##TITLE=1H_E3d0607-4
 CDCl3
 8 sc, 
 7.7.2023
##JCAMPDX= 6.0         $$ Bruker NMR JCAMP-DX V2.0
##DATA TYPE= NMR FID
##DATA CLASS= NTUPLES
##ORIGIN= UXNMR, Bruker Analytische Messtechnik GmbH
##OWNER= root
$$ XWIN-NMR		Version 3.5
$$ Fri Jul  7 14:49:15 2023 Russian Standard Time (UT+4h)  she@DPX200
##.OBSERVE FREQUENCY= 200.13135
##.OBSERVE NUCLEUS= ^1H
##.DELAY= (6, 6)
##.ACQUISITION MODE= SIMULTANEOUS
##.ACQUISITION SCHEME= undefined
##.AVERAGES= 8
##.DIGITISER RES= 18
##SPECTROMETER/DATA SYSTEM= spect
##.PULSE SEQUENCE= zg30
##.SOLVENT NAME= CDCl3
##.SHIFT REFERENCE= (INTERNAL, CDCl3, 0, 15.7039)
##AUDIT TRAIL= $$ (NUMBER, WHEN, WHO, WHERE, WHAT)
$$ ##TITLE= Audit trail, XWIN-NMR		Version 3.5
$$ ##JCAMPDX= 5.01
$$ ##ORIGIN= Bruker BioSpin GmbH
$$ ##OWNER= she
$$ F:/spectra/data/she/nmr/H-F/1/audita.txt
$$ ##AUDIT TRAIL=  $$ (NUMBER, WHEN, WHO, WHERE, WHAT)
(   1,<2023-07-07 14:48:03.71 +0400>,<she>,<DPX200>,
      <created by zg, POWCHK disabled, PULCHK disabled
       configuration hash MD5:
       00 E9 B6 7A A2 85 ED C7 34 08 36 98 17 FE 4E 26
       data hash MD5: 16K
       9D 4D 81 45 54 49 88 8B A3 D4 68 69 8D 8B E2 7C>)
$$ ##END=
$$ 
$$ hash MD5
$$ 9C 60 91 AE 54 E2 EF 08 C1 BC F5 5E 6F 25 58 0E
##$RELAX= 
##$RELAX= 
##$RELAX= 
##$RELAX= 
##$RELAX= 
##$RELAX= 
$$ Bruker specific parameters
$$ --------------------------
##$DU= <F:/spectra>
##$EXPNO= 1
##$NAME= <H-F>
##$PROCNO= 1
##$TYPE= <nmr>
##$USER= <she>
##$AMP= (0..31)
100 100 100 100 100 100 100 100 100 100 100 100 100 100 100 100 100 100 
100 100 100 100 100 100 100 100 100 100 100 100 100 100 
##$AQSEQ= 0
##$AQ_mod= 1
##$AUNM= <au_zg>
##$AUTOPOS= <>
##$BF1= 200.13
##$BF2= 200.13
##$BF3= 200.13
##$BF4= 200.13
##$BF5= 200.13
##$BF6= 200.13
##$BF7= 200.13
##$BF8= 200.13
##$BYTORDA= 1
##$CFDGTYP= 0
##$CFRGTYP= 5
##$CHEMSTR= <none>
##$CNST= (0..31)
1 1 145 1 1 1 1 1 1 1 1 1 1 1 1 1 1 1 1 1 1 1 1 1 1 1 1 1 1 1 1 1 
##$CPDPRG= <>
##$CPDPRG1= <>
##$CPDPRG2= <>
##$CPDPRG3= <>
##$CPDPRG4= <mlev>
##$CPDPRG5= <mlev>
##$CPDPRG6= <mlev>
##$CPDPRG7= <mlev>
##$CPDPRG8= <mlev>
##$CPDPRGB= <>
##$CPDPRGT= <>
##$D= (0..31)
0 1.2 0 0 0 0 0 0 0 0.06 0 0.03 0 0 0 0 0.0002 0 0 0 0 0 0 0 0 0 0 0 0 
0 0 0 
##$DATE= 1688726883
##$DBL= (0..7)
120 120 120 120 120 120 120 120 
##$DBP= (0..7)
150 150 150 150 150 150 150 150 
##$DBP07= 0
##$DBPNAM0= <>
##$DBPNAM1= <>
##$DBPNAM2= <>
##$DBPNAM3= <>
##$DBPNAM4= <>
##$DBPNAM5= <>
##$DBPNAM6= <>
##$DBPNAM7= <>
##$DBPOAL= (0..7)
0.5 0.5 0.5 0.5 0.5 0.5 0.5 0.5 
##$DBPOFFS= (0..7)
0 0 0 0 0 0 0 0 
##$DE= 6
##$DECBNUC= <off>
##$DECIM= 32
##$DECNUC= <off>
##$DECSTAT= 4
##$DIGMOD= 1
##$DIGTYP= 9
##$DL= (0..7)
0 120 120 120 120 120 120 120 
##$DP= (0..7)
150 150 150 150 150 150 150 150 
##$DP07= 0
##$DPNAME0= <>
##$DPNAME1= <>
##$DPNAME2= <>
##$DPNAME3= <>
##$DPNAME4= <>
##$DPNAME5= <>
##$DPNAME6= <>
##$DPNAME7= <>
##$DPOAL= (0..7)
0.5 0.5 0.5 0.5 0.5 0.5 0.5 0.5 
##$DPOFFS= (0..7)
0 0 0 0 0 0 0 0 
##$DQDMODE= 0
##$DR= 18
##$DS= 0
##$DSLIST= <SSSSSSSSSSSSSSS>
$$ [...]
##$SUBNAM2= <"">
##$SUBNAM3= <"">
##$SUBNAM4= <"">
##$SUBNAM5= <"">
##$SUBNAM6= <"">
##$SUBNAM7= <"">
##$SUBNAM8= <"">
##$SUBNAM9= <"">
##$SW= 18.05172834244
##$SWIBOX= (0..15)
0 0 2 0 0 0 0 0 0 0 0 0 0 0 0 0 
##$SW_h= 3612.71676300578
##$TD= 16384
##$TD0= 1
##$TE= 0
##$TE2= 300
##$TE3= 300
##$TEG= 300
##$TL= (0..7)
0 120 120 120 120 120 120 120 
##$TP= (0..7)
150 150 150 150 150 150 150 150 
##$TP07= 0
##$TPNAME0= <>
##$TPNAME1= <>
##$TPNAME2= <>
##$TPNAME3= <>
##$TPNAME4= <>
##$TPNAME5= <>
##$TPNAME6= <>
##$TPNAME7= <>
##$TPOAL= (0..7)
0.5 0.5 0.5 0.5 0.5 0.5 0.5 0.5 
##$TPOFFS= (0..7)
0 0 0 0 0 0 0 0 
##$TUNHIN= 0
##$TUNHOUT= 0
##$TUNXOUT= 0
##$USERA1= <user>
##$USERA2= <user>
##$USERA3= <user>
##$USERA4= <user>
##$USERA5= <user>
##$V9= 5
##$VALIST= <valist>
##$VCLIST= <CCCCCCCCCCCCCCC>
##$VD= 0
##$VDLIST= <DDDDDDDDDDDDDDD>
##$VPLIST= <PPPPPPPPPPPPPPP>
##$VTLIST= <TTTTTTTTTTTTTTT>
##$WBST= 1024
##$WBSW= 4
##$XGAIN= (0..3)
0 0 0 0 
##$XL= 0
##$YL= 0
##$YMAX_a= 365460
##$YMIN_a= -507926
##$ZGOPTNS= <>
##$ZL1= 120
##$ZL2= 120
##$ZL3= 120
##$ZL4= 120
##$ABSF1= 10
##$ABSF2= 0
##$ABSG= 5
##$ABSL= 3
##$ALPHA= 0
##$AQORDER= 0
##$ASSFAC= 0
##$ASSFACI= 0
##$ASSFACX= 0
##$ASSWID= 0
##$AUNMP= <proc_1d>
##$AZFE= 0.1
##$AZFW= 0.1
##$BCFW= 1
##$BC_mod= 2
##$BYTORDP= 1
##$COROFFS= 0
##$CY= 11.3945322036743
##$DATMOD= 1
##$DC= 2
##$DFILT= <>
##$DTYPP= 0
##$F1P= 15.7292609196834
##$F2P= 12.9074282941183
##$FCOR= 0.5
##$FTSIZE= 0
##$FT_mod= 4
##$GAMMA= 1
##$GB= 0.15
##$INTBC= 1
##$INTSCL= 1
##$ISEN= 128
##$LB= 0.24
##$LEV0= 0
##$LPBIN= 0
##$MAXI= 10000
##$MC2= 0
##$MEAN= 0
##$ME_mod= 0
##$MI= 1.114404
##$NCOEF= 0
##$NC_proc= 0
##$NLEV= 6
##$NOISF1= 3.799351
##$NOISF2= 2.8
##$NSP= 1
##$NTH_PI= 0
##$NZP= 0
##$OFFSET= 15.70392
##$PC= 1
##$PHC0= -20984.8
##$PHC1= 5.25272
##$PH_mod= 1
##$PKNL= yes
##$PPARMOD= 0
##$PSCAL= 0
##$PSIGN= 0
##$REVERSE= no
##$SF= 200.130013532006
##$SI= 16384
##$SIGF1= 3
##$SIGF2= 2
##$SINO= 400
##$SIOLD= 16384
##$SREGLST= <1H.CDCl3>
##$SSB= 0
##$STSI= 0
##$STSR= 0
##$SW_p= 3612.71676300578
##$SYMM= 0
##$S_DEV= 0
##$TDeff= 0
##$TDoff= 0
##$TI= <>
##$TILT= no
##$TM1= 0
##$TM2= 0
##$TOPLEV= 0
##$USERP1= <user>
##$USERP2= <user>
##$USERP3= <user>
##$USERP4= <user>
##$USERP5= <user>
##$WDW= 1
##$XDIM= 8192
##$YMAX_p= 0
##$YMIN_p= 0
$$ End of Bruker specific parameters
$$ ---------------------------------
##NTUPLES= NMR FID
##VAR_NAME=  TIME,          FID/REAL,        FID/IMAG
##SYMBOL=    X,             R,               I
##VAR_TYPE=  INDEPENDENT,   DEPENDENT,       DEPENDENT
##VAR_FORM=  AFFN,          ASDF,            ASDF
##VAR_DIM=   8192,          8192,            8192
##UNITS=     SECONDS,       ARBITRARY UNITS, ARBITRARY UNITS
##FACTOR=    0.0002768,     1,               1
##FIRST=     0,             0,               0
##LAST=      2.2672688,     0,               0
##MIN=       0,             -507926,         0
##MAX=       2.2672688,     365460,          0
$$ Real data points
##PAGE= N=1
##DATA TABLE= (X++(R..R)), XYDATA
$$ [...]
$$ plain form
1999 382 -1159 -890 924 151 -340 215 -570 -1272 243 1072 227 -132 -123 -417 -165 934 1273 -482 -344
2018 -344 285 -304 379 1145 -68 -1041 -18 192 -419 790 673 -1378 -584 1088 -541 -142 994 -903
2036 -903 -1328 904 574 -791 285 378 -1414 19 1642 -178 -302 864 -741 -643 1587 987 -636
2053 -636 148 0 -870 575 1494 -192 -1090 123 -440 -423 1215 515 -1141 -673 -45 -173 323 784 -354
2072 -354 -1171 61 509 -232 615 610 -1071 -503 1048 391 -265 771 -113 -1376 452 1235 -681 -192
2090 -192 629 -1072 -386 1435 -334 -1204 73 -186 -890 772 783 -1419 -797 697 -472 2 1460
2107 1460 -619 -1361 442 347 -75 1037 448 -1024 -577 692 121 44 930 -470 -1298 206 668 -58
2125 -58 292 80 -683 -970 489 464 -651 118 124 -972 -32 974 -382 -767 420 83 -705 819 861
$$ packed form
1999C82j541K69J814p73m91N55p85p02J515Q29q45l59Rk94K52J099L39j755J38
2018c44O29n89O83P66j213r73J023K10o11J209j17k051P94J672j629L99J136j897
2036i03m25K232l30j365J076R3j792J433J623j820j24J166j605R8K230o00j623
2053f36P84j48q70J445R19j686q98J213n63J7J638p00j656M68O28j28M96M61j138
2072c54q17J232M48p41Q47nj681N68J551o57o56J036q84j263J828P83j916M89
2090a92Q21j701O86J821j769q70J277k59p04J662J1k202O22J494j169M74J458
2107A460k079p42J803r5m22J112n89j472M47J269n71p7Q86j400q28J504M62p26
2125e8L50k12p63k87J459k5j115P69Oj096R40J006j356l85J187l37p88J524M2
$$ plain form
2144 861 -1077 -235 1126 -415 111 1241 -893 -1006 989 362 -401 861 113 -1735 35 1153 -673
2161 -673 -20 822 -1337 -1103 1214 6 -586 798 -116 -1189 338 1128 -474 -191 648 -579 -445
2178 -445 1211 205 -642 393 232 -360 249 569 -338 -523 280 279 -376 207 -67 -623 -171 214 -64 -165
2198 -165 -53 -225 -409 101 613 -212 -142 278 -326 12 797 191 -73 293 37 -277 510 654 -570 -322
2218 -322 622 -406 -236 820 -211 -929 309 39 -596 353 336 -707 -207 781 -315 -339 701 -426
2236 -426 -537 691 313 -383 163 52 -172 219 569 50 -180 196 -120 28 530 72 -310 21 -263 85
2256 85 540 -111 -365 -301 -410 196 357 -230 -282 -187 -207 100 716 -55 -421 77 -101 98 889 59 -596 201
2278 201 13 -235 689 239 -693 -156 147 -95 95 532 -645 -807 349 -138 -42 441 -376 -729 152 170
$$ packed form
2144H61j938Q42J361j541N26J130k134j13J995o27p63J262p48j848J770J118j826
2161f73O53Q42k159K34K317j208n92J384r14j073J527P90j602K83Q39j227J34
2178d45J656j006q47J035j61n92O09L20r07j85Q03jo55N83k74n56M52L85k78j01
2198a65J12j72j84N10N12q25P0M20o04L38P85o06k64L66k56l14P87J44j224K48
2218c22R44j028J70J056j031p18J238k70o35R49j7j043N00R88j096k4J040j127
2236d26j11J228l78o96N46j11k24L91L50n19k30L76l16J48N02m58l82L31k84L48
2256H5M55o51k54O4j09O06J61n87n2R5k0L07O16p71l66M98j78J99P91q30o55P97
2278B01j88k48R24m50r32N37L03k42J90M37j177j62J156m87R6M83q17l53Q81J8
$$ plain form
2298 170 75 328 -209 -719 -137 597 70 235 234 -613 -33 722 18 414 303 -658 -205 493 171 217 -7
2319 -7 -650 -477 354 135 -59 -26 -645 -721 400 346 -115 173 -466 -643 512 473 -45 387 -209 -623 472
2340 472 687 24 145 65 -499 25 865 -27 -245 101 -693 -276 749 -5 -266 12 -550 -357 463 380
2360 380 -289 -162 -309 -533 326 557 -300 -52 71 -649 443 976 -235 37 202 -407 112 839 -101
2379 -101 -282 -47 -55 -491 791 239 -640 175 -108 -476 625 295 -649 -56 25 -362 389 476 -461 -179 109
2400 109 -325 305 902 -141 -298 452 -253 -170 949 -225 -369 320 -94 -250 595 263 -596 24 96 -461
2420 -461 220 467 -609 -163 93 -323 -31 496 -316 -132 73 -243 100 357 -11 -192 -12 -35 88 450
2440 450 74 -317 196 -49 -106 739 -115 -481 -62 -332 -253 507 -19 -558 -17 -185 -243 354 534 -519 -331
$$ packed form
2298A70r5K53n37n10N82P34n27J65jq47N80P55p04L96j11r61M53O98l22M6k24
2319go43J73Q31k19j94L3o19p6J121n4m61K88o39j77J155l9n18M32n96m14J095
2340D72K15o63J21q0n64N24Q40q92k18L46p94M17J025p54k61K78n62J93Q20q3
2360C80o69J27j47k24Q59K31q57K48J23p20J092N33j211K72J65o09N19P27r40
2379a01j81K35qm36J282n52q79Q15k83l68J101l30r44N93Q1l87P51Q7r37K82K88
2400A09m34O30N97j043j57P50p05Q3J119j174j44O89m14j56Q45l32q59O20P2n57
2420d61O81K47j076M46K56m16K92N27q12J84K05l16L43K57l68j81J80k3J23L62
2440D50l76l91N13k45n7Q45q54l66M19k70P9P60n26n39N41j68n8N97J80j053J88
$$ plain form
2461 -331 479 -313 15 1131 -364 -537 416 -183 -166 876 382 -763 55 317 -187 483 595 -552 -522
2480 -522 561 53 83 538 -532 -721 223 21 293 52 -269 -476 -168 385 342 2 94 -226 -44 146
2500 146 495 516 -490 -93 238 -60 402 706 -491 -631 371 -4 -46 683 -133 -914 41 357 -357 318
2520 318 586 -875 -574 893 66 -124 590 -293 -838 596 602 -152 170 127 -649 -129 1009 121 -276 389
2540 389 -347 -583 697 443 -507 -167 30 -516 70 574 -47 -616 46 36 -202 385 392 -426 -415 97 122
2561 122 31 408 197 -856 110 612 4 312 673 -458 -249 530 223 -201 287 57 -729 74 705 -337
2581 -337 -304 316 -592 -639 506 195 -520 83 99 -536 21 823 -122 -457 378 -3 -411 912 470 -599
2601 -599 -76 502 -351 152 811 -146 -767 146 22 -442 544 176 -887 -115 196 -130 239 417 -222 -772
$$ packed form
2461c31Q10p92L28J116j495j73R53n99J7J042m94j145Q18K62n04O70J12j147L0
2480e22J083n08L0M55j070j89R44k02K72k41l21k07L08N53m3l40R2l20J82J90
2500A46L49K1j006L97L31k98M62L04j197j40J002l75m2P29q16p81R55L16p14O75
2520C18K68j461L01J467q27j90P14q83n45J434Op54L22m3p76N20J138q88l97O65
2540C89p36k36J280k54r50L40J97n46N86N04o21n69O62j0k38N87Pq18J1N12K5
2561A22r1L77k11j053R66N02o08L08L61j131K09P79l07m24M88k30p86Q03O31j042
2581c37L3O20r08m7J145l11p15O03J6o35N57Q02r45l35Q35l81m08J323m42j069
2601e99N23N78q53N03O59r57o21R13j24m64R86l68j063P72L11l26L69J78o39n50
$$ plain form
2621 -772 277 295 -345 415 326 -639 -29 576 90 177 432 -225 -522 458 499 -97 -65 84 -599 68 667
2642 667 87 -334 -16 -214 -474 358 590 -376 -682 86 -274 -195 736 145 -717 -47 75 49 426 671 -221
2663 -221 -624 423 205 -76 641 51 -862 -107 336 -186 269 301 -605 -654 389 362 15 225 -295 -1001
2683 -1001 359 481 -147 135 47 -759 -212 627 274 -96 -8 -24 -267 559 578 -282 -314 -158 -114 198 521
2704 521 162 -512 -591 -44 -14 213 592 -340 -650 -69 355 3 295 -56 -556 -590 621 261 -58 293 -520
2725 -520 -650 382 386 -56 144 -130 -611 100 728 254 -283 97 -279 -574 514 269 -406 -201 -516 -440
2745 -440 444 316 -74 -239 -300 -196 205 419 201 -323 -277 -210 192 557 238 -98 -510 -238 304 434 225
2766 225 22 -403 -401 172 568 126 -31 -233 -591 -261 662 324 -274 -78 -386 -326 682 550 -217 -217 -422
$$ packed form
2621g72J049J8o40P60q9r65O10O05m86Q7K55o57k97R80M1n96L2J49o83O67N99
2642F67n80m21L18j98k60Q32K32r66l06P68l60P9R31n91q62O70J22k6L77K45q92
2663b21m03J047k18k81P17n90r13P55M43n22M55L2r06m9J043k7l47K10n20p06
2683a001J360J22o28K82q8q06N47Q39l53l70Q8j6k43Q26J9q60l2J56M4L12L23
2704E21l59o74p9N47L0K27L79r32l10N81M24l52K92l51n00l4J211l60l19L51q13
2725e20j30J032Mm42K00k74m81P11O28m74n37L80l76k95J088k45o75K05l15P6
2745d40Q84j28l90j65o1J04M01K14k18n24M6O7M02L65l19l36m12K72N42J30k09
2766B25k03m25KN73L96m42j57k02l58L30R23l38n98J96l08O0J008j32p67%k05
$$ plain form
2787 -422 -298 567 710 6 -301 -311 -413 332 879 42 -325 -68 -224 -24 746 391 -627 -371 -315 46
2807 46 518 262 -371 -603 -365 120 523 574 -241 -659 -309 -32 739 575 -366 -477 -358 -111 614 747 24
2828 24 -585 -347 113 459 739 281 -708 -474 13 405 656 161 -687 -578 -67 142 587 131 -563 -578 -74
2849 -74 421 375 381 -436 -788 -75 312 562 759 -364 -633 16 433 750 455 -263 -575 -420 323 571 337
2870 337 -96 -955 -375 221 417 529 70 -779 -505 207 452 536 -26 -676 -389 13 475 422 167 -622 -811
2891 -811 324 646 459 221 -326 -536 12 484 281 79 -433 -743 17 288 358 113 -42 -694 -398 253
2911 253 340 -94 -291 -618 -480 641 511 235 -61 -269 -252 218 513 246 -295 -279 -294 87 497 201 -199
2932 -199 -380 -126 -127 449 117 -67 -388 -369 33 324 -63 52 -229 -338 -38 229 282 24 67 -402 -162 487
$$ packed form
2787d22J24Q65J43p04l07j0j02P45N47q37l67K57j56K00P70l55j018K56N6L61
2807D6M72k56o33k32K38M85M03N1q15m18L50K77P71j64r41j11J19K47P25J33p23
2828B4o09K38M60L46K80m58r89K34M87L92K51m95q48J09N11K09M45m56o94j5N04
2849g4M95m6Oq17l52P13L87K50J97j123k69O49M17L17k95p18l12J55P43K48k34
2870C37m33q59N80N96J96J12m59q49K74P12K45Q4n62o50K87M02M62n3k55p89j89
2891h11J135L22j87k38n47k10N48M72k03k02n12l10P60K71P0k45j55o52K96O51
2911B53Q7m34j97l27J38J121j30k76k96k08J7M70K95k67n41J6j5L81M10k96m00
2932a99j81K54jN76l32j84l21J9M02K91l87J15k81j09L00K67N3k58M3m69K40O49
$$ plain form
2954 487 161 -70 144 -142 -236 321 189 -42 -90 -200 -367 5 239 -25 -146 -186 -286 -133 236 228 -98 -81
2976 -81 -221 -303 184 428 87 -319 81 -183 -50 493 155 -212 -135 -88 -34 282 291 -53 -348 -187 149 30
2998 30 204 203 -336 -515 130 37 20 304 -213 -609 -109 327 192 92 138 -364 -544 799 554 93 162 -347
3020 -347 -436 196 606 55 -336 -235 -487 -287 768 396 -298 -149 -335 -277 511 572 -215 -428 -325 -8 346
3041 346 500 45 -777 -449 33 380 648 378 -467 -672 67 514 480 379 -159 -886 -258 610 358 187
3061 187 12 -433 -607 312 603 -28 -425 -496 -721 57 867 61 -400 -340 -430 -63 773 570 -381 -492 -23
3082 -23 60 582 811 -268 -621 -6 272 346 782 109 -853 -546 340 389 350 256 -671 -913 -104 511 316 180
3104 180 -400 -952 -393 657 599 59 -197 -741 -532 573 841 -33 -266 -350 -492 253 804 206 -558 -559 -281
$$ packed form
2954D87l26k31K14k86r4N57j32k31m8j10j67L72K34k64j21m0j00J53L69ql26J7
2976h1j40q2M87K44l41m06M00k64J33N43l38l67P7M7N4L16Rl44k95J61L36j19
2998C0J74jn39j79O45r3j7K84n17l96N00M36j35j00M6n02j80J343k45m61O9n09
3020c47q9O32M10n51l91J01k52K00J055l72o94J49j86N8P88O1p87k13J03L17L54
3041C46J54m55q22L28M82L47K68k70q45k05P39M47l4j01n38p27O28Q68k52j71
3061A87j75m45j74R19K91o31l97p1k25P78Q10q06m61O0r0L67Q36k03r51j11M69
3082b3Q3N22K29j079l53O15K78P4M36o73r62L07Q86M9l9r4r27k42Q09O15j95j36
3104A80n80n52N59J050n8n40k56n44K09J105K68q74k33q4j42P45N51n98p64jK78
$$ plain form
3125 -281 190 857 648 -510 -592 -119 26 462 734 -454 -994 -236 336 328 358 -53 -759 -538 313 643 293
3146 293 145 -689 -896 216 781 579 -96 -289 -629 -388 921 684 -227 -340 -532 -570 520 741 -136
3165 -136 -547 -414 -363 177 946 349 -671 -509 -101 103 822 456 -519 -510 -93 229 608 478 -134 -798 -268
3186 -268 392 444 398 35 -690 -406 137 496 353 -277 -619 -579 -72 724 454 -304 -341 -508 -106 836 704
3207 704 -120 -529 -500 -85 423 801 16 -652 -556 -35 183 746 261 -600 -619 -103 422 321 271 -410 -809
3228 -809 19 161 33 247 -148 -888 -130 539 240 136 -125 -671 -456 355 651 263 -154 -321 -389 281
3248 281 600 266 -106 -411 -290 59 371 306 -209 -390 -337 -32 372 322 -33 -346 -409 31 345 287 16 -445
3270 -445 -509 121 162 274 250 -225 -365 -7 308 219 126 -153 -318 -49 347 165 90 -98 -254 -489 111 91
$$ packed form
3125b81M71O67k09j158q2M73J45M36K72j188n40P58N72qL0m11p06K21Q51L30l50
3146B93j48q34k07J112N65k02o75j93l40K41J309k37r11j13j92l8J090K21q77
3165a36m11J33N1N40P69n97j020J62M08K04P19l66r75RM17L22L79j30o12o64N30
3186b68O60N2m6l63p25K84N43L59j43o30l42M0N07P96k70p58l7j67M02R42j32
3207G04q24m09K9M15N08L78p85o68R6N21K18N63m85q61j9N16N25j01n0o81l99
3228h09Q28J42j28K14l95p40P58O69k99j04k61n46K15Q11K96l88m17j67o8O70
3248B81L19l34l72l05J21L49L12o5n15j81N3L05M04n0l55l13o3M40L14n8k71m61
3270d45o4O30M1J12k4m75j40L58L15q9r3k79j65K69L96j82p5j88j56k35O00k0
$$ plain form
3292 91 57 -133 -333 -254 27 53 261 -150 -264 -197 77 211 170 -183 -127 -196 153 136 132 152 -72 -93 -177 -84 151
3317 151 353 7 -278 -15 -96 30 199 -81 -178 -223 50 -14 83 153 30 -120 86 -116 254 170 40 -195
3339 -195 -132 121 211 188 -11 -236 -390 -36 125 312 104 -202 -417 -34 201 63 63 -470 -308 -153 83 235
3361 235 -11 -194 -566 -131 283 246 143 -13 -596 -123 148 243 301 -12 -490 -425 238 435 260 -114 -495
3382 -495 -580 71 374 295 -151 -603 -505 199 630 414 196 -439 -572 -20 362 421 -44 -295 -566 -89 611
3403 611 510 -12 -206 -619 -56 577 513 52 -420 -720 -83 433 606 157 -488 -700 -291 469 561 155 -396
3424 -396 -743 -179 311 684 240 -520 -739 -444 458 582 159 -302 -724 -476 407 773 307 -332 -688 -581
3444 -581 196 894 368 -238 -627 -603 108 950 449 -266 -748 -634 213 582 612 -303 -801 -385 73 645 735
$$ packed form
3292I1l4j90k00P9K81K6K08m11j14O7K74J34m1l53N6o9L49j7mK0k24k1q4R3K35
3317A51K02l46k85K63q1J26J69k80r7m5K73o4R7P0j23j50K06k02L70q4j30k35
3339a95O3K53R0k3j99k25j54L54J61J87k08l06k15L83K35j38%n33J62J55K36J52
3361B35k46j83l72M35M14l7j03j56n83M73K71R5N8l13m78O5O63J97j75l74l81
3382d95q5O51L03p9m46m52R8P04M31k16k18o35j33N52L82N9m65k51k71M77P00
3403F11j01n22j94m13N63O33o4m61m72l00O37N16J73m49o45k12M09P60R2m06n51
3424c96l47N64M90L73m44p60k19K95R02J24m23m61m22K48Q83L66m66o39l56J07
3444e81P77O98n26o06l89K4P11Q42n01p15m82J14Q47L69L0r15m98M16M58N72R0
$$ plain form
3465 735 1 -606 -384 153 657 790 18 -757 -804 100 747 595 123 -432 -717 -110 604 718 205 -636
3485 -636 -555 -369 443 699 -53 -534 -532 -244 382 949 285 -511 -706 -159 309 812 608 -377 -1022 -60 234
3506 234 677 517 -337 -855 -141 234 535 425 -190 -860 -565 256 537 462 -96 -813 -600 259 584 446
3526 446 29 -455 -582 -26 596 493 -276 -500 -486 20 509 553 -184 -554 -356 58 300 548 173 -543 -613
3547 -613 229 239 508 274 -610 -607 -58 297 466 341 -179 -617 -336 414 233 232 -98 -795 -416 422 365 311
3569 311 36 -513 -284 214 715 9 -249 -345 -390 -76 563 197 -288 -344 -257 22 234 326 -55 -360 -227 86
3591 86 163 428 -53 -541 -352 112 288 233 91 -398 -472 202 332 153 118 -139 -412 -136 302 256 -60 -163
3613 -163 -347 -302 209 252 25 -253 -270 -251 27 537 -73 -103 -1 -180 -31 212 302 4 -187 -27 -137 210
$$ packed form
3465G35p34o07K22N37N04J33p72p75m7R04O47j52m72n55k85O07P14J14n13q41
3485f36Q1J86Q12K56p52m81KK88O26N67o64p96j95N47M68N03k04r85o45R62K94
3506B34M43j60q54n18P14L75L01j10o15o70K95Q21K81p5n58p17K13Q59L25j38
3526D46m17m84j27N56O22j03p69k24J4N06M89M4p37l70J98M14K42K48l75p16p0
3547f13Q42J0K69k34q84LN49L55J69j25n20m38K81P50j81jl30o97L79Q38n7n4
3569C11k75n49K29M98N01p06k58r6m5L14O39l66m85n6Q7K79K12R2l81l05J33L13
3591H6P7K65m81m88J89M64J76n5j42m89p4O74J30j79l5k57k73K76M38m6l16j03
3613a63j84M5N11M3k27k78j7J9K78N10o10l0J02j79J49K43R0k98j91J60j10L47
$$ plain form
3635 210 279 -89 -147 -21 132 50 176 98 -279 -152 -33 -14 31 27 -38 -237 144 54 69 -44 0 -118 -314 162
3659 162 168 -58 255 -80 -277 84 412 12 28 174 -29 -200 184 69 43 213 -82 -347 -64 178 -162
3680 -162 -24 -30 -166 -197 174 262 73 94 -197 -195 -92 350 36 -161 -299 -222 21 176 335 -34 -176 -155 14
3703 14 226 380 -17 -289 -287 -3 28 354 85 -345 -364 -298 156 233 249 -176 -413 37 239 303 367 -178 -388
3726 -388 -241 361 546 300 -129 -450 -283 273 485 108 -50 -372 -420 156 410 366 -68 -573 -518 -32 554
3747 554 279 -135 -558 -351 8 573 324 54 -498 -605 144 554 590 92 -419 -500 178 699 606 166 -445
3768 -445 -698 80 554 729 86 -489 -600 -206 420 528 111 -483 -607 -392 350 867 215 -533 -649 -414
3788 -414 353 830 270 -592 -778 -316 563 829 386 -447 -613 -312 268 880 441 -265 -750 -420 338 699
$$ packed form
3635B10O9l68n8J26J53q2J26p8l77J27J19J9M5mo5j99L81r0J5j13M4j18j96M76
3659A62Ok26L13l35j97L61L28m00J6J46k03j71L84j15k6J70k95k65K83K42l40
3680a62J38oj36l1L71Q8j89K1k91KJ03M42l14j97j38P7K43J55J59l69j42K1J69
3703A4K12J54l97k72KK84L1L26k69m30j9O6M54P7J6m25k37M50K02O4O4n45k10
3726c88J47O02J85k46m29l21J67N56K12l77j58l22m8N76K54m4m34n05N5M86N86
3747E54k75m14m23K07L59N65k49k70n52j07P49M10L6m98n11q1O78N21r3m40o11
3768d45k53P78M74J75o43n75j11L94O26J08m17n94j24K15P42N17o52p48j16K35
3788d14P67M77n60q62j86M62Q79K66m43q33j66L01N80O12m39p06m85L30P58L61
$$ plain form
3808 699 479 -247 -869 -612 233 791 412 -278 -670 -652 64 642 588 -287 -813 -427 129 819 472 98 -606
3829 -606 -533 -114 492 802 -9 -790 -530 -68 525 793 42 -601 -678 -111 545 609 110 -465 -674 -54 684
3850 684 674 167 -476 -759 -147 374 767 463 -423 -496 -294 523 743 335 -441 -633 -305 433 557 230 -254
3871 -254 -850 -436 312 644 196 -417 -630 -271 297 552 344 -241 -564 -442 190 661 428 -19 -530 -479
3891 -479 18 628 336 68 -581 -420 277 393 269 -85 -474 -465 -2 547 301 70 -477 -466 -155 443 360
3912 360 24 -481 -615 73 341 497 195 -418 -492 -56 329 448 86 -270 -329 -160 258 294 164 -98 -131
3933 -131 -365 210 519 92 -251 -355 -321 117 69 -43 -95 -260 -171 83 358 284 -143 -203 -291 -111 161 331
3955 331 20 -105 -151 105 180 176 20 -161 -219 -55 176 293 15 -410 -141 -223 36 285 -122 -183 -153 -47 -14
$$ packed form
3808F99k20p26o22K57Q45N58l79o90l92J8P16N78n4q75n26L86N56O90l47l74p04
3829f06P3M19O06L10q11p81K60M62N93K68p51o43p7N67O56O4m99n75k09O20P38
3850F84j0n07o43k83O12N21L93l04q86p3K02Q17K20m08p76j92L28P38J24l27m84
3871b54n96M14P48L32m48o13k13L59N68K55k08n85l23J22O32M71k33m47n11N1
3891d79M97O10k92k68o49J61O97J16j24l54l89RM63N49k46k31n47J1L11N98q3
3912C60l36n05j34O88K68J56l02o13p4M36L85J19l62l56n9J69M18L6j30k62l3
3933a31k34N75L09m27l43j04L4M38m8j12n2j65Q9K54K75p4m27o0q8J80K72J70
3955C31l11j25m6K56P5mj56j81n8J64K31J17k78m25K69q2K59K49m07o1L0J06L3
$$ plain form
3978 -14 10 94 93 -215 -99 129 32 143 64 -94 -313 48 161 122 51 -13 -166 -93 99 66 82 45 -18 35 60 -46
4004 -46 48 -51 -54 -240 -152 157 -68 -216 37 -106 77 -9 109 22 -53 -118 -35 -4 64 85 -80 39 -22 16 86 245
4030 245 101 -186 -7 -76 33 218 157 -119 -183 98 -52 51 149 -166 -327 -195 26 93 283 125 -260 -299
4052 -299 99 336 299 159 -218 -298 -23 159 181 47 -62 -292 -1 231 200 -51 -223 -406 43 255 369
4073 369 208 -372 -414 -65 222 279 122 -314 -242 -216 109 471 296 -240 -429 -170 158 419 357 -224 -432 -203
4095 -203 369 435 315 -66 -570 -410 -3 442 449 -142 -455 -548 209 505 369 -173 -488 -564 -21 620 351 -77
4117 -77 -391 -466 92 514 487 53 -618 -441 64 396 410 52 -463 -532 -202 446 558 174 -472 -659 -177 416
4139 416 493 217 -427 -673 -115 618 530 195 -383 -593 -312 339 854 281 -211 -450 -436 508 761 317 -274
$$ packed form
3978a4K4Q4jl08J16K28r7J11p9j58k19L61J13l9p1o4j53P3J92l3J6l7o3N3K5j06
4004d6R4r9lj86Q8L09k25j48K53j43J83q6J18q7p5o5Q3L1O8K1j65J19o1L8P0J59
4030B45j44k87J79o9J09J85o1k76o4K81j50J03R8l15j61J32K21O7J90j58l85l9
4052b99L98K37l7j40l77q0K75J82K2j34j09k30K91K32l1k51j72j83M49K12J14
4073C69j61n80m2L49K87N7j57m36P2K6L25L62j75n36j89K59L28K61o2n81k08K29
4095b03N72O6j20l81n04J60M07M45Pn91l13r3P57K96j36n42l15p6N43O41k69m28
4117g7l14p5N58M22k7m34o71J77N05L32J4l58n15o9L30O48J12l84o46j87M82N93
4139D16P7k76o44k46N58P33q8l35n78k10K81O51N15n73m92k39J4R44K53m44n91
$$ plain form
4160 -274 -399 -312 133 601 234 -397 -701 -254 254 470 228 -429 -941 -237 121 579 404 -165 -629 -552 194
4181 194 570 437 1 -864 -576 177 576 486 -138 -716 -606 47 565 591 -237 -537 -670 -78 508 662 -10
4202 -10 -627 -443 -88 549 548 121 -607 -548 87 416 606 119 -409 -677 -93 432 576 194 -445 -756 -216
4223 -216 405 418 171 -171 -666 -416 430 414 229 -322 -544 -325 263 420 199 -128 -552 -300 135 635 278
4244 278 -342 -510 -196 262 504 385 -181 -377 -354 224 472 425 -66 -527 -391 142 592 171 -47 -379 -340
4265 -340 201 194 309 4 -409 -383 22 450 220 -17 -247 -281 -110 314 318 -27 -187 -124 44 257 273 2 -235
4288 -235 -125 -77 315 108 69 -220 -397 90 170 215 101 -240 -240 8 -39 158 8 -78 49 -2 330 210 38
4311 38 79 -142 -158 86 260 121 -143 -131 -249 177 366 129 -59 -176 -39 -79 176 177 84 -44 -100 -129 197
$$ packed form
4160b74j25Q7M45M68l67o31l04M47N08K16k42o57n12P04L58M58j75n69m64P7P46
4181A94L76j33m36q65K88P53L99r0o24n78J10O53N18K6q28l00j33N92N86J54o72
4202a0o17J84L55O37jm27p28N9O35L29J90m87n28k68N84N25J44l82o39l11N40
4223b16O21J3k47l42m95K50Q46j6j85n51k22K19N88J57k21l27m24K52M35N00l57
4244B78o20j68L14M58K42j19n66j96K3N78K48m7m91m61J36N33M50m21k18l32L9
4265c40N41pJ15l05m13K6M05M28k30k37k30l4J71M24Ml45j60O3J68K13J6k71k37
4288b35J10M8L92k07l9k89j77M87Q0M5j14l41%K48m7J97j50q6J27n1L32j20j72
4311C8M1k21j6K44J74j39k64J2j18M26J89k37j88j17J37m0K55Jr3j28n6k9L26
$$ plain form
4334 197 9 -36 -19 -22 -28 126 -5 258 -25 -16 322 -143 105 -15 -30 -2 -46 5 24 50 144 -75 18 1 -237 -2
4360 -2 172 85 -47 -169 -142 -9 35 -89 -6 -6 -53 -21 61 105 -112 27 -146 -17 195 354 35 -30 -242 -140
4384 -140 244 187 92 -217 -221 -44 108 284 -43 -246 -168 -80 121 207 183 -255 -372 -96 42 242 179 -191 -262
4407 -262 -176 94 364 250 -109 -355 -104 29 227 318 16 -311 -240 -131 430 238 17 -257 -229 152 340
4428 340 336 -5 -238 -338 7 228 532 173 -239 -491 -98 194 305 109 -285 -279 -123 330 355 -58 -260 -462
4450 -462 -136 241 436 246 -339 -472 -121 255 346 381 -334 -556 -112 263 409 127 -269 -564 -355 116 626
4471 626 348 -38 -435 -434 134 423 298 30 -496 -414 -2 555 436 -35 -499 -314 -130 483 332 91 -553
4492 -553 -521 122 464 465 -103 -479 -416 -171 504 433 11 -373 -426 -117 515 628 151 -304 -497 -37 366 454
$$ packed form
4334A97j88m5J7loJ54j31K63k83RL38m65K48j20j5K8m4N1J9K6R4k19R3j7k38K35
4360bJ74q7j32j22K7J33M4j24Q3%m7L2Q2M4k17J39j73J29K12J59l19o5k12J02
4384a40L84n7r5l09mJ77J52J76l27k03P8Q8K01Q6k4m38j17K76J38K00o3l70p1
4407b62Q6K70K70j14l59k46K51J33J98R1l02l27P1J09N61j92k21k74K8L81J88
4428C40ml41k33j00L45K21L04l59m12k52L93K92J11j96l94OJ56M53K5m13k02k02
4450d62L26L77J95j90n85j33L51L76R1L5p15k22M44L75J46k82l96k95K09M71N10
4471F26k78l86l97JN68K89j25k68n26Q2M12N57j19m71m64J85J84O13j51k41o44
4492e53L2O43L42Jn68l76O3K45O75p1m22l84n3L09O32J13m77m55j93M60M03Q8
$$ plain form
4514 454 141 -275 -562 -244 373 598 115 -312 -511 -420 477 780 294 -312 -452 -306 281 571 40 -353
4534 -353 -425 -317 340 593 381 -222 -591 -293 226 497 453 -371 -514 -386 165 647 529 -95 -355 -469 158
4555 158 405 449 -68 -575 -521 153 662 452 116 -458 -216 -96 483 496 -66 -433 -295 -61 511 529 -111
4576 -111 -450 -449 21 407 395 162 -374 -447 -30 191 350 143 -311 -538 20 334 408 65 -281 -331 24 284
4598 284 354 260 -211 -376 -106 347 276 211 -278 -382 -178 237 391 83 -147 -174 -222 91 342 5 -258 -305
4620 -305 -176 201 192 95 -85 -307 -271 90 237 103 -9 -411 -244 49 224 85 93 -224 -118 81 231 76
4642 76 -101 -112 -273 -29 291 87 50 39 -195 -87 152 329 32 -170 -46 -243 -7 39 -205 -143 34 -102
4664 -102 72 229 126 -252 -110 -77 -39 231 134 40 -188 168 52 97 45 -40 -204 83 7 -124 -164 -10 -165
$$ packed form
4514D54l13m16k87L18O17K25m83m27j99R1Q97L03m86o06j40J46N87K90n31l93
4534c53p2J08O57K53k12o03l69K98N19K71m4q24j43J28N51M82j18o24k60j14O27
4555A58K47M4n17n07N4O74N09k10l36n74K42J20N79J3n62l67J38K34N72J8o40
4576a11l39JM70L86j2k33n36p3M17K21J59k07m54k27N58L14P4l43l46n0L55K60
4598B84P0r4m71j65K70M53p1o5m89j04K04M15J54l08k30k7m8L13K51l37k63m7
4620c05J29L77rr7j80k22L6L61J47j34j12m02J67K93J75j39Ql17J06J99J50j55
4642G6j77j1j61K44L20k04l7j1k34J08K39J77k97k02J24j97K36M6k44O2J77j36
4664a02J74J57j03l78J42L3L8K70r7r4k28L56j16M5n2q5j64K87p6j31m0J54j55
$$ plain form
4687 -165 10 -3 -13 -161 -164 99 -140 61 -51 -48 1 137 3 44 -88 16 89 162 62 -279 13 -148 103
4710 103 12 145 -231 -176 -12 -25 274 149 104 -295 -162 -41 179 66 23 -106 -131 7 195 84 -68 -127
4732 -127 65 152 172 317 153 -132 -130 -51 202 150 53 -127 -155 -112 99 122 89 -173 -200 -97 162 35 134 -119
4756 -119 -304 -88 274 281 78 -170 -125 -98 55 243 110 -158 -421 -232 126 261 279 -157 -229 -312 -37 312
4778 312 112 -93 -269 -237 136 169 99 -93 -252 -92 47 239 238 -63 -303 -217 -216 178 182 218 -388 -427 -144 360
4802 360 295 29 -456 -336 -134 349 286 103 -56 -412 -167 221 320 89 -214 -348 -73 232 370 148 -126
4823 -126 -485 -196 273 246 152 -177 -524 -51 316 498 168 -192 -581 -380 74 502 74 -255 -358 -317 180
4844 180 618 393 -42 -394 -455 -61 401 197 -100 -383 -219 33 433 257 -35 -369 -269 10 523 460 -28
$$ packed form
4687a65J75j3j0j48lK63k39K01j12LM9J36j34M1j32J04P3P3j00l41K92j61K51
4710A03r1J33l76N5J64j3K99j25m5l99J33J21K20j13m3j29k5J38J88j11j52n9
4732a27J92Q7K0J45j64k85KP9K53n2r7j80k8M3K11K3l3k62k7J03K59j27R9k53
4756a19j85K16L62Pk03k48M5K7J53J88j33k68k63J89L58J35J8m36p2q3K75L49
4778C12k00k05j76L2L73L3p0j92j59J60J39J92jl01k40Q6JL94ML6o06l9K83N04
4802C60o5k66m85J20K02M83o3j83j59l56K45L88R9k31l03j34K75L05J38k22k74
4823a26l59K89M69k7r4l29l47M73L67J82l30l60l89K01M54M28m28l29j03M1M97
4844A80M38k25m35l52o1L94M62k04k97k83J64K52M00j76k92l34J00K79N13o3m88
$$ plain form
4865 -28 -371 -303 57 355 381 -42 -437 -639 -39 325 448 -9 -348 -465 -149 176 325 87 -415 -371 87
4886 87 413 400 134 -238 -337 -73 186 454 254 -241 -376 -220 241 403 212 -286 -378 35 179 396 198
4907 198 -163 -381 -321 145 322 308 -50 -256 -296 253 405 153 -250 -323 -235 148 460 327 53 -374 -55 61
4929 61 294 321 -141 -413 -400 14 273 197 -43 -255 -347 127 240 276 207 -239 -380 101 196 262 116 -184 -239
4952 -239 -191 218 150 -68 -166 -354 -139 221 197 -126 33 -330 11 -7 226 171 -132 -331 9 210 208 -71 -79
4975 -79 -100 -180 20 -26 -35 -102 -83 29 297 269 120 -231 5 5 -2 116 -9 105 -67 -132 -66 108 21 -167 12
5000 12 1 252 -60 46 0 -127 -171 87 0 82 -121 -217 121 10 -11 -90 -55 65 -48 162 108 -108 56 -245
5024 -245 -53 51 110 266 -202 -192 -114 52 -157 49 46 165 138 161 -63 134 -120 45 104 101 7 -106 -186 -39
$$ packed form
4865b8l43O8L60K98K6m23l95k02O00L64J23m57l39j17L16L25J49k38n02M4M58
4886H7L26j3k66l72r9K64K59K68k00m95j35J56M61J62j91m98r2M13J44K17j98
4907A98l61k18O0M66J77j4l58k06m0N49J52k52m03p3Q8L83L12j33k74m27L19J16
4929F1K33K7m62k72J3M14K59p6k40k12r2M74J13L6o9m46j41M81R5O6j46l00n5
4952b39M8M09o8k18r8j88K15L60k4l23J59l63L41j8K33n5l03j99L40K01kk79q
4975g9k1q0K00m6ro7J9J12K68k8j49l51K36%pJ18j25J14j72o5O6J74q7j88J79
5000A2j1K51l12J06m6j27m4K58q7Q2k03r6L38j11k1p9L5J20j13K10n4k16J64l01
5024b45J92J04N9J56m68J0P8J66k09K06lJ19k7K3k24J97k54J65N9lr4j13q0J47
$$ plain form
5048 -39 -37 170 265 -71 3 24 49 39 -114 -7 72 87 265 72 -29 -224 -265 87 0 53 -76 -156 -210 58 213
5073 213 92 34 -208 -157 -25 100 177 131 -174 -116 35 91 97 -25 -120 -170 251 54 146 152 -208 -341 -39 134
5097 134 61 56 -70 -296 -56 139 112 77 -150 -258 -218 11 264 79 70 -19 -23 231 308 145 -205 -149 -54 251 335
5122 335 170 -210 -412 -232 -59 140 74 -93 -331 -217 68 443 169 -80 -317 -58 61 241 166 -57 -273
5143 -273 -220 70 215 408 -192 -376 -268 -67 335 416 -118 -280 -27 -71 256 202 -159 -221 -279 -46 162 167 61
5166 61 -276 -359 -36 211 171 117 -280 -426 50 283 167 62 -68 -316 -115 364 184 157 -308 -236 -239 204 231
5189 231 -68 -123 -362 -37 108 357 82 -159 -230 -278 95 269 133 -200 -393 -47 92 257 92 -66 -150
5210 -150 -168 -2 402 111 -144 -402 -307 190 322 291 -48 -133 -241 77 220 155 -92 -359 -365 -54 314 203
$$ packed form
5048c9KK07R5l36P4K1K5j0j53J07P9J5J78j93j01j95m1L52q7N3j29q0n4K68J55
5073B13j21n8k42N1J32J25P7m6l05N8J51N6Oj22r5n0M21j97R2Ol60j33L02J73
5097A34p3nj26k26K40J95k7l5k27j08M0K29K53j85rq9mK54P7j63l50N6R5L05Q4
5122C35j65l80k02J80J73J99o6j67k38J14K85L75k74k49k37K59J19J80p5k23k16
5143b73N3K90J45J93o00j84J08K01M02Q1n34j62K53m4L27n4l61o2n8K33K08Nj06
5166F1l37q3L23K47m0n4l97j46M76K33j16j05j30k48K01M79j80k7m65P2lM43K7
5189B31k99n5k39L25J45K49k75k41p1m8L73J74j36l33j93L46J39J65j65j58q4
5210a50j8J66M04k91k55k58R5M97J32l1l39q5j08L18J43o5k47k67oL11L68j11
$$ plain form
5232 203 -37 -204 -359 14 423 265 51 -206 -110 113 256 248 -80 -145 -288 -98 402 255 -121 -103 -168 -196
5254 -196 118 193 262 -123 -108 -124 67 270 9 -87 -366 -387 194 255 146 -237 -265 -205 -99 145 139 -55 -329 -39
5278 -39 169 275 203 -151 -105 -82 150 232 77 -17 -299 -92 64 -46 245 -173 -134 -149 140 -14 183 -60 -357
5301 -357 -51 10 126 255 -21 -52 -223 31 144 102 -43 -110 -159 -1 186 27 -193 -117 6 103 2 240
5323 240 -124 -203 51 8 152 8 -68 23 -170 -16 -79 -26 29 -65 -125 163 97 79 88 31 -92 -97 11 122 64 -152
5349 -152 64 -42 107 -129 71 64 -312 -8 119 40 -27 93 -136 -29 90 61 -77 -97 -8 41 -63 62 -28
5372 -28 -40 78 47 -36 94 -27 -52 60 148 89 -84 -28 171 -67 164 169 -54 88 43 -13 44 -3 110 -92 -169
5397 -169 101 5 -51 59 -1 45 10 9 180 22 -151 69 1 86 -35 -16 -93 -45 73 202 221 155 -136 -176 80
$$ packed form
5232B03k40j67j55L73M09j58k14k57R6K23J43ql28o5j43J90N00j47l76J8o5k8
5254a96L14P5O9l85J5j6J91K03k61r6k79k1N81O1j09l83k8O0J06K44oj94k74K90
5278c9K08J06p2l54M6K3K32Q2j55r4k82K07J56j10K91m18L9j5K89j54J97k43k97
5301c57L06O1J16J29k76l1j71K54J13m2j45o7m9J58J87j59k20P6J23R7j01K38
5323B40l64p9K54m3J44j44p6R1j93J54o3N3N5r4o0K88o6j8Rn7j23nJ08J11n8k16
5349a52K16j06J49k36K00pl76L04J27p9o7J20k29J07J19k9j38k0Q9M9j04J25r0
5372b8j2J18l1q3J30j21k5J12Q8n9j73N6J99k38K31Nk23J42m5n6N7m7J13k02p7
5397a69K70r6n6J10o0M6l5jJ71j58j73K20o8Q5j21J9p7M8J18J29J9o6k91m0K56
$$ plain form
5422 80 110 65 92 -89 -87 52 70 200 61 -1 -42 94 105 57 -114 -321 -178 -125 132 52 79 114 -101 50 136
5447 136 173 147 -309 -60 12 286 406 10 -74 -69 7 240 108 101 -84 -238 41 254 177 79 -271 -236 -30 156
5471 156 206 23 -129 -391 -154 42 202 -6 -145 -112 -178 2 497 118 -134 -188 -220 180 280 63 -178 -256
5493 -256 -42 114 240 159 -59 -253 -193 55 155 243 43 -263 -200 -51 193 243 -22 -113 -258 29 197 156
5515 156 58 -164 -52 62 234 355 35 -182 -242 -99 151 203 64 -133 -279 -78 225 252 -76 -205 -175 -59
5537 -59 456 112 195 -178 -283 -140 165 347 34 -27 -138 -80 117 196 -55 -165 -228 -163 183 215 62 52 -401
5560 -401 -200 121 161 67 -74 -335 -322 52 277 89 -94 -250 -113 326 52 218 122 -248 -142 102 245
5581 245 110 -22 -231 -206 46 68 249 -122 -195 77 -74 304 97 -8 -112 -62 -158 103 105 84 -104 -140 -121
$$ packed form
5422H0L0m5K7j81KJ39J8J30j39o2m1J36J1m8j71k07J43N3K57q0K7L5k15J51Q6
5447A36L7k6m56K49P2K74J20l96q4NP6K33j32pj85j54K79K13p7r8l50L5K06J86
5471A56N0j83j52k62K37J96J60k08j39L3o6J80M95l79k52n4l2M00J00k17k41p8
5493b56K14J56J26q1k18j94O0K48J00Q8k00l06O3J49K44N0k65r1j45K87J68m1
5515A56r8k22J12J14J72J21l20k17o0J43K50N2j39j97j46K01L03K7l28j29L0J16
5537e9N15l44Q3l73j05J43L05J82l13o1j11N8J97P9k51j10o3O5L46L2j53j0m53
5560d01K01L21M0r4j41k61J3L74K25j88j83j56J37M39k74J66r6l70J06K44J43
5581B45j35j32k09K5K52K2J81l71p3K72j51L78k07j05j04N0r6K61Kk1j88l6J9
$$ plain form
5604 -121 86 297 5 -156 -134 -61 38 236 -203 -115 -69 7 181 23 250 -164 -184 -236 43 251 -96 -137 -294
5627 -294 -186 97 25 0 -251 55 19 111 357 129 -43 59 -31 48 85 -60 -135 -199 -60 -22 -80 9 -150 -190
5651 -190 -31 -185 152 175 -6 -134 -248 11 196 117 14 -82 -58 40 148 200 -42 -275 -260 235 -3 -125
5673 -125 -39 60 12 210 92 159 -53 -54 -110 36 -59 -124 68 119 -218 3 64 -127 139 -65 -104 -125 170 117 -4
5698 -4 97 -45 -71 -35 -135 -5 155 -48 -58 -18 -72 -40 39 17 38 129 -128 -109 135 -99 -40 38 -83 -29 34 -26
5724 -26 2 143 -14 -73 148 -140 -147 205 141 -73 25 74 59 73 -111 8 18 211 -192 15 -136 -280 5 52
5748 52 21 -21 -51 -52 43 86 -119 -46 -280 -64 -74 -114 98 -105 -55 -155 -95 62 140 37 -81 -42 -15 -25 118 -19
5774 -19 11 -63 -119 15 -67 2 -21 -81 38 -85 143 72 65 -66 -16 21 49 -3 -2 -51 -96 137 115 135 42 -167 -253 93
$$ packed form
5604a21K07K11k92j61K2P3R9J98m39Q8M6P6J74j58K27m14k0n2K79K08l47m1j57
5627b94J08K83p2k5k51L06l6R2K46k28j72J02r0P9L7j45p5o4J39L8n8Q9j59m0
5651a90J59j54L37K3j81j28j14K59J85p9j03r6K4R8J08N2k42k33J5M95k38j22
5673a25Q6R9m8J98j18O7k12jn6J46r5o5J92N1l37K21O1j91K66k04l9k1K95n3j21
5698dJ01j42k6L6j00J30J60k03j0M0n4L2P9k2K1R1k57J9K44k34N9P8j21N4O3o0
5724b6K8J41j57n9K21k88pL52o4k14R8M9j5J4j84J19J0J93m03K07j51j44K85M7
5748E2l1m2l0jR5M3k05P3k34K16j0m0K12k03N0j00O0J57P8j03j18L9K7j0J43j37
5774a9L0p4n6J34q2O9k3o0J19j23K28p1pj31N0L7K8n2Jm9m5K33k2K0r3k09q6L46
$$ plain form
5802 93 61 35 77 -155 -171 -3 122 246 58 -137 -86 -46 181 118 46 10 -167 -131 -28 136 110 -114 -42 -153
5826 -153 35 262 135 -115 -45 -68 75 83 -64 -166 -125 -161 109 173 -42 -177 -107 -122 84 29 57 32 -141 -203
5850 -203 -48 186 43 -149 -91 -42 59 152 117 -38 -64 -151 68 134 36 113 -203 -91 -75 163 93 35 -168 -139
5874 -139 10 80 67 -141 30 -114 63 160 -35 -19 -239 -53 136 169 90 23 34 -130 -99 7 219 -31 -140
5897 -140 108 -29 131 138 -30 -38 -195 -89 -33 82 213 -280 -201 95 52 147 14 -104 -145 -86 -13 81 -125 14
5921 14 -102 -55 75 100 82 -26 -245 -99 112 223 -43 -14 -59 -39 -108 210 101 -83 -181 -158 -17 199 -8
5944 -8 -201 -88 -218 -67 146 82 -101 -37 -70 -98 133 32 59 -20 27 41 63 106 9 -78 -58 -24 -44 151 -65 -185
5970 -185 -150 -53 144 53 44 -44 126 -135 71 118 57 -53 40 12 151 190 -15 16 -269 22 23 2 135 -51 -49 -28
$$ packed form
5802I3l2k6M2k32j6J68J25J24j88j95N1M0K27o3p2l6j77L6J03J64k6k24P2j11
5826a53J88K27j27k50P0k3J43Qj47j02M1l6K70O4k15j35P0j5K06n5K8k5j73o2
5850b03J55K34j43j92N8M9J01R3l5j55k6q7K19O6r8P7l16J12J6K38p0n8k03K9
5874a39J49P0j3k08J71j44J77R7j95J6k20J86J89L3p9o7J1j64L1J06K12k50j09
5897a40K48j37J60Pj68qj57J06N6J15J31m93P9K96m3R5j33j18m1N9P3R4k06J39
5921A4j16M7J30K5j8j08k19J46K11J11k66K9m5K0o9L18j09j84r8K3J41K16k07
5944hj93J13j30J51K13o4j83O4l3k8K31j01K7p9M7J4K2M3r7q7K0L4k0J95k16j20
5970a85L5R7J97r1rq8J70k61K06M7o1j10R3k8J39L9k05L1k85K91Jk1J33j86KK1
$$ plain form
5996 -28 -17 188 76 -18 23 -175 -99 109 -159 -104 -93 -46 -55 27 78 -125 17 72 105 96 5 -44 56 86 94 -115 132
6023 132 69 -157 -64 -44 6 86 -57 -189 74 -55 92 -91 -151 62 20 -63 -127 -118 99 -18 35 -94 58 -23
6047 -23 2 -55 -142 123 -88 -12 4 -79 -180 11 64 -50 -50 0 49 26 28 -116 58 -41 4 36 41 41 -113 -127 69 23
6075 23 -111 -1 -201 8 -10 125 43 -18 53 64 113 222 23 122 9 53 85 20 -99 123 -12 -209 94 11
6099 11 17 -103 -60 154 294 -61 5 103 -163 169 47 74 -26 3 95 -46 -15 206 106 -64 -61 -1 -38 -129 93
6124 93 -169 108 -63 79 47 -32 49 -225 50 -92 35 -63 -84 -71 -85 -139 -138 1 -171 -46 11 9 136 -16 36
6149 36 31 -30 67 248 52 87 11 -29 122 42 64 2 -145 -35 99 39 49 -9 -52 -20 -102 -60 80 29 84 -158 -9
6176 -9 199 17 148 -54 39 179 59 73 -124 -195 -97 -114 38 190 -9 -37 -8 79 41 -43 143 -158 -52 19
$$ packed form
5996b8J1K05j12r4M1j98P6K08k68N5J1M7rQ2N1k03J42N5L3rr1m9J00L0Qk09K47
6023A32o3k26R3K0N0Q0j43j32K63j29J47j83o0K13m2q3o4RK17j17N3j29J52q1
6047b3K5n7q7K65k11P6J6q3j01J91N3j14%N0M9k3Kj44J74r9M5L2N%j54j4J96m6
6075B3j34J10k00K09j8J35q2o1P1J1M9J09j99R9j13M4L2o5j19K22j35j97L03q3
6099A1Oj20M3K14J40l55O6R8k66L32j22K7j00K9R2j41L1K21j00j70LO0l7r1K22
6124I3k62K77j71J42l2p9Q1k74K75j42J27r8k1J3j4n4JJ39j72J25N7kJ27j52N2
6149C6no1R7J81j96L5p6m0J51q0K2o2j47J10J34o0J0n8m3L2q2M2J40n1N5k42J49
6176iK08j82J31k02R3J40j20J4j97p1R8j7J52J52j99k8K9Q7l8q4J86l01J06P1
$$ plain form
6200 19 184 41 -129 -87 -99 26 -15 54 94 -70 -96 73 33 175 -21 -28 -151 117 124 101 112 -16 125 -145 153
6225 153 277 159 103 -127 -16 -119 25 -64 -78 -21 -67 -195 221 47 -43 -43 -157 -126 74 75 -44 -101 -275 8
6249 8 -13 53 58 -70 120 75 186 183 153 -206 -143 33 -11 -7 43 12 -190 -41 114 -9 63 -120 -26 -29 -124 63 91
6276 91 26 -61 208 127 72 98 -37 -266 -134 -100 -45 97 32 -278 -117 58 66 90 -188 101 6 90 85 159 49 54
6302 54 -25 69 -75 -155 70 -155 122 -5 13 -40 27 103 -122 111 130 80 -49 -161 -114 53 28 27 -85 -10 -32
6327 -32 -53 -21 -148 91 -77 -44 12 -64 -109 -53 40 0 -197 -58 43 -162 20 0 232 151 43 -35 -77 32 -14
6352 -14 -117 -17 -222 4 -22 -61 178 -95 16 -3 -38 1 -133 29 -6 -89 -18 67 -18 114 40 -72 -8 -28 3
6377 3 35 -143 -52 -94 158 50 180 -85 -36 -42 -42 69 92 -44 -236 81 20 133 -66 54 -40 -149 -15 186
$$ packed form
6200A9J65j43j70M2j2J25m1O9M0j64k6J69m0J42j96pj23K68Pk3J1j28J41k70K98
6225A53J24j18n6k30J11j03J44q9j4N7m6j28M16j74r0%j14L1K00Jj19n7j74K83
6249Hk1O6Nj28J90m5J11ll0l59O3J76m4MN0l1k02J49J55j23P2j83R4lr5J87K8
6276I1o5q7K69q1n5K6j35k29J32L4N5J42o5l10J61J75QK4k78K89r5Q4nP4j10N
6302E4p9R4j44q0K25k25K77j27J8n3O7P6k25K33J9n0j29j12M7J67k5jj12P5k2
6327c2k1L2j27K39j68L3N6p6m5N6R3m0j97J39J01k05J82k0K32q1j08p8m2J09m6
6352a4j03J00k05K26k6l9K39k73J11j9l5L9j34J62l5q3P1Q5q5J32p4j12O4k0L1
6377CL2j78R1m2K52j08J30k65M9o%J11K3j36j92L17o1J13j99J20r4j09J34K01
$$ plain form
6401 186 -26 75 -143 -58 -179 24 -7 -69 -114 80 190 103 -47 156 -87 -217 -104 122 -25 13 -98 23
6423 23 151 56 107 -19 -69 -48 -32 168 -114 -269 -169 -26 -67 74 63 3 -141 -22 -34 130 61 79 53 88 -46
6448 -46 35 67 48 -67 159 61 50 67 -133 -115 -107 -51 55 -41 -136 -6 113 -84 62 -106 -105 16 -71 -54 41 118
6474 118 -123 -146 -2 54 156 -123 30 -36 -39 38 126 52 251 -13 -90 142 46 -71 -8 -2 -120 -60 -140 -65 -141 59
6500 59 -222 -27 47 -26 -94 -62 -24 -148 -29 114 75 111 13 11 16 127 -74 -48 -97 231 108 -5 -75 -182 30
6525 30 -24 -1 85 101 -32 10 -52 32 3 -298 144 -41 -101 -29 92 235 -206 -10 124 -107 47 118 -12 -105
6549 -105 -69 -50 -84 -75 -114 -241 2 154 39 93 107 19 137 69 129 74 104 31 31 120 -30 106 -9 68 86 43 2
6576 2 250 35 -84 -29 -1 -136 -40 -92 -72 136 -41 -24 -134 -89 102 151 -48 121 -8 55 50 -132 9 -71 -82
$$ packed form
6401A86k12J01k18Q5j21K03l1o2m5J94J10q7j50K03k43j30J13K26j47L8j11J21
6423B3J28r5N1j26n0K1J6K00k82j55J00J43m1J41j1o0j44J19j2J64o9J8k6L5j34
6448d6Q1L2j9j15K26r8j1J7k00J8QN6J06r6r5J30J19j97J46j68JJ21q7J7R5P7
6474A18k41k3J44N6J02k79J53o6lP7Q8p4J99k64p7K32r6j17O3Oj18O0q0P5p6K00
6500E9k81J95P4p3o8L2L8j24J19J43l9L6r8kNJ11k01K6m9L28j23j13p0j07K12
6525C0n4K3Q6J6j33M2o2Q4k9l01M42j85o0P2J21J43m41J96J34k31J54P1j30r3
6549a05L6J9l4Rl9j27K43J52j15N4J4q8J18o8O0n5L0p3%Q9j50J36j15P7J8m3m1
6576BK48k15j19N5K8j35R6n2K0K08j77J7j10M5J91M9j99J69j29O3nj82J41q0j1
$$ plain form
6601 -82 58 -56 -210 117 218 31 -23 170 51 13 -66 16 230 -26 47 152 49 150 -54 28 -40 88 76
6624 76 -22 -169 31 -46 79 -41 -21 43 -37 -75 13 -27 187 7 -158 78 -117 11 -79 -63 49 -81 83 -150
6648 -150 34 -178 -14 -112 78 -70 -70 46 55 -51 33 8 -14 15 0 98 -92 -74 151 79 152 13 -83 -84 69 2
6674 2 -171 -41 -3 -121 208 -40 23 -110 -2 151 -29 -52 -40 -305 44 24 -199 95 -63 -101 -54 -11 109
6697 109 84 -75 -62 139 5 65 175 -176 106 -93 -111 35 56 85 98 40 75 75 121 14 -112 12 147 -127
6721 -127 57 77 -2 6 -26 40 -14 -88 -39 20 34 142 -71 -99 -12 -149 62 -33 10 6 56 86 15 -6 36 -194 -38
6748 -38 -2 -28 11 23 17 -77 -111 125 -5 -103 -49 17 -135 -164 19 -23 94 81 135 19 -65 119 -1 -267 67 79
6774 79 -25 58 -24 -20 -98 19 20 -79 195 20 -60 51 164 90 -3 55 36 113 -121 145 -43 54 -33 -51 70 36
$$ packed form
6601h2J40j14j54L27J01j87n4J93j19l8p9Q2K14k56P3J05j03J01k04Q2o8J28j2
6624G6r8j47K00p7J25j20K0O4q0l8Q8m0K14j80j65K36j95J28r0J6J12j30J64k33
6648a50J84k12J64r8J90j48%J16Rj06Q4k5k2K9j5R8j90J8K25p2P3j39r6jJ53o7
6674Bj73J30L8j18L29k48O3j33J08J53j80k3J2k65L49k0k23K94j58l8M7M3J20
6697A09k5j59J3K01j34O0J10l51K82j99j8J46K1K9J3n8L5%M6j07j26J24J35k74
6721a27J84K0p9Ql2O6n4p4M9N9J4J08k13k8Q7j37K11r5M3mN0L0p1k1M2k30J56
6748c8L6k6L9J2or4l4K36j30r8N4O6j52k9J83m2J17j3N4j16q4J84j20k66L34J2
6774G9j04Q3q2Mp8J17Jr9K74j75q0J11J13p4r3N8j9P7k34K66j88R7q7j8J21l4
$$ plain form
6800 36 -19 73 -130 -38 26 79 24 -88 -68 -42 27 5 1 92 86 234 24 193 105 55 -14 -127 57 54 -18 -36 -38 -59 82
6829 82 71 57 -25 45 9 90 142 -41 -91 -90 297 128 30 -4 -146 36 -9 -54 43 50 -122 -117 -84 -115 -19 58 -71 -104
6857 -104 -95 116 82 -59 -91 -1 -55 39 -63 -183 65 224 120 120 -31 147 -8 -151 81 70 44 79 -138 -41
6881 -41 8 -82 57 -5 -26 -146 -58 65 40 35 65 52 162 84 80 -85 -8 -22 -23 205 15 77 60 5 49 56 -66 -102
6909 -102 79 -100 18 87 -70 133 13 -255 48 -239 119 -38 53 -2 90 -37 74 -46 5 -16 -4 67 121
6932 121 104 -9 -25 28 118 -69 -29 -98 5 -150 14 -70 -62 -137 -106 83 85 71 -172 -16 39 121 28 -9 -24 -29 41
6959 41 34 132 65 75 10 208 -22 10 72 48 75 -1 67 -203 102 94 -79 -103 -8 6 -2 -213 -127 170 -131 -125 -68 17
6987 17 46 -9 32 -145 -12 -1 46 41 159 -79 -177 18 -9 -41 40 228 -41 75 -20 57 56 -67 -15 33 -168 33
$$ packed form
6800C6n5R2k03R2O4N3n5j12K0K6O9k2mR1oJ48k10J69q8n0o9j13J84lp2j8kk1J41
6829H2j1j4q2P0l6Q1N2j83n0JL87j69r8l4j42J82m5m5R7Pj72NL3l1R6P7j29l3
6857a04RK11l4j41l2R0n4R4j02j20K48J59j04%j51J78j55j43K32j1k6L5k17R7
6881d1M9r0J39o2k1j20Q8J23k5nL0j3J10p8mj65P7j4jK28j90O2j7n5M4Pj22l6
6909a02J81j79J18O9j57K03j20k68L03k87L58j57R1n5R2j27J11j20N1k1J2P1N4
6932A21j7j13j6N3R0j87M0o9J03j55J64q4Qp5L1J89Kj4k43J56N5Q2r3l7j5nP0
6959D1pR8o7J0o5J98k30L2O2k4K7p6O8k70L05qj73k4R5J4qk11Q6K97l01ON7Q5
6987A7K9n5M1j77J33J1M7nJ18k38r8J95k7l2Q1J88k69J16r5P7jj23N2M8k01K01
$$ plain form
7013 33 -20 -166 -34 49 -46 85 90 118 113 -34 -99 136 48 80 12 -126 -84 -105 -49 80 36 -12 -7 100 -21 115 19
7040 19 36 12 60 -106 -152 34 -18 -84 16 82 7 -80 -54 -54 91 -142 4 187 -46 -54 38 -13 58 188 -179 -181 -88
7067 -88 9 107 56 5 75 -138 -74 -37 29 92 20 10 -102 154 92 -14 -105 -145 -107 -82 -160 27 147 -28 -58 52
7093 52 -15 16 152 -56 155 -33 -19 0 13 -65 -140 -28 187 57 -24 -136 121 -53 -139 68 183 -76 50
7116 50 74 -108 140 21 90 -111 -50 -36 71 75 74 -120 2 -162 -8 165 106 43 6 -64 -35 -34 -25 -127 -99 125
7142 125 -120 23 -42 -2 -110 -204 -16 -52 31 -27 -18 0 -2 49 -132 -44 -30 -55 48 -23 116 23 -76 31 -43 129
7168 129 -27 63 -96 72 -23 88 -6 13 54 -147 -74 -64 -26 -77 -74 -106 26 -63 -92 15 -220 -55 -109 114 -99
7193 -99 -75 126 -30 61 44 -83 -5 -133 50 -59 -241 -17 -8 95 -14 -64 134 94 12 -17 38 -5 3 17 143
$$ packed form
7013C3n3j46J32Q3r5J31NK8nj47o5K35q8L2o8j38M2k1N6J29m4m8NJ07j21J36r6
7040A9J7k4M8j66m6J86n2o6J00O6p5q7K6%J45k33J46J83k33qR2n1P1J30l67kR3
7067h8R7R8n1n1P0k13O4L7O6O3p2j0j12K56o2j06r1m0L8K5p8J87J20j75l0J10
7093E2o7L1J36k08K11j88J4J9J3p8p5J12K15j30q1j12K57j74q6K07J15k59J26
7116E0K4j82K48j19O9k01O1J4J07Mjj94J22j64J54J73n9o3l7p0K9JRj02K8K24
7142A25k45J43o5M0j08r4J88l6Q3n8RJ8kN1j81Q8J4k5J03p1J39r3r9J07p4J72
7168A29j56R0j59J68r5J11r4J9M1k01P3J0L8n1Ll2J32q9k9J07k35J65n4K23k13
7193i9K4K01j56R1j7j27P8j28J83j09j82K24RJ03j09n0J98m0q2k9N5m3QJ4J26
$$ plain form
7218 143 21 29 -133 23 78 46 20 205 1 63 -101 -60 -67 -156 162 31 151 6 -91 -67 9 120 -30 6 138
7243 138 -45 -113 -143 40 -99 -59 87 72 -64 108 25 -27 252 -117 -28 55 224 -55 -52 -65 -10 112 -133 62
7267 62 -175 -111 167 0 -111 110 16 50 -60 -11 49 23 -35 -104 -242 7 54 -11 -169 -70 -113 6 -23 8 33
7292 33 -131 52 148 106 119 -97 -79 36 -9 108 -95 48 29 -133 96 128 76 45 -45 264 -77 12 7 67 39
7317 39 -171 141 56 -76 25 38 40 -156 -136 91 139 -202 158 195 2 -44 -120 -90 -45 -91 59 24 -21 -136 3
7342 3 31 32 24 138 61 101 76 117 133 9 122 88 -130 -80 26 -35 13 -70 15 -10 114 33 -112 74 -123 -124 -124 -38
7370 -38 114 -22 -32 -47 -17 67 -115 -78 -10 104 66 64 83 -195 164 151 -57 4 182 142 108 38 -82 -117 20 -22
7396 -22 31 -18 -4 94 -98 118 16 10 -54 -97 88 130 45 -42 8 -152 135 62 -6 -116 -42 75 -151 -49 79
$$ packed form
7218A43j22Qj62J56N5l2k6J85k04O2j64M1pq9L18j31J20j45r7K4P6J11j50L6J32
7243A38j83o8l0J83j39M0J46j5j36J72q3n2K79l69Q9Q3J69k79Lj3N5J22k45J95
7267F2k37O4K78j67j11K21r4L4j10M9O0k6n8o9j38K49M7o5j58R9m3J19k9L1K5
7292C3j64J83R6m2J3k16J8J15m5J17k03J43j9j62K29L2n2l1r0L09l41Q9nO0k8
7317C9k10L12q5j32J01J3Kj96K0K27M8l41L60L7j93m6p6L0M5m6J50l5m5j15J39
7342CK8JqJ14p7M0k5M1J6j24J13l4k18N0J06o1M8q3Q5k5J24q1j45J86j97j%Q6
7370c8J52j36j0j5L0Q4j82L7O8J14l8kJ9k78L59j3k08O1J78m0l4p0j20l5J37m2
7396b2N3m9J4R8j92K16j02oo4m3J85M2q5q7N0j60K87p3o8j10P4J17k26J02J28
$$ plain form
7421 79 112 152 -121 158 -75 -79 36 61 -167 124 -24 40 130 49 47 -54 67 -89 -85 -92 -32 30 51 6 -28 55 43
7448 43 -15 -13 -10 83 -15 17 8 83 -1 72 -94 -10 -2 91 -134 48 -48 53 -224 -60 -6 52 81 -86 -122 -67 3 -98
7476 -98 -42 -51 -10 34 -13 62 119 -58 110 -123 170 -51 177 -54 47 -9 -125 7 -58 43 -4 -102 -146 53 -117
7501 -117 94 -34 49 -45 75 -59 118 129 -23 33 111 143 29 -22 -87 159 46 -15 93 -41 -24 -55 158 53
7525 53 123 55 -59 -47 34 51 -11 -4 168 37 119 113 -37 -38 49 -162 -187 96 -70 -104 -82 -16 -74 67 -89 75 -53
7552 -53 -46 -6 176 134 -41 -19 -126 4 184 60 -69 12 -22 182 315 -121 93 -55 10 -119 35 -4 78 26
7576 26 -67 -11 201 -17 120 -32 -92 56 -51 -20 -35 104 -23 -1 65 37 -95 -90 24 -38 43 100 4 -117 -72
7601 -72 113 -107 74 -40 -14 45 178 66 48 -111 -99 -4 -2 2 23 -83 41 -76 -18 -43 -90 119 34 -133 27
$$ packed form
7421G9L3M0k73K79k33mJ15K5k28K91j48O4R0q1kj01J21j56MpO0O2K1m5l4Q3j2
7448D3n8KLR3r8L2rP5q4P3j66Q4QR3k25J82r6J01k77J64N4N8K9j67l6N5P0j01
7476i8N6rM1M4m7P5N7j77J68k33K93k21K28k31J01n6j16J32o5J01m7r8m4J99j70
7501a17K11j28Q3r4J20j34J77J1j52N6P8L2j14n1o5K46j13o1J08j34J7l1K13j05
7525E3P0o8j14J2Q1J7o2PJ72j31Q2oj50jQ7k11k5K83j66l4K2O6n8J41j56J64j28
7552e3PM0J82m2j75K2j07J30J80j24j29Q1l4K04J33m36K14j48O5j29J54l9Q2n2
7576B6r3N6K12k18J37j52o0J48j07L1j5J39j27K2O6k8j32NJ14o2Q1N7r6j21M5
7601g2J85k20J81j14K6N9J33j12j8j59J2R5KMK1j06J24j17N8k5m7K09q5j67J60
$$ plain form
7626 27 81 69 -79 -84 -39 105 -174 9 -3 -29 -126 -38 -43 64 72 -25 -2 11 -48 13 3 -5 91 19 -92 61 114 8
7654 8 12 -10 46 178 82 -101 122 -64 -244 -306 -68 -61 -89 -45 12 28 23 85 7 30 -147 -50 -12 221 -47 -114 40
7681 40 -22 -65 126 13 -170 183 -116 -54 -141 110 -167 61 -80 -105 -53 -22 -3 -66 -3 -156 29 1 -30 -140
7705 -140 -106 -17 -102 -8 -72 -39 146 95 -45 -97 170 -32 -99 -10 47 -26 -40 109 120 -47 125 -36 -46 -4 -105
7730 -105 84 20 37 93 118 131 -40 86 -35 43 69 65 43 -26 -5 -89 -31 -94 30 115 157 -117 4 149 5 13
7756 13 -77 -137 45 -37 -166 50 103 38 -51 96 98 161 -3 129 23 -91 -40 -91 15 182 133 -174 64 -150
7780 -150 101 62 -127 -21 -42 -55 12 -98 77 -81 -123 92 -42 103 79 33 33 91 -73 -6 10 50 -1 97 86
7805 86 -12 7 -1 -123 -73 124 -123 -109 38 -24 -11 120 137 17 63 77 196 53 -56 24 80 85 -101 -96 19 8
$$ packed form
7626B7N4j2j48nM5J44k79J83j2k6r7Q8nJ07Qr7K3J3n9O1j0qR6p2j11J53N3j06
7654HMk2N6J32r6j83K23j86j80o2K38Pk8M4N7J6nO2p8K3j77R7L8K33k68o7J54
7681D0o2m3J91j13j83L53k99O2q7K51k77K28j41k5N2L1J9o3O3j53J85k8l1j10
7705a40L4Q9q5R4o4L3J85n1j40n2K67k02o7Q9N7p3j4J49J1j67J72j61j0M2j01
7730a05J89o4J7N6K5J3j71J26j21P8K6mk2o9K1q4N8o3J24Q5M2k74J21J45j44Q
7756A3r0o0J82q2j29K16N3o5q9J47KO3j64J32j06j14N1n1J06J67m9l07K38k14
7780a50K51l9j89J06k1j3O7j10J75j58m2K15j34J45k4m6%N8j64O7J6M0n1R8j1
7805H6r8J9qj22N0J97k47J4J47o2J3J31J7j20M6J4J19j43j09Q0N6Nj86NJ15j1
$$ plain form
7831 8 73 39 -49 10 -16 -37 44 -16 -49 -96 -68 -55 -80 107 -190 -37 86 -201 -24 -5 -14 176 -51 -56 131 -65 160
7858 160 182 70 -82 1 58 150 -33 49 138 102 145 76 46 -97 -29 141 3 -90 18 71 23 -114 261 -142 -59
7883 -59 -111 -139 83 -110 -131 -60 74 -17 -153 36 -31 18 12 60 -22 -22 178 33 -99 -115 178 74 85 -18 125
7908 125 -5 -65 -128 59 149 -143 -4 -41 -48 5 91 -210 48 98 -22 50 -16 -75 -103 -53 69 -188 171 -111 83
7933 83 -20 24 -1 43 -4 -94 126 -6 -59 120 1 -27 -17 -47 3 34 -72 5 -62 103 -22 8 -50 -101 45 -95
7959 -95 -59 3 0 0 11 52 -26 180 -127 -160 46 -75 -46 -41 -5 -3 27 -41 -108 -97 194 54 -28 -22 36 -7 1 -122 -97 -87
7989 -87 28 80 26 67 3 -84 55 16 128 -38 -67 -6 -103 -49 96 -23 -11 -57 75 -43 -39 143 -29 -15 -135
8014 -135 131 -48 -59 -10 94 -74 79 25 -80 42 116 53 57 86 28 -34 -13 230 80 -11 -55 -39 -158 34 -51
$$ packed form
7831HO5l4q8N9k6k1Q1o0l3m7K8J3k5J87k97J53J23k87J77J9rJ90k27nJ87j96K25
7858A60K2j12j52Q3N7R2j83Q2Q9l6M3o9l0j43O8J70j38r3J08N3m8j37L75m03Q3
7883e9n2k8K22j93k1P1J34r1j36J89o7M9oM8q2%K00j45j32j6K93j04J1j03J43
7908A25j30o0o3J87R0k92J39l7pN3Q6l01K58N0j20P2o6n9k8N0J22k57L59k82J94
7933H3j03M4k5M4m7r0K20j32n3J79j19k8J0l0N0L1j06P7o7J65j25L0n8n1J46j40
7959i5L6O2l%J1M1p8K06l07l3K06j21K9NL6KL0o8o7J1K91j40q2ON8m3Qj23K5J0
7989h7J15N2n4M1o4q7J39l9J12j66k9O1r7N4J45j19J2m6J32j18MJ82j72J4j20
8014a35K66j79j1M9J04j68J53n4j05J22P4o3MK9n8o2K1K43j50r1m4J6j19J92q5
$$ plain form
8039 -51 -148 70 -48 -31 -35 -54 -161 -89 -19 0 -112 45 -35 -171 65 159 -140 135 -1 68 -7 -92 -60 -161 95
8064 95 -56 80 -128 -126 -19 16 124 -79 -39 55 -225 -110 49 -91 -35 -73 -59 3 108 206 -52 135 -69 3
8088 3 38 112 -17 132 0 -57 28 25 14 -9 -98 -17 25 2 -6 98 34 -3 2 -51 -143 -40 5 -71 -225 45 33 100 142
8117 142 37 13 -4 -164 -63 -21 -54 -39 -75 87 -46 -45 -2 6 -14 -22 -80 -162 -147 -29 38 -55 42 -161 227 -120 -142
8144 -142 -143 66 -66 -63 40 35 32 -47 -2 -9 -11 4 57 19 -79 -57 91 63 -80 64 -90 -62 115 103 -152 17 -34 -50
8172 -50 37 -6 11 -88 -165 49 -58 -184 -48 39 94 -180 87 -172 87 45 152 -2 -105
$$ packed form
8039e1r7K18j18J7mj9j07P2P0J9j12J57q0j36K36R4k99K75j36O9p5q5L2j01K56
8064I5j51J36k08KJ07L5J08k03M0R4k80J15J59j40N6l8J4O2J05R8k58J87k04P2
8088CL5P4j29J49j32n7Q5lj1k3q9Q1M2k3qJ04o4l7Nn3r2J03M5p6j54K70j2O7M2
8117A42j05k4j7j60J01M2l3J5l6J62j33JM3Qk0qn8q2J5J18O7r3R7k03L88l47k2
8144a42jK09j32LJ03nlp9M5pkJ5N3l8r8K2J48k8j43J44j54K8J77j2k55J69n1j6
8172e0Q7m3J7r9p7K14j07j26J36Q7N5k74K67k59K59m2J07j54j03
8191a05
$$ Imaginary data points
##PAGE= N=2
##DATA TABLE= (X++(I..I)), XYDATA
$$ plain form
0 0 0 0 0 0 0 0 0 0 0 -8 8 -8 16 -16 17 -24 32 -40 48 -56 67 -80 96 -112 136 -158 184 -209 241 -280 321
31 321 -363 414 -467 529 -596 671 -751 839 -936 1040 -1156 1283 -1421 1571 -1736 1916 -2114
48 -2114 2331 -2565 2825 -3114 3432 -3787 4185 -4629 5138 -5723 6398 -7196 8151 -9318
62 -9318 10785 -12692 15278 -19004 24861 -35451 60617 -246844 -32436 365460 -95863 139237
74 139237 190698 -316480 -229156 249891 63249 5904 120210 -163860 -232752 133128 107959
85 107959 23682 109265 -80237 -175818 82341 47024 -47957 82692 -31085 -146797 118076
96 118076 138114 -78393 -29039 -23183 -127188 54848 151935 -13366 -38010 -55778 -119483
107 -119483 86378 178578 -14164 -36752 -72325 -204154 41558 244462 13183 -29526 35445
$$ packed form
0@%%%%%%%%%qJ6j6K4l2L3m1N6p2Q8j04J23j47J76k08K48k94L42l93M50n21O01
31C21o84P77q81R96j125J267j422J590j775J976k196K439k704K992l307L652m030
48b114M445m896N390n939O546p219P972q814R767j0861J2121j3594J5347j7469
62i318K0103k3477K7970l4282M3865o0312R6068l07461K14408L97896m61323K35100
74A39237N1461n07178Q7324M79047j86642n7345J14306k84070o8892L65880k5169
85A07959q4277Q5583j89502r5581K58159l5317r4981J30649j13777j15712K64873
96A18076K0038k16507M9354N856j04005J82036R7087j65301k4644j7768o3705
107a19483K05861R2200j92742k2588l5573j31829K45712K02904k31279m2709O4971
$$ plain form
118 35445 -198757 -104548 256214 88467 -115238 48205 -76043 -187539 161940 185106
128 185106 -104444 -10132 9623 -181485 26940 197849 -48545 -74608 58421 -65887
138 -65887 -37783 136783 9678 -96682 2354 -25725 -17298 104267 16354 -76166 7411
149 7411 -7243 -11047 92965 14568 -100342 -20858 5150 -4167 97297 52308 -91452 -46348
161 -46348 1790 -16698 74095 62051 -75811 -45167 -725 -29291 79417 88634 -85943 -60606
173 -60606 22824 -56313 21149 133105 -34562 -93252 49442 -10165 -45206 105836 22744
184 22744 -117094 16200 42475 -54234 50610 67770 -80869 -29947 51974 -26201 -1339
195 -1339 50885 -44218 -38549 47713 -2294 -11612 41112 -31578 -50692 37681 13365 -15860 31380
$$ packed form
118C5445k34202R4209L60762j67747k03705J63443j24248j11496L49479K3166
128A85106k89550R4312J9755j91108K08425J70909k46394k6063J33029j24308
138f5887K8104J74566j27105j06360R9036k8079Q427J21565q7913r2520Q3577
149G411j4654l804J04012p8397j14910P9484K6008r317J01464m4989j43760M5104
161d6348M8138j8488R0793j2044j37862L0644M4442k8566J08708R217j74577K5337
173f0606Q3430p9137P7462J11956j67667n8690J42694n9607l5041J51042q3092
184B2744j39838J33294K6275r6709J04844J7160j48639N0922Q1921p8175K4862
195a339N2224r5103N669Q6262n0007r318N2724p2690j9114Q8373k4316k9225M7240
$$ plain form
208 31380 -12342 -45152 26017 23929 -12545 20203 -5001 -46177 11594 28108 -8340 20615
220 20615 7643 -42956 5743 24823 -21150 16543 21846 -45113 -5217 34897 -24040 -3422
232 -3422 37455 -28982 -26022 37467 -12158 -27877 41299 1017 -39026 29146 9646 -39680
244 -39680 23229 24373 -31186 10355 18760 -33035 4898 33216 -18563 -6330 21373 -23586
256 -23586 -12067 34629 -1892 -16448 12907 -16474 -18034 28804 7134 -16795 6916 -9610
268 -9610 -18857 23428 18330 -15463 -4746 -7004 -17196 20188 27023 -11270 -6645 -3152 -20763
281 -20763 14624 34370 -8877 -17224 -3557 -14751 9036 36656 2629 -22760 -11883 -15323
293 -15323 280 35704 12705 -26382 -14752 -7683 -980 32342 19864 -25029 -25238 -10683 1555
$$ packed form
208C1380m3722l2810P1169k088l6474L2748k5204m1176N7771J6514l6448K8955
220B0615j2972n0599M8699J9080m5973L7693N303o6959L9896M0114n8937K0618
232c422M0877o6437K960O3489m9625j5719O9176m0282m0043O8172j9500m9326
244c9680O2909J144n5559M1541Q405n1795L7933K8318n1779J2233K7703m4959
256b3586J1519M6696l6521j4556K9355k9381j560M6838k1670k3929K3711j6526
268i610r247M2285n098l3793J0717k258j0192L7384O835l8293M625L493j7611
281b0763L5387J9746m3247q347J3667j1194K3787K7620l4027k5389J0877l440
293a5323J5603L5424k2999l9087J1630P069O703L3322j2478m4893k09J4555J2238
$$ plain form
306 1555 31780 28793 -16192 -29966 -10022 4728 23811 28685 -10019 -35878 -15447 8742 28762
319 28762 31597 -6699 -37299 -23669 2893 25905 29397 -2441 -34143 -27542 4590 29693 30849
332 30849 424 -37315 -35178 671 28829 34530 8568 -30109 -34698 -3259 29609 36335 6571
345 6571 -30969 -37376 -7472 30785 40747 13212 -26806 -41585 -13611 26217 37483 13826 -26018
358 -26018 -42574 -14191 27885 41630 15867 -25428 -44213 -24495 21369 46653 20258 -21384
370 -21384 -37905 -23007 19240 47299 22180 -22604 -41315 -26388 13919 49656 33898 -19202
382 -19202 -41461 -23828 5820 40761 36568 -18135 -45120 -23898 5590 38555 42836 -9959
394 -9959 -51119 -29946 6365 28988 38544 3231 -46610 -32990 12232 32092 35178 4015 -46485
$$ packed form
306A555L0225k987m4985j3774J9944J4750J9083M874l8704k5859K0431K4189K0020
319B8762K835l8296l0600J3630K6562K3012L492l1838l1702O601L2132K5103J156
332C0849l0425l7739K137L5849K8158N701k5962l8677m589L1439L2868O726k9764
345F571l7540o407K9904L8257R962k7535m0018j4779K7974L9828J1266k3657l9844
358b6018j6556K8383M2076J3745k5763m1295j8785J9718M5864K5284k6395m1642
370b1384j6521J4898M2247K8059k5119m4784j8711J4927M0307L5737j5758n3100
382a9202k2259J7633K9648L4941m193n4703k6985K1222K9488L2965M281n2795
394i959m1160K1173L6311K2623R556l5313m9841J3620M5222J9860L086l1163n0500
$$ plain form
407 -46485 -40118 9097 35908 35961 9244 -35811 -42769 1724 37828 34276 4127 -36604 -44765
420 -44765 -2303 37213 40186 11575 -35115 -47192 -8863 27964 40133 18072 -32570 -46918
432 -46918 -6770 26159 35052 26223 -21198 -55168 -14066 30243 26810 22828 -2876 -48853 -21735
445 -21735 34777 26316 8502 -943 -39722 -31774 31867 37974 1905 -6745 -27297 -35847 21712
458 21712 46248 783 -17240 -21427 -32934 13644 54380 13267 -23999 -23819 -28275 845 49996
471 49996 30498 -21485 -28849 -20372 -4003 36588 38905 -8564 -35333 -27631 -1385 28624 29439
484 29439 5581 -20511 -34905 -8844 29686 21074 -2934 -8232 -24093 -20030 27896 30485 -13648
497 -13648 -11297 -4038 -23313 11725 41122 -9861 -26990 5484 -4725 365 36299 3666 -37191
$$ packed form
407d6485O367M9215K6811N3k6717m5055o958M4493L6104l552l0149m0731q161
420d4765M2462L9516K973k8611m6690j2077L8329L6827J2169k2061n0642j4348
432d6918M0148L2929Q893q829m7421l3970M1102M4309l433l982k5704m5977K7118
445b1735N6512q461j7814r445l8779P948O3641O107l6069q650k0552q550N7559
458B1712K4536m5465j8023m187j1507M6578M0736m1113l7266J80m456K9120M9151
471D9996j9498n1983p364Q477J6369M0591K317m7469k6769P702K6246L0009Q15
484B9439k3858k6092j4394K6061L8530q612k4008n298j5861M063M7926K589m4133
497a3648K351P259j9275L5038K9397n0983j7129L2474j0209N090L5934l2633m0857
$$ plain form
510 -37191 -6255 7428 -1389 28871 16789 -38047 -18934 14614 -693 16961 26734 -29857
522 -29857 -36692 12169 10581 5153 27027 -4724 -42881 -6574 21718 4689 11519 12308 -24607
535 -24607 -24154 13036 18724 4734 2346 -3026 -15960 -9820 15377 16187 -6731 -4476 4165 -10040
549 -10040 -4707 16610 -12 -16129 7573 7361 -14698 4530 9896 -18748 -927 21430 -7111
562 -7111 -8449 10409 -12688 -11448 23239 8208 -12823 7305 -3100 -21736 13097 21567 -10739
575 -10739 739 7832 -21811 -5013 23166 -736 -6294 11664 -8512 -19350 8554 10124 -6255
588 -6255 6187 7210 -15236 -10421 6498 2825 2831 9111 1498 -13273 -11836 6306 10125 2028 8999
603 8999 2791 -22650 -10443 19156 7725 -2037 11417 -7513 -26865 6594 20145 -4608 3800
$$ packed form
510c7191L0936J3683q817L0260j2082n4836J9113L3548j5307J7654R773n6591
522b9857o835M8861j588n428K1874l1751l8157L6307K8292j7029O830P89l6915
535b4607M53L7190N688j3990k388n372j2934O140K5197Q10k2918K255Q641j4205
549a0040N333K1317j6622j6117K3702k12k2059J9228N366k8644J7821K2357k8541
562g111j338J8858k3097J240L4687j5031k1031K0128j0405j8636L4833Q470l2306
575a0739J1478P093k9643J6798K8179k3902n558J7958k0176j0838K7904J570j6379
588f255J2442J023k2446M815J6919l673OO280p613j4771J437J8142L819q097O971
603H999o208k5441J2207K9599j1431r762J3454j8930j9352L3459J3551k4753Q408
$$ plain form
616 3800 6368 -23345 -8493 20171 184 -4947 9468 -10780 -14136 16024 6935 -12075 5453
629 5453 866 -14409 12956 15697 -17671 -5987 10640 -7917 4299 23004 -8635 -23706 3124
642 3124 7352 1817 16978 5345 -25622 -15895 9222 11215 11701 6610 -15314 -23642 -4009 18112
656 18112 18269 2992 -9687 -18016 -14091 11172 25367 6749 -11102 -12285 -11705 1513 23754
669 23754 14250 -13585 -13397 -4806 -2558 16827 18855 -11849 -18094 -1680 698 9800 17954 -7201
683 -7201 -25102 -3883 9608 7340 14728 420 -28379 -12882 15663 12553 10341 3921 -22984
696 -22984 -21831 12929 23249 9466 951 -15086 -25752 1916 28180 15232 -3105 -13284
708 -13284 -21964 -5587 22841 21143 -1700 -16765 -19223 -7352 16382 24002 2078 -18398 -18305
$$ packed form
616C800K568k9713J4852K8664j9987n131J4415k0248l356L0160r089j9010J7528
629E453m587j5275K7365K741l3368J1684J6627j8557J2216J8705l1639j5071K6830
642C124M228n535J5161j1633l0967R727K5117J993M86n091k1924q328J9633K2121
656A8112J57j5277j2679q329L925K5263J4195j8618j7851j183N80J3218K2241
669B3754r504k7835J88Q591K248J9385K028l0704o245J6414K378R102Q154k5155
683g201j7901K1219J3491k268P388j4308k8799J5497K8545l110k212o420k6905
696b2984J153L4760J0320j3783q515j6037j0666K7668K6264j2948j8337j0179
708a3284q680J6377K8428j698k2843j5065k458J1871K3734P620k1924k0476R3
$$ plain form
721 -18305 -6639 12858 22989 6510 -16442 -20772 -5616 14631 21700 9011 -12971 -22782 -8252
734 -8252 14141 22042 9913 -11033 -21855 -11379 11832 24130 9582 -12204 -19890 -13459 6844
747 6844 24765 12986 -12620 -20898 -11884 5179 21206 16379 -9911 -23257 -10434 5587 18863
760 18863 19275 -6351 -24653 -11668 6731 17705 18892 -1775 -23985 -16332 6747 18309 17098
773 17098 1324 -22150 -20752 3835 17094 16557 4124 -19078 -22681 488 17037 16014 4135
786 4135 -14777 -21513 -3409 17198 17639 3847 -12541 -19734 -4601 15778 17600 5663 -11363
799 -11363 -19541 -4617 14066 16804 6715 -10719 -19841 -6493 13158 16341 5748 -8438 -19416
812 -19416 -10549 12423 17870 4513 -7546 -16705 -11894 9416 18449 7606 -6493 -15852 -11563
$$ packed form
721a8305J1666J9497J0131j6479k2952m330J5156K0247P069j2689k1982r811J4530
734h252K2393P901j2129k0946j0822J0476K3211J2298j4548k1786p686O431K0303
747F844J7921j1779k5606q278R014J7063J6027m827k6290j3346J2823J6021J3276
760A8863M12k5626j8302J2985J8399J0974J187k0667k2210P653K3079J1562j211
773A7098j5774k3474J398K4587J3259n37j2433k3202l603K3169J6549j023j1879
786D135j8912o736J8104K0607M41j3792j6388p193J5133K0379J822j1937j7026
799a1363q178J4924J8683K738j0089j7434r122J3348J9651L183j0593j4186j0978
812a9416Q867K2972N447j3357j2059r159M811K1310R033j0843j4099r359M289
$$ plain form
825 -11563 6941 17595 9421 -4992 -13421 -11209 4768 17350 9224 -4599 -11943 -12592 2394
838 2394 17186 9275 -4756 -10756 -11297 -735 13879 11592 -4189 -12567 -9074 -782 10705 12272
852 12272 -1446 -10958 -9380 -1012 10541 11023 -612 -8371 -8585 -1692 9832 10981 137 -7807
866 -7807 -7669 -2387 6374 11294 1475 -9187 -6589 -1515 3436 9169 3140 -7971 -8160 -2129 4029
881 4029 7714 3106 -5199 -7251 -2350 3041 6800 4486 -4418 -6638 -467 2008 4465 5784 -2289
896 -2289 -6592 -428 2995 2218 3215 960 -5406 -3462 4206 2196 -1242 1325 -1915 -4919 1399 3618
912 3618 -1240 -1672 -7 -1387 -956 2465 1107 -2394 11 869 -495 1534 1022 -1369 407 1058
928 1058 242 685 328 -628 217 1308 291 -1506 -379 -383 -347 1560 -96 -2551 -2071 -294 2268 1802
$$ packed form
825a1563J8504J0654q174j4413q429K212J5977J2582q126j3823p344o49J4986
838B394J4792p911j4031o000n41J0562J4614k287j5781q378L493Q292J1487J567
852A2272j3718r512J578Q368J1553M82j1635p759k14O893J1524J149j0844p944
866g807J38N282Q761M920r819j0662K598N074M951N733o029j1111j89O031O158
881D029L685m608q305k052M901N391L759k314q904k220O171K475K457J319q073
896b289m303O164L423p77R97k255o366J944P668k010l438K567l240l004O318K219
912C618m858m32J665j380M31L421j358l501K405Q58j364K029n12k391J776O51
928A058q16M43l57r56Q45J091j017j797J127mL6J907j656k455M80J777K562m66
$$ plain form
946 1802 -1088 -1253 -3502 -2515 5151 5220 -2270 -2946 -1505 -4007 2314 10529 1083 -7550 -1267 -1406 -2241
963 -2241 10620 7394 -9163 -5590 1200 -3038 5090 10849 -4788 -10981 430 864 631 9401 -87
978 -87 -12599 -1742 3858 104 6777 2496 -11137 -4358 6708 3271 3057 3029 -8432 -8149 7103
993 7103 8701 1607 -46 -6895 -9577 3576 11538 5515 -3040 -9383 -8077 620 9261 11341 -675
1008 -675 -13758 -9129 2032 6054 10368 6820 -12638 -16176 3509 8769 4969 9745 -4212 -19840
1022 -19840 -541 13067 3694 5533 1833 -16931 -7460 14115 6773 -661 2756 -10908 -12354
1035 -12354 12333 11310 -4770 -578 -6309 -12795 9057 15329 -3950 -6395 -4236 -9706 4556
1048 4556 19051 2325 -11552 -6551 -5547 2259 17201 8749 -9366 -12594 -7315 4442 15039
$$ packed form
946A802k890j65k249R87P666O9p490o76J441k502O321Q215r446q633O283j39q35
963b241J2861l226j6557L573O790m238Q128N759j5637o193J1411M34k33Q770r488
978h7j2512J0857N600l754O673m281j3633O779J1066l437k14k8j1461K83J5252
993G103J598p094j653o849k682J3153P962o023q555o343J306Q697Q641K080j2016
1008f75j3083M629J1161M022M314l548j9458l538J9685N260l800M776j3957j5628
1022a9840J9299J3608r373J839l700j8764R471K1575p342p434L417j3664j446
1035a2354K4687j023j6080M192n731o486K1852O272j9279k445K159n470J4262
1048D556J4495j6726j3877N001J004P806J4942q452j8115l228N279J1757J0597
$$ plain form
1061 15039 9180 -3005 -12962 -13815 3384 17073 7535 -2304 -6722 -16143 -5381 18953 11111 -6948
1075 -6948 -3041 -9255 -12618 14596 17596 -8536 -6279 -1200 -11200 6329 20678 -4630 -12796
1088 -12796 1901 -4095 102 19621 1050 -18254 -492 2358 -2088 15629 6283 -20158 -8054
1101 -8054 6343 571 10372 10920 -15766 -16662 5001 6428 7440 11107 -8474 -18572 -1762 7435
1115 7435 10192 10423 -5869 -14871 -4888 2741 11256 12552 -4870 -13288 -3355 105 6179 14934 -2159
1130 -2159 -16874 -1239 3031 -1155 13001 4482 -19128 -4510 9419 -2150 5637 8695 -15347
1143 -15347 -10589 12264 3460 -340 9025 -9876 -15642 11721 10138 -3378 6747 -3988 -18485
1156 -18485 5936 15448 -1604 1579 -256 -16998 -2627 16996 3447 -2417 1225 -12593 -8501
$$ packed form
1061A5039n859j2185r957q53J7199J3689r538r839m418r421J0762K4334p842j8059
1075f948L907o214l363K7214L000k6132K257N079j0000J7529J4349k5308q166
1088a2796J4697n996M197J9519j8571j9304J7762K850m446J7717r346k6441J2104
1101h054J4397n772R801N48k6686q96K1663J427J012L667j9581j0098J6810R197
1115G435K757K31j6292r002R983P629Q515J296j7422q418R933L460O074Q755j7093
1130b159j4715J5635M270m186J4156q519k3610J4618J3929j1569P787L058k4042
1143a5347M758K2853q804l800R365j8901n766K7363j583j3516J0125j0735j4497
1156a8485K4421R512j7052L183j835j6742J4371J9623j3549n864L642j3818M092
$$ plain form
1169 -8501 13285 8122 -2657 -627 -8867 -8406 8090 8448 626 -91 -8028 -7407 7350 7367 -355
1184 -355 1912 -4841 -9621 6864 9069 -3553 1040 -648 -10427 4135 11278 -4165 -2931 1882
1198 1882 -8370 -58 12611 -1523 -7352 1653 -5334 -3822 12678 2862 -9429 1137 -1660
1211 -1660 -6358 10770 7991 -8942 -1816 1643 -6030 5085 10757 -5134 -5683 2622 -3590 495
1225 495 9536 -1893 -6415 1632 -2178 -1123 7243 -661 -5362 1224 -1620 -1428 5964 -201 -5493
1240 -5493 1821 511 -3244 5268 2459 -6800 1619 3406 -4142 3441 4327 -6533 -269 5191 -3531
1255 -3531 879 5468 -5188 -2843 6023 -2439 -2886 5798 -2490 -5730 5707 279 -6028 4634
1269 4634 910 -6647 3941 3219 -6492 1764 4164 -4660 1243 5054 -4793 -1771 5070 -2113 -470
$$ packed form
1169h501K1786n163j0779K030q240M61J6496L58p822p17p937O21J4757J7p722
1184c55K267o753m780J6485K205j2622M593j688r779J4562P143j5443J234M813
1198A882j0252Q312J2669j4134n829R005o987J512J6500r816j2291J0566k797
1211a660m698J7128k779j6933P126L459p673J1115N672j5891n49Q305o212M085
1225D95R041j1429m522Q047l810J055Q366p904m701O586k844J92P392o165n292
1240e493P314j310l755Q512k809r259Q419J787p548P583Q86j0860O264N460q722
1255c531M410M589j0656K345Q866q462m47Q684q288l240J1437n428o307J0662
1269D634l724p557J0588p22r711Q256K400q824N903L811r847L022O841p183J643
$$ plain form
1284 -470 5418 -4034 -3729 5267 -711 -1560 4935 -2793 -5584 3920 1334 -2159 3621 -1002 -7041 1987
1300 1987 3952 -2462 2227 1172 -7476 279 5931 -1402 784 2152 -6489 -1610 6543 781 -78
1315 -78 2235 -5319 -3650 6744 2968 -1934 1695 -3723 -5905 5862 5094 -2822 197 -2748 -6448
1330 -6448 3823 6698 -1884 -1962 -1768 -5723 1725 8378 189 -3438 -1364 -4944 464 8909 1654
1345 1654 -3631 -1227 -4289 -299 8679 3513 -4351 -2536 -2961 -1717 6907 5488 -4596 -4343 -2491
1360 -2491 -2074 5740 6850 -3928 -5317 -2441 -1983 4866 7332 -2477 -6365 -2625 -892 4263 7899
1375 7899 -510 -7153 -2724 -36 3076 8269 1092 -8051 -3464 591 2575 7273 2203 -7626 -5646
1390 -5646 541 2916 5752 3073 -6648 -7370 494 3477 4903 3879 -5173 -7887 -342 3897 5234
$$ packed form
1284d70N888r452L05Q996n978q49O495p728k791R504k586l493N780m623o039R028
1300A987J965o414M689j055q648P755N652p333K186J368q641M879Q153n762q59
1315g8K313p554J669J0394l776m902L629n418k182J1767p68p916L019k945l700
1330f448J0271K875q582p8J94l955P448O653q189l627K074l580N408Q445p255
1345A654n285K404l062L990Q978n166p864J815m25J244Q624j419j0084K53J852
1360b491M17P814J110j0778j389K876M58O849K466r809l888L740J733N155L636
1375G899q409o643M429K688L112N193p177r143M587M055J984M698n070r829J980
1390e646O187K375K836k679r721p22P864K983J426j024r052k714P545M239J337
$$ plain form
1405 5234 3894 -3821 -7624 -1333 4208 5538 3718 -2887 -7117 -2374 4197 5798 3703 -2609 -7410
1420 -7410 -2788 3445 5010 4182 -2430 -8135 -3578 3560 4994 3942 -1668 -7642 -4646 3222 5429
1435 5429 3643 -119 -6568 -5907 3268 6116 3226 599 -4922 -6439 1891 6794 3543 -508 -3838
1450 -3838 -5492 -329 6908 4214 -1732 -3747 -4687 -1712 5621 5576 -1539 -5258 -3970 -968 3870 6021
1466 6021 797 -6060 -4759 470 3269 5562 2491 -4934 -5980 13 4157 4430 2802 -2748 -6747
1481 -6747 -1794 4717 3858 1591 -1270 -5863 -3359 3667 4292 967 -1508 -4036 -3518 2031 4995 1052
1497 1052 -2666 -2761 -2525 1168 4972 2151 -2797 -3526 -1193 1760 3815 3317 -1407 -5348 -1537 2946
1513 2946 2541 2772 182 -5676 -4136 3432 3572 437 1022 -2838 -6611 1309 5877 -56 -414 15
$$ packed form
1405E234j340p715l803O291N541J330j820o605m230M743O571J601k095o312m801
1420g410M622O233J565q28o612n705M557P138J434j052n610n974K996P868K207
1435E429j786l762o449O61R175K848k890k627n521j517Q330M903l251m051l330
1450c838j654N163P237k694n946k015r40K975P333m5p115l719J288L002M838K151
1466F021n224o857J301N229K799K293l071p425j046N993M144K73j628n550l999
1481f747M953O511q59k267k861m593K504P026O25l325k475k528N18N549K964l943
1497A052l718r5K36L693L804k821m948p29K333K953K055m98m724l941L811M483
1513B946m05K31k590n858J540P568J40l135N85l860l773P920M568n933l58M29
$$ plain form
1529 15 -5661 -1684 6054 1947 -1894 547 -2412 -3600 4452 4752 -2795 -903 759 -3178 1424 5240
1545 5240 -1311 -2813 546 -855 200 3386 8 -3435 -1188 272 275 2115 784 -3019 -2356 393
1561 393 1735 2056 -48 -1501 -1540 -1810 1854 3970 -756 -1906 309 -1816 -55 4866 1213 -3233
1577 -3233 424 258 -2742 3369 3497 -4051 -844 2568 -3612 -202 5040 -2346 -3345 3294 -757 -3360
1593 -3360 3404 769 -4347 2106 2427 -3785 685 2643 -3255 197 4148 -1855 -1509 2068 -1122
1608 -1122 -1194 2904 685 -1985 281 -373 -1402 1506 1207 -1232 -329 -710 -776 916 0 -549 421 -1332
1626 -1332 -661 1649 -666 -865 1907 -317 -1160 2289 -74 -2870 1772 2017 -2147 1999 1721 -4363
1642 -4363 -268 3867 -1598 92 3072 -3471 -3236 3507 787 -1562 2569 -988 -4907 1637 2863
$$ packed form
1529A5n676L977P738m107l841K441k959j188Q052L00p547J892J662l937M602L816
1545E240o551j502L359j401J055L186l378l443K247J460LJ840j331l803O63K749
1561C93J342L21k104j453l9k70L664K116m726j150K215k125J761M921l653m446
1577c233L657j66l000O111J28p548L207L412o180L410N242p386r99O639m051k603
1593c360O764k635n116O453L21o212M470J958n898L452L951o003L46L577l190
1608a122p2M098k219k670K266o54j029K908k99k439R03l81o6J692r16n49R70j753
1626a332O71K310k315j99K772k224q43L449k363k796M642K45m164M146k78o084
1642d363M095M135n465J690K980o543K35O743k720k349M131l557l919O544J226
$$ plain form
1657 2863 -1442 1315 854 -4583 -142 3508 -215 202 984 -2501 -1136 2717 1038 -34 442 -1708
1673 -1708 -1118 2439 1056 -506 136 -2150 -1025 2533 876 -404 -100 -2791 -1439 3254 994 -1053
1689 -1053 165 -2357 -2656 3360 2812 -2149 41 -820 -3977 2523 5084 -1788 -1197 770 -3644 428
1705 428 6128 119 -3322 579 -1654 -1966 4917 2718 -3961 -1360 -132 -2142 3079 3542 -2960 -2498
1721 -2498 -150 -1467 2070 3386 -1859 -3043 -188 -285 1431 3473 -731 -3449 -353 460 1399 3457
1737 3457 -276 -3055 -963 98 1637 3118 -267 -3307 -1369 91 1089 3164 237 -3979 -1836
1752 -1836 761 333 2967 1665 -4018 -2661 1443 778 2131 2524 -2813 -3561 1031 2092 1408 2148
1768 2148 -1244 -4054 17 2488 1372 1759 -760 -3781 -630 2139 1293 1166 -645 -3332 -1263 2012
$$ packed form
1657B863m305K757m61n437M441L650l723M17P82l485J365L853j679j072M76k150
1673a708N90L557j383j562O42k286J125L558j657j280L04k691J352M693k260k047
1689a053J218k522k99O016n48m961K190q61l157O500K561o872N91J967m414M072
1705D28N700o009l441L901k233l12O883k199o679K601J228k010N221M63o502M62
1721b498K348j317L537J316n245j184K855r7J716K042m204k718L096Q13R39K058
1737C457l733k779K092J061J539J481l385l040J938J460R98K075k927m216K143
1752a836K597m28K634j302n683J357M104o65J353L93n337p48M592J061o84P40
1768B148l392k810M071K471j116L87k519l021L151K769q46j27j811k687K069L275
$$ plain form
1784 2012 1646 654 -294 -2825 -1880 2032 2181 329 -272 -2517 -1824 1842 2420 1013 -95 -2218 -1780
1801 -1780 1392 2513 1136 -448 -1922 -2136 880 2767 787 -506 -1292 -2784 69 3031 866
1816 866 -917 -1209 -2242 -249 2420 1621 -728 -1423 -1513 -444 2187 2109 -558 -1323 -1152 -334 2081 2083
1834 2083 -519 -1306 -1076 -491 1572 2005 -33 -1630 -1307 -610 831 1929 355 -1968 -1363 -421 700
1851 700 1680 194 -1228 -1247 -601 925 1806 453 -1091 -1016 -275 838 1614 948 -976 -1354 -83 665
1869 665 1542 980 -1182 -1318 -328 339 1180 778 -964 -1684 -851 328 831 761 -560 -1570 -569 507
1887 507 489 876 96 -1327 -412 619 718 735 -40 -679 -476 665 1199 311 -188 -613 -716 399 1007 179
1907 179 -275 -810 -793 151 672 438 -383 -830 -646 135 499 616 -305 -788 -370 73 803 608 80 -284
$$ packed form
1784B012l66r92r48k531R45L912J49j852o01k245O93L666N78j407j108k123M38
1801a780L172J121j377j584j474k14L016J887j980j293p86j492K853K962k165
1816H66j783k92j033J993K669p99k349o95r0J069K631p8k667p65J71Q18K415K
1834B083k602p87K30N85K063M33k038j597L23O97J441J098j574k323O05R42J121
1851G00R80j486j422j9O46J526Q81j353j544P5P41J113P76o66j924l78J271P48
1869F65Q77n62k162j36R90O67Q41m02j742p20Q33J179N03p0j321j010J001J076
1887E07j8L87p80j423R15J031R9J7p75o39K03J141N34q88m99m25j03J115O08q28
1907A79m54n35J7R44N21k34q21m47J84P81L64J17r21m83M18M43P30j95n28l64
$$ plain form
1927 -284 -518 388 683 169 496 -138 -627 506 667 -3 -186 -135 -270 -334 640 293 -913 -307 -13 -470
1947 -470 360 661 -857 -656 261 174 -36 390 199 -1026 -33 1014 297 -34 508 -448 -438 883 601
1966 601 -81 -23 -29 -678 105 1071 -135 -887 371 -553 -488 863 194 -1035 -169 156 -338 390 961 -628
1986 -628 -958 907 241 -380 916 -32 -1249 332 1167 -115 -73 299 -594 -651 1013 729 -676 -294
2004 -294 -204 -714 294 898 -310 -815 -292 -303 -77 777 787 -916 -894 504 20 273 1070 -3 -856 186
2024 186 911 80 447 724 -1162 -619 1439 120 -539 736 -366 -1392 882 1088 -1054 -147 329
2041 329 -1044 -485 1590 -129 -1495 398 -330 -818 1516 856 -1332 -618 492 -319 453 1549 -255
2058 -255 -1369 458 636 -198 937 438 -1407 -696 682 354 241 382 -561 -1493 118 893 -305 -62
$$ packed form
1927b84k34R06K95n14L27o34m89J133J61o70j83N1j35o4R74l47j206O06K94m57
1947d70Q30L01j518K01R17q7k10M26j91j225R93J047p17l31N42r56J0J321k82
1966F01o82N8oo49P83R66j206p52J258r24O5J351o69j229Q66L25m94P28N71j589
1986f28l30J865o66o21J296r48j217J581Q35j282M2L72q93n7J664k84j405L82
2004b94R0n10J008O04j208n05N23j1K26Q54J0j703K2J398m84K53P97j073q53J042
2024A86P25q31L67K77j886N43K058j319o59J275j102j026K274K06k142R07M76
2041C29j373N59K075j719j366J893p28m88K334o60k188P14J110q11P72J096j804
2058b55j114J827J78q34J135m99j845P11J378l28j13J41r43r32J611P75j198K43
$$ plain form
2076 -62 240 -1179 -580 1276 631 -672 83 -73 -801 419 1619 -583 -573 992 -464 -314 1760 228
2094 228 -1426 328 595 -566 567 786 -1320 -1001 1076 164 -323 1121 -564 -1702 440 550 -281
2111 -281 483 286 -1247 -589 1176 435 -235 437 -270 -1004 596 1152 184 33 141 -423 -564 616 866
2130 866 -528 -335 356 -657 -149 879 -323 -1013 212 368 -601 265 743 -1014 -440 1123 -390
2147 -390 -477 1021 -633 -1088 1184 841 -590 447 464 -1175 2 1717 -330 -476 804 -743 -990
2164 -990 1263 627 -848 202 -55 -1146 217 1144 -512 -874 610 -479 -969 1105 396 -684 89
2181 89 347 -300 83 653 -79 -396 427 351 -309 175 188 -618 14 406 -43 -245 23 7 -216 24 580
2202 580 -616 -596 183 -327 -192 506 53 -611 -113 251 -195 106 763 -442 -398 736 183 -476 837
$$ packed form
2076f2L02j419N99J856o45j303P55j56p28J220J200k202J0J565j456J50K074j532
2094B28j654J754K67j161J133K19k106L19K077r12m87J444j685j138K142J10q31
2111b81P64j97j533O58J765p41o70O72p07p34J600N56r68j51J08n64j41J180K50
2130H66j394J93O91j013N08J028j202o90J225J56r69Q66M78j757N74J563j513
2147c90q7J498j654m55K272l43j431J037J7j639J177J715k047j46J280j547k47
2164i90K253o36j475J050k57j091J363R27j656l62J484j089m90K074p09j080P73
2181H9K58o47L83N70p32l17Q23p6o60M84J3q06O32L92m49k02K68j6k23K40N56
2202E80j196K0P79n10J35O98m53o64M98L64m46L01O57j205M4J134n53o59J313
$$ plain form
2221 837 -83 -742 418 503 -483 41 425 -312 -382 877 -216 -747 339 36 -682 310 495 -804 -152
2240 -152 121 -197 237 376 -125 -401 109 92 136 532 128 -461 133 235 167 468 25 -180 9 -80 185
2261 185 296 -236 -477 -298 -82 14 238 -70 -548 -147 -4 8 467 -23 -721 153 257 -53 500 393 -513
2282 -513 -11 548 92 171 536 -245 -526 744 384 -273 483 -137 -933 213 464 -206 -31 -118 -735 -145
2302 -145 485 -100 -130 -40 -641 -145 639 322 -122 305 -529 -47 882 242 0 122 -261 -138 701 249 -93
2323 -93 -13 -348 -468 589 499 -344 -44 -308 -625 318 390 -493 -66 -229 -548 463 827 -153 -286 267 -375
2344 -375 -50 971 196 -509 342 -149 -304 1024 276 -643 210 40 -301 749 444 -615 -378 -133 -522
2363 -522 203 575 -553 -554 124 -619 203 822 -318 -499 222 -305 60 749 -149 -543 194 172 -43 409
$$ packed form
2221H37r20o59J160Q5r86N24L84p37p0J259j093n31J086l03p18R92J85j299O52
2240a52K73l18M34J39n01k76N10j7M4L96m04n89N94J02o8L01m43k05J89q9K65
2261A85J11n32k41J79K16R6K24l08m78M01J43J2M59m90o98Q74J04l10N53j07r06
2282e13N02N59m56P9L65p81k81J270l60o57P56o20p96J146K51o70J75q7o17N90
2302a45O30n85l0R0o01M96P84l17m44M27q34M82R29o40k42J22l83J23Q39m52l42
2323i3Q0l35j20J057r0q43L00k64l17R43P2q83M27j63l19J011L64r80j33N53o42
2344c75L25J021p75p05Q51m91j55J328p48r19Q53j70l41J050l05j059K37K45l89
2363e22P25L72j128jO78p43Q22O19j140j81P21n27L65O89q98l94P37k2k15M52
$$ plain form
2383 409 164 -722 27 303 -445 550 451 -783 -40 146 -322 316 213 -562 -329 176 -243 164 696 -384
2403 -384 -542 476 54 -358 816 -117 -728 261 283 -137 594 293 -525 112 347 -157 92 447 -371 -429
2423 -429 283 -29 -188 509 -327 -559 251 -263 -186 145 -257 -478 -57 -16 -65 192 -67 -339 80 320 6
2444 6 517 2 -316 201 195 133 685 199 -616 1 325 -242 118 336 -585 -609 397 -117 -147 733 -362 -969
2466 -969 416 158 -244 531 189 -772 36 474 -65 189 519 -512 -512 591 266 -21 243 -330 -548 137
2486 137 197 53 -112 -285 -215 -142 345 250 -307 -401 -247 -3 201 144 -103 -539 -158 66 184 147 578 -339
2508 -339 -577 586 322 -82 583 12 -606 86 702 114 -112 331 -644 -589 886 152 -637 290 -429 -818
2528 -818 413 881 -453 -126 216 -429 -208 894 139 -708 106 48 -395 792 679 -485 -377 160 -119
$$ packed form
2383D09k45q86P49K76p48R95r9j234P43J86m68O38j03p75K33N05m19M07N32j080
2403c84j58J018m22m12J174r33o11R89K2m20P31l01q18O37K35n04K49L55q18n8
2423d29P12l12j59O97q36k32Q10n14P7L31m02k21M21M1m9K57k59k72M19K40l14
2444FN11n15l18N17oo2N52m86q15O17L24n67L60K18r21k4J006n14l0Q80j095o07
2466i69J385k58m02P75l42r61Q08M38n39K54L30j031%J103l25k87K64n73k18O85
2486A37O0j44j65j73P0P3M87r5n57r4J54K44K04n7k47m36L81K24J18l7M31r17
2508c39k38J163k64m04O65n71o18O92O16n88k26M43r75N5J475p34p89R27p19l89
2528h18J231M68j334L27L42o45K21J102p55q47Q14n8m43J187j13j164J08N37k79
$$ plain form
2547 -119 3 723 42 -749 62 205 -263 283 157 -660 -590 522 85 -50 216 -106 -642 -69 623 -148
2567 -148 -85 265 -287 -331 589 423 9 63 106 -397 110 1015 -109 -302 435 -267 -525 698 382 -642
2587 -642 -231 121 -356 -207 677 -146 -755 197 189 -504 469 393 -788 -217 477 51 -21 614 74 -807 446
2608 446 641 -488 249 358 -488 -257 520 120 -106 309 -235 -675 181 407 -305 -50 214 -682 -307 613
2628 613 -74 -102 124 -130 -338 417 646 -91 -249 278 -388 -167 951 92 -425 88 -134 -163 495 527 -378
2649 -378 -636 242 -36 -9 583 -34 -821 -452 323 -20 54 416 -450 -685 348 413 -209 345 8 -707 159
2670 159 860 101 119 202 -720 -400 632 538 -270 -93 -37 -694 290 633 -269 -226 -66 -386 -222 689 218
2691 218 -800 -189 -137 -230 523 696 -431 -574 96 232 310 379 -15 -438 -271 422 433 80 78 -325 -710 121
$$ packed form
2547a19J22P20o81p91Q11J43m68N46j26q17P0J112m37j35K66l22n36N73O92p71
2567a48O3L50n52m4R20j66m14N4M3n03N07R05j124j93P37p02k58J223l16j024
2587f42M11L52m77J49Q84q23o09R52qo93R73p6j181N71O94m26p2O35n40q81J253
2608D46J95j129P37J09q46K31P77m00k26M15n44m40Q56K26p12K55K64q96L75R20
2628F13o87k8K26k54k08P55K29p37j58N27o66K21J118q59n17N13k22k9O58L2r05
2649c78k58Q78k78K7N92o17p87L69P75l43P4L62q66k35J033O5o22N54l37p15Q66
2670A59P01p59J8Q3r22L20J032r4q08J77N6o57R84L43r02M3J60l20J64R11m71
2691B18j018O11N2r3P53J73j127j43O70J36P8O9l94m23J67O93J1l53km03l85Q31
$$ plain form
2713 121 428 92 30 -375 -540 -265 404 284 -479 -256 -226 -600 336 655 -294 -427 -143 -372 160 632 276
2734 276 -529 -110 -79 -28 572 390 -479 -333 10 -46 347 396 -384 -524 -160 -46 340 426 -84 -424 -258 236
2756 236 301 334 -35 -452 -225 -246 327 699 -110 -297 -210 -256 382 675 172 -182 -175 -391 195 794 330 -447
2778 -447 -289 -218 -314 482 442 -701 -578 -219 -172 376 537 -312 -526 -150 237 294 781 324 -695 -143 247
2799 247 356 863 196 -689 -314 161 386 491 316 -769 -567 -33 397 403 287 -540 -718 -127 196 295 274
2820 274 -587 -641 -44 127 388 495 -319 -654 2 535 513 493 -34 -779 -384 508 399 480 -83 -763 -456
2841 -456 340 546 516 -36 -896 -687 232 495 442 0 -754 -833 361 761 173 83 -396 -710 132 738 467
2862 467 142 -576 -697 70 802 704 105 -347 -611 -186 880 487 121 -250 -751 -360 722 456 81 -284
$$ packed form
2713A21L07l36o2m05j65K75O69j20p63K23L0l74R36L19r49j33K84k29N32M72l56
2734B76q05M19L1N1O00j82q69J46L43n6L93M9p80j40L64J14L86Q6n10l40J66M94
2756B36O5L3l69m17K27k1N73L72q09j87Q7m6O38K93n03l54Pk16N86N99m64p77
2778d47J58P1r6P96m0j143J23L59M7N48J61q49k14L76L87N7M87m57j019N52L90
2799B47J09N07o67q85L75M75K25J05j75j085K02N34M30Oj16q27j78N91L23R9k1
2820B74q61n4N97J71K61J07q14l35O56N33k2k0n27p45L95Q92j09Q1n63o80L07
2841d56P96K06l0n52q60K09R19K63n3m42p54p9J194M00n88r0m79l14Q42O06k71
2862D67l25p18j21P67P32r8n99m52k64M25J066l93l66l71n01L91J082k66l75l65
$$ plain form
2882 -284 -756 -189 551 501 -15 -373 -562 -309 553 728 55 -284 -305 -581 330 581 137 -161 -488 -316 17
2903 17 736 301 -78 -252 -327 -31 517 266 -303 -211 -286 -89 563 348 -290 -396 -436 -183 275 326 -48 -375
2925 -375 -270 55 370 469 17 -256 -269 9 273 546 62 -195 -315 -319 298 304 -160 -133 -223 -231 -14 320 89
2948 89 -269 -349 -494 -106 374 146 -177 11 -349 -272 326 169 -59 40 66 -212 192 663 120 -231 101 -115
2970 -115 -227 393 187 -309 -110 -196 -121 229 40 -209 -157 -32 19 36 157 279 -338 -252 138 68 332 327 -255
2993 -255 -163 -187 266 93 142 47 -353 -260 365 300 52 110 -267 -434 150 558 108 -60 1 -454 -433 411 537
3016 537 -300 0 -126 -259 420 614 -20 -302 -167 -121 259 700 279 -465 -338 -165 11 551 537 -356 -601
3037 -601 -65 237 227 343 -278 -960 -437 638 361 204 -214 -621 -494 201 659 161 -229 -247 -570 -18
$$ packed form
2882b84m72N67P40n0n16l58j89K53Q62J75o73l39k1k76R11K51m44k98l27J72L33
2903A7P19m35l79j74p5K96N48k51n69R2p5J97O52k15o38j06m0K53M58N1l74l27
2925c75J05L25L15R9m52k73j3K78K64K73m84k57j20mO17Om64K7r0qK17L34k31
2948H9l58q0j45L88M80k28l23J88l60P7N98j57k28R9K6k78M04M71n43l51L32k16
2970a15j12O20k06m96J99q6P5L50j89k49N2J25N1J7J21J22o17Q6L90p0K64nn82
2993b55R2k4M53j73M9r5m00R3O25o5k48N8l77j67N84M08m50j68O1m55K1Q44J26
3016E37q37L00j26j33O79J94o34k82J35M6L80M41m21p44J27J73J76N40j4q93k45
3037f01N36L02j0J16o21o82N23J075k77j57m18m07J27O95M58m98l90j8l23N52
$$ plain form
3057 -18 1049 430 -109 -212 -418 -258 576 629 -269 -498 -167 -236 400 732 -98 -737 -225 -143 124 637 387
3078 387 -737 -579 28 226 365 497 -549 -914 25 573 361 514 -172 -849 -329 483 690 140 -127
3097 -127 -630 -757 495 800 72 -187 -518 -571 62 909 461 -473 -521 -335 -47 646 696 -193 -413 -200 -45
3118 -45 466 785 140 -705 -333 188 470 548 353 -611 -640 192 359 461 234 -542 -764 -85 475 410 188
3139 188 -220 -775 -369 720 654 -53 -422 -712 -530 457 872 237 -312 -220 -311 87 940 589 -573 -442
3159 -442 -94 -263 547 680 -269 -672 -314 66 260 692 -95 -1028 -519 334 376 512 19 -762 -678 366
3179 366 771 413 161 -480 -647 -38 917 445 -5 -367 -506 -153 823 525 233 -551 -444 -149 362 885
3199 885 288 -555 -688 -275 19 637 482 -482 -819 -284 196 390 380 -78 -866 -429 399 263 375 158
$$ packed form
3057a8J067o19n39j03k06J60Q34N3q98k29L31o9O36L32q30o39N12Q2K67N13k50
3078C87j124J58O07J98J39J32j046l65R39N48k12J53o86o77N20Q12K07n50k67
3097a27n03j27J252L05p28k59l31n3O33Q47m48r34m8J86K88O93N0q89k20K13J55
3118d5N11L19o45q45L72N21K82P8j95r64k9Q32J67J02k27p76k22O79N60o5k22
3139A88m08n55M06J089o6p07l69k90J82R87M15o35n49R2r1L98Q53l51j162J31
3159d42L48j69Q10J33r49m03L58L80J94M32p87r33N09Q53M2J36m93p81Q4J044
3179C66M05l58k52o41j67O09R55m72m50l62j39L53R76k98k92p84J07K95N11N23
3199H85n97q43j33M13K94O18j55r64l37N35M80J94j0m58p88M37Q28j36J12k17
$$ plain form
3219 158 -642 -413 588 605 200 155 -491 -594 202 763 274 -184 -362 -743 148 718 212 -166 -312 -391 -126
3240 -126 596 635 -90 -384 -371 -132 362 464 100 -423 -597 -117 285 478 268 -237 -502 -131 291 315 54
3261 54 -117 -259 -175 243 261 70 -136 -362 -276 71 392 40 -68 -217 -317 295 484 129 -257 -306 -310 187
3283 187 511 245 -99 -177 -119 -35 353 423 77 -90 -64 -40 236 239 -78 -293 -139 2 -29 -52 46 -168 -127 -158
3307 -158 104 182 -11 -51 -47 -176 135 230 94 77 -89 -192 12 228 133 81 56 -139 -95 218 141 -88 162 -130
3331 -130 -423 31 208 -98 -75 -120 -441 -51 307 111 -34 -163 -161 -294 184 444 -21 -284 -194 -27 152 408
3353 408 44 22 -422 -215 -121 482 215 -140 -402 -314 -78 441 227 -136 -150 -587 22 434 327 156 -128
3374 -128 -486 16 503 395 170 -107 -410 -130 428 532 64 -56 -506 -90 391 526 60 -269 -525 -447
$$ packed form
3219A58q00K29J001J7m05m5o46j03P96N61m89m58j78l81Q91N70n06l78j46p9K65
3240a26P22L9p25k94J3K39M94J02l64n23j74M80M02J93k10n05k65L71M22K4k61
3261E4j71j42Q4M18J8j91k06k26Q6L47L21l52j08j49j00O12J89l55l86m9mM97
3283A87L24k66l44p8N8Q4L88P0l46j67K6K4K76Ll17k15J54J41l1k3R8k14M1l1
3307a58K62P8j93m0Mj29L11R5j36j7j66j03K04K16r5n2k5j95M4L13p7k29K50k92
3331a30k93M54J77l06K3m5l21L90L58j96j45j29Kj33M78K60m65k63R0J67J79K56
3353D08l64k2m44K07R4O03k67l55k62Q8K36N19k14l63j4m37O09M12j07j71k84
3374a28l58N02M87j08k25k77l03K80N58J04m68j20m50M16M81J35m66l29k56P8
$$ plain form
3394 -447 455 607 306 -397 -675 -526 231 695 420 -201 -518 -507 -6 654 293 -362 -588 -384 288 840
3414 840 472 20 -599 -579 128 696 640 -202 -529 -488 129 524 570 -113 -712 -692 -4 712 620 41 -576 -596
3436 -596 -56 577 622 87 -601 -465 -271 679 780 116 -579 -426 -147 482 939 130 -640 -683 -98 443 622
3457 622 515 -694 -973 -260 549 666 380 -569 -792 -339 482 859 462 -365 -854 -497 322 770 346 -206
3477 -206 -678 -354 166 889 697 -178 -494 -369 195 680 697 -191 -610 -419 117 366 704 -5 -817 -470
3497 -470 211 617 458 2 -634 -707 96 510 411 228 -416 -712 189 612 598 188 -502 -664 -262 685 609
3518 609 -64 -464 -600 -505 431 643 163 -314 -519 -384 212 557 176 -426 -489 -71 372 747 479 -377 -782
3539 -782 -238 382 505 400 -136 -595 -452 392 644 330 157 -631 -429 340 543 419 55 -520 -629 -57
$$ packed form
3394d47R02J52l01p03k78J49P57M64k75o21l17J1N01O60l61o55k26K04O72N52
3414H40l68m52o19K0P07N68n6q42l27M1O17L95M6o83n99K0O88P16r2n79o17k0
3436e96N40O33M5n35o88J36J94R50J01o64o95J53K79O29M57q09p70m3N85N41J79
3457F22j07j209k79P13Q09J17k86r49k23M53Q21L77l97q27m89L57Q19M48m24n52
3477b06m72L24N20P23j92q75l16J25N64M85J7q88m19J91N36K49L38p09q12L47
3497d70O81M06j59m56o36p3Q03M14r9j83o44k96R01M23j4m10o90j62M02R47p6
3518F09o73m00j36R5R36K12m80m77k05J35N96L45l81o02o3M18M43L75k68q56m05
3539g82N44O20J23j05n36m59J43Q44K52l14j73p88K02P69K03j24l64n75j09N72
$$ plain form
3559 -57 720 354 -62 -316 -640 -242 619 518 -263 -368 -434 -172 366 624 14 -416 -192 -133 242 712 241
3580 241 -404 -270 151 268 453 329 -365 -529 -177 194 254 178 -99 -542 -183 336 224 187 -33 -283 -211
3601 -211 241 453 151 -172 -145 -286 -62 411 209 -49 -167 -129 -12 419 409 -178 -265 -67 -160 187 428 19
3623 19 -520 -107 -47 20 354 -77 -356 -218 120 71 105 213 -85 -509 68 19 174 341 101 -35 -16 142
3645 142 103 -31 -1 13 -193 28 195 139 -128 -124 -221 56 231 114 32 -43 95 -322 150 284 -39 -8 93
3668 93 -91 -102 129 184 138 -121 -52 -236 103 354 -101 -115 133 -181 -35 172 111 -27 -137 -76 4 247 191
3691 191 -137 -353 -99 -84 175 264 163 -295 -49 -46 -11 438 211 -10 -312 -178 227 141 268 145 -252 -343
3713 -343 -6 287 90 98 -263 -457 -14 329 251 -104 -211 -326 -68 342 373 26 -348 -240 -29 266 573
$$ packed form
3559e7P77l66m16k54l24L98Q61j01p81j05o6K62N38K58o10m30K24N9L75M70m71
3580B41o45J34M21J17J85j24o94j64L52L71O0p6k77m43L59N19j12l7k20k50P2
3601b11M52K12l02l23K7j41K24M73k02k58j18L8J17M31j0n87q7J98r3L47K41m09
3623A9n39M13O0O7L34m31k79J38L38m9L4J08k98m24N77m9J55J67k40j36J9J58
3645A42l9j34L0J4k06K21J67n6k67Mr7K77J75j17q2p5J38m17M72J34l23L1J01
3668I3j84j1K31N5m6k59O9j84L39K51m55j4K48l14J46K07o1j38j10O1Q0K43n6
3691A91l28k16K54J5K59Q9j01m58K46LL5M49k27k21l02J34M05q6J27j23l97r1
3713c43L37K93j97Ql61j94M43L43p8l55j07j15K58M10L1l47l74J08K11K95L07
$$ plain form
3734 573 -30 -331 -374 28 569 569 125 -233 -639 -274 289 516 125 -376 -599 -370 197 658 244 -389 -776
3755 -776 -174 246 633 273 -318 -588 -407 352 687 274 -290 -478 -559 256 587 407 -120 -602 -262 259
3775 259 702 520 -338 -589 -351 -2 599 484 -127 -678 -257 99 629 624 -53 -796 -540 -49 657 686 162
3796 162 -606 -695 234 491 708 198 -454 -466 -28 790 752 20 -616 -586 -163 645 764 163 -610 -765 -188
3817 -188 483 697 137 -601 -846 -185 394 861 356 -428 -786 -379 477 657 248 -354 -678 -278 351 636
3837 636 616 -236 -785 -412 436 641 387 -393 -777 -426 191 920 253 -275 -630 -645 63 730 538 -60 -603
3858 -603 -512 -35 650 542 -127 -664 -588 199 649 609 5 -618 -441 89 592 627 -107 -531 -701 0 570
3879 570 304 -54 -641 -651 -163 394 485 214 -438 -596 -94 484 602 194 -535 -521 -288 466 614 38 -146
$$ packed form
3734E73o03l01m3M02N41%m44l58m06L65N63K27l91n01k23K29N67M61m14o33l87
3755g76O02M20L87l60n91k70J81P59L35m13n64j88q1Q15L31j80n27m82L40N21
3775B59M43j82q58k51K38L49O01j15o11n51M21L56N30no77p43K56M91P06K9n24
3796A62p68q9R29K57K17n10o52j2M38Q18l8p32o36L0M23Q08J19o01p73j55N77
3817a88O71K14n60p38k45O61N79M67n05p84l58M07Q56J80m09o02l24M00O29K85
3837F36k0q52n49L73Q48K05k54p80l84L51O17P29o67n28l55j5P08O67j92n98n43
3858f03R1M77O85j08o69n37P6P87M50m0o04o23J77N30N03L5p34m24j70P01N70
3879E70k66l58n87j0M88N57R1k71o52j58N02N78J18m08p29J4K33P54J48n76j84
$$ plain form
3900 -146 -554 -190 395 606 183 -168 -572 -209 140 629 492 -326 -317 -277 112 361 253 -289 -505 -318 227
3921 227 420 302 -13 -479 -327 79 376 419 -28 -251 -124 24 403 276 -124 -214 -240 -173 293 358 -121 -102
3943 -102 -359 -75 194 336 63 -375 -410 -78 189 295 155 -137 -106 -236 89 238 77 -85 -238 56 242
3964 242 175 158 -125 -146 -74 187 190 204 -63 -179 -127 -61 146 -41 -97 -355 -172 -118 244 -33 19 -212 -182 -75
3988 -75 13 -72 29 -26 -60 -111 -38 140 134 -189 -13 -31 -36 97 -52 115 -158 -60 89 55 65 -35 -163 48 124
4013 124 -97 147 -17 78 -70 -163 34 -78 -77 48 -50 -135 27 81 183 91 -74 -289 -79 33 79 156 -30
4036 -30 -220 -66 30 40 292 166 -18 -200 76 28 321 -40 -235 -269 -214 262 215 -29 -52 -286 -35 177 119
4059 119 157 -85 -113 -236 26 329 254 -171 -156 -203 -176 287 152 -228 -325 -401 -2 209 272 -151 -427 -304 -82
$$ packed form
3900a46m08L64N85K11m23l51m04L63L49M89j37q18RM0L89K49j08n42k16J87N45
3921B27J93j18l15m66J52M06K97M3m47k23J27J48L79j27m00r0k6O7M66O5m79J9
3943a02k57K84K69J42k73m38l5L32K67J06j40k92L1j30L25J49j61j62j53K94J86
3964B42o7j7k83k1P2K61LJ4k67j16N2O6K07j87n6k58J83N4L62k77N2k31L0J07
3988g5Q8q5J01n5l4n1P3J78ol23J76j8nJ33j49J67k73R8J49l4J0j00j28K11P6
4013A24k21K44j64R5j48r3J97j12JJ25r8q5J62N4J02r2j65k15K10J12M6P7j86
4036c0j90J54R6J0K52j26j84j82K76m8K93l61j95l4N5M76m7k44k3k34K51K12n8
4059A19L8k42k8j23K62L03p5m25J5m7K7M63j35l80r7p6L99K11O3m23k76J23K22
$$ plain form
4082 -82 299 344 74 -292 -340 67 426 331 124 -393 -482 36 434 469 86 -214 -452 -158 401 371 91 -301
4104 -301 -533 -163 228 577 204 -391 -249 -306 190 555 206 -348 -620 -195 298 475 391 -170 -478 -270 197
4125 197 599 323 -275 -566 -269 327 552 224 -178 -573 -407 280 607 247 -167 -612 -521 331 613 366
4145 366 -68 -493 -536 251 662 456 -217 -540 -490 78 727 829 -157 -529 -407 125 516 707 10 -477 -508
4166 -508 -44 530 621 246 -616 -771 -66 552 626 236 -360 -608 -320 555 560 144 -551 -715 -218 607 708
4187 708 228 -400 -578 -293 525 795 340 -494 -527 -289 261 763 180 -407 -666 -298 332 497 593 -291 -640
4208 -640 -358 312 706 453 -53 -491 -427 225 474 372 -209 -355 -385 86 563 319 -40 -634 -481 99 642
4229 642 402 -84 -423 -453 102 388 491 121 -582 -367 -31 457 533 131 -452 -308 54 691 526 214 -277
$$ packed form
4082h2L81M5k70l66m8M07L59r5k07n17q9N18L98L5l83l00k38K94N59l0k80l92
4104c01k32L70L91L49l73n95J42n7M96L65l49n54k72M25M93J77q4n61l08K08M67
4125A97M02k76n98k91K97N96K25l28m02l95J66O87L27l60m14m45R1Q52K82k47
4145C66m34m25m3P87M11k06o73l23N0N68O49J02r86l72J22N32L91J91o97m87l1
4166e08M64N74R1l75q62j55P05O18P4l90n96k48K88Q75Nm16o95j64M97Q25J01
4187G08m80o28j78K85Q18K70m55q34l3K38N50N02n83n87k59L68O30J65R6q84l49
4208f40K82O70L94k53n06m38O4O52K49j02n81j46l0M71M77k44l59n94J53N80N43
4229F42k40m86l39l0N55K86J03l70p03K15L36M88P6m02n83J44L62O37j65l12m91
$$ plain form
4250 -277 -391 -59 415 562 119 -440 -447 -57 369 344 217 -205 -441 -108 260 587 67 -122 -431 -237 297
4271 297 563 188 -307 -329 -291 118 427 -1 -64 -328 -168 198 245 209 -4 -262 -126 97 466 78 29 -330
4293 -330 -212 311 323 89 37 -222 -176 42 300 77 58 -244 -235 -98 217 232 66 -81 -137 123 4 197 11
4316 11 -43 -131 -126 29 157 43 -102 -244 70 135 40 140 -265 -86 -36 -16 25 80 43 -110 -59 195 165 36 122
4341 122 -103 -63 -190 -10 30 315 110 -57 -159 -97 -102 42 76 120 -105 50 -150 162 218 -213 -191 78 -59
4364 -59 20 153 68 -67 -247 63 112 130 18 -47 -144 6 23 251 31 -92 -45 -139 199 269 48 -53 -250 -120
4388 -120 101 100 72 64 -217 -333 -119 196 209 -30 -211 -89 -97 145 347 -129 -429 -161 -173 115 410 53 -234
4411 -234 -237 -261 115 222 187 -206 -123 -66 162 230 156 -277 -298 -126 192 316 13 -166 -459 -319 292 298 241 -221
$$ packed form
4250b77j14L32M74J47m43n59pL90M26k5j27m22k36L33L68L27n20j89l09J94N34
4271B97K66l75m95k2L8M09L09m28o3k64J60L66M7l6k13k58J36K23L69l88m9l59
4293c30J18N23J2k34n2k59M6K18K58k23j9l02RJ37L15J5j66j47n6K60j19J93j86
4316A1n4q8NJ55J28j14j45j42L14O5r5J00m05J79N0K0M1N5l7j53N1K54l0j29Q6
4341A22k25M0j27J80M0K85k05j67j02O2nJ44L4M4k25J55k00L12N6m31K2K69j37
4364e9P9J33q5j35j80L10M9J8j12o5r7J50J7K28k20j23M7r4L38P0k21j01j97J30
4388a20K21jk8qk81j16K14L15J3k39j81J22qK42K02m76l00K68j2K88K95l57k87
4411b34lk4L76J07l5l93Q3N7K28O8p4m33k1J72L18J24l03j79k93J40O11On7m62
$$ plain form
4435 -221 -404 -220 242 452 425 -124 -395 -186 -6 336 302 60 -320 -352 109 367 267 -28 -370 -515 159
4456 159 546 349 101 -432 -581 -270 270 343 15 -464 -488 -90 461 377 -69 -142 -528 -51 532 491 -21 -291
4478 -291 -512 -202 400 622 110 -502 -394 -265 100 476 173 -304 -495 -292 344 594 238 -152 -470 -313
4498 -313 454 418 358 -294 -430 -188 282 682 619 -345 -664 -421 188 691 425 -215 -398 -509 -11 741 469
4519 469 -255 -545 -374 63 597 487 -107 -537 -519 25 577 410 -40 -452 -266 -111 339 655 87 -546
4539 -546 -549 84 317 455 32 -336 -504 -27 300 418 80 -434 -394 -192 400 697 232 -242 -489 -214 215
4560 215 632 198 -254 -460 -150 300 410 352 -322 -651 -69 155 419 335 -243 -509 -47 265 395 345 -25
4581 -25 -478 -393 505 441 266 -33 -388 -497 450 422 184 -110 -347 -333 -26 449 366 -66 -264 -345 95 578
$$ packed form
4435b21j83J84M62K10k7n49k71K09J80L42l4k42l80l2M61K58j00k95l42j45O74
4456A59L87j97k48n33j49L11N40P3l28m79k4L98N51q4m46p3l86M77N83m1n12k70
4478b91k21L10O02K22n12o12J08J29L65L76l03m77j91K03O36K50l56l90l18J57
4498c13P67l6o0o52j36K42M70M00o3r64l19K43O09N03k66o40j83j11M98P52k72
4519D69p24k90J71M37N34j10n94m30J8N44N52j67m50m12J86J55M50L16n68o33
4539e46lO33K33J38m23l68j68M77L27J18l38n14M0K02N92K97m65m74k47K75M29
4560B15M17m34m52k06L10M50J10n8o74l29N82K24K64q4n78k66M62L12J30n0l70
4581b5m53Q5Q98o4j75k99l55j09R47k8k38k94k37J4L07M75q3m32j98q1M40M83
$$ plain form
4603 578 147 -68 -139 -206 160 438 276 78 -228 -325 -54 335 420 146 -162 -213 10 284 375 65 -168 -321
4625 -321 -238 328 271 -47 -231 -204 -239 244 194 -117 -21 -238 -16 218 144 -34 -112 -206 67 77 120 76 -141 -127
4649 -127 109 2 256 101 -22 -137 13 80 128 156 -175 -303 85 131 148 83 -181 24 -182 50 141 56 -164
4672 -164 -132 -53 -120 102 -65 -8 -170 23 121 154 39 -181 46 81 56 -38 157 -165 -169 -39 -111 -17 25 88 72
4697 72 -11 -4 -116 -149 84 128 -117 -81 -24 -119 39 168 241 159 -77 -130 47 5 -81 46 -34 -166 -18 108 123
4722 123 71 -32 -307 120 152 125 104 -186 -259 -111 3 143 14 -55 -97 -207 58 460 32 2 -280 -117 67
4745 67 217 150 -79 -249 -216 122 365 211 6 -194 -285 78 132 166 -81 -269 -379 -17 192 187 46 -328 -332
4768 -332 -64 221 333 -20 -75 -234 -63 211 441 -110 -221 -239 -180 177 258 51 -264 -504 -275 241 143 143
$$ packed form
4603E78m31k15p1o7L66K78j62j98l06r7K71L89Q5k74l08n1K23K74R1l10k33j53
4625c21Q3N66n7l18j84K7l5M83n0l11R6k17K22K34p4j78p8r4K73J0M3m4k17J4
4649a27K36j07K54j55j23j15J50O7M8K8l31j28L88M6J7o5k64K05k06K32R1q5k20
4672a64L2P9o7K22j67N7j62J93R8L3j15k20K27L5k5r4J95l22mJ30p2R4M2O3j6
4697G2q3Pj12l3K33M4k45L6N7r5J58J29P3q2k36n3J77m2q6J27q0j32J48J26J5
4722A23n2j03k75M27L2k7k1k90p3J48J14J40j29o9m2j10K65M02m28l0k82J63J84
4745F7J50o7k29j70L3L38K43j54k05k00r1L63N4L4k47j88j10L62K09nj41l74m
4768c32K68K85J12l53n5j59J71K74K30n51j11j8N9L57Q1k07l15k40K29N16r8%
$$ plain form
4790 143 -247 -399 -266 77 328 -32 -122 -133 -43 35 419 160 7 -253 -307 125 351 291 -123 -398 -302 229
4812 229 278 214 -21 -308 -203 304 378 249 212 -357 -279 58 433 330 23 -364 -231 -99 432 320 -46 -315
4834 -315 -277 20 363 253 192 -304 -363 -33 380 500 56 -274 -330 86 330 294 173 -280 -397 -204 364 360
4856 360 212 -171 -434 -156 315 457 180 -352 -512 -152 132 476 268 -313 -588 -262 121 402 96 -150
4876 -150 -477 -370 154 412 243 -31 -382 -313 124 473 389 -15 -278 -460 88 587 290 93 -545 -97 258
4897 258 279 312 97 -384 -507 34 261 314 182 -225 -140 74 375 473 187 -286 -440 -110 198 257 -16 -232
4919 -232 -415 18 352 340 10 -420 -330 -214 284 183 139 -141 -382 -87 307 295 59 -91 -311 -82 225
4940 225 350 262 121 -222 -90 215 446 54 -16 -489 -151 164 301 32 -153 -153 -341 247 269 70 -81 -308
$$ packed form
4790A43l90j52J33L43K51l60r0j1R0P8L84k59j53k60n4M32K26o0m14k75R6N31
4812B29M9o4k35k87J05N07P4j29l7n69P8L37L75j03l07l87J33J32N31j12l66k69
4834c15L8K97L43j10o1m96n9L30M13J20m44l30n6M16K44l6j21m53j17J93N68m
4856C60j48l83k63K78M71J42k77n32j60L60K84L44k08n81k75L26L83K81l06k46
4876a50l27J07N24K58j69k74l51O9M37L49q4m04k63j82N48M99k97j97o38M48L55
4897B58K1L3k15m81j23N41K27N3j32m07Q5K14L01R8k86m73j54L30L08N9k73k16
4919b32j83M33L34j2l30m30R0J16M98j01m4k80k41K95L94j2k36j50k20K29L07
4940B25J25q8j41l43J32L05K31l92p0m73L38L15J37k69j85%j88N88K2j99j51k27
$$ plain form
4962 -308 -179 51 254 157 -144 -33 -164 -90 245 173 -111 -255 -197 -101 87 193 -129 -136 -35 -114 219 142 50
4985 50 -71 43 13 261 75 -87 -69 -30 -21 116 185 41 -173 -223 -21 109 208 101 -17 -64 77 64 109 33
5009 33 -53 -64 -97 -89 151 110 -55 -7 50 -122 -96 45 -80 53 -8 2 77 -32 33 254 64 -104 28 53 53 -79
5035 -79 184 -111 -105 -61 53 19 131 -119 -52 -12 -51 41 -157 70 -103 -96 33 -79 -179 20 -61 -193 -99 49
5059 49 114 64 -19 -55 186 13 60 -3 -61 -214 -44 30 70 122 -177 -154 -51 160 -31 129 -66 -137 -74 27 209
5084 209 16 -72 -128 -161 207 195 121 18 -298 -283 85 220 212 40 -148 -90 132 316 63 -104 -210 -194 -77
5107 -77 75 149 41 -291 -166 137 128 163 88 -237 -123 -5 336 15 144 -200 -107 66 420 234 76 -230
5129 -230 -203 -36 311 200 77 9 -214 23 298 376 83 -69 -415 42 140 284 24 -232 -220 -162 103 315
$$ packed form
4962c08J29K30K03r7l01J11j31P4L35p2k84j44N8R6J88J06l22pJ01p9L33p7r2
4985E0j21J14l0K48j86j62J8L9RJ37O9j44k14n0K02J30R9j07j18m7J41j3M5p6
5009C3q6j1l3QK40m1j65M8N7j72K6J41j25J33o1J0P5j09O5K21j90j68J32K5%j32
5035g9K63k95OM4J14l4J12k50O7M0l9R2j98K27j73PJ29j12j00J99q1j32R4J48
5059D9O5n0q3l6K41j73M7o3n8j53J70P4M0N2k99K3J03K11j91J60j95p1O3J01J82
5084B09j93q8n6l3L68j2p4j03l16J5L68J35qj72j88N8K22J84k53j67j06J6J17
5107g7J52P4j08l32J25L03rL5p5l25J14J18L41l21J29l44R3J73L54j86j58l06
5129b30K7J67L47j11j23o8k23K37K75P8k93j52l46M57R8J44k60k56J2N8K65K12
$$ plain form
5151 315 165 -168 -229 -308 118 345 211 -90 -214 -153 172 203 202 -18 -285 -113 135 437 238 -188 -363 -172
5173 -172 -18 321 215 -18 -269 -70 79 264 262 24 -371 -237 85 358 204 -28 -200 -162 76 456 510
5194 510 -42 -125 -173 -109 462 300 55 -335 -336 -55 321 258 161 -289 -381 79 181 172 -124 -156 -210 -2 428 518
5218 518 88 -215 -272 -254 153 330 77 -93 -196 -388 211 380 -119 -193 -106 -257 174 425 253 -305 -357 -206
5240 -206 278 347 227 -87 -308 -79 17 432 143 -112 -363 14 142 452 234 16 -231 -71 126 100 298
5261 298 -63 -283 -271 -49 289 309 -86 -324 -133 -57 52 234 -59 -301 -242 46 317 186 57 -247 -144
$$ packed form
5151C15j50l33o1p9M26K27j34l01j24O1L25L1jk20k67J72K48L02j99m26j75J91
5173a72J54L39j06k33k51J99J49J85kk38l95J34L22K73j54k32j72L8K38L80N4
5194E10n52q3m8O4N71j62k45l90jK81L76o3r7m50r2M60J02rk96l2n4K08M30R0
5218E18m30l03n7J8M07J77k53j70j03j92N99J69m99p4Q7j51M31K51j72n58n2J51
5240b06M84O9j20l14k21K29R6M15k89k55k51L77J28L10k18k18k47J60J97k6J98
5261B98l61k20J2K22L38K0l95k38J91P6J09J82k93k42N9K88K71j31j29l04J03
$$ [...]
8191A02
##END NTUPLES=NMR FID
##END=
