##TITLE=1H_E3d0607-3
 CDCl3
 8 sc, 
 7.7.2023
##JCAMPDX= 6.0         $$ Bruker NMR JCAMP-DX V2.0
##DATA TYPE= NMR FID
##DATA CLASS= NTUPLES
##ORIGIN= UXNMR, Bruker Analytische Messtechnik GmbH
##OWNER= root
$$ XWIN-NMR		Version 3.5
$$ Fri Jul  7 14:39:49 2023 Russian Standard Time (UT+4h)  she@DPX200
##.OBSERVE FREQUENCY= 200.13135
##.OBSERVE NUCLEUS= ^1H
##.DELAY= (6, 6)
##.ACQUISITION MODE= SIMULTANEOUS
##.ACQUISITION SCHEME= undefined
##.AVERAGES= 8
##.DIGITISER RES= 18
##SPECTROMETER/DATA SYSTEM= spect
##.PULSE SEQUENCE= zg30
##.SOLVENT NAME= CDCl3
##.SHIFT REFERENCE= (INTERNAL, CDCl3, 0, 15.7039)
##AUDIT TRAIL= $$ (NUMBER, WHEN, WHO, WHERE, WHAT)
$$ ##TITLE= Audit trail, XWIN-NMR		Version 3.5
$$ ##JCAMPDX= 5.01
$$ ##ORIGIN= Bruker BioSpin GmbH
$$ ##OWNER= she
$$ F:/spectra/data/she/nmr/H-F/1/audita.txt
$$ ##AUDIT TRAIL=  $$ (NUMBER, WHEN, WHO, WHERE, WHAT)
(   1,<2023-07-07 14:38:36.12 +0400>,<she>,<DPX200>,
      <created by zg, POWCHK disabled, PULCHK disabled
       configuration hash MD5:
       00 E9 B6 7A A2 85 ED C7 34 08 36 98 17 FE 4E 26
       data hash MD5: 16K
       19 D9 2B C1 BE D0 A4 7A BA E7 C3 AF FB CD 10 DD>)
$$ ##END=
$$ 
$$ hash MD5
$$ 4C 26 04 2D B8 ED BB 27 16 6D ED E0 8D 8B 95 96
##$RELAX= 
##$RELAX= 
##$RELAX= 
##$RELAX= 
##$RELAX= 
##$RELAX= 
$$ Bruker specific parameters
$$ --------------------------
##$DU= <F:/spectra>
##$EXPNO= 1
##$NAME= <H-F>
##$PROCNO= 1
##$TYPE= <nmr>
##$USER= <she>
##$AMP= (0..31)
100 100 100 100 100 100 100 100 100 100 100 100 100 100 100 100 100 100 
100 100 100 100 100 100 100 100 100 100 100 100 100 100 
##$AQSEQ= 0
##$AQ_mod= 1
##$AUNM= <au_zg>
##$AUTOPOS= <>
##$BF1= 200.13
##$BF2= 200.13
##$BF3= 200.13
##$BF4= 200.13
##$BF5= 200.13
##$BF6= 200.13
##$BF7= 200.13
##$BF8= 200.13
##$BYTORDA= 1
##$CFDGTYP= 0
##$CFRGTYP= 5
##$CHEMSTR= <none>
##$CNST= (0..31)
1 1 145 1 1 1 1 1 1 1 1 1 1 1 1 1 1 1 1 1 1 1 1 1 1 1 1 1 1 1 1 1 
##$CPDPRG= <>
##$CPDPRG1= <>
##$CPDPRG2= <>
##$CPDPRG3= <>
##$CPDPRG4= <mlev>
##$CPDPRG5= <mlev>
##$CPDPRG6= <mlev>
##$CPDPRG7= <mlev>
##$CPDPRG8= <mlev>
##$CPDPRGB= <>
##$CPDPRGT= <>
##$D= (0..31)
0 1.2 0 0 0 0 0 0 0 0.06 0 0.03 0 0 0 0 0.0002 0 0 0 0 0 0 0 0 0 0 0 0 
0 0 0 
##$DATE= 1688726315
##$DBL= (0..7)
120 120 120 120 120 120 120 120 
##$DBP= (0..7)
150 150 150 150 150 150 150 150 
##$DBP07= 0
##$DBPNAM0= <>
##$DBPNAM1= <>
##$DBPNAM2= <>
##$DBPNAM3= <>
##$DBPNAM4= <>
##$DBPNAM5= <>
##$DBPNAM6= <>
##$DBPNAM7= <>
##$DBPOAL= (0..7)
0.5 0.5 0.5 0.5 0.5 0.5 0.5 0.5 
##$DBPOFFS= (0..7)
0 0 0 0 0 0 0 0 
##$DE= 6
##$DECBNUC= <off>
##$DECIM= 32
##$DECNUC= <off>
##$DECSTAT= 4
##$DIGMOD= 1
##$DIGTYP= 9
##$DL= (0..7)
0 120 120 120 120 120 120 120 
##$DP= (0..7)
150 150 150 150 150 150 150 150 
##$DP07= 0
##$DPNAME0= <>
##$DPNAME1= <>
##$DPNAME2= <>
##$DPNAME3= <>
##$DPNAME4= <>
##$DPNAME5= <>
##$DPNAME6= <>
##$DPNAME7= <>
##$DPOAL= (0..7)
0.5 0.5 0.5 0.5 0.5 0.5 0.5 0.5 
##$DPOFFS= (0..7)
0 0 0 0 0 0 0 0 
##$DQDMODE= 0
##$DR= 18
##$DS= 0
##$DSLIST= <SSSSSSSSSSSSSSS>
$$ [...]
##$SUBNAM2= <"">
##$SUBNAM3= <"">
##$SUBNAM4= <"">
##$SUBNAM5= <"">
##$SUBNAM6= <"">
##$SUBNAM7= <"">
##$SUBNAM8= <"">
##$SUBNAM9= <"">
##$SW= 18.05172834244
##$SWIBOX= (0..15)
0 0 2 0 0 0 0 0 0 0 0 0 0 0 0 0 
##$SW_h= 3612.71676300578
##$TD= 16384
##$TD0= 1
##$TE= 0
##$TE2= 300
##$TE3= 300
##$TEG= 300
##$TL= (0..7)
0 120 120 120 120 120 120 120 
##$TP= (0..7)
150 150 150 150 150 150 150 150 
##$TP07= 0
##$TPNAME0= <>
##$TPNAME1= <>
##$TPNAME2= <>
##$TPNAME3= <>
##$TPNAME4= <>
##$TPNAME5= <>
##$TPNAME6= <>
##$TPNAME7= <>
##$TPOAL= (0..7)
0.5 0.5 0.5 0.5 0.5 0.5 0.5 0.5 
##$TPOFFS= (0..7)
0 0 0 0 0 0 0 0 
##$TUNHIN= 0
##$TUNHOUT= 0
##$TUNXOUT= 0
##$USERA1= <user>
##$USERA2= <user>
##$USERA3= <user>
##$USERA4= <user>
##$USERA5= <user>
##$V9= 5
##$VALIST= <valist>
##$VCLIST= <CCCCCCCCCCCCCCC>
##$VD= 0
##$VDLIST= <DDDDDDDDDDDDDDD>
##$VPLIST= <PPPPPPPPPPPPPPP>
##$VTLIST= <TTTTTTTTTTTTTTT>
##$WBST= 1024
##$WBSW= 4
##$XGAIN= (0..3)
0 0 0 0 
##$XL= 0
##$YL= 0
##$YMAX_a= 254999
##$YMIN_a= -353008
##$ZGOPTNS= <>
##$ZL1= 120
##$ZL2= 120
##$ZL3= 120
##$ZL4= 120
##$ABSF1= 10
##$ABSF2= 0
##$ABSG= 5
##$ABSL= 3
##$ALPHA= 0
##$AQORDER= 0
##$ASSFAC= 0
##$ASSFACI= 0
##$ASSFACX= 0
##$ASSWID= 0
##$AUNMP= <proc_1d>
##$AZFE= 0.1
##$AZFW= 0.1
##$BCFW= 1
##$BC_mod= 2
##$BYTORDP= 1
##$COROFFS= 0
##$CY= 11.3945322036743
##$DATMOD= 1
##$DC= 2
##$DFILT= <>
##$DTYPP= 0
##$F1P= 15.7292609196834
##$F2P= 12.9074282941183
##$FCOR= 0.5
##$FTSIZE= 0
##$FT_mod= 4
##$GAMMA= 1
##$GB= 0.15
##$INTBC= 1
##$INTSCL= 1
##$ISEN= 128
##$LB= 0.24
##$LEV0= 0
##$LPBIN= 0
##$MAXI= 10000
##$MC2= 0
##$MEAN= 0
##$ME_mod= 0
##$MI= 1.114404
##$NCOEF= 0
##$NC_proc= 0
##$NLEV= 6
##$NOISF1= 3.799351
##$NOISF2= 2.8
##$NSP= 1
##$NTH_PI= 0
##$NZP= 0
##$OFFSET= 15.70392
##$PC= 1
##$PHC0= -20990.95
##$PHC1= 12.45272
##$PH_mod= 1
##$PKNL= yes
##$PPARMOD= 0
##$PSCAL= 0
##$PSIGN= 0
##$REVERSE= no
##$SF= 200.130013532006
##$SI= 16384
##$SIGF1= 3
##$SIGF2= 2
##$SINO= 400
##$SIOLD= 16384
##$SREGLST= <1H.CDCl3>
##$SSB= 0
##$STSI= 0
##$STSR= 0
##$SW_p= 3612.71676300578
##$SYMM= 0
##$S_DEV= 0
##$TDeff= 0
##$TDoff= 0
##$TI= <>
##$TILT= no
##$TM1= 0
##$TM2= 0
##$TOPLEV= 0
##$USERP1= <user>
##$USERP2= <user>
##$USERP3= <user>
##$USERP4= <user>
##$USERP5= <user>
##$WDW= 1
##$XDIM= 8192
##$YMAX_p= 0
##$YMIN_p= 0
$$ End of Bruker specific parameters
$$ ---------------------------------
##NTUPLES= NMR FID
##VAR_NAME=  TIME,          FID/REAL,        FID/IMAG
##SYMBOL=    X,             R,               I
##VAR_TYPE=  INDEPENDENT,   DEPENDENT,       DEPENDENT
##VAR_FORM=  AFFN,          ASDF,            ASDF
##VAR_DIM=   8192,          8192,            8192
##UNITS=     SECONDS,       ARBITRARY UNITS, ARBITRARY UNITS
##FACTOR=    0.0002768,     1,               1
##FIRST=     0,             0,               0
##LAST=      2.2672688,     0,               0
##MIN=       0,             -353008,         0
##MAX=       2.2672688,     254999,          0
$$ Real data points
##PAGE= N=1
##DATA TABLE= (X++(R..R)), XYDATA
$$ [...]
1889b14p52J839M67j743P3J62k63O48O35q78m77K14O6j0J077q07j070J020k71
1908b84j04J178n70j083N76L06L14K73k51m89k72M25M37K43L5j126L4M03j15O92
1928F22k97j227P94K44p37R44K31j299j80J073q1n52P73j48j185R77P80j003N32
1947B61J20j297R18Q59p93J16q2l14k30R28N32j145j15K06m32O98M78j078O7j80
1967d83O7L46L02L09j137k97J152k70k90R51m09j306J020P24n28k52O75p60o42
1986h28J646k04j218R77l1j447J525P03j405k10P43l85l87J160j62j550O26P43
2004B96o76O92N06j347k20N82L83pN29j97j329J98J424m40k65N89j015q10J068
2023c9P04m74k51L71j036k08K039o41j199J261o72j374J929O44j935K80J302j285
$$ y = [-214, -966, 873, 1340, -403, -330, -168, -431, 217, 852, -26, -503, -289, -223, -233, 844, 37, -1033, -13, -284, -388, 790, 220, -863, -287, 19, 333, 606, 355, -134, -406, 19, 456, 699, 734, -392, -358, 45, -70, 622, 325, -902, -108, 136, -601, 343, 574, -725, -905, 168, 87, -465, 308, 160, -1025, -48, 732, -271, 261, 381, -916, 2, 861, 68, 184, 102, -212, -442, 486, 1018, -127, -242, -36, -468, 230, 708, -370, -303, -483, -416, -70, 232, 541, -596, -893, 259, -11, -301, 650, 241, -1065, -45, 679, 151, -101, 574, -186, -828, 818, 614, -604, 373, 342, -1105, 420, 1123, -282, -492, 251, -134, -521, 639, 477, -1073, -447, 296, -380, 312, 818, -529, -749, -167, 216, 209, 738, 541, -788, -590, 834, 394, 129, 718, -297, -1107, -39, 665, 191, -60, 311, -725, -933, 1106, 465, -734, 527, -145, -1519, 410, 1054, -881, -601, 701, -584]
2041e84j76K087p88j733J562K23j192J556M4k023O76J066q21L15Q59j134j197
2058a260J236R52j310O44R2j456K82J201J19m63N3m50p89P55J389r44m81R64j027
2077d93m12J759M5j193L86L48r79L26J496r66j218J347k76j185J930n7k085J095
2095a32P58j471O72J125j549p51J935%j337J259J0j875J216J163j106J07N45j183
2113f14k29J472L93j086J89K12j202O89J139m92o90J74k18m10P74N25o11q55R06
2132F6l49n14J467j13j534Q12O67r48K71J101q61j007J591j83j313J525J12j901
2150a111J260P49j551M84R92j271l61J642l52j453J245K89j873J333Q72j690L38
2167d58Q66j069K2J501n09r71P15M82j085L95J211j235j17P57o31j90O91J36o43
$$ y = [-584, -760, 1327, 539, -1194, 368, 591, -601, 955, 999, -1024, -348, 718, -103, 212, 1071, -63, -1260, -24, 928, -382, 262, 354, -1102, -820, 381, 500, 37, 90, -360, -1149, -394, 995, 51, -430, 534, -493, -905, 854, 899, -294, 92, 440, -539, -213, 1283, 317, -901, 446, 170, -1015, 915, 858, -1227, -132, 626, -845, -173, 952, -597, -1348, 587, 587, -750, 509, 519, -1356, -140, 1023, -83, 24, 569, -614, -843, 629, 1022, -64, 125, 337, -865, -176, 963, 471, -219, -45, -263, -673, 101, 626, 15, -840, 66, -283, -797, 670, 557, -977, -165, 502, -446, -175, 926, 65, -942, 649, 466, -847, 678, 790, -1111, 149, 898, -653, -169, 823, -448, -809, 833, 481, -972, 273, 562, -1311, 22, 894, -796, -458, 408, -661, -639, 862, 353, -618, 97, 579, -506, -111, 1100, -135, -252, 505, -126, -316, 375, 511, -132]
2186a32n3K90l39k46J029n26n14M60m5n40N80M28o35l10N99O4o93Q49K83j114
2206e65O76L51r04L47P13n16m54N99O6o92N53P15j449M66O74r55n6R61q36j35
2226d41P76r3n11%N11o79J26J068r07j14O24o47L1P21k33k23J60j9l40l3O99l6
2248D40n24L79o20k0Q70k70r0k98j89j6K68M4J65o74K74M08l88L47P6l76L3L0
2270a31L47N6k24M29o71j32P39j46j65K26n54j17M55K67l49l15L64l13j90R34
2290E10m35m38M12m50m1Q07k8m37N1j84q8L62O26m41m41J02K9J67N97n45k81R6
2312e0m49O21N47n34m27K7m2K91K88p8m55k40K42L2M41K31n74J0j38j47Q19N6
2334D71o59M55p16L39N64O9l63k80j02J86J2O65l29r01N78j21k34R32l20m21J58
$$ y = [-132, -185, 105, -234, -480, 549, 23, -491, -31, -76, -616, -36, 392, -243, -553, 46, 110, -583, 266, 549, -565, 111, 462, -442, -95, 618, 102, -352, 247, 313, -379, 174, 889, -560, -94, 580, -375, -431, 530, -306, -441, 335, 242, -269, -269, 242, -437, -311, 757, -150, -264, 360, -287, -256, 465, 232, 9, 169, 150, -190, -223, 476, 440, -84, 295, -325, -345, 525, 255, 165, -133, -322, -338, -70, -26, 139, -535, -261, 147, -241, 106, 182, -194, -161, -131, 216, 272, 48, 477, -194, -326, 413, 267, 102, 328, -226, -343, 112, 379, 30, -285, 79, -234, -424, 510, 75, -363, 49, -401, -442, 365, 337, -100, -49, -233, -321, 41, 667, 226, -215, -113, -84, 83, 680, 135, -146, -50, -499, 122, 669, 135, -292, -265, -307, -16, 272, 194, -261, -501, -259, -227, 214, 445, -129, -119, -257, -404, 415, 471, -188, 267, -449, -110, 454, 523, 160, -120, -222, -36, -24, 641, 312, -589, -11, -132, -366, 566, 246, -175, -17]
2355a7k49R5L98L22p15k19K02M7J44M90o11k02L40k26L74P14j091K40J88m08J50
2376c4P58m58n97O3K12L9L83K33j240J75K50j20O36P3q32O8K14j85N15K60n69
2397a56j43J16O1J61O08m33r08P98J9j17R21n14j057L31M02j42P13n02l86k03
2417d31L76J15P6J52o48n03R42kj57N91p76o01N06N65L5L59n41n28J46N68J94
2438D38j17k06k01n62R06l6K30k09p01M3L60n5N05j65q60M4L68K12K43J88o25
2459b00o15Q25L65k24M19m24j013Q47N27k74Q8J15j105J61J023j22m43J92k98
2478a56o29R73O03r71J22j45o32P52O02k58k74l54m7J0Q18R1o84j55L3j43Q62
2499D18K82m30n71j33N56J95M5l0o25m45Q02K33k7k6j09q04J93R31O5q31L57l13
$$ y = [-17, -266, -171, 227, 549, -166, -385, -183, -136, 8, 498, -113, -315, 25, -201, 173, 887, -204, 36, 224, -184, -34, 724, 266, -331, -268, -56, -17, 366, 599, -641, -466, -216, -336, 300, 373, -459, -391, -177, -362, 153, 413, -156, -299, -183, -122, 39, 647, 214, -694, 104, 123, 6, 927, 413, -644, -313, 89, -53, 660, 158, -228, -431, -55, 60, 136, 288, -360, -863, 79, 77, -80, 511, -265, -866, -360, 205, 240, 599, 58, -470, -324, 244, 438, 321, 115, -86, -648, 258, 222, 452, 243, -458, -415, -55, -110, 395, 230, -630, -586, -218, -6, 237, 425, -200, -815, 10, 375, 151, 570, 146, -867, -20, 507, 233, 321, 436, -669, -508, 515, 393, -50, 142, -156, -785, 188, 791, -180, -58, -203, -835, -83, 519, 261, -13, -367, -414, -404, 414, 505, -179, -334, -301, -444, 418, 700, 270, -301, -434, 122, 317, 362, 332, -293, -738, 64, 297, 270, 244, 135, -669, -476, 455, 520, -311, 46, -267]
2521b67n84J056P56j358L23L42r46N98R12n68m90J50l2l14J109L81j494J08M08
2540I0m18M53Q78j061l41J40J31j38P79o9j231R5R16m02L07L10o60m33O16M37
2560C99k64Q1m8n32r7J028O2o99K87j17o12M70P09k99p41M34q7m26J000m9j009
2581e10K53M08p10O37O76p56n58O35J73n63P72K46j235o0R90l62P7N96q37k63
2601c91M84K93o02N47O7q64K40R05n44k53O69p93m88R31J25m52L2K06o02J7J092
2622F19m14n39P08l19o25P24K53n36J05J51m69K0Q59q9p77K74M1m64N76M94p77
2643a85p0Q9J2M2K59J94q08J74L44l00K36N69o67l06K50K96l6N10k90n06k97P48
2665B58L2j47L06m91q11R48L88m82L38j31o94J15Q41j22m85M07m02p50J214K07
$$ y = [-267, -851, 205, 961, -397, -74, 268, -678, -80, 832, 264, -226, -76, -108, -422, 687, 1068, -426, -318, 90, -328, 125, 1003, -58, -399, -259, -128, -266, 513, 444, -787, -692, 224, -178, 129, 439, -221, -654, -38, 399, 135, 216, 168, -364, -461, 567, 629, -70, 217, 100, -512, -42, 667, 368, -373, 61, -26, -452, 548, 499, -510, -257, 151, -559, 78, 754, -2, -560, 75, 248, -315, 457, 703, -532, -592, 398, 36, 113, 709, -128, -391, 93, 386, -216, 331, 398, -466, -226, 679, 135, -118, 551, -242, -730, 201, 326, -126, -94, 112, -490, -473, 619, 205, -334, 374, 55, -570, 154, 407, -129, -24, 127, -342, -322, 537, 448, -329, -55, -14, -478, 98, 592, -185, -255, -166, -154, -112, 147, 341, -467, -293, 51, -249, -13, 556, -111, -417, -167, 129, 93, 603, 313, -193, -490, 258, 290, 143, 449, -42, -853, 95, 483, 1, 339, 208, -486, -371, 470, 348, -137, 270, -132, -882, 332, 539]
2685E39p05o0L53o32K90Q11k65n84J47J63k98O71J68o80j40R1m9N56K2l27m28
2706c57j53L81K56K34J20r05k11M53M88Jj95k05m40j37J010K91o07Q7k98l91R32
2727C54J39l44k2k02n12N56O52k47n75J03j84k23J194J5q75k1j83j38Q40M33p85
2748b5m73N1L09M33K87r4j057J16L79K93L24k79m29j84r2O72M94m86l00l40j01
2769e02M73N84K9o69m85LL19P10P7o74j78j87M6R99M00q66m62k93K28R33K83m04
2791C64p27k06K90L29R35k85j362J17L49J51Q54k01j073k84K78N44M26Ko27p56
2811h82K11O66K72M21p23q02J93O27M62M33r37n81J26M80O36K99o03r78n1P08
2831b3L64L82k25j032m36Q28L50L51J3j316OM68M62L06J15j239l06L20R56L48
$$ y = [539, -166, -226, 127, -505, -215, 596, 331, -253, -106, 57, -241, 430, 598, -82, -222, -131, -180, 376, 398, 71, -357, -510, -129, 127, 361, 481, -424, -635, -182, 306, 307, 112, -93, -533, -670, 340, 631, 24, 111, -187, -578, 354, 493, 149, 127, -75, -587, -31, 621, 374, -201, -98, -282, -505, 689, 704, -171, -192, -375, -513, 327, 760, -25, -498, -447, -138, 295, 582, 488, -569, -453, -74, 219, 543, 264, -165, -349, -441, 231, 725, 239, -61, -401, -502, -29, 555, 584, -85, -570, -567, -248, 462, 539, -135, -313, -500, -454, 545, 945, 79, -383, -676, -448, 485, 768, 364, -363, -569, -279, 50, 985, 700, -662, -545, -196, -45, 809, 608, -465, -749, -471, 73, 499, 501, -126, -882, -671, -5, 267, 688, -35, -837, -644, -17, 445, 878, -59, -640, -514, -34, 602, 901, 298, -680, -731, -23, 341, 723, 498, -534, -970, -142, 208, 559, 572, -744, -738, -270, 192, 498, 613, -626, -932, -612, 344, 692]
2851F92o2o28q84N85P11K43j4n24r86L97P32K85k4m88p21L7O88N46k27j91q18
2872f51j74P69M78J5j95q14m22R34L98J11j11o87m26L41R63P1k30o28m89N31P82
2893E66J77n37j29r05K50J052k7j58l55n96J58P26L08l42k95k36j25M22N96m09
2913A41k35o7m53P33N54m75j76l28j33J75N49L04n62l02j6Q7M44M59p31l12J72
2934a72k59N39L12l51l42l4J37K11L60j53l22l32Q2J78M51k21j13j11j19J39M30
2955C10j78J12n9n05K84K47J25l51J32k99K8M9M16l49p0P5l86K56L52l36n1L02
2977A04l35O9L04K35l85o7J36j93J46M84l25l55K15l52M32J10R6k49j25j47K59
2998E7o7J10j22j90l5J4K11K97Q5m06l43Q4N59NK7j34n36O4M86R4R9j68l96l07
$$ y = [692, 630, 2, -882, -297, 414, 657, 643, 119, -867, -470, 262, 547, 523, 35, -686, -649, 39, 585, 358, 167, -651, -825, -56, 422, 437, 242, -572, -994, -60, 338, 449, 338, -349, -775, -434, 529, 600, 370, -258, -747, -216, 566, 743, 206, 77, -828, -578, 474, 447, 289, -66, -662, -504, 222, 530, 188, -107, -343, -468, -46, 550, 141, -94, -161, -614, 119, 673, 198, 22, -306, -439, -264, 285, 589, 27, -275, -291, -204, 240, 699, -32, -344, -172, -431, 108, 420, 69, -273, -307, -170, 41, 401, 248, -74, -406, -324, -146, 305, 84, -29, -140, -259, -120, 310, 132, 244, 185, -320, -36, 211, 336, -15, 117, -182, -154, -105, 311, -38, -108, -33, -419, -163, 189, -147, -198, 104, -231, -162, 142, 377, -8, -75, 61, -132, 14, 498, 173, -182, 33, -319, 113, 223, 319, 70, -55, -202, 57, -10, 100, -22, -212, -247, -233, -22, 275, 360, -46, -389, -305, 254, 259, 286, 152, -384, -320, 166, 260, 359, 191, -205, -512]
3022e12N50M88l42M7k97l60K09O75k47l68o7l79L27N88K51n44j70j33K9K15Q46
3043H06n82p14J95JM24M64N1q59l91M02L81K54J85o51o92K27Q15j1O6k70l92m09
3065g00P33P09m84r2l85n19N21Q59l48p8n17l95M06O94L67n60l33l11q2Q06P21
3086A012p49o58J33o6M41Q47n93p49j58K40L91L99K15q33o88L57O01K16K36m87
3106A07o91k2O60L51P5l03p22k44O26Q47p1l82m92n31M45R90r8l55p66O7J10P70
3128C71P04r39n56p0n4P17O67l09j033j26L47M25K81L66r22p04M73N18K80M45
3148H81r61o80J64Q24M09j12k28r35j46R60M82j91l99m87n65P52P82J0n70k88
3168b98k77J97R58K93q32m22j55p2J140K42m46p46p9J74N01O56k22q41k37K31
$$ y = [-512, 38, 526, 184, 231, -66, -426, -217, 458, 211, -157, -224, -603, -276, 312, 563, 19, -151, -284, -255, -40, 806, 224, -490, -295, -294, 130, 594, 645, -214, -605, -203, 178, 432, 617, -34, -726, -499, 316, 305, 371, 101, -291, -700, 33, 742, 258, 166, -219, -738, -217, 642, 294, 216, -301, -696, -290, 404, 771, 211, -122, -433, -515, 291, 1012, 263, -395, -262, -328, 113, 960, 367, -382, -540, -300, 91, 490, 705, -128, -816, -459, 142, 358, 594, 107, -584, -606, 54, 405, 480, 177, -545, -789, -163, 684, 613, 231, -261, -792, -347, 643, 545, 190, -576, -509, -399, 371, 1075, 136, -420, -490, -544, 173, 840, 531, -502, -628, -281, 144, 425, 791, -131, -835, -362, 156, 436, 881, -80, -760, -596, 228, 637, 525, 297, -638, -784, 176, 658, 467, 68, -419, -984, -232, 550, 560, -10, -298, -575, -378, 580, 873, 41, -381, -536, -608, 532, 774, 328, -418, -497, -323, 178, 834, 612, -229, -466, -235]
3188b35K33O08k0q31n53L40O64K64j04n23o19K90M89N81l13k40o39m7P15O46j28
3209E78n70l92o2K27P63K64q57l67n5J78P39L37o94l83j96K14M92M55k93p39k29
3230e90O13q5P32l44o39j53L57J97K94j7m36o93M18M63R0J55l88m72O4O19K01
3251C86J24o65n2j33K93N64k77j40k61k38K21N84p9l01k77k46K95L98P0m7o60
3272d41P4K71K32K64j77l51j33L28OJ65Lj79l96P2M90N2l36K4l45J84L82k6q2
3295H1k18M6j71K56J12l3L2k66J22O9J17K2j44o3p3K17n4K62r8m28J81O1j18M03
3319C15j62j45j12M0Q0J7q5K93l34j21J22J0J1K40j33j22or7J66J93j35j01J24
3342E8j21J03J65r0j23j09JQ8K91n0l00k23J47R8J70J56k39j51k2J23Q6J40j14
$$ y = [-235, -2, 606, 586, -245, -798, -458, 206, 470, 366, -157, -776, -486, 3, 584, 271, 31, -608, -655, 60, 706, 578, 8, -384, -446, -219, 544, 808, -49, -416, -471, -293, 446, 783, 89, -294, -490, -276, 216, 671, 378, -361, -590, 23, -62, 670, 326, -313, -466, -109, 88, 382, 365, -71, -764, -346, 117, 207, 362, -26, -498, -434, 185, 386, 510, -155, -207, -340, -47, 517, 240, 100, -161, -399, -178, 406, 327, 26, -251, -497, -202, 196, 266, 219, -441, -367, -96, 136, 400, 223, -128, -261, 67, 73, 238, 241, 62, -334, -262, 228, 280, -56, -32, -377, -193, 189, 163, 81, -137, -91, -262, -6, 106, 73, 105, -161, -39, 30, 147, 169, 25, -38, -111, 106, 52, 314, 216, -212, -31, 30, -88, 315, 153, 8, -104, -64, 16, 33, -52, 241, -93, -214, -92, -82, -71, 169, 36, -86, -92, -189, -23, 170, 35, -66, 58, -63, 40, 205, 115, -8, -117, -116, -28, 263, 213, -87, -310, -163, -65, 105, 261, 22, -129, -151, -28, 58, 198, 84]
3365H4l62k3L17J65K44j99l74j54R8M36K67j22n46j22J42L15L0K80p01l57K49
3386c33K45L03L29n94l14P8K20M77K7o55k93N4N41K59K47m07q21K75M26K49J98
3407E11l18n38j16L39L61L51l70m73k30L34L42J59j46m56n05M17P10R4j39o80
3427c53l16J98N32K59J22n61n14L13L86O96k74o60l08j56Q90K68j3m46o38j9P89
3448A95K86J8m44o47q8N34N48Jn21l38q1M35O83k03l58m40k22M50P09J78m56m64
3470b25m53M00P44J34l56n05k55J74N43L93k34m50o65L45O15M01j11p49m66J70
3490e50P27N39l29m35o77K20N81N00k11m44l63L1L51Q07j63m81k63l82N06N36
3510E00R1n23m88j5K97M38L67o19m60N8J95M25L89m14o42j95K11P55J22k38o34
$$ y = [84, -278, -301, 16, 181, 425, 226, -148, -302, -204, 232, 499, 377, -169, -291, -149, 166, 196, 476, -225, -582, -333, -88, 215, 544, -50, -364, -286, -66, 411, 438, -217, -510, -456, 85, 344, 591, 184, -637, -362, 64, 313, 511, 193, -345, -461, -122, 239, 590, 220, -253, -483, -149, 193, 352, 206, -250, -755, -338, 372, 466, 327, -353, -669, -471, 61, 320, 442, -119, -633, -320, 66, 762, 488, -172, -480, -636, 254, 522, 509, 63, -575, -594, 195, 481, 499, 55, -592, -680, -146, 402, 403, -118, -456, -537, -102, 581, 378, 20, -420, -642, -192, 517, 695, 239, -225, -678, -278, 466, 600, 244, -261, -516, -342, 201, 594, 360, -90, -755, -410, 205, 606, 495, -254, -720, -550, 177, 716, 387, -48, -725, -505, 76, 576, 365, -79, -442, -411, -60, 747, 584, 103, -160, -542, -36, 500, 591, 68, -420, -435, -138, 300, 667, 48, -412, -354, -159, 266, 655, 241, -401, -596, -385, 370, 492, 254, -380]
3531c80j45J99M64L65j65m75l20J82M88L25l33n08l5l9L42N08j95m72k72p9L51
3552a94Q89k34o11k59L4L02L47L41p33m03K72M5L95M54m62n77O0J84L92L24j84
3573C82m41n15O45J37K25m2o68n9J92K62K06j98k77k8j53M42K92j79l89j70M8
3594b88M52J94j25m76j56L62N2K79J62n19j64O9KN01jk47m92Q1M05l5J25p5m72
3617c66n8M41k42L98qk84k89O04j15J53r2j32j01oJ78J37k65J94k38RJ14L25m3
3640C14k32l10J26j51M52j90j54NK40j09pQ8j03J47j70l4PJ58K1l3p9Q9j39N8
3664fK71k16k14J89M7j54K90Q3l35k7J34l5K2n6o8j04J56J18k25J09N0k64j52
3687c87J65J56M5L21k50k50M5L00m8Q0j82j67J31rK24Q3j84K1l54J81K45j7J03
$$ y = [-380, -525, -326, 138, 503, 338, -137, -457, -275, 213, 538, 205, -303, -338, -377, -35, 473, 278, -194, -466, -545, -194, 695, 461, -150, -409, -375, -73, 274, 615, -118, -521, -249, -204, 191, 645, 183, -394, -334, -150, 242, 566, 382, -59, -574, 71, 208, 433, 391, -277, -336, -144, 118, 324, 126, -151, -179, -332, 110, 402, 223, -166, -336, -288, 164, 358, 233, -243, -399, -37, 15, 294, 456, -63, -227, -158, -156, 345, 344, 97, -395, -314, 91, 56, 181, 106, -366, -424, 17, -225, 173, 165, -119, -408, 196, 81, 234, 142, 10, -91, -97, 81, 218, -47, 147, -91, -82, 32, 357, 314, 82, -228, -102, -253, 199, 9, -145, -140, 100, -9, -16, 72, -31, 116, -54, -88, -81, 77, 98, 65, -14, 75, -64, -6, 265, 49, -165, 24, 71, -83, 207, 290, -45, -72, 62, 27, 49, -7, -75, -179, -23, 95, -130, -21, 29, -235, -387, -222, -66, -21, 300, 50, -200, -155, 145, 97, 177, -5, -172, -41, -50, 174, 257, 73, 94, -260, -79, 166, 149, 252]
3710B52l57l15J91L22K52r2l97j18j5K71K32l8l26j06o4L27L38O9n08j69J1K10
3732c0L23J60m01m40J22J55L94J84m86n19J85L38K11J20k01l59j37K57N34J13
3752E23l09n20p6J83M41J25j32m53l10K09M51M31m50k38k67N3M30L11m1l93l96
3773d28J32M27J97J30n03m98L02N7N31N0m71k98r6L81N51P2m83l89j88O42M88
3794F06r6l44n88j15M71M76j2k23n70j42L48N18J95m55m23k8J09N77K38l13n39
3815c10m86N90M90Q3j51n07j95J90L96N60k42o28k97J08O07L90j07n96k39k09
3835e53O34M54j58j86p83O4N45N63j28n04n42l5N77N10rm17l88o2J98O07N3k46
3857A94m93l80O33L74J28l69m63j77L67L66K52l9o56j38n9M35M63j22n13l52R2
$$ y = [252, -105, -420, -229, 93, 345, 253, -144, -262, -277, -6, 226, 188, -138, -244, -308, 19, 357, 426, -82, -251, -240, -30, 293, 453, 52, -388, -266, -111, 283, 467, -19, -538, -353, -15, 196, 316, 115, -244, -381, -124, 410, 523, 214, -306, -382, -199, 242, 367, 235, -218, -528, -319, 132, 563, 113, -125, -392, -339, 91, 402, 361, -32, -428, -296, 131, 328, 458, -45, -543, -241, -184, 347, 397, -74, -372, -468, -87, 464, 536, 53, -336, -524, 118, 606, 510, 166, -422, -537, -66, 410, 398, 175, -395, -537, -189, 329, 524, 69, -354, -382, -273, 304, 542, 229, -310, -796, -206, 284, 367, 216, -291, -486, -296, 100, 660, 418, -210, -507, -399, 208, 598, 491, -105, -344, -553, 81, 535, 377, 191, -592, -528, 17, 580, 452, -52, -594, -629, -52, 458, 449, 32, -356, -418, -220, 387, 440, 194, -299, -679, -46, 328, 456, 87, -376, -553, -186, 180, 432, 393, -263, -401, -460, -25, 438, 316, -197, -549, -457]
3878d57L84M93j91l51m03J76N50k9J77l64n44J19M82L67J49o57l07O2M07J71J80
3899D14l69l39m5K65L06K15l16n96K58J01J34L03k56l77j24L02K78K45m33j08
3919a42k73K53K89K84kn65j03J01M28j26N8k43j83n4K54K84l6l09k13nL82M1M2
3942A62l00j82J15J56K53K09m26l73K54J52M0J96p2m15P3K01J53l1j28j21j71
3963b55J95Q3J51j56R7k78N9L01p5L9k86K9p9K14K9r7j09J71r3m5K44K7j74j2
3987b0k8J22J13j45mj35rO4p2K26m0j42M8q6Q9j87K70J40k15j5J30p7N9J15m21
4012b20K32m1l3L25l40K64j59k1Q3j8J45l2j09p1j97J28J41l7j27r8K59k4j13
4035f3J5J38k09Qj6j18L37k3k66N0N8L4J75k4M5m17m4L78J5N6l1l84J33J39L14
$$ y = [-457, -73, 420, 229, -122, -525, -349, 201, 172, 349, -15, -559, -440, 42, 409, 558, -99, -406, -344, 63, 234, 414, 45, -294, -339, -74, 232, 447, 131, -465, -207, -106, 28, 331, 75, -302, -426, -124, 154, 399, -34, -142, -415, -162, 127, 411, 409, -156, -259, -158, 270, 144, 202, -41, -224, -278, -24, 260, 224, -85, -298, -303, 79, 120, 162, -138, -320, -205, -49, 204, 413, -13, -386, -132, 20, 60, 256, 184, -231, -158, 43, 196, 165, 37, -84, -255, -60, 23, 174, 18, 115, -163, -104, 197, 122, 161, -125, -96, -175, 39, 68, -29, -138, 33, -60, -105, 139, 166, -8, -20, -48, 74, 187, 42, 38, -97, -106, -42, -114, 112, 72, -70, -22, -108, -19, -206, 64, 204, -11, -26, 104, 27, 86, 201, -220, 12, -29, -62, 263, -77, 187, 28, 7, 90, 72, 217, 185, 76, 5, -192, -64, 77, 40, -87, -185, 74, 50, -63, -48, 90, -119, -111, -127, -245, 92, 69, -197, -147, -89, -55, 120, 96, 141, -276, -320, 58, 73, 129, 98, -286, -153, -14, 300]
4060C00k9l12L2j46R9L91k9m40p6j40L24K69M0l37r7j01J75K75J2O2m77m1Q3L33
4084A70K35j93m08j6L1K50K44j73k65j36J64K53L4j7j82k54L3L39L2L9k88j81
4106b89j03N47O5o6j37m30L38oL48P8m11l26K0L97K37J88k35n51n3L73L33j0k38
4129F9l38k9J71L74K40j53o12j74L45M59k19j2l49k49L74L14l0Ml97m19M33K83
4151H5M80k38n95j44K54K33M40m6o38j66l3L22K39J56m36l71N0M86J04J79m89
4172a28j35j95M64L56nm28j89k73L82N85n7k14o08m8M53L56j02l20j80k13K34
4193b65M95L68m98l98j13J62M94J36l26k67j46O9M01K52j75l70k50K04L65J39
4213B77R7n75o5J29L25K46l52k75j11j10N23J81p3j80k62J0K04L39m3l14k81P6
$$ y = [300, 271, -41, -9, -155, -56, 335, 306, -134, -210, -350, -26, 243, 283, -54, -151, -252, -77, 198, 210, 272, -205, -246, -163, 170, 405, 212, -196, -212, -181, 69, 313, 140, -125, -261, -97, 156, 190, 173, -9, -263, -230, 109, 141, 180, -108, -289, -392, 155, 220, 154, 17, -413, -75, -81, 267, 345, -66, -392, -372, 25, 262, 450, 215, -336, -389, -16, 317, 307, 69, -269, -298, -127, 247, 487, 334, -278, -452, -107, 352, 133, 121, -228, -477, -103, 211, 181, 185, -212, -631, -198, 85, 565, 327, -268, -412, -158, 75, 515, 469, -169, -335, -368, -46, 193, 349, -87, -458, -408, 78, 182, 361, -128, -263, -458, 6, 362, 357, -71, -260, -533, -151, 434, 377, 163, -445, -493, -40, 316, 214, -106, -286, -499, -265, 230, 598, 100, -298, -411, -249, 245, 381, 55, -212, -358, -289, 112, 364, 189, -181, -431, -227, 138, 277, 374, -201, -266, -137, 188, 434, 82, -193, -304, -414, 109, 290, 217, 37, -225, -215, -11, 328, 285, -29, -310, -234]
4235b34K78L53j02m09j74K41K1M31J8l13k07j82K7M61R6k16k31q3J16M16kk6m25
4258a46k29K66M2M25j69k13j85o5L94K61j33l64j47R1K76J85j29j95m8p1Q5L32
4280B63K2m31j0J8O8N78l46k14K6j13K72Q8j15Rl24N6K38k11K61p4k11M3J97L1
4304A21J13p2k25J4q8K41P1j49l3l17M77P5j62J6j02j32j9O8K01l2l6j22J78q9
4328cR8j52m7l2j03K97k3q2N7l6J16j23p9M9J37j38K8N0M9r3l0P2o2KQ6o4N0m4
4356b0k2J18l7L4j63L25j90O5j7j89J3J7J76j93l0j1M6R3J60k45P4m7J01J33k30
4381c9q7J90k07J03Q8K38l44j33J15j08J90J19P1j02k81M1J27J97L0k41j2qn6
4404a09L89J26m58J2k5l9Q7K44p0l06N3QL31m8j88j09j35J20J91J36j17k85N5
$$ y = [-234, 44, 397, 295, -114, -288, -47, -26, 405, 423, 110, -97, -279, -252, 209, 305, 89, -142, -225, -109, 307, 305, 279, -146, -375, -109, -67, 358, 189, -24, -209, -274, 120, 381, 248, -116, -263, -172, 104, 289, 160, -35, -83, -154, -69, 263, 285, -146, -156, -138, -70, 508, 162, -52, -26, -139, 133, 221, 106, 115, -209, -153, 85, -126, 135, 61, -150, -107, 90, 121, 234, 162, -63, -49, -137, 104, 175, 26, -7, -324, 153, 228, 66, 82, -20, -152, -171, -103, 98, 66, 30, -92, 86, -3, 95, -57, -104, -136, -239, 58, 35, -47, 10, -26, 90, -33, -112, -63, 74, -64, -36, 14, 63, -30, -60, 12, -50, -48, 38, -26, 24, -20, -42, 76, 39, 73, -90, 235, 45, 110, 93, -96, -83, -66, 110, -83, -113, -124, -78, 15, 175, -70, 4, -43, 58, 191, -39, -126, 64, -143, -40, 48, 286, -58, -191, -76, -184, 6, 125, 196, 94, -187, -146, -19, 178, 208, -33, -45, -53, -109, 280, 406, -52, -40, -65, -104, -17, 227, 157, -149, -96, -88, 243, 195, 7, -102, -237, -117, 74, 210, 93, -192, -137]
4427a37J25K02J27k24j19k14K16J63K05k25j99k05J58K85r0N0j6l12n1M04K76
4448D19k00k99l16J92L69K68j0m82j97J88J47J35J06m72k09P8J45K82J11k44k31
4469b20qK30J93J04j46n62J51L43J19k8j07k73j22L87J63K09k86l01j34J63K89
4490A64J11l79p6j69N1L33K83k16l26j03O2K47L62pl44l24J43K04J66Q6l38l60
4512d30K2L58L72k6k20m51K2L59L61J4m00l87J16K62K23P7l82N8j39J73K39K34
4534D55l46k52k39L25J96J95k04m06kJ11J77L83k41m02n6L6K67M36k67l36q1M1
4556b10K50K47j8m24k67K48L06J50Pl07n5k11M44J24K1l47j40r1K79K20j29L3
4578A30m10K4J00M57j50q7m11L17k9L08M5k99j51j46L41RJ32k8l92o2L99J58o7
$$ y = [-137, -12, 190, 317, 93, -26, -240, -24, 139, 344, 119, -80, -285, -127, 158, 68, 118, 102, -210, -261, 143, 419, 219, -80, -396, -204, 165, 433, 423, -59, -256, -68, 79, 214, 320, -152, -361, -283, -138, 144, 255, 11, -220, -228, 2, 195, 299, 153, -409, -258, 85, 204, 176, 69, -204, -326, 61, 224, 433, 147, -154, -288, -125, 164, 275, -104, -180, -349, -298, 35, 318, 102, -224, -327, -265, -18, 344, 337, -7, -331, -188, 16, 182, 268, -70, -430, -408, -50, 322, 296, 76, -375, -353, 6, 367, 381, -19, -406, -290, -28, 195, 272, -110, -52, -191, -18, 221, 455, 109, -143, -382, -57, 139, 334, 130, -276, -278, -167, 10, 393, 152, -250, -306, -270, -3, 433, 166, -170, -251, -210, 40, 287, 269, -155, -422, -174, 132, 282, 289, -18, -73, -284, 160, 284, 305, -42, -182, -273, 6, 226, 97, 130, -280, -256, -156, 301, 151, 64, -347, -30, -59, 249, 294, -5, -156, -302, 39, 48, 180, 152, -240, -302, 97, 255, 188]
4601A88j96q2l00L99J90nj39k30j9J33lL36j67j36j00k74N60Lj89RK5r5K28J39
4625B75j45p7m12L31K9R0Rj35k6K1K05J07j84j6j17q8R2M1k5K86l85l0K79o8J38
4650A95j89P4k70J58J75q8O9p9k11K55l8j2L9j01j0KJ44J8m9j50J13L1N9j59Q9
4675F5j16J56o5RN0j75l4J71j32Q6m7N5J97j96j19K13j4N4j50nL3P9r5j45P9K15
4701A69o8j88O7j35J90n5N1m9k9k6J73j74l4J18j79J54P2j56J22p2l4J13l8p6
4725h4J91J39k4l28L0K14j11J0J09k57Q3L6J39q0q6k6L0k5J94K9j82q4j03J69
4749a7J65M7k62J53k37Q0J38J40k10j72r3J81J52J62r2m00M3O7K98r0J1j4l49
4772b99J28L76p0J39k83j06J75J35m1r0l16KP7M00P3l63J7j83J95O1K43j70r9
$$ y = [188, -8, -90, -390, 9, 199, 194, 55, -175, -194, -61, -64, 272, 105, -31, -131, -405, 155, 158, -31, -22, 3, -92, 136, 275, 130, 53, -359, -28, 1, 91, 100, -35, -61, -40, 165, 272, 88, 72, -45, -133, -41, 0, -25, 261, -124, -154, 125, 57, 195, 6, 80, -190, -32, 143, 55, 124, 45, -166, 89, 51, 39, 78, -23, -33, -31, 113, 131, 82, -68, 45, 76, 135, -24, 65, -51, 105, 40, 49, 99, -76, -110, 61, -71, 15, -32, 23, 220, 24, -95, 118, 104, 158, 8, 3, 36, 115, 20, -125, -46, 169, 101, -87, -20, -155, 35, -20, 31, -18, -47, -73, 100, -74, -108, 10, -169, -15, 57, -99, 23, -49, -83, 30, -8, -84, 107, 246, 222, -106, -76, 138, 27, 37, 146, -111, -28, 8, 147, 67, -19, -45, -15, -40, 154, 183, 1, -83, -186, -17, 148, 195, -67, 86, -151, -71, 67, 207, -3, -175, -268, -87, 65, 227, 135, -265, -222, -155, 143, 53, 64, 50, -299, -171, 205, 135, 274, -9, -115, 60, 195, 154, 64, -252, -250, -173, 227, 300, -63, -46, -229, -34, 27, 270, 100, 1]
4795Ak30l5K13K66n7n9k67J1K02L03k72j92L4j74Q1N37o8k95k11j84K71L08J85
4818C68l09j75k23L14Q4J64r6k80O1j51L45L80m27k46K1m9K04K62k2l12j10J4
4840a83K24J73j9j36l13l4K14K72Q7l65j86J71K58O5J1k66k42P1K00L28k40j86
4862i6q1j99L67J32J79k52k34j15K75J45J37k18j64p5N0L46J70j44l82j00M8L01
4884I0P7R7m78j4L9K85J69j74k07o6j3J57L46k01j69j18NK19J07j06L9k83J30
4907f9Q9J39j0k67l3o9K54J06R9j85l28J87J16M2N3j07j81p7K62K42l3r0l13m2
4931b15J55Q6P4j5j99q6K45Q2M7j53L7k71J03J60J22j33k35K4j05L66o5J21j00
4954D5j16RK45l5K8k52l8k3K60L5j63M0j70p4K53N4N0j33k43J08K12l8j44J29
$$ y = [1, -229, -264, -51, 215, 158, 99, -168, -157, 45, 348, 76, -116, -82, -256, -175, 362, 294, -1, -212, -396, -125, 183, 368, 59, -116, -339, -25, 59, 223, 127, -153, -92, -243, 102, 482, 55, -191, -170, -219, -15, 247, 225, -87, -197, -183, 41, 214, 195, 59, -254, -288, -74, 198, 285, -80, -266, -95, 163, 228, 239, -27, -269, -198, 2, 330, 90, -96, -177, -376, -9, 123, 302, 50, -184, -299, -24, 121, 258, 40, -124, -199, -149, 197, 367, 223, -159, -259, -211, 90, 167, 264, -214, -228, -189, 96, 265, 91, -116, -182, -195, -38, 308, 107, -62, -180, -175, 44, 151, 45, 84, -199, -69, 20, 159, 149, -118, -151, -220, 34, 140, 239, 54, -274, -87, 29, 71, 124, 17, -164, -241, 21, 263, 230, 140, -173, -215, -60, 26, 100, 85, -114, -200, 45, 127, 174, 21, 58, -213, -110, 50, 172, 39, -196, -172, -277, 89, 24, 145, 45, -71, -62, 183, 148, 176, -76, -114, -137, 123, 158, -5, 35, -135, -209, 44, 98, 148, 15, -228, -120, 92, 54, -90, 39]
4978C9k92J16K2J74j1m4j47J38L1O6k7j86J30m3J53j26k4R6j14L4pP8j04J04R3
5003A49k24J12J04k14K33l12K50k33J59M7Kj04j53J15K88k18O8p2j09j4J25P1
5025G0l4j01N1j3J0K4J6j50J96j25j04K22j72J84K1P5p9j16o0J15Mo7P7o6p2L1
5051f3l3M45k90J0j65j74L16N0j9j68O6k26K21NP8o5k9M9k2R8J30k29J17j20R1
5076G3j2J0J89j01j88N0J63k05P9j36N1O9j59K15O6l53K64l74L45j33J07p8r5
5099a53J1J48J46L0l22P0J18r5R9j8j50j11K03OR0R4k16k42J45J20P1k9n4j26
5123a65M7K27p5J02k10o5J06R2m9N2j59L2K7J12N9K3j34m3m0J32L2R2Mk25l9r3
5149a58K57J94k92j46r4K73J35l8N6k29q9N9J92O7j51l4r0J10J72j24j25M6o7
$$ y = [39, -253, -137, -115, 59, 48, 4, -143, -5, 26, 92, 65, -121, 9, -34, 119, -7, -31, 65, -49, -15, -22, 56, -48, 56, 149, -75, 37, 141, -73, 160, -152, 98, -135, 24, 71, 73, -31, -184, -69, 219, 1, 69, -3, -112, -126, -1, 70, 36, -65, -14, -27, -17, 7, 23, -127, 69, -56, -160, 62, -110, 74, 95, 170, 91, -25, -85, 30, 34, -33, 44, -22, -94, -63, -96, 349, 59, 69, -96, -270, 46, 96, 77, -91, -25, -251, -30, -25, 53, -12, -41, 8, -14, 84, 214, -15, 102, -18, 73, 61, 71, 260, 159, -29, 21, 184, -21, 58, -78, -27, 42, -117, 98, 164, -189, 75, -299, 46, -87, 20, -58, -153, -142, 6, 152, 182, -140, -70, 48, -47, 52, 34, -116, -227, -24, -18, 72, 166, -50, -292, -147, -27, 44, 15, -39, -165, -118, 109, 34, 136, -74, -139, -33, 59, 10, 62, -97, -65, -38, 74, 133, 156, 22, -21, -61, 71, 103, 195, 199, -26, -65, -158, 99, 293, 1, -145, -239, 34, 169, 131, 187, -42, -131, -72, 120, 187, 36, 2, -88, 22, 194, 70, -55, -9, -76]
5172g6o3L30p5j55Q4k33K0J84J51j42O2r4k81J97K36n8J6j88r1J74J32j21lj21
5196a15K0P4J56P6j10j97LJ5K70l41J40M2k64K58J36K9j83J2n0Q6J02M0j80O6
5220H5j82k3K08M0j31k34J44J8R3J50m2j10J9j00J90o2k1k10n5O5M0L35j80j21
5244h4R4n9j88L92k37P2r0p3R7K09M0J3j90o2J23J20r9k1j73n7R6K03L9k10m1
5269h6k8K2J02J48j54j80n1L01k1Mj16j2Q3J44m7R3j9k42p1J95O4L2j50ok73K26
5295d2P0J01jk2j59L5J0O7J11k54k3J44n0J19j7k91J76j12J0J08O8p9N5k22J30
5320f8O8J33m8j71J54o4J06k4k90Q4M0J9J1J37p9Pk6q6J47p5j50K20j24L3J28
5345H2R6p4r1m4j06R1m1l5pJ5m7J62k21J12Nj06K38l8j41J54j99P9R8N3NJo6Q2
$$ y = [-76, -139, 191, 116, -39, 45, -188, -168, 16, 167, 25, 87, -7, -288, -91, 145, 87, 103, -85, -176, -2, 130, 9, 6, -115, -95, -21, 135, 211, 101, -96, -93, -78, 192, -149, -9, 33, -231, 27, 163, 192, 9, 21, -29, 57, 159, 199, 19, 85, -97, -120, 88, 128, -3, -237, -93, -75, 18, 168, 126, 16, 35, -65, 125, 63, 42, -168, -223, -158, -118, 217, 37, -84, 10, -49, -237, 155, -82, -10, -100, -173, -76, 133, 173, 186, -4, -66, 57, 177, 78, 57, -116, -173, -77, 126, 165, -45, -86, -114, -92, 10, 158, 4, -176, -227, 74, 53, 57, -59, -71, 12, 156, 109, 202, 183, -59, -130, 65, 129, 161, 11, 5, -268, -42, 28, 129, 128, 106, -53, -18, -8, 59, 170, -84, -107, 37, -13, 106, 89, -202, -26, -138, -128, -20, 48, -31, 24, -198, -68, 0, 133, 85, -86, 68, 4, 110, 86, -204, -120, -80, -61, -50, 87, 8, 15, -11, -97, 50, -25, -175, 45, -79, -46, 82, 178, 104, 13, -31, -137, -46, -87, -122, -129, -114, -161, 1, -220, -108, -103, -209, 29, -9, -150, 4, -195, -116, -18, 35, 40, 41, -25, 57]
5373E7lmo2n8J12k34K59k6J4JJ00k23J42k3L6j4r3Q3j54J72J0j33M0lO4q2J94
5400A72n6j81R2l8P7qJ1j40J43R3k3j77k0J16k28K82p8k9P7k5j71O0J10j51Q7
5425eq0j03J99J65k06j17K26j49N7L8k7j29J1J0J90Lp4M7j58j0K67r8Pj03k68
5450c07L20j12J86Jj17L9j6k1Q0J48k19p3j10K59PJ13k35K7r7J41N4k9k1p0j42
5475a94J46N5K8j0j47PN5O9m9O1k12J30m0Q6Q9k31L10l83J59J06L0L7k19n5K6
5500a46J26J62n0k80K9l8K88j7N4j80j43M5K04R0j06oq3k0J04j8J65k40L9Q9J0
5525G8P2Q5k38j62J80m0L34l14k8P3j87L45j15j15KJ32k32M5N4n2M1l8N8K5R6
5550I9o5j43K5j58J21J95Q7j09j64m1K17j9Q2l5j52o5p5J50K26j28j69n8L6J17
$$ y = [57, 54, 50, -12, -70, 42, -192, 67, 41, 55, 56, 156, -67, 75, 52, 88, 74, -19, 64, -90, 82, 92, -41, -1, -4, 60, -22, 172, 116, -65, 27, -11, 66, 58, 69, -71, 72, 165, 142, -35, -55, 61, -167, 115, 37, 8, 85, 60, -111, -51, 59, -92, -5, -85, -188, 11, 176, -30, -147, 79, -70, -13, 25, -2, -131, -120, -110, 80, 83, 9, 56, -102, -112, 155, 57, 64, -39, -307, 13, -99, 87, 88, -29, 10, -6, -27, 53, 201, -18, -91, -201, 58, 65, 178, -57, -30, -127, 14, 68, 39, 18, -52, -194, -48, 7, 35, 25, -122, -115, -60, 9, -40, 21, -191, -61, -101, -15, 74, -157, 153, -230, -71, 35, 65, 102, -117, -172, -146, -20, 142, 92, -188, -159, -197, 91, 74, 128, -52, -195, -150, 54, 144, 38, 32, -51, -71, 33, 15, 180, -60, -21, 68, 78, 150, 235, -3, -165, 15, -25, 309, -5, -33, 40, -147, 198, 83, -32, -30, 102, -130, -85, -31, -83, -42, -80, -22, 3, 99, 34, -109, -84, -242, -121, 74, 161, 52, -112, -153, 64, 45, 127, 92, -60, -125, -200, -50, 176, 48, -121, -179, -143, -26]
5574b6K01j66j54J20j3O4J13q8k36q7K12J8K47Nk17J9r4l1L46p6j83j34K6J7J70
5599E3q4K68k47j61J77j38J61Nj2l5j76J15K02l0j98k8J62r2J34n5q5j30K21j5
5623A2J60j39o1j97L40j04N7r8j46M8N3K08o6J22j33P3j13Q3R5j39j16j45J85
5646b1MK30j98l2j44J26J21l15K57J17k82K95o0J3L4k94J33KRn0KJ27K8j57N1
5671dR1p9j63J09JJ8M5K71k29j03J64k38OK94k42j31R2L6J74n8o8N7k99M1J1K19
5697A5K2K8j00M0n7K13j82J24j46j0K34j43O3r2Mj29Q0P1J6o1j40N4j51J28N2
5722f7o2l8K25l5N3mk27J58J00k40J36jo9J81j34O5j48J8L4m7J8j2J96p1L9j76
5748a08L32j22J3j4k48J86O9J8j35rj65L09j19rJ59j99J9n1J5K75j82j96K33j58
$$ y = [-26, 175, 9, -145, -25, -38, 26, 139, 51, -185, -272, -60, -42, 205, 210, -7, 12, -82, -113, 233, 157, -26, -160, -134, -117, 53, -31, 237, -10, -171, 6, -132, 29, 34, 22, -13, -189, -74, 128, 98, -100, -128, 34, -58, 76, 21, -64, -194, 27, 12, 172, 33, -28, -225, 115, 11, 68, -30, -176, -128, -75, 133, 67, 189, 56, 129, 16, 99, 194, 55, -61, -206, -21, -17, 213, 15, -17, -161, -35, 86, -229, 28, 145, -137, 158, 98, 111, 145, -149, -16, -14, -5, -55, -53, 74, 102, -55, -4, 87, 8, -155, -46, -45, -27, 18, 289, 60, -43, 121, -117, -111, 183, -59, -190, -98, -62, 112, 54, -14, 43, -256, -215, -204, 15, 37, 65, -35, 5, -52, 161, -21, 103, -43, -53, 181, 38, 101, 9, 13, -116, -36, 35, 51, -10, -150, -96, -247, -119, -67, -129, -167, 58, 23, 76, 72, -155, 3, 103, -137, -1, -2, -71, 110, -24, 41, -107, -89, -55, -102, -84, -96, 100, 29, 68, -108, 224, 102, 115, 101, -147, 39, 108, 126, -9, -18, -183, 126, 7, -2, 157, -42, -23, -74, -59, 216, 34, -162, 71, -87]
5772h7Q4J90j49k6nm7o1J89Q4j92j4M2m0J11q6J46k39J44n3K5J95k22L7j25R0
5797iP3r2K8J14k30K01j4K6r1j31K3O1J88j57K5r2O8N0OO0r8O9j36K2J61j53p4
5824a02J79j52K3Q0J91k74J54jj72L7O7K0j18kK3J24N2j87p0K11j61M7Pk0J38
5849I4J4j59q2J71J07l34Q6LK7J76j01J93j94r0m5J44p6K13pm06L62r6p3R8j30
5874a05K25l2n2Q4r8k6j6N4j10N9J51q5k27J20K28r8j10P7k08L07k15M5J23n4
5898C7j87J30OJ17r1L2j45K30j3q6q4J50r3j40Q2P4n1Q5kN1k77K71j79O4l2r1
5924a42J26O1L7J9j21k5L8J82r4o4r1j1K7J44n3L1p1J3J13j87M71m72Q2p8R9J08
5950A42q3N4j73k6j80M10k46J4L9K3j38K19J11j19k17J39L6o4J96k38Ln4j8L21
$$ y = [-87, -3, 187, 38, 12, 7, -40, -101, 88, 172, -20, -34, 8, -32, 79, -7, 139, -100, 44, -9, 16, 211, -11, 26, -99, -9, 64, -28, 0, 114, -116, 85, 71, 97, 6, -125, -102, -41, 147, -10, 15, -77, -9, 41, 47, 107, 9, 78, -58, -36, 125, -28, -102, 77, -75, -52, 28, 219, -55, 99, 98, -74, -37, 30, 50, -68, -70, -47, 77, 129, -58, -128, 83, -78, -31, -24, -44, 94, 108, -51, -133, 38, 145, -189, -103, -100, -73, 103, 2, 195, 1, -89, -134, 10, -66, 147, 140, -266, 96, 0, -73, 25, -105, 120, 88, 36, 120, 22, -4, -20, 34, -76, -17, 134, 49, -178, -58, 170, 72, -38, 39, -169, 138, -77, -32, 91, 37, -150, -20, -14, 103, 12, 44, -101, 129, 116, 30, -54, 96, 3, -137, -55, 19, -32, 53, 51, 102, -175, 96, -83, -19, -51, -142, -16, 45, 82, 101, -20, -45, -7, 175, 81, 17, -74, -85, -58, 86, 33, 64, -7, 6, 119, -68, 403, -69, 13, -65, 34, 142, 59, 113, -60, -86, -266, 144, -102, -88, -49, -26, -164, 55, 166, 47, -170, -31, 5, -59, 137, -101, -98, -152, -170, 151]
5974A51J6r3j69L3o2J54m8J81n1l14K8K63p6k3m7p6K47j14J44j1jm8q4P5n3p5
6000e3O1l5r4P0M7P7j19n8J7K28o1r9k03J77O4j13P6Q5r1M5j79J45L5j01K87j46
6026F2j37J4O0L4q2J1j46K81k57M02r8j25m0O9M6o9j23J98j29J0J45r7j50j9L08
6051A68k11J32p1J26j35j1J3k3J73j76j5K54l15J07J73j80j66j30J79K05j43J96
6073A50k33p7J61o5J34j24P8l6k6M4P4j63k1k5J06m2J90j96K36j9q9J19l35J66
6097Gj3Qp3LN2q0K10k42M6J87j98J77q8j18J73o1P6p0m9J56j1j13K30k37J04r7
6123b1K0j5j5J0o1p2J28J26K2J2j98j42K50j73O4J46j84J66j16J31j32M4O5m0
6147A5L9l14J76J64k15J52J29j07j32K15j36j3N6r2K03k56K14p6R8j12m0m6J88
$$ y = [151, 167, 74, -95, -62, -124, 30, -18, 163, 112, -202, -174, 89, 13, -10, -57, -133, 114, 0, 144, 133, 132, 84, 0, 75, 22, -53, 8, -27, -121, -51, -4, 73, -46, -104, -87, 141, 80, -19, -222, -45, 19, -94, -18, 67, -24, 21, -158, -13, 22, -79, 208, 62, -75, -61, -1, 33, -49, -38, -184, 97, -160, 242, 144, 19, -21, 48, 94, 25, -98, 100, -29, -19, 126, 29, -121, -140, 168, -43, 89, 18, 144, 9, -2, 11, -12, 161, -15, -30, 224, -91, 16, 189, 9, -157, -287, -108, 97, -46, 150, -83, -160, 1, -64, 70, -54, 24, -12, -38, 6, 80, -83, -104, -129, -23, -65, 125, -71, 165, 146, 57, 176, -159, 7, -6, 2, -71, -68, -16, -96, 114, -128, -82, 105, -93, 84, -4, -122, 51, -10, 66, -4, -53, 103, 92, -21, 209, -28, 76, -21, -1, -16, -31, -21, -82, -154, -26, 100, 122, 134, -64, -206, 44, -129, -65, 81, -103, 63, -53, 78, -54, -10, 55, 15, 54, -260, -84, 80, -135, 17, 146, 39, -93, 122, -14, -27, 29, -63, 140, -116, 98, 22, 120, 8, -32, -78, 110]
6170A10j6j02J20j03j66lJ35K5j28L6J9K02r9j53J41n5q2p1K00q9J36Lo2j77J46
6195c3M5q5J96j76R8j13k3J58k2l9l9kJ79j33j5J30r0J44k86M2l0%m3J55m5m1
6221f8Q3K2P7m3k75J50K48j65rj9m4m2M8l4p5J39ok2J6L4K8j18L9m3J40n0j3K6
6249B4oj3M1m3R7j60M1j2L3l0l1O3j10j3J01m0R4J32j35k33O7p3O3PJ24P%J40
6277A35j83M5j9K1N8k2j49J95j11P2n4Q0j27J39n8j13K02m1p5M4nj48J99j19L6
6302Bj09J09n4pn2l1K50l8j88M4O7N8l9j86K69m3j9P8j55o0PJ00k3J4j5j06J74
6329D7j00J4j45K31p0O3P6k25J09L8l0l2po8J83j28J01m1j10K37j20KL2qj85J06
6355c0l6j2p1J73N6j22R2j28p1J8K36k4n8m2P3j52N4J00M6j96Lm3J54j46R2J8
$$ y = [110, 94, -8, 112, 9, -157, -160, -25, 0, -128, -92, -73, 129, 30, -123, 18, -37, -119, -190, 10, -79, 57, 60, -2, -179, -33, 12, -73, 123, -53, 45, -68, -91, 67, 45, 6, -33, -35, 144, 11, -4, 126, 36, 180, -106, -64, -94, -94, -137, 18, -27, -68, 15, 37, 114, 71, -204, -54, 194, 29, 20, 1, -43, -85, -37, -71, -146, -7, -13, -35, -19, 15, 43, -75, -36, -79, 61, 11, -2, 24, 18, 5, 46, 3, 100, -60, -19, -31, 2, -28, -59, 4, -106, -119, -18, -58, 36, 168, 33, -200, -133, -206, -143, -136, -12, -5, -5, 135, -48, -3, -22, -1, 57, 35, -114, 81, -30, 42, -12, 68, -59, 80, 22, -91, 111, 70, -5, 39, 34, -114, 85, -34, 2, -107, 2, -52, -59, -111, -142, 108, 70, -118, -74, -7, 51, 12, -174, 95, 52, 33, 111, -44, -104, -97, 3, -20, -6, -21, -127, 47, -53, -39, -184, 47, -23, 40, 116, -109, 0, 38, 8, -24, -31, -99, 84, -44, 57, 16, -94, 143, 23, 25, 57, 49, -136, -30, -66, -78, -149, 24, 80, -42, 50, -78, -149, -131, 105, 81, 23, -19, 54, -98, -44, 56, 102, -94, -91, -134, 20, -126, -34, -16]
6381a6J8j57Q4R2j33M3K5J01k43Q6J6rM9J22n2j3P4l4j25K3m6o3K39j20J72j20
6407A3q8R6P1k1j16P4KP1j85M3P2j0m6j08J06J04J46j68l7R3k27J08M5j14J06
6432C0M4j48O0N5k70J44rj6n8LJ26r1K32j38J56O0j80n7O4R0J3p2N7k75K89k38
6458a29J34k1P3Rl29L32M4l8L5k3K7j84p2J73J32l4j64k3oM3K26l28p9K20K7K4
6484F9j49J14p7O5nq5J75o1q3P2o9n4L4N8n6K8pJ7%%L7k13J59M2K8lp2r2N9L0
6514c9Q3j86M6O1n4O8L0ML9j16J4QO4r3J20j38J17%l2k9N5j84J4K43k06L4J42
6541F5N6j91L2K57j82Q1Oj08j30P1N7Q1k9J52j98R0%j31K26q0k01J6J30j50J61
6566H1r4J41j19M5K4r9mJ8mm7Q4k46K35K6j09J61r5q1J11J2k0j24Q2J14PO3j01
$$ y = [-16, 2, -155, -71, 21, -112, -69, -44, 57, -186, -100, -84, -93, -44, 78, 26, 13, 87, 53, -72, -49, -95, -158, 81, -39, 133, 13, -75, 21, 92, 71, -45, 29, 31, 102, -83, -40, 32, 22, -24, -132, -26, 78, 224, 56, 19, 112, -115, -7, 38, -76, 30, 74, -74, -14, 41, -229, -85, -94, -110, -168, -165, -39, -130, 102, -36, 120, 180, 0, -57, 7, 97, 110, 38, 95, -180, 109, -129, 5, -16, 57, 66, -263, 69, 113, 75, 110, 87, 114, -70, -142, 31, 163, 129, -35, -58, -64, -21, 205, -123, -202, 18, 45, 69, -80, 34, -43, 22, 17, -68, 107, 46, -37, 35, -34, -88, -54, 4, -52, -24, -31, -14, -14, -14, 23, -190, -31, 11, 39, 36, -36, -128, -69, -39, 44, -142, -96, -35, -89, -21, 9, 13, 52, -64, -50, -42, 22, -71, 49, -89, 28, 28, -4, -33, 22, -162, -148, 95, -111, -77, 65, 121, -70, -38, 219, 37, 118, 124, 16, -114, -43, 14, 95, 66, 218, 20, 110, 110, -21, 205, 125, -76, -60, 70, -80, 81, -13, 128, 9, 54, 78, -21, -25, -7, -11, -58, 26, -220, 15, 41, -68, 93, -2, -83, 28, 40, 20, -104, -22, 92, 99, 162, 61]
6593F1J16j43j30J12K4J5o3L1j2J48j60%qp2M1K2J23l3qj52O5M1J8pO9q3N0N8
6621A23Ml89K97j01%nj3Q5r8J28q6J96j67j59K07o5j4ML4J12j27N6o9J22j44R5
6647B6K23k52j18K69mk04oJ39j29k0N3j1m1J29p7O8j9q7k1j4J75j1k25J10L9r
6673a7O1j48k2K07o2l7K8J9J76j64p4M5m0N2R0j94p7O5q8J67K8R8j34l1J43Q3
6699A74j83O5k44K59m5j18L0k4J17J25N1k56n2OJ53L3j22j42K28o4P7j32J83j7
6723A02j26O0p3J25k27J87J01l6K3m7j9p7m3Q9K47j47q9j18J29l6j62Q0Q2Mp0
6748d1N8n7Q7j22L9N4R2j5j15J19j77L5J3K21q4pk10M0qJ20j14L42l20J19k7j29
6774h7J16j32J80j68J49J01k24J25l5j27L7J84p2j00j01P5l0M9J90NR3k62m8R7
$$ y = [61, 177, 34, -96, 16, 40, 55, -8, 23, 11, 159, -1, -1, -9, -81, -40, -18, 105, 72, 64, -88, -23, 18, 36, 29, 98, 15, 65, 123, 127, -262, 35, -66, -66, -71, -84, 1, -97, 31, -55, 141, -26, -185, 22, -43, -57, -53, -19, 93, -34, 22, -47, 75, -69, 26, 249, -3, -121, 148, 144, -60, -66, 73, -56, -76, -23, -34, -75, 54, -23, 45, 26, -61, -82, -96, 79, 68, -157, -47, -8, -17, 44, -104, -126, 81, 19, -18, 10, 29, 205, 41, -33, 12, -28, 24, 114, -80, -157, -92, -180, -13, 15, 113, -21, -52, 91, 174, -9, 56, -188, 71, 26, -92, -62, -86, 31, 156, 207, -49, -101, -95, 58, 91, -31, -173, 55, -9, 68, -64, 119, 102, -24, 36, -37, 88, -139, 48, 149, 113, 136, 89, 70, -7, -50, 39, 286, 139, 50, -68, 61, 25, -137, -57, 25, 29, -41, 17, -40, 47, -75, -36, 18, 110, 95, -20, 99, -78, -43, -30, 191, 107, 100, -110, -70, -78, 42, -72, 270, -50, 69, 42, -87, 29, -103, 77, -91, 58, 159, -65, 60, 25, -102, -65, 119, 47, -53, -154, -79, -109, -60, 130, 135, 228, -34, -82, 15]
6798A5j13J66o2k40O7n2K10j6J5J6RR6m2m4K6j86J70j52J90l9o3r2J75j88R8l8
6824g4K3J08q2j88J33O7J61jk09O3n1LK6N1o1R7O4p5q2l5J14m7j39L49j36j66
6850h7L1j3l6M8N8k3M2n1Q2J1N8j41k4l0j2J37J1j17J47j33J46j68J04o6K32j29
6876G7J20j94k00K21l0Oq1j6Q5J74j4p8j62J08Jj0jN3m7k2R5q4r7J21r4M6M2M7
6904F6k22M6N3RR3%J7j11Q0j40J42p5K28j22k05J62m7j69K90q5P8Rl13J82LJ43
6930A12n4j09P7J03j18p3j2R4P5j08o9L3n5N4p7L9K19q0l2K6n2n0QJ26qm4m1j8
6958c4j32K28P5K6k31r0K9J82J96l68P2RR6k5L9j51Q3K5j01J44k06nJ25k5J34
6983I5M3n0p8j15Q2j78M04l85J62o8J12O6j5k7q9o2K8J0O6J5j40J10p7J23J7K2
$$ y = [15, -98, 68, 6, -234, -167, -219, -9, -25, -10, 6, 15, 111, 69, 25, 51, -135, 35, -117, 73, 34, -29, -121, 54, -134, -36, -74, -51, 57, -25, -213, -80, -13, 148, 147, -62, 1, -50, -47, -21, 30, -31, 66, 130, 55, -27, -62, 52, 5, -134, 215, 79, -87, -56, -69, -105, -57, 1, -22, 20, -31, 51, 62, 120, -21, -45, -75, -87, 50, 61, -56, 91, -42, 104, -64, 40, -26, 206, 77, 197, 3, -197, 24, -6, 0, -81, -97, -12, 162, 148, 70, -92, 16, 17, 7, 6, 59, 12, -10, 85, 1, -96, 25, -69, -23, 19, 66, -156, -110, -57, -48, 45, 45, 62, -49, 31, -109, 33, -42, 186, 64, -141, 21, -26, -195, 95, 10, 88, 97, -216, -34, -31, 112, 58, -51, 26, 129, 11, -62, -74, 20, 95, -13, -82, -49, -104, -50, -127, -88, 131, 51, 19, 45, -7, -57, -49, 77, 69, 25, -16, -34, -166, 62, 137, 163, -68, -158, -129, 53, 249, -119, -47, -38, 58, 33, 72, -79, 4, 29, -72, 72, -134, -139, -14, -39, 95, 138, 88, 10, -105, -23, -201, 203, -182, -20, -88, 24, 90, 75, 48, -41, -103, -75, -65, 1, 16, -124, -14, -91, 32, 49, 71]
7009G1O6k21J04m8J78k31P3k7J27k17k8J52n1L0o9n5l2K89r5p5j43R3K86k08o0
7034i1N2l0j3K39j89J35l0j07Q9j65oJ32q6k7J70j07J00k6o9n8J13P6k53J35Q5
7059F9K1l1j20QM0k18L69k07k7k2J28O6Pk2K9k34L03j61K5m4R8j92J01R7JL8j26
7086dmJ88j08r3L7q8J23j16J05r2J09N5q1j82r1K61k6J99p4K1L4j66P1Mk28J72
7112B6J76k44Q0j31Q3K4j3k7j27R4J13J0K7j1N2j56J84k70K14k9j59J31r8J1R7
7137E7P4j75K4q9N1O8M9o5M7l8o1k4R8P3l2p9j1J07n3Q9j45J49k54J07P6o3J17
7164I7j62OL1r5K18M6k99K01j39M4J72j40J08P9k27l5J98L4k91J97j61J93j25
7187e0q6K64k29R5m9j1O6o7M9j1R2P3j83J72j38N5j52J25Np6J35j53P8q7J69m9
$$ y = [71, 137, -84, 20, -28, 150, -81, -8, -35, 92, -125, -153, -1, -52, -22, -91, -146, -178, 111, 16, -59, -202, -109, 177, -31, -91, -39, -69, -82, 157, -32, 103, 73, -34, 55, -110, -116, 16, -70, -97, 73, -34, 66, 40, -29, -87, 26, 102, -151, -16, 69, 90, 59, -61, -53, -13, -231, 138, -69, -96, -118, 10, 76, 83, 61, 90, -144, 159, -2, 23, -21, 77, -115, -14, 83, 84, 122, -4, -8, 180, 72, -21, 16, -72, 51, -65, 40, -52, 57, 112, 31, -151, -242, 19, -7, 192, 118, 139, 173, 7, 78, 82, -146, 26, 202, -42, 38, -93, -10, 14, 1, -26, -153, -59, 54, 64, 91, 80, 132, -24, 160, -110, 104, 75, -84, 47, -51, -40, 57, 131, -44, -20, -109, -58, 10, 59, -6, 41, 3, -58, -82, 16, 89, 57, -22, -33, 74, 21, 110, -35, 114, -140, -33, 43, -20, 97, -65, -59, -28, -123, 95, 141, -158, 43, -96, -52, 120, -20, 88, 167, -60, -95, 103, 137, -154, 43, -118, 75, -50, -136, 128, -101, -6, -55, -66, 0, -67, -18, -29, 63, 136, -47, 125, -13, 42, -110, 15, 20, -56, 79, -74, 4, -83, 86, 37]
7213C7p9Q1M9l8P9k17J6Q8K4j01L0P6N8j27j52K40j13j61P7O9M2k6J64k23k3K41
7239A11j52J31n7k4J38k01J01j57K54j30M8Lj11J09j21K26k95N7N8J9K9m6L0j1
7263IJ00j59N6o7M4kk1n8R2K4j05R2k1Q7Jq3P5L3j09Q7j22J35j26M0K2n2l6O1
7291cPJ28j74K29k58J26r6Q5j56R9j16l4K04lj22Q9k9l5J74p9R4qj36J1N4o8O4
7318D7p3j6l5k8Q9K3P9J6j97j05N4K43j30j9j4M7J31j9oO6j86N9K07k46r9J24
7344A2o5L3j97K19J8J89k85J59l6l2l3j6J14n9p8K28l61J83Qm0J14j44J23r5J19
7369G8j0n5J32j48M7M3j72lO1J39j03P8k36kJ17r4J88j3M2kj59N3K6o7l0k7K09
7396I2l3l03J32Q9P8m4L5k15K96j17o4J76k6j06Pj5j0P9pN2r9L6J8L1r8j3k6R
$$ y = [37, -42, 39, 88, 50, 129, -88, -72, 16, 40, -61, -31, 45, 103, -24, -176, 64, -49, -210, -133, -64, -22, -48, 116, -107, -130, 111, -41, 90, 33, 9, 147, -54, 47, -110, 144, 14, 62, 65, -46, 63, -58, 168, -127, -70, -12, 7, 36, -10, 20, 9, 109, -50, 6, -61, -17, -19, -40, -98, -6, 18, -87, 5, -16, 71, 72, -11, 64, 97, -12, 75, -47, 88, -38, 2, 24, -28, -64, -3, 4, 132, -42, 187, -71, 55, -41, 44, -112, -13, -129, -163, 41, 38, -84, 5, -24, -59, 115, 36, 130, 122, -14, -3, 51, -17, 47, -26, -42, -77, -105, -16, 7, 86, 102, -95, -200, -146, 97, -33, -52, -66, -19, 112, 93, 87, 153, -33, 26, 233, -13, -112, 12, -53, -20, -217, 2, 20, 209, -76, 83, 47, 15, -18, -34, 80, 21, -57, 171, -190, -7, 1, -39, 75, -69, 54, -41, 78, 68, 13, 145, -3, 44, 87, -85, -88, -27, 112, 9, 87, -149, -151, -34, -128, 60, 47, 89, 87, -72, -19, 7, -60, -90, -117, 92, 59, -244, -112, -23, 55, 11, 46, -169, 127, 10, -54, 122, 96, -10, -3, -18, -28, 51, 44, 96, -3, 33, 51, 82, -16, -29, -55, -46]
7424d6M7J38j60j1L6%Q4l0j03o0Q8K01l34K74j18R9l5j22k4K09k33oJ71n2p8P4
7450Ir8O1L6J79k42P1r8J73O0j48Q5n1m5j07J8J13q4j2n1J04n0L0J29k51K6K9
7476a14k3K41j96J67j57Q6K7N1j5o8Pm1j7R6J4j02J20q5R9o3J2j36J09p9O4r8
7502a01l1J6J81k49j1K62j3j25Q0j6Rn5O4k7n7M1R4j48k5J32Qr4K41k66J28lm9
7529a4J09j97J44J19j63r2K90k11q9J89q5O1j55n3K82j34P7j16l5J92o4J0M5j27
7553a7q3J3J06M2j9j22o4J86l7k9%R2j05j46J07K0K8l9m2rR2r0rj5K42j22pj29
7581a56K59j9ko4oj63J34J57k70M3P3O2j6r6l1K34k58J32j3O4P4k19p9O6K94l28
7607a28K65m2j50K02l10K08o8m2j11J05m1K73j65L7q4R8j35Q2J04k77K83l75K60
$$ y = [-46, 1, 139, -21, -32, 4, 4, 88, 58, -45, -105, -17, 184, -150, 124, 6, 105, 70, -52, -76, 133, -100, -106, 65, 13, -65, 9, -89, -28, 8, 187, -55, 16, -82, 91, 151, 3, 88, 37, -8, -115, -97, 16, -68, -80, -131, -27, -77, -47, 82, -169, -143, -114, -137, 104, -92, 75, -82, 4, 31, 82, 67, -1, 6, -35, -52, 44, 58, -44, 76, -9, 90, 27, 39, -97, 12, -67, -3, -101, -132, -116, 65, -184, -195, 67, 54, -71, 9, -7, 2, -53, 11, -16, -73, -32, 62, -86, -111, 21, 29, -65, 176, -90, 38, 35, -14, 95, -102, 42, 161, -2, -94, 196, -15, -104, 85, 0, 61, -94, -147, 135, 1, 78, -38, -73, 119, 55, 65, 110, -17, -100, -87, 19, 61, 42, -80, -144, 42, 5, -24, -24, 68, -37, -183, -76, -56, -28, -67, -109, -118, -26, -116, -125, -140, 102, -20, -27, -156, 103, 84, 82, 18, 12, -151, -17, 140, -130, -87, -14, 48, 32, -64, -95, 139, -119, 13, 0, 64, 138, -81, -160, -94, 200, -128, 137, 95, -55, 147, -163, 45, -23, -65, -176, -71, -112, 161, -4, 33, -51, 47, -88, -6, 98, -179, 104, -271, -11]
7630a1J21j09j91K87j39J8o9O2J16rj20l6Q9R0J36k50K0k4J68j43O9p1J0N7j35
7655f4l2R7q8J5N5J1NO7j73K22j83N7j9m4J94j29n3q7J24O8k8Q2p2k43J50k04
7681b72K64l5Qj0k2p4L00j05m8k28K61j14O4Q2j35j3K6J22j88j45K37Q0j18Q4
7705B1l5k6k7J39J4o2R5m4J18j69n9J64m2K5k80K31p8Q8L7k29K06j70l4J23L5
7730D1J27k75J63p8NLk5R0j88J79o0J5o4l1J06l8n4o6K55j50Q3n6O0k2j38L33
7756B15k40J59j62Q2P8n7k4k16N7J83J18j69N6O3k05L7p2J12J5j53M5Q5P4o8r7
7781h4O3M4lm4j43Q5J12Km2j96K87p4j8K05k77J25j01J69p0j23L8j63J15K02o7
7806D2j1l9r7J22p3R9Ln4N6l4J8r1R9p8j50J77j00J48N8j8j26NJ61k48P6R4m8
$$ y = [-11, 110, 1, -190, 97, -42, -24, -93, -31, 85, 76, -44, -80, 9, 99, 235, -15, 5, -19, 149, 6, 75, 4, 14, 71, -64, -96, 1, -87, -72, -17, -6, -1, 66, -107, 115, -68, -11, -30, -74, 120, -9, -62, -149, -25, 43, 15, 97, 25, -218, -68, -272, -8, -43, -35, -45, -67, -141, 159, 54, 6, -222, 39, -75, -11, 71, -64, -77, -51, 71, -117, -262, -25, 55, -63, 21, -14, -40, -67, 72, 86, 24, 119, 75, 193, 24, -35, 129, 87, 112, -168, 63, -15, 73, 110, -119, 87, -83, -117, 6, 41, 168, -107, 56, -22, -17, -14, -39, 51, -137, 42, -18, -3, -67, -98, 8, -30, -84, -150, 105, -45, 38, -18, 42, 20, -118, 215, -25, 134, -28, 54, 132, 75, 51, -165, -108, 75, 193, 24, 80, 143, -62, -25, -97, 15, 30, -123, -78, 7, 81, 13, -84, -21, 23, 20, -24, -167, -82, 30, 32, -10, -206, 81, 7, -11, 194, -83, 42, -59, 110, 40, -83, -45, -208, -93, 109, 42, 31, -8, -105, 17, -56, 43, 46, -8, 48, 14, 32, -59, 40, -38, -188, -11, -111, 37, 95, 77, -49, -44, 117, -131, -55, 39, -9]
7833ik9J10k00J76lr5R8k15L22j67r1M9K14k00M0k95L27j38J42k3J9K0j82L7P0
7858b3J86j22j61J45m3j27k3K08j31K32o3j52J06m0QJ9l2j06J11PJ32j95J52K9
7882A17j18m7P6l8J34j12J5M1q7L7j7l6n5K29k12k8L7J33m7N1M2j81J35j05O5
7907B9k3J23o4Q7j23M9m2k11K97r8L5o4J4J84n2K8j29r2q0O4L0J82k41P0n1Q3
7933Ej03J61n1k1l0k7k1q5J64K3M0r4J67j92K28k12Q9j66Q3J04k48K40p7m0J85
7958A22k81K47J18j99o8N3j40P6J2j4O6n8Q4j32J47j50j5O3J36j24jN8p7J16l2
7983Gp3O5k13L27j3j50K9K9q6j39K36r9J54j53j00J95n6J07q0Kj3K0r9M6Q8k1
8009A0j1j23j02L03P0j05k04J18M6R1O6o3N1k14Q9P9j10n9P6j2Q3l5Qj02N3M1
$$ y = [-9, -38, 72, -128, 48, 45, -50, 48, -167, 155, -12, -103, -54, 160, -40, 0, -295, 32, -106, 36, 13, 32, 52, -130, -93, -23, 163, 41, -120, 25, -18, -145, -168, 40, -91, 141, 78, -74, 32, -8, 0, 19, -13, -119, -8, -1, 131, -64, 88, 117, -1, -48, 28, -10, 124, 12, 27, 68, -19, 18, 1, -35, -90, 139, -73, -101, -64, 69, 22, 73, 115, -66, 69, -36, 29, 6, 129, 65, 152, 29, 78, 36, -175, 122, 24, 59, -5, 9, 193, 141, 169, 40, -52, -132, -68, -38, 144, -97, -27, -78, 5, -98, 63, 12, -9, -39, -66, -87, -172, -8, 15, 55, -39, 128, -64, 164, -48, 41, -125, -42, 62, -186, 54, -23, -63, 122, -159, 88, 206, 7, -61, -8, -148, -72, -60, -74, -8, -66, 18, -114, 33, -117, -132, -69, 67, -57, -58, 0, -77, 39, 7, -66, -1, -214, 113, 100, -50, -21, 8, -78, -217, 19, -80, 74, -79, -179, 16, -40, 67, -13, -11, -24, -4, -103, -57, 31, 10, -1, -124, -226, 77, 147, 42, -162, -44, 2, 93, 159, 96, 147, -67, 22, 101, -9, -68, 8, -4, 79, 44, 52, -50, 3, 44]
8035D4k7Nn6J23k7j35J29J76j80j20l5Q7k8K3k1J07m8j23m0N5j33J35J59N0M8
8060A68L7q7K8j61M4K9j96O4r0K22Q5Nk95K68mj26Q3J5j98R3R2j61J06o4K32j66
8086B3j55J40j39J25k0j01J04N6j48k1J74J8j48J58P3n2j17N9l8j23K00p0J50
8109A48k34J33j57lL8J58l2O8j46J4j4K2j11J59r4R1J92k71l7l3J05q0j4N9%%
8135c9K4P6m9j96K56n6O0j30o1J61j52L7N2r8l7K33j08n1O4PrR9Kk32K1J23K3
8162B0j42J76j95K52j38j27J38J32q5n8Q1q2J66K4q0k74J3J58j0m1M3j15J87j28
8186h5R2j02J39J48k06
$$ y = [44, 17, 22, -34, 89, 62, -73, 56, 232, 52, -68, -103, -16, -44, -21, -42, 65, 17, -106, -146, -91, -224, -89, 70, 120, 168, 205, 118, 146, -15, 29, 58, -138, -74, -164, 58, 143, 148, -147, 121, 117, -9, 74, 89, -109, -16, 76, -85, 21, -43, 189, 23, -132, 8, -131, -6, -26, -127, -23, 33, -115, -136, 38, 56, -92, 66, 139, 87, -30, 29, -9, -132, 68, -2, 148, -86, 47, -110, -113, -75, 83, 51, 119, -27, -13, -27, -5, -116, 43, -51, 40, 232, -39, -76, -109, -4, -84, -98, -39, -39, -39, -15, 61, 12, -184, 72, 16, 76, -54, -115, 46, -106, -69, -17, -115, -152, 81, -27, -78, -14, -7, -16, 83, 85, -147, -126, -3, 20, -122, 54, -141, 111, -27, -154, -16, 116, 31, -27, 54, -28, 138, 162, 82, -192, -179, -21, -31, -72, -29, -144, 43, -85, 7, -95, 44, 192, -14]
8191a4
$$ Imaginary data points
##PAGE= N=2
##DATA TABLE= (X++(I..I)), XYDATA
0@%%%%%%%%%%Qj6J6j6K4l2M0m8N6p2Q8j04J21j45J76k07K39k73L13l61M16m77
32b54N41o13O94p83Q82r89J105j234J375j529J698j881K082k304K545k806L092
49A621l407L753m134M558n027N548o134O799p560Q436r463J0684j2162J3997j6344
64h835J9471k3868L0545m2006O6948k15693J50193K78244l18901J59966L8916
75A34980l52116M4091L36480j09707m6533P3155j84962n1605K45270j8332n7491
86A3230O9102j36987q6429J92119p18p4644Q2682p2157q8775J72747J8414j47070
98e8486M2081P820r5727J30975J08969j24020m7714l181n4136J22717Q8540j13368
110D470j0160k1841j28748J52245J91675j53943p1741O7430j54059N605K71267
$$ y = [0, 0, 0, 0, 0, 0, 0, 0, 0, 0, 0, 8, -8, 8, -8, 16, -16, 24, -24, 32, -40, 48, -56, 65, -80, 96, -111, 128, -145, 168, -193, 223, -254, 287, -326, 368, -415, 467, -522, 583, -651, 724, -805, 893, -988, 1094, -1210, 1335, -1471, 1621, -1786, 1967, -2167, 2391, -2636, 2912, -3222, 3577, -3983, 4453, -5010, 5674, -6488, 7509, -8835, 10636, -13232, 17313, -24693, 42255, -173438, -23245, 254999, -63902, 96064, 134980, -217136, -173045, 163435, 53728, 7195, 80350, -104612, -156217, 89053, 70721, 13230, 82332, -54655, -141084, 51035, 50317, -24327, 58355, -13802, -102577, 70170, 88584, -58486, -16405, -8585, -104312, 26663, 135632, 11612, -36102, -39283, -93419, 29298, 117838, 4470, -5690, -27531, -156279, -4034, 187641, 33698, -38043, 29387, -124672, -119067, 152200]
121A52200m7294j61189R5579p5891j24925K39533P2292k20996M9638N9291j64423
132a26185J00494J83724j45735p9826R2409o8066j2331J37328n0782q9125O7909
143I814j8489k3395J06209l5037j04767M7199J2279j6648Q6167j6127r8060L0095
155b0760J9566k7083Q0206J3660j20693J195N9852k2122N1895M1071j00516k6342
167e0071L5486k7625O8996O2999j14916k8697P7354n6117M492J23496p1110j09425
179h5138Q9958R922o3340J03773J2095j33617M5973N8672q2982M8010P0312j07164
191c3526j7552Q9965l7210k3335O2463m2499m6577O0742k579k5169M9045l1201
203B567n2086O2963J1240m6613L7811J653n6703K9734L5195k5173J0907K038m3839
$$ y = [152200, 104906, -56283, 39296, -36595, -161520, 78013, 150305, -70691, -21053, 38238, -126185, -25691, 158033, 12298, -67528, 24881, -43185, -55516, 81812, 31030, -58095, 9814, -8675, -32070, 74139, 39102, -65665, -18466, -6187, -22835, 63332, 47205, -50855, -20760, -1194, -28277, 51929, 65589, -55104, -53909, 5943, -16179, 35716, 76787, -23729, -50071, -14585, -42210, 26786, 89785, -25131, -53828, 23526, -32591, -28099, 95397, 24287, -85138, 4820, 14742, -48598, 55175, 67270, -66347, -20374, 38298, -44684, 3326, 73638, -33526, -51078, 38887, 1677, -21658, 40805, -1694, -48271, 12471, 9892, -15277, 33768, 2567, -49519, 13444, 24684, -21929, 15882, 17535, -39168, -9434, 25761, 588, 11495, 13533, -30306]
216c0306J9144L3108l0399J2339K5209n1349j392M7192k5618l873L0536l8835
228a4244q614M3660k6852j2476M9543k7446m1061N2548L489n1175L8996K2301
240B8669n2137K0186K6308m4765J6933L2186m1401O662L3751m0870p313M8425
252B6634j8766k7288L1633q643k6914L2707O146k5589J7314p807k6364L4565J3012
265B0640l1894J0686Q443k7212J3203K7534j6191j1293L932j4226J1815K8826
277B4263j7525j2816J2592k1868k912M1769m080k8641M168m159l041K7362N473
290B0585k2377n487o251p538L1444K1448l1812j5402Q913q840J5198K7542j7078
303A0345k3462l357J13K1671K6022j5661k8908k966L385P625K8356M756l5460
$$ y = [-30306, -11162, 21946, -8453, 3886, 29095, -22254, -23646, 23546, -2072, -5945, 24591, -14244, -22858, 20802, -6050, -18526, 31017, 3571, -37490, 15058, 18547, -32628, 6368, 28669, -23468, -3282, 23026, -21739, -4806, 27380, -14021, -7359, 26392, -14478, -21791, 26634, 7868, -19420, 12213, 3570, -23344, 9363, 15509, -10080, 7234, -573, -26937, 7628, 20640, -11254, -568, 7875, -19337, -6134, 21400, 5209, -6084, -2152, -16378, -4563, 24263, 6738, -6078, 6514, -15354, -18266, 23503, 19423, -9218, -5050, -9209, -12250, 15112, 20585, -1792, -7279, -13530, -21068, 10376, 31824, 12, -15390, -6477, -15317, -119, 27423, 10345, -13117, -16474, -16361, 5310, 31332, 15671, -13237, -16203, -12818, -5193, 23163, 27919, -7541]
316g541j7092J0825J5775K1440j157k8717j5470J219J3731K9419Q410k9697k8539
329b7394M292K1088J7755Q199j6707k9249m473J9826K6775J3381k4348l3885l613
342b8353J9431K4720J3311j2484k8972j8699J5562L4483J2615j8620l0724j3605
354c1335J6013K7242J8655o037l5503k5965J3419L4906K0056j3531k6674j8746
366b7500K194L1388K7890r321l0030k7091J866L7053K7787q699k5398k3042o872
379b9775K3475L8286Q99l7018k2949J45J9567L6989N481l4103k3946p369J2352
392a7966M0864J7615l5490l2880L528J4195K2706K3881k0712m3319l958K0766
404a0770K5255K4512j9119m4272o338J9538K0901K1757o390m1086k2043K3370
$$ y = [-7541, -24633, -13808, 1967, 23407, 22250, -6467, -21937, -20718, -6987, 22432, 30842, 1145, -27394, -23102, -2014, 15741, 23940, 7233, -22016, -26489, -6663, 20112, 33493, 9145, -24740, -28353, -8922, 15798, 29109, 16625, -12347, -31046, -15484, 18999, 31614, 12994, -17730, -31335, -15322, 11920, 30575, 24538, -10965, -36930, -23511, 11395, 31451, 17920, -8754, -27500, -25306, 6082, 33972, 24651, -5379, -32470, -30604, 6449, 34236, 25537, 139, -22903, -29775, -6300, 31986, 32885, -4133, -27082, -26937, -7370, 29619, 35100, 997, -22949, -30318, -17966, 22898, 40513, 5023, -27857, -24329, -10134, 12572, 36453, 15741, -27578, -31536, -10770, 14485, 38997, 19878, -24394, -30732, -11194, 9707, 31464, 25074, -16012, -38055, -14685]
416a4685L1803J5087r525l6280k3517J5092K7651K5576J19m0264k6956J3375K5433
429B909K5735J269l5938k5644Q151J9703K7562J6258l5225m1895J5517K4505N776
442H683K1215j1201m9834L343L5451N283Q218l853m3961q743M1979J2548o745
455A2383N146l0642k9303L9469L2292j6232n525j6842k9525K8371M0310q026j2274
468I602j4313l1559J1616N0298P019k5768j0767j7285p276L6550K5549j5784k3151
481e269j9390K430K6504J5450O04j4101k9288j336K7706R429j624K29k5258j4821
495b8735L5910J4880k4797P138j98l5181K3166M2533k8721j8564J7714j7997j964
508a4816M0934o815l4571Q918j82j1076L7377J1519m4906j824J4623j7662K3332
$$ y = [-14685, 17118, 32205, 22680, -13600, -37117, -22025, 5626, 31202, 31321, -8943, -35899, -22524, 2909, 28644, 29913, -6025, -31669, -23518, -3815, 23747, 40005, 4780, -37115, -21598, 2907, 8683, 29898, 18697, -31137, -27794, 7657, 12940, 21158, 17305, -26656, -35399, 6580, 19128, 12383, 17529, -13113, -42416, -2947, 29345, 13113, 7588, -9254, -38779, -10408, 29902, 21876, 9602, -4711, -36270, -24654, 25644, 32663, 6895, -3872, -21157, -28433, 8117, 33666, 17882, -5269, -24659, -22229, 4275, 19725, 20329, 6228, -23060, -24396, 3310, 12739, 11115, 11344, -13914, -28735, 7175, 22055, -2742, 4396, 4198, -30983, -7817, 34716, 5995, -12569, 5145, -12852, -14816, 26118, 19303, -15268, -6350, -6532, -17608, 19769, 31288, -13618, -15442, -819, -18481, 4851]
521D851L0667l5905k2469J9264n798K930L4767j1303l8664R157J3111j0194K0461
534A0875J6307l1067j6344J6226P008k74N507J749j3738j2738J4536J4646j2111
547E82l363J0151j1753q132K0536l83k0194J3978R351k2773J1038J6892k9552
560a3622m9L0011j4892r616K2072j4604j9436K4645O598j6293J4475p30k8769
573b0210J5198J9812k0771Q127J6612l0205n860K7093q645q437K0686o989k1290
586a4879J1906O727j2967J1723J2222j7622n038Q879o518l79J3609M765j0708
599A720j1323M757N075m945J1379J2869k1954j5933J8033L750r196J8584L568
612A6384l2345K141K1889j2643L999K0134k3725j4910K4164k416j0152J8440n209
$$ y = [4851, 35518, -387, -22856, -3592, -9390, -6460, 28307, 17004, -21660, -12503, 608, -9586, 10875, 27182, -3885, -20229, -4003, 3005, 2731, 8238, 9987, -3751, -16489, -1953, 12693, 582, -2781, 7370, -4383, -12515, 8021, 7638, -12556, 1422, 10773, -12000, -962, 15930, -13622, -13671, 16340, 1448, -8168, 13904, -700, -20136, 4509, 11107, -5186, 9289, 8559, -20210, -5012, 14800, -5971, 2156, 18768, -11437, -17297, 9796, 1151, -7286, 13400, 6411, -14879, -2973, 3754, -9213, 2510, 14732, -2890, -7928, 951, -5567, -5946, 7663, 12428, 1720, -9603, -4846, 229, -4716, 6663, 19532, -2422, -18355, -322, 3428, -5768, 12816, 16384, -15961, -13820, 8069, -4574, -575, 19559, -4166, -19076, 5088, 2672, -7480, 10960, 5751]
625E751k1955J5083J1412j5741P325O335k2086R999K2117j9922n126J5725j8209
638i292m501L1808k052k5726M417L600j1176J6281J9722j8578j7395L325N68R195
652A96J6802m091j8457j1467M462J4972R508K071q528k0321m059K0096J2573m193
666I564l501j0048j5069J2214K3405n531j0508j368j3914L695K5889j715j5525
679b412L6p288m118K3615J0118k2922q796O510m646J2991K0598j8337k1566O394
693i823K976Q225K0801q719k7589k317J2070O529J3595M248k6522j7081J4571
706i036J4096Q384M298j7704k0131M555J6881J2659J476j3437j8465k334J8444
719c14J5430r60j1148j5204o017J3537J8491M624j4745j7003j447R886J5192R277
$$ y = [5751, -16204, -1121, 10291, -5450, 1875, 8210, -13876, -3877, 18240, -1682, -6808, 8917, -9292, -13793, 18015, 15963, -9763, -5346, -1746, -12922, 3359, 23081, 4503, -12892, -9567, -8999, 196, 16998, 12907, -5550, -17017, -12555, 2417, 11925, 13996, 5468, -14853, -18912, 1184, 13757, 9564, 6063, -3985, -19054, -6840, 16565, 11034, 526, -842, -14756, -11061, 14828, 13113, -2412, -2376, -9664, -13782, 9833, 19951, -2971, -11767, -5257, -9903, 3088, 23686, 5349, -16217, -9823, -6847, 1378, 22179, 13460, -14129, -16446, -4376, 2153, 15748, 19996, -6526, -23607, -9036, 5060, 13444, 17742, 38, -20093, -15538, 1343, 14002, 15478, 2041, -16424, -18758, -314, 15116, 14156, 3008, -12196, -18213, -4676, 13815, 18439, 3694, -13309, -14756, -4870, 10322, 19599]
733A9599j2732j9328m095J0469J5951Q597r209k0062q880J3020J5698N790l339
746A1479j8157j5280J1534K0050O285o103j4980j3026M415J9961J2313p324j4749
759c582j2600N53K0477J4269p841j3187j1784k185J6887J7654l001j7492j3066
772a4898K18J2014J7984K172j7610j3004j977Q892J9104N499j6528j5116j835
785a5085R952J4872O651r467j7792n694J1111J4605P275r407j6319m493O883J3883
799F975J0168q579j6914o056N958J4411R881p126j5582p550N424J2186J0394j940
813A1650j7099j0382P100J1076R804q6j5033j0565L358J0327J1782J102j3349
826c15j1946J987J1046Q851K181q746j4233k59J1453Q470L328q126j4447k44R466
$$ y = [19599, 6867, -12461, -16556, -6087, 9864, 18461, 9252, -10810, -19690, -6670, 9028, 14818, 11479, -6678, -21958, -10424, 9626, 15911, 9808, -5172, -18198, -13783, 6178, 18491, 11167, -3582, -16182, -15629, 4848, 19117, 11276, -1911, -13695, -15880, 1007, 18661, 15660, -1832, -14898, -14680, -2666, 15318, 17490, -120, -13124, -15101, -6209, 12895, 18394, 1866, -13250, -15085, -5133, 9739, 16390, 6923, -10869, -16563, -5452, 9153, 16428, 7021, -9298, -13791, -6908, 6975, 17143, 8564, -8350, -14406, -8448, 5963, 15844, 8718, -6864, -14414, -8990, 3196, 13590, 11650, -5449, -15831, -8731, 2345, 12149, 12063, -2970, -13535, -10177, 150, 11932, 13034, -315, -12261, -10274, 772, 9623, 11804, 3058, -11175, -11434, 19, 8489, 11817, 3691, -10756, -11000, -1534]
841a534P654M352n896j2746m304R206J0487J509m652r416o482P492J0217K429
855H316k274r660p163O765R286L043k733q300n285K981Q015N482k621p508o392
870h048K139R044K903k122l141q085j32R205M131j809m030n856m07O329N030q14
886D337l982l399k839M574P441k150l986j203l134K796N663l48l045k249j549
901c073R89M313K034m948k251K915j944M91N417k989m425K306J958j184M03J565
917A577k277j681L698J41k470K224o02k483L017R67k502k11J115K46j188P96P16
934A083k325N62K059r85o42j107k27K003M57L33j541k583J498J247J284K893l761
951B48n197K905L214M0K862%p886k931Q157K141j787M189o714r513R294O592n060
$$ y = [-1534, 6120, 10472, 4576, -8170, -12474, -3268, 7219, 8728, 4076, -5340, -11822, -4330, 5887, 8316, 6042, -3618, -10781, -4016, 5270, 8313, 5580, -2720, -8005, -5024, 2991, 8473, 5852, -1656, -8048, -5909, 3135, 6038, 3916, 775, -7310, -7442, 1763, 5894, 4085, 55, -5801, -6208, 121, 5151, 4337, 355, -3044, -5883, -1309, 6132, 3982, -4, -1207, -4341, -1545, 4118, 3770, 725, -1524, -3073, -2084, 2229, 4263, -685, -2936, -21, -1965, -1474, 3943, 954, -3471, -1165, 793, -391, 12, 1577, -700, -2381, 1317, 1458, -1012, 1212, 610, -1873, 1144, 2111, -391, -602, 513, 759, -429, 367, 1083, -1242, -680, 1379, 394, -248, -1355, -1582, 421, 878, 1211, -330, -2913, -1415, -168, 1116, 4009, 248, -4949, -2044, 1170, 1210, 4072, 4072, -3814, -6745, 1412, 3553, 1766, 5955, -759, -10272, -978, 5614, 554]
968E54L158m01j2045J129J3304j007n541L552n528p262J1985O008q373N19j462
983a410o163P783Q264o221m813O63k498L072R768k227j0335p10J416K390Q849
998G828k84r921m905P72N971P494R49o317r813k787J0218Q717j204l623o498r017
1014a2420N162J7186Q03j1013l14n346o510J7806R972j4804l831J705q391Q479
1028a516J6614r611j3452N740j428k247J6268Qj9090J518O748k850J0112L656
1042A0470j6687m093R022J550N294N740j3701j1579R904Q173J262N091q340j5348
1056a3242L913J1652O239K466q539j1885j520P155J2089M871j0785j0425q33J884
1070f960R320J2925q459j7716L500N462k509J4951L757k3854k196J4431m026L973
$$ y = [554, 3712, 3311, -8734, -7605, 5699, 4692, -849, 2703, -2825, -10087, 1898, 7906, -467, 52, -1410, -7573, 210, 8474, 2253, -2560, -1897, -4395, -1323, 8445, 6218, -4117, -4827, -3411, -1021, 7828, 7544, -2377, -7282, -6510, -539, 6955, 7904, 1587, -8226, -11013, -795, 7922, 6718, 3095, -3403, -12420, -7258, 9928, 10731, -282, -596, -5942, -12452, 5354, 15326, 522, -3309, -1604, -9995, -1516, 15098, 5487, -7965, -2225, -3653, -5900, 10368, 10376, -8714, -7196, -448, -3298, 6814, 10470, -6217, -10310, -1288, 262, 5556, 11296, -2405, -13984, -4080, 4093, 5355, 10446, 2106, -13242, -9329, 2323, 8562, 11028, 2489, -9396, -10916, -3761, 8328, 13199, 2414, -8011, -8844, -6960, 2360, 15285, 6826, -10890, -7390, -1928, -4437, 10514, 14271, -9583, -11779, 2652, -1374, 2599]
1084B599J1276j6132j2996J5994N194o209R210n797j9182J2030J4506q926K482
1097D049L33j8443M723J9154l054m519J007j3791l642K0219N877r268m47q065
1111e867r806J5135J3270n463n020p469o900R195J0749J572l266j1021o611Q413
1125c089Q508N28J000p932j2070Q684J2153n936J702J163j7122L518J9676o808
1139C975o885P927j0710o693J9866L090j4582L874o80j0988J4933J1928j7036
1152a981k275N612j1166P743J7853j1987j0839O305n580K93J7867k458j5762K619
1166c756L83m709J4844N609j5917k036L111l695Q886P430r225m983L32j193P568
1181B649N879p465l923J944m155M734R788q170o479O081l964L64J1846o950r557
$$ y = [2599, 13875, -2257, -15253, 741, 5935, -274, 8936, 3139, -16043, -4013, 10493, 1567, 4049, 4382, -14061, -9338, 9816, 6762, 2243, 3250, -10541, -14183, 6036, 11913, 2645, 2198, -5867, -15673, -538, 12732, 7269, 2249, -5220, -12120, -2925, 7824, 9396, 6130, -4891, -11502, -3089, 5419, 5947, 6947, -985, -13055, -4371, 7782, 1846, 3548, 4711, -12411, -8893, 10783, 3975, -2910, 5017, -5693, -12386, 7480, 10570, -4012, -138, -818, -11806, 3127, 15055, -1981, -4256, 1356, -9810, -2067, 15786, 3799, -7040, -735, -6315, -6022, 11845, 9387, -6375, -3756, -3373, -8082, 6762, 12371, -3546, -5582, -2471, -6166, 2720, 10150, 925, -4058, -3726, -4919, 2649, 8528, 1063, -2860, -916, -5071, -337, 9451, 1281, -5198, 883, -3081, -2717, 9129, 2179, -7378]
1196g378P591o87l780J1011j058j3526L888O607n945O273N703j4532j231J0556
1210C492n490K273R775j2073p050J1310r51l255R289l888j1617O335N123n035
1224a762N231J486j0893K729O187n038L754K869q875R84N794l523J254L308o090
1239b585j054O378k668j519N506n018l961Q354j292n018O312k820n683P506L30
1254B768n477M938j87p174N475M233q020K235N904q456O36Q747p156k480Q794
1269D780n947l217Q817l881n535P780m18o231N802J304p681M530M198o615K566
1284B52L303p732L066N913o566J081M391p492L37P846l625l049M526l730l473
1299d952P808J16n791M164j465n510P659K948o893K368K87n648N440M901n534
$$ y = [-7378, 213, -474, -4254, 6757, 5699, -7827, -3939, 2668, -3277, 2996, 8699, -5833, -7064, 3492, -1998, 275, 10050, -2023, -9073, 2237, 1286, -1969, 7320, 3432, -8185, -1850, 3273, -1762, 3469, 4955, -5938, -3209, 2978, -2060, 1694, 4563, -4312, -3328, 2466, -1057, 197, 3505, -2585, -3639, 2739, 71, -1448, 4058, -960, -4921, 3433, 2141, -2877, 3435, 615, -5068, 2438, 2768, -2709, 2229, 2042, -5132, 343, 4576, -3444, -1209, 4695, -3761, -3125, 5622, -1534, -4014, 4780, -1167, -4384, 4433, 552, -4983, 2797, 2379, -3852, 1950, 3254, -4427, 103, 4301, -2314, 252, 3555, -4177, -1111, 4802, -1764, -683, 3708, -3784, -3447, 4399, 774, -2275, 2251, -1479, -4952, 2856, 2972, -2819, 1345, -120, -5630, 2029, 4977, -1916, 452, 739, -4909, 531, 5432, -102]
1314a02p89J892m930K637P675n090m133M048m052q95R849k743p363L480j534j901
1330c951Q227M93p547N66J189k512N754M327p833k823L524k142L811O022o977
1345A28m137L278j869L379O372n669o192L008N36L62O514j774q587P62L549o01
1361i41N209M85r238j75L886j08M587J637q204k832M399J877K810J937o422m945
1377f038M540K418J097M326n684p957N288L855J4L158l347p795J682N737J504
1392B798P21j342p229j060P210K037k62Qo748k710O641L624p7q49n817k839N043
1409h51M482N39j383m463m374L629O413M08k016l833m301K814N825J131j033m270
1425a283m877L143N382J467j065l698m525J122O454K431k097k174m771j037P784
$$ y = [-102, -891, 1001, -3929, -1292, 6383, 1293, -2840, 1208, -2844, -3739, 6110, 3367, -3996, -516, -2050, -3951, 4276, 4769, -2778, -2212, -1023, -3535, 2219, 6546, -1287, -4110, -586, -2728, 1083, 7105, 128, -4009, -731, -2600, 779, 7151, 1482, -4710, -1702, -1166, -804, 5710, 3936, -4651, -3889, -340, -941, 4268, 4753, -4485, -4660, -774, -882, 3705, 5342, -2862, -5694, -1295, 582, 3392, 5329, -1093, -6038, -1498, 920, 2017, 6343, 659, -7298, -2010, 1845, 1859, 5017, 1670, -6125, -4443, 1294, 2798, 3519, 2177, -5052, -6112, 1098, 3135, 2873, 2881, -3867, -6577, 64, 3688, 3611, 2762, -3055, -5894, -851, 3631, 4170, 2787, -1676, -6050, -2421, 3992, 4400, 2384, -1449, -5750, -2936, 2889, 4020, 2987, -1283, -6160, -3017, 2365, 3832, 2767, -931, -5456, -4334, 2120, 4551, 2454, 280, -4491, -5528, 2256]
1440B256L025l206j411l431k746N856N287k191l935k023j387K545N865l4n198
1455g28k166q03J468O160J183n346l435M9K196L510K504k490n781p06L781K598
1471A994K172r96n862k037L556L592J225p50l547m504K205O235k6j927n52m496
1487c718o80O283K112k749k203j461q21K978M298j995l947j17MJ161M254j91m249
1504a041k049J218K690J369O15j769m689M71M665R06l22n42m082j735M562K960
1520C227j754o73j219m722K791O800k705k407J846m206j130P197P08m879J173
1535D7k41l721M197M959n475k131M270l532m50O449k537m951K766P66j589K522
1551A349R18l829q29K429M08K37P35k419j479J692J154J500o86k358K21n59O91
$$ y = [2256, 5281, 2075, 664, -2767, -5513, 343, 5630, 3439, -496, -2519, -3906, -1361, 4504, 4470, -728, -2894, -3697, -2229, 3931, 5114, -232, -3667, -3618, -1422, 2088, 4592, 2102, -3679, -4385, -604, 1994, 4166, 3170, -2692, -4729, -1173, 2419, 3644, 2894, -653, -5157, -2952, 3283, 3257, 1330, 778, -3718, -4398, 1885, 3997, 1248, -955, -2416, -3237, -259, 4039, 2044, -1903, -2020, -2016, -855, 3399, 3208, -1041, -3090, -1872, 818, 2187, 2802, 1033, -3656, -3185, 1480, 2386, 2064, 1522, -2560, -4295, 267, 3227, 1473, 800, -419, -5141, -2350, 4450, 1745, -662, 1184, -3022, -4152, 3045, 3753, -1126, 47, -194, -3915, 282, 5241, -234, -2365, 1905, -1627, -2077, 4372, 1835, -3116, -350, 416, -1173, 1349, 2267, -1562, -2391, 38, 446, 683, 1418, -1001, -2480, -788, 366, 1866, 1180, -1178, -957, -1516, -825]
1568h25M155j448l616J576k92j571L871J583m416n64K506k993J204N100m466l029
1584c225N581k825l271O862j234o099M774K175o039K484M399n622j30O111m486
1599e45k496N760k823k997O040p52m331K522P38l097K238K221k894m75J188j646
1615a349P73K579k205l18R14k048J223J469j562P07J69j677J476O45j996J290
1631I0J279k074M54K288l092p67M076j970j582M278k975m104N840J08l877M383
1647B355k05o443K762M467l586J42L633n206j965O369j407k190M116l131l795
1662d084M820J056k665K211j38l883K065K744j557j50L71k556R31K844j749j75
1678H5L80k726J594K701j738k42j21k576J733L058j854n37J000l236k15N758r04
$$ y = [-825, 3330, 1882, -1734, -158, -450, -2021, 1850, 3433, -983, -1547, 959, -2034, -830, 4270, -196, -3225, 2356, -469, -3740, 3122, 1888, -4211, 563, 2738, -3301, -817, 3582, -2040, -2170, 3941, -545, -3041, 2719, -104, -3101, 2939, 2187, -2144, 378, 1116, -1981, 257, 2478, -416, -891, 297, -1349, -576, 2003, -202, -520, 394, -1654, -431, 1038, -524, 183, 352, -1325, 151, 796, -1200, 90, 1369, -705, -251, 2037, -1055, -1822, 2254, 284, -1298, 2980, 5, -4099, 1741, 1849, -2028, 2355, 2150, -4293, -1531, 2936, -650, -508, 3125, -2081, -4046, 2323, 916, -1274, 2842, -289, -4084, 736, 1792, -873, 1338, 1200, -2683, -618, 2126, 569, 419, 790, -1766, -835, 2009, 260, 85, 465, -2261, -667, 2034, 296, 54, -67, -2643, -910, 2148, 294, -243, 757, -2479, -2694, 3064, 2160]
1695B160l460K404k284k887O232J560m891J768l86m481M631M468m783j486K621
1710A186l700k13O802k053m453K685j300j912N656k8m939J347O03j988L727K210
1726C630m443j369K171r36J325L242l466k414J880l26J313K910l065k532J220
1741h60l04J292K850k028l039N89N06N60L187j062m384J161J431j364L464J025
1757C024n260n1K779r72J792J716m110j878L095J86J12K685k680m139L144J703
1773A146j183K425j158m380J609K442o47J196m60l557L11L084j93J17O59k854
1789a443j448L459N26l51P69k653j366K889P87l85Q19k251j711K174J917p82k33
1806G17q14k445J811K484j259J20k55l038J175L134o70q68K13k020k18K838Q23
$$ y = [2160, -1300, 1104, -1180, -4067, 2165, 3725, -1166, 602, 216, -4265, 366, 4834, 51, -1435, 1186, -2514, -2727, 4075, 2022, -2431, 254, -1046, -2958, 2698, 2670, -2269, -922, -319, -2307, 1420, 3630, -813, -2182, -11, -947, 378, 3620, 154, -2260, -380, -706, 607, 3517, 452, -2080, -860, -1164, 128, 2978, 950, -2089, -1500, -994, -434, 2753, 1691, -2693, -1532, -101, -1465, 1999, 3024, -2236, -2287, 492, -480, 1312, 3028, -1082, -2960, 135, 321, 433, 3118, 438, -3701, -557, 1146, -37, 2388, 1230, -3150, -1541, 901, 254, 1450, 990, -2567, -2256, 828, 635, 752, 1411, -1443, -2891, 568, 1094, 743, 1512, -1141, -2507, 382, 1169, 784, 1603, -648, -2359, -185, 1732, 950, 717, -97, -2542, -731, 1753, 494, 614, 359, -2679, -1504, 1630, 960, 92, 305, -1715, -1933, 905, 1728]
1823A728j597j76p30j150K714J369k060k5k36j780K183J912j589p59l32r52J402
1840g8J586n08j385m7p77rK770k93k135N89o59k49K291Lj415m5l73j33J868K67
1860A268j254n77M54l47P89J409j459j177P75m48Q42J314j698o62O82p14M88J506
1878A191o11j693K81O74l16J075M63k043l3J274q17J280N70j988r9J035k94L27
1896B76O41p23q29M92M78q5M91o05j072J028L39p43P83m35j242Q41N35K02j96
1915A76l95m59K44M73L63lj90p37O5Q50l9M7q3j065N24R70p65K39P08j546j18
1936g41J298k36n63R5L17r43N03J251j375l01J013r10K65J085r02l15L59q4J07
1955g7L69N75j233j51O68k2K99M19p01o86N57NK98M7k7q78k80J205O9r89P40j65
$$ y = [1728, 131, -45, -775, -1925, 789, 2158, 98, 73, -163, -1943, 240, 2152, 563, -196, -528, -1480, -78, 1508, 1000, -385, -432, -1209, -1218, 1552, 1259, -876, -287, -946, -1195, 1096, 1099, -316, -361, -734, -867, 1001, 1268, 14, -563, -109, -456, 333, 1742, 283, -894, -119, -567, 275, 1589, -109, -771, -89, -803, -315, 1191, 580, -1113, -832, -158, -474, 601, 1064, -979, -1012, 262, -555, 725, 1295, -693, -792, 243, -51, 276, 917, 194, -635, -143, 335, 250, 741, 136, -936, 92, 431, -312, 471, 36, -1206, -365, 170, 372, 176, -219, -678, -434, 39, 402, 399, 209, -528, -463, 387, 348, 395, 312, -753, -229, 741, -24, 215, 923, -623, -741, 557, 321, -242, -147, 170, -773, -270, 981, -394, -695, 318, -592, -327, 758, -144, -459, -100, -184, -77, 292, 867, -366, -517, 151, 129, 428, 847, 146, -540, 17, 22, 320, 367, 340, -538, -818, 387, 456, -533, 207, 42]
1977D2j257J177Q81q21m08N68m40n38J354M36j867P86P53j496J174R25j517n15
1995g63R80J79p24Q32J94j602L45J225p31p0O72j218k56J068K27j91P0l97p44
2014i04L2J663k64r89O43n65n14J267P45r60n20N08l52l12J681k79j794R52L31
2033C69j188J044J127k085k68J606p94n29J484k10k022J278J109j566N22R38k164
2050a349O16J681o70m34Q13q00r61J232J232j169l91O57j159k1J801k57j000M1
2068a38j64k65M09J202p84j261R28l88l97J443M37j832M52O03n18j23J388o59
2086C33j451J369N04j398J331N74k268N13J564j366j91J402j055j239J735N65
2102I22j588M90O20j595R15J478j463k74P47o82l72J368L55j274q0O43q14N09
$$ y = [42, -1215, -38, 843, 22, -386, 182, -258, -796, 558, 994, -873, -87, 666, -830, 344, 1269, -248, -763, 217, 396, -328, 504, 698, -904, -559, 666, -65, -135, 537, -681, -937, 131, 358, 167, 237, -160, -904, -872, 791, 527, -462, 181, -384, -898, 369, 1114, 154, -366, 142, -210, -522, 1159, 880, -914, 38, 369, -819, 225, 1352, -733, -1001, 605, -189, -718, 766, 556, -1466, -188, 921, -645, -123, 815, -1349, -733, 948, 278, -156, 657, -143, -1104, 128, 1360, 191, -200, 457, -702, -723, 1078, 821, -179, -138, -302, -567, -158, 1044, 260, -1001, -73, -461, -858, 585, 1022, -810, -358, 245, -273, -396, 992, 333, -1118, 251, 755, -643, 688, 1262, -1006, -493, 1071, -295, -486, 916, -139, -1378, 357, 922, -666, -176, 444, -1151, -236, 1242, -221, -495, 252, -430, -802, 566, 921, -353, -433, 210, -604, -95]
2120i5J226o88q36K89M3K3K33O92p85r99R88L04q88J141j74j426N33Q81r10K5
2140d23J090n63j229J309L06j317R68R06k109P85J472j440n3J121j023n84J615
2157H31K3j871R86R23j729M34J649j653l30J171o93m40J086q7j002L62P72q19
2175c87L7J236q86p97J207l38n04P74J44n73k43P25l0o39P62p0q92N17L34n30
2195a53J95K96m46k33J46L50n22L05O55j253K60Q57q26K0R94q15k43N91J19n99
2215c02K14Q95j038q8J170q03l32R12n12o09O49L11o55l9M55m05j45P99l60q07
2235f90P94n69k40J092n9o82J23J62m4K4N86k46o19L86j01j16Q01k05n78J92j14
2256a03P9L38l6mn27j38N63pj14N2l04rM0M30j08m52n6K6n4P39O1p12M99l89k67
$$ y = [-95, 1131, 443, -393, -104, -61, -38, 195, 887, 102, -897, 91, 395, -493, 648, 474, -952, -419, 462, -448, -423, 667, 104, -1125, 184, 490, -827, 141, 1047, -1062, -277, 1195, -245, -298, 823, -200, -784, 831, 854, -1017, -31, 892, -837, -403, 1246, -407, -737, 434, -259, -699, 387, 300, -702, -340, 432, -387, -350, 886, 0, -797, 410, 72, -432, 342, 486, -87, -330, 395, 365, -274, 488, 418, -474, 43, 377, -153, 42, 338, -108, -341, -195, 155, -367, -62, 593, -660, -400, 457, -369, -349, 645, -170, -413, 178, 297, -302, -88, 807, -231, -319, 851, 48, -284, 628, 116, -493, 156, 467, -188, -227, 228, -177, -322, 477, 117, -690, 104, -465, -705, 387, 328, -354, -231, -69, -113, -89, 497, 251, -368, 18, -83, -199, 602, 397, -181, 11, -103, -24, 314, 278, 274, -253, -391, 172, 165, 51, 103, -201, -210, -170, 260, 152, -300, -356, -330, -384, 355, 416, -296, 203, -186, -453]
2281d53O76L02m94l19M73k42j59Q16j55j018N58Q1m79R72p9q68J26K39q0K27M1
2302A65l05l75L90R6O8L68l65n53N28k33K97O34m33n24M0K32K65K87m34j99k89
2323c40M77J29J50k10o36J4K12N5N54r4q10K43J02kM27O9n23j38J06J95Q7N86
2345F53m24p02K75M54l06O48l21q00K42K31K88J81k67n91q8N02K33j44J52m12
2365a96n48P72L9k10N60o54m90O09M8O5N97n41o10L17M86r8Q9J52p28j38Q92l30
2387H3Q9K81r98R5N51j22K73J42p38k36K98M14n3L27l11r72N94Q20o72N39o3j011
2409f70L15P99k81K26j95n68k9M81N42m57N8k82o44P99N05p15K66k32n25M06L11
2430A10J92j34l58k87K70L55M51n66j72j34j09P77k5k47J10n68J22O39ML9k61
$$ y = [-453, 223, 525, 31, -288, 185, -57, -216, 600, 445, -573, -15, 66, -413, 559, 480, -388, -262, -23, -103, 124, 165, -140, -515, -125, -29, 39, 407, 42, -511, 17, -216, 81, 715, 282, -242, -202, 30, 295, 582, 148, -51, -340, 137, 266, 416, 206, -430, -416, -204, -149, 405, 311, -499, -256, -154, -156, 271, 340, -183, -321, -215, -20, 67, 653, 229, -473, -198, 256, -50, 598, 277, -523, -281, -50, 238, 419, 152, -439, -527, -25, 208, 64, 216, -196, -744, 28, 67, -143, 417, -237, -727, -118, -70, -5, 592, 51, -559, -242, 244, 146, 235, 387, -341, -479, 413, 83, 172, 453, -545, -450, 101, -21, 252, 394, -344, -580, -282, 132, 79, 406, 95, -877, -283, 537, -135, 404, 341, -670, -355, 444, 163, 389, 194, -374, -403, 78, 620, 163, 221, -61, -705, 94, 599, -116, 150, -82, -607, -201, 110, 302, 168, -190, -477, -207, 148, 599, 33, -139, -273, -382, 395, 370, 123, 233, -335, -213, 426, 430, 469, 208]
2451B08p74J6P29J4J03n7n90m00Q95L82o82L00j09j198Q07J157p20j66J46p75
2471g14K52J165K7j000K36O4n24R36P45j019m91L35m90M32R30o41o22N0L0L25
2491B6L86K1r26k13L51J17N33J66n00o40K63M58M08j83K7m36m76P66N77m90k1
2512B14l43l58K24Q42J29j025R5J48o11Q84P39j355k39P14m79K45Q25m45j014
2531h10L34O85m48P10K84j279j59J068n53J33R52q93p48O81N32l23L07M1r67k46
2551f99J123k38k25M71p67k71N20M84k69l00N0r7k89R72K07j146l7N90n04L67
2571e8Q09p08n15L10K64k82N52J73j024k7R60o11R3O88p72n38N16O70n93J85M57
2592E49j208O9J072m63j23N43n68n63Q67K86m56R8L16o08l10J020j94n38O75k65
$$ y = [208, -566, -550, 179, 193, 296, 239, -351, -751, 144, 526, -156, 144, 35, -1163, -356, 801, 81, -85, 61, -714, -462, 703, 730, -270, -34, 30, -494, 442, 1187, 168, -323, 12, -478, -46, 884, 243, -379, -329, -299, 26, 412, 433, -493, -706, -355, -238, 295, 461, -39, -679, -416, 42, 450, 267, 294, -142, -618, 148, 725, 235, 214, -129, -487, -263, 579, 708, -317, -222, -74, -685, 199, 938, -417, -656, 58, -421, -176, 649, 204, -810, -476, 209, -239, 471, 755, -524, -683, 385, -168, -35, 917, 24, -724, -43, 489, 166, 473, 514, -453, -699, 424, 186, -39, 432, -335, -606, -86, 398, 129, -171, -121, -218, -507, 465, 672, -474, -511, 79, -425, -58, 751, 43, -472, -162, 102, -180, 372, 545, -479, -506, 454, -157, -64, 624, -148, -686, -170, 500, -93, 92, 549, -659, -590, 482, 19, -104, 439, -129, -692, 175, 461, 5, 103, 419, -189, -499, 521, 327, -211, 464, 199]
2612A99n37P39O5o14K6L19n86k20J239k93r74N46K17p60P21M02n12j85K31j44
2632a21p8N38J54q80J61O05m30K04M10p67l42O57L8n1J40R3o80n3P05j76l69N58
2654C16m98o73Q76K69m09mK68n74q3Q66J9o03N74k54r18J123L13n83%J57n90J45
2676b63Q09n0r53L96N2o80Q79M85r86P4L84n57K30P63l38q16Q8N04j88N33J80
2697E46r07j54O63j17J98K04n84k42KP16K62m78r4j85m80P83M13k77p8m62j89
2718d60J37P98K52r34k05J53l08R32L96q15k92J10J15K24O17l09q40N5L92lN57
2739E72K71j220j32M65Q2M26J72o51p20K79M07M26l3k20q30P6Q50K63j37k00o34
2760d88p3N14M56P9m05p02K45J6P53N52n55p18j25K87L02N16qj120k18M93j5Q15
$$ y = [199, -338, 401, 466, -148, -122, 197, -389, -609, 630, 337, -637, -91, 126, -634, 87, 489, -23, -208, 23, -121, -199, 339, 493, -387, -226, 379, -51, 153, 563, -204, -546, 111, 149, 98, 238, 331, -349, -402, 303, 127, -242, 316, -182, -855, 21, 290, -119, -123, 145, -429, -512, 354, 373, -230, 344, 90, -828, 295, 608, 25, 25, 182, -408, -263, 546, 496, -457, -61, -9, -689, 190, 675, -311, -237, 147, -410, -180, 583, 245, -571, -483, 21, -167, 366, 546, -361, -515, 148, 31, 229, 433, -151, -393, -391, 325, 587, 109, 15, -170, -650, 133, 546, 269, 191, -271, -460, -323, 475, 727, -207, -412, -259, -567, 365, 761, -54, -346, -236, -121, 103, 720, 411, -429, -374, 18, 15, 572, 843, -377, -509, -44, 38, 464, 636, -15, -735, -456, -49, 377, 344, 124, -706, -630, 220, 483, 346, 146, -488, -561, -47, 409, 488, 83, -619, -374, -358, 395, 947, 392, -326, -451, -164, 138, 654, 646, -474, -692, -199, -214, 601]
2782F01J66j101n36M66K61O19O8p79n53M02M56L71J01l39j097N37O40J2M65n42
2802B18q31n7P51L43K81l33q63l99Q01N72O6p8p87p27O71P01K68o7p13q10O17
2823c76O52K91J36q55p30M00P36N37l03l98p80J52R12L45l91o6j025k3J054L01
2843E69m3n06p74j70Q16P16r1m11n33l53N71J018j95l94l86p19P10R13k2l74o16
2864b74l44M79O84K01m30o91l52R9R13P31o52m88m18k62R82M56n24r4q81K10O80
2885B5N36J4p80k39j76N44R18m06o10l2m05L39J087k05o31j33k21K62M99J92n81
2906cl98Q0K2N37N13o36n37J02Q1L19O74o63m27j40J68M23M63k35m26l97O27j48
2928aM59Q0q06k74M68M5M41M6n95L0l22K56N32j32k87q5k34J20L22L71m27k14
$$ y = [601, 767, -334, -870, -404, -143, 476, 544, -235, -788, -386, 70, 441, 542, 203, -894, -357, 283, 295, 760, 218, -613, -670, 81, 424, 705, 372, -491, -890, -89, 483, 549, 471, -316, -1043, -372, 329, 597, 530, -183, -993, -376, 276, 567, 703, -152, -882, -482, 254, 791, 488, 90, -690, -538, 374, 719, 328, 262, -763, -786, 268, 569, 526, 20, -754, -924, -108, 608, 517, 106, -427, -780, -209, 809, 614, 220, -166, -885, -175, 738, 716, 342, -274, -618, -139, 545, 746, 316, -375, -727, -628, 285, 1016, 364, -124, -542, -804, 178, 634, 110, 16, -865, -655, 25, 561, 575, -205, -444, -620, -76, 842, 436, -174, -206, -611, -272, 815, 610, -21, -154, -375, -113, 386, 578, -3, -401, -321, -299, 238, 751, 115, -422, -320, -239, 80, 754, 91, -336, -476, -308, 115, 578, 343, -83, -480, 147, -1, 458, 538, -268, -542, -74, -29, 412, 458, -137, -107, -429, -173, 359, 227, -60, -145, -379, -259, 63, 434, 7, -207]
2950b07J55j42R1N42l63k30K54l20R4M09j22k58q7K93j98J11L31k87k34K64l15
2971b19J52N50m61m15M48k41O2j6M62l07q1q4l4P3N39k87m23J74J2J16L42j46
2993B16k37k60L59M1P4K07l52m71P4L94J70J9j06k95j51L9O53k05n20K70l53k0
3015d54P88P1l19q6k54k44N78N60l90n57O2J8J57Q17n05m35M6L0R5O09j49m48
3037a0o11L52L07K06L10n21o87K03M10K33L58l26p27j39O44K40L7M9m03o31L98
3058c08Q95j73j37l42m13K7O74N20n28l91k96p1M83P82l79o92l5j74M23P64j93
3079D36p67k80J32L53M89M00n74j062O56K34L12L72m82p76k22Q23M26Rq4p50o89
3100a044Q18P14j32j06n95m28J87Q73L33m24m29k69j24O71Q53n12o17k43j76P74
$$ y = [-207, -52, -194, -103, 439, 76, -154, 100, -220, -126, 283, 161, -97, -184, 109, -89, 22, 353, 66, -168, 96, -219, -67, 483, 22, -393, 55, -186, -124, -140, 322, 15, -66, -150, -184, -111, 428, 141, -282, -108, -96, 20, 362, 216, -21, -281, 78, 119, 193, 400, 48, -423, -349, 45, 215, 234, 128, -167, -318, -279, 374, 169, -351, -81, -434, -454, 334, 405, 86, 0, -254, -498, 80, 640, 250, -307, -245, -227, -70, 747, 242, -193, -147, -117, -22, 587, 438, -10, -621, -269, 38, 244, 554, 33, -654, -451, -41, 192, 550, 224, -503, -642, 2, 242, 279, 328, -75, -706, -308, 587, 414, 277, -65, -478, -451, 223, 743, 215, -176, -472, -543, -60, 722, 343, -349, -384, -558, -135, 629, 436, -331, -611, -479, -126, 363, 763, 189, -873, -217, 17, 329, 701, 219, -557, -779, 44, 470, 479, 395, -355, -1044, -226, 488, 356, 250, -345, -773, -586, 287, 620, 196, -233, -502, -626, 45, 898, 386, -231, -474, -650, 124]
3120A24P23k37q91k78K29M73L55M32r87n85K49M43L91L71o78q76K1O92N39%k58
3141B52q90k89J056J97J3K1p99n19O76Q69Q8l20o88l37M6J031N38p69m46j94j41
3162f05R46P68o21r05k47J42M71N70J90j084m78M86K14O73K00q64l94r5N87N74
3182E28Q6l33r86o4P82M21J17k21q71j56P75M71J13l56o84k60J82R13K50o26m44
3203c63k88J50R88K06k80p87k65J98M24N84M6r49l34N07K18L45K20p71n84M35
3223c00M48J50J66k28r33J14P26J71R3k37q23n9O96N14j67k07m18l32M39Q29j75
3244D67n59Nm20J87O97K65m87m49j61L72M14K8kp95K1L01L15K33j12n06j81J07
3266b60N25L4j09j73m94lP33q5P1l02l83j07P67K5r0q8k13l8K07L18l04J17k31
$$ y = [124, 847, 610, -281, -559, -330, 143, 498, 930, -57, -642, -393, 50, 441, 812, 134, -742, -721, -29, 510, 510, 252, -638, -927, 129, 326, 339, 360, -439, -958, -282, 587, 675, 355, -333, -670, -624, 407, 945, 176, -270, -464, -605, 341, 1109, 488, -417, -664, -522, -51, 519, 709, -375, -853, -367, -153, 520, 720, -144, -538, -633, -46, 528, 614, 281, -705, -769, 13, 434, 551, 330, -541, -697, 78, 549, 662, 306, -378, -638, -456, 457, 707, 81, -363, -651, -501, 487, 693, 413, -374, -639, -441, -17, 567, 613, -336, -670, -163, 55, 400, 620, -151, -735, -300, 148, 298, 464, 236, -697, -583, 143, 314, 407, 170, -653, -712, -16, 498, 331, 124, -294, -626, -187, 642, 467, -92, -87, -507, -320, 377, 642, 155, -294, -455, -83, 331, 359, 357, -438, -417, -116, 199, 432, 320, -186, -367, -260, 265, 299, 190, 17, -477, -480, 253, 168, 239, -63, -446, -553, 214, 239, 149, 61, -152, -190, 17, 335, 31, 148, -83]
3289h3j38L6M27j94lO9m12J36K01J47j79n7p6N8o3L50k9k57j11QK77O7k75k3J4
3314a10j09K99M2J1M5k09j99K17J78k4j55J63l17r5L97n0O2J0k98l5L42j07J48
3337B06k7j24j35j76M17j97J91Kk23j27L16J10J7k19j85j12J04K71J95j29k47
3358g2j16L7K46J65M5l65m83K70J88J88R5j67m29J43K94J29K66m15k82q7K96L01
3380B47O3j48k53m83M00L63j4k8m36o5L46J02M24l50m85j25J44N99J98k70m22
3401a93l65O8O12M45l36m08l61J63N83L99k18m54k98q8N43M55O2o46m73J9M86
3422eN68j25l59n08k28P73L19L8m20n79j2N36M09J24m60l77j15K31M64K01l39
3443A36m25j57K54O53K4k00m28o46M90O95M29m18o27k18K15M42L92l10n60l61
$$ y = [-83, -221, -185, 242, 48, 45, 114, -298, -162, 39, 186, 7, -50, -126, -68, -131, 219, 190, -67, -178, -170, 107, 174, -101, -124, -110, -219, 80, 122, 133, 178, -31, -230, -13, 165, 141, -14, 149, -168, -263, 134, 84, 146, 156, -142, -177, 165, 58, 206, 179, 55, -80, -256, 161, -36, 155, 157, -66, -193, 123, 233, 250, 31, -154, -266, -162, 109, 304, 175, -72, -188, -151, 95, 260, 305, -60, -543, -273, -85, 103, 198, 31, -398, -255, 39, 168, 434, 19, -263, -350, -54, 247, 310, 162, -91, -574, -174, 189, 175, 147, -289, -354, -8, 94, 518, 168, -317, -442, -298, 301, 499, 229, -193, -558, -490, 122, 567, 231, -177, -538, -375, 208, 607, 389, -65, -363, -451, 92, 547, 609, -37, -510, -491, -5, 563, 438, 79, -429, -657, 116, 435, 473, 53, -526, -538, -2, 407, 531, 71, -306, -421, -190, 274, 475, 136, -289, -446, -192, 461, 485, 285, -143, -789, -299, 396, 825, 407, -220, -438, -223, 219, 611, 301, -259, -620]
3463f20K47N29M11k37o37l93K67O78J42J62o59m00j8N31N85k9n26n45J02J70P92
3484E52k7n38l89j21K55Q18Rk47q24k11L88Q30J05n70l60j03L79K89M50m01n81
3505b97l9k5N85N45l36p23k69K69K04O01L6p07m11K54O34l6J53m95n06j0O33L64
3527D24L9l91n89r4M85O52K1l50o31j10N11N55o1l43l99j45L00K57L69j88n68
3548b56p4K18K71L96m14m89k78L57L58L48m2p99j84L80M16LK69n67n15L32M05
3569A35J61p2j68l87j97O46J60J6l91j66k56N51L10q2k63k07j56K35M21J61l76
3590G5l19j8J18M43P6l72l43R3J16L19J87j56m45j76L58L36q8K12n16l68M54N3
3612C9L9R6k07j84k7M32M8k15J67m40k90N77J69j96L3j42j55Q5L74j90k8J52l03
$$ y = [-620, -373, 156, 567, 330, -307, -700, -433, 245, 387, 549, -110, -510, -528, 3, 588, 559, 33, -512, -410, -240, 552, 525, -13, -402, -523, -268, 550, 559, 312, -512, -723, -335, 495, 600, 30, -330, -433, -54, 235, 685, 284, -297, -336, -361, 224, 769, 433, -290, -559, -290, -86, 515, 551, -156, -567, -313, 321, 285, 438, -57, -563, -573, 60, 424, 463, 72, -517, -611, -126, 526, 547, 197, -434, -544, -33, 522, 461, 118, -281, -426, -126, 131, 500, 312, -256, -330, -112, 159, 555, 141, -348, -626, -269, 89, 437, 395, -404, -588, -208, 208, 211, 480, -87, -602, -270, 135, 296, 224, 56, -331, -528, 118, 278, 294, -97, -263, -519, 32, 342, 260, -3, -210, -366, -131, 290, 451, 75, -244, -262, -144, 299, 375, 3, -340, -247, -131, 188, 375, 219, -226, -402, -44, 292, 204, 416, -100, -468, -14, 39, 78, 174, -33, -217, -244, 188, 236, 21, 188, -252, -542, 35, 204, 8, 41, -101, -256, -171, 203, 13, -15, 137, -166]
3635a66l7M72j88k42K72j9j39J61Q1p2k18N9K99k23K42j03k40k23J96P3K76k80
3657a9J32j01l23K05K90k99J96l08J43J39l7j43K84J36k06r2o5K35j80K36k11
3678A2j58J28L4N0K51l09m1n7J56J24j76O7k05j45J48L49j22O5j53k22Q5J66J86
3701B33r1k71J7j22J73L35p5k32O3l07K57K51k0j12l62j4J60L15J62j70m86l1
3723c27P1M21J75k66j66k99K08L76R6p2l00l70K99M51mP2m25l05J60L80J23q0
3745B18k57l75p5P28K50l40j63l08k9L86L50j33l30l67Q0K96L28K83m93m59J31
3766b79K07N46K0m68l38jJ79N88m0m3n90m43N92L46K98l53n19l25L45O92n2r8
3788B64o36k58K43O73K49k53n01k16r7O53M84j82o03m12K88M67M07K7o21m87J51
$$ y = [-166, -203, 269, 81, -161, 111, 92, -47, 114, 195, 123, -95, -36, 263, 40, 282, 179, -61, -284, -88, -15, 261, -19, 113, 12, -311, -106, 184, -115, 81, -227, -84, 55, 18, -125, 159, 295, 89, -3, -68, 167, -13, 223, 12, -146, -18, 16, 66, 317, 8, -33, -90, 66, 190, 14, 81, -124, -269, -121, 228, 106, 171, 18, -204, -119, 47, 233, 142, -129, -112, -234, -61, 274, 199, -33, 30, -277, -20, 231, 211, 99, -263, -277, -117, 198, 360, 190, -296, -327, -256, 165, 340, 74, -92, -391, -183, 193, 289, 217, -83, -453, -154, 297, 293, 365, -60, -365, -205, 175, 298, 218, -39, -414, -489, 239, 489, 149, -14, -322, -351, 35, 385, 252, -78, -445, -365, -69, 259, 542, 49, -410, -279, -72, 474, 494, 26, -312, -313, -134, 454, 414, 371, -219, -662, -70, 276, 574, 221, -298, -623, -278, 414, 362, 264, -372, -630, -387, 286, 535, 282, -219, -435, -532, 121, 605, 423, -180, -592, -304, 163, 570, 597, -24, -511, -360]
3809c60J31O62p0m60l96j31O61M73j08m62m26Q7M26K88R5l68n60j18O36L21K90
3830F11m22n40j78L67N63J94n63l91k21L21N56J32j17m49l40M73J56M69k21p70
3850c70k40K95L97N13l71l90l35M1N89K70P7n09m48Q1N11K91J09m67m93K12J71
3871f6N43k0m59l97K34O2M84Ll23m10j21L39M94J7l46k25k22M05K02K31j95n94
3893c64j41K65M73J88j59n61q0K17J12L58r9k12l61J95M29L55k18m02k42n6L63
3914F0K57P5m73j82K1j11N47P2k20l55j23L81K71pk23k30lK53J16K43j23n02O9
3937a87J49J24M9m2l22j4L18k6K23j57k35k84M56J56k2J5j33k56j52L88J86j44
3959I0k4j66j69K59J37q1Q2k51m1L38N0r1n6n4j93O0J11Q6J12k99J15q7J4Q1j36
$$ y = [-360, -229, 433, 363, -97, -493, -624, 37, 510, 402, -60, -486, -399, 27, 315, 410, 42, -518, -636, 0, 321, 611, 189, -351, -529, -162, 401, 595, 32, -359, -580, -259, 297, 429, 312, -137, -477, -4, 152, 621, 400, -370, -610, -315, 82, 595, 224, -166, -501, -460, 129, 399, 476, -33, -481, -400, 111, 402, 511, 44, -449, -237, -66, 477, 457, -2, -399, -165, -103, 381, 384, 61, -349, -470, -131, 363, 380, 34, -191, -413, -8, 194, 425, 230, -364, -505, -240, 233, 421, 262, -299, -379, -162, -50, 308, 209, -3, -364, -169, 260, 615, 397, -5, -247, -303, 60, 317, 392, -81, -263, -242, -353, 194, 266, 46, -309, -432, -51, 220, 213, -10, -240, -243, 10, 126, 369, 246, -256, -187, -38, 86, 135, 93, -229, -243, 75, 49, 272, 115, -120, -404, 52, 208, 186, 201, 68, -188, -340, 48, 234, 90, 66, -100, -269, -10, 127, 46, 128, -123, -164, 174, 224, 133, 77, 23, -170, -110, 1, 87, 199, -100, 15, -72, -58, 23, -113]
3984a13l5l9J85n0K20j66k3L2m7P4J56j81P7j28LJ24P3j3j70m9JJ08q2PJ23k25
4010a38M4K23k90K5K46n2q6N1k08K04j8k6j8k3q8J49m5K20M2k41j18Q9R6J55k48
4035e5J14n0j41K04j18J87o7j02k9j88K13J57j86m3o7K7L99r2k18N4r4J30R2J18
4059B45j79j33j03P3J82J65L5l26k21J06K06K10q3l16p4Q4J02K12l8j58k02O9
4081a44J24L23j68o4l24N2M21j49N1j7m65k7K40M51Ql73m0r4L8M85k2r2m64j47
4105c97K32M09J26j39n42J92R2M0M27l07l22n9M8K67K68j30k70o48N35L52K64
4126D38j84l34l91L53M16J33j53k43m78j5N35L62j01m55r7j40L13L57o9j90l27
4147b70j36N47L4J58k89m44Q8L87L38m2j04m84j20J48N17J15k48l73k15J95M38
$$ y = [-113, -148, -187, -2, -52, 168, 2, -21, 11, -36, 38, 194, 13, 90, -38, -35, 89, 162, 149, -21, -70, -69, 39, -43, -36, 87, -138, -94, 129, -161, -136, 110, 58, -28, 23, -185, 19, 1, -25, -43, -66, -154, -5, -50, 170, 212, -29, -147, -58, 38, 193, -55, 59, 9, -132, 72, -46, 141, 74, -28, -57, -245, -32, 125, -61, -104, -171, -144, 255, 163, -55, -1, -95, 35, 127, 245, 66, -67, -170, -97, 85, 250, 285, -41, -262, -156, 50, 260, 177, -139, -213, -129, -27, 185, 147, -11, -213, -144, -20, 303, 135, 71, -253, -201, 220, 71, 122, 105, -360, -387, -147, 304, 312, -61, -101, -195, -157, 328, 306, 214, -250, -397, -165, 244, 370, 231, -311, -119, -27, 13, 440, 133, -189, -248, -200, 67, 335, 205, -65, -713, -178, 174, 438, 254, -80, -471, -118, 298, 431, 278, 35, -443, -458, 77, 439, 338, -117, -214, -354, -41, 316, 247, 57, -270, -406, 141, 175, 333, 44, -400, -312, 75, 413, 371, 267, -217, -337, -189, 328, 443, 195, -178, -393, -198, 240]
4168B40J12q9n03j39J37M42K68m12k37k33J14L70L12k30k92j90m6N21L19k41l61
4189a38k07j36N64M09j86o10k4P7L52L70j72k43m21P6J93L77K8m11k02r4L30L12
4211B44L9k36k72qK35M05j04k02n58K49%K42K70k33j59k75K34M19M5l59j16o2
4233b02J66J92L68k83l66k17L55Q1J22k8l75j34K44J88J22j92k48j8J22K23N4
4254A74J36m20j48j08L72L27k29o2k42j01J77M30O4m20p4r1J49L25J12l63k21
4275b13j98M76K8OO1l30K2J71K67rk46l07J90R3N5J51j24j12j44K20J20R2j23
4298A46j13l10K14R2J25j25n8l1j07P5K24q7j54o8J2J12K72l05k40K94K0NM4k08
4322a71K02Mk84J23J53N3p1j66O4j60J17J46q0J67j60M3J04j53J64j7k34R1j4
$$ y = [240, 352, 263, -240, -379, -242, 200, 468, 56, -181, -414, -300, 70, 382, 152, -140, -330, -376, 145, 464, 223, -138, -345, -481, 83, 492, 306, -304, -328, -251, 101, 471, 299, 56, -365, -289, -96, 281, 309, -102, -304, -398, -68, 244, 283, 47, -225, -233, 2, 407, 303, 101, -457, -208, -208, 34, 304, 71, -88, -363, -129, 290, 335, -24, -140, -202, -36, 156, 524, 241, -125, -342, 13, 94, 216, 188, -187, -321, -77, 111, 233, 41, -207, -225, -103, 120, 174, 310, -110, -258, -366, 6, 333, 104, 42, -200, -301, -124, 306, 370, -50, -124, -215, -66, 259, 371, 8, -213, -411, 65, 93, 99, 160, -170, -148, 23, 290, 281, 35, -272, -82, 11, 66, 217, 93, -19, -163, 57, 177, 269, 146, 33, -277, -63, 29, 154, 29, -29, -60, -167, -92, 132, 45, -109, -177, -165, -53, 219, -86, -326, -32, -12, -7, 37, -171, 31, 35, -249, -126, 27, 80, 9, -157, -93, -253, -136, 10, -70, 97, -63, -20, 84, -69, 95, 78, -156, -65, -79]
4345g9J41j49J71j98K57j98n1K5r6J81k6q2K32k36L3n3J15j8P1k23J68J5o6M9
4369a7N6r7pR5k6j11P4O7j27K54l6j97M4N8j35M31k07j72n8j03K90Jo0J85k16
4394a4j47P1J19O2j88j50O5R9K94J84l82k21R4J34N5J07j09j52j43R1L31j02J26
4417B24k76k32L38R4J58j34r8k26j16L14K11p6j29k87P2K50Q3J56m42qj25J85
4439f4J85L9m4k50r8K06J31l5J91n41j68L71K91p6l0k43j7J70L25m7k54l0k53
4462b41P5M46O1l36j67k09J65O7L73J05k08n59J21M29L3p2k79o8J07K32J48j66
4484E7k11r8NL39M03j78l31k98q6L18K98M7k50m52J34K46L36R2j42o31rK08L37
4507A34J18j57k43l4j15L92K06k09l68q6J13N32Q8l15k29J5MK00J98j11l21J6
$$ y = [-79, 62, -87, 84, -114, 143, -55, -106, -81, -177, 4, -22, -104, 128, -108, -75, -128, -13, -31, 40, -183, -15, 0, -66, -17, 39, -58, -65, 30, 4, -107, -33, 34, -93, 161, 125, -72, -28, 30, -105, 326, 119, -53, -111, -214, 76, 77, 17, 202, -14, -161, -90, 29, 91, -97, -247, -182, -83, 211, 395, 13, -208, -114, 20, 75, 182, 73, -79, -222, -131, 200, 98, 224, -52, -284, 54, 148, 306, 172, 74, -152, -268, 46, 257, 181, 52, -235, -163, 87, 170, 326, -116, -124, -249, -64, 121, 160, 116, -134, -232, -26, 105, 70, 261, -280, -448, -77, 214, 138, 108, -135, -152, 18, 343, 296, 42, 12, -241, -166, 280, 341, 5, -162, -371, -206, -139, 234, 339, 131, -428, -307, 122, 155, 83, -196, -264, -157, 75, 223, 57, -154, -252, -247, 92, 495, 317, -14, -312, -398, -80, 218, 265, 15, -437, -303, -57, 279, 371, 229, -402, -411, -203, 134, 252, 95, -148, -182, -297, 95, 301, 92, -276, -362, -249, 283, 371, 56, -173, -158, -154, 46, 244, 133, -188, -172]
4529a72p0K95K53r9l74j99J42L33J71J04m95k57L2M15K27j0l16k74J45J63L24
4550C38K1j85m80J13J5N91j05p2l70j86L50K94j47j04m02n2J68K08K84r0m77j6
4572c04K86J57J56j72k04j93O2N07O1j76l33k13J26M33P0j81j35k73J96J31J76
4593A77O5k80j04j67K86K97j82k3k45j53L07L98j70k09l65J70M36l8p5j62rm0
4615h6J49J78J2k02l1k33l5M28N7j61j99P3l4J06J48k40o6j09K83K20j64m3k30
4638a79J01O4K05J37l61Q4l7k32M74j42lk34O8q6R2J0l9J7m2J66k9nRJ3L9o6j11
4665h7P6J41p8pm6J89j33m4L4q1o4P3m6J09m1N1m1J85j08k42J12j3J12J4n0R5
4691A10q1k3J39k43J77j10p3Q9J05j60r2J58j21K42J4j51L5k42K16K7P3j35M4
$$ y = [-172, -242, 53, 306, 207, -167, -366, -224, 109, 280, 384, -111, -368, -336, 79, 306, 296, -20, -294, -149, 14, 338, 359, 174, -306, -193, -178, 413, 308, 236, -134, -320, 30, 324, 177, 73, -329, -381, -213, -5, 279, 189, -288, -304, -18, 139, 295, 123, -81, -274, -212, 295, 356, 180, -153, -366, -240, 193, 263, 82, -53, -326, -130, 1, 177, 242, -38, -142, -309, -23, 274, 92, 69, -176, -329, -22, 376, 206, -3, -368, -198, 238, 200, 125, -37, -46, -86, 63, 241, 253, 51, 20, -213, -248, 180, 237, 76, -123, -50, -84, 22, 170, -70, -136, -245, 38, 258, 94, 51, -179, -78, -14, 191, 328, -33, 51, 14, -218, 256, 114, 111, -123, -55, -141, -49, -39, -78, -61, -103, 63, 34, 29, 38, 51, 90, 24, -87, -11, 130, 52, 45, -1, 188, 55, 11, 45, -36, -100, -27, -73, 36, -5, 46, 5, 190, 82, -160, -48, -61, 51, 65, 15, 110, 29, 6, 145, -98, 79, -31, -104, -15, 90, -70, -162, -4, -125, 117, 131, -20, 15, -227, -11, 16, 89, -46, -2]
4714bj8l9J06j98K11j10OJ2j46K67r3L1l3J1o5O0q1Q4k1j42J98m2J96m7l71j48
4740c74L36J03l4o9l4n3l5J96J77K9j68k16jJ51K26r4k56j66K21rL15j3j20m42
4764c30J36J86K24Q5l06L2j29R6K92m7j69k50rJ73K96n6j39j69n8O3nK21L1m46
4788b78o4L04j1K71k72p3o5J54K85j2K8k38q8j54M03M9k26p0k37K88%J34L2k37
4812g7k00K63l4R4J65r3k28q5K64N3R5j99j24l2J46K57j01m03p5P9K29J55j31
4835A8K0j89r0K28J47R6j4j93l10K43L76k46L0k30j48J14L66J24j94l90PJ98J52
4858A15O0p5k20Mk9J48K09k2q3m31J81J78L0J95l93k57K16J25K09n4j95j33P2
4881a50m7M65j89r2j00q6K59K51r4j56j40r6J8K58J41j35l19j15K30O9M16l54
$$ y = [-2, -20, -59, 47, -151, 60, -50, -44, -32, -178, 89, -4, 27, -6, 5, -60, 0, -81, 3, -18, -160, 38, -4, 192, 145, -226, -374, -38, 65, 31, -38, -72, -125, -160, 36, 213, 242, 74, -142, -143, 8, 234, 140, -116, -282, -61, -70, 245, 232, 112, -330, -194, -8, 216, 301, -5, 27, -102, -6, 286, 239, 70, -180, -189, -16, 280, 224, 85, -84, -142, -79, -84, 137, 168, -278, -342, -38, -49, 222, -50, -123, -188, -34, 251, 239, 267, 29, -59, -213, 190, 239, 13, -57, -294, -6, -6, 128, 160, -77, -277, -14, -48, 46, 211, 118, -110, -195, 69, 122, 217, 18, -106, -138, 8, 265, 164, -239, -314, -235, -6, 149, 18, 38, -151, -241, -13, 134, 230, 216, 23, -287, -44, 332, 86, 116, -114, -262, -148, 218, 342, 148, -242, -235, -37, 115, 175, 100, -120, -116, -145, 3, 212, 190, 107, -324, -143, 35, 65, 260, -133, -390, -174, -49, 160, 106, -89, -222, -150, -197, 268, 79, -13, -113, -199, 60, 311, 217, 61, -79, -175, -157, 101, 242, 107, -212, -327, -97, -28, 388, 34]
4903C4q6p2L3K27j51q5O2j25K0M48n6j67k11pJ29LJ20m4kj34J0L17q9k66Q8k39
4929b43J98R4K54j70k28j37K7J57J46P5k23n7O1NJ16K59m14j24O3J77J35o3j9
4952H9k78k0N3J96O6r7k4n6J50l3K4J02k59L7j6J05l3L6m7j85J50J16j55J6N9
4977dq3j54M45j85OQj65L8J51j6J9r2j4J7P9J52l65J36j14O8j5K13o4rp6k2K51
5004B05j52J02j09j52J5%R3k9j54R3q7J95k9j7N5l7J0KL7k5o3j95K27J60k09j0
5030g4O2q0R7n6o6O5m3K1J88k0j45R6j30J68j28J93p1m9L6j52J21k8j0m6j11P7
5056h5J77R6j01j22k6L0O8J5m6L3j4j65J50kO8j33nM6p8L09k10k19O6K9O0J38
5082G9K34m14r2J82j0j22J77M3p6j07K50K4J61k70k33K38j20R2M1Q2k13n1J26
$$ y = [34, -52, -124, -91, 136, -15, -100, -38, -163, -143, 305, 249, 82, -129, -136, -7, -4, 116, 72, 70, -64, -54, 263, 174, -92, -4, -243, -45, 49, 303, 133, -95, -232, -205, -48, 98, 173, -50, -107, -46, -41, 75, 334, -80, -204, -141, 36, 171, 108, 89, -189, -209, -156, 40, 106, 9, -15, -71, 79, 46, 70, 172, -87, -50, -66, 39, 6, 42, -5, -190, -40, 76, -79, -63, -4, -87, -241, 204, 19, 25, 33, -132, -94, 57, 41, 60, -32, -46, -29, 50, 202, -163, -27, -141, -73, -88, 125, 61, 52, -24, -46, 205, 53, 155, 46, -106, -91, -91, 2, -27, -181, -88, -175, 20, -9, -26, 29, -8, 2, 4, 41, 16, -47, -242, -15, 145, -64, -74, -12, -92, 5, -51, -117, -52, -95, -74, 114, 94, -51, 45, -85, 83, -45, 148, 77, 28, 64, -88, 33, 5, -5, -51, -162, -85, 92, 188, 87, -35, -61, -31, 37, 52, 6, 39, 25, -140, 10, 8, 76, -57, -62, -16, -94, 215, 5, -214, -148, -119, -59, 79, 313, -101, -193, -11, -21, -143, 34, 77, 1, -106, 144, 168, 329, 59, -174, 64, -56, 36, 77, 159, -54, -105, 21]
5105B1Q0L7j11j44J31p1MK00r7j43k2QK25K6l33p2J94OK76p9N2j66j20J20N5j12
5131c5R7p8k94J31J90J56j03r5j78J54K43r0m9lk07m6L76r2J51j9k33j59K35K5
5155G7J63k82j1q2R5K51J5k53l43K28K2K88q6j90l5j3K00J05N0j84j56J04p2J44
5179C5K34k67q2JJ23qP0K9k99J06J55J14j53q3q1K5J5J28K1p3p7m9N0K08J02j89
5205E5j89O5j8J85kM7l18O5o0J67O0Rj61r2M2J18K4J45k94O8j80L64N2j25lj88
5231a64K17R1lj14l0O9k08K68R1k38J1N4k56J23K4J99R6k69j0j13J45J61r8j51
5255a05k0N7N5J14j88J2j33K78k6M1J0j62r4L28k18J27p1q3O1K6jL49l70n0p4
5280a37j5K26J24j42O2k79K27no9J61j22n4j9R8j13K38k13m2j0K36L5j01j44q7
$$ y = [21, 101, 138, 27, -117, 14, -57, -53, 147, 50, -93, -115, -107, 118, 144, -189, -261, -67, -61, 215, 136, 188, 22, -98, 22, 77, -35, 62, -16, -310, -179, 11, 167, 64, -31, -209, -55, 188, 98, 49, 46, -161, -207, 169, 77, 228, 209, -24, -183, 52, 77, 240, -42, -53, -135, -40, 211, 226, -27, -370, -142, -120, 168, 82, -108, -143, -156, 44, 149, 199, 15, -141, -37, -109, 35, 269, 2, -80, -79, 44, 36, 106, 135, -164, -58, 97, 211, 58, -25, -106, -81, -66, 62, 83, 10, -67, -116, -66, 142, 244, 55, -134, -69, -87, 98, 96, 143, -175, -110, -170, -3, 57, 66, -95, -187, -145, -27, -3, 142, -152, -84, -264, 100, 152, 27, 24, -164, 53, 144, 141, 27, -3, 66, -142, 126, 217, -21, -10, 44, -212, -89, -65, 134, 230, -39, -49, -162, -17, 144, 46, -105, -125, -68, -13, 101, -87, -75, -208, 70, 44, 85, 95, -67, -161, 167, -51, 76, 5, -78, -17, 9, 8, 357, -13, -63, -137, -152, 74, 198, 56, 118, -161, 66, 61, -8, 153, 31, -23, -42, 56, -57, 181, -32, -74, -84, 152, 187, 86, -58, -145]
5304a45J12P1M8J8j95j08K10j08J50j6K4j99M7M0K03p0j72J1L5n3K80j52J12J0
5328A53l29K09M9J14j77oo1L0p0K39J4j60j28J38K9l9O7mQ2j76J15J5J0j39M4
5353A9m7O3n1k5L2r4Q8L7j64L3l6J13P1p9J25j7l1K3o4L8m6QK1j26l9K48O8m8
5381A20j46l5J13j05j26J54r5J6J06P9Nj17n4J40n3J62j82L3j18k8K47L2q1q9
5405b2K81l48J3J65j01Q0L5k36J76MOR8k36J56j22J90r1j11m4j56J35J96j17q2
$$ y = [-145, -33, 38, 86, 104, -91, -199, 11, -97, 53, 37, 61, -138, -91, -51, 152, 82, -90, -79, -44, -97, 183, 31, 143, 153, -176, 33, 82, 196, 19, 13, -48, -18, -88, 151, 165, 5, -123, 15, 44, 5, 72, 68, 150, -26, 89, 104, 114, -25, 19, -28, 35, -16, -41, -9, -103, -15, 22, -142, -109, -145, -32, 39, -40, 85, 68, 37, 60, -4, 34, -12, -4, 17, -109, -148, 100, 168, 120, -26, -61, 52, -53, -179, -25, -120, -104, 2, 81, 86, -31, -85, 55, 2, 164, -18, 15, -103, -131, 116, 148, 67, -22, 259, -89, -76, 89, -12, 68, 103, -133, 43, 47, 53, 151, -85, 71, -51, 139, 48, -63, -107, -263, -128, 68, -49, -131]
$$ [...]
8191a89
##END NTUPLES=NMR FID
##END=
