##TITLE=1H_E3d0607-2
 CDCl3
 8 sc, 
 7.7.2023
##JCAMPDX= 6.0         $$ Bruker NMR JCAMP-DX V2.0
##DATA TYPE= NMR FID
##DATA CLASS= NTUPLES
##ORIGIN= UXNMR, Bruker Analytische Messtechnik GmbH
##OWNER= root
$$ XWIN-NMR		Version 3.5
$$ Fri Jul  7 14:31:50 2023 Russian Standard Time (UT+4h)  she@DPX200
##.OBSERVE FREQUENCY= 200.13135
##.OBSERVE NUCLEUS= ^1H
##.DELAY= (6, 6)
##.ACQUISITION MODE= SIMULTANEOUS
##.ACQUISITION SCHEME= undefined
##.AVERAGES= 8
##.DIGITISER RES= 18
##SPECTROMETER/DATA SYSTEM= spect
##.PULSE SEQUENCE= zg30
##.SOLVENT NAME= CDCl3
##.SHIFT REFERENCE= (INTERNAL, CDCl3, 0, 15.7039)
##AUDIT TRAIL= $$ (NUMBER, WHEN, WHO, WHERE, WHAT)
$$ ##TITLE= Audit trail, XWIN-NMR		Version 3.5
$$ ##JCAMPDX= 5.01
$$ ##ORIGIN= Bruker BioSpin GmbH
$$ ##OWNER= she
$$ F:/spectra/data/she/nmr/H-F/1/audita.txt
$$ ##AUDIT TRAIL=  $$ (NUMBER, WHEN, WHO, WHERE, WHAT)
(   1,<2023-07-07 14:30:37.45 +0400>,<she>,<DPX200>,
      <created by zg, POWCHK disabled, PULCHK disabled
       configuration hash MD5:
       00 E9 B6 7A A2 85 ED C7 34 08 36 98 17 FE 4E 26
       data hash MD5: 16K
       79 5C 22 3E 1D 6B 00 44 08 32 55 C5 11 0F E0 9A>)
$$ ##END=
$$ 
$$ hash MD5
$$ 86 16 5E 96 6D B1 24 EB 2F 68 4D B0 13 6F 30 E4
##$RELAX= 
##$RELAX= 
##$RELAX= 
##$RELAX= 
##$RELAX= 
##$RELAX= 
$$ Bruker specific parameters
$$ --------------------------
##$DU= <F:/spectra>
##$EXPNO= 1
##$NAME= <H-F>
##$PROCNO= 1
##$TYPE= <nmr>
##$USER= <she>
##$AMP= (0..31)
100 100 100 100 100 100 100 100 100 100 100 100 100 100 100 100 100 100 
100 100 100 100 100 100 100 100 100 100 100 100 100 100 
##$AQSEQ= 0
##$AQ_mod= 1
##$AUNM= <au_zg>
##$AUTOPOS= <>
##$BF1= 200.13
##$BF2= 200.13
##$BF3= 200.13
##$BF4= 200.13
##$BF5= 200.13
##$BF6= 200.13
##$BF7= 200.13
##$BF8= 200.13
##$BYTORDA= 1
##$CFDGTYP= 0
##$CFRGTYP= 5
##$CHEMSTR= <none>
##$CNST= (0..31)
1 1 145 1 1 1 1 1 1 1 1 1 1 1 1 1 1 1 1 1 1 1 1 1 1 1 1 1 1 1 1 1 
##$CPDPRG= <>
##$CPDPRG1= <>
##$CPDPRG2= <>
##$CPDPRG3= <>
##$CPDPRG4= <mlev>
##$CPDPRG5= <mlev>
##$CPDPRG6= <mlev>
##$CPDPRG7= <mlev>
##$CPDPRG8= <mlev>
##$CPDPRGB= <>
##$CPDPRGT= <>
##$D= (0..31)
0 1.2 0 0 0 0 0 0 0 0.06 0 0.03 0 0 0 0 0.0002 0 0 0 0 0 0 0 0 0 0 0 0 
0 0 0 
##$DATE= 1688725836
##$DBL= (0..7)
120 120 120 120 120 120 120 120 
##$DBP= (0..7)
150 150 150 150 150 150 150 150 
##$DBP07= 0
##$DBPNAM0= <>
##$DBPNAM1= <>
##$DBPNAM2= <>
##$DBPNAM3= <>
##$DBPNAM4= <>
##$DBPNAM5= <>
##$DBPNAM6= <>
##$DBPNAM7= <>
##$DBPOAL= (0..7)
0.5 0.5 0.5 0.5 0.5 0.5 0.5 0.5 
##$DBPOFFS= (0..7)
0 0 0 0 0 0 0 0 
##$DE= 6
##$DECBNUC= <off>
##$DECIM= 32
##$DECNUC= <off>
##$DECSTAT= 4
##$DIGMOD= 1
##$DIGTYP= 9
##$DL= (0..7)
0 120 120 120 120 120 120 120 
##$DP= (0..7)
150 150 150 150 150 150 150 150 
##$DP07= 0
##$DPNAME0= <>
##$DPNAME1= <>
##$DPNAME2= <>
##$DPNAME3= <>
##$DPNAME4= <>
##$DPNAME5= <>
##$DPNAME6= <>
##$DPNAME7= <>
##$DPOAL= (0..7)
0.5 0.5 0.5 0.5 0.5 0.5 0.5 0.5 
##$DPOFFS= (0..7)
0 0 0 0 0 0 0 0 
##$DQDMODE= 0
##$DR= 18
##$DS= 0
##$DSLIST= <SSSSSSSSSSSSSSS>
$$ [...]
##$SUBNAM2= <"">
##$SUBNAM3= <"">
##$SUBNAM4= <"">
##$SUBNAM5= <"">
##$SUBNAM6= <"">
##$SUBNAM7= <"">
##$SUBNAM8= <"">
##$SUBNAM9= <"">
##$SW= 18.05172834244
##$SWIBOX= (0..15)
0 0 2 0 0 0 0 0 0 0 0 0 0 0 0 0 
##$SW_h= 3612.71676300578
##$TD= 16384
##$TD0= 1
##$TE= 0
##$TE2= 300
##$TE3= 300
##$TEG= 300
##$TL= (0..7)
0 120 120 120 120 120 120 120 
##$TP= (0..7)
150 150 150 150 150 150 150 150 
##$TP07= 0
##$TPNAME0= <>
##$TPNAME1= <>
##$TPNAME2= <>
##$TPNAME3= <>
##$TPNAME4= <>
##$TPNAME5= <>
##$TPNAME6= <>
##$TPNAME7= <>
##$TPOAL= (0..7)
0.5 0.5 0.5 0.5 0.5 0.5 0.5 0.5 
##$TPOFFS= (0..7)
0 0 0 0 0 0 0 0 
##$TUNHIN= 0
##$TUNHOUT= 0
##$TUNXOUT= 0
##$USERA1= <user>
##$USERA2= <user>
##$USERA3= <user>
##$USERA4= <user>
##$USERA5= <user>
##$V9= 5
##$VALIST= <valist>
##$VCLIST= <CCCCCCCCCCCCCCC>
##$VD= 0
##$VDLIST= <DDDDDDDDDDDDDDD>
##$VPLIST= <PPPPPPPPPPPPPPP>
##$VTLIST= <TTTTTTTTTTTTTTT>
##$WBST= 1024
##$WBSW= 4
##$XGAIN= (0..3)
0 0 0 0 
##$XL= 0
##$YL= 0
##$YMAX_a= 242343
##$YMIN_a= -333267
##$ZGOPTNS= <>
##$ZL1= 120
##$ZL2= 120
##$ZL3= 120
##$ZL4= 120
##$ABSF1= 10
##$ABSF2= 0
##$ABSG= 5
##$ABSL= 3
##$ALPHA= 0
##$AQORDER= 0
##$ASSFAC= 0
##$ASSFACI= 0
##$ASSFACX= 0
##$ASSWID= 0
##$AUNMP= <proc_1d>
##$AZFE= 0.1
##$AZFW= 0.1
##$BCFW= 1
##$BC_mod= 2
##$BYTORDP= 1
##$COROFFS= 0
##$CY= 11.3945322036743
##$DATMOD= 1
##$DC= 2
##$DFILT= <>
##$DTYPP= 0
##$F1P= 15.7292609196834
##$F2P= 12.9074282941183
##$FCOR= 0.5
##$FTSIZE= 0
##$FT_mod= 4
##$GAMMA= 1
##$GB= 0.15
##$INTBC= 1
##$INTSCL= 1
##$ISEN= 128
##$LB= 0.24
##$LEV0= 0
##$LPBIN= 0
##$MAXI= 10000
##$MC2= 0
##$MEAN= 0
##$ME_mod= 0
##$MI= 1.114404
##$NCOEF= 0
##$NC_proc= 0
##$NLEV= 6
##$NOISF1= 3.799351
##$NOISF2= 2.8
##$NSP= 1
##$NTH_PI= 0
##$NZP= 0
##$OFFSET= 15.70392
##$PC= 1
##$PHC0= -20984.9
##$PHC1= 5.652719
##$PH_mod= 1
##$PKNL= yes
##$PPARMOD= 0
##$PSCAL= 0
##$PSIGN= 0
##$REVERSE= no
##$SF= 200.130013532006
##$SI= 16384
##$SIGF1= 3
##$SIGF2= 2
##$SINO= 400
##$SIOLD= 16384
##$SREGLST= <1H.CDCl3>
##$SSB= 0
##$STSI= 0
##$STSR= 0
##$SW_p= 3612.71676300578
##$SYMM= 0
##$S_DEV= 0
##$TDeff= 0
##$TDoff= 0
##$TI= <>
##$TILT= no
##$TM1= 0
##$TM2= 0
##$TOPLEV= 0
##$USERP1= <user>
##$USERP2= <user>
##$USERP3= <user>
##$USERP4= <user>
##$USERP5= <user>
##$WDW= 1
##$XDIM= 8192
##$YMAX_p= 0
##$YMIN_p= 0
$$ End of Bruker specific parameters
$$ ---------------------------------
##NTUPLES= NMR FID
##VAR_NAME=  TIME,          FID/REAL,        FID/IMAG
##SYMBOL=    X,             R,               I
##VAR_TYPE=  INDEPENDENT,   DEPENDENT,       DEPENDENT
##VAR_FORM=  AFFN,          ASDF,            ASDF
##VAR_DIM=   8192,          8192,            8192
##UNITS=     SECONDS,       ARBITRARY UNITS, ARBITRARY UNITS
##FACTOR=    0.0002768,     1,               1
##FIRST=     0,             0,               0
##LAST=      2.2672688,     0,               0
##MIN=       0,             -333267,         0
##MAX=       2.2672688,     242343,          0
$$ Real data points
##PAGE= N=1
##DATA TABLE= (X++(R..R)), XYDATA
$$ [...]
1837c29L56J374l56k371j25J303k60J222J225k970j080K153J31R1J406j932j344
$$ -329 27 1401 1045 -1326 -1451 -148 -408 814 2039 -931 -2011 142 273 364 1770 -162 -1506
1854a506J407J53P03J182j749j703J169J064m10N19j05k207L23J645l93Q34m52
$$ -1506 -99 54 757 1939 190 -1513 -344 720 310 829 724 -1483 -1160 485 92 926 474
1871D74k259R18J633q28M20N51j979m03J702O27m64K95p55j350J831O53j087J113
$$ 474 -1785 -867 766 -62 358 909 -1070 -1473 229 856 392 687 -68 -1418 413 1066 -21 1092
1889A092r31j707J616R86j049K60j9j096L14R37k8k80M5r33K8J583n73q94J124
$$ 1092 161 -1546 70 1056 7 267 248 -848 -534 403 375 95 140 -793 -765 818 245 -649 475
1908D75r05n38J427K07o44l2k76Q4O48J50m17k64M5k22M68P60q64l79K13o02J117
$$ 475 -430 -968 459 666 22 -10 -286 -202 446 596 179 -85 -40 -262 206 966 102 -277 -64 -666 451
1929D51J58j204Q20J36j463J145R62j144p69J051j93o74J037L00j613R47N82r06
$$ 451 609 -595 225 361 -1102 43 1005 -139 -908 143 -50 -724 313 613 -1000 -53 529 -377
1947c77J075j62j343N22J021m03r5K18m39o08O15P42n83j02k29n83O82M21k04
$$ -377 698 536 -807 -285 736 333 238 456 17 -591 24 766 183 81 -148 -731 -49 372 168
1966A68r4k14o28J44P71P84r29r21Q81p3m43J142K34j343j47P31K40j26P14p78
$$ 168 74 -140 -768 -624 147 931 2 -919 -38 -111 -554 588 822 -521 -668 63 303 177 891 113
1986A13j026J143N24j127J042k43j860Q01J598n83r28P59m32j272J509J411j631
$$ 113 -913 230 754 -373 669 426 -1434 -633 965 382 -546 213 -219 -1491 18 1429 -202
2003b02j55N6q79J185R86o95n25j95o9P4J258N72j491q89R78l01M06J091p46j238
$$ -202 -357 -301 -1180 5 991 296 -229 -424 -493 -419 839 1411 -80 -969 9 -292 114 1205 459 -779
2023g79m8Q31L26R3M58j205j284J792J23p34J348o18j935R84J844j215l40Q41
$$ -779 -827 4 330 423 881 -324 -1608 184 307 -427 921 303 -1632 -648 1196 -19 -359 482
2041D82r74q81K021O53j758P06p2j513J880J080j731j28L29n98j88J890J46k252
$$ 482 -492 -1373 648 1301 -457 249 177 -1336 544 1624 -107 -235 94 -504 -692 1198 1344 -908
2059i08j6Q44n26R08R77j673o61M08L32O03O99m45j661k45J576P6j22J106j098
$$ -908 -924 -80 -606 302 1279 -394 -1055 -647 -315 288 987 542 -1119 -1364 212 288 166 1272 174
2078A74j660J256J177p44N9K71q74p21J826J60j188R08p60j333J718Q39j718L78
$$ 174 -1486 -230 947 203 262 533 -341 -1062 764 924 -264 644 -116 -1449 269 1108 -610 -232
2096b32N81j116p9J885m58j877J039L98j162J524P17j901Q0P69m56N24J046p48
$$ -232 349 -767 -846 1039 581 -1296 -257 141 -1021 503 1220 -681 -601 168 -288 236 1282 534
2114E34j501O31P22l78L96Q26j588q78J132N12l9l3q9j055l38J440J07m87L72
$$ 534 -967 -336 386 8 404 1230 -358 -1236 -104 408 369 336 247 -808 -1146 294 401 -86 286
2133B86o09j091J460P78r89N3N58j029l57J893r1j600Q69K59j355J326R45j836
$$ 286 -323 -1414 46 824 -165 -112 446 -583 -940 953 862 -738 131 390 -965 361 1306 -530
2151e30J60P69r40K3J761q64j597J175O67j549J183R09k127J04J472r44J28R57
$$ -530 -370 399 -541 -518 1243 379 -1218 -43 624 -925 258 1167 -960 -856 616 -328 -200 757
2169G57p72o79M68N89m99M11N51j472k57J739l02n85L86l44n52J02R54Q9p48K41
$$ 757 -15 -694 -226 363 -136 275 826 -646 -903 836 534 -51 335 -9 -561 -459 495 584 -164 77
2189G7l82m91J168l5n96K92k84k57Q8P36R0r55M52M60j171P21O77o79l2O82p77
$$ 77 -305 -796 372 337 -259 33 -251 -508 -420 316 406 -549 -97 363 -808 -87 590 -89 -121 561 -216
2210b16J45N37q9p64L99N01r33M36N78j079j92J235p31l65R03k46o07J67O14k98
$$ -216 -71 466 377 -387 12 513 -420 16 594 -485 -677 558 -173 -538 365 119 -488 -321 293 -5
2230ej64M16n91m04J202k98l67O88l44n94L43M61J7l62J74j29l17L82L09m10L02
$$ -5 -169 247 -344 -748 454 156 -211 477 133 -461 -118 343 360 -2 172 43 -274 108 417 7 309
2251C09m28l07L30K28k9Q9k90j18l74L92P15n10m05J97J26n7K35K74l05l94K81
$$ 309 -119 -426 -96 132 103 192 -98 -216 -590 -198 517 7 -398 -201 -75 -132 103 377 72 -322 -41
2272d1K08q9L90k53n30O25l57R4N01l82n72J17N05k7j29J55j89p22P13J63k87
$$ -41 167 78 468 215 -315 310 -47 47 548 166 -406 -289 216 189 60 215 26 -696 17 180 -107
2293a07L75l38o83O82J84n0J78l58j31j0M92K86m08j5k09k80O99q9j48L57p19
$$ -107 268 -70 -753 -71 113 63 241 -117 -248 -258 234 520 112 97 -112 -392 307 218 70 427 -292
2314b92J57K14K0L52l10m58O2J67p8N62n82Rl77K43P23k15p0L1p77O27L06l6L76
$$ -292 -135 79 99 451 141 -317 -255 -88 -166 396 -186 -177 -554 -311 412 197 127 158 -619 8 314 278 654
2337F54p41l20M66K41J45l30J02j41o51P40L44n18J11j31p32Q08K77l10N1n10
$$ 654 -87 -407 59 300 445 115 217 76 -575 165 509 -9 102 -29 -761 47 324 14 65 -445
2357d45l2K77M38k1m90K58j71j86N82J27k39J51p27R4P72j74oJ45m47k13M19L56
$$ -445 -477 -200 238 217 -273 -15 -186 -372 210 337 98 249 -478 -384 388 214 208 353 -94 -307 112 468
2379D68k21m17K04l74J12M93j07k97J67o70K76P53l40K7k31l82L23J43K18j12
$$ 468 247 -170 34 -340 -228 265 158 -139 28 -642 -366 387 47 74 -157 -539 -216 -73 145 33
2399C3K4j45k96P49M61q77J29J55q92O16P35m47k83J8k60K47J83K11m96j56R3
$$ 33 57 -88 -384 365 826 -51 78 233 -659 -43 692 245 -38 -20 -280 -33 150 361 -135 -291 -198
2420a98k13M47M96q14k7L00k68L82K92k97M1k86P8M31J49l05l74m4J16l4N03J00
$$ -198 -411 36 532 -282 -309 -9 -277 105 397 100 141 -145 -67 364 513 208 -166 -210 -94 -128 375 475
2442D75n30j62j09K53M39l35q9r1n57N81M83j32k19k54j1p9M86J82n44PL41q73
$$ 475 -55 -217 -326 -73 366 31 -58 -149 -706 -125 358 226 7 -247 -258 -337 149 331 -213 -206 135 -738
2464g38P68Q57j131o1N42m22K33M64j05n89m5N28m22M45L16j349K06N90j74K84
$$ -738 30 887 -244 -305 237 -185 48 512 407 -182 -227 301 -121 324 640 -709 -503 87 -87 197
2484A97M17p82l15J77M25J7L7k1l97k33Q47k11k4L30p26M0M12K17q6k04j17p7
$$ 197 614 -168 -483 -306 119 136 173 152 -245 -478 369 158 134 464 -262 -222 190 407 321 117 0 -77
2506g7k87O88M09r85P4J48j78J00L60J00p91K07M20m45M13L69j038o2R99m78k02
$$ -77 -364 324 733 -252 -178 -30 -208 -108 252 352 -439 -232 188 -257 156 525 -513 -575 424 -54 -256
2527b56Q28n59q88Q57N30l29k7J89p78n0J100l97m23N72m77o84R63J97n96k8L59
$$ -256 572 13 -875 -18 512 183 156 345 -433 -483 617 220 -203 369 -108 -792 171 368 -228 -256 103
2548A03n14qR53l45q19O58j10l06P45r9l76j62L75n3j47M46p8p53M00M25l61o8
$$ 103 -411 -419 534 189 -630 28 -82 -388 357 258 -118 -280 95 42 -105 341 263 -490 -90 335 -26 -94
2570i4N84m76l15M21K16m32J81O0o44o1J052m56k24M75o29m04Q27L96n05j35L69
$$ -94 490 14 -301 120 336 -96 85 145 -499 -560 492 36 -188 287 -342 -746 81 477 -28 -163 206
2591B06m21l13J216l22o91O45k99n10P70M15q08J52O4k87k87J059k68j025O08
$$ 206 -215 -528 688 366 -325 320 21 -489 281 696 -112 40 104 -183 -470 589 321 -704 -96
2610i6J52n06P43J42p21R7P9j64J60L26Np14M35K40m59L16N67r76M8O72j19k39
$$ -96 56 -450 293 435 -286 -189 -110 -274 -114 212 217 -497 -62 178 -281 35 602 -374 -326 346 227 -12
2632a2L04p5n36m2P61k53k92N52p13k14Q55p4j57j59lm42J68N79M1o14K94J0n64
$$ -12 292 217 -319 -361 400 147 -145 407 -306 -520 335 261 104 -55 -58 -500 -332 247 288 -326 -32 -22 -586
2655e86Q08K48m37n8L5j20J3N85J55r94K01M48o79Q16K20q79j34M33k41J51K72
$$ -586 222 470 33 -25 10 -110 -97 488 643 -351 -150 298 -381 435 655 -224 -358 75 -166 -15 257
2676B57p6r14L71N25k26L71L80j161j78Q36k84J48L17m97m32L18O76l84Q0K41
$$ 257 181 -733 -362 163 -63 308 688 -473 -651 185 -99 49 366 -131 -563 -245 431 47 127 368
2696C68p62n3R66j88k50O5m79l8L85M51k20l57m44K66nO93J93r02j19O7K84L07
$$ 368 -394 -447 519 331 81 146 -333 -371 14 465 245 -112 -556 -290 -295 398 591 -311 -430 -363 -79 228
2718B28K74J4j137M0P79j08L90J28r64j87N83K17K32N2o54m49J77Q44j83N5j18
$$ 228 502 516 -621 -581 198 90 480 608 -356 -543 40 257 489 541 -113 -562 -385 459 276 331 213
2739B13p47l3R66r7j99R1p09j38O90O03l47k21l40m42L82R79j02m75l62k70M73
$$ 213 -534 -567 399 302 103 194 -515 -653 37 640 293 72 -268 -710 -328 651 549 74 -288 -558 -85
2760h5P46k14p7q22j27L58N51L26j90p84m93L51P91K07k05m75p49J08J056M02
$$ -85 661 447 370 -452 -579 -221 330 656 466 -318 -811 -460 331 538 333 -142 -891 -783 273 675
2780F75m65j10r42m4J160K98j94l28l95l77N50R42j33l50m14o11M89R81p8n41
$$ 675 210 100 -842 -886 274 572 378 50 -345 -722 -172 770 637 287 -127 -738 -249 732 654 113
2800A13k33n61J30J016K02n35m85n14K33R04N90n52o88j68m3P52P80n51p49j73
$$ 113 -120 -681 -551 465 667 132 -353 -867 -634 270 860 308 -380 -548 -591 161 941 390 -359 -532
2820e32j06Q84P51l86n67n91l9O54O84O7r43k93j46J99R79O6q00l38l39J82J330
$$ -532 -638 246 997 611 44 -547 -586 68 752 819 -124 -417 -563 -364 615 681 -119 -457 -796 -614 716
2841G16K45j027l95k53M74N59N34m29q98j50J52P56O04m46p34k51J18L97Q94l29
$$ 716 961 -66 -461 -714 -240 319 853 424 -474 -624 -472 284 888 442 -292 -543 -425 -28 866 537
2861E37p37l74Q6N22O63J21r10o85K39N29M95L22q94o04K9L90O79L09p25n59J0
$$ 537 -200 -574 -488 34 697 818 -92 -777 -538 -9 486 808 -86 -690 -661 -271 408 717 -8 -567 -557
2882e57K08Q81K55m89q97J9M01N33M85k37r77j51L59J95P14r1r83M8k8K65N33
$$ -557 -349 532 787 298 -599 -580 -179 354 839 602 -375 -526 -167 28 742 651 -332 -284 -312 -47 486
2903D86j11n58m63P4O20R1M26n41q41M34M22K28K86l93p34K13K67M47J12j82m54
$$ 486 375 -183 -646 -572 48 139 565 24 -817 -383 39 267 553 160 -574 -361 -94 353 465 283 -171
2924a71k03N07J69p7J68n43l78M74K05J65J8o26k08L29K30K72j98l45j00J6K15
$$ -171 -374 133 302 225 393 -150 -528 -54 151 316 334 -292 -500 -171 59 331 133 -212 -312 -296 -81
2945h1M54l09Jm53L86J76j02L47k2p65J68K09q3L45j3m44j11K78J9n2L13k01n89
$$ -81 373 64 65 -388 -2 174 72 419 397 -368 -200 9 -74 271 258 -186 -297 -19 0 -52 261 60 -529
2968e29M70J19j76K93J70q53L42L29j73J59K3j53k62K83L06k34R0Ko15L12L84
$$ -529 -59 60 -116 177 347 -506 -164 165 -8 151 174 21 -241 42 348 114 204 206 -409 -97 287
2989B87l30L43k6l01j52j37M40J93l25m7k82l2K79J93J1j49j00j29R5L88K32o38
$$ 287 -43 300 274 -27 -179 -316 124 317 -8 -55 -337 -369 -90 103 114 -35 -135 -264 -169 219 451 -187
3011a87k9N3j81Q11N6l50k78j51J01L32K19N4q69J57K46KM39O0r18o5K67K33L27
$$ -187 -216 -163 -344 467 523 173 -105 -256 -155 177 396 450 -419 -262 -16 -14 425 485 -433 -498 -231 2 329
3034C29Q9p03l13Q3O73J64Kj54q53J89P59J76k5k68n28l66N03O88K52o05l60k79
$$ 329 418 -285 -598 -515 158 322 324 170 -683 -494 265 441 416 148 -380 -746 -243 445 697 92 -268 -547
3056e47K2J127K4n92l30l67K23M93N59k76p86j13K99R6Q12l3j033l77N16J65P60
$$ -547 -525 602 626 34 -296 -663 -440 53 612 336 -450 -563 -264 -168 644 611 -422 -799 -283 -118 642
3077F42K2p07n69K9Q61K63J65l62j197K01P31L37L41n05p83l65P34Q65k33m00
$$ 642 664 -43 -612 -583 278 541 706 344 -853 -652 79 416 757 252 -531 -896 -162 703 470 70
3097G0m21o27N57R45O9m52m28n36L11J028L56m12q11k25K02M18R04k74r92j99
$$ 70 -351 -978 -421 524 593 141 -287 -823 -512 516 872 460 -351 -576 -374 44 948 674 -318 -517
3117e17J90M25P94l01o90n62J04N59N33J43k75j191oP81K20M26n06p28k71N82
$$ -517 -327 98 892 591 -99 -661 -557 2 535 678 403 -788 -794 -13 207 633 127 -601 -872 -290
3137b90P49J98l73o72n17O02R35m1k42l77p49K62J063J93m93n79k67J48N62R64
$$ -290 459 657 284 -388 -905 -303 632 591 349 -28 -777 -515 548 741 248 -331 -598 -450 112 1076
3157A076o00j021K1r1P04Q19k99r24l20J83M04N60L38p80r00L60M69N79K44p04
$$ 1076 476 -545 -524 -615 89 908 609 -315 -635 -452 -48 512 850 70 -830 -470 -1 578 822 118
3177A18q40P1P12M03R4k74p40l46P16O65j07l09l87m65K30R25P5j95p83k30J84
$$ 118 -722 -651 61 464 558 284 -456 -802 -86 579 472 163 -224 -689 -459 466 541 346 -437 -667 -483
3198d83O08O33l48q59j9L0N95M43r4o46m82J31P16J62L41n62q09K29O26K2L11
$$ -483 125 758 410 -449 -468 -438 157 600 506 -140 -622 -491 225 387 728 166 -643 -414 212 234 545
3219E45m12q20J99N03N07k01k73l81l28O09M10j38j05l46n44N19O10K85n20l15
$$ 545 133 -687 -488 15 522 321 48 -333 -661 -52 358 220 115 -231 -775 -256 354 639 119 -196
3239a96k12J25N88L83m77l06j85j17M94L89j99l13m07Q3N12J00ll86m47L21K57
$$ -196 -408 -283 305 688 211 -95 -280 -397 97 486 287 -26 -433 -350 162 262 259 -127 -574 -253 4
3260DL56j4m76j82p3K80M32k77N4m56LL01L99j37M8l52j79K30J96K06k40m23K15
$$ 4 360 346 -130 -312 -385 -105 327 50 104 -352 -349 -48 351 214 262 -90 -269 -39 157 363 123 -300 -85
3283h5lM4N80n58P2k61r0M15K18k49j04k10rJ19K78Qk03j42J1K91n3P7l07K05
$$ -85 -88 -44 536 -22 50 -211 -301 114 332 83 -21 -231 -240 -121 157 165 -38 -180 -169 122 69 146 -161 44
3307D4j97L3J77J39j89Ml76L37J53l1o3R8k71K4J8l1J16n4J25p2O6j5k6j1l0q5
$$ 44 -153 -120 57 196 7 11 -365 -28 125 94 31 129 -142 -118 -100 -131 -15 -69 56 -16 50 35 9 -2 -32 -117
3333a17J98o9No9N7j14k24L07K48mj29o5k17J65j4P8N5m6k50P8L32Q5j71p9j59
$$ -117 81 12 17 -52 5 -109 -333 -26 222 218 89 24 -193 -28 -42 36 91 45 -205 -127 205 290 119 40 -119
3358a19j44K4N91ml97l2k50K31K86R1q5k09k46J99L23R8j30l95qO7L37J94k66
$$ -119 -263 -239 352 348 -49 -81 -331 -100 186 277 192 -17 -263 -64 259 357 227 -168 -176 -109 228 422 156
3381A56l07k36K9N20J96j23k42n15K27M59j9K36l06n62R7M30L93k26l32m2k04
$$ 156 -151 -387 -358 162 358 235 -7 -522 -295 164 145 381 75 -487 -390 40 433 207 -125 -167 -371
3402c71L96M66j63l38j56k85M62L95n7l20m67J89J13L69K98l94m96rR9N81J21
$$ -371 25 491 328 -10 -166 -451 11 406 349 29 -438 -249 -136 233 531 137 -359 -368 -269 312 433
3423D33m29j39m38J73N56N20l90n77r7k9O46K28N0p08k79J83N03K46l0m91k49
$$ 433 4 -135 -573 -400 156 676 286 -291 -388 -417 229 457 507 -201 -480 -297 206 452 422 -69 -318
3444c18l7L29N65L7n31m96jN35L42Ro22l09J55J49N80K46m91n97J47J11M80L41
$$ -318 -355 -26 539 576 45 -451 -452 83 425 434 -188 -497 -342 -193 387 633 142 -455 -308 -197 283 624
3466F24n15n88q9M39M06L35l60n28k82N14L16J98q2p24o2O8N39L12k73o04j09
$$ 624 109 -479 -568 -129 277 612 252 -276 -558 -44 272 470 388 -336 -398 -330 209 521 248 -356 -465
3487d65j81O83O72l10m54l56r4N88L78j8m49n71L74J40N18K40p49m19K28P8L28
$$ -465 -646 37 709 399 -55 -411 -505 83 461 443 -6 -577 -203 -63 455 695 -54 -473 -245 -167 161
3508A61K64l55l98o4K82L11K99l05p36PM83M31o6r4n25l49M63K94L43j57m07k19
$$ 161 425 70 -328 -392 -110 201 500 195 -541 -534 -51 380 314 220 -305 -654 -191 103 446 289 -118 -337
3530c37O8M20L45j79k73n89K10N20K99r5n00q5N0Q9L22K95o17m91L26Q6L91J90
$$ -337 -269 151 496 317 44 -545 -335 185 484 389 -111 -196 -146 -57 265 560 -57 -548 -222 -136 255 445
3552D45l84k74p6L23K17K09k83o68J07N95P9r0K9m40j50L56K21J88l15j97j77
$$ 445 61 -213 -289 34 251 460 177 -491 -384 211 290 200 229 -211 -361 -5 216 404 89 -108 -285
3573b85J7N48J6k67k25k3j28M91K63k88k55j74O9K04K53J83n36k19J22J57M91
$$ -285 -268 280 296 29 -196 -219 -347 144 407 119 -136 -310 -241 -37 216 399 -137 -356 -234 -77 414
3594D14j08l36j31R5N8K90j9m5n43J2M42J37l3k27k27o1L62P0Km15J52k34K16
$$ 414 306 -30 -161 -66 -8 282 263 218 -325 -313 129 266 233 6 -221 -282 80 150 152 -263 -111 -345 -129
3617a29K90r7K5N0l59j05N35N5k40L1j27N0r1L74n9k43J42p9k74M76J77n13J70
$$ -129 161 64 89 139 -220 -325 210 265 25 56 -71 -21 -112 262 203 -40 102 23 -251 225 402 -111 59
3640E9k49P2K70j62J37l32K1L9R1K1J71j64n2rR5K09k09K18j70k29J63J4j78M00
$$ 59 -190 -118 152 -10 127 -205 -184 -145 -54 -33 138 -26 -78 -87 8 217 8 226 56 -173 -10 4 -174 226
3664B26k83j92K17Q8J42j22J05j32j78J19P5n9J42j13k87J33J70k81N27l14Rk12
$$ 226 -57 -249 -32 56 198 76 181 49 -129 -10 65 6 148 35 -252 -119 51 -230 297 -17 -8 -220
3686b20K48O5J2j61Q8m18M43K90l34N6r0j28O3J64n0Q3j43j43k5K72L22j84l89
$$ -220 28 93 105 -56 32 -386 57 347 13 69 -21 -149 -86 78 28 111 -32 -175 -200 72 394 210 -179
3709a79Q9j44N3M30k0l18j02J64o3J21M90m59k60R3q4L42P0J13k83m17J86L82
$$ -179 -90 -234 -181 249 229 -89 -191 -27 -90 31 521 62 -198 -105 -189 153 223 336 53 -364 -178 204
3731B04J56Mn92j85L54J46J49o8n35k64M73L66P6Kl25l97K34L24L05J9o42k37
$$ 204 360 364 -228 -413 -59 87 236 168 -367 -631 -158 208 284 286 -39 -436 -202 122 427 446 -196 -433
3753d33J0O10K07Q9o44k54n7L82K79K10l93n80L16K18L29R2q2n89k34M09M36L6
$$ -433 -423 187 394 483 -161 -415 -472 -90 189 399 6 -574 -258 -40 289 381 299 -290 -524 -115 321 357
3775C57l06k65l99M61L69L34j87m81m13K30N37J32po50j75n4Q01L07m57k30l93
$$ 357 51 -214 -613 -152 217 551 364 -117 -530 -300 237 369 362 -288 -463 -517 284 591 134 -96 -489
3796d89K57L45M74k12n07j86m0M74K63J5o63n4jK36M26J69n00l34j66M59N42N6
$$ -489 -232 113 587 375 -132 -318 -358 116 379 394 -269 -323 -324 -88 338 507 7 -327 -493 -34 508 564
3818E64m54l51j01K11M93J22j05q39q2K96N21K94l77m92j09R9N22L88j89o44l41
$$ 564 110 -241 -342 -131 362 484 379 -460 -542 -246 275 569 192 -300 -409 -310 212 600 411 -233 -574
3839e74K05P94J20m21m54k82L38K67M95Q4n32m08j9L47L74M27n20n72k22O09M75
$$ -574 -369 425 545 124 -330 -612 -274 -7 488 572 40 -368 -387 -40 334 761 241 -331 -553 56 531
3860E31Ll82n95p2M06M80J29l60n98j06L11M50L15l19m96R7o1M42J72K6o02j46
$$ 531 534 152 -443 -515 -109 371 500 140 -458 -564 -253 197 512 193 -303 -206 -267 175 347 373 -229 -375
3882c75J27L27L60k79l81j06K62K53L43k21l39m02J82L30K80J6m74l42L9M10L89
$$ -375 -248 79 439 160 -221 -327 -65 188 531 310 -29 -431 -249 81 361 377 -97 -439 -400 10 399
3903C99r5m47k27p1M53J40P2j15l38p3J30N36p0k87k44N3p3N21J09n22jj34J63
$$ 399 304 -143 -370 -441 12 152 224 109 -229 -302 -172 364 294 7 -237 -184 -257 264 373 -149 -150 -284 -121
3926a21M59o2j29k86k63L00K36M8P5n26M9l6M32N3O4k95k45l6K16L29j64L6k15
$$ -121 338 276 147 -139 -402 -102 134 182 257 -269 -220 -256 176 229 293 -2 -247 -283 -67 262 98 134 -81
3949h1L8J04K14p2j24j52j93K92R9l1O0k35p0J82K37j70j31l2j18K52N9q1L5p0
$$ -81 -43 61 275 203 79 -73 -266 26 125 94 154 -81 -151 31 268 98 -33 -65 -183 69 128 47 82 12
3973A2j24P9K29j61M1k67j8J25J26J00k26j3J02J00k5l5K54j99q8o5O4j17J11
$$ 12 -112 -33 196 35 76 -191 -209 -84 42 142 -84 -97 5 105 80 45 299 100 12 -53 11 -106 5
3996EM0k19K39j32j5L7M9j04K48l05J82j09R3J83j02m4m6l3n8J80n0p4p6J03l2
$$ 5 45 -174 65 -67 -82 -45 4 -100 148 -157 25 -84 9 192 90 46 0 -33 -91 89 39 -35 -111 -8 -40
4021d0R0j75M3J66n5j23J78K8k50K10n7J7mJ2p7Q4j5k10J75K17L6l54q1P3R1J19
$$ -40 50 -125 -82 84 29 -94 84 112 -138 72 15 32 28 40 -37 47 32 -178 -3 214 250 -104 -185 -112 -21 98
4047I8j36K09k83p0K83J66j70L2k83NjL18J11k88Q5j16R6j4J50n8l39j3R8L05
$$ 98 -38 171 -112 -182 101 267 97 129 -154 -149 -150 168 279 -9 76 -40 56 42 192 134 -205 -218 -120 185
4071A85N3k60l4l05L45N1nQ3j44j85K40J81J85k21l10j17J05K95pN9k74k06J34
$$ 185 238 -22 -56 -361 -16 35 30 113 -31 -216 24 205 390 169 -141 -258 -153 142 135 194 -80 -286 -152
4094a52K67J22k08K2j93p4J99K07J85l19k78PO6J03L53l99j63n5K82K9M71l84
$$ -152 115 237 29 51 -142 -216 -17 190 375 56 -222 -215 -149 -46 307 -92 -255 -310 -28 1 472 88
4116H8l98R2K51K57j68R1m78q4L77J80P6k46k75M5O0P1J87Q0l48k19N9M30K41
$$ 88 -310 -218 33 290 122 213 -265 -349 28 208 284 38 -237 -192 -132 -61 126 206 -142 -361 -302 128 369
4139C69j52l41k07J71N49j82j1k31k68J30Q1N03k73k12Mrk4K81J84l23k66n2K38
$$ 369 217 -124 -331 -160 389 207 196 -35 -303 -173 -92 411 138 -74 -70 -79 -103 178 362 39 -227 -279 -41
4162d1K72m8l13O6l04K27K49J31q4k56j95J87L77j78L6m04j07J81N43n0k72o9
$$ -41 231 183 -130 -64 -368 -141 108 239 155 -101 -296 -109 268 90 126 -278 -385 -204 339 289 17 -52
4184e2r9j19M18J30n4l05n7q5L53J88k58j78j37K05N7K54q9k31k21j00N11J35
$$ -52 -151 -270 148 278 224 -81 -138 -223 130 318 60 -118 -255 -50 7 261 172 -59 -280 -380 131 266
4206B66m3j77m30K03K88O3N4l44j68Q0K29K91j55k83K8j05M8L95J92l52l38Q7
$$ 266 223 46 -384 -181 107 170 224 -120 -288 -208 21 312 157 -126 -98 -203 -155 240 432 80 -258 -171
4228a71K74K23m2j62k28o5J10J86l7N4l61j22K25L17J04j18l50M9L2R0L12j84
$$ -171 103 326 284 122 -106 -171 -61 125 88 142 -219 -341 -116 201 305 187 -163 -114 -82 8 320 136
4250A36j78q2J78j76J51J1rl80J90K32J71r6l05j20J28J50M7J14r2k35k20L59
$$ 136 -42 -124 54 -122 29 40 31 -349 -159 73 244 148 -157 -277 -149 1 48 162 70 -165 -385 -26
4272b6J68M4j53n3k41J98R2J61j61q5m3P4J24Q1M7k50n4N7J12J16k20j75P8J21
$$ -26 142 186 33 -20 -261 -63 29 190 29 -56 -99 -25 99 180 227 -23 -77 -20 92 208 -12 -187 -109 12
4296A2l0Q1J21k64N1n9K69j75l0rJ12j74J73O7j8j01r5q9M8K14j45O2j23O1j11
$$ 12 -18 63 184 -80 -29 -88 181 6 -24 -33 79 -95 78 145 127 26 -69 -158 -110 104 -41 21 -102 -41 -152
4321a52J66K6o8lq9N1N7Q3j55J85j93O6J32j12LM0p0L3m8J40O6j65J06j63R9P6
$$ -152 14 40 -28 -31 -120 -69 -12 71 -84 101 -92 -26 106 -6 -3 37 -33 0 -48 92 158 -7 99 -64 35 111
4347A11m3O1j15J00j94J34p2J57j21j60K12k01l6N2J43j47K22k25L0K45j5lk14
$$ 111 68 129 14 114 -80 54 -18 139 18 -142 70 -131 -167 -115 28 -119 103 -122 -92 153 138 135 -79
4370g9J93p7J72j91Q3k16K32k19J37P4j76K7J0kn2K31j34j47J1K8O6K10r8j03
$$ -79 114 37 209 18 101 -115 117 -102 35 109 -67 -40 -30 -32 -84 147 13 -134 -123 -95 -29 181 83 -20
4394b0j52L4L0J36m4o0j11K16j57K91m8K2j64m0p6J98m0m1j13K19k40J36J78j9
$$ -20 -172 -138 -108 28 -16 -76 -187 29 -128 163 115 137 -27 -67 -143 55 15 -26 -139 80 -160 -24 154 135
4418A35k04o4O0Q7J40r4p2j58J65jQ2R9j09l42Q8J01M0R3q1k2l2J54K4J05k5k48
$$ 135 -69 -133 -73 14 154 60 -12 -170 -5 -6 76 175 66 -276 -188 -87 -47 46 -35 -57 -89 65 89 194 169 -79
4444g9r6M3K95j45N6j81k22K49K03Q2o1l71K4O4J90K13j21l51J35J50j6J32J19
$$ -79 -175 -132 163 18 74 -107 -329 -80 123 205 144 -227 -203 -139 51 264 143 -208 -73 77 61 193 312
4467C12l66KJ8Q5n7K10j45k64J28J99J29k00o1j92j89L56M30k67j56o8L4L4L65
$$ 312 -54 -52 -34 51 -6 204 59 -205 -77 122 251 51 -10 -202 -391 -35 395 128 -28 -96 -62 -28 337
4490C37k68L0l07l0M8M23k72P3j57M2J05J16J7j45M9j97Q2K30J56k71r0j83j83
$$ 337 69 99 -208 -238 -190 233 -39 34 -123 -81 24 140 157 12 61 -136 -54 176 332 61 -29 -212 -395
4513c95M91J67j07l25P1j55K48J57K0p9l34J88j26M41m5k49r8l8J11K55j59r4
$$ -395 96 263 156 -169 -98 -253 -5 152 172 93 -241 -53 -179 262 217 -32 -130 -168 -57 198 39 -55
4535e5j12Ln1M71O4k97j40p6J95J02K27j17l35r2K2K15K30j27k19j79R1K24J95
$$ -55 -167 -164 -215 256 320 23 -117 -193 2 104 331 214 -121 -213 -191 24 254 127 -92 -271 -180 44 239
4558B39r4j08k62K03R6mrMj43j63L29N6l2j66q8J17l7L25j07j42j99j15K21J89
$$ 239 145 37 -225 -22 74 70 61 65 -78 -241 88 144 112 -54 -142 -25 -62 263 156 14 -185 -300 -79 110
4582A10J37l31Jj23Q8K62K6r6k95l1K36J35K06k63k13o5J97K29k9j56n4j19J05
$$ 110 247 -84 -83 -206 -118 144 170 74 -221 -252 -16 119 325 62 -151 -216 -19 210 181 25 -29 -148 -43
4605d3J28K9J37k87o7J76n1Q2K6j09r8n1p0K45jL0k50J07nK97j93q7RL1q3K49
$$ -43 85 114 251 -36 -103 73 22 104 130 21 -77 -128 -198 47 46 76 -174 -67 -72 225 32 -55 -46 -15 -98 151
4631A51l6O0l74J31O6R2J11k39j33kL05o5j21J06J6k79L20j0r3m4J44k09O8O5
$$ 151 115 175 -199 -68 -2 90 201 -38 -171 -173 132 67 -54 52 68 -211 109 99 6 -38 106 -103 -35 30
4655C0k6n6J14m7O6j08J11j19OJ2J8Nj44J36K27k05J70j31J6j8J8n1q7k0Q1j48
$$ 30 4 -52 62 15 81 -27 84 -35 -29 -17 1 6 -138 -2 225 20 190 59 75 57 75 24 -63 -83 -2 -150
4681a50J61j60p1K95r1mn2l3K79k4p8n8j32K1K32k16J36k20J35J55p0o3k3o4O6
$$ -150 11 -149 -220 75 -16 -20 -72 -105 174 150 72 14 -118 -97 135 -81 55 -165 -30 125 55 -8 -31 -95 -29
4706b9J42r8n9J98k65J62Q1k8q0N0o8p3k8J59O8k17m2P9L4J23p3J06l12J74m4
$$ -29 113 15 -44 154 -111 51 132 104 24 74 6 -67 -95 64 132 -85 -127 -48 -14 109 36 142 -170 4 -40
4731d0P0R6j02j0k97L81j55K06k16J2q0J06o5J22j1o1r2L8L4J92m2n7k54J73P
$$ -40 30 126 24 14 -283 98 -57 149 -67 -55 -135 -29 -94 28 17 -44 -136 -98 -64 128 86 29 -225 -52 -45
4756d5J42q2p0k06J70J50J7l7nm4o4J31P3Q8j71k80N6J91J6m4Q7n0k01K29j3J39
$$ -45 97 15 -55 -261 -91 59 76 39 34 -10 -74 57 130 218 47 -233 -177 14 30 -14 73 23 -178 51 38 177
4782A77k78P4j34J41J00j5j54J00j97J67J08p4J80k60j7NL43m1o0j62j16K0L70
$$ 177 -101 -27 -161 -20 80 65 -89 11 -186 -19 89 15 195 -65 -82 -77 266 225 165 3 -113 -93 277
4805B77j30l6k80j08J97Q6J88q1r7k22J20lJ68p5N7j43nl5J32JJ11q3k17M5L51
$$ 277 147 111 -169 -277 -80 6 194 113 16 -206 -86 -89 79 4 61 -82 -87 -122 10 11 122 39 -178 -133 218
4830B18N4l39p7m1K38m9K68l13j25j55M40j23J73r7l57J94j88M58J10j12j71j52
$$ 218 272 -67 -144 -185 53 4 272 -41 -166 -321 119 -4 169 72 -285 -91 -279 179 289 177 6 -146
4852a46J16L0j28K59j84j39j08L97J2j39m5o7q2L08j31J74p9k61O0J07J73k35
$$ -146 -30 0 -128 131 -53 -192 -300 97 109 -30 -75 -142 -224 84 -47 127 48 -213 -153 -46 127 -108
4874a08K13j99j44K15P9r9J09o3j42J50J48r8L4j19k6K4P6J64k45J01k38K03K
$$ -108 105 -94 -238 -23 56 -43 66 3 -139 11 159 61 95 -24 -50 -26 50 214 -31 70 -168 35 37
4897C7j27N8P2j79L1J23J74k44o8p2P6J39R7L8q2l0j27J76l3k8j15L1J13o6R9
$$ 37 -90 -32 40 -139 -108 15 189 -55 -123 -195 -119 20 117 155 73 43 -84 92 59 31 -84 -53 60 -6 93
4922I3Rj49o7J66mJ35j4r3j37q8J65N6n0j13J91q9o1J51O3j81J08k55K07Q6M6
$$ 93 102 -47 -114 52 48 183 169 76 -61 -149 16 72 22 -91 100 11 -50 101 164 -17 91 -164 43 129 175
4947A75j75J0q7P4K23k02l9N9j43RJ86N7j12j44Q4j06J17K09l28L30k93l7L4M1
$$ 175 0 10 -77 -3 220 18 -21 38 -105 -96 90 147 35 -109 -25 -131 -14 195 -133 197 -96 -133 -99 -58
4971e8M4Jr7J21j2K02r7r5r2P7K2J42k81J42nl2Q3L2p4N0q6j42J51O1K5n1j36
$$ -58 -14 -13 -110 11 -1 201 104 9 -83 -6 16 158 -123 19 14 -18 65 97 23 73 -13 -155 -4 57 82 31 -105
4998a05J1j49K05P3j5j6j05M2J75m9O8oj78k8M5l9P7J2J3R6j33K45k59J57j20
$$ -105 -94 -243 -38 35 20 4 -101 -59 116 67 135 129 -49 -77 -32 -71 6 18 31 127 -6 239 -20 137 17
5023A7j92N7J12K1Kj07J87l8M4j13m3j09K00Jj74J12o3P8J56j02j48K4K1J14j60
$$ 17 -175 -118 -6 15 17 -90 97 59 103 -10 -53 -162 38 39 -135 -23 -86 -8 148 46 -102 -78 -57 57 -103
5048a03J60j1q8R4J22k53k8J51Ro2j7j03J32j16K33k44K2L15r1n4J6k64K38j91
$$ -103 57 46 -42 52 174 -79 -107 44 53 -9 -26 -129 3 -113 120 -124 -102 213 122 68 84 -180 58 -133
5072a33N8J92r4K0j9k5j8J50j17j39K37L4j70Oj16J36J73m24K01J69m42K86k01
$$ -133 -75 117 23 43 24 -1 -19 131 14 -125 112 146 -24 -18 -134 2 175 -249 -48 121 -321 -35 -236
5095b36J86J9M4j27J1mK4O7k0N1j54Q3M1K53k06p3J08o1jjqj37J91j5p8J73j24
$$ -236 -50 -31 13 -114 -103 -107 -83 -16 -36 15 -139 -56 -15 238 32 -41 67 6 5 4 -4 -141 50 35 -43 130 6
5122FK5k0L4R6j56p9j1Ro0J20R7Rj40j49J37N2J61N0l06O2O5J27j63R5l9j92K3
$$ 6 31 11 45 141 -15 -94 -105 -96 -156 -36 61 70 -70 -219 -82 -30 131 181 -125 -63 2 129 -34 61 22 -170 -147
5149a47J34KJ16r7J2k22K54p8M2Pm7n0K66j96J06j16k4l5QJ51p4M9k20n2J38j
$$ -147 -13 -11 105 8 20 -202 52 -26 16 23 -24 -74 192 -4 102 -14 -38 -73 -65 86 12 61 -159 -211 -73 -74
5175g4J66J21k45J7j5J52lj07n3j07m2K82q2P2j30k1l8R2J82q8K3k97oK48J5j8
$$ -74 92 213 -32 -15 -30 122 119 12 -41 -148 -190 92 10 82 -48 -69 -107 -15 167 79 102 -195 -201 47 62 44
5201D4p4j09j81K45K05k4N7j69q9p3R1J19k2Jj14J02q7K17M1j28p1L7O6j02Ml3
$$ 44 -30 -139 -320 -75 130 106 163 -6 -95 -168 -77 42 20 21 -93 9 -78 139 180 52 -19 18 84 -18 -14 -47
5227d7J19j65K00j48MP2q4P8k10L55j16j10lK9J73k3r1P7r0j05O4J27j7j53l9
$$ -47 72 -93 107 -41 -37 35 -49 29 -181 174 58 -52 -55 -26 147 124 33 110 20 -85 -21 106 89 -64 -103
5252a03PM4j7K24n0j60qj8J78Pj79j54J60J97j29Q3J8k9k9j38J84q9J01J7k78
$$ -103 -96 -52 -69 155 105 -55 -63 -81 97 104 -75 -229 -69 128 -1 82 100 71 42 -96 88 -1 100 117 -161
5277a61J23K3K36k41j5j04J36M9Q3J67l86j4m5K55k43K56j43l9p4P4L8L1J45j49
$$ -161 -38 -15 221 -20 -35 -139 -3 46 129 296 -90 -104 -149 106 -137 119 -24 -63 -137 -63 -25 6 151 2
5301Bnj00J09J77j42m2K9R5q1n6J13k41R3K6o9K03r9j0o0Q1P6j38J34k5j22qJ18
$$ 2 -3 -103 6 183 41 -1 28 123 42 -14 99 -142 -49 -23 -92 111 12 2 -58 23 99 -39 95 70 -52 -60 58
5328E8K5r3q4K00j22j59R0K32k53K24o2p1L8n1j0m9J46j15J89j52J99j47O9p4
$$ 58 83 -10 -94 106 -16 -175 -85 147 -106 118 56 -15 23 -28 -38 -87 59 -56 133 -19 180 33 102 28
5352B8L2m1j10J46lk38L53k61o5PJ73QM1o8jK3m1J29j73N5j1K2P3q7l5l0J54r8
$$ 28 60 19 -91 55 52 -186 167 -94 -159 -152 21 29 70 2 1 24 -17 112 -61 -6 -17 5 78 -9 -44 -74 80 -18
5380a8J59j02n5q3J43k5j58O8K03Or9J9m1j78J37p7Q6J2J66l34K83j87P8p8J23
$$ -18 141 39 -16 -99 44 19 -139 -71 132 138 39 58 17 -161 -24 -101 -15 -3 163 -171 112 -75 3 -75 48
5405D8J00o8Nk39J78J25j01q9K1j01M7P6j26O7J54j60Q3Q4j08Kq2M1j16J45N9
$$ 48 148 80 85 -154 24 149 48 -41 -20 -121 -74 2 -124 -57 97 -63 20 104 -4 -2 -84 -43 -159 -14 45
5430D5J3q1J04j55qJ38O9o4q3k4P8m6K08j08k31L5J03Qo4K54k84J17j28K23N9
$$ 45 58 -23 81 -74 -82 56 125 61 -22 -46 32 -14 194 86 -145 -110 -7 1 -63 191 -93 24 -104 119 178
5455A78k79J36j96J22J5Ro8K09p4J7J67j31p8Kn7p2L04k4k00R1k38J54J5j13K06
$$ 178 -101 35 -161 -39 -24 -15 -83 126 52 69 236 105 27 29 -28 -100 204 180 -20 71 -167 -13 2 -111 95
5480I5j97%o7J66K25l44RJ34pM4k1j4k7J8p2K05j38J33k07O7J36k20P8N5j43J05
$$ 95 -102 -102 -169 -3 222 -122 -113 21 14 58 37 23 -4 14 -58 147 9 142 -65 2 138 -82 -4 51 -92 13
5506A3n4N9j70J25m3j8k1M8N0J09j54j4q7J20j37J98J05j51K9l7K0J66j09j70
$$ 13 -41 18 -152 -27 -70 -88 -109 -61 -11 98 -56 -70 -157 -37 -174 24 129 -22 7 -30 -10 156 47 -123
5530a23J60j18K83k11J84j27j4jj84J55M9j41q3J95q9J47j17k20K08o2J6J45P4
$$ -123 37 -81 202 -9 175 48 34 33 -151 4 53 -88 -171 24 -65 82 -35 -255 -47 -109 -93 52 126
5553A26j40L6p2k1K90n2k11jL8j21J02J58j21L9l05K66n3J45j39l5P9L5J2%L0
$$ 126 -14 22 -50 -71 219 167 -44 -45 -7 -128 -26 132 11 50 -255 11 -42 103 -36 -71 8 43 55 55 85
5578H5j06j73Q5J36J54j90m6KK4l2O7n5J11l1k99L30k5m3N1nj07K13l6K5J9l07
$$ 85 -21 -194 -109 27 181 -9 -55 -53 -29 -61 6 -49 62 31 -268 62 37 -6 45 40 -67 146 110 135 154 -153
5604a53L5N3R1K60k17J8o4j62J63j9p2P8j51%M7J13K5O7k16J8R6kJ25j19p2j28
$$ -153 -118 -65 26 286 69 87 23 -139 24 5 -67 11 -140 -140 -93 20 45 112 -104 -86 10 8 133 14 -58 -186
5630a86K17j06J7n9J00M9o2P1K17m89K42l2l5J17J4L4n1k39K47j32J6J00K7j26
$$ -186 31 -75 -58 -117 -17 32 -30 41 258 -231 11 -21 -56 61 75 109 58 -181 66 -66 -50 50 77 -49
5654d9nN5n7R7k21J44J95k36O1J40j68J30k06O4J16r1J3o3P8o2MQ3K6j29R4M3
$$ -49 -54 1 -56 41 -180 -36 159 -77 -16 124 -44 86 -120 -56 60 -31 -18 -81 -3 -65 -61 22 48 -81 13 56
5680E6m6k5k5j14J61K4r1l8j5K57mj81K20j51r0M1%J07J24j48j4J30k31J49p0
$$ 56 10 -15 -40 -154 7 31 -60 -98 -113 144 140 -41 179 28 -62 -21 -21 86 210 62 48 178 -53 96 26
5705B6j80Q7O7J07p6L1m6K5n2k0k7Q3L5o0J8J4p6l0Q5j44J45K7o7K24k60J02J4
$$ 26 -154 -67 0 107 31 62 16 41 -11 -31 -58 25 60 0 18 32 -44 -74 11 -133 12 39 -28 196 -64 38 52
5732E2j4L3P3j44K9j30Q9K2pqO0m7J04j5Rj22J21p9j28R2J15n9J58j28k6ko0l6
$$ 52 38 71 144 0 29 -101 -12 10 3 -5 55 8 112 97 106 -16 105 26 -102 -10 105 46 204 76 50 48 -12 -48
5760d8K53k62K23k55k2rN8M5O4Q3m9k6j55O2m6R8k1l3l1RqJ65p1Pj76J76j05P6
$$ -48 205 -57 166 -89 -111 -120 -62 -17 47 130 81 55 -100 -38 -84 14 -7 -40 -71 -62 -70 95 24 31 -145 31 -74 2
5788Bp8K06j83K28j41j87K19r5j41K5K78p8K0m4jq5j3R4j01K10j78J5K1M0j00
$$ 2 -76 130 -53 175 34 -153 66 -29 -170 -145 133 55 75 31 30 -55 -68 26 -75 135 -43 -28 -7 33 -67
5813f7J99q9m0M1j52J09M3q1l5J3K0J21k2Qj64j38M02k26N3m4M8J98k41O5j91
$$ -67 132 43 3 44 -108 1 44 -37 -72 -59 -39 82 60 68 -96 -234 168 -58 -5 -49 -1 197 -44 21 -170
5838a70K55n7j14K46k22J57j6m3k2j44L5J16k7m5k1J92k71K02j40r4J39n4J09
$$ -170 85 28 -86 160 -62 95 79 36 14 -130 -95 21 -6 -51 -72 120 -151 51 -89 -183 -44 -98 11
5861A1L5j16J06j30R4o3R9J56k64P4k4l6nJ30j38J93p9n5m8J43j66R1o0J57j32
$$ 11 46 -70 36 -94 0 -63 36 192 -72 2 -22 -58 -63 67 -71 122 43 -12 -60 83 -83 8 -52 105 -27
5886b7J21j4j14J70j80J09N8j77j34K30J3P4j98k5l7m6K62j87J81j16j58K48j60
$$ -27 94 80 -34 136 -44 65 123 -54 -188 42 55 129 -69 -94 -131 -177 85 -102 79 -37 -195 53 -107
5909a07J86j71Q0j1Rk1j69L50k82K40j08j28K04q2R8j97J6Q3Q0K7M0P1j49q8M
$$ -107 79 -92 -12 -23 -14 -35 -204 146 -136 104 -4 -132 72 -10 88 -109 -93 -10 70 97 137 208 59 -29 -25
5934b5m3Q7oj25J4J28Q5k88J22p0L44j00j27K7l7m6rJ6O9m6M0ok2J56m9j14j32
$$ -25 -68 19 13 -112 -98 30 115 -173 -51 -121 223 123 -4 23 -14 -60 -69 -53 16 -30 10 4 -18 138 89 -25 -157
5961a57J54P2k8J90l15J54j59J45K14k60m2J40j46K58k84J46j97J17j12l6J44
$$ -157 -3 69 41 231 -84 70 -89 56 270 10 -32 108 -38 220 -64 82 -115 2 -110 -146 -2
5982bQ1K7j94O6Nm0J6J27j35q7J60p7J7k8k4L1J36k7J00j96J19l9R5r0p5K3J37
$$ -2 79 106 -88 -22 -17 -57 -41 86 -49 -136 24 -53 -36 -64 -88 -57 79 52 152 -44 75 36 131 41 -34 -11 126
6009A26j34L5j35J20K38k73N6j29O1J03r0O0l9L8j31n5J00K8O4k75J77j27J54
$$ 126 -8 27 -108 12 250 -23 33 -96 -35 68 -22 38 -1 37 -94 -149 -49 -21 43 -232 -55 -182 -28
6032b8%Q9q6m3M9J0Mj42R4q7K40j89O6k17K06Rk7M0J9p6J43q0k8N3lJ65k47J1
$$ -28 -28 61 -25 -68 -19 -9 -5 -147 -53 -140 100 -89 -23 -240 -34 -25 -52 -12 7 -69 74 -6 -34 19 16 181 -66 -55
6060e5J08j17J25j39K06j63N1k2q3L7K2q1J42j45J64o9L0L6q1R2j34P0n5j03K64
$$ -55 53 -64 61 -78 128 -35 16 -6 -89 -52 -30 -111 31 -114 50 -19 11 47 -34 58 -76 -6 -61 -164 100
6085A00k43N3J64n7L5j46R3l6j2M7O0j62J03n0J25r4J06k56J73M3k33K30j20J3
$$ 100 -143 -90 74 17 52 -94 -1 -37 -49 -2 58 -104 -1 -51 74 -20 86 -170 3 46 -187 43 -77 -64
6109f4N5r8Q6J09r8P2k6j3l5p9n6N2Q3n5J04J15j04j22K1m3J60L7l0o6Q3p1o3
$$ -64 -9 -107 -21 88 -10 62 36 23 -12 -91 -147 -95 -12 -67 37 152 48 -74 -53 -96 64 101 71 5 88 17 -46
6136d6J26o9J66r7k26J78j13N7N9J02k03k1Q7ok2L7j29K22k19R9J86k29L6Q4l0
$$ -46 80 11 177 80 -146 32 -81 -24 35 137 -66 -87 0 -6 -28 9 -120 102 -117 -18 168 -61 -25 59 29
6161B9j51Q1j1k0j22Q9J53m6j40J74q3P6k7j7J01nj66J52n5k2J36p9Lm2j6r5J11
$$ 29 -122 -41 -52 -72 -194 -105 48 2 -138 36 -47 29 2 -15 86 81 -85 67 12 -10 126 47 50 8 -8 -103 8
6188Hr7K04k85K35p5J01j91j5P4l1J13K3j02Q2Q7j5%q0P6j70M9j0J9p1l5N4Q3
$$ 8 -89 115 -170 65 -10 91 -100 -115 -41 -72 41 64 -38 44 131 116 116 36 112 -58 -9 -19 0 -71 -106 -52 31
6215C1q7OJ67q7R4j21K8n9O8n6K72k92p3J69j46J50kq5J67j85k7J76%k14K9q4
$$ 31 -56 -50 117 30 124 3 31 -28 40 -16 256 -36 -109 60 -86 64 62 -23 144 -41 -68 108 108 -106 -77 -161
6241a61K23O7j47m1J09q3p9K35n1j15oJ1k7K2J30j46J45j48J04j1J48j62N4k69
$$ -161 62 129 -18 -59 50 -33 -112 123 72 -43 -49 -38 -65 -43 87 -59 86 -62 42 31 179 17 71 -198
6265a98K43j94J26r1P9o1j4O1m4J41J04r7O7L9k07Q5j24J25rp8J06M5k00Ql7P8
$$ -198 45 -149 -23 -114 -35 -96 -110 -49 -93 48 152 55 122 161 -46 39 -85 40 31 -47 59 104 -96 -88 -125 -47
6291d7R5Mq2K8j46J09Q2r0j1m6J09M1k9r2N8jl3m8j8J96k10J25O9K9k5r5Q8r5
$$ -47 48 52 -30 -2 -148 -39 43 -47 -58 -104 5 46 17 -75 -17 -18 -51 -99 -117 79 -131 -6 63 92 67 -28 60 -35
6319c5J06R3p3j03KJ5j66Q0j33L41o5j59J04pK1P7k46O1K42k04m5q6J49JJ14k8
$$ -35 71 164 91 -12 -10 5 -161 -81 -214 127 62 -97 7 0 21 98 -148 -87 155 -49 -94 -180 -31 -30 84 56
6345E6k37J60J94n7k67K37j45j0R1j81Q5J00o2R3J37k09j44O9P9L6J65j72J91
$$ 56 -181 -21 173 116 -151 86 -59 -69 22 -159 -74 26 -36 57 194 -15 -159 -90 -11 25 190 18 209
6368B09j91o0K15k72J48lP5l26J30J07j52RJ37o9L9J29k52J13P2k59J90Mj37J61
$$ 209 18 -42 173 -99 49 46 121 -205 -75 32 -120 -111 26 -43 -4 125 -127 -14 58 -201 -11 -7 -144 17
6392A7J10j64M2nk31K01R2J33k09M9q0J85j39J43o4J4o7L4j1k4L5m0J3o5MP4n3
$$ 17 127 -37 5 0 -231 -30 62 195 -14 35 -45 140 1 144 80 94 27 61 50 26 61 21 34 -31 -27 47 -6
6419fj07Q0K7r7J70k40K45J40j25k30J36Pm6L3j54J25o6J15J97j83j95K25qJ4
$$ -6 -113 -33 -6 -103 67 -173 72 212 87 -143 -7 0 -46 -13 -167 -42 -108 7 204 21 -174 51 43 57
6443E7Q1j74m4l0J36R2k08q5P3J0N4R1R1j63K39k42NJ71P3j73r6J03p5N0N9j44
$$ 57 138 -36 -80 -110 26 118 -90 -175 -102 -92 -38 53 144 -19 220 -22 -17 154 227 54 -42 61 -14 36 95 -49
6469d9P8lk70K19J2Mp2p5K87Kj0L8j68q4J3J77Jj03K8j30J24N9j56P1J06l37K45
$$ -49 29 26 -244 -25 -13 -9 -81 -156 131 133 123 161 -7 -91 -78 99 100 -3 25 -105 19 78 -78 -7 99 -238 7
6496GM1J01j49j40K27j16M0NO9p3m5M1m8N2M4O6l27J76j92K33j16J02m6%J13j58
$$ 7 48 149 0 -140 87 -29 11 16 85 12 -33 8 -40 12 56 122 -205 -29 -221 12 -104 -2 -48 -48 65 -93
6522i3M2K01m75L32M2L5K5m9j72K35pj1k60M2J47m0JR5l7j25J54j06j7j19L4N3
$$ -93 -51 150 -325 7 49 84 109 60 -112 123 116 105 -155 -113 34 -6 -5 90 53 -72 82 -24 -41 -160 -126 -73
6548g3J77j09j32O7R2k5n9n7Q2r0R9j47J91l7JN5j51J14J22n7n5M4o2j8Mj48P3
$$ -73 104 -5 -137 -70 22 -3 -62 -119 -37 -127 -28 -175 16 -21 -20 35 -116 -2 120 63 8 52 -10 -28 -24 -172 -99
6575i9Q0J3j31K47j16Rj01P8Q2n5k21K49l8M2k9K9J05j17o7J15L8j70J23j30P8
$$ -99 -19 -6 -137 110 -6 3 -98 -20 62 7 -214 35 -3 39 10 39 144 27 -40 75 113 -57 66 -64 14
6600A4q5Q0k6j03Q3J55j73K70j84qK3k2j2j2l2m0K8N7o3Q1j23O0P9M4p4j80J20
$$ 14 -71 9 -17 -120 -37 118 -55 215 31 23 46 24 12 0 -32 -72 -44 13 -50 31 -92 -32 47 91 17 -163 -43
6627d3j19o3J47lj6j2mK33n3l9n7o6J09j1M5q1q2J26m3R8m3J8o7K0o1LM7r8R3
$$ -43 -162 -225 -78 -81 -97 -109 -113 120 67 28 -29 -95 14 3 48 -33 -115 11 -32 66 23 41 -26 -6 -67 -64 -17 -115 -22
6656b2n9L7j2R7L7j2j18k5J65n0M9j80O1L5r4J90k64K71Kj66Q8n8M3j5j1k2K1
$$ -22 -81 -44 -56 41 78 66 -52 -77 88 38 87 -93 -32 3 -91 99 -165 106 108 -58 30 -28 15 0 -11 -33 -12
6683a2Nj57J22p5J11l4l7J19n1QN2p3J26j31R2j23K51r4j19j05J15m7o4k7J70
$$ -12 -7 -164 -42 -117 -6 -40 -77 42 -9 -1 51 -22 104 -27 65 -58 193 99 -20 -125 -10 -57 -121 -148 22
6708B2J33k10J32J89r3j77R2k28R1J14j27J71j22MO2j77Q4jJ08O7m7j03J5lM6
$$ 22 155 -55 77 266 173 -4 88 -140 -49 65 -62 109 -13 -9 53 -124 -40 -41 67 134 87 -16 -1 -4 42
6733D2K6j03p4J14P6r0l4M5k2M4N7j75m6Q8J9J42j5l1j38K58j32J47j45o1K8j66
$$ 42 68 -35 -109 5 81 -9 -43 2 -20 24 81 -94 -140 -52 -33 109 94 63 -75 183 51 198 53 -8 20 -146
6759a46Q6N8n0j5K9M2q7PP9J20m1k4N7o9K9n1n5Q1p7M5J0j59L1O7P9R5j57j29
$$ -146 -60 -2 -52 -67 -38 4 -83 -76 3 123 82 58 115 46 75 24 -31 50 -27 18 28 -131 -100 -33 46 141 -16 -145
6787a45R9M2q8Q3K61k76K08m3j18K1n0p4J5k0O5l7jR6j26O7R2KQ2k61J76k07J46
$$ -145 -46 -4 -92 -9 252 -24 184 141 23 44 -6 -80 -65 -85 -20 -57 -58 38 -88 -21 71 73 155 -106 70 -137 9
6814IJ36j67J11n3n5O5m4R5L1K6k8k35K11j26P0K13j61j6p2n1J27j06jP2M0k06
$$ 9 145 -22 89 36 -19 46 2 97 128 154 126 -109 102 -24 46 259 98 82 10 -41 86 -20 -21 51 91 -115
6840a15K41q5j7J86l45m0J85K1J20l13J96%k6O6j09J06m1l1l0R2j19J20j6Pr1
$$ -115 126 41 24 210 -135 -175 10 31 151 -162 34 34 8 74 -35 71 30 -1 -31 61 -58 62 46 53 -38
6865c8Om9J19n9j18J19nm1Q8M4j94K34m6k06K36n6j8j6L4J07q8q1J23o8K2j08
$$ -38 -32 -81 38 -21 -139 -20 -25 -66 22 66 -128 106 60 -146 90 34 16 0 34 141 53 -28 95 27 49 -59
6891e9o5J94o1k3L3K1m1p9n7J26j05r1Q4J84p7k2J9M4k9M1J0r7J04j03J7j09J61
$$ -59 -124 70 9 -14 19 40 -1 -80 -137 -11 -116 -207 -123 61 -16 -38 -19 25 -4 37 47 -50 54 -49 -32 -141 20
6918B0j9O4j15O4R9j88j33J61L3j01J85p4J64j56O2m1L6Rl0n4OJ52j99j34J80
$$ 20 1 65 -50 14 113 -75 -208 -47 -14 -115 70 -4 160 4 66 25 61 70 40 -14 -8 144 -55 -189 -9
6943iJ25Q2k55p4J73J76j94P3k32L3M5N9R2k0K7j81NK23l66J28L8k9o4N4J08Q0
$$ -9 116 198 -57 -131 42 218 24 97 -135 -102 -57 2 94 74 101 -80 -75 148 -218 -90 -52 -81 -145 -91 17 97
6969I7MO7j47R3k36N1K24j52r7J07n9R6J1j49L4jo6J93lq7n7p7L3K2L31k21j20
$$ 97 101 168 21 114 -122 -71 153 1 -96 11 -48 48 59 -90 -56 -57 -123 70 67 -20 -77 -154 -121 -99 232 11 -109
6996a09J01M4k23L38k04J14j95J50M8m0l8L0L7r0K12j09j82L1K3J8rM7l5m6K00
$$ -109 -8 36 -187 151 -53 61 -134 16 64 24 -14 16 53 -37 175 66 -116 -85 -62 -44 -53 -6 -41 -87 113
7021A13k28K39j19n2J8q7R2J02O8k42J7P2j04L0O6K19l23K24j12j49L23k10L9
$$ 113 -115 124 5 -47 -29 -116 -24 78 146 -96 -79 -7 -111 -81 -15 204 -119 105 -7 -156 167 -43 -4
7044dq9J80Q3j45L1j81J05n8J70q4K7M9L3m6j20N5o2N8J09j75J42j31n5O3J04
$$ -4 -93 87 170 25 56 -125 -20 -78 92 8 35 84 117 71 -49 6 -56 2 111 -64 78 -53 -108 -45 59
7069E9m4l6q8J30M2j48RN9N3Rn8Ko4J04j43Q7m3J48j14l2P6l9r5J55R4j64J32
$$ 59 15 -21 -109 21 63 -85 -76 -17 36 45 -13 -11 -75 29 -114 -27 -70 78 -36 -68 8 -31 -126 29 123 -41 91
7096I1j33nm8M5N8K3j85J04p0R9L9r2J0Q1M2j4j7j33J14L3j7k29J98Q0q8K3O6
$$ 91 -42 -47 -95 -50 8 31 -154 -50 -120 -21 18 -74 -64 17 59 45 28 -105 9 42 25 -204 -6 74 -14 9 75
7123G5k79M28k93K32p3r7Qn5rO5j9KJ23q0J02k01Q0J05o3j26J96j18Q4j82J5J07
$$ 75 -204 224 -69 163 90 -7 1 -54 -63 2 -17 -15 108 28 130 -71 9 114 51 -75 121 3 87 -95 -80 27
7149B7L8r7J53k31J56m4j09j10K09O0j28K24j85q7K5K01j42R9p1J77k36J19m3
$$ 27 65 -32 121 -110 46 2 -107 -217 -8 52 -76 148 -37 -124 -99 102 -40 59 -12 165 -71 48 5
7172EN9r5J41j09r3q0J45Q1j81J32L1L1j01M0j22J77p1l6J6J6K2j2R0j81J75j06
$$ 5 64 -31 110 1 -92 -172 -27 54 -127 5 36 67 -34 6 -116 61 -10 -46 -30 -14 8 -4 86 -95 80 -26
7198b6J18n6l1m3PK5O5k1j16p5K07K1p2K0q1K29k08n4J98j59L4Rk6N2J16l3n7
$$ -26 92 36 5 -38 -31 -6 59 38 -78 -153 54 75 3 23 -58 171 -37 -91 107 -52 -18 -9 -35 17 133 100 43
7225D3q6K3O2k86M45q2r6J2k7J27j20K3L7q4OOo0R8j75P3jM7N3j76J85M0j72J26
$$ 43 -43 -20 42 -244 201 119 23 35 8 135 15 38 75 -9 -3 3 -57 41 -134 -61 -62 -15 38 -138 47 87 -85 41
7253D1J8o5Kq1K6J13P2k23K16r0q7J79j00ok8k03J83J6k2r2L06k99K30j45M6q1
$$ 41 59 -6 -4 -85 -59 54 126 -97 119 29 -58 121 21 15 -13 -216 -33 -17 -39 -131 175 -124 106 -39 7 -74
7279g4J59j78J8J46j03O5j7Q5p4k51K70j75K24j17N0j09J72p5j28J58m5M4P6j62
$$ -74 85 -93 -75 71 -32 33 16 101 27 -224 46 -129 95 -22 28 -81 91 16 -112 46 1 45 121 -41
7303d1m0J44n9J08Kp9N0o9K39j34j85mJ14M6Mj70J81n5j22mP4P7M4n4j41J20m5
$$ -41 -81 63 4 112 114 35 85 16 255 121 -64 -68 46 92 96 -74 107 52 -70 -74 0 77 121 67 -74 46 1
7330AJ8LK2J70j55p0m6J9O5j94P4n0N5N5o1J49J29r3r8qj85K47j20J07Q9j53J72
$$ 1 19 22 44 214 59 -11 -57 -38 27 -167 -93 -143 -88 -33 -94 55 184 91 -7 -15 -200 47 -73 34 123 -30 142
7357A42j44J0j0Mj93K6J92K7j26J38j71J48p9L8Q3m1M4j31J98k86K12q4L7n4r5
$$ 142 -2 8 -2 2 -191 -165 27 54 -72 66 -105 43 -36 2 85 44 88 -43 155 -131 81 -3 34 -20 -115
7382a15R2m9o7M5P3k0K3O2r2j71J46J23K5r2J11j55J08j7K1K3r8j18J75j44J39
$$ -115 -23 -72 -139 -94 -21 -41 -18 44 -48 -219 -73 50 75 -17 94 -61 47 30 51 74 -24 -142 33 -111 28
7407B8j9m5J32j98m9J14J85l02J30J11p0j30J41m5P2j03J0J3Qj7M8m2J8L6q9J20
$$ 28 9 -36 96 -102 -151 -37 148 -154 -24 87 17 -113 28 -17 55 -48 -38 -25 -17 -34 14 -28 -10 26 -63 57
7433E7j67K07j27p0J11Oj67J25j29J01M0J04l67L68l1m4M2J79k12j53J13q7J88
$$ 57 -110 97 -30 -100 11 17 -150 -25 -154 -53 -13 91 -276 92 61 17 59 238 26 -127 -14 -101 87
7456H7o6m9P7L7k62mM7J01j0J4J20k25J7J32L0P4j02O5j01K16j15j28j23M9M1
$$ 87 21 -28 49 86 -176 -180 -133 -32 -42 -28 92 -133 -116 16 46 120 18 83 -18 198 83 -45 -168 -119 -78
7481g8KJ91k27K50r7k27L37m1j20Q7j40J90n3k5J3K1p3M3j38J06q6J05j67Q9l8
$$ -78 -76 115 -112 138 41 -186 151 110 -10 77 -63 127 74 49 62 83 10 53 -85 21 -65 40 -127 -38 -76
7506g6L7K46l47P8J14j21M8J16j45j38R6K58j30Lj07k5q3P1J56p9q0j23J95j1
$$ -76 -39 207 -140 -62 52 -69 -21 95 -50 -188 -92 166 36 39 -68 -93 -176 -105 51 -28 -108 -231 -36 -47
7530d7O0j32K05k25J59J23j84R2m9Rj00Q6J36j3j57k2K53l20J66q3K03k29R6j50
$$ -47 13 -119 86 -139 20 143 -41 51 2 11 -89 -3 133 120 -37 -59 194 -126 40 -43 160 -69 27 -123
7554a23mO7R2j15K8J72k00R6j38K32k50J98j65J68j7O8j44L6K9Rj69Q9O1K1lR
$$ -123 -127 -60 32 -83 -55 117 -83 13 -125 107 -143 55 -110 58 41 109 -35 1 30 39 -130 -41 20 41 38 47
7580D7m6j44K07m1n2K40j61m3k4n5J06r2J21r6M9r3N1o2nJ10Or7J32Pj2j82K22
$$ 47 1 -143 64 23 -29 211 50 7 -17 -72 34 -58 63 -33 16 -77 -26 -88 -93 17 23 -74 58 65 53 -129 93
7607I3p8P7n2J7q0k42J89p2K66j71N0l5p6J06k19L25j17r4J25q0J27j29j29J90
$$ 93 15 92 40 57 -23 -265 -76 -148 118 -53 -3 -38 -114 -8 -227 98 -19 -113 12 -68 59 -70 -199 -9
7631iN0q4l0J34j01J43j48N4%j00P6j67J26Q6n9J30j74J34Q1k50M1P5p1L3J09
$$ -9 41 -43 -73 61 -40 103 -45 9 9 -91 -15 -182 -56 30 -29 101 -73 61 142 -108 -67 8 -63 -30 79
7656G9m3j23P9P7K3k60J15M7K35k59j98Q3O2M4K3j9L2j79K63j43J34jl00K70k9
$$ 79 36 -87 -8 69 92 -168 -53 -6 229 -30 -228 -145 -83 -39 -16 -35 -3 -182 81 -62 72 71 -229 41 12
7681A2J09j92P5mo4J98j33M3j03m1K84jk65J58o7K31m36J54L0j47L03j26Q9j02
$$ 12 121 -71 4 0 -64 134 1 44 -59 -100 184 183 -82 76 9 240 -196 -42 -12 -159 144 18 107 5
7705E%K7k02J76J03o9k8j83R8J31m8Po9O8rJ35k51pK22o3m9j01m9K22j32R0k9
$$ 5 5 32 -170 6 109 40 12 -171 -73 58 10 17 -52 16 7 142 -109 -116 106 43 -6 -107 -156 66 -66 24 -5
7732ej25J08k2r8p8K08Q8j27k1J3N8N7l7o5J64j52n8OK4L6J4K0LJ42j84oL3o9
$$ -5 -130 -22 -44 -142 -220 -12 76 -51 -72 -59 -1 56 19 -46 118 -34 -92 -86 -62 -26 -12 8 11 153 -31 -37 -4 -73
7760g3j0J37J2rN1j47r2j34K01j18P7K59j35M4j39rq8l1L66k17kQ4j7p9P7j20
$$ -73 -83 54 66 57 108 -39 -131 -265 -64 -182 -105 154 19 63 -76 -85 -173 -204 162 -55 -57 27 10 -69 8 -112
7786a12J61j0L2j41J54j8k52K12M8M1l1rr7J37j31P6j78R6m2QQ4O8pj41nq0L7
$$ -112 49 39 71 -70 84 66 -186 26 74 115 84 75 -22 115 -16 60 -118 -22 -64 -56 28 96 89 -52 -57 -137 -100
7813a00O2j2Q0q9l9J08j66K04Lp6PO8q3K21k30m7Q0o4p4R6R3j06J62j65J22l8
$$ -100 -38 -50 30 -59 -98 10 -156 48 51 -25 -18 50 -33 188 -42 -89 -9 -73 -147 -51 42 -64 98 -67 55 17
7839A7j8K3N8J13l62J90k5J3m0l5J0P2lK3P0j37k7J37j15O9l4j04J64j00JO2P0
$$ 17 -1 22 80 193 -169 21 -4 9 -31 -66 -56 16 13 36 106 -31 -58 79 -36 33 -1 -105 59 -41 -40 22 92
7866I2J8o7M3k6j03k5j3J13j14K5j8M5QP2j2p6mJ50j41l8o3K67j94%j0J42J41
$$ 92 110 43 86 60 -43 -68 -81 32 -82 -57 -75 -30 -22 50 38 -38 -42 108 -33 -71 -134 133 -61 -61 -71 71 212
7893B12j75r8R0j08n5R1R8j33K21j03r3J32j1L4j07J13m5P8j59J3n2k5J95j66
$$ 212 37 -61 29 -79 -134 -43 55 -78 143 40 -53 79 68 102 -5 108 63 141 -18 -5 -57 -82 113 -53
7917e3K11j84p1P2KJ6k6J8k1j57J45O3j7J00j71L2j3J29j35NJ79j04J1j65K0J14
$$ -53 158 -26 -97 -25 -23 -7 -33 -15 -36 -193 -48 15 -2 98 -73 -41 -54 75 -60 -55 124 20 31 -134 -114 0
7943@k5N0r9j0J23j98K24rq4L7Q1p3n3J9q9J40p4Q5j31J02o3J1o6N5N6l4P5j66
$$ 0 -25 25 -74 -84 39 -159 65 56 -28 9 90 17 -36 -17 -106 34 -40 45 -86 16 -47 -36 -102 -47 9 -25 50 -116
7971a16K6RQ1M5R8k07M5M3J9J29k48Q4OPK43l82J40R1j3o7q7J32j41L8J56p4N5
$$ -116 -90 -81 0 45 143 -64 -19 24 43 172 -76 8 14 21 264 -118 22 113 100 33 -54 78 -63 -25 131 57 112
7998A12j74K30p6j50kn5J78l8P6j13J42j44J64m23J71J47j49J34p2n6L7J75n1
$$ 112 -62 168 92 -58 -60 -115 63 25 101 -12 130 -14 150 -273 -102 45 -104 30 -42 -98 -61 114 63
8021F3r9%N6mO5j18NJ52n8k54K64r8j80J50J52k7r7KJ67j43j09L2l8J14OJ21r4
$$ 63 -36 -36 20 16 81 -37 -32 120 62 -192 72 -26 -206 -56 96 69 -28 -26 141 -2 -111 -79 -117 -3 3 124 30
8048C0qn9p3K45n5O1j56J1J22j30J63p8l96L64J4r1R5j17J66k24J06J0N4J2O3
$$ 30 22 -37 -110 135 80 141 -15 -4 118 -12 151 73 -323 41 55 -36 59 -58 108 -116 -10 0 54 66 129
8073A29j22JJ7J33j15L7k33R3R5L8m0%j6j3N8k03R7J45r4m3O3l1K44l10ON4P1
$$ 129 7 8 25 158 43 80 -153 -60 35 73 33 33 17 4 62 -141 -44 101 7 -36 27 -4 240 -70 -64 -10 61
8100F1j40R0n9K6j67J11l0Q1K2J23j31j4J08j19m8r1K18Qr3K4N3J02Ql23K98j69
$$ 61 -79 11 -48 -22 -189 -78 -108 -27 -5 118 -13 -27 81 -38 -86 -177 41 49 -44 -20 33 135 143 -180 118 -51
8126e1M7K42k78J53j33J47L2k26J63q5o7q8J80J08n9j83K16k28M5J03j25N0j0
$$ -51 -4 238 -40 113 -20 127 159 -67 96 11 -56 -144 36 144 85 -98 118 -110 -65 38 -87 -37 -47
8149d7Q0p8K9j06J37op5P4l3J69j16r4NJ28J63j38j75J66L0j01j56O4N6p9K35
$$ -47 33 -45 -16 -122 15 9 -66 8 -25 144 28 -66 -61 67 230 92 -83 83 113 12 -144 -80 -24 -103 132
8174A32k00J16k8k4n7J53j12J71j1l17N7J60Jq9M6j08P9
$$ 132 -68 48 20 -4 -61 92 -20 151 140 -177 -120 40 41 -48 -2 -110 -31
8191c1
$$ Imaginary data points
##PAGE= N=2
##DATA TABLE= (X++(I..I)), XYDATA
0@%%%%%%%%%%Qj6J6j6K4l2M0m8N6p2Q8j04J20j37J61j92K24k57K97l44L93m50
$$ 0 0 0 0 0 0 0 0 0 0 0 8 -8 8 -8 16 -16 24 -24 32 -40 48 -56 64 -73 88 -104 120 -137 160 -184 209 -241
32b41N14n80O54p40Q34r36J046j167J301j447J608j782J971k181K407k652K926
$$ -241 273 -307 347 -393 441 -495 551 -616 685 -762 846 -936 1035 -1146 1261 -1391 1535
49A535l225L550l911M313m757N250n805O434p153P984q956J0110j1508J3245j5469
$$ 1535 -1690 1860 -2051 2262 -2495 2755 -3050 3384 -3769 4215 -4741 5369 -6139 7106 -8363
64h363J8431k2594K8915l9773O3405k04034J41097K65259l05359J46194M4339
$$ -8363 10068 -12526 16389 -23384 40021 -164013 -22916 242343 -63016 83178 127517
75A27517l25309L4330L13263r5670m3834O0735j71457m0389K26272k4978n0089
$$ 127517 -197792 -163462 149801 54131 10297 71032 -100425 -140814 85458 60480 10391
86A0391O9799j34023q3229J89831K850p6103P5071o8253q7205J60838K0525j32926
$$ 10391 80190 -53833 -137062 52769 55619 -20484 54587 -13666 -100871 59967 80492 -52434
98e2434M3114K944r7967J27613J10272j20687m6970K101n9224J05341R3106r5013
$$ -52434 -9320 -6376 -104343 23270 133542 12855 -34115 -32014 -91238 14103 107209 12196
110A2196j0683k2208j26579J36209J83435j41368o7502P2182j45210j2390K57305
$$ 12196 1513 -20695 -147274 -11065 172370 31002 -36500 35682 -109528 -121918 135387
121A35387k6380j57668P9337o1172j20451K10539P7229j93945M3079N2841j55476
$$ 135387 109007 -48661 30676 -30496 -150947 59592 136821 -57124 -14045 38796 -116680
132a16680Q9316J75229j34524q1843Q8048n8069j8308J28968l2711q2938N0054
$$ -116680 -27364 147865 13341 -68502 19546 -38523 -56831 72137 39426 -43512 6542
143F542k1460j7030J01447l4969r7238N1204Q950k7113Q6495K80r9287J3734K2176
$$ 6542 -14918 -31948 69499 34530 -62708 -11504 -2554 -29667 56828 57108 -42179 -28445 -6269
156f269k1127P1070J8631j02595p46M5593l0100N1607N0652r6905l2734M2139
$$ -6269 -27396 43674 62305 -40290 -41036 4557 -25543 26064 76716 -20189 -52923 -10784
168a0784k4971N2350O7129r3763l6364O1774n0357K485J18998n7279j06227Q2445
$$ -10784 -35755 16595 83724 -10039 -46403 15371 -34986 -32501 86497 29218 -77009 5436
180E436J5350p0234R0236K9551j24027K3968O1177o4895L5823O3894r0097k0107
$$ 5436 20786 -49448 40788 70339 -53688 -29720 31457 -33438 2385 66279 -23818 -43925
192d3925P5322l5713j8854O4608l8250n2454N8785O980l1370M0399j7239n0460
$$ -43925 31397 -4316 -23170 41438 3188 -49266 9519 16499 -14871 25528 8289 -42171
204d2171M6147J3059l4752L5965O77n5554K7773L4795k8830Q387J2545m0384N437
$$ -42171 3976 17035 -17717 18248 18925 -36629 -8856 25939 -2891 5496 18041 -22343 -16906
217a6906L3351j8813P442K0357m4278k150M2258k6605n090L8354l4376k0676M3365
$$ -16906 16445 -2368 5074 25431 -18847 -20997 21261 -5344 -10434 27920 -6456 -27132 16233
230A6233j3979k0850L8944j3032l6696L8146O665m2369L2541K1461m9778J6657
$$ 16233 2254 -18596 20348 7316 -29380 8766 15431 -26938 5603 27064 -22714 -6057
242f057L1930m3765N590L9078l1695o392L1666k6734j3100L7118j0138k1160K6151
$$ -6057 25873 -17892 -12302 26776 -4919 -11311 20355 -6379 -19479 17639 7501 -13659 12492
255A2492q433k7752L0284J0381k8006J3528K703k7168K0864J9567k1424L213L712
$$ 12492 4059 -23693 6591 16972 -11034 2494 5197 -21971 -1107 18460 -2964 249 3961
268C961k2234J1081K4354j2894p528P050j6898J688L0873p131j8237Q182j3386
$$ 3961 -18273 -7192 17162 4268 -3260 3790 -13108 -11420 19453 12322 -5915 2267 -11119
281a1119n496L3214K128k0782J842r540p830K6966J1420k0392o697j409j0536
$$ -11119 -16615 16599 18727 -2055 -213 -9753 -17583 9383 20803 411 -6286 -7695 -18231
294a8231K0010K5324j9650j9127J691q039J3772K8646j0665k0264l417o438J1545
$$ -18231 1779 27103 7453 -11674 -9983 -18022 -4250 24396 13731 -6533 -9950 -16388 -4843
307d843K8143k816k7651r538M174P045K2869J0578k6310k0643R40R886K4641R208
$$ -4843 23300 20484 -7167 -16705 -12531 -5486 17383 27961 1651 -18992 -18052 -8166 16475 25683
321B5683k3688j8116j216P587K1948J4016j7651k9063o126J7627K1416J3082j0685
$$ 25683 1995 -16121 -17337 -9750 12198 26214 8563 -20500 -26626 -8999 12417 25499 14814
334A4814k7997j1211J0543K0362K0316r495l1282j1861J3590K3225J4841p003
$$ 14814 -13183 -24394 -13851 6511 26827 17332 -13950 -25811 -12221 11004 25845 18842
346A8842k3314k2751L970L0236K1826o332k7604k1176P239K1152J7777L889k3553
$$ 18842 -4472 -27223 -23253 6983 28809 22477 -5127 -26303 -19064 2088 19865 23754 201
359B01k8883J393L0128K5592n039k3759k1220p507K1418L0063M277j8782k7276
$$ 201 -28682 -27289 2839 28431 23392 -367 -21587 -29094 -7676 22387 26664 7882 -19394
372a9394j0762K6598K9708j048j9327k0724j3629J2292L6709J5530k6129k6579
$$ -19394 -30156 -3558 26150 25102 5775 -14949 -28578 -16286 20423 35953 9824 -16755
384a6755r199Q315L2629J6122k1657k0997j1852N48L2872K7629k2237l5748n431
$$ -16755 -25954 -17639 14990 31112 9455 -11542 -23394 -22846 10026 37655 15418 -20330 -25761
397b5761R643J6918K7933k175l6709j6060Q899J9541K7791n882l8162j2790J2423
$$ -25761 -16118 800 28733 26558 -10151 -26211 -17312 2229 30020 24138 -14024 -26814 -14391
410a4391J5345K3410P675l2043l2408Q407K8224J9018J386k4023k5610J843J7547
$$ -14391 954 24364 32039 -4 -32412 -24005 4219 23237 24623 600 -25010 -23167 -5620
423e620K5518J2903k9569l3167L891K0432K3775J2767k0975k8824o206J0379K3939
$$ -5620 19898 32801 3232 -29935 -26044 -5612 18163 30930 9955 -18869 -25075 -14696 9243
436I243K4806j8048m0849K702K1957K612J9386O582m4381j6701K8809J1633Q323
$$ 9243 34049 16001 -24848 -22146 -189 2423 21809 28391 -15990 -32691 -3882 7751 16074
449A6074O941l2297k2292K7332J6613m323J0329j7340l8723K1104L9639p245o293
$$ 16074 23015 -9282 -31574 -4242 12371 8048 18377 1037 -37686 -16582 23057 15812 9519
462I519o919l2016N365L7929O432n937p714l0993n761M1563J7208j8659p015j3480
$$ 9519 2600 -29416 -24051 13878 20310 14373 6659 -24334 -30095 11468 28676 10017 3002 -10478
476a0478k0473K2786L4602k744j9022j9112q108J6965J5417N673j499k3606j5818
$$ -10478 -30951 -8165 26437 23693 4671 -14441 -22549 -5584 9833 15506 14007 -9599 -25417
489b5417J9489J7148j141J143j4252k2053J8994K3066j5548K404Q892l4674J690
$$ -25417 -5928 11220 10079 11222 -3030 -25083 -6089 16977 1429 3833 12725 -21949 -20259
502b0259M6521j2112k7197J7070p329j7697L2881J4889l0911l184M148j6464K3812
$$ -20259 26262 14150 -13047 4023 -3306 -21003 11878 26767 -4144 -7328 -3180 -19644 4168
515D168K6327l2335j2313J6922j9211O105M0784j6718l2591J2455L64p901K9538
$$ 4168 30495 -1840 -14153 2769 -16442 -10337 30447 13729 -18862 -6407 -6043 -13944 15594
528A5594Q644l3292l023J1263j1721J3629K4249k0653j9802J1037M034j786Q300
$$ 15594 24238 -9054 -12077 -814 -12535 1094 25343 4690 -15112 -4075 -41 -1827 6473
541F473M839r303j4873M389J7246m104r656J0584j205j6588J0222J3424j7880
$$ 6473 11312 2009 -12864 -8475 8771 4667 -4989 5595 4390 -12198 -1976 11448 -6432
554f432r40J7868j4578l323K1860j7487j4795K7058k101j8532K0502J562k8593
$$ -6432 -7372 10496 -4082 -7405 14455 -3032 -17827 9231 7130 -11402 9100 10662 -17931
567a7931J1742J9483j5816M070J2893k4301l233K3381j1829k695K3094j8731j9303
$$ -17931 -6189 13294 -2522 1548 14441 -9860 -13093 10288 -1541 -4236 18858 127 -19176
580a9176K3598O52j6306J7968P156k3259J689J2521j1733K307J6758r092q533
$$ -19176 4422 5074 -11232 6736 13892 -9367 -7678 4843 -6890 -4583 12175 3083 -5450
593e450O838n985l780J1877O376m278q478k798L864k933M430J6911q272k2265
$$ -5450 1388 -4597 -8377 3500 9876 5598 -2880 -5678 -1814 -4747 -317 16594 8322 -13943
607a3943P707J0939j1840R150J8622k2843j6075K1553k834q755K2286o135k4325
$$ -13943 -6236 4703 -7137 2013 20635 -2208 -18283 3270 436 -8319 13967 7832 -16493
620a6493J4437P839j4242J2813P912k3071K036J9069j1477k679J4223j6345o134
$$ -16493 -2056 5783 -8459 4354 12266 -10805 -8769 10300 -1177 -3856 10367 -5978 -12112
633a2112K4882o330j3703J4767q941j6777K4241J3189k1098k938N905j3799M777
$$ -12112 12770 6440 -7263 7504 -1437 -18214 6027 19216 -1882 -4820 1085 -12714 -7937
646g937K5033m069j8459k187l023K852J7430N456j0389j3473o954Q914J3074N889
$$ -7937 17096 13027 -5432 -7619 -10642 -7790 9640 15096 4707 -8766 -15720 -6806 6268 12157
660A2157m92j4160j5235Q419J6829K095j754l033j7208l829K3311O695j0437L17
$$ 12157 11665 -2495 -17730 -9311 7518 9613 7859 4826 -12382 -16211 7100 13795 3358 3675
674C675j0571j0638K0499J2157j2549k431l611j2636J2976K2003j1515j5848L777
$$ 3675 -6896 -17534 2965 15122 2573 142 -3469 -16105 -3129 18874 7359 -8489 -4712
687d712n110J374K5106j16k3394k914O17R48K1256P662k2158j2567N025L755J1746
$$ -4712 -9822 -8448 16658 16542 -6852 -9766 -9149 -8201 13055 20717 -1441 -14008 -8983 -5228 6518
702F518J5167j2998k4520R3J1590J0091J1709o500k0674p442P622J3906J1434
$$ 6518 21685 8687 -15833 -15740 -4150 5941 17650 11150 -9524 -16966 -9344 4562 15996
715A5996m458j7387j2456P185J7261Q158l806j2573j2897J021J5685J5444l408
$$ 15996 11538 -5849 -18305 -11120 6141 14299 10493 -2080 -14977 -13956 1729 17173 13765
728A3765j8251q873K897R505J5514J683j7373j2891R85J1498J5574K870j5633
$$ 13765 -4486 -13359 -10462 -957 14557 16240 -1133 -14024 -13039 -1541 14033 16903 1270
741A270j6636J583J2422J0053O789q489k1744l640J6116J3409L279r168j5701
$$ 1270 -15366 -13783 -1361 8692 15481 6992 -14752 -18392 -2276 11133 14412 5244 -10457
754a0457o572J0366J6471O332p867j6042j0828J0880J9119L409p266j1654j1605
$$ -10457 -17029 -6663 9808 16140 8273 -7769 -18597 -7717 11402 14811 7545 -4109 -15714
767a5714M300J8735J1033q022j6642r113L871J5160J2627n550j3631j0017k022
$$ -15714 -11414 7321 18354 10332 -6310 -15423 -11552 3608 16235 10685 -2946 -12963 -14985
780a4985J5157J6723m442j6328r878J975J1095J2210K531j1969j5432o86J3059
$$ -14985 172 16895 12453 -3875 -13753 -11778 -683 11527 14058 2089 -13343 -14029 -970
793i70J3957P88j3412j0061j499P147J4563M889j2222j3338l787R744J4971K679
$$ -970 12987 13775 363 -9698 -11197 -4050 10513 15402 3180 -10158 -13945 -4201 10770 13449
807A3449r896j1675m341N410J2440R684q359j6618l265P676J0346Q188n986j2726
$$ 13449 3553 -8122 -12463 -7053 5387 15071 6712 -9906 -13171 -5495 4851 13039 7053 -5673
821e673n507K177J1646J1879m771j4735o461N568Q278O845J317j1095j1301L292
$$ -5673 -11180 -9003 2643 14522 9751 -4984 -11445 -5877 2401 9246 10563 -532 -11833 -8541
835h541R775R239L89j3171q143L579N508P889M027q725j1898n32J0598P596K48
$$ -8541 1234 10473 10862 -2309 -10452 -6873 -1365 6524 10551 1826 -10072 -10604 -6 7590 7838
850G838o416q850j470P227O361M947m438j2648j708Q513O113J614l569o717l856
$$ 7838 1422 -7428 -8898 -1671 4690 9637 5199 -7449 -9157 -644 5469 7083 3514 -3203 -7059
865g059K621Q352M595l778r072l974O266N001N75J448n435p998L559P177K919
$$ -7059 -4438 3914 8509 4731 -4341 -8315 -2049 2952 3527 4975 -460 -8458 -4899 2278 5197
880E197j230n808m190K349M825K592L0k161o069j932Q099L977l674j527k221j765
$$ 5197 3967 -1841 -6031 -3682 1143 3735 3765 1604 -4465 -6397 1702 5679 2005 478 -1743 -3508
896c508L532K883N59j873m123j310L701L813k050l486K036j122k732M560K713
$$ -3508 24 2907 3466 1593 -2530 -3840 -139 3674 1624 -1862 174 -948 -3680 880 3593
911C593m496j744K063J155n22J80O47j771kJ722j328J305P80l446J103L412j710
$$ 3593 -903 -2647 -584 571 49 229 876 -895 -897 825 -503 802 1582 -1864 -761 2651 941
928I41k455J601J771j739j161K670j075k613J592J962m48j914j329J505J178J23
$$ 941 -1514 87 1858 119 -1042 1628 553 -2060 -468 1494 1046 -868 -2197 -692 486 609
944F09N13k000r93l2J32M866J224o235j843L028L73J499M145k093p955L78N364
$$ 609 1122 -878 -1871 -1903 -1771 3095 4319 -1916 -3759 -731 -358 1141 5286 3193 -4762 -4384 980
961I80l9M030Q00j0640j581P577j107J551N999p877j0103P538P864m296J303J648
$$ 980 941 4971 5771 -4869 -6450 1127 20 1571 7570 -307 -10410 -2872 4992 696 1999 3647
977C647j0193n32J0873k97j880P64p554j271J0107K167m734p95k782l619O359
$$ 3647 -6546 -7078 3795 3498 1618 2382 -5172 -6443 3664 5831 1097 302 -2480 -6099 260
992B60Q247m393o600j858r53N720P454k615n884n540j425O901P371J244o594j0029
$$ 260 8507 4114 -2486 -4344 -5297 423 7877 5262 -622 -6162 -7587 -686 6685 7929 1335 -8694
1008h694j91Q615N165J595r19r870r272R641J3056l182k824j164j2689J095J8048
$$ -8694 -8885 -270 4895 6490 5571 -4299 -13571 -3930 9126 5944 3120 1956 -10733 -9638 8410
1023H410K20p350J246q457n963J6024Q440j2074k861J701q872O380J6171q025
$$ 8410 8630 1280 2526 -5931 -11894 4130 12570 496 -2365 -664 -9536 -3156 13015 4990
1037D990j1516L644k671K527J3168l518j2203k23J305J917J1554J572j4883n656
$$ 4990 -6526 -2882 -5553 -3026 10142 6624 -5579 -5802 -4497 -2580 8974 10546 -4337 -9993
1051i993O428L157P343M893j1531j0505K023O765R730L270r453r624l104N975
$$ -9993 -3565 -408 6935 11828 297 -10208 -8185 -1420 8310 11580 2127 -7497 -10601 -4626
1065d626J2278L339p533p642n573M6J3972J0204j1700r023L098n295M212J9061
$$ -4626 7652 10991 3458 -4184 -9757 -9711 4261 14465 2765 -6258 -3160 -8455 -4243 14818
1079A4818o210j7482M466K117k873J3693L318j8137k273R945l348M895J0186j5575
$$ 14818 8608 -8874 -4408 -2291 -5164 8529 11847 -6290 -8563 1382 -1966 2929 13115 -2460
1093b460j1028J3805L045j964Q456q915j4647Q820Q933l07M359n036j5965L054
$$ -2460 -13488 317 3362 1398 9854 939 -13708 -4888 4045 3738 8097 3061 -12904 -9850
1107i850J4428Q67K08N65j4268n301J3279P475P27k852j0975m436O882O821N828
$$ -9850 4578 5445 5653 6218 -8050 -13351 -72 7403 8130 5278 -5697 -10133 -3251 3570 9398
1122I398j732j1880n191N712N306M986J939j1165p780Q978K392l78R172q148j5376
$$ 9398 7666 -4214 -9405 -3693 1613 6599 8538 -2627 -10407 -1429 963 585 9757 1609 -13767
1137a3767J1053R148p370M666J763j5275J906J5235l568l762N071j1288m826J8097
$$ -13767 -2714 6434 -936 3730 5493 -9782 -7876 7359 3791 29 5100 -6188 -11014 7083
1151G083J083j0074N806n372j0984J4123R702j0001j522o32r231O906J3333n927
$$ 7083 8166 -1908 3898 -1474 -12458 1665 11367 1366 -156 -788 -10019 -3113 10220 4293
1165D293n513J683q451L02J5994j107q994J140m181k051J0383L184m559k250m743
$$ 4293 -1220 463 -7988 -7686 8308 7201 -1793 -653 -4834 -6885 3498 6682 2123 -127 -4870
1180d870p50Q742K859n268K38k355n003P690N620p039r1K27o441P074P195r340
$$ -4870 -5620 3122 5981 713 951 -1404 -6407 1283 6903 -136 -227 0 -6441 633 7828 -1512
1196a512j081M673p061J617J1204n248q466N390n44l529J0241l24j0787M400J564
$$ -1512 -2593 2080 -4981 -3364 7840 2592 -5874 -484 -1028 -4557 5684 5360 -5427 -1027 537
1211E37o331R959M484j2704k3O345n138K085Q608o427o864N536p46j095P652l690
$$ 537 -5794 4165 8649 -4055 -4078 2267 -2871 -786 7822 1395 -5469 67 -679 -1774 5878 2188
1227B188p244N261Pl840P049n04o843K618J717k036L390M25n189K311K466m159
$$ 2188 -5056 205 212 -3628 3421 2917 -3926 -1308 409 -1627 1763 2188 -3001 -690 1776 -2383
1243b383L020L980p449j23O758m383o39N047m976j468N585l376j121N595m439
$$ -2383 637 4617 -2832 -2955 3803 -580 -1219 3828 -1148 -2616 2969 -407 -1528 4067 -372
1258c72m223P201n44o369N613J743p961M676M016p397L319L827p320K638N897
$$ -372 -4595 2606 2062 -4307 1306 3049 -4912 -236 3780 -3617 -298 3529 -3791 -1153 4744
1273D744p076r34P321m263l167O876j863n470N262M11l854M904j768n621N976
$$ 4744 -2332 -3266 4055 -208 -3375 3501 1638 -3832 1430 1841 -2013 2891 1123 -4498 1478
1288A478P09n291N385O07p634K893N263m048K48L187n822n28O102k560j179M846
$$ 1478 2187 -3104 2281 2888 -4746 -1853 3410 -638 -390 2797 -3025 -3553 2549 -11 -1190 3656
1304C656n960l134Q673p83l796M002k541m651N531J968l136K068j555n595N177
$$ 3656 -2304 -5438 3235 2452 -1344 2658 117 -4534 997 2965 -171 1897 342 -5253 -76
1319g6N121n734M68L001p421J469Q389l812k641K045m521O5P457j469l815K382
$$ -76 5045 -689 -221 2780 -4641 -3172 5217 1405 -1236 809 -3712 -3647 3810 2341 -1474 908
1335I08k912k855P616K709o732J81K72l730N895L777n100j20m93m144N757N326
$$ 908 -2004 -4859 2757 5466 -1266 -1085 -813 -4543 1352 5129 29 -91 -584 -4728 1029 6355
1351F355n579l014J803k643R69P198j882n920R19q60K34P520j457o596J468n53
$$ 6355 776 -2238 -435 -3078 -2109 5089 3207 -2713 -1794 -2654 -2420 5100 3643 -2953 -1485 -2038
1367b038j215O796J721o672k037J496M11M520K647n835l043K199j391L811O002
$$ -2038 -3253 3543 5264 -1408 -3445 -1949 -1538 2982 5629 -206 -3249 -1050 -2441 1370 7372
1382G372o952n356L589K97J421M858l019o388P28K483J375M284j425p852Q6M501
$$ 7372 420 -4936 -1347 -1050 371 5229 2210 -4178 -3450 -967 408 4692 3267 -4585 -4499 2
1398BRK955J523o913k860M017K319K955l8n933k325K549K606K242J281m333n409
$$ 2 11 2966 4489 -2424 -5284 -1267 1052 4007 3969 -1964 -4289 -1740 866 3108 4389 56 -5353
1415e353K630M639J152N87l448m947J731L115K423K132m492n572J820L903K381
$$ -5353 -2723 1916 3068 3655 207 -4740 -3009 106 2529 4661 169 -5403 -3583 320 2701
1430B701R27k592n026l13M495K263J070r47o697q20O242J331k07O17m675l848
$$ 2701 3628 1036 -3990 -4303 192 2455 3525 2578 -4119 -4939 1303 2634 2427 3044 -1631 -5479
1446e479M478M748k87k094k692l156J918N656K98k452j602l575N41O184J835l087
$$ -5479 -1001 3747 3460 1366 -1326 -4482 -2564 3092 3390 938 -664 -4239 -3698 2486 4321 1234
1462A234k952j637P57K945L676o54n166j948J510K671L525m31m451k388J224K355
$$ 1234 -1718 -3355 -2598 347 4023 3369 -1797 -3745 -2235 436 3961 3530 -921 -3309 -2085 270
1478B70K475J249l078n425J338M598K85O27n12m792j132M169K379k91j216k624
$$ 270 2745 3994 916 -4509 -3171 1427 1712 2339 1827 -2965 -4097 72 2451 2160 944 -1680
1494a680k199K938M051j279k088l87k220P83M790Q93l340k482M24J227J460K605
$$ -1680 -3879 -941 3110 1831 -257 -644 -2864 -2081 2709 3602 262 -2220 -1796 -569 891 3496
1510C496j356m600o24K470J634J897l55m329k095L155J842q4J785k092o010K844
$$ 3496 2140 -2460 -3084 -614 1020 2917 2562 -1767 -3862 -707 1135 1051 2836 744 -5266 -2422
1526b422N111k043K9J511n051r68N343L72j713J932k466l860M716L569n043P71
$$ -2422 2689 646 675 2186 -2865 -3833 1510 1882 169 2101 -365 -4225 491 4060 -983 -212
1542b12K428n085P38N712k122l223J755n23o35K548M08k802n95R15j26J731J142
$$ -212 2216 -2869 -2131 3581 1459 -1764 -9 -532 -1167 1381 1789 -1013 -1608 -693 -819 912 2054
1559B054k428j642O79J164J680p34n22M2k688P37M605j073k631J254r91j782L178
$$ 2054 -374 -2016 -1337 -173 1507 773 251 293 -2395 -1658 2947 1874 -757 497 -494 -2276 902
1576I02J923l158K40J084m014K467M160m763n60M719m617k024O657j876m269M297
$$ 902 2825 -333 -93 991 -3023 -556 3604 -1159 -1719 3000 -1617 -3641 3016 1140 -3129 1168
1592A168O61m751K978K506n104J408M596m774j80M715m297j816N559r65l134K449
$$ 1168 1829 -2922 56 2562 -2542 -1134 3462 -1312 -1492 3223 -1074 -2890 2669 1704 -1430 1019
1608A019k43k826K011J741j741M13l1k138J478J705j763O27L63j911R65M49o61
$$ 1019 776 -2050 -39 1702 -39 374 343 -1795 -317 1388 -375 252 615 -1296 -331 118 -543
1625e43J269p42j493K449m2k444J544J604k389Q72K138l048q02L120k068j82M364
$$ -543 726 -16 -1509 940 898 -1546 -2 1602 -787 85 2223 -825 -1627 1493 -575 -757 3607
1642C607l996k886N014j402k531N144k36o250J743L398l159J668L340n079j836
$$ 3607 -389 -3275 1739 337 -2194 2950 2714 -3536 -1793 1605 -1554 114 3454 -1625 -3461
1657c461M513j652J34M245l709l607L975L96j558K726l43l842R90K376q03Q56
$$ -3461 1052 -600 -466 3779 70 -3537 438 834 -724 2002 1659 -2183 -1193 1183 380 1236
1673A236nl298J054K284j282J012J98l293M94K274k60R51r05l208J243K293m29
$$ 1236 1231 -2067 -1013 1271 -11 1001 1199 -2094 -1600 674 414 1365 460 -2748 -1505 788 359
1690C59J001Q47m511j462N124J95j448K591l298l921N032J873k246K577j858n672
$$ 359 1360 2207 -2304 -3766 1358 1553 105 2696 -602 -4523 509 2382 136 2713 855 -4817
1706d817L668M626l002l49K104n259q80O508l07k717J690k946k269N497P81k990
$$ -4817 -1149 3477 475 126 2230 -3029 -3909 2599 2292 -425 1265 -1681 -3950 1547 2328 -662
1722f62J243j092l199L696L685k858j611O58j999J476L845j558k006N6k559J852
$$ -662 581 -511 -3710 -14 3671 813 -798 -140 -2139 -663 3182 1624 -382 -326 -2885 -1033
1738a033M497j653k120j78j872P57L752K72k258r61j741q5M951N48l971N34n44
$$ -1033 3464 1811 -309 -487 -2359 -1602 2150 2422 164 -797 -2538 -2623 2328 2876 -1095 -561 -1105
1755a105k287M680K756m023j297M52j505K722L479l033k484J091j013P70M472
$$ -1105 -3392 1288 4044 21 -1276 -824 -2329 393 3872 839 -1645 -554 -1567 -797 3675
1770C675j286m792J342M74r24M023J20m123j04M75j95L137J223l926j658J878
$$ 3675 2389 -2403 -1061 -587 -1511 2512 2632 -1491 -1595 -1120 -1315 1822 3045 -881 -2539 -661
1786f61k18J248K686k694l010J682N11J144K401k481k619J457J05P10K455j417
$$ -661 -879 369 3055 361 -2649 -967 -456 688 3089 608 -2011 -554 -449 261 2716 1299
1802A299l242J42J964J58J432n0l695P8J999n26J776J030m231p97K846j50M67
$$ 1299 -1943 -1801 163 321 1753 1703 -1992 -1914 85 -441 1335 2365 -1866 -2663 183 33 500
1819E00J361k222k139J686J465J22Q27j201k968K004J806r59J247l97l317Q54
$$ 500 1861 -361 -2500 -814 651 773 1600 399 -2569 -565 1241 282 1529 1132 -2185 -1331
1835a331K235l73O89m06k385J52J892K62k31M32j983j552K985Q63j172P52j447
$$ -1331 904 531 1220 814 -1571 -1419 473 735 504 936 -1047 -2599 386 1249 77 829 -618
1852f18j412K123N88l27O78j416j431J610J603p08l59L46j877K99K047l56m71
$$ -618 -2030 93 681 354 1032 -384 -1815 -205 1398 690 331 677 -1200 -901 1146 790 319
1869C19J43k074P49K207q61m37L59j562l39J969Q83j468k16m0r77J623J057j541
$$ 319 462 -1612 -863 1344 483 46 405 -1157 -1496 473 1356 -112 -328 -368 -1345 278 1335 -206
1887b06K33O9j649J498J697j315n32K86o21M67Q81j57p35J42l95j35J408l12j573
$$ -206 27 96 -1553 -55 1642 327 -205 81 -540 -73 808 651 -84 58 -337 -472 936 624 -949
1906i49J049k9r12J149L29j128j21K99m9N61P7m95k27M22r6rJ053q45p20Q43k90
$$ -949 100 71 -841 308 637 -491 -612 -313 -362 199 276 -219 -446 -24 -120 -129 924 79 -641 202 -88
1927h8N38M88j430L58O93j173N00J367j227j117J208L45q37L88N80j352J99J281
$$ -88 450 938 -492 -134 559 -614 -114 1253 26 -1091 117 462 -375 13 593 -759 -560 721
1945G21j065L43N28j339L57J237n88n08L72p6n65O89P92n80m87J95k86N56O71
$$ 721 -344 -1 527 -812 -455 782 194 -314 58 -18 -583 106 898 318 -169 26 -260 296 967
1964I67q55k02l7n21Q54K76J48p26j028Q12N15n74P80L32j578L6R87K99n89L31
$$ 967 112 -90 -127 -648 206 482 630 -96 -1124 -312 203 -371 409 741 -837 -801 186 485 -104 227
1984B27j58j205J196J114j469M46M86j696P10J822j005r74N04J53q72J077J108
$$ 227 69 -1136 60 1174 -295 151 637 -1059 -349 1473 468 -506 -2 151 -721 356 1464
2001A464j647o61P24k29L88J087r35r60K15K6L39R85K5j405j056J515O47l94Q22
$$ 1464 -183 -844 -120 -349 39 1126 191 -769 -554 -528 -189 796 821 -584 -1640 -125 522 128 950
2020I50o09j341L00J126L92m14J18q51r11J532J077j712O38J9j808R95J998j057
$$ 950 341 -1000 -700 426 818 404 522 -329 -1240 292 1369 -343 295 314 -1494 -499 1499 442
2038D42j104P26l17q54J436R46k032J03P41j069J169J130j727m22J001k95n5J310
$$ 442 -662 64 -253 -1107 329 1275 -757 -654 87 -982 187 1317 -410 -832 169 -126 -181 1129
2056A129P3k239j24J711j40j05R50j560j150J245N27K34J1n35j085j31J610L84
$$ 1129 1202 -1037 -1161 550 410 305 1255 -305 -1455 -210 317 551 562 27 -1058 -1189 421 805
2074H05r39N29n87j495J633J166q33n74K48k98o60J758O71j875N14L04j500J259
$$ 805 -134 395 -192 -1687 -54 1112 279 -295 -47 -345 -1005 753 1424 -451 63 367 -1133 126
2092A26J399j792l64J257q66n25J794p6k295O06J259j042O10R30j866m53J586
$$ 126 1525 -267 -631 626 -240 -765 1029 953 -1342 -736 523 -519 91 1021 -845 -1298 288
2109B88l24J90P15q96j124N19J528n02k44N62j218p67J602P42n82m50k3n12j00
$$ 288 -36 154 869 -27 -1151 -632 896 394 150 712 -506 -1273 329 1071 489 39 16 -496 -596
2128e96J139M02j164M5J07j131J295R62j266n48O27l70l09J321L94k052M97J111
$$ -596 543 945 -219 -174 -67 -1198 97 1059 -207 -755 -128 -498 -807 514 908 -1144 -647 464
2146D64j059O03J227j647l77J644q35j18J298o45j605P58J406j452K48J278j846
$$ 464 -595 8 1235 -412 -789 855 20 -98 1200 555 -1050 -292 1114 -338 -90 1188 -658
2163f58n81K063o59m59Q05o36q27P62P45o75j14O38q95n11J865k68q97L95j05
$$ -658 -1239 824 165 -294 511 -125 -952 -190 555 -120 -234 404 -491 -1002 863 595 -302 93 -12
2182a2n49L64Q90q9q44J26L37n17O50M45q35q5K42n49L14N67k05q96L67N80r41
$$ -12 -561 -197 693 604 -240 -114 223 -294 356 801 -34 -119 123 -426 -112 455 250 -646 -279 301 -640
2203f40L73J000p89n81P55k38j71O31Pn49L09M01o24j44J015q26o31J348k07q97
$$ -640 -267 733 -56 -637 118 -120 -291 340 347 -202 107 508 -116 -260 755 -71 -702 646 439 -458
2223d58P77K5p66K91N20j00n08K96k17n89Q60K64p21L61m0n62O80J95j40l87P0
$$ -458 319 344 -422 -131 389 289 -219 77 -140 -729 131 395 -326 35 -5 -567 113 308 168 -219 -149
2244a49J52l32O10J76m20q8K11m94M11L44k82q2M0k24O3K9L51k84m46N37l46J62
$$ -149 3 -329 281 457 37 -51 160 -334 77 421 139 57 97 -127 -64 -35 316 32 -414 123 -223 -61
2266f1K38k66j3l71K87M09k13J25j81m92O77n1j44N20l19n27K21M45K71n81J68
$$ -61 177 -89 -102 -473 -186 223 10 135 -46 -538 139 88 -56 464 145 -382 -161 284 555 -26 142
2287A42J25o30L60N61n27M8j42n19O46R3j35k04q9j24r5N59K70l22l88K01q1L26
$$ 142 267 -363 -3 558 31 79 -63 -582 64 157 22 -182 -271 -395 -490 69 339 17 -371 -170 -251 75
2309G5K14l28M34n35j33O64L4j77j68l09J13P5K66J34l02k79j91K94N62m85j72
$$ 75 289 -39 395 -140 -273 391 425 248 80 -229 -116 -41 225 359 57 -222 -413 -119 443 -42 -214
2330b14J35l82J73N85k77j2j48m89M85O15j89j57j78l6k64M78O59o52m68N26m69
$$ -214 -79 -461 -288 297 20 8 -140 -629 -144 471 282 125 -53 -89 -353 125 784 132 -336 190 -279
2351b79N37L97o39K6j82j70L49L93q8m97j34K14k37K37K52n57J83j70J16O71j74
$$ -279 258 655 16 42 -140 -310 39 432 344 -153 -287 -73 -310 -73 179 -378 -195 -365 -249 422 248
2372B48l82L70m69j13N02K79k76l15r4K40N7M09j64m43J11l06J24Q88m77m04j2
$$ 248 -134 236 -233 -346 156 435 159 -156 -250 -10 47 456 292 -151 -40 -346 -222 666 189 -215 -227
2393b27j10J78K96R6l08l56K77l6L01K01l44k19M12n63K71Q05o63k41J57R5J9
$$ -227 -337 -159 137 233 -75 -431 -154 -190 111 312 -32 -251 161 -402 -131 674 11 -230 -73 22 41
2414D1L46Q2m75l35M10k10L17L44r76J6N13l64M71K88o36l23J62Q1O11m6k77l76
$$ 41 387 469 -6 -341 69 -141 176 520 -456 -440 73 -291 180 468 -168 -491 -329 -248 363 317 40 -336
2436c36n0N67Q9Mj8n11r5N53j2N16o32k19N0k55N32M33l89k81k55J64q3K90J71
$$ -336 -386 181 270 274 256 -255 -350 203 191 707 75 -144 -94 -349 183 616 227 -54 -309 -145 -228 62 233
2459B33m44k83N25m53K88Q57j099m50R17j97O7O14k57q36K45N92j45j90N20q53
$$ 233 -211 -494 31 -422 -134 723 -376 -826 91 -106 -39 575 318 -518 -273 319 174 -16 504 -349
2479c49j31R83k74k34M47m90o57O83K69J7n27Q3j87j60Q84J1m98k2l51N4N78J57
$$ -349 -480 503 229 -5 442 -48 -705 -22 247 264 -263 -180 -367 -527 357 368 -130 -152 -503 -449 129 286
2501B86k61m02J75L44k70N28K35q00j89O29j77Q7L46n71m74K59N45m0l91N61q92
$$ 286 25 -377 -202 142 -128 400 635 -165 -354 275 98 185 531 -40 -514 -255 290 250 -141 420 -472
2522d72k55J332l93n86N68l52o16N88P64o45k12M11m66k94J271r9p88M61k69m57
$$ -472 -727 605 212 -374 194 -158 -774 -186 578 -67 -279 132 -334 -628 643 544 -244 217 -52 -509
2542e09R46K21o49j79K03k72L7R07k78j062M43K33l90N66J08o16j21L36P5J5R
$$ -509 437 658 9 -170 33 -239 -202 705 427 -635 -192 41 -349 217 325 -291 -412 -76 -1 14 23
2563B3J61q24L22Q86o32J5M63o42j11M56L07m76j50M73n40j20J018m03n44M80
$$ 23 184 -640 -318 568 -64 -49 414 -228 -339 117 424 -52 -202 271 -269 -389 629 226 -318 162
2583A62j32n50O50L62p43n9L85l73k12J069o0j053K94N43o75M64O28r24j80N98
$$ 162 30 -520 130 492 -251 -310 75 -298 -510 559 499 -554 -260 283 -392 72 700 -224 -404 194
2603A94k70l13Q97o5j127N21M83o97N69M04q21j29L68J09l92M85P3q07K76N03
$$ 194 -76 -389 508 443 -684 -163 320 -377 192 596 -225 -354 14 123 -269 216 289 -518 -242 261
2623B61p17L36P05q62l23R19j26j47R5M0l85j22R00p0n79K79l10l33P80l0l91
$$ 261 -456 -120 585 -277 -600 319 193 46 141 181 -204 -326 574 504 -75 204 -106 -439 341 311 -80
2644h0k4J6N1l4M71J05j013K18M11n15O27M81r36j60K31k7J98J93J07q01n2P83
$$ -80 -104 -88 -37 -71 400 505 -508 -290 121 -394 233 714 -222 -382 -151 -178 20 213 320 -481 -533 250
2666B50l18J42N21q12m14R10j20j43L53Mj025L17Q21l52l4J92p66j39J028L6p38
$$ 250 -68 74 595 -217 -631 279 159 16 369 373 -652 -335 486 134 100 292 -474 -613 415 451 -287
2687b87L75k71m13N56M96k25n09M1n0p2R71k9o93r5j6M2N17K92k60p36k5L64R5
$$ -287 88 -183 -596 -40 456 231 -278 -237 -287 -359 612 583 -110 -205 -221 -179 338 630 370 -366 -391 -27 68
2710F8M76j29q19k37L11K45N57k38m23n78J56Q59Rj73J87o68l48J046Q0j97j17
$$ 68 544 415 -404 -641 -330 -85 472 234 -189 -767 -611 248 257 84 271 -397 -745 301 381 184 67
2731F7k91l21L53R18k12m57j08m56J38J042l8q20M2k63q0Q34L51n67p35R0K23
$$ 67 -224 -545 -192 726 514 57 -51 -507 -369 673 635 -185 -143 -406 -486 348 699 132 -603 -513 -290
2752b90K64P62l18q75j92J25N67P48m02k26o07jO75N10k28n61m59j84P23O62j28
$$ -290 -26 736 418 -457 -649 -524 43 791 389 163 -444 -445 230 740 512 -49 -508 -692 31 693 565
2773E65l49o76k08K90P76M62r02k29m26K5J045K78o52k37m72J94Q29M89n65o23
$$ 565 216 -460 -668 -378 398 860 -42 -271 -697 -672 373 651 -1 -238 -710 -516 313 802 237 -386
2793c86pj41O06P84k73r36j6j03L47R87j56r08k75QL54N73L97q25p43J00M61M38
$$ -386 -393 -534 72 856 583 -353 -369 -472 -125 862 706 -202 -477 -469 -115 458 855 30 -713 -613 -152 286
2815B86N51r20o52P0K07Q16N20o95p92q6J92Q27N10k59r81m73N92N37O06j34j043
$$ 286 837 -83 -735 -665 -458 358 878 183 -609 -695 -503 324 834 575 -406 -879 -287 250 856 722 -321
2836c21m23L15M73P62Pj197l10J67L90P38J44q42o76K26M91N05M26p96j076L82
$$ -321 -744 -429 44 806 813 -384 -694 -527 -137 601 745 -97 -773 -547 -56 449 875 79 -997 -615
2856f15N11K80N90m87p16k29O02M71K98m10o07n35O59O22J25O4q40o33M29O64
$$ -615 -104 176 766 279 -437 -666 -64 407 705 295 -312 -847 -188 434 559 623 -217 -850 -421 243
2876B43K76K9j018m85N41M25O04m5p10n57K12O23M70n2l61r24Q0J034J14J41l35
$$ 243 519 548 -470 -955 -414 11 615 570 -140 -697 -485 138 608 556 195 -729 -649 385 499 640 305
2897C05r69J74O41L49J30l79n66k96N66O92l42%l66n65L40O37m2k4l86n24N79
$$ 305 -664 -490 151 500 630 251 -315 -611 -45 647 305 305 -61 -626 -286 351 309 285 -101 -625 -46
2918d6M45j54M6k45n05J43M33M70m07j19l32r5N60K79o5j73n00k21M67L17Rp2
$$ -46 399 245 291 46 -459 -316 117 587 180 61 -271 -366 194 473 408 235 -265 -486 -19 298 307 235
2940B35n49J6K65k8L67k80j63k92O9N79p9n9M3m36L7M58o5m5J68k79k26L47O9
$$ 235 -314 -298 -33 -61 306 26 -137 -429 -360 219 140 81 124 -312 -275 183 118 73 241 -38 -264 83 152
2963A52j92K36o9m74M73J37j77j67L40n83N7M84k25o8L71n53O8J03L35j38q0J30
$$ 152 -40 196 127 -347 126 263 86 -81 259 -324 -267 217 -8 -76 295 -258 -190 -87 248 110 30 160
2985A60n89L36K86m1j36J59m80J51K33J14J81l64r4k20N8M79J93l78k19k9J16
$$ 160 -429 -93 193 152 16 175 -305 -154 79 193 374 10 -84 -304 -246 233 426 48 -171 -200 -84
3006h4J02J78P5o07p8L10p2L33M02p68m42M86K32L33O5j80p38O9M66J18J63j12
$$ -84 18 196 271 -336 -414 -104 -176 157 559 -209 -651 -165 67 400 465 285 -453 -384 82 200 363 251
3028B51o45j5N18J61K14k09n16k24M30L84N6k63m35l85J68R02J07m91n6m78k7
$$ 251 -394 -409 109 270 484 275 -241 -465 -35 349 405 142 -293 -678 -510 392 499 8 -48 -526 -553
3049e53P36L50K4r07j07K37N6R50p7r45k20K8L50O20J25m44q08q9N42O24K77l10
$$ -553 183 533 557 -350 -457 -220 -164 786 709 -236 -456 -428 -78 542 667 223 -585 -674 -132 492 769 459
3071D59j101j05O52N39J27l32p44l32N62Q05k6j98l84o21M2J204R2l14m15o36
$$ 459 -642 -747 -95 444 571 239 -505 -837 -275 530 504 306 -78 -699 -657 547 639 325 -90 -726
3091g26J66R20N02n26n37l70J03K83R85k12j015j34L9K79P86K37r08n52J51M64
$$ -726 -560 360 862 336 -201 -571 -468 -185 800 588 -427 -561 -522 -243 543 780 -128 -680 -529 -65
3111f5L88L08l08j159J53O91L46L51l72q27k11M97O37L35m65n14o60N46R62L4
$$ -65 323 631 323 -836 -683 8 354 705 333 -494 -705 -208 429 764 299 -215 -875 -329 633 667
3131F67j41p03p51N22P28L69l33p48m7j58N21R68m39p46r6k81N44J064k16q35
$$ 667 526 -177 -928 -406 322 691 358 -390 -437 -595 -74 894 455 -291 -387 -668 -124 940 724 -111
3151a11p11K44M59N22M86o53j053L09L96N17M01m96r08r0O28M88K43l23n13p86
$$ -111 -822 -578 -119 403 889 236 -817 -508 -112 405 806 310 -598 -688 -60 428 671 348 -165 -951
3171i51O35Q49j20L3n99o62K56R31L07k79n37o85L71N94R15m67q21k93m6O84P05
$$ -951 -316 533 413 446 -153 -815 -559 372 679 400 -137 -822 -451 143 1058 591 -230 -523 -569 115 820
3192H20p7o84m99j8N83L69J1l13r09J73M77N16J76n97p82J69M08M97J28k95m19
$$ 820 743 59 -440 -458 125 494 505 192 -717 -544 -67 449 625 28 -754 -585 -177 320 448 153 -266
3213b66o10P37P66j23k44l91n62L04O90M11m07n61k08p5P22M98n19m10j33j33
$$ -266 -876 -139 627 504 260 -131 -693 -389 301 712 305 -256 -464 -539 183 681 162 -248 -381 -514
3233e14N26O11k27n27k73R8J08O25O6m74n48J82K03O22J73p10k49q0K58M67J6
$$ -514 12 623 396 -131 -404 -306 -198 427 493 19 -529 -347 -144 478 651 -59 -308 -388 -130 337 353
3254C53j74l38l42M17M59J11l60l67k93M18J64L35j17o39n9J17N45m7q7k28j57
$$ 353 179 -159 -501 -84 375 486 126 -241 -534 -116 48 383 266 -373 -432 -315 230 183 96 -132 -289
3275b89n5L32L89j11k38j66J19J13K01N5l01l39K04P4J83K22n77j49K81O0J42
$$ -289 -344 -12 377 266 28 -138 -19 94 295 350 49 -290 -86 -12 171 393 -184 -333 -52 8 150
3296A50M8j80l9k43o2L02J76m8l02K6m4K25R6j55o7J45j07MK09r3J53p9k59K49
$$ 150 198 18 -21 -264 -326 -24 152 104 -198 -172 -216 9 105 -50 -117 28 -79 -75 134 41 194 115 -144 105
3320A05J21j32M3j85K7j5q4K16o9j67J93k92K79roM8k06Q5r8J2K66N3k14k1l42
$$ 105 226 94 137 -48 -21 -36 -120 96 27 -140 53 -239 40 31 25 73 -133 -48 -146 -134 132 185 -29 -50 -392
3345c92L83K51j16l2r0k51Q3L41J1M5l24j03J19J08K62j96k21j33OL12L78m10
$$ -392 -9 242 126 94 4 -247 -164 177 188 233 -91 -194 -75 33 295 99 -122 -255 -249 63 441 31
3367C1j52j89m2L05L37j43j37m76K48K14M32j69j66o6o9l7N09j38l02k69n8J22
$$ 31 -121 -310 -352 -47 290 147 10 -466 -218 -4 428 259 93 27 -42 -79 430 292 -10 -279 -337 -215
3389b15M62J27k78l23k92K96M37K32l27l85k19J96K14O46l23m44o7p4O02M19m12
$$ -215 247 374 96 -227 -519 -223 214 446 119 -266 -485 -289 -75 571 248 -196 -263 -337 265 684 272
3410B72n81j58L60L97J20j94j97n51K35N87J5J74o03k09L2K82M02J6m98k96nK72
$$ 272 -309 -467 -107 290 410 216 19 -532 -297 290 305 479 -124 -333 -301 -19 383 399 -99 -395 -400 -128
3432a28L75J28k56n78n9L02M51K95m67m83J70J37M09N04l83p97j95J56O47M64
$$ -128 247 375 119 -459 -518 -216 235 530 63 -420 -250 -113 296 800 417 -380 -575 -419 228 692
3452F92l90o30l21M30N36J24j19m95m87M17K17M79N0o69m53K23P10J38n6m07l95
$$ 692 302 -328 -649 -219 317 441 322 -173 -660 -243 -26 453 503 -166 -619 -396 314 452 396 -11 -406
3473d06L0L87M64N9n18m35m4N81L95o6k59p95J46L69K80L99l66p32O1K37M01K28
$$ -406 -376 11 475 534 16 -419 -463 118 513 447 188 -607 -461 -92 188 587 221 -511 -450 -213 188 416
3495D16k27n94l23O50K73K35No84n22O21L16J34M2l77n67M54K44N12k37m91l16
$$ 416 189 -405 -728 -78 195 430 435 -249 -771 -150 166 300 342 -35 -602 -148 96 608 371 -120 -436
3516d36N0M68L87j17l29l88j23O08M82j83n13k77K4L29K60K92n57l93O7n0P59
$$ -436 -386 82 469 352 23 -365 -488 120 602 419 -94 -371 -347 -18 242 534 -23 -416 -349 -399 360
3537C60J70l34m85k09M90L27K9K7n88k75L58L46K14j41n02k26K11L28K28k65j75
$$ 360 530 196 -289 -498 -8 319 348 375 -213 -488 -130 216 430 289 -213 -439 -228 100 328 63 -112
3558a12k98n7P12J80k76k56j86r4O60J37k6j64o02O1L83M19p3m33j11j11M1M62
$$ -112 -410 -467 245 425 149 -107 -293 -387 273 410 384 220 -382 -321 62 481 408 -25 -136 -247 -206 256
3580B56O9l42j86r1L15J48Q8j13l31m8O3K67J41J2l88j82J47L59J3Ok96k30L5
$$ 256 325 -17 -203 -294 21 169 257 144 -187 -235 -172 95 236 248 -140 -322 -175 184 197 203 -93 -323 -288
3603b88M77kj80l7o9j9J38L47m1l43m7m2O1L36J0n45K27j65k07N64N2k78j38J1
$$ -288 189 187 7 -30 -99 -118 20 367 326 -17 -64 -106 -45 291 301 -244 -17 -182 -389 175 227 -51 -189 -178
3627a78PL08L4J5k82N9J66n9J20l6k60O7O3K30j06o6j2k46R8J81L1k48J00o6k44
$$ -178 -171 137 171 186 -96 -37 129 70 190 154 -106 -39 24 254 148 82 70 -176 -78 103 134 -114 -14 -80 -324
3652c24K43L9R1m9o8O5l53M44p7j65L11o8k38J85N2j17J7K8Q0j93J18J08j63j9
$$ -324 -81 -42 49 0 -68 -3 -356 88 11 -154 157 89 -149 36 88 -29 -12 16 96 -97 21 129 -34 -53
3676e3R7l31M26J5l92L71m4k88n6K37O5j8j6j21j06P7K53O2k00o9j51M10L2K6
$$ -53 44 -287 139 154 -238 133 89 -199 -255 -18 47 29 13 -108 -214 -137 116 178 -22 -91 -242 168 200 226
3700B26k96k1o8J36J11K19j07l34O0N1K69K5j88m6j95j62L81J65J8q7p24K88M33
$$ 226 -70 -91 -159 -23 88 307 200 -134 -74 -23 246 271 83 37 -158 -320 61 226 244 157 -567 -279 154
3723A54l7R1j29l57l5L98K54j0l66k04j72N52J45kn2m96J06N9M85q8k37k34j99
$$ 154 117 208 79 -278 -313 85 339 329 -37 -241 -413 139 284 282 230 -266 -160 -101 384 296 59 -175 -374
3746c74L14L44K78l44o06o2J98M74J50m71j21k87J51N63L29k57m86m33M24L44
$$ -374 -60 284 562 218 -388 -450 -252 222 372 -99 -220 -507 -356 207 536 279 -207 -640 -216 128
3766A28K87j68l97k26r4O07K33l8n19m3k64N61M33M2m74l95n7M41K89O5n71l03
$$ 128 415 247 -150 -376 -470 137 370 332 -187 -230 -494 67 500 542 68 -327 -384 57 346 411 -160 -463
3788d63J11K41N11J87m02n86n6L09M13L69n14m19j70K78O29N1k43n33k94M52M76
$$ -463 -352 -111 400 587 185 -401 -457 -148 265 634 120 -299 -469 -191 438 489 246 -287 -581 -129 347
3809C47L5n0n57k26J33O39K22j87n35m22K48L44N08j20l29n46K0M69M41j13m48
$$ 347 382 332 -225 -451 -318 321 543 356 -179 -601 -353 -9 499 379 50 -496 -476 -7 434 321 -127
3830a27l77K49K45K97L02n46m48m4L28N38n0l76l26k75M11O56r5j34p59r1O56
$$ -127 -504 -255 -10 287 589 43 -405 -449 -121 417 367 -9 -335 -610 -199 457 362 228 -531 -622 34
3851C4J62J72j47n21k61L08M63L76l51m70j67Q8N14K06k22l70lj17M52M03j91
$$ 34 196 368 221 -300 -561 -253 210 586 235 -235 -402 -314 200 406 184 -186 -189 -306 146 549 358
3872C58m45l31K98L5M38k3m90l40P5L46L96J02m69j69j28K06M63J7j24m25l68
$$ 358 -87 -418 -120 -85 353 330 -160 -500 -425 -79 317 419 -50 -219 -347 -141 322 339 215 -210 -578
3893e78O06J95N0j1m73j22L05J7M01j45k63l10J41N18k5j54m59k13J09O57K57
$$ -578 28 223 273 262 -211 -333 -28 -11 390 245 -18 -328 -187 331 306 152 -307 -520 -411 246 503
3914E03k01m98j71P5K86L42j0m39j83QK63K50q4j23j04j00L08Q2O5q6l99m5K83
$$ 503 302 -196 -367 -292 -6 336 326 -113 -296 -288 -25 225 141 18 -86 -186 122 204 269 183 -216 -261 22
3937B2J22J51m21j13M7J10L04q4p5j48j54J28J28Q9p8o1n8m7Q0J04j32n9j46K41
$$ 22 144 295 -126 -239 -192 -82 222 138 63 -85 -239 -111 17 106 28 -33 -91 -138 -58 46 -86 -145 -291 -50
3961e0j4J74M5j31nj45K7K10P6k48j18N9K76j44J18m1j70q7J25J31M9j60J73j51
$$ -50 -64 110 155 24 19 -126 -99 111 187 -61 -179 -120 156 12 130 89 -81 -168 -43 88 137 -23 150 -1
3985aj03J21N2p5k9k5n4L16j82k15K50m4n7O4%j04m6o5P5J6K18M4l68K35j08l8
$$ -1 -104 17 69 -6 -35 -60 -114 202 20 -195 55 11 -46 18 18 -86 -132 -197 -122 -106 112 156 -212 23 -85 -123
4011a23L6P8j23K48J8M3k90k6J40m5J05r7p5J43o1K44o6j59j33J83j26J9J69j67
$$ -123 -87 -9 -132 116 134 177 -113 -139 1 -44 61 -36 -111 32 -29 215 149 -10 -143 40 -86 -67 102 -65
4035f5J54l06K55L5oq8O9l57L31L8j23l1j17J0Q8PK78k21N2l42J71P6J99J61m48
$$ -65 89 -217 38 73 67 -21 48 -309 22 60 -63 -94 -211 -201 -113 -106 172 -49 3 -339 -168 -92 107 268 -180
4060a80J39J36j09J33Lk51j29K00O9J3K54l80j33N7K74J00O1m23J27j54L74q5
$$ -180 -41 95 -14 119 122 -129 -258 -58 11 24 278 -102 -235 -178 96 196 257 -166 -39 -193 181 96
4082I6p1p1j00j02J89L89j70j36j39k06K70L38N9k87l03L2K06K25k6r0j65k69
$$ 96 25 -46 -146 -248 -59 330 160 24 -115 -321 -51 287 346 59 -244 -212 -6 219 193 103 -62 -331
4104c31Q7K15J42M0k82k24J57L07Q8l0k14o3j26K59J85n7k09j56k10N56J07m0
$$ -331 -244 -29 113 153 -129 -353 -196 111 199 169 -45 -108 -234 25 210 153 -56 -212 -422 134 241 201
4126B01n9l37p5J87N02j89k86k13J9J20M34Ln24J2M3o5M91N9k10l86P4J00M00
$$ 201 142 -195 -270 -83 419 230 -56 -269 -250 -130 304 307 -217 -205 -162 -227 264 323 113 -273 -199 -99 301
4149C01O4k51l61l6K73K98l9Q1l74l85M29L09N8l34j33p7j0K39K23k30k14k80
$$ 301 365 114 -247 -283 -10 288 249 330 -44 -429 0 309 367 33 -100 -177 -187 52 275 45 -169 -449
4171d49K07L95R5k29n2k33Q2K42L80jm49j74m7K10K95j23j14k18j99K34M94j07
$$ -449 -242 153 248 19 -33 -266 -184 58 438 437 -12 -186 -233 -23 272 149 35 -183 -382 -148 346 239
4193B39j92l51P2L09J29J73m61j99J9K70R6J76j75k24j83K90K47O6j24k20m32
$$ 239 47 -304 -232 77 206 379 -82 -281 -262 8 104 280 105 -119 -302 -12 235 301 177 -43 -475
4214d75K82N34k0k98Q5m40J62K01J95Pk94k98K35J58K57q7l29j23J97J30N7n3
$$ -475 -193 341 321 23 108 -332 -170 31 226 233 -61 -359 -124 34 291 204 -125 -248 -51 79 136 83
4236H3j18q7r4J87P8K13l17k88Q2J91J63J71k80j12j50K22N9J98j04l33N3J65
$$ 83 -35 -122 -216 -29 49 262 -55 -343 -261 -70 93 264 -16 -128 -278 -56 3 201 97 -236 -183 -18
4258a8K63r3o2k43o2K91j59K67ll94P0O6P3K40k44k32J74j23K19J60j92j17j96
$$ -18 245 152 90 -153 -215 76 -83 184 181 -213 -143 -77 -4 236 -8 -240 -66 -189 30 190 -2 -119 -315
4281c15K36K73q1O7J9k56J48j01K66j92P4m02K71J3M3J67m53J12M2j2J92K58l63
$$ -315 -79 194 113 180 199 -57 91 -10 256 64 138 -264 7 20 63 230 -223 -111 -69 -81 111 369 6
4304Fj34j97L93l4Q5mk99J41j0K3J30j22m2J42j51J62k13K70o1l15J15K31m3j94
$$ 6 -128 -325 68 34 119 115 -184 -43 -53 -30 100 -22 -64 78 -73 89 -124 146 85 -230 -115 116 73 -121
4328a21K70k12P1J3m1k9K7R3j22r1K45j32j40R3r9K34j09K38j42J4j80K13o4%
$$ -121 149 -63 8 21 -20 -49 -22 71 -51 -142 103 -29 -169 -76 -175 59 -50 188 46 60 -120 93 29 29
4352B9P7j6r1o1mR1r6J30J5rj20j31L29r3r8J45J46m97M30p5j03J87n7j22P8k18
$$ 29 106 90 -1 -62 -66 25 -71 59 74 65 -55 -186 143 50 -48 97 243 -254 176 101 -2 185 128 6 84 -134
4378a34K01Kj02j37o5L46k9R4l17O2M1P6k9ml9m3j60L52k82K10j49J55l1oJ56
$$ -134 67 69 -33 -170 -235 111 82 176 -141 -79 -38 38 9 5 -34 -77 -237 115 -167 43 -106 49 18 12 168
4403A68j9j36K2j53J36j6j3J50k72O7K40k6O6j61o5l1r4L11L5k80L6l39K81K06
$$ 168 149 13 35 -118 18 2 -11 139 -133 -66 174 148 214 53 -12 -43 -137 174 209 -71 -35 -374 -93 113
4427A13J0j06j13N6J46j59J20j46L7j19r0L09K28q5k29P9j72K72J30j10o4k51
$$ 113 123 17 -96 -40 106 -53 67 -79 -42 -161 -251 58 286 201 -28 51 -121 151 281 171 107 -144
4449a44JL29l7j72k4K4j64K36J3o0R9k16j10K49J51R3k52l4j66O3J97J96r8j49
$$ -144 -143 186 149 -23 -47 -23 -187 49 62 2 101 -115 -225 24 175 268 16 -18 -184 -121 76 272 174 25
4473B5j88Q7J41L0Q2j80k32J60L54j45n7j99N9J1K09Lr5k37j03LK97J81J09k92
$$ 25 -163 -76 65 95 177 -3 -235 -75 279 134 77 -122 -63 -52 157 160 65 -172 -275 -272 25 206 315 23
4497B3k30O7j2K63J44j82k07mO6J00K7j12j07O0j21L63J01o8o1j57j05L21P1k23
$$ 23 -207 -140 -152 111 255 73 -134 -138 -72 28 55 -57 -164 -104 -225 138 239 171 110 -47 -152 169 240 17
4521A7j69j6k7R3K71j85k62J56M3L86J20l10o8k66J16L0K92P5l88j39J85J35J00
$$ 17 -152 -168 -195 -102 169 -16 -278 -122 -79 307 427 117 49 -217 -101 -71 221 296 -92 -231 -46 89 189
4544A89M7k58k29K5K90K95j99j56k41J87p8L01k43J46j09j86K58J63q4p0j14k21
$$ 189 236 -22 -251 -226 64 359 160 4 -237 -50 -128 173 -70 76 -33 -219 39 202 118 48 -66 -287
4566b87J41K49K02k35k06l7J79J14o1l1j19n1M4J30K48k59k39n2K88J12L6p2l8
$$ -287 -146 103 305 70 -136 -173 6 120 59 28 -91 -142 -98 32 280 21 -218 -270 18 130 166 94 56
4589E6p1j24J25P8J30l2l42M5J00J25M4j10j08l4O8J98p1o0l40K36P7J37j6r2
$$ 56 -15 -139 -14 64 194 162 -180 -135 -35 90 134 24 -84 -118 -50 148 77 17 -323 -87 -10 127 111 19
4613A9p3j66J87J79j40k4N4q5pM3J00M4k57l1J14J96m6Kj20j28J58n9K49n8k93
$$ 19 -54 -220 -33 146 6 -18 36 -49 -56 -13 87 131 -126 -157 -43 153 107 109 -11 -139 19 -40 209 151 -142
4638a42Q6L3o2K17j39l9j4k36L54J40r3o5j12K26j98P9j40J91ql35K66J23l1j79
$$ -142 -56 -23 -85 132 -7 -46 -60 -296 58 198 105 40 -72 154 -44 35 -105 86 78 -257 9 132 101 -78
4662g8J83k20O0J0O6L5Jj37J60n3m6L8J77j97P5n3N6j07l9J11K0j35k6L41l04
$$ -78 105 -115 -55 -45 21 56 57 -80 80 27 -19 19 196 -1 74 21 77 -30 -69 42 62 -73 -99 242 -62
4687f2J6l6J30L6k56R1Q1R9k4Ll6j24J27L3j2r9K3j3J72n4L4n8n5j42N6p3K05
$$ -62 -46 -82 48 84 -172 -81 0 99 75 78 42 -82 45 78 66 -33 -10 -23 149 95 129 71 16 -126 -70 -143 62
4714F2M0k55M1J39j9J01l00N2K8J93L0r6n3N5k16N7L00j11n0r4j25K09J4j70K19
$$ 62 102 -153 -112 27 8 109 -191 -139 -111 82 112 16 -37 18 -198 -141 159 48 -2 -96 -221 -12 2 -168 51
4739E1k65J87J80k03J21k01r4R1J32k5K17m4j13j26J56p4l8J42j01j31k3Q6K73
$$ 51 -214 -27 153 -50 71 -130 -224 -133 -1 -26 191 147 34 -92 64 -10 -48 94 -7 -138 -161 -75 198
4762A98n0k61j2P2J25J5J10j7k80P8O9J19j22j76Q2J0m0Q2Q3r4m7n8k1K38J9k78
$$ 198 148 -113 -125 -53 72 87 197 180 -100 -22 47 166 44 -132 -50 -40 -80 2 85 -9 -56 -114 -135 103 122 -156
4788a56rNq8L55q7j06j04K15L0O4L9j51j16Q2j0J99r7n3k56J6K54L6J44q1k90
$$ -156 -165 -160 -248 107 20 -86 -190 25 55 119 158 7 -109 -27 -37 162 65 12 -244 -228 26 62 206 125 -165
4813a65O3j1K23m3k7j12N3j07K64k8n8j80k1R9p1K93L1k92KJ87o8J72m0m7j51
$$ -165 -102 -113 110 67 40 -72 -19 -126 138 110 52 -128 -149 -50 -121 172 203 -89 -87 100 32 204 164 117 -34
4838c4j55L59j45J42k44J1j5j8L20q4k05j4mm8L11J7k12r9j5n8K98m0O8k60J36
$$ -34 -189 170 25 167 -77 -66 -81 -99 221 137 -68 -82 -86 -134 177 194 -18 -117 -132 -190 108 68 136 -124 12
4863A2p0N9P9k8M6l35K40R2J09k59j02K4QK25r4jk6p6P1J06J86r1j60j69P7J11
$$ 12 -58 1 80 52 98 -237 3 95 204 -55 -157 -133 -125 100 6 5 -21 -97 -26 80 266 175 15 -154 -77 34
4889C4J36p9p4j77P3O7J5P9p7j3J30k9RKM0k33L1N9K3K2k9n4r7K1K70p1r6p7K8
$$ 34 170 91 17 -160 -87 -20 -5 74 -3 -16 114 85 94 96 136 -97 -66 -7 16 38 9 -45 -142 -121 149 78 -18 -95 -67
4918f7r3J56M3J7r4j24J25Q9l0J78j87j04J72n9KR4j88p3M9m7K74q5P0k51n4K27
$$ -67 -160 -4 39 56 -38 -162 -37 52 22 200 13 -91 81 22 24 118 -70 -143 -94 -141 133 48 118 -133 -187 40
4944D0p6q0l6Q1K2K6M0J1L8j8r9k2O3J98j92p6m2N9LL5K3K3L2k4j2o1J56k03K0
$$ 40 -36 -116 -152 -71 -49 -23 17 28 66 48 -51 -73 -10 188 -4 -80 -122 -63 -60 -25 -2 21 53 29 17 -44 112 -91 -71
4973g1M7J15k18N9L9j21K06j85%K16om2R4r0j2j2j2j09P5J26r7j21K69p8l25K02
$$ -71 -24 91 -127 -68 -29 -150 56 -129 -129 87 81 39 133 43 31 19 7 -102 -27 99 2 -119 150 72 -253 -51
4999e1J26k96K67j66K07j18J65j9j81J7K8J42r7L5l22L40j12p5J87r6R5n8L6j50
$$ -51 75 -221 46 -120 87 -31 134 115 -66 -49 -21 121 24 59 -263 77 -35 -110 77 -19 76 18 54 -96
5023i6J44j19R3M4J24j91J13o2k1Q0j87N2P0J43k78R5k9J83j99n8K0QK65k19M7
$$ -96 48 -71 22 66 190 -1 112 50 29 109 -78 -26 44 187 -91 4 -25 158 -41 -99 -79 -71 194 -25 22
5048B2j0k02J58l4J83%j01J8kO6k8M9J8k70J13J14rm4K7N0k92J8J55nj6O8M3q5
$$ 22 12 -190 -32 -66 117 117 16 34 32 98 70 119 137 -133 -20 94 85 41 68 118 -174 -156 -1 -6 -22 46 89 4
5076DQ7k87K00r2J00k50K90q1Q8j04lJ10P5l0l8j8j21N9QJ13o0j17J30j07NJ06
$$ 4 91 -196 4 -88 12 -238 52 -29 59 -45 -48 62 137 107 69 51 -70 -11 -3 110 50 -67 63 -44 -39 67
5102F7k04K4K08o8n7P6j85k0J15J58l8P8p7r0q4J7J15j22J90j04j04l0J13J86
$$ 67 -137 -113 95 27 -30 46 -139 -159 -44 114 76 154 77 -13 -97 -80 35 -87 103 -1 -105 -135 -22 164
5126A64l7j09j84J12J8q9J19m9K9R6p2J08j83P6j24L8P2J1J45j62k7P3N1N8L5
$$ 164 127 18 -166 -54 -36 -125 -6 -55 -26 70 -2 106 -77 -1 -125 -87 -15 -4 141 -21 -48 25 76 134 169
5151A69q7j57j7K2K5K3j50K68j49m3K19j09q7p8J50%Q2ol7j7p1R1M1L6j42K3R4
$$ 169 82 -75 -92 -70 -45 -22 -172 96 -53 -96 123 14 -73 -151 -1 -1 81 75 38 21 -50 41 82 118 -24 -1 93
5178I3j60J93m8qJ9m43L46r5M0q7J51j89J39J08O7j88l9K0LJ34N5j00J53l9k01
$$ 93 -67 126 78 70 89 -354 -8 -103 -63 -150 1 -188 -49 59 126 -62 -101 -81 -78 56 111 11 164 125 -76
5203g6J15J41j42n2rJ28o4P4m5%rk07J17K06R8m71M0L06n6r6Q2O8j80nJ12kn7
$$ -76 39 180 38 -14 -23 105 41 115 70 70 61 -146 -29 177 275 -196 -156 150 94 -2 80 148 -32 -37 75 73 16
5230A6j16J33j97K08k7K72l11M1j96O2J75k10M03m06Q9nJ81j98J64J3k13L1kK35
$$ 16 -100 33 -164 44 17 289 -22 19 -177 -115 60 -150 253 -153 -64 -69 112 -86 78 91 -122 -91 -93 142
5254A42j98QL1N3n1q2J60j27j04J67j08J63N0r4j86R0J85K09j14k02J39r9j00
$$ 142 -56 -48 -17 36 -15 -97 63 -64 -168 -1 -109 54 104 10 -176 -86 99 308 194 -8 131 32 -68
5277f8K38q1o2q9K5J06N7j08j7j81K74l26J92K42m33J74M8j39L04k06nJ9J11j39
$$ -68 170 89 27 -62 -37 69 126 18 1 -180 94 -232 -40 202 -231 -57 -9 -148 156 -50 -55 -36 75 -64
5301f4q4K75j8j55j27K80j21R4r4K2j09J02JK28j69L9j34j2J51qj91N5j36J01
$$ -64 -148 127 109 -46 -173 107 -14 80 -14 8 -101 1 2 230 61 100 -34 -46 105 97 -94 -39 -175 -74
5325g4J39j94J24l4L9O0m3j82J46l0mO6j8j6L7r6O1L8J68l35P5Q1M8q8l3K22j62
$$ -74 65 -129 -5 -39 0 60 17 -165 -19 -49 -53 13 -5 -21 16 -80 -19 19 187 -148 -73 8 56 -32 -65 157 -5
5352ep2j17K97o7N2o1J06k13j1R5lj24J38k1M8n1J11j05m1M6j14L7P8mll9Q7K30
$$ -5 -77 -194 103 36 88 27 133 -80 -91 4 1 -123 15 -6 42 -9 102 -3 -44 2 -112 -75 3 -1 -4 -43 44 274
5380B74k41J58j18j01pj24K24K1j63q6K19j40J51K0j40k7K76k02n4J21k6j17M7
$$ 274 33 191 73 -28 -35 -159 65 86 -77 -163 56 -84 67 87 -53 -80 196 -6 -60 61 35 -82 -35
5403c5L0N3M9rj20N2jJ2K9Mr3M0J13j09O0l0r2j35J96k4k6N3no5J03J07k06OL0
$$ -35 -5 48 97 88 -32 20 19 31 60 64 -29 11 124 15 75 45 -47 -182 14 -10 -36 17 12 -53 50 157 -49 -43 -13
5432a3l3j09L0L56k85Q3mj63L05l8n7m6K1n1J15q2j2O2j97Q3OJ05p9qJ01j53J87
$$ -13 -46 -155 -125 231 -54 29 25 -138 167 129 72 26 47 -4 111 29 17 79 -118 -35 -29 76 -3 -11 90 -63 124
5459A24k08N8o0o8M1J31N4j18p0M2P4J45r6J7l7L4l8p7J23l4M9O3j43J0P4j14
$$ 124 -84 -26 -86 -154 -113 18 72 -46 -116 -74 0 145 49 66 29 63 25 -52 71 37 86 149 6 16 90 -24
5485b4J30j94O8J31j26k9J02j99O1L6L13k99r5j38L01q5L7P7m1j65J03N0K12j35
$$ -24 106 -88 -20 111 -15 -44 58 -141 -80 -44 269 -30 -125 -263 38 -47 -10 67 26 -139 -36 14 226 91
$$ [...]
8191b5
##END NTUPLES=NMR FID
##END=
