##TITLE=1H_E3d0307-4
 CDCl3
 8 sc, 
 4.7.2023
##JCAMPDX= 6.0         $$ Bruker NMR JCAMP-DX V2.0
##DATA TYPE= NMR FID
##DATA CLASS= NTUPLES
##ORIGIN= UXNMR, Bruker Analytische Messtechnik GmbH
##OWNER= root
$$ XWIN-NMR		Version 3.5
$$ Tue Jul  4 14:33:23 2023 Russian Standard Time (UT+4h)  she@DPX200
##.OBSERVE FREQUENCY= 200.13135
##.OBSERVE NUCLEUS= ^1H
##.DELAY= (6, 6)
##.ACQUISITION MODE= SIMULTANEOUS
##.ACQUISITION SCHEME= undefined
##.AVERAGES= 8
##.DIGITISER RES= 18
##SPECTROMETER/DATA SYSTEM= spect
##.PULSE SEQUENCE= zg30
##.SOLVENT NAME= CDCl3
##.SHIFT REFERENCE= (INTERNAL, CDCl3, 0, 15.7039)
##AUDIT TRAIL= $$ (NUMBER, WHEN, WHO, WHERE, WHAT)
$$ ##TITLE= Audit trail, XWIN-NMR		Version 3.5
$$ ##JCAMPDX= 5.01
$$ ##ORIGIN= Bruker BioSpin GmbH
$$ ##OWNER= she
$$ F:/spectra/data/she/nmr/H-F/1/audita.txt
$$ ##AUDIT TRAIL=  $$ (NUMBER, WHEN, WHO, WHERE, WHAT)
(   1,<2023-07-04 14:32:07.89 +0400>,<she>,<DPX200>,
      <created by zg, POWCHK disabled, PULCHK disabled
       configuration hash MD5:
       00 E9 B6 7A A2 85 ED C7 34 08 36 98 17 FE 4E 26
       data hash MD5: 16K
       C7 C8 2D 55 12 82 48 82 96 4F 93 1A BD C2 E7 22>)
$$ ##END=
$$ 
$$ hash MD5
$$ E3 F1 F5 20 5C A6 14 C5 C3 0D 16 31 D7 28 92 01
##$RELAX= 
##$RELAX= 
##$RELAX= 
##$RELAX= 
##$RELAX= 
##$RELAX= 
$$ Bruker specific parameters
$$ --------------------------
##$DU= <F:/spectra>
##$EXPNO= 1
##$NAME= <H-F>
##$PROCNO= 1
##$TYPE= <nmr>
##$USER= <she>
##$AMP= (0..31)
100 100 100 100 100 100 100 100 100 100 100 100 100 100 100 100 100 100 
100 100 100 100 100 100 100 100 100 100 100 100 100 100 
##$AQSEQ= 0
##$AQ_mod= 1
##$AUNM= <au_zg>
##$AUTOPOS= <>
##$BF1= 200.13
##$BF2= 200.13
##$BF3= 200.13
##$BF4= 200.13
##$BF5= 200.13
##$BF6= 200.13
##$BF7= 200.13
##$BF8= 200.13
##$BYTORDA= 1
##$CFDGTYP= 0
##$CFRGTYP= 5
##$CHEMSTR= <none>
##$CNST= (0..31)
1 1 145 1 1 1 1 1 1 1 1 1 1 1 1 1 1 1 1 1 1 1 1 1 1 1 1 1 1 1 1 1 
##$CPDPRG= <>
##$CPDPRG1= <>
##$CPDPRG2= <>
##$CPDPRG3= <>
##$CPDPRG4= <mlev>
##$CPDPRG5= <mlev>
##$CPDPRG6= <mlev>
##$CPDPRG7= <mlev>
##$CPDPRG8= <mlev>
##$CPDPRGB= <>
##$CPDPRGT= <>
##$D= (0..31)
0 1.2 0 0 0 0 0 0 0 0.06 0 0.03 0 0 0 0 0.0002 0 0 0 0 0 0 0 0 0 0 0 0 
0 0 0 
##$DATE= 1688466727
##$DBL= (0..7)
120 120 120 120 120 120 120 120 
##$DBP= (0..7)
150 150 150 150 150 150 150 150 
##$DBP07= 0
##$DBPNAM0= <>
##$DBPNAM1= <>
##$DBPNAM2= <>
##$DBPNAM3= <>
##$DBPNAM4= <>
##$DBPNAM5= <>
##$DBPNAM6= <>
##$DBPNAM7= <>
##$DBPOAL= (0..7)
0.5 0.5 0.5 0.5 0.5 0.5 0.5 0.5 
##$DBPOFFS= (0..7)
0 0 0 0 0 0 0 0 
##$DE= 6
##$DECBNUC= <off>
##$DECIM= 32
##$DECNUC= <off>
##$DECSTAT= 4
##$DIGMOD= 1
##$DIGTYP= 9
##$DL= (0..7)
0 120 120 120 120 120 120 120 
##$DP= (0..7)
150 150 150 150 150 150 150 150 
##$DP07= 0
##$DPNAME0= <>
##$DPNAME1= <>
##$DPNAME2= <>
##$DPNAME3= <>
##$DPNAME4= <>
##$DPNAME5= <>
##$DPNAME6= <>
##$DPNAME7= <>
##$DPOAL= (0..7)
0.5 0.5 0.5 0.5 0.5 0.5 0.5 0.5 
##$DPOFFS= (0..7)
0 0 0 0 0 0 0 0 
##$DQDMODE= 0
##$DR= 18
##$DS= 0
##$DSLIST= <SSSSSSSSSSSSSSS>
$$ [...]
##$SUBNAM2= <"">
##$SUBNAM3= <"">
##$SUBNAM4= <"">
##$SUBNAM5= <"">
##$SUBNAM6= <"">
##$SUBNAM7= <"">
##$SUBNAM8= <"">
##$SUBNAM9= <"">
##$SW= 18.05172834244
##$SWIBOX= (0..15)
0 0 2 0 0 0 0 0 0 0 0 0 0 0 0 0 
##$SW_h= 3612.71676300578
##$TD= 16384
##$TD0= 1
##$TE= 0
##$TE2= 300
##$TE3= 300
##$TEG= 300
##$TL= (0..7)
0 120 120 120 120 120 120 120 
##$TP= (0..7)
150 150 150 150 150 150 150 150 
##$TP07= 0
##$TPNAME0= <>
##$TPNAME1= <>
##$TPNAME2= <>
##$TPNAME3= <>
##$TPNAME4= <>
##$TPNAME5= <>
##$TPNAME6= <>
##$TPNAME7= <>
##$TPOAL= (0..7)
0.5 0.5 0.5 0.5 0.5 0.5 0.5 0.5 
##$TPOFFS= (0..7)
0 0 0 0 0 0 0 0 
##$TUNHIN= 0
##$TUNHOUT= 0
##$TUNXOUT= 0
##$USERA1= <user>
##$USERA2= <user>
##$USERA3= <user>
##$USERA4= <user>
##$USERA5= <user>
##$V9= 5
##$VALIST= <valist>
##$VCLIST= <CCCCCCCCCCCCCCC>
##$VD= 0
##$VDLIST= <DDDDDDDDDDDDDDD>
##$VPLIST= <PPPPPPPPPPPPPPP>
##$VTLIST= <TTTTTTTTTTTTTTT>
##$WBST= 1024
##$WBSW= 4
##$XGAIN= (0..3)
0 0 0 0 
##$XL= 0
##$YL= 0
##$YMAX_a= 445700
##$YMIN_a= -624026
##$ZGOPTNS= <>
##$ZL1= 120
##$ZL2= 120
##$ZL3= 120
##$ZL4= 120
##$ABSF1= 10
##$ABSF2= 0
##$ABSG= 5
##$ABSL= 3
##$ALPHA= 0
##$AQORDER= 0
##$ASSFAC= 0
##$ASSFACI= 0
##$ASSFACX= 0
##$ASSWID= 0
##$AUNMP= <proc_1d>
##$AZFE= 0.1
##$AZFW= 0.1
##$BCFW= 1
##$BC_mod= 2
##$BYTORDP= 1
##$COROFFS= 0
##$CY= 11.3945322036743
##$DATMOD= 1
##$DC= 2
##$DFILT= <>
##$DTYPP= 0
##$F1P= 15.7292609196834
##$F2P= 12.9074282941183
##$FCOR= 0.5
##$FTSIZE= 0
##$FT_mod= 4
##$GAMMA= 1
##$GB= 0.15
##$INTBC= 1
##$INTSCL= 1
##$ISEN= 128
##$LB= 0.24
##$LEV0= 0
##$LPBIN= 0
##$MAXI= 10000
##$MC2= 0
##$MEAN= 0
##$ME_mod= 0
##$MI= 1.114404
##$NCOEF= 0
##$NC_proc= 0
##$NLEV= 6
##$NOISF1= 3.799351
##$NOISF2= 2.8
##$NSP= 1
##$NTH_PI= 0
##$NZP= 0
##$OFFSET= 15.70392
##$PC= 1
##$PHC0= -20628.05
##$PHC1= 8.05272
##$PH_mod= 1
##$PKNL= yes
##$PPARMOD= 0
##$PSCAL= 0
##$PSIGN= 0
##$REVERSE= no
##$SF= 200.130013532006
##$SI= 16384
##$SIGF1= 3
##$SIGF2= 2
##$SINO= 400
##$SIOLD= 16384
##$SREGLST= <1H.CDCl3>
##$SSB= 0
##$STSI= 0
##$STSR= 0
##$SW_p= 3612.71676300578
##$SYMM= 0
##$S_DEV= 0
##$TDeff= 0
##$TDoff= 0
##$TI= <>
##$TILT= no
##$TM1= 0
##$TM2= 0
##$TOPLEV= 0
##$USERP1= <user>
##$USERP2= <user>
##$USERP3= <user>
##$USERP4= <user>
##$USERP5= <user>
##$WDW= 1
##$XDIM= 8192
##$YMAX_p= 0
##$YMIN_p= 0
$$ End of Bruker specific parameters
$$ ---------------------------------
##NTUPLES= NMR FID
##VAR_NAME=  TIME,          FID/REAL,        FID/IMAG
##SYMBOL=    X,             R,               I
##VAR_TYPE=  INDEPENDENT,   DEPENDENT,       DEPENDENT
##VAR_FORM=  AFFN,          ASDF,            ASDF
##VAR_DIM=   8192,          8192,            8192
##UNITS=     SECONDS,       ARBITRARY UNITS, ARBITRARY UNITS
##FACTOR=    0.0002768,     1,               1
##FIRST=     0,             0,               0
##LAST=      2.2672688,     0,               0
##MIN=       0,             -624026,         0
##MAX=       2.2672688,     445700,          0
$$ Real data points
##PAGE= N=1
##DATA TABLE= (X++(R..R)), XYDATA
0 0 0 0 0 0 0 0 0 0 0 0 0 -8 8 -8 8 -8 8 -16 16 -16 20 -24 28 -32 40 -44 51 -59 67 -76 85 -93 108 -124 136
35 136 -153 170 -191 212 -236 260 -290 319 -352 387 -428 469 -518 570 -625 690 -762 840 -930
54 -930 1033 -1146 1284 -1444 1632 -1863 2150 -2519 3008 -3683 4670 -6233 8993 -14779 31452
69 31452 -169938 -624026 51643 111181 -177698 334023 265201 -408785 -166663 171330 -30957
80 -30957 154896 230569 -250264 -217555 82055 -26706 91831 216444 -146302 -153262 117438
91 117438 -25855 -12618 148407 -137216 -188650 158492 98409 -37718 85692 -79667 -200337
102 -200337 87988 139555 3367 37312 -117848 -195919 110657 169879 50447 108573 -126925
113 -126925 -319371 64233 197927 -24315 110653 46088 -328852 -67511 279644 20924
123 20924 822 118310 -237284 -206916 230368 92612 -69675 127571 -71476 -240142
133 -240142 118987 161735 -90114 8500 11878 -149914 39444 154876 -31726 -18110 11965
144 11965 -107212 20894 129337 -37993 -54039 3028 -68845 38464 142969 -18592 -71542
155 -71542 -12149 -78333 -908 142057 14080 -83834 -18476 -51373 2235 139182 27462
166 27462 -72422 -14969 -82289 -41017 157336 55337 -90902 17738 -28100 -100422 110798
177 110798 110293 -110560 -26902 40347 -96806 32743 152719 -56910 -72564 57759 -52642
188 -52642 -36226 113367 -12330 -93173 39927 8735 -40470 70161 22848 -79642 6747
199 6747 20991 -31794 45524 24203 -72903 5488 42315 -26244 26028 37464 -58705 -25189
211 -25189 33851 -2755 18759 28306 -44861 -21563 28945 -15868 7170 43715 -37995 -36034
223 -36034 33835 -9888 -5514 48331 -24082 -39106 37454 -10419 -32588 51122 5825 -55052
235 -55052 29259 23667 -48096 21337 37055 -43725 5531 35767 -41640 -2734 44786 -26034
247 -26034 -9236 37219 -29823 -26886 40337 -950 -21598 27985 -9770 -37717 25788 17051
259 17051 -19868 14378 -5365 -35964 20859 26687 -14187 8385 653 -36260 6238 34987
271 34987 -2268 -4600 -983 -26386 3989 37630 946 -8706 114 -34026 -10613 45491 15112
284 15112 -17304 -5761 -20830 -12216 33307 22336 -13461 -14763 -25049 -17889 37621 39861 -14422
297 -14422 -21302 -14634 -18783 22358 41544 -3315 -26658 -22345 -12245 28564 47107 2004 -33604
310 -33604 -27149 -13623 14557 44040 15303 -33775 -32955 -7472 22327 42695 11778 -35148 -39914
323 -39914 -16704 20136 46953 21930 -29137 -42610 -12931 22504 40212 22552 -25857 -49217
335 -49217 -19429 25481 49701 29335 -23930 -48148 -23765 17579 43684 28593 -18215 -48935
347 -48935 -29384 23812 52870 28659 -21000 -52184 -34491 13176 44762 36212 -10073 -51194
359 -51194 -35168 21013 53776 30838 -18782 -49128 -41040 6951 55302 44556 -8102 -46212
371 -46212 -40930 10555 54237 35298 -14583 -46474 -44068 -360 56124 53659 -9887 -50318 -39416
384 -39416 -4835 44074 51385 -9571 -51146 -37333 -4310 43735 61442 932 -58020 -43028
396 -43028 -713 31698 51463 14848 -50559 -45933 6873 38323 48220 11661 -54067 -53688 2085
409 2085 37816 47156 20193 -41232 -58624 -3054 45098 41732 7493 -41224 -57844 -10869 42604
422 42604 54309 20885 -40168 -59329 -11558 35808 48759 22046 -37058 -57273 -12933 32520
434 32520 50588 35336 -28840 -69011 -16791 35880 31146 26859 -4991 -61745 -27928 42777
446 42777 35357 12057 -7275 -54097 -35525 41143 42494 2773 -4601 -35934 -44108 34299 58831
459 58831 -4508 -23263 -26682 -39433 23423 69377 11237 -29871 -26143 -34148 6248 66626 28204
472 28204 -39522 -35509 -19923 -547 50776 46658 -20308 -48919 -31071 4128 38821 31507 -4154
485 -4154 -30096 -37452 -2275 43191 28826 -9133 -19547 -29270 -14175 38276 32388 -18968 -13251
498 -13251 -6891 -22063 26245 45522 -24473 -33074 7662 -6062 8254 42560 -9204 -44579
510 -44579 1225 7571 1661 38831 1763 -58073 -7199 26537 -3899 26549 26643 -52493 -37477
523 -37477 30830 13871 6010 28888 -20788 -50444 11749 31821 3053 15345 2706 -42134
535 -42134 -17376 28986 18414 466 111 -10839 -19823 -1424 23100 11736 -13323 -7793 788
548 788 -8562 2673 16568 -5516 -13003 10249 733 -11778 12131 342 -20803 15481 19457
561 19457 -17911 -352 9537 -22458 1652 32059 -6169 -14591 10926 -15575 -15420 32207 10097
574 10097 -21994 9902 -2467 -31567 15410 28259 -16410 -3640 13062 -20569 -12951 21225
586 21225 5145 -6444 10762 -3703 -19148 2133 9513 2161 8944 5594 -10352 -15543 -2482
599 -2482 15562 10156 -1102 5392 -9078 -27495 5551 28824 419 -5569 4990 -21384 -17774
612 -17774 26003 14062 -10529 6526 -10444 -26355 17942 21312 -13499 3732 5349 -25390
624 -25390 3925 28417 -11024 -11800 14546 -10891 -6912 29680 -3969 -28348 11806 6635 -12623
637 -12623 21623 11491 -35300 -11721 21291 4442 5827 13822 -20920 -31134 6724 21747
649 21747 13733 6800 -15344 -26781 -5387 18631 24663 8472 -15711 -23172 -12760 10418 31240
662 31240 16030 -17465 -21410 -7880 1104 20485 24377 -11991 -29136 -5269 6139 13346 22314
675 22314 -7510 -30268 -4999 8555 7573 19801 190 -34374 -11652 23023 13038 6670 4408
688 4408 -28287 -25253 21815 26335 5286 94 -21395 -28546 14442 35722 8706 -9635 -16978
701 -16978 -27306 -1213 38272 23505 -13677 -22139 -20066 -4284 27144 27105 -5873 -26275 -21831
714 -21831 -1836 24544 29636 -1145 -28435 -20953 -314 17963 27842 6759 -25883 -26850 505
727 505 24249 25358 3902 -21935 -28164 -6085 21709 27719 7930 -21398 -29774 -6038 21061
740 21061 26831 6617 -21525 -27188 -8950 16393 30891 12941 -22298 -29551 -5918 17202 24716
753 24716 12905 -16087 -31492 -8560 20187 26085 14228 -15065 -33950 -9678 20209 22970
765 22970 12739 -9891 -32901 -17467 20697 29924 10307 -11989 -29499 -21107 14710 29582
777 29582 13674 -6541 -27291 -24315 13019 31458 12966 -8716 -22172 -21194 5082 30206 20164
790 20164 -8244 -23642 -19446 5432 27787 17040 -7190 -20774 -20585 2782 27106 19099 -6300
803 -6300 -22830 -20707 3483 25238 17628 -5789 -19777 -19718 -1976 25662 23637 -7102 -22278
816 -22278 -16539 -1357 20829 23274 -539 -19167 -19619 -2910 20611 22422 -857 -18815 -17028
829 -17028 -3863 15384 22877 2146 -18689 -16956 -5340 13280 22924 1900 -19059 -14647 -3857
842 -3857 9091 20432 8394 -16681 -19881 -1823 12249 15767 6924 -11295 -16473 -4800 9125
855 9125 18102 7990 -13841 -15501 -2471 7281 14225 8479 -9524 -15845 -4587 7225 12088 7955
869 7955 -8135 -16837 -3488 8054 8613 7002 -3845 -14522 -6588 6582 11267 6746 -5683 -11132
883 -11132 -3384 4666 7504 7583 -130 -12124 -7294 7649 7222 2094 1210 -7130 -8237 3725 7342
898 7342 1989 -635 -4016 -6953 327 7887 1946 -4160 -656 -2066 -3531 4429 4948 -2769 -3582 -187
914 -187 1420 1509 1610 -233 -1608 333 248 522 3233 -1143 -3593 2692 2269 -2412 -241 1279 -1410
931 -1410 -841 1596 -483 -2775 -11 943 116 1321 -1672 -3703 527 3348 2412 -836 -2906 -1269
947 -1269 -1384 1476 8312 1509 -9307 -3727 3661 1531 4520 7090 -6669 -12340 2414 6025 2676
962 2676 7700 -3642 -15907 -171 8722 1340 6162 2370 -16089 -8071 11375 5836 393 3646
976 3646 -10056 -12168 9982 9225 -1308 3801 -6301 -14022 8567 15355 -2806 -4014 -1264 -10253
990 -10253 267 17278 4572 -10945 -7182 -4721 1660 14032 7225 -8672 -12592 -7271 5077
1003 5077 13880 8649 -4295 -16215 -12241 8301 16632 6267 -1828 -10206 -18165 313 23659
1016 23659 10557 -7240 -6168 -13646 -7509 20740 15285 -7734 -6101 -10826 -11790 17004 20526 -9441
1030 -9441 -10670 -1999 -11410 6167 24836 -4493 -19385 -391 -3250 1388 22648 1347 -22408
1043 -22408 -3894 4918 1331 16861 8787 -22150 -15207 8908 9554 10772 7237 -15828 -19146 506
1057 506 13366 17435 5098 -17112 -16775 -3312 8481 20459 9272 -17369 -17837 -3686 3683
1070 3683 18959 17483 -15755 -21341 1449 1783 8903 22673 -7725 -26598 1254 7213 2821
1083 2821 18917 100 -27077 -1817 14122 -1280 10317 8460 -26850 -11544 22372 3818
1095 3818 -2146 9137 -18371 -19541 19787 15179 -4201 2820 -11233 -21475 12367 24274 -489
1108 -489 -4727 -7956 -18830 3383 23883 8730 -4056 -11928 -17550 3182 18856 9160 1651
1121 1651 -10401 -20551 147 18315 7730 1444 -5573 -20197 -3246 19506 5076 -1529 2109
1134 2109 -18483 -10337 22843 8562 -9699 3028 -8432 -14084 17853 15743 -11630 -2091 -1575
1147 -1575 -14448 13013 22139 -13378 -10579 5344 -12405 2688 26622 -4703 -19815 1753
1159 1753 -3778 -2133 21999 4850 -20110 -4955 720 -3651 16690 11956 -17025 -10579 2120
1172 2120 -661 11557 11469 -9742 -9973 -2247 -779 12045 10696 -9830 -8576 903 -3023 6633 13384
1187 13384 -7431 -11236 2701 -1382 2615 12111 -6645 -12317 4834 319 -1133 11804 -2484
1200 -2484 -15546 3105 6384 -2505 8692 2299 -16233 -70 10314 -3474 5713 7764 -16106
1213 -16106 -6495 13352 344 -792 8274 -8184 -11641 7687 5400 -1995 4932 -4447 -10928 5132
1227 5132 5512 -2395 4459 -1816 -9948 3335 5430 -2227 3367 -702 -8111 3616 5468 -4145 2411
1242 2411 3489 -8304 277 8871 -3615 -2049 5048 -5757 -1520 8217 -3730 -3148 5799 -5244
1256 -5244 -4303 9281 -1300 -7435 6226 278 -8241 6542 3583 -9298 3859 4758 -8419 3469
1270 3469 6780 -8761 712 8688 -5873 -2131 7129 -4393 -3475 7617 -1258 -4469 4446 -2924
1284 -2924 -3698 8632 -433 -6843 4468 -1259 -6573 7535 3642 -8141 336 1247 -4831 5159
1298 5159 6230 -6556 -1754 3128 -4682 3084 9014 -6137 -5841 3547 -2194 1958 8503 -3348
1312 -3348 -6556 2201 -1170 771 9030 -2352 -10513 1413 2209 -2051 7623 2086 -11382 -1862
1326 -1862 4387 -23 6001 2641 -10582 -3852 5205 1099 4018 4364 -8601 -7102 5667 4344
1340 4344 2948 4050 -7241 -8157 5104 3928 1906 4774 -6665 -10671 4158 7608 1123 2267
1354 2267 -3357 -10358 -4 8524 2934 852 -3190 -10516 -470 9886 3498 645 -1806 -9696
1368 -9696 -2605 9688 5987 -382 -3240 -8669 -3265 9365 7048 -1327 -2382 -7274 -6133 9191
1382 9191 9641 -2492 -4427 -6006 -5607 6692 9812 -527 -5244 -6330 -5231 5690 11509 539
1396 539 -6872 -5038 -4282 3098 11305 3335 -6483 -6242 -4050 3651 10633 3587 -5996 -6518 -3695 2115
1412 2115 9200 5417 -5839 -8680 -3323 3035 8700 4773 -5402 -7401 -4243 1447 9630 6105
1426 6105 -5843 -8254 -3652 2049 8632 6650 -3915 -8375 -3931 1506 7688 8742 -3646 -10325
1440 -10325 -2633 2129 4997 8268 -509 -10055 -5258 2957 5283 5780 110 -8837 -6569 3205 5498
1455 5498 4131 1356 -7035 -8489 2701 7994 3903 -894 -4990 -6616 -552 8271 6853 -1514 -5877
1470 -5877 -5501 -1193 7348 7724 -1160 -6215 -5245 -1688 4529 8567 1375 -8031 -5759 265 2761 6036
1486 6036 3447 -6143 -6828 57 3540 4853 3095 -4184 -7170 -94 5398 3343 1708 -1657 -6566
1501 -6566 -2349 5681 5592 207 -3508 -4052 -2180 2850 6746 1658 -5610 -4194 -1391 1377 6303 3670
1517 3670 -5920 -6164 340 1363 2838 6043 -2238 -9289 -282 4217 900 4171 1528 -8092 -2674
1532 -2674 5152 1532 1776 3057 -5714 -5793 5766 3669 -2300 2490 -1179 -7229 2217 6198 -1559
1547 -1559 -1165 -230 -4312 49 5164 528 -2643 -734 -2099 -859 4548 2283 -2871 -2347 -888 1086
1563 1086 2659 1338 328 -2155 -3805 1927 4446 -507 -642 -164 -3922 -513 4914 334 -1820
1578 -1820 1172 -3249 -3549 5479 1796 -4910 2521 562 -6358 2902 5376 -4570 -758 3867 -3603
1593 -3603 -1243 5489 -1959 -3347 4907 -485 -3837 4568 259 -5299 3343 3356 -3566 760 1750 -3955
1609 -3955 -155 3404 -1173 -1086 923 -2662 -978 3397 260 -1440 738 -1272 -797 1423 147 555
1625 555 -169 -1730 1620 1592 -1915 399 1679 -2011 562 3295 -2274 -2405 2604 -1543 -978 5393
1641 5393 -1607 -5709 2865 744 -3146 4845 2047 -6745 -956 3088 -1760 2084 3960 -5082 -3465
1656 -3465 3645 -493 793 5485 -3572 -5690 3193 1725 -462 3799 -1025 -5230 615 2920 327
1671 327 2081 -548 -5003 -351 2770 344 1353 -550 -4643 -444 2717 1212 2177 -1752 -5174
1686 -5174 867 3390 -164 2236 582 -6508 -1424 6126 1246 -396 1971 -5301 -4032 6445 2861
1701 2861 -1592 1943 -4150 -6294 5134 5627 -2363 -149 -967 -6281 1434 7307 -455 -2260 -636
1716 -636 -5300 -139 7577 872 -2885 -257 -3510 -1610 6521 3647 -3239 -2194 -1294 -1041 4260 3916
1732 3916 -2465 -2998 -2001 -951 4276 3678 -2498 -3170 -2394 -777 4020 3343 -1977 -3228 -2646 -1304 4222
1749 4222 4896 -2289 -4149 -928 -1213 2200 6006 -634 -4936 -1471 -502 2280 5304 107 -4529 -1870
1765 -1870 -215 1156 4550 1642 -4794 -3308 756 1046 3064 2104 -4084 -3719 244 1145 3253 2298
1781 2298 -3370 -4199 352 2380 2138 1961 -1763 -4141 -630 2798 2949 1986 -1965 -3947 -133 2006
1797 2006 2432 2125 -1777 -4188 -1075 2261 2598 1348 -1553 -3906 -1548 2359 2211 1543 -561 -3905
1813 -3905 -2365 2475 2653 1159 -663 -2916 -1641 1520 2769 1752 -590 -2715 -2124 1574 3052
1828 3052 905 -526 -1804 -2512 738 3068 1169 -782 -2471 -2317 612 2319 1317 -722 -2150
1843 -2150 -1826 52 2311 2013 -881 -2245 -1705 318 2476 1406 -467 -1203 -1895 -85 2568 1802
1859 1802 -525 -1914 -1332 352 1735 1891 -99 -2074 -1879 -79 1857 1741 -1059 -1632 -1033 -612 1239
1876 1239 1755 -287 -1593 -1497 226 1316 1565 475 -1575 -944 121 612 1627 1012 -1576 -1158 411
1893 411 1083 921 211 -769 -1063 -365 889 908 -141 -997 -1528 218 1036 158 61 -539 -1461 -281 1219
1912 1219 1052 -478 -801 -257 -149 901 1395 -89 -799 -113 -111 694 962 207 -989 -618 683 389 -259
1931 -259 460 -412 -1150 380 952 -99 -541 -230 -79 -186 600 570 -640 -413 -230 -93 982 672 -910
1950 -910 -418 297 493 635 718 2 -837 -146 923 231 217 -86 -1296 -138 729 291 21 -54 -805 -1201
1970 -1201 736 1565 -663 -1054 331 -727 -431 1726 418 -1283 -203 183 116 999 952 -1088 -975
1987 -975 1128 26 61 1591 -591 -2137 700 1203 -372 66 110 -1325 -992 1274 754 -468 -173
2004 -173 -1054 -1103 1373 1145 -406 -243 -573 -736 354 1751 575 -1326 -431 190 -114 1075 1038 -827
2022 -827 -1039 264 438 517 789 -154 -1707 -196 1303 -230 232 726 -1743 -1515 1692 695 -900 217
2040 217 -95 -1616 450 2162 -651 -632 736 -1362 -203 2513 268 -1469 530 11 -1194 1238
2056 1238 1626 -1240 -1248 672 -145 -207 1441 -316 -1672 -76 323 -81 751 391 -1281 -1037 989 464
2074 464 -261 822 4 -1699 288 1489 -32 -307 582 -655 -877 1199 969 -934 359 299 -1794
2091 -1794 763 1768 -1317 -821 1170 -987 -841 1712 186 -2094 84 839 -1266 802 1453 -1756
2107 -1756 -610 1294 -500 -40 1381 -342 -1515 706 996 -424 324 882 -968 -688 751 269
2123 269 79 170 -526 -566 -56 389 166 -522 -86 -372 -772 751 787 -915 -125 576 -461 -359 1278 312
2143 312 -1398 399 693 -961 1110 1049 -1632 3 1547 -656 -247 1598 -764 -1831 1406 793
2159 793 -1510 762 902 -2195 -52 1527 -960 -289 1015 -751 -966 1320 337 -993 607 478
2175 478 -1358 332 1247 -795 -174 820 -590 -48 929 -11 -356 209 174 -193 390 408 -627 -458 348
2194 348 -311 -376 414 -45 -403 -228 729 57 -543 417 43 -871 542 664 -733 157 576 -401 -239 791
2214 791 -126 -985 712 782 -1127 539 749 -1294 -207 770 -463 -532 275 -405 -682 461 331 -732
2232 -732 199 320 -899 571 755 -1023 79 662 -284 159 618 -250 -434 204 179 -38 542 163 -803
2251 -803 214 389 -208 294 13 -607 -273 -37 267 11 -505 -170 -44 -146 70 392 -98 -669 98 539
2271 539 -11 446 232 -1143 269 775 -202 375 339 -1065 -453 993 156 -491 252 -414 -838 491 767
2290 767 -238 103 -351 -1051 624 726 -576 130 -184 -938 467 1090 -65 -455 109 -254 130 1246
2308 1246 47 -638 313 -221 -53 1260 330 -605 -137 -268 7 586 68 -451 -211 -391 -241 915 447
2327 447 -1075 -72 41 -586 661 1079 -861 -478 215 -457 559 1180 -480 -485 374 -22 156 1006 -69
2346 -69 -1134 179 233 -110 962 -111 -1200 376 131 -315 812 119 -1425 -198 531 -273 396 533
2364 533 -1094 -507 948 -48 64 840 -935 -638 891 53 136 567 -567 -630 598 284 -2 313 -333
2383 -333 -1004 455 553 -696 307 -77 -1375 260 960 -418 34 243 -956 13 721 -75 21 299
2401 299 -559 -301 1052 143 -598 676 -191 -487 927 409 -521 431 -192 -794 695 542 -513 -106
2419 -106 276 -668 -19 829 -598 -676 275 -130 -60 625 -182 -271 290 -168 145 620 142 -213 150 -15 -146
2440 -146 410 180 -383 51 -122 -468 484 144 -500 314 -262 -791 263 91 -443 245 -100 -883 132
2459 132 775 -482 -101 539 -783 -387 1081 -79 -643 647 -98 -584 765 577 -613 -57 98 -603
2477 -603 222 852 -462 -581 383 -398 -136 681 -320 -531 5 -162 78 248 80 -227 -466 -115 346
2496 346 202 298 -251 -733 -66 482 783 30 -127 53 -750 186 1058 -211 -532 -16 -309 -311 1077 432
2516 432 -1119 -229 284 -494 419 1312 -952 -823 563 -230 -275 1121 -91 -1174 125 597 -100 331
2534 331 705 -869 -530 715 -31 -280 627 -528 -803 627 589 -280 33 62 -850 -176 1038 53 -712
2553 -712 159 -556 -662 936 658 -637 -355 103 -305 129 1161 128 -912 115 269 -135 667 810
2571 810 -703 -628 205 59 -20 646 196 -1192 15 755 -366 -96 686 -369 -677 585 356 -252 136
2590 136 49 -931 -241 879 -124 -169 730 -307 -429 1007 327 -365 344 232 -735 10 1186 -275 -602
2609 -602 532 -314 -674 876 217 -1034 -133 266 -586 305 923 -521 -805 314 67 -496 1148 390
2627 390 -913 40 363 -280 242 729 -506 -691 13 384 10 738 79 -1056 -209 587 35 235 330
2646 330 -744 -952 498 647 -163 82 -62 -982 -28 886 241 -455 8 -353 -362 934 845 -405 -608 -22
2666 -22 -384 421 1500 -187 -1194 -59 29 146 948 395 -1128 -895 288 153 513 789 -697 -1322
2684 -1322 401 451 249 643 -509 -1192 -349 879 673 211 84 -738 -734 884 1016 44 -204 -553 -653
2703 -653 451 926 311 -514 -719 -271 -74 1014 830 -642 -1002 -273 64 649 759 -143 -1206 -502 677
2722 677 396 736 337 -1177 -736 774 618 639 592 -905 -1045 404 1083 371 150 -250 -1091 -83 1111
2741 1111 564 -14 -425 -1083 -346 982 565 33 -809 -678 -337 369 942 228 -551 -743 -319 513 999
2760 999 427 -310 -932 -401 673 670 470 18 -1219 -579 525 770 440 -229 -905 -768 437 1037 297
2779 297 -121 -441 -1277 19 1293 244 -85 -241 -972 -350 1164 911 -373 -273 -752 -475 894 1190
2797 1190 -89 -517 -582 -654 637 1194 71 -522 -911 -756 452 878 133 -674 -835 -541 266 1204 415
2816 415 -636 -782 -551 208 1380 591 -502 -885 -633 276 1025 729 -279 -891 -825 94 1079 959 -349
2835 -349 -839 -540 -411 1018 1138 -572 -938 -754 -434 851 1027 -210 -968 -896 -144 491 1051 300 -998
2854 -998 -906 14 467 1282 499 -799 -671 -253 629 1152 425 -746 -800 -403 401 869 434 -659 -1115 -393
2874 -393 339 827 882 -686 -1158 -393 389 1129 601 -516 -989 -360 473 1086 758 -395 -941 -325 445
2893 445 811 820 -193 -1106 -386 405 456 836 -98 -1094 -681 228 561 617 -100 -939 -1070 201 743 366 104
2914 104 -564 -776 262 655 385 266 -595 -770 133 635 623 14 -453 -519 -199 606 860 60 -502 -631
2934 -631 -240 445 363 215 -408 -895 -58 353 310 418 -221 -524 -178 155 264 220 104 -423 -268 399 251
2955 251 28 355 -235 -399 231 235 -43 139 -138 -486 -91 303 122 -123 169 -217 -433 433 350 -142 119
2976 119 -190 -361 147 409 233 -8 -134 -135 -181 472 487 50 -287 -261 -132 300 535 262 -274 -385 -32 -42
2998 -42 391 468 -467 -694 -311 -101 418 779 -66 -842 -318 226 183 333 284 -716 -834 385 345 497 435
3019 435 -505 -914 104 646 419 86 -292 -952 -286 912 606 -116 -378 -749 -562 596 941 141 -635
3038 -635 -574 -281 240 1105 497 -928 -507 -86 374 942 580 -441 -957 -203 692 866 607 -308 -1186 -413
3058 -413 797 799 486 -153 -1165 -829 570 1011 158 -71 -728 -992 269 1296 182 -271 -358 -919 30
3077 30 1331 563 -469 -658 -366 -52 1047 1157 -363 -1074 -286 84 508 1101 -159 -1106 -788 253
3095 253 639 760 194 -934 -1137 190 759 359 432 -660 -1315 135 1009 612 96 -518 -966 -396 820
3114 820 1055 46 -289 -748 -650 714 980 45 -408 -510 -409 254 1029 486 -948 -533 1 -3 877 612
3134 612 -738 -928 -46 487 663 622 -293 -1087 -453 696 548 471 -79 -936 -742 505 971 426 -184 -615
3154 -615 -862 215 1231 367 -264 -526 -920 -444 1019 700 -332 -611 -531 -408 576 1174 7 -775 -309
3173 -309 -235 83 1219 396 -879 -377 143 383 966 444 -677 -766 242 268 390 551 -517 -1008 23
3192 23 613 542 50 -396 -847 -537 371 875 120 -449 -512 -478 513 1003 340 -313 -593 -386 -85 651 721 -135
3214 -135 -744 -300 155 497 636 -80 -834 -453 66 313 597 227 -957 -652 328 217 398 353 -594 -739
3234 -739 189 555 312 170 -280 -628 -123 770 479 41 -221 -523 -32 845 557 18 -356 -533 -229 397
3254 397 635 111 -407 -539 82 121 548 77 -552 -493 -346 326 340 186 -170 -558 -351 389 202 77 21
3275 21 -490 -396 391 346 266 -15 -361 -177 157 331 61 -101 -317 -516 216 479 -34 -105 -261 -361 -63 297
3297 297 257 -56 -234 -227 -25 152 155 59 -143 -196 -155 236 303 147 130 -322 77 160 -24 -55 -15 -185 -221 -4 71
3322 71 147 -24 -51 -254 -202 74 63 91 -5 -263 -81 159 -46 104 87 -482 -207 166 108 267 29 -220 -240
3345 -240 81 342 16 272 -207 -443 40 338 79 24 -294 -529 -154 66 362 129 -265 -474 -104 352
3365 352 347 174 -178 -484 -141 406 517 265 -94 -584 -90 486 514 271 -128 -655 -417 308 801 330 -215
3386 -215 -666 -484 297 583 266 -184 -847 -833 329 728 422 -352 -706 -463 37 884 734 -234 -526 -575
3406 -575 251 997 624 -348 -547 -475 63 674 694 -105 -780 -722 57 692 639 -103 -650 -762 -23 887 786
3427 786 75 -620 -733 -310 719 842 147 -529 -960 -39 918 884 24 -858 -866 -65 604 1097 120 -1035
3447 -1035 -726 -302 649 959 126 -885 -925 -91 662 926 412 -819 -1071 -239 589 887 463 -634 -949
3466 -949 -378 540 937 523 -706 -1063 -457 555 1002 522 -464 -900 -583 316 858 363 -500 -925 -632
3485 -632 485 749 423 -381 -977 -282 223 828 701 -515 -838 -472 453 833 768 -215 -1099 -650 602
3504 602 870 474 -167 -982 -677 405 863 553 -161 -767 -789 15 1023 521 -173 -496 -726 -123 787 545
3524 545 -29 -488 -904 -184 601 573 -25 -807 -473 -43 531 826 74 -660 -610 48 491 611 165 -467 -725
3545 -725 -164 735 527 207 -295 -964 -166 652 415 126 -275 -732 -443 597 978 225 -254 -470 -475 319
3565 319 1002 307 -466 -487 -320 213 694 249 -351 -528 -79 -58 501 734 -195 -685 -185 10 354 358 -166
3586 -166 -466 -266 156 211 325 76 -379 -410 235 424 129 132 -244 -481 -75 512 413 -289 -554 -312 -261 595
3608 595 620 -135 -408 -213 -229 155 472 190 -551 -328 -90 -74 505 294 -175 -484 -20 101 260 203 -4
3629 -4 -229 -183 179 263 166 150 -340 -180 166 132 96 179 -55 -351 31 163 90 -84 13 -225 -64 95 -35 -52
3653 -52 -51 -231 -137 168 225 -113 -42 -175 -73 -102 371 213 -268 112 12 -131 178 291 -152 -289 -174 -57
3675 -57 4 300 114 -292 -196 -131 -283 54 291 37 -233 -165 69 112 291 158 -203 -195 -45 52 425 341 -188
3698 -188 -279 25 177 417 146 -55 -236 -515 293 97 136 15 -375 -491 140 233 262 -34 -305 -302 -32 473
3720 473 359 -181 -309 -346 -230 531 387 -45 -332 -370 -151 399 669 -13 -408 -316 -148 370 817 156 -611
3741 -611 -537 -209 212 648 279 -453 -626 -159 340 451 273 -540 -817 -311 508 738 152 -646 -675 -392 430
3762 430 802 132 -472 -754 -330 394 794 513 -376 -917 -381 319 619 484 -303 -849 -312 198 852 533
3782 533 -304 -1019 -599 354 730 498 -155 -839 -704 273 797 488 -246 -877 -721 334 889 542 -100 -834
3802 -834 -738 143 752 606 -229 -796 -617 27 870 706 -213 -765 -913 -37 884 679 -46 -789 -620 -14
3822 -14 634 840 42 -927 -921 -41 686 669 134 -629 -641 -89 918 871 133 -774 -1041 13 614 801 151
3843 151 -648 -845 -71 504 751 102 -501 -771 -290 595 685 275 -414 -782 -494 704 956 541 -330 -701
3863 -701 -181 427 877 350 -445 -823 -386 418 575 337 -238 -629 -464 288 712 350 -219 -568 -437 325
3883 325 754 551 -206 -657 -380 143 574 482 -134 -702 -284 230 532 452 -424 -479 -558 -224 465 535 -287 -571
3905 -571 -486 148 391 477 35 -642 -268 123 604 427 -158 -514 -286 -118 344 510 46 -463 -497 -84 382
3926 382 319 107 -252 -464 -22 153 393 276 -299 -185 -15 171 412 46 -330 -273 -100 89 403 137 -193
3947 -193 -508 11 182 197 -7 32 -312 -68 257 194 226 -276 -155 -102 112 299 57 -119 -117 -249 -47 248
3969 248 33 -112 -153 -188 -33 62 137 112 -253 -215 -19 216 120 -59 -227 61 -33 100 27 61 106 -71 190 61
3993 61 58 148 61 -191 -57 142 94 193 -107 -42 -30 -14 68 82 232 -138 -245 114 108 -32 116 121 -149 200 112 44
4019 44 86 -23 -91 68 91 -43 -214 81 44 -239 -112 -7 -36 -115 -117 -54 -284 177 56 -256 15 -261 -274 32
4043 32 337 36 36 -106 -217 -169 259 220 -26 -102 -70 -47 186 327 71 -105 -177 -133 204 188 33 -271 -129 -142
4067 -142 72 199 158 -160 -366 -197 145 163 57 -172 -372 -48 333 207 40 -146 -470 -267 392 448 198
4088 198 -39 -257 -163 207 327 308 -75 -419 -186 -42 518 123 -225 -529 -328 140 487 349 -141 -303 -344
4109 -344 203 152 197 83 -537 -482 177 421 495 -78 -414 -318 94 481 257 -11 -361 -483 -30 481 284 -24
4131 -24 -416 -447 83 496 440 61 -673 -476 196 351 514 11 -493 -403 -151 592 638 53 -336 -441 8 386
4153 386 416 228 -185 -644 -26 593 429 271 -412 -643 -280 505 469 110 -227 -702 -270 503 648 104 -359
4174 -359 -542 -359 242 674 227 -387 -609 -238 430 487 318 -661 -710 -168 296 515 367 -309 -564 -261 210
4195 210 558 237 -113 -617 -429 270 450 378 -169 -602 -310 291 659 256 -316 -537 -410 91 638 507
4215 507 -84 -419 -325 84 664 599 42 -545 -178 47 540 419 -62 -665 -291 233 488 403 42 -518 -423
4236 -423 -7 345 364 -204 -436 -449 81 637 315 -35 -579 -498 123 533 501 57 -337 -450 77 483 608
4257 608 -112 -342 -309 -19 355 197 243 -182 -203 -91 303 355 76 -167 -361 143 287 246 234 -257 -161 -253 172
4280 172 174 26 -197 -393 -68 206 264 73 -230 -338 -97 -80 287 375 -158 -402 -226 216 297 20 -272 -214
4302 -214 -243 109 154 -23 -92 -85 -49 -21 124 191 99 -242 -145 15 170 40 169 -21 5 -106 134 257 114 -187
4326 -187 14 -67 136 -27 -22 -12 -6 -34 33 112 42 148 169 31 76 156 -24 -112 -53 46 -57 169 -95 3 149 -55
4352 -55 -107 37 145 12 -161 87 86 -66 -1 195 89 124 -192 -121 13 139 19 51 -62 -156 -21 284 64
4375 64 -129 -199 -116 79 149 84 108 -140 -255 -22 108 123 -36 -95 -142 -31 197 126 33 -223 -287 0 199 282
4399 282 -170 -209 -341 -106 292 262 164 -260 -354 65 167 262 129 -53 -271 -90 49 370 203 -183 -324 -181
4421 -181 164 247 137 -70 -352 -341 234 364 256 -331 -529 -82 157 410 352 -44 -423 -246 225 404 339
4442 339 -170 -125 -262 154 386 403 78 -518 -274 215 438 322 -40 -511 -419 -148 392 376 116 -565 -425
4463 -425 -65 251 410 125 -441 -259 -22 390 640 190 -405 -521 116 206 246 119 -336 -659 -170 422 394
4484 394 46 -235 -741 -298 346 470 282 -302 -543 -188 349 537 278 -311 -382 -298 315 592 298 -370 -520
4505 -520 -238 253 547 288 -82 -568 -394 16 519 342 -92 -562 -321 343 635 264 -143 -435 -420 17
4525 17 482 226 -228 -429 -373 60 521 335 -282 -526 -418 121 618 419 -157 -479 -307 -5 659 676 91
4546 91 -684 -375 158 429 432 -95 -535 -566 76 629 449 75 -409 -418 98 628 584 -79 -471 -488 -5 509 539
4569 539 -75 -516 -464 -60 368 451 -12 -295 -287 -212 254 422 134 -601 -537 -46 258 377 157 -462 -449 -48
4591 -48 307 531 142 -399 -376 74 348 300 216 -260 -423 -158 355 303 41 -222 -312 -26 179 411 288 -189
4613 -189 -471 -254 213 246 -10 -45 -278 -245 75 211 69 -10 -305 -215 252 302 350 -29 -317 76 230 137 234
4636 234 -27 -291 -71 92 180 52 -251 -183 -193 138 164 102 -27 -39 -145 150 26 69 -112 1 -248 -67
4658 -67 293 -88 -117 27 13 -126 -45 -2 -4 -89 -30 92 4 -31 -82 75 -60 124 46 105 132 -152 228 122 59
4683 59 -11 -240 70 -19 -44 68 -120 -25 -7 56 190 26 -106 61 35 190 104 15 144 31 88 291 -33 -74
4707 -74 -19 34 15 48 214 -43 -149 -44 17 224 -19 -274 -328 -69 38 153 16 -119 -105 -237 126 302 221
4730 221 -54 -172 -57 79 159 320 0 -153 -154 202 171 119 -127 -218 -302 111 154 146 -82 -281 -205 17 273 131
4754 131 -154 -232 -130 3 205 307 184 -432 -175 83 284 197 -57 -223 -176 43 190 225 59 -235 -155 -46
4776 -46 257 355 94 -159 -527 -167 273 405 -1 -30 -358 -180 280 314 119 -240 -339 -40 95 254 27 -210
4798 -210 -231 -110 344 317 314 -273 -288 -208 283 314 141 -345 -249 -121 217 437 7 -295 -403 -154 266 369 22
4821 22 -210 -332 -386 300 444 154 -238 -235 -284 27 347 323 -26 -447 -308 40 363 168 57 -369 -253 161
4843 161 256 298 -159 -378 -269 91 493 257 6 -465 -279 71 390 364 -13 -329 -371 62 464 136 -102
4864 -102 -281 -281 -179 401 311 -45 -410 -220 75 471 219 -78 -330 -331 39 151 559 35 -408 -191 -46 411
4886 411 446 93 -174 -226 50 216 487 -54 -172 -384 43 357 441 109 -428 -335 -152 194 284 160 -278 -342
4908 -342 -106 256 97 51 -273 -260 -75 342 341 35 -300 -206 -38 169 315 31 -228 -322 -121 74 172 286
4930 286 -56 -176 -7 241 375 37 -168 -304 -94 138 236 90 -287 -421 -315 185 234 173 24 -127 -193
4951 -193 261 176 117 -36 -167 -171 203 274 99 105 -99 -109 251 197 -14 85 -252 -32 77 233 99 -89 -113 -121
4975 -121 31 190 107 -11 -255 -48 -60 197 98 -45 48 -176 -29 97 137 52 -176 166 -12 63 183 21
4997 21 -258 -193 -12 99 297 -123 -136 -173 70 125 182 76 47 -133 43 -95 111 105 -2 80 79 187 -70 -43
5021 -43 56 21 -33 -15 -19 -69 -69 24 43 -115 44 117 -25 110 137 25 -36 -95 18 6 86 -18 -8 -18 -51 -122 -29 132
5049 132 -8 -42 96 14 -148 5 26 -189 54 282 100 97 -146 -12 73 176 67 -147 -103 -87 179 170 29
5072 29 -10 -166 -101 132 139 68 -63 -29 -284 -38 90 106 140 -108 -86 -47 148 1 21 30 -171 31 174 219 -134
5097 -134 -208 -84 78 42 209 23 -2 -255 -120 224 355 -29 -169 -134 2 343 306 73 -89 -332 -187 250
5119 250 85 -80 -79 -132 -146 247 84 144 -269 -259 -36 121 235 -13 -196 -129 -43 404 356 -42 -186 -342 -40
5142 -40 117 407 114 -15 -282 -169 156 352 172 -253 -209 -255 110 432 305 -61 -273 -246 92 384 326 41
5164 41 -244 -250 171 299 268 -96 -535 -217 200 360 310 -112 -189 -175 -56 369 432 -86 -480 -294 105 400 249
5187 249 -95 -102 -281 90 312 238 -39 -589 -310 -53 538 449 120 -324 -371 -37 329 339 -26 -508 -426 -118
5209 -118 343 232 131 -284 -344 11 156 410 -49 -179 -370 64 240 442 127 -341 -414 -113 389 328 13
5230 13 -278 -211 28 242 293 42 -272 -388 -201 233 294 100 -145 -438 -81 150 402 95 -213 -341 -167
5251 -167 199 249 81 -119 -319 -312 85 267 195 -280 -329 -217 122 262 121 -138 -225 -400 159 417 370 -92
5273 -92 -221 -222 74 300 228 -51 -310 -228 205 509 143 -86 -107 -53 96 340 330 -168 -224 -359 13 290 56
5296 56 32 -208 -292 -42 275 23 18 -266 -280 100 69 163 63 -75 -65 -109 354 260 46 -294 -236 4 178 201
5320 201 -179 26 -253 91 -7 128 -17 -163 -150 -94 85 3 -48 -108 -90 16 -11 194 68 -138 17 -155 -32
5343 -32 250 82 2 -10 72 119 150 -127 -57 -31 -71 54 95 28 -104 -41 137 101 -58 -3 4 -20 -90 128 30 -62 -27
5370 -27 -6 -47 14 -64 2 -80 30 -21 81 -46 -114 -126 97 179 -74 -62 -169 -47 7 128 36 12 51 48 15 100 31
5397 31 -73 -139 -87 94 14 56 -228 -71 -40 170 245 -43 -185 -170 -126 -41 125 38 -80 -242 42 118 139 112 -327
5422 -327 -209 -171 -9 41 -93 -68 -168 -336 165 272 -4 -55 -186 -15 -59 153 130 -27 -213 62 51 94 0
5445 0 110 -171 -25 -29 276 137 -24 -219 -226 173 134 119 -185 -314 -158 116 66 248 -65 -163 -255 -59 303 146
5469 146 -46 -368 -241 -12 277 153 35 -205 -125 -39 262 263 43 -384 -225 -104 226 392 43 -257 -276 -39
5491 -39 100 167 23 -285 -284 -21 233 271 182 -152 -402 -40 278 252 184 -39 -325 -74 28 244 227 -46 -343
5514 -343 -126 330 398 55 -151 -91 -67 164 292 54 -66 -328 -203 139 153 194 -95 -285 -217 -69 281 173
5536 173 -300 -310 -226 169 234 164 9 -116 -65 169 296 110 90 -259 -248 -16 310 214 -61 -237 -77 41 432
5559 432 327 -205 -177 -220 241 489 357 74 -204 -189 106 190 261 -89 -179 -76 -44 161 254 -77 -331 -131 69
5582 69 243 186 -65 -277 -129 -14 161 208 4 -306 -189 40 213 223 42 -206 -116 -19 174 121 -121 -108 -211
5605 -211 35 138 189 -123 -186 -187 -6 196 92 113 -203 -207 182 255 145 64 -269 -265 -61 194 54 47 -191 -35
5629 -35 -72 140 223 157 59 -267 -105 132 34 109 -155 -42 -97 165 327 93 -65 -183 8 153 -73 92 -102
5652 -102 -189 -128 222 19 -42 38 -98 -159 237 56 -29 -98 -100 -87 -68 135 31 -128 -8 -15 -30 260 -6 -128 -197
5677 -197 -67 60 233 -123 7 -87 186 53 -111 185 -85 -93 -89 55 55 -148 -113 31 72 4 -19 47 123 -24
5701 -24 146 -103 20 8 -214 -109 10 2 -103 224 -27 -25 60 108 60 -127 -5 145 130 -79 39 24 -51 81
5725 81 -127 125 17 -125 44 63 72 -52 124 -167 -99 27 157 295 140 -109 -117 62 -2 -129 -162 -128 -82 17
5749 17 90 280 -2 -87 30 19 7 57 -21 63 5 -47 163 180 -137 51 -11 5 47 45 176 -67 -129 -74 108 -24
5775 -24 88 -86 -146 -111 41 -56 -271 -155 -119 -154 176 34 -80 1 -9 5 44 70 5 -182 -31 72 17 113 -142
5800 -142 2 -71 -9 179 245 -9 -126 -87 -22 143 -38 3 -66 -35 5 150 -3 45 -34 -77 -65 97 227 58
5824 58 -176 -97 53 114 102 -95 -109 -110 -203 105 187 -2 -109 18 7 83 147 67 -63 -128 -18 -116 268 30 -250
5849 -250 -333 79 -59 145 111 -97 -70 -137 175 13 89 -34 -238 36 15 -48 11 -82 -113 14 -6 107 136 -105
5873 -105 -155 -128 90 5 51 70 -23 -9 -30 59 105 -75 -249 34 -50 -19 248 50 -239 -17 35 -30 57 -85 -191
5898 -191 -86 -128 99 87 41 -77 -213 30 104 124 -185 -20 -162 43 133 224 38 -129 -61 67 131 147 -43
5921 -43 -108 -145 -44 267 133 11 -107 -16 -77 78 22 118 -225 -236 -32 -9 99 40 49 -71 -16 -22 114 -7 -92
5946 -92 -36 -61 60 145 -114 51 -130 -74 134 131 200 -212 -264 -116 3 232 6 -71 -180 70 166 224 11 -182
5970 -182 -309 -48 96 22 81 -40 5 -80 -127 292 23 -142 -45 -14 -149 145 -49 -161 -147 -87 81 264 234
5993 234 -128 -39 54 5 154 90 -64 -120 92 97 151 174 -183 -68 16 32 -111 129 42 -126 -88 35 229 79
6017 79 -167 -54 1 79 -79 -41 -102 19 34 -7 91 -48 99 -121 -22 35 152 90 -34 -29 58 74 -1 -35 23 -20
6043 -20 58 125 17 -38 150 -201 -40 38 -39 15 48 -136 79 -138 11 119 -143 105 163 28 111 -31 31 91
6067 91 72 -46 -75 -120 -140 -70 -30 43 -116 -167 -142 -12 -4 43 83 -35 10 -67 130 92 83 -52 42 21 99 151 -40 -273
6095 -273 -60 94 145 41 -53 -115 -155 29 51 214 -76 -92 -108 -55 246 -69 -116 -223 -112 13 100 92 -131 -169
6119 -169 -148 -17 134 95 186 -89 -27 -47 184 129 -134 -27 -133 100 103 75 77 -93 -115 38 78 114 -44 -301 -80
6144 -80 -10 -127 109 169 -252 -77 -155 124 212 -124 -115 -132 10 128 89 -2 -79 -126 267 137 182 14 -213 21
6168 21 70 70 157 47 -194 -251 -36 -35 -50 66 48 -325 -73 114 185 -67 76 -159 -65 16 223 43 -68 -95 -154
6193 -154 13 309 -73 -79 -119 -71 177 149 83 31 -170 -191 128 111 177 -259 -285 -242 -28 150 67 73 -32 -97 37
6218 37 118 29 -30 -13 72 -85 145 175 83 -177 -14 150 265 99 -28 -150 -68 -163 201 39 -79 -207 -268 -99
6242 -99 162 13 -71 -64 -229 -110 -34 66 -30 -184 -149 -110 -4 171 -33 -96 -66 75 184 41 -76 131 -155
6265 -155 -6 37 211 -47 29 -9 39 -107 129 90 -197 -75 -110 107 148 38 -63 0 30 -18 126 146 -106 85
6289 85 -18 99 49 60 -160 -133 90 76 -10 59 63 -6 -96 4 185 15 -89 -150 -33 20 106 -4 140 -156 0
6314 0 18 136 -58 -107 -12 -27 -8 -47 -64 20 -1 33 30 25 81 -70 -129 29 -80 49 112 -102 143 -135 -128 92 -91
6341 -91 -118 117 -143 67 221 28 -36 193 -96 -36 68 -44 -100 40 -41 172 182 142 -172 32 -209 159 25
6364 25 0 -118 -72 38 -26 216 69 -125 -124 18 233 88 -52 89 81 48 175 76 17 116 -177 -35 16 -57 107
6389 107 45 -28 38 67 166 142 -137 -79 -15 40 -212 178 -64 45 53 110 -25 -128 2 48 -73 -9 -12 -89 -43 -146
6415 -146 -35 113 -50 -178 -95 103 -8 59 126 -38 -93 16 18 191 208 25 -65 66 72 42 230 60 -91 -142
6439 -142 213 51 69 -83 -71 -183 79 3 192 67 -45 -36 -59 163 23 177 194 -54 -136 22 -59 12 -161
6462 -161 -156 20 -65 -29 120 16 35 79 11 73 49 -148 -19 -19 23 13 31 -53 -143 91 11 128 -11 -212 -139 33
6488 33 191 22 243 -33 53 -40 101 61 -100 -11 -38 6 185 -90 95 -114 -50 155 194 44 -39 -103 98 -29
6512 -29 115 97 149 -197 -157 18 -12 88 -68 -49 -182 -86 15 -23 -45 -47 -99 49 81 -46 -186 35 -65 55
6536 55 61 42 -57 -120 19 54 4 -23 -80 -18 -30 32 172 -100 -98 -49 55 15 -27 -46 96 74 -31 44 174 35 -167
6563 -167 -214 -38 -32 -90 155 -33 -166 -3 16 -14 15 73 -156 37 302 1 34 59 15 181 96 158 -134 -129 -232
6588 -232 90 219 38 -78 51 48 -144 66 -87 64 -27 83 79 -195 101 -83 0 -28 36 70 48 37 83 76 -159
6613 -159 83 71 -112 42 83 -86 -100 34 -84 107 -90 123 -14 178 27 -68 -62 -42 -130 -132 36 -109 -148 24
6637 24 183 168 173 112 -65 59 78 -25 -49 78 66 -91 35 104 -24 -116 -120 -18 -154 -51 -121 -7 -34 -223 25
6662 25 79 112 -47 -96 -39 34 105 60 31 -13 44 -64 12 -102 -117 -98 33 117 63 89 -7 4 -86 4 -113 -76 3 -85
6690 -85 -47 15 -9 -207 -50 -27 9 60 -70 111 80 33 -64 36 44 15 97 2 -291 -26 -149 49 -42 2 -151 94
6716 94 -41 119 -23 -117 93 20 -116 38 139 -46 -99 -2 -39 72 -18 -189 -18 -180 75 -16 138 -15 0
6739 0 -76 -38 75 138 -2 -18 22 104 82 82 -73 -60 48 -62 46 19 -14 -183 94 77 -45 85 104 -43 -13 264
6765 264 5 72 67 -172 -137 135 209 86 68 17 -4 72 -29 -10 83 138 56 178 92 22 -57 44 -51 13 141 147 20
6792 20 -87 -97 22 41 168 119 -212 -71 28 97 -61 -72 -82 -75 120 121 140 -51 -17 -37 88 144 94 -123 -73 -16
6818 -16 139 56 79 -184 -214 -59 -55 54 23 -79 -96 34 155 175 38 -20 95 -50 15 -119 -19 -51 -90 97
6842 97 198 18 25 97 57 13 67 75 161 88 74 47 -35 29 -40 31 -206 5 36 239 113 -139 -165 103 -45 147
6868 147 115 178 -103 -172 88 177 2 20 56 -67 -76 -21 186 -69 -216 -174 109 -40 13 -51 -90 -35 -56 150 87
6893 87 93 -91 151 111 30 -6 -82 -41 -190 136 47 102 19 91 141 154 -18 -82 -178 24 -75 30 -53 91 -111 -40
6919 -40 -99 157 76 13 97 -26 -66 3 2 156 -243 12 52 -15 -15 111 -69 14 2 143 -11 23 6 -132 -62 -133
6945 -133 39 -8 -61 35 136 126 -4 30 70 156 119 -130 101 -70 -60 -46 -41 62 221 -107 -139 -161 102 88 -7
6970 -7 -30 55 -29 34 -7 -36 76 -87 87 -36 65 56 -118 -145 -5 -10 62 124 -172 108 -105 22 -43 60 79 -9
6996 -9 -191 88 213 -126 7 -157 1 -20 -22 63 -43 -34 -16 -58 70 -49 -58 -6 -115 34 94 76 55 -14 -73 -7
7022 -7 106 -60 -28 23 -48 -31 98 16 -10 -145 -88 6 -21 -76 122 14 -64 45 142 -43 104 -18 -86 -114 46
7047 46 89 -43 -2 18 8 67 -43 20 34 -11 4 -62 -92 -37 -7 -177 -10 34 21 -40 -30 -115 8 36 -109 -31 -122
7074 -122 -4 9 -7 111 75 114 30 60 81 81 -69 103 -86 113 55 -43 50 162 -156 58 -59 -21 138 -129
7098 -129 145 -24 -150 37 164 6 -171 -22 89 95 94 -9 54 -56 -7 43 199 -37 -144 -69 104 57 101
7121 101 58 -12 4 14 119 -26 33 -27 -52 154 106 -3 84 -3 -254 -159 -75 175 220 -52 -27 -150 17 79 -45
7146 -45 -35 -56 -85 107 55 75 -253 -138 -123 95 101 70 54 -99 -77 73 -6 108 -62 -106 60 -115 -4 86 -177
7171 -177 6 -158 56 13 26 -58 -118 -135 -10 38 75 10 -35 -28 -132 121 34 69 -255 -149 46 181 -47 193
7195 193 -116 39 -8 195 218 61 -25 3 69 -64 15 144 18 -101 -4 302 3 -4 -108 32 -32 81 138 -43
7219 -43 -45 128 11 -3 70 29 -79 -105 73 -4 188 -10 -86 -197 40 48 95 -22 -25 -47 -21 71 37 5 -141 -145 89
7246 89 70 -73 -19 -68 173 -58 37 67 91 -192 -59 34 20 115 -161 11 29 -63 -28 85 129 35 -121 84 84 -128
7272 -128 -17 -1 104 -79 25 31 66 29 -15 -2 71 32 4 -27 -59 68 97 51 164 57 -149 -28 97 -46 -31
7297 -31 -12 -28 -40 -51 -22 -46 30 11 4 -2 107 138 -149 86 -20 -39 -23 -54 56 -76 -92 85 131 42 100 94 77 -127
7325 -127 -151 34 143 156 80 -70 -92 4 54 -20 -36 21 96 15 160 -9 30 -31 -77 -25 -56 123 65 -28 10 97 1
7352 1 31 98 -135 -20 -99 -77 92 10 78 123 -65 6 -167 28 -82 -160 -23 -98 136 -19 -40 -4 -104 66 271
7377 271 -89 164 -138 -89 108 -93 -17 -72 31 -59 104 27 24 12 -101 -107 -99 121 -84 145 -11 -151 -132 10
7401 10 90 -106 -13 -104 -79 128 -5 -106 -44 -79 59 37 9 -38 62 76 61 66 152 13 90 64 -125 44 36 89 4
7428 4 61 -85 -88 -46 101 57 -103 -22 -151 115 234 35 87 129 12 129 -25 33 76 -26 37 -44 116 184 -44
7453 -44 158 -20 1 -50 157 81 -162 -108 66 -27 -125 -98 24 -150 -6 31 77 -81 -214 -203 31 -27 67 103 85
7478 85 -157 -86 64 49 133 -115 -78 -36 48 56 79 79 6 61 -63 198 115 -40 -193 -42 -33 3 40 -66 -75 -72 -247 96
7506 96 12 127 45 -19 -47 96 88 -13 20 -158 -46 13 50 22 16 -139 52 -121 73 4 9 -14 159 72 59 -50
7532 -50 31 -128 -127 150 -31 23 -150 -4 38 -15 98 65 -52 -55 67 -16 77 166 -194 45 82 -27 185 92 -53
7557 -53 -93 53 105 45 118 -51 -242 -127 -10 138 -31 -31 -133 -162 225 70 25 7 -96 -66 90 58 224 -60
7581 -60 -101 153 180 160 81 10 -41 -54 -10 151 121 61 69 37 -89 24 168 63 -88 -180 6 74 -15 51 -60 -147
7607 -147 -9 -25 258 122 60 -174 76 92 73 55 -19 -63 -98 38 109 -46 -64 -109 -22 134 110 186 28 -22 -6
7632 -6 40 34 -43 61 -106 45 -183 55 -58 -49 -72 -296 106 59 48 -33 -62 26 -88 45 107 -14 -10 102 -3 5
7658 5 25 -98 -140 -34 107 48 -103 -178 13 -146 76 76 -48 -37 23 -90 8 -112 -16 9 19 20 -6 144 89 52
7684 52 81 -48 25 -41 -42 -51 -22 27 -25 -38 158 -174 47 -10 -125 31 -10 -121 24 -12 -8 73 87 1 -105 -5 -167
7711 -167 154 -68 -35 9 -155 -90 29 -14 -74 -15 -106 -5 115 -6 -11 83 -69 -45 54 13 18 -22 -147 -52 25 -14
7737 -14 -227 -35 -52 -24 -174 132 -135 50 27 -5 -25 -51 77 147 70 -79 105 34 99 -53 17 -260 -38 -10
7761 -10 -92 48 -60 78 123 -199 103 87 65 34 -72 -45 15 -200 33 48 37 -17 88 -51 -194 -126 -45 240
7785 240 188 -86 25 -137 34 40 -2 71 7 -89 -54 81 196 141 56 24 -17 -25 118 -87 68 20 46 -39 38 -82
7811 -82 -120 51 83 -97 100 -94 115 49 -150 -129 6 43 -34 169 -141 -79 -49 151 36 83 -58 33 -78 23
7835 23 85 59 45 45 73 -29 -140 95 -67 119 -168 54 -5 -42 84 -148 -143 -32 -28 -29 -4 -94 -9 47 185 4
7861 4 -168 -90 -20 71 -20 44 -154 -68 6 34 114 54 -81 110 -118 16 142 119 -48 -98 18 -39 58 -21 130 -14
7887 -14 -109 -40 -49 6 10 -35 -39 -36 64 -155 164 -120 -57 -40 -58 128 167 -77 -47 -102 70 86 -134 121 -138 105 81
7914 81 77 30 -7 -80 -38 105 -59 -51 -19 -52 160 81 88 17 -57 -30 5 -46 33 -149 -260 -158 37 180 -50 -9 31
7941 31 27 59 -12 73 -50 -61 -61 -86 -34 -13 -9 6 51 -39 -90 57 79 -116 -193 3 -5 187 188 18 -112 -174 12 87 60
7970 60 41 47 -118 -34 147 -95 -162 -107 -159 25 -76 100 -32 4 -175 84 -118 32 76 -114 -46 71 93 60
7994 60 22 -73 19 -72 75 122 -2 78 -138 -113 76 201 95 -74 -66 -24 -39 51 0 -84 -126 -103 23 -19 -47 71
8020 71 -2 28 3 21 36 78 -27 -24 84 -49 -101 3 -113 -43 124 130 25 14 -148 -137 0 67 71 -40 47 2 -153
8047 -153 -111 124 84 -93 -41 6 -18 87 -45 59 96 -48 -38 -37 4 197 18 -39 -32 66 24 -80 -43 62 23 -28
8073 -28 142 56 -48 -27 6 -52 134 -232 73 -118 -106 130 -18 -47 -12 2 -28 -92 -77 -78 70 104 2 -79 5 -3
8099 -3 136 20 -75 -75 162 24 71 -29 98 -79 141 142 -5 33 44 -64 13 138 -74 66 -13 94 84 105 -52
8124 -52 -83 -16 -1 5 55 181 19 72 -247 -84 185 243 -123 26 186 32 71 -56 -45 89 -216 -55 57 98
8148 98 -47 -111 -106 -234 -21 -75 -94 -42 55 100 -101 -55 56 -74 -73 -61 -52 122 -19 -12 -60 34 22 206 53 11 -23
8175 -23 145 40 -104 89 -87 2 206 142 -158 108 21 -11 -74 80 -69 13
8191A3
$$ Imaginary data points
##PAGE= N=2
##DATA TABLE= (X++(I..I)), XYDATA
0 0 0 0 0 0 0 0 0 -8 8 -8 8 -8 16 -21 24 -32 40 -48 56 -72 81 -100 120 -138 167 -192 224 -257 297 -341
30 -341 393 -446 505 -574 648 -730 822 -919 1025 -1144 1277 -1416 1575 -1743 1926 -2128
46 -2128 2350 -2591 2856 -3145 3462 -3816 4206 -4642 5127 -5674 6297 -7012 7841 -8818
60 -8818 9986 -11415 13210 -15541 18701 -23251 30397 -43281 73805 -298828 -20620 445700
72 445700 -133760 175863 223251 -403243 -249056 331050 65877 11236 135071 -236923
82 -236923 -266619 191876 107656 25253 146695 -127054 -215822 144254 61984 -73198 95455
93 95455 -64664 -183025 172871 160049 -106987 -11520 -31631 -165011 97823 189105 -52136
104 -52136 -59801 -66382 -129958 138221 216479 -37230 -50431 -111747 -248209 104333 300854
115 300854 -32461 -46694 33079 -243680 -58774 343967 59017 -152907 43115 -142912
125 -142912 -181814 264740 175021 -158130 16605 -12875 -209461 105023 219191 -114850
135 -114850 -81748 51853 -91048 20961 173308 -40956 -96959 22165 -54936 3754 133451
146 133451 -33784 -100105 27829 -4490 24555 121426 -34751 -125265 -649 -3912 10358
157 10358 127306 9718 -126664 -17988 19213 13399 109532 12967 -127189 -30689 -5785
168 -5785 -13146 136609 57763 -139539 -27902 30522 -64530 78139 117711 -121223 -77569
179 -77569 82273 -34656 2403 141940 -48804 -125756 60074 8069 -50508 94290 12841
190 12841 -112868 30214 55482 -43226 35771 32480 -86444 -10230 54698 -22957 13607 31313
202 31313 -67536 -10845 64371 -17584 -8392 34015 -49492 -33898 53239 13227 -6673 18906
214 18906 -36383 -28957 42396 5724 -10889 34252 -24653 -45084 40880 15851 -21392 32966
226 32966 -11333 -51199 32165 15500 -38676 33215 20237 -59394 11269 42154 -42514 -824
238 -824 46940 -36567 -17574 44049 -26179 -20159 49370 -12584 -29238 35356 -11209 -33849 40260
251 40260 14682 -33259 16007 5599 -36200 20241 29968 -26239 -1864 7372 -28796 14609
263 14609 34584 -20774 -11558 6235 -25947 3538 39570 -5039 -21964 458 -12043 3281
275 3281 36643 -1328 -26612 -681 -12867 -3856 46382 15503 -34518 -11451 -2523 -2966 31343
288 31343 18707 -27388 -22040 -6703 -555 35406 31887 -30268 -36558 -2762 290 21407 33687
301 33687 -15787 -38678 -10398 8755 30152 33698 -15552 -46435 -17680 11863 26057 34401
313 34401 1322 -43087 -26248 15518 31850 28847 -6843 -45835 -30092 10563 35271 37210
325 37210 551 -43842 -37989 7401 36549 29936 -1402 -39355 -41757 4336 43650 40050 2278
338 2278 -42818 -45208 -180 38084 40055 7337 -34949 -42985 -4787 42698 47722 2556 -43144
351 -43144 -47731 -9013 38356 46696 13654 -31298 -50190 -14346 40388 49366 4584 -43841 -48350
364 -48350 -13238 33246 56895 22431 -36131 -52032 -19094 31915 54350 14174 -39659 -47430
376 -47430 -15877 29589 59720 31989 -36945 -60095 -18149 25831 48026 32343 -30640 -59384
388 -59384 -16067 27610 47319 36687 -26241 -69967 -27849 31184 43616 30459 -10009 -58061
400 -58061 -34415 32915 48371 23483 -16062 -59360 -37303 33237 54635 28681 -9233 -50630
412 -50630 -44205 21618 58697 25724 -22176 -48608 -37613 18826 59643 37906 -12855 -55458
424 -55458 -48215 14790 53837 34230 -8407 -50117 -46350 14123 53058 37516 626 -46402
436 -46402 -60035 5301 60177 30621 -3298 -20476 -49619 -12056 59725 36701 -16811 -25461
448 -25461 -38458 -15564 54368 45444 -20328 -28147 -23301 -22175 38775 56731 -22557 -47738 -14054
461 -14054 -8318 30406 62289 -6965 -57252 -23274 -2766 20027 57554 12177 -59233 -36791
473 -36791 11013 22739 43246 26854 -41624 -55088 -7551 29492 42156 17724 -25152 -36081
485 -36081 -19141 15454 45525 18066 -30323 -29998 -13060 2589 37699 27152 -31164 -27067 5504
498 5504 -4042 18739 37450 -27648 -43439 17623 15936 2439 27854 -9874 -48435 5859 30175
511 30175 1658 17108 -544 -54282 -5532 47736 3742 -55 14174 -46070 -36452 45586
523 45586 29087 -11979 7173 -17537 -44723 18304 46316 -3121 -9006 -2577 -33379 -9919
535 -9919 40534 21463 -12832 -10169 -8717 -10878 6896 24304 8413 -18906 -11486 6345 -58
548 -58 1634 13933 -4045 -16974 7092 6777 -12980 5164 6983 -17721 7614 21794 -19065
561 -19065 -11801 14681 -11554 -3452 30709 -3757 -25761 8779 38 -12844 27605 15262 -30073
574 -30073 -931 10329 -22295 11186 33677 -17058 -17755 13998 -10605 -13680 23648 10123 -15155
587 -15155 1835 -711 -17541 3801 16099 534 90 119 -12110 -11002 4966 17963 9282 -8721
601 -8721 -4513 -4783 -16990 9376 32306 -1059 -19063 832 -9133 -12038 26848 18725 -20253
614 -20253 -5539 -1129 -18946 15628 26906 -17141 -10587 8747 -17064 -1448 29367 -7740
626 -7740 -21918 13827 622 -11764 22077 1822 -31672 9117 20148 -12407 8779 12455
638 12455 -30950 -11255 31752 9816 -7727 3670 -16734 -24674 16440 29891 4092 -8966
650 -8966 -18598 -20279 6438 25930 16912 -5921 -24538 -19133 2183 20062 25739 3630 -27532
663 -27532 -22183 4903 14072 17344 13294 -17746 -30034 3867 20852 11538 9503 -11979 -30079
676 -30079 770 21899 7701 5891 -5248 -30529 -6931 31423 13821 -9683 -6864 -20617
688 -20617 -16444 28565 29541 -9063 -15330 -16022 -15585 21197 36560 -2551 -25723 -15740 -9327 11016
702 11016 38297 14665 -28981 -26582 -4321 10661 27782 17530 -19123 -30595 -9805 13912
714 13912 26914 17483 -15336 -34036 -12484 15499 22478 16469 -7056 -31138 -18815 15168 29569
727 29569 14978 -11521 -27298 -18313 10056 29818 20061 -7538 -27827 -21418 8927 29411 19109
740 19109 -8075 -28381 -20125 7362 25408 22753 -2541 -31068 -25082 8194 26451 17852 -3192
753 -3192 -23893 -25553 4271 29951 20107 -3423 -23682 -27576 3340 31747 19535 -3386 -18980
766 -18980 -25786 -3267 31140 27623 -5633 -24507 -23386 -5370 25775 29707 -528 -21448 -24486
779 -24486 -10679 22819 31595 -150 -23557 -21460 -7763 16128 29664 8764 -22200 -25357 -6688
792 -6688 16797 27615 7252 -19779 -21696 -7235 14380 28297 9756 -18944 -23896 -8439 15265
805 15265 26518 8352 -17937 -22234 -8265 10426 25525 14132 -19290 -27037 -6045 11520
817 11520 21722 14193 -12656 -24511 -10857 9160 23487 14968 -11946 -23529 -9271 8992
829 8992 19312 15976 -6908 -23707 -11030 7970 17565 16432 -6237 -24173 -9952 8290 14007
842 14007 14100 -1240 -21756 -16252 7758 18024 10052 -3091 -16090 -13791 3940 14886 13171
855 13171 -477 -18132 -13258 6706 13655 10330 819 -13566 -13526 3011 13454 10290 521 -11394
869 -11394 -14234 2363 14337 7273 -724 -7737 -13007 -1843 11505 9795 106 -10049 -10803 583
883 583 8772 6600 1802 -4513 -10911 -4032 11313 8769 -2507 -3041 -4836 -4983 6509 9300 -195
898 -195 -4049 -3601 -3551 2591 8373 1348 -6698 -1818 483 -1821 3634 4143 -4362 -4866 800 2302 897
915 897 133 -1206 -2117 257 1282 17 1953 -182 -3411 2461 3418 -2416 -815 2189 -399 -546
931 -546 1760 184 -2412 361 2088 -144 -22 -1194 -3040 1009 3622 387 -2678 -3773 -682 1272
947 1272 1627 4906 -334 -9930 -3154 7329 3816 1220 2877 -6274 -10541 5456 11066 561 790
962 790 -3461 -13023 2359 14509 1544 -1457 -480 -12775 -5817 15018 7968 -6151 -1803 -6493
976 -6493 -9260 11126 12276 -6538 -3637 -3170 -9816 8380 16520 -5964 -10553 631 -3206 1678
990 1678 15444 2338 -15595 -6112 3714 5558 11253 2945 -13322 -11104 666 9999 12317 1457
1004 1457 -11380 -14495 -4711 13618 16501 -1168 -11565 -10552 -9107 6178 23875 6379 -17387
1017 -17387 -10220 -3846 -144 20272 13531 -15754 -12384 -1674 -2480 16179 18527 -14232 -17745 3279
1031 3279 -198 4916 19988 -6252 -25196 1771 8871 1212 14336 -334 -25647 -3383 14977
1044 14977 3397 6650 3042 -22116 -13055 17647 14322 1545 -1445 -15592 -14495 10565 19028
1057 19028 10066 -3984 -19898 -12666 8212 15035 13706 282 -22000 -16370 7491 12818 13034
1070 13034 7156 -20141 -22943 8544 13348 4767 11371 -9914 -28311 4793 19269 1661 6821
1083 6821 -1651 -25612 -1407 23341 1323 -1839 5007 -20522 -10896 27617 9319 -13539 2496
1096 2496 -9532 -15614 21636 19320 -13423 -7648 -4978 -13518 13473 25291 -7357 -16809 -5359
1109 -5359 -8310 7245 24833 2860 -16025 -11726 -8147 9217 21855 4088 -9805 -11121 -12419
1122 -12419 6179 22604 5258 -9425 -8111 -12360 1156 22709 5363 -12293 -2513 -9965 -7288
1135 -7288 22754 10496 -18247 -3782 62 -9621 14678 16761 -16095 -10345 5343 -6532 8152
1148 8152 20671 -14284 -18322 10357 -487 -472 22130 -4562 -25806 3594 9066 -1127 14868
1161 14868 3314 -24138 -5979 11517 1050 9077 8142 -19516 -13012 10424 5680 5864 6743 -12933
1175 -12933 -12669 4169 5263 8456 6961 -12342 -11137 5927 3842 3722 9657 -7290 -13720 5630
1189 5630 5821 147 7930 -5166 -13973 6299 7103 -3292 6256 -1276 -15650 2729 12025 -3176
1203 -3176 876 2083 -14326 -1726 14894 -1634 -2530 6069 -12267 -7743 16557 4104 -7104
1216 -7104 4480 -4353 -10732 9624 9848 -5027 -72 -1591 -9077 5382 9422 -4214 -742 87
1230 87 -8615 2692 8410 -3348 -1141 479 -6809 1925 7757 -4126 -2104 4233 -5661 -1777 9734
1245 9734 -2207 -5997 5010 -1854 -3433 8438 -845 -6119 5433 -763 -5323 8179 1620 -9320
1259 -9320 3954 4032 -8156 3055 6272 -9091 -204 7485 -7344 -1024 8212 -6955 -3339 9515
1273 9515 -3691 -6099 7055 -1094 -5508 6990 1232 -6570 3709 1342 -4253 6732 2072 -8773
1287 -8773 2761 3098 -6073 5075 5336 -8775 -1828 4893 -2907 2232 5881 -7067 -4941 5053
1301 5053 -1529 87 7335 -5473 -8416 5424 2242 -743 6461 -2828 -8298 3668 3297 -244
1315 -244 6006 -1755 -10810 2022 7434 -1458 3270 2239 -10738 -2065 8873 785 599 1087 -10060
1330 -10060 -4083 8650 2511 -816 1650 -7459 -6615 8031 6688 -1581 -315 -5751 -6988 7179
1344 7179 7484 -1239 435 -4858 -8397 6662 10616 -1335 -3106 -2989 -7343 2044 10680 1661 -4563
1359 -4563 -3907 -6734 1501 11604 2121 -5516 -3390 -6113 -351 10926 4690 -5672 -5432 -4799 339
1374 339 10447 6297 -5907 -5148 -3155 -1482 9767 8977 -6343 -8096 -2382 -617 7525 8761 -4071
1389 -4071 -8894 -3557 -39 6597 9090 -3047 -10849 -3828 1388 4435 8600 -69 -10160 -5376
1403 -5376 1527 5893 8523 41 -9383 -5778 1492 5523 7778 2046 -8231 -7847 1566 6872 6958
1418 6958 1134 -8236 -7219 553 5005 7870 2508 -9163 -8452 817 5901 6997 2280 -7525 -8899
1433 -8899 -105 5801 6706 3897 -6410 -10675 445 7391 4887 3936 -3046 -10272 -2167 7548 6463
1448 6463 1917 -3140 -8576 -3849 6838 6930 419 -2498 -6886 -5803 5506 9141 449 -5318 -5629
1463 -5629 -3571 2706 8323 4000 -5662 -7448 -2438 2940 7773 5271 -4725 -7843 -2262 2904 6242
1478 6242 5998 -1649 -9332 -4328 4960 5231 3559 189 -7319 -6010 3371 5703 2684 -449 -5565
1493 -5565 -5904 2008 6761 2104 -2181 -3133 -4684 -376 7123 4496 -3120 -4902 -2227 1035 4354
1508 4354 5160 -579 -6899 -3434 2481 3635 4678 1157 -6958 -5562 3253 4465 1613 2356 -3177
1523 -3177 -8940 657 7707 724 -186 92 -7243 -2607 7220 2596 -1708 623 -4102 -4668 6292
1538 6292 5691 -3886 -675 694 -5134 2199 7511 -1918 -3967 430 -1638 443 5005 -21 -4404
1553 -4404 -1109 64 -154 3513 1542 -4563 -2774 1010 1886 2326 106 -1786 -2032 -2180 2509 5024
1569 5024 -933 -2846 141 -1784 59 5395 843 -3650 324 -511 -2496 4834 3070 -5983 238
1584 238 2862 -4947 1051 6268 -4138 -3579 4331 -1997 -3130 4794 -428 -4940 3736 1678 -4980
1599 -4980 2789 2544 -5332 2015 4996 -3795 -1099 3032 -2599 -551 4222 -494 -2343 1291 -909
1614 -909 -1074 3218 363 -2749 209 -270 -902 1492 197 -880 -235 -1423 993 2036 -1867 -657
1630 -657 2052 -1080 -465 3078 -1471 -2986 2729 774 -1750 4157 -87 -5994 2531 3968 -2974
1645 -2974 2148 2601 -6742 -1686 5369 -549 -509 2856 -4354 -4305 4830 1561 -1640 3210 -2517 -6291
1661 -6291 3727 4083 -1816 1269 -310 -4864 1067 4618 349 -213 -412 -3845 211 4539 649
1676 649 -912 -708 -3517 3 4186 753 -604 -1741 -4454 1108 4611 -687 -885 -55 -4837 -1190
1692 -1190 7053 1537 -3564 182 -2802 -3191 6766 4088 -4366 -440 -1376 -4410 5419 6824 -3886
1707 -3886 -3340 441 -3334 1667 7621 -1005 -5505 -393 -1931 263 7085 194 -5871 -737 -720 -772
1723 -772 5729 2669 -5685 -3374 1050 770 3389 2951 -3540 -3862 512 1337 3893 2932 -3745 -3876 50
1740 50 1264 3702 2344 -3387 -3739 -423 1145 3789 3205 -3668 -5363 472 1557 1729 3838 -1947
1756 -1947 -6330 -702 2521 2408 3485 -1175 -5659 -1077 2727 2185 2771 196 -5072 -2906 3269 2712
1772 2712 1660 684 -4244 -3423 2659 2603 1569 548 -4024 -3925 1920 3591 1032 -484 -2263 -3509
1788 -3509 491 3893 2004 -411 -2864 -3282 1258 3579 1761 256 -2268 -3515 672 3925 2309
1803 2309 -351 -2493 -3018 49 3521 2140 -611 -1863 -3073 -948 3629 2699 -1043 -2066 -2505 -733
1819 -733 2568 2689 96 -1858 -2652 -764 2611 3099 -220 -2114 -1493 -940 1872 3473 478 -2110
1835 -2110 -2063 -778 1878 2711 363 -1957 -2168 -831 1235 2491 999 -2193 -2661 -607 1149 2157
1851 2157 578 -1704 -1773 -894 806 2551 1107 -1650 -2136 -444 1536 1865 935 -809 -2035 -727
1867 -727 1389 2060 1169 -1354 -1932 -245 518 1411 1307 -1095 -2148 -749 738 1492 802 -662 -1732
1884 -1732 -1012 942 947 668 13 -1872 -1163 1282 1035 546 -165 -829 -578 398 1368 800 -596 -731 -746
1903 -746 611 1482 -84 -532 -490 -969 4 1370 643 -887 -1349 -105 335 591 835 -675 -1197 -59
1921 -59 195 721 795 -328 -937 -327 811 703 -202 168 -231 -864 493 1371 -72 -755 -243 315 79
1940 79 394 287 -892 -685 274 -52 352 282 -1142 -925 431 391 -10 101 -169 -871 61 1274 490 -292
1960 -292 -153 -667 -37 1413 304 -499 -112 -459 -393 757 1421 -580 -1600 420 -116 -513 1304 136
1978 136 -1984 -466 608 211 348 312 -1149 -1225 1264 648 -577 1146 -189 -1924 997 2026 -399
1995 -399 -507 298 -717 -400 1505 893 -1212 -505 -319 -529 1368 966 -1266 -748 -240 -433 290 1203
2013 1203 124 -1798 -548 675 383 435 748 -1084 -1083 493 879 146 415 -378 -1207 -38 1830 -29
2031 -29 -579 697 -989 -1253 1913 1025 -1351 -326 205 -1126 169 2039 -661 -1667 538 -446 -621
2048 -621 2172 149 -2184 81 826 -828 984 1339 -1310 -1575 1170 872 -374 1086 -181 -1653
2064 -1653 240 1017 60 354 71 -1123 -958 1008 717 -731 -101 40 -1445 176 1633 -128 -883
2081 -883 175 -260 -751 1153 1203 -1228 -351 898 -925 313 2078 -1094 -1487 1328 -10 -1089 1515
2098 1515 831 -2056 -88 1457 -853 -190 1253 -1756 -1334 1454 65 -735 805 -259 -1488 559
2114 559 1367 -469 -104 637 -683 -472 992 622 -246 146 -258 -185 441 425 277 -650 -265 109 -332 558
2134 558 678 -955 -564 385 -192 -528 868 62 -1601 132 993 -743 23 1142 -1436 -659 1813
2151 1813 -177 -559 1359 -450 -1640 1226 1541 -1222 47 1307 -1650 -409 2039 -436 -1032 1060
2167 1060 -562 -1019 1107 478 -1188 44 671 -1084 -265 1278 -586 -795 918 -108 -417 772
2183 772 104 -416 97 357 15 337 555 -229 -490 702 64 -340 521 -20 -598 -225 364 150 -651 117
2203 117 329 -1019 56 774 -660 -282 500 -332 -350 642 239 -874 430 977 -918 6 1134 -672
2221 -672 -337 1290 -93 -706 629 14 -519 320 345 -872 -186 458 -717 69 758 -945 -552 813
2239 813 -271 -323 526 -252 -469 384 284 -137 264 32 -667 129 878 -95 -65 161 -433 11 435 321
2259 321 154 -398 -369 29 80 -12 198 -574 -599 -39 523 -281 -118 79 -688 -118 957 -146 -148 506 -743
2280 -743 -295 1036 572 -588 -102 202 -610 525 1030 -319 -319 -175 -592 573 1037 -700 -455 -68 -624
2299 -624 -26 919 -178 -838 -199 -51 2 799 37 -924 -68 241 120 1017 464 -823 -42 348 185 600
2319 600 257 -561 -97 133 177 821 397 -1045 -600 495 -159 18 830 -1096 -970 595 -221 226 508
2338 508 -889 -829 667 240 -88 757 -92 -1038 165 1049 -60 441 34 -1325 487 792 -376 508
2356 508 178 -1431 -34 1193 -112 -259 233 -727 -665 958 273 -672 234 -667 -810 1133 250 -548
2374 -548 451 -249 -696 586 700 -201 25 66 -416 679 893 -351 -145 459 -949 155 1219 -368
2392 -368 -407 156 -630 -91 992 -192 -534 16 -439 -368 988 295 -937 203 138 -666 847 623 -894
2411 -894 176 187 -556 691 651 -602 -250 673 -468 -291 986 -399 -806 507 37 -459 499 -53
2429 -53 -509 255 -154 -147 391 -89 -394 63 150 -100 174 378 -389 51 209 -196 565 381 -723 235 97
2450 97 -612 409 665 -344 35 113 -476 -3 765 -500 -656 428 -438 -608 1120 54 -1072 332
2468 332 236 -649 564 742 -775 -252 516 -178 -41 793 -462 -447 599 92 -246 595 56 -793 -72
2487 -72 258 -19 77 -46 -493 -447 75 119 81 -64 -318 -391 -26 350 364 -281 -501 -24 -165 252 1080 -211
2509 -211 -745 372 159 -21 827 300 -1000 -382 538 10 149 803 -815 -1291 747 357 -645 652
2527 652 -42 -1419 39 963 -198 -167 307 -767 -686 927 309 -716 420 -68 -965 781 893 -396
2545 -396 -256 228 -376 -170 889 152 -890 -10 -102 -461 755 434 -834 -610 -24 -11 -56 635 76 -1211
2565 -1211 -219 705 -241 255 531 -687 -584 666 476 -90 125 193 -891 -100 871 -78 -119 429 -462
2584 -462 -599 456 167 -582 -37 175 -594 -340 698 -148 -622 487 -109 -735 805 489 -838 -208
2602 -208 375 -302 24 970 -229 -771 553 213 -620 890 531 -941 -198 607 -394 77 719 -418
2620 -418 -908 498 342 -567 673 330 -1295 -305 695 -370 88 563 -533 -820 474 794 -40 341
2638 341 253 -1016 42 937 141 10 125 -475 -488 623 907 -390 -461 -15 -509 -52 937 -75 -725
2657 -725 -345 -221 -41 744 629 -716 -609 208 32 110 1103 -362 -1287 188 781 252 674 95 -1086
2676 -1086 -601 796 642 32 311 -813 -1270 668 1109 34 60 -538 -1050 17 1140 485 -427 -394
2694 -394 -711 -420 841 931 -242 -555 -346 -161 610 982 -32 -711 -633 136 486 834 681 -978 -955 366
2714 366 582 590 316 -575 -1342 -321 1019 379 16 -73 -1142 -446 1373 852 -207 -202 -822 -859 791 1310
2734 1310 145 -339 -333 -676 281 1612 517 -642 -428 -447 -58 1293 536 -523 -729 -590 150 680 730
2753 730 -405 -929 -617 34 816 762 -145 -788 -910 -255 981 704 70 -294 -797 -171 1070 841 16
2772 16 -401 -782 -477 657 1115 -136 -763 -533 -744 157 1241 10 -957 -488 -744 7 1282 415 -822
2791 -822 -864 -173 138 734 873 -500 -884 -292 -55 854 1082 -161 -956 -398 -51 709 1039 -104 -867
2810 -867 -640 40 557 943 234 -1157 -890 -77 495 972 181 -966 -793 -49 430 1023 338 -839 -1091
2829 -1091 -236 721 1222 551 -721 -1125 -14 448 887 826 -782 -1187 -31 359 666 841 -538 -1248
2847 -1248 -549 384 741 675 -228 -1179 -586 346 733 729 81 -1292 -507 375 832 945 20 -1024 -798 342
2867 342 917 858 87 -928 -936 222 998 488 309 -923 -959 125 656 767 143 -1008 -969 -37 722 631
2887 631 124 -757 -910 124 759 755 243 -385 -966 -105 965 539 143 -352 -1156 -283 859 767 274 -353
2907 -353 -748 -539 605 813 -104 -340 -505 -843 335 751 165 -416 -673 -395 443 754 371 -344 -408 -112
2927 -112 167 794 545 -424 -393 -254 219 696 445 -147 -447 -498 183 565 -38 -86 -509 -542 -64 355 297 -64
2949 -64 -283 -540 -393 497 516 -114 -152 -204 -338 467 413 -82 233 6 -326 -39 568 204 -62 97 -213 -275
2971 -275 318 347 -391 -70 -95 -407 308 456 11 -248 -260 -105 141 250 414 -352 -418 -78 -5 303 420 107
2993 107 -595 -469 106 306 415 387 -501 -685 74 351 272 386 -354 -859 -243 276 569 -5 48 -765 -672
3014 -672 613 605 17 -47 -397 -673 347 949 377 -316 -195 -611 128 1153 535 -522 -611 -339 29 889
3034 889 660 -544 -933 -310 259 456 643 30 -1122 -696 384 535 674 299 -936 -875 382 870 690
3053 690 -62 -663 -992 -144 1242 763 48 -373 -1036 -502 884 1091 -118 -496 -618 -531 762 1417 -44
3072 -44 -860 -464 -356 224 1277 267 -1067 -770 45 249 649 605 -819 -1189 247 615 672 620 -305 -1137
3092 -1137 -104 797 916 269 -338 -1065 -928 751 898 -22 -189 -854 -710 415 1102 432 -494 -602 -655
3111 -655 -22 1130 756 -595 -857 -269 -331 1041 1061 -419 -869 -497 17 408 802 -67 -915 -498 552
3130 552 307 676 493 -1098 -744 152 476 323 151 -619 -1054 -135 902 612 -175 -459 -921 -154 857
3149 857 1056 -60 -647 -550 -267 526 1239 245 -885 -601 -308 13 1120 536 -743 -582 -108 7 475
3168 475 745 -457 -1107 -237 462 163 548 71 -1110 -434 371 452 333 124 -935 -869 501 774 191
3187 191 114 -265 -881 313 1138 299 -244 -378 -523 10 702 793 -204 -726 -391 -184 589 662 -80 -788 -479
3208 -479 -32 441 542 455 -571 -892 35 535 346 378 -369 -706 -187 555 568 300 -127 -637 -380 640
3228 640 670 -14 -248 -516 -564 521 672 -136 -308 -443 -311 231 634 217 -322 -387 -312 4 662 455 -574
3249 -574 -496 -215 71 653 348 -229 -618 -300 284 532 311 204 -604 -366 202 563 295 -124 -415 -461 -20
3270 -20 490 283 -154 -68 -514 -107 488 308 69 -212 -227 70 502 450 -52 -130 -62 -260 220 637 -165 -214
3292 -214 -237 -250 123 488 5 -261 -330 -202 18 142 23 -341 -366 -163 -93 129 170 -125 -107 -125 -155 238 177
3315 177 -32 14 -164 -215 133 192 90 -131 -82 -148 -184 313 14 -96 -3 -425 40 442 70 -234 11 -358
3337 -358 -116 186 107 -32 -247 -413 -225 6 178 -2 -214 -177 -212 200 368 194 0 -219 -153 65 517
3358 517 224 -30 -196 -315 56 531 511 -251 -354 -473 -82 706 276 -98 -293 -441 -5 713 584 -61
3378 -61 -421 -349 -35 434 539 -9 -641 -390 -64 503 674 -237 -412 -550 -393 296 717 18 -522 -767 -139
3399 -139 556 754 377 -732 -823 -101 345 1044 223 -600 -798 -51 477 1032 335 -488 -932 -435 481 967
3419 967 554 -575 -978 -512 299 1069 593 -471 -925 -332 625 951 409 -575 -779 -636 282 944 600
3438 600 -460 -925 -474 433 915 723 -143 -893 -511 287 859 752 -259 -1102 -545 328 869 674 -176
3457 -176 -817 -881 488 982 606 -105 -975 -963 285 860 559 196 -840 -943 131 813 677 -193 -868
3476 -868 -762 -71 712 756 117 -716 -810 46 830 721 215 -842 -855 28 659 746 294 -883 -1134 83
3496 83 754 868 139 -542 -934 -313 830 765 -196 -606 -872 -398 856 966 -17 -444 -649 -443 657 890
3516 890 233 -779 -801 -255 425 1012 367 -377 -708 -531 291 791 259 -519 -761 -418 398 643 482 -272
3536 -272 -870 -359 477 724 322 -108 -684 -494 267 793 503 -270 -611 -617 207 890 366 -448 -572 -463 -97
3557 -97 566 709 -163 -805 -201 -87 414 598 -75 -749 -604 27 316 630 259 -544 -485 -40 307 324 360
3578 360 -464 -600 23 484 471 179 -340 -551 -89 347 390 127 -201 -522 -276 557 452 23 -296 -328 -330 101
3600 101 553 180 -493 -427 -82 26 374 518 -330 -361 -48 167 246 378 -105 -476 -240 121 192 155 160 -536
3622 -536 -322 197 290 158 136 -183 -389 -69 183 140 -41 44 -442 -219 321 204 65 61 -167 -249 142 212 19
3645 19 -234 -126 -98 -80 192 205 -372 -194 -135 -188 -35 114 -52 -258 -3 91 -197 158 70 -239 -132 89 -95
3668 -95 235 170 -298 -295 -58 50 -57 289 -129 -276 -214 32 -53 71 186 -79 -278 -91 213 96 201 -137
3690 -137 -387 -370 101 203 190 175 -418 -230 77 364 293 268 -94 -398 -406 439 281 -16 -101 -301 -67 416 414
3713 414 110 -266 -323 -176 221 418 187 -339 -370 -259 54 462 323 -423 -553 -334 222 542 488 -183 -440
3734 -440 -292 189 476 479 -173 -759 -381 181 516 392 -283 -733 -492 160 665 679 -189 -724 -570 -106 861
3755 861 429 113 -740 -666 -14 684 597 -105 -594 -525 -112 531 668 -7 -707 -694 -25 684 691 139 -746 -875
3777 -875 35 541 683 238 -748 -1006 -27 606 671 84 -521 -875 -262 736 875 184 -547 -829 -239 681
3797 681 843 161 -509 -898 -315 568 833 354 -565 -814 -304 495 678 480 -431 -1075 -424 443 840 377
3817 377 -591 -813 -514 353 825 581 -157 -891 -494 478 992 525 -409 -980 -554 245 993 600 -238 -778
3837 -778 -455 319 941 394 -310 -707 -526 215 779 617 -265 -962 -529 162 863 578 -82 -865 -621 9
3857 9 712 667 -265 -705 -480 175 580 671 -18 -614 -642 -44 657 629 94 -750 -486 -30 552 708 33 -471
3879 -471 -612 10 695 529 -126 -477 -386 -70 571 511 183 -541 -752 -153 497 642 164 -503 -615 -64 434
3900 434 543 248 -322 -483 -85 313 524 238 -272 -537 -366 285 535 235 -346 -623 -163 305 344 325 -370
3921 -370 -531 -325 254 345 198 -249 -459 -177 266 512 200 -190 -307 -227 220 334 233 -25 -407 -228 87
3942 87 303 244 32 -498 -337 129 202 181 43 -59 -345 -23 222 104 77 -21 -354 70 336 408 65 -66
3964 -66 -351 -128 332 368 -75 -111 -35 -171 123 304 41 -165 -212 -36 96 13 78 -199 -152 56 -102 44 150
3987 150 15 0 -89 66 23 0 67 26 -62 106 101 125 179 -14 83 22 112 -49 107 97 -32 -169 -24 79 -20
4012 -20 -7 16 -136 39 118 -67 -111 -38 -40 110 -21 -48 -13 -138 36 -354 -114 88 -18 -31 -136 -228 -55 -85
4036 -85 32 99 -190 -111 -165 149 279 -164 -150 -209 60 138 58 187 -211 -193 14 59 67 347 -102 -328 -161 -6
4060 -6 303 199 -6 -260 -177 189 249 53 45 -232 -256 91 356 248 -132 -381 -312 -60 164 184 -24 -361 -287
4083 -287 -163 447 366 -79 -164 -245 -115 207 217 200 -390 -267 -121 380 349 136 -184 -419 33 214 407 187
4105 187 -362 -485 -370 330 408 -11 -220 -535 -230 397 527 66 -277 -479 -301 215 372 118 -266 -393
4125 -393 -298 348 622 80 -454 -417 -273 231 552 476 -274 -592 -212 453 657 216 -198 -683 -294 213 595
4146 595 325 -80 -608 -422 188 593 251 -288 -595 -473 303 680 300 -184 -557 -492 302 656 377 -263
4166 -263 -369 -282 73 558 467 -100 -581 -205 208 416 436 54 -511 -522 85 632 558 22 -631 -545 40 619
4188 619 571 162 -526 -625 82 590 558 -128 -523 -528 27 525 461 108 -483 -574 -157 574 531 -54 -427 -591 -98
4211 -98 340 779 77 -483 -468 -69 291 681 220 -366 -580 -147 469 434 328 -500 -688 -32 506 387 129
4232 129 -346 -421 -123 444 437 220 -264 -432 -262 378 500 179 -371 -528 -445 212 639 216 -211 -387 -50
4253 -50 221 558 363 -224 -529 -84 196 375 279 -81 -204 -395 64 305 221 -10 -372 -229 270 354 124
4274 124 -76 -324 -199 -1 296 248 -192 -264 -100 45 401 199 -105 -147 -139 -20 325 279 32 -176 -236 236
4296 236 130 188 6 -349 -179 127 231 209 86 -128 -234 -59 -1 154 92 -158 -158 -114 205 -65 -87 -25 -156
4319 -156 -20 -24 149 139 -121 -146 38 11 40 -36 -62 -2 -78 -12 110 -145 57 -18 -57 106 117 22 170 18 -173
4344 -173 -61 -22 -86 104 -61 120 68 48 142 231 -24 -56 93 102 124 48 124 -60 95 -146 -14 31 95 31 -206
4369 -206 -158 -87 178 297 128 -114 -107 68 118 234 27 -101 -191 -156 241 393 132 -92 -307 -45 89 75 96
4392 96 -60 -313 -180 -3 152 167 -132 -293 -208 -73 270 94 -116 -260 -289 117 183 243 -84 -410 -178 48
4414 48 92 379 28 -394 -322 172 346 175 66 -202 -311 15 135 373 67 -502 -220 39 287 199 162 -333
4436 -333 -333 -1 446 434 41 -401 -489 -119 246 370 102 -274 -564 -359 220 301 161 -255 -428 -213 267 372
4458 372 244 -315 -541 -352 340 487 322 -133 -349 -328 319 575 304 -34 -506 -417 329 338 318 -193 -461 -415
4480 -415 131 722 402 -117 -286 -504 127 546 454 -27 -430 -457 179 545 498 -216 -594 -367 141 372 484
4501 484 36 -591 -500 -82 549 339 1 -717 -330 -132 450 503 170 -530 -623 -123 482 623 0 -495 -396
4522 -396 -213 381 654 175 -612 -549 15 498 670 28 -649 -596 -190 444 618 257 -424 -541 -187 290 510
4543 510 111 -235 -806 -131 414 614 239 -436 -428 -71 349 478 151 -400 -527 -257 303 592 250 -159 -435
4564 -435 -153 205 471 284 -273 -509 -147 343 499 280 -39 -453 -212 357 319 310 -71 -351 -228 295 385
4585 385 145 -24 -497 -604 147 347 353 -35 -433 -320 158 248 241 25 -409 -484 38 489 187 -198 -228 -387
4607 -387 27 315 195 -134 -363 -480 45 317 240 -76 -229 -287 11 12 165 3 -312 -176 90 282 54
4628 54 -70 -84 -197 56 206 110 94 -177 -235 15 195 355 49 -154 -93 -100 -18 262 -53 -97 -131 -21 232 114
4652 114 -44 -196 -44 -40 -50 169 118 -99 -151 95 -46 80 24 -150 -58 49 27 30 8 -12 62 54 48 12 -129 -36
4678 -36 -85 76 85 308 -46 -27 139 67 31 157 169 -66 1 48 183 -246 -74 -51 -79 121 -151 -200 -116 74 -5
4703 -5 -8 76 -115 -3 74 111 68 -79 -114 -92 25 202 82 -1 -147 0 -89 25 -22 -29 -131 -212 71 181 289
4728 289 74 -165 -42 -60 202 220 -63 -107 -93 -136 160 395 10 -21 -255 -85 93 217 191 -232 -425 -220
4750 -220 75 271 12 -280 -257 -142 121 333 109 -191 -333 -173 214 184 -10 -191 -109 -150 113 145 258 -139
4772 -139 -492 -226 79 405 243 -285 -249 -326 132 478 263 -186 -365 -287 264 347 257 -13 -218 -298 34 333
4794 333 206 -204 -391 -455 -13 344 201 -247 -237 -392 23 382 346 -232 -415 -325 21 319 246 126 -341 -213
4816 -213 72 325 294 -128 -459 -293 -5 285 398 -26 -308 -320 -90 495 335 -145 -289 -274 -71 302 346
4837 346 146 -199 -286 -3 313 359 60 -203 -375 -148 285 421 93 -212 -438 -59 322 251 78 -134 -466
4858 -466 -198 312 332 131 -304 -389 -116 318 254 175 -151 -422 -227 282 318 46 -158 -447 -224 260 237 352
4880 352 -187 -365 -250 179 237 148 -105 -287 -245 412 462 192 -219 -463 -85 307 301 205 20 -447 -251 203
4902 203 400 110 5 -481 -200 86 275 133 -6 -388 -110 126 344 88 -141 -355 -202 -24 234 367
4922 367 35 -370 -290 60 319 300 -71 -168 -148 -50 280 238 72 -197 -234 -102 257 196 35 -339 -143 100 209
4945 209 88 25 -241 -278 -39 122 283 -1 -232 -246 -140 172 158 27 -72 -175 -82 225 187 90 -160 -238 16
4968 16 55 265 97 -192 -224 -81 73 234 25 -224 -131 -164 171 316 43 -338 -162 -32 88 69 157 -44
4990 -44 -180 87 222 159 -15 -73 -143 -21 55 72 78 -22 -221 -180 -73 152 21 -4 -153 -51 58 2 -58 -65 -148
5015 -148 -114 -46 -28 116 -90 -13 133 6 137 -43 67 173 196 31 34 -162 -64 3 -47 36 107 -58 -2 -45 -53
5040 -53 -57 -64 41 -199 111 60 70 115 -106 -122 82 80 4 -51 77 -189 -9 114 83 43 -47 -205 -19 83 103 -62
5066 -62 -267 29 125 55 56 -30 -91 -147 340 77 28 -146 -185 -252 -36 -12 86 -166 -276 -149 147 122 34 -133 -108
5091 -108 -27 -31 206 324 -335 -166 -150 198 194 101 -91 -110 -265 93 301 59 82 -383 -5 -90 146 247 14
5114 14 -395 -234 176 558 106 -132 -396 -231 -159 455 135 96 -339 -256 173 313 173 -22 -268 -167 -207 143
5136 143 147 -117 -250 -277 -9 255 354 -19 -205 -259 -61 278 254 -27 -290 -510 83 210 169 15 -356 -349 -82
5159 -82 347 352 24 -322 -416 -76 257 350 21 -288 -261 -59 286 356 -40 -437 -265 -60 181 347 257 -324 -436
5182 -436 -165 271 204 84 -161 -322 0 122 430 297 -200 -392 -97 333 392 87 -190 -262 -140 356 444
5203 444 275 -307 -402 -237 152 361 96 -176 -347 -409 145 437 255 -327 -450 -168 2 448 253 -59 -478
5224 -478 -159 37 466 218 -216 -283 -226 81 371 259 15 -247 -428 156 327 326 16 -238 -252 112 213 280
5246 280 42 -297 -338 70 305 278 -32 -433 -273 12 323 352 -24 -468 -214 -80 404 132 31 -258 -342
5267 -342 41 336 378 -85 -279 -239 39 217 383 103 -145 -229 -58 177 226 40 -214 -146 71 223 204 16
5289 16 -94 -333 -136 302 301 164 -358 -190 -182 -35 158 137 -144 -303 -169 216 218 161 -178 -180 -124 -42 208 198 -87
5314 -87 -256 -152 200 163 164 -44 55 -162 -103 175 174 -24 -90 -80 64 -15 2 69 -89 58 29 246 121 -109 -65
5339 -65 -84 1 40 65 97 -117 22 44 301 265 -93 117 -124 80 88 45 -73 -174 -93 43 -99 165 16 -45
5363 -45 89 35 17 134 27 -107 -32 205 167 -88 -193 -1 145 19 -57 -82 53 -78 32 71 32 -120 -148
5386 -148 37 -40 36 -30 -18 -169 91 95 108 -33 6 -160 144 96 30 24 -85 -180 -241 91 20 38 -244 -141 137
5411 137 18 197 -14 -30 -237 199 201 225 -39 -120 -213 92 81 198 -1 -247 -193 94 167 316 -162 -247 -46
5434 -46 -67 40 106 107 -312 -322 132 176 161 160 -162 -187 5 286 191 26 -227 -243 -4 90 90 121 -42 -200 -80 149
5460 149 222 -44 -206 -174 -23 166 75 71 -87 -243 -120 111 274 176 -71 -186 11 147 121 148 -78 -322 -266
5483 -266 213 301 207 -203 -282 -249 -47 224 190 -24 -482 -23 172 340 222 -120 -311 -271 -56 236 232 -122 -211
5506 -211 -241 86 331 215 75 -356 -374 225 243 217 -62 -287 -161 -200 69 377 -73 -203 -209 60 366 115
5528 115 -55 -356 -260 -95 220 218 70 -357 -259 37 311 180 -151 -330 -193 -105 236 214 111 -66 -317 -48
5550 -48 293 162 107 -190 -261 -257 -2 205 55 -245 -263 -119 56 130 -43 -107 -185 -125 84 436 110 -274 -349 -3
5574 -3 326 258 -10 -145 -233 18 187 350 292 -194 -45 32 24 369 175 -31 -328 -171 146 327 124 -118 -223
5597 -223 -1 183 57 40 -18 -377 -224 166 177 51 -231 -113 -152 55 235 161 -68 -107 -182 -58 118 54 -40
5620 -40 -144 -327 92 180 238 -193 -140 -220 29 225 214 -137 -86 -158 60 311 121 -185 -133 -112 26 140 130 -48
5644 -48 -128 -231 -51 115 151 -114 -246 -62 -83 178 83 -24 -47 -109 12 283 92 -113 15 -71 -70 58 161
5667 161 13 -68 -227 -68 53 66 26 -73 -161 51 46 37 22 -144 -122 32 170 -62 68 -31 -161 -2 -7 15 -62
5692 -62 -50 -24 2 94 -174 -51 -63 64 119 44 60 -17 -42 95 -6 30 8 7 92 -13 81 47 147 -122 27 5
5718 5 54 43 2 36 -184 -207 -95 120 -21 -152 12 -76 35 -145 -83 -45 -33 10 -60 86 -101 -78 81 274 162
5743 162 22 21 -32 -139 21 111 -66 10 56 82 77 -43 -160 35 9 -74 -2 164 88 -169 -49 -111 -187 164 109
5768 109 7 -77 28 136 185 64 -54 -6 136 154 -56 32 -85 -36 -117 178 62 172 -153 -67 -69 -88 201 84
5792 84 -117 -4 -35 176 59 -57 139 -45 92 45 -104 -25 -120 -224 -67 -28 97 181 -72 -204 -335 69
5814 69 173 71 -35 -166 -44 81 93 39 149 -70 180 91 202 -7 -68 -221 -39 -21 193 6 -23 -108 -158
5837 -158 73 109 2 -76 -76 -19 -60 164 27 55 -67 -155 106 -55 80 -65 11 -38 -37 130 182 -16 25 -128 -21
5862 -21 50 2 -17 -211 -136 45 -3 75 57 -159 -71 43 -19 41 145 21 -208 19 148 278 -27 -97 64 -8
5886 -8 111 212 146 -29 -131 -204 71 125 9 -87 6 44 57 106 -46 -252 -112 -53 230 163 -183 -95 -6 -169 38
5911 38 151 147 -202 -348 3 166 139 78 -140 -40 -14 65 134 22 49 -48 -21 26 158 83 -140 -159 -123 14 321
5936 321 177 -39 -71 76 194 133 308 -301 -106 66 -103 282 137 -103 -103 -10 215 153 63 -44 -154 -33
5958 -33 14 241 37 -54 71 -54 -145 195 286 17 -69 -273 -21 189 98 -131 -53 -118 40 -44 6 -48 -259 -156
5982 -156 -54 4 -74 -111 -152 -116 119 132 261 7 -84 -55 -76 198 95 163 -5 -118 -31 120 -94 22 -24 -41
6006 -41 166 136 -106 117 -38 -12 -55 64 237 -65 -35 75 -48 66 7 -216 52 -33 -51 221 53 -146 43
6029 43 -150 -83 -69 0 63 -110 58 93 109 106 -154 -48 -49 18 46 11 -82 -62 -14 122 -62 47 40 -55 -4 194 21
6056 21 -83 44 -159 -133 -24 3 -75 -60 110 3 39 71 51 -78 -35 -101 91 -66 -225 13 -35 -125 78 -110
6080 -110 11 -34 -159 128 86 -128 -99 -1 -39 -22 -37 127 -34 -24 -47 223 137 -74 -198 -146 -80 17 298 202 -75
6105 -75 -68 190 33 -20 -23 -98 -79 -196 -204 96 168 -116 -138 -120 9 75 35 -188 -240 -201 -102 6 46 -60 -246 -97
6131 -97 77 151 -9 -23 -36 -68 139 50 215 59 -83 29 -12 173 93 -60 -151 -20 -33 185 157 -111 33 108
6155 108 -106 114 119 30 -228 -288 4 202 54 171 -60 -114 57 52 8 -35 -276 -180 147 353 -41 -156 -54
6178 -54 -233 76 147 102 -47 -85 -115 52 55 218 -105 -152 -62 -16 206 65 -175 -177 65 76 174 -41 38 -174 -219
6203 -219 -22 130 225 60 -14 -124 27 114 -68 -98 -209 -84 -170 309 178 -45 -108 -114 -127 238 152 33 -195
6226 -195 -86 -3 162 159 -80 -89 -29 106 -49 20 100 -19 -228 138 64 43 -145 -118 -217 -117 111 129 80 20 -335
6251 -335 -60 179 46 108 -208 -127 -77 200 142 14 -202 -96 -40 -154 109 -93 51 -71 -107 74 96 -14
6273 -14 77 -12 11 -122 -182 175 40 -23 -168 -81 -65 4 -53 -80 -170 -166 25 -23 21 -147 -293 127 228 122 -137
6298 -137 -103 5 35 -104 58 27 -5 -34 8 15 50 -63 -41 54 -1 142 98 118 101 -158 -100 -93 -32 79 61 -96 53
6325 53 -37 85 -123 -162 -31 -68 124 56 94 39 -134 3 121 113 179 -47 -59 149 11 44 8 24 87 -72 77
6350 77 36 -80 34 -25 -41 101 80 -6 112 74 -52 -59 62 85 -69 -146 -185 -15 -9 0 -68 -118 119 73 15 66 -77
6377 -77 91 119 195 187 -246 -55 -34 -59 -39 148 -85 -14 58 -35 113 45 -10 -92 -156 9 100 -70 -46 -55 -126 -69 18
6404 18 3 -59 65 2 -33 -3 83 -149 -113 -106 -102 169 2 -90 -232 -78 -27 33 -45 37 -41 20 155 5 118 10
6430 10 -69 17 -112 118 30 -28 -183 -122 96 113 -91 -42 32 -137 -14 -10 163 -84 -148 78 181 47 52 -101 -212
6455 -212 -6 -105 109 -97 -16 -106 146 93 167 15 -144 -21 -190 48 81 111 -24 -94 -114 43 102 23 -82 -70
6479 -70 -31 77 227 -8 26 -131 14 63 94 42 43 21 5 -36 -55 -94 -5 -88 -41 -55 -58 73 -121 -128 52 -52 272
6506 272 51 29 -26 -59 167 -52 98 -51 -116 -139 15 129 60 74 -20 76 37 14 30 -44 -182 75 112 80 2
6531 2 77 -88 28 -29 265 86 15 -118 -106 -30 -134 -116 -88 -55 12 -2 -138 97 -154 -59 -112 108 20 -5 -138
6556 -138 -6 -78 171 153 -47 -87 -165 -29 252 126 78 71 -114 -126 -38 74 -7 -70 -102 -74 -7 101 31 66 -132
6581 -132 27 -103 132 -71 -25 -12 142 6 -86 108 -66 -60 -113 47 -22 44 -22 -110 89 -74 -64 94 -113 25
6605 25 62 132 44 -165 12 54 162 120 78 48 79 -74 207 16 -15 -310 -31 -60 15 83 -3 -121 -108 -61 92
6630 92 -7 -153 -45 -134 -198 -85 99 -58 -88 -85 -82 -17 64 -86 -164 -174 4 78 229 180 -167 -146 -41 32 -20 -5
6656 -5 -131 0 6 -184 216 89 103 -206 -229 -31 33 -30 -154 4 -141 42 30 174 -105 -127 72 33 -142 170
6680 170 123 32 63 6 83 162 -86 35 28 55 135 68 83 73 101 -69 131 132 204 -40 -127 -255 -58 -32 50 -6 -197
6707 -197 75 -53 62 85 73 -148 -111 124 129 184 11 -184 13 95 71 -41 208 -70 -49 60 77 -17 -10 138
6731 138 18 1 -76 -8 41 -93 46 -10 -7 191 -31 27 123 25 86 160 -54 -199 21 113 202 -138 106 -67 -245
6756 -245 -68 64 90 -53 30 -90 28 16 35 -103 -251 -43 118 195 125 144 -92 33 22 140 31 -62 124
6779 124 -230 -108 134 108 -148 -121 151 -107 -26 -265 33 -88 177 66 50 -31 11 26 -43 -44 92 8 -31 197
6803 197 1 70 -151 97 1 -37 -163 97 -128 102 211 -71 -17 40 121 -42 63 7 -43 3 -46 178 -47
6826 -47 92 -43 65 181 -106 -30 -39 -121 13 139 111 -73 -221 72 153 -119 45 -3 -80 8 22 115 -130 -40
6850 -40 -184 -198 -82 9 148 56 -150 -83 117 58 93 -38 -149 -125 57 -13 62 130 22 -18 67 228 89 109 -52
6875 -52 -68 13 -57 22 -45 -60 6 -82 31 29 -87 -70 -122 74 72 93 128 60 -136 78 172 33 44 -351 123 -25 121
6902 121 64 24 -183 -113 163 85 116 -160 -110 10 95 38 67 178 -174 15 -31 44 33 -52 36 -6 189 100 -59
6927 -59 -271 -102 -1 81 53 -181 12 -50 -21 -70 80 -20 163 27 -98 -11 -71 171 0 -17 -207 51 194
6950 194 -70 101 -76 -107 -9 95 -106 2 24 -23 -54 25 123 -70 -70 -85 -36 89 6 -58 -144 -44 164 96 -24
6975 -24 -2 -54 95 48 -32 198 -104 -45 -39 119 162 83 -46 156 -213 34 133 62 100 -133 -67 120 -10 19 20 159
7001 159 -47 3 165 200 50 -76 -83 22 1 -55 41 84 42 -106 114 6 -46 -185 -70 -115 40 -46 25 -97
7025 -97 -44 -119 94 -103 -132 -130 2 29 -76 92 -58 29 -63 168 121 43 -138 -24 -51 252 -53 136 -24 -126
7049 -126 205 -14 25 94 -103 -68 -13 71 -74 19 249 -24 -77 116 -19 -27 21 -126 -132 34 -71 -15 39 -65 59
7074 59 -110 -34 107 -47 -76 90 -150 150 -71 -8 -49 -94 -181 3 15 117 -6 -142 -83 101 175 82 -217 -50
7098 -50 223 -100 -20 20 -121 -57 60 51 36 79 -107 59 -61 -52 215 169 -54 -112 -15 -2 134 -169 -47 5 -118
7123 -118 -13 -69 86 -233 -121 -73 -104 72 222 -55 -236 -88 -46 38 -22 56 -106 19 -5 -89 -9 -6 -5 -119 128
7148 128 25 152 -89 -38 -102 -56 272 -51 23 137 -153 98 85 35 47 -148 -58 37 -42 61 97 -191 1 -97
7172 -97 -6 216 -42 -134 19 -187 53 177 182 -114 -184 -54 23 151 136 90 111 118 97 92 34 -177 -78 7 15 4 17
7199 17 -23 -136 -178 226 145 -96 39 -221 -7 43 -25 150 98 -144 -62 161 75 63 -62 -57 -199 -43 -28 94
7223 94 -9 -40 28 -75 -116 -131 -70 -4 36 -77 68 264 -10 -164 12 107 37 72 -17 -114 -112 -47 -14 -32 -88 -75 -106
7250 -106 -62 -134 98 7 -29 27 -53 124 53 -44 36 -3 -69 45 175 79 -74 32 -35 11 -127 59 -153 -32 4
7275 4 79 106 172 -12 -118 127 75 -32 212 -6 79 30 -87 -56 -71 -36 -65 24 -95 -98 -29 88 -88 13 96 1
7301 1 -90 -62 -79 -11 22 19 17 50 -47 -148 -16 -32 26 104 -126 146 -154 -46 164 -174 9 -44 -122 110 88 51 130
7328 130 137 -106 33 60 2 -27 -95 -96 -93 -18 205 11 -49 53 -163 63 -20 79 37 -57 44 -41 -74 98 68 -289
7354 -289 -27 -8 142 -88 -51 -72 74 -52 -4 76 4 13 -90 18 14 110 -5 -24 -6 131 20 50 68 -30 138
7379 138 16 -20 179 30 -172 -99 54 17 -124 -29 -53 -8 -108 126 -107 -45 220 -49 11 -63 -152 225 -158
7402 -158 -72 -68 -298 -41 -4 58 -15 -71 106 49 -21 7 -110 -5 -20 24 35 28 39 -53 34 94 68 -5 88 -88 23
7429 23 10 -65 114 43 97 -138 -45 -25 -51 -79 116 34 -125 57 3 154 40 -123 -35 111 -7 -1 -11 -23 7 -18
7455 -18 -86 113 86 -28 -8 150 -85 45 42 -64 -144 -12 -51 100 -26 -71 -3 -62 103 173 86 -32 15 -17 177
7480 177 4 71 -114 -57 0 -58 166 -181 -16 -107 -4 27 -20 143 -210 204 110 55 -45 -108 -125 -38 63 69 29
7505 29 59 -103 23 232 93 64 183 22 -173 5 63 34 194 -217 41 -163 188 118 141 -87 -134 -75 142
7528 142 133 -15 149 13 -31 -44 13 -83 -21 39 15 112 51 -17 25 -63 -102 239 37 190 -122 -80 -132 -122 227 42
7554 42 -77 39 -90 -34 123 11 101 -254 -73 82 121 -41 95 -32 -135 -103 225 158 -14 -12 -51 8 129
7577 129 90 23 -83 19 -51 -47 29 258 -10 -71 7 92 124 30 -28 6 -83 -13 236 18 113 -82 -137 49 104 -216
7603 -216 -213 -14 45 116 31 10 5 -32 -70 -35 82 -84 243 -22 -153 -189 57 5 1 -62 -158 121 -62 -35 73 56
7629 56 -178 -58 210 -18 10 4 -29 -144 -20 -40 40 9 14 87 -57 147 51 4 17 1 -126 -27 -113 -117 -87 -115 27
7656 27 -88 -34 80 -130 -5 -27 -12 48 -42 40 -92 118 -81 -15 60 -137 33 -108 140 -154 -110 -20 -63 -22
7680 -22 -21 -17 -77 9 -54 189 -107 -75 -7 38 -65 37 20 70 7 -255 -85 109 -17 104 86 -134 -73 3 171 73
7706 73 86 -1 -77 -35 15 43 138 -21 86 20 -77 90 144 -70 32 34 152 25 -2 -97 -27 81 -11 132 136 44 -78
7733 -78 2 80 129 180 37 -72 42 11 17 -76 -71 -83 -86 21 41 13 -139 86 -11 93 41 -14 -65 -115 6 -32 66 -101
7761 -101 112 -57 -19 39 -54 116 107 -31 158 -2 88 56 13 -22 81 -30 -80 11 18 -148 -30 -20 70 -16 63 -11
7787 -11 -44 77 172 15 -15 -28 -184 46 69 60 -14 -110 57 -23 -189 211 -148 -107 -75 -95 -15 -34 -42 5 -28 -249 112
7814 112 31 -26 -40 -20 -73 43 -80 13 -45 -84 -18 91 -53 1 113 -171 -35 -1 42 -78 66 -213 -154 112
7838 112 5 64 -145 -52 -16 26 -27 69 73 -102 -21 30 42 -36 29 40 -61 -70 -103 93 60 -8 -228 79 -165 44
7864 44 109 -133 -141 0 -70 -30 -9 -87 1 -122 1 189 134 135 104 -84 3 33 52 47 39 60 8 26 157 61 4 -143
7892 -143 -139 -5 188 4 107 -129 -63 -43 40 62 151 14 -129 31 84 -74 -168 -209 -193 -152 -61 72 -19 -116 -228
7917 -228 121 85 50 -227 -50 109 -46 17 -25 -131 28 -68 -20 89 76 -106 -142 -95 58 -51 -99 104 -42
7940 -42 -98 -205 64 160 13 -18 -36 88 -30 134 42 20 -202 -84 113 -23 -3 -60 -141 -124 108 85 70 75 -151
7965 -151 -5 26 -76 -65 0 -9 64 -39 53 8 -12 -112 -42 47 132 27 -104 -68 -216 -33 -19 47 160 -184 -105
7990 -105 156 53 118 -3 -26 -62 -38 54 98 -12 -133 -4 17 -16 -53 57 24 -20 44 -7 -19 -39 -112 -111 -66 -48 64
8017 64 -79 -142 -85 85 137 -93 -189 -44 -143 -198 65 42 32 -71 -224 9 80 -11 19 -60 -64 95 0 126 -194
8042 -194 -122 -18 -66 5 -80 32 -115 -124 134 -37 -54 -39 -62 15 -91 -229 -93 117 76 -112 -9 -112 -61 145
8066 145 1 -109 -35 69 95 9 -111 -55 -6 -73 -44 175 -103 12 -56 38 64 -48 51 96 5 -79 0 -31 -21 -11
8092 -11 -25 -5 71 -16 10 -75 -183 120 -8 68 7 -15 11 -199 -71 -29 106 -27 43 -35 -130 -144 8 23 -73 34
8118 34 -69 84 29 124 -74 27 121 -5 -59 69 76 -54 -37 135 57 -24 147 37 -58 -28 -31 -6 -25 22 27 -4 22
8145 22 0 65 -70 -205 -27 60 -39 36 2 -75 -1 -41 73 30 32 -55 -162 -86 -101 -3 -23 -87 -169 -6 -34 36 11 -119
8173 -119 -148 -32 128 45 -57 19 63 81 51 119 -102 16 107 -171 68 -31 101 -100
8191a00
##END NTUPLES=NMR FID
##END=
