##TITLE=1H_E3d0307-3
 CDCl3
 8 sc, 
 4.7.2023
##JCAMPDX= 6.0         $$ Bruker NMR JCAMP-DX V2.0
##DATA TYPE= NMR FID
##DATA CLASS= NTUPLES
##ORIGIN= UXNMR, Bruker Analytische Messtechnik GmbH
##OWNER= root
$$ XWIN-NMR		Version 3.5
$$ Tue Jul  4 14:15:06 2023 Russian Standard Time (UT+4h)  she@DPX200
##.OBSERVE FREQUENCY= 200.13135
##.OBSERVE NUCLEUS= ^1H
##.DELAY= (6, 6)
##.ACQUISITION MODE= SIMULTANEOUS
##.ACQUISITION SCHEME= undefined
##.AVERAGES= 8
##.DIGITISER RES= 18
##SPECTROMETER/DATA SYSTEM= spect
##.PULSE SEQUENCE= zg30
##.SOLVENT NAME= CDCl3
##.SHIFT REFERENCE= (INTERNAL, CDCl3, 0, 15.7039)
##AUDIT TRAIL= $$ (NUMBER, WHEN, WHO, WHERE, WHAT)
$$ ##TITLE= Audit trail, XWIN-NMR		Version 3.5
$$ ##JCAMPDX= 5.01
$$ ##ORIGIN= Bruker BioSpin GmbH
$$ ##OWNER= she
$$ F:/spectra/data/she/nmr/H-F/1/audita.txt
$$ ##AUDIT TRAIL=  $$ (NUMBER, WHEN, WHO, WHERE, WHAT)
(   1,<2023-07-04 14:13:40.90 +0400>,<she>,<DPX200>,
      <created by zg, POWCHK disabled, PULCHK disabled
       configuration hash MD5:
       00 E9 B6 7A A2 85 ED C7 34 08 36 98 17 FE 4E 26
       data hash MD5: 16K
       EA 04 77 5A CE 77 E9 19 44 34 92 EA 3C A8 E3 FE>)
$$ ##END=
$$ 
$$ hash MD5
$$ 2E 92 F4 E7 6A E9 D6 12 82 00 0A 7E 99 62 C8 BD
##$RELAX= 
##$RELAX= 
##$RELAX= 
##$RELAX= 
##$RELAX= 
##$RELAX= 
$$ Bruker specific parameters
$$ --------------------------
##$DU= <F:/spectra>
##$EXPNO= 1
##$NAME= <H-F>
##$PROCNO= 1
##$TYPE= <nmr>
##$USER= <she>
##$AMP= (0..31)
100 100 100 100 100 100 100 100 100 100 100 100 100 100 100 100 100 100 
100 100 100 100 100 100 100 100 100 100 100 100 100 100 
##$AQSEQ= 0
##$AQ_mod= 1
##$AUNM= <au_zg>
##$AUTOPOS= <>
##$BF1= 200.13
##$BF2= 200.13
##$BF3= 200.13
##$BF4= 200.13
##$BF5= 200.13
##$BF6= 200.13
##$BF7= 200.13
##$BF8= 200.13
##$BYTORDA= 1
##$CFDGTYP= 0
##$CFRGTYP= 5
##$CHEMSTR= <none>
##$CNST= (0..31)
1 1 145 1 1 1 1 1 1 1 1 1 1 1 1 1 1 1 1 1 1 1 1 1 1 1 1 1 1 1 1 1 
##$CPDPRG= <>
##$CPDPRG1= <>
##$CPDPRG2= <>
##$CPDPRG3= <>
##$CPDPRG4= <mlev>
##$CPDPRG5= <mlev>
##$CPDPRG6= <mlev>
##$CPDPRG7= <mlev>
##$CPDPRG8= <mlev>
##$CPDPRGB= <>
##$CPDPRGT= <>
##$D= (0..31)
0 1.2 0 0 0 0 0 0 0 0.06 0 0.03 0 0 0 0 0.0002 0 0 0 0 0 0 0 0 0 0 0 0 
0 0 0 
##$DATE= 1688465620
##$DBL= (0..7)
120 120 120 120 120 120 120 120 
##$DBP= (0..7)
150 150 150 150 150 150 150 150 
##$DBP07= 0
##$DBPNAM0= <>
##$DBPNAM1= <>
##$DBPNAM2= <>
##$DBPNAM3= <>
##$DBPNAM4= <>
##$DBPNAM5= <>
##$DBPNAM6= <>
##$DBPNAM7= <>
##$DBPOAL= (0..7)
0.5 0.5 0.5 0.5 0.5 0.5 0.5 0.5 
##$DBPOFFS= (0..7)
0 0 0 0 0 0 0 0 
##$DE= 6
##$DECBNUC= <off>
##$DECIM= 32
##$DECNUC= <off>
##$DECSTAT= 4
##$DIGMOD= 1
##$DIGTYP= 9
##$DL= (0..7)
0 120 120 120 120 120 120 120 
##$DP= (0..7)
150 150 150 150 150 150 150 150 
##$DP07= 0
##$DPNAME0= <>
##$DPNAME1= <>
##$DPNAME2= <>
##$DPNAME3= <>
##$DPNAME4= <>
##$DPNAME5= <>
##$DPNAME6= <>
##$DPNAME7= <>
##$DPOAL= (0..7)
0.5 0.5 0.5 0.5 0.5 0.5 0.5 0.5 
##$DPOFFS= (0..7)
0 0 0 0 0 0 0 0 
##$DQDMODE= 0
##$DR= 18
##$DS= 0
##$DSLIST= <SSSSSSSSSSSSSSS>
$$ [...]
##$SUBNAM2= <"">
##$SUBNAM3= <"">
##$SUBNAM4= <"">
##$SUBNAM5= <"">
##$SUBNAM6= <"">
##$SUBNAM7= <"">
##$SUBNAM8= <"">
##$SUBNAM9= <"">
##$SW= 18.05172834244
##$SWIBOX= (0..15)
0 0 2 0 0 0 0 0 0 0 0 0 0 0 0 0 
##$SW_h= 3612.71676300578
##$TD= 16384
##$TD0= 1
##$TE= 0
##$TE2= 300
##$TE3= 300
##$TEG= 300
##$TL= (0..7)
0 120 120 120 120 120 120 120 
##$TP= (0..7)
150 150 150 150 150 150 150 150 
##$TP07= 0
##$TPNAME0= <>
##$TPNAME1= <>
##$TPNAME2= <>
##$TPNAME3= <>
##$TPNAME4= <>
##$TPNAME5= <>
##$TPNAME6= <>
##$TPNAME7= <>
##$TPOAL= (0..7)
0.5 0.5 0.5 0.5 0.5 0.5 0.5 0.5 
##$TPOFFS= (0..7)
0 0 0 0 0 0 0 0 
##$TUNHIN= 0
##$TUNHOUT= 0
##$TUNXOUT= 0
##$USERA1= <user>
##$USERA2= <user>
##$USERA3= <user>
##$USERA4= <user>
##$USERA5= <user>
##$V9= 5
##$VALIST= <valist>
##$VCLIST= <CCCCCCCCCCCCCCC>
##$VD= 0
##$VDLIST= <DDDDDDDDDDDDDDD>
##$VPLIST= <PPPPPPPPPPPPPPP>
##$VTLIST= <TTTTTTTTTTTTTTT>
##$WBST= 1024
##$WBSW= 4
##$XGAIN= (0..3)
0 0 0 0 
##$XL= 0
##$YL= 0
##$YMAX_a= 585734
##$YMIN_a= -822092
##$ZGOPTNS= <>
##$ZL1= 120
##$ZL2= 120
##$ZL3= 120
##$ZL4= 120
##$ABSF1= 10
##$ABSF2= 0
##$ABSG= 5
##$ABSL= 3
##$ALPHA= 0
##$AQORDER= 0
##$ASSFAC= 0
##$ASSFACI= 0
##$ASSFACX= 0
##$ASSWID= 0
##$AUNMP= <proc_1d>
##$AZFE= 0.1
##$AZFW= 0.1
##$BCFW= 1
##$BC_mod= 2
##$BYTORDP= 1
##$COROFFS= 0
##$CY= 11.3945322036743
##$DATMOD= 1
##$DC= 2
##$DFILT= <>
##$DTYPP= 0
##$F1P= 15.7292609196834
##$F2P= 12.9074282941183
##$FCOR= 0.5
##$FTSIZE= 0
##$FT_mod= 4
##$GAMMA= 1
##$GB= 0.15
##$INTBC= 1
##$INTSCL= 1
##$ISEN= 128
##$LB= 0.24
##$LEV0= 0
##$LPBIN= 0
##$MAXI= 10000
##$MC2= 0
##$MEAN= 0
##$ME_mod= 0
##$MI= 1.114404
##$NCOEF= 0
##$NC_proc= 0
##$NLEV= 6
##$NOISF1= 3.799351
##$NOISF2= 2.8
##$NSP= 1
##$NTH_PI= 0
##$NZP= 0
##$OFFSET= 15.70392
##$PC= 1
##$PHC0= -20629.75
##$PHC1= 10.65272
##$PH_mod= 1
##$PKNL= yes
##$PPARMOD= 0
##$PSCAL= 0
##$PSIGN= 0
##$REVERSE= no
##$SF= 200.130013532006
##$SI= 16384
##$SIGF1= 3
##$SIGF2= 2
##$SINO= 400
##$SIOLD= 16384
##$SREGLST= <1H.CDCl3>
##$SSB= 0
##$STSI= 0
##$STSR= 0
##$SW_p= 3612.71676300578
##$SYMM= 0
##$S_DEV= 0
##$TDeff= 0
##$TDoff= 0
##$TI= <>
##$TILT= no
##$TM1= 0
##$TM2= 0
##$TOPLEV= 0
##$USERP1= <user>
##$USERP2= <user>
##$USERP3= <user>
##$USERP4= <user>
##$USERP5= <user>
##$WDW= 1
##$XDIM= 8192
##$YMAX_p= 0
##$YMIN_p= 0
$$ End of Bruker specific parameters
$$ ---------------------------------
##NTUPLES= NMR FID
##VAR_NAME=  TIME,          FID/REAL,        FID/IMAG
##SYMBOL=    X,             R,               I
##VAR_TYPE=  INDEPENDENT,   DEPENDENT,       DEPENDENT
##VAR_FORM=  AFFN,          ASDF,            ASDF
##VAR_DIM=   8192,          8192,            8192
##UNITS=     SECONDS,       ARBITRARY UNITS, ARBITRARY UNITS
##FACTOR=    0.0002768,     1,               1
##FIRST=     0,             0,               0
##LAST=      2.2672688,     0,               0
##MIN=       0,             -822092,         0
##MAX=       2.2672688,     585734,          0
$$ Real data points
##PAGE= N=1
##DATA TABLE= (X++(R..R)), XYDATA
$$ [...]
1949A441r46j454N41P31k77M12J020k111p91K005j2o46J190j520j204K134M16
1966I29j086O78j83k288J280K940k074j596K294j393r30L280l23l032J000Q23
1982C19j072J351J603k782j528K707Q2j249K473j131l309J625K191r01l09O27
1998F97j719j037K682R54j492lq15j264K431J460j838m66L28r71M07K706m72k924
2016a336K39J504j210J627J532l183j197K366M1m74J783j132l698K137L111k180
2032g0j47J790l468q94M540K77l096J077N3k498K502L175k931j517J736j678l9
2049a188M058j386l431J686M88j459K428J388l496j042K390o01P2K297k514k163
2065b473K380M97o10J413m97l069P69L307q57j272J260j262k058L227J915k764
$$ plain form
1949 1441 495 -959 -418 313 36 448 1468 -643 -1434 571 559 -87 1103 -417 -1621 513 929
1966 929 -157 521 338 -1950 -670 2270 196 -1400 894 -499 -1429 1851 1528 -1504 -504 319
1982 319 -753 598 2201 -581 -2109 598 680 -569 1904 773 -2536 -911 1280 379 70 697
1998 697 -1022 -2059 623 1577 85 82 -733 -1997 434 1894 56 -410 -82 -1053 -646 2060 1588 -1336
2016 -1336 -1097 407 -803 824 2356 -827 -2024 342 383 -91 1692 560 -3138 -1001 2110 -70
2032 -70 -217 1573 -1895 -2789 1751 2028 -1068 9 62 -2436 66 3241 310 -1207 529 -1149 -1188
2049 -1188 2870 1484 -1947 -261 227 -1232 1196 2584 -912 -1954 436 -165 -93 2204 -310 -2473
2065 -2473 -93 404 -206 1207 710 -2359 -1590 1717 860 -412 848 -414 -2472 755 2670 -94
2081i4l99Q87j767M15L667j113l739J751R63k458K874K127m668o91L066j019n25
2098g23L345j899l972K718J949k093J721P44m380J006L326j774O2J820k909j513
2114b572L953M44k529J183K35l199K222K723k739l88J035j575L03K583n76k187
2130a084J24J025q00J001J853k030k176J822R36m77N59P64k710j210L380N06j977
2147d94J603o91l015K461K441k484j62J699l021k81M060j185k918K776n30k850
2163b591L647J036m000J537J478k603J504K510l478j266L638j177j458L367j224
2178I20l604K798J148j806J398O00k958K56K323q45r8O90j324j246J727R56p45
2195A90k48k35m51K44O03R64r01j265J252N2p91J447j95j794R28R46q80J43J021
$$ plain form
2081 -94 -493 394 -1373 -958 2709 1596 -2143 -392 571 -1887 987 3114 -1554 -2245 821 -198 -723
2098 -723 2622 723 -3249 -531 1418 -675 1046 1790 -2590 -1584 1742 -32 30 1850 -1059 -2572
2114 -2572 1381 1825 -704 479 714 -2485 -263 2460 -279 -667 368 -1207 -904 1679 1103 -1084
2130 -1084 -960 65 -735 266 2119 89 -2087 -265 671 194 753 1517 -1193 -2403 977 1483 -494
2147 -494 1109 418 -2597 -136 2305 -179 -341 1358 -1663 -1944 2116 931 -1987 789 259 -2591
2163 -2591 1056 2092 -1908 -371 1107 -1496 8 2518 -960 -2226 1412 235 -1223 2144 920
2178 920 -2684 114 1262 -544 854 1454 -1504 -1248 1075 230 132 822 -502 -1748 -21 935 190
2195 190 -58 -293 -744 -500 103 1067 166 -1099 153 205 -586 861 666 -1128 -200 746 -134 9 1030
2214A030k036k09K877j344j115J984j269k034L270J80k421J461o4k258K066J726
2230A844k683J28J929k459K49L027j909j601K294p74j146K307o55j525Q19N89
2246D34p90R44J17j313K28R37p67O10J78j548N23O75n31J092o00j501J187O31
2264E06r94J087K08j948L60J717p97k09R95j764M3K024j043n96J711j929r26K629
2282A074k42j594J144m58j482J922R25k168O02O44j929J521K024k623j57J497
2298G00j699N67K027j334j091Q77j33j57J369n65j535R70j30j9J741j033j838
2315a283J330r7l12J612q14j911J185N11p64J537J26k584N01J646j006P09R35
2332A321k426R6J660q21Q53P31k422k95K187p24j03J196j641j495K469M90j484
$$ plain form
2214 1030 -1006 -1215 1662 318 -797 1187 -82 -2116 1154 1334 -1087 374 310 -1948 118 1844
2230 1844 -839 -711 1218 -1241 -992 2035 126 -1475 819 45 -1101 1206 551 -974 -155 434
2246 434 -356 588 705 -608 -380 557 -210 400 578 -970 -447 228 -303 789 189 -1312 -125 506
2264 506 -488 599 807 -1141 -781 936 139 -70 925 -839 -796 1228 185 -411 1300 -629 -1555 1074
2282 1074 832 -762 382 -76 -1558 364 1289 -879 -277 367 -1562 -41 1983 -640 -797 700
2298 700 -999 -432 1595 261 -830 47 -86 -243 1126 561 -974 -4 -134 -153 1588 555 -1283
2315 -1283 47 -50 -362 1250 436 -1475 -290 221 -543 994 1120 -1464 -963 683 -323 386 1321
2332 1321 -1105 -1009 651 -170 683 1414 -1008 -1303 884 160 57 1253 -388 -1883 586 1076 -408
2349d08J366j024j800K120J107j915J048m78k000J703J593j380j20L70j454O67
2365f05K128j132p02Q13j825N01K605j201j007R12j385J42K227m98j547O93o28
2382e09n82K061J71k143Q23J81j290J978J014k545L37N76j235J602Q91j728j11
2399e09O74q20Q10J755k076j026J732o94m36K185j308j762J745j39p61J957o64
2416F63j851J038N98r64Q57O63k099K12J117l16K83O86j635K83P93m84N76N92
2434A012j708j8Q90Q4J97K91j084m71J197k54J74O87j484p24J537j83l41J040
2452H42r68j148J445J96n59Q44l11j882J235J022j309R27R23k235N0K089j260
2469i9q3J416j621q38J836j60r13J005l81j277J094J075j166j56N52r74L57R71
$$ plain form
2349 -408 958 -66 -1866 254 1361 -554 494 16 -1984 -281 1312 -68 -188 182 -1272 -605
2365 -605 1523 391 -311 502 -1323 -822 1783 582 -425 487 -898 -756 1471 973 -574 119 -509
2382 -509 -1091 970 1141 -1002 -179 2 -1288 690 1704 -841 -504 72 -1163 439 1330 -398 -509
2399 -509 165 -655 155 1910 -166 -1192 540 -154 -590 1595 287 -1475 270 131 -630 1327 663
2416 663 -1188 -150 448 -516 341 1004 -1095 -883 234 -82 201 887 -748 -465 328 -156 420 1012
2434 1012 -696 -714 176 260 457 748 -336 -807 390 136 310 997 -487 -1211 326 143 -198 842
2452 842 -126 -1274 171 367 -192 652 341 -1541 -306 716 -593 334 1257 -978 -928 1161 -99
2469 -99 -182 1234 -387 -1225 611 451 -462 543 162 -1115 -21 1054 -112 -268 284 -690 -333 638
2487F38k29p23J8n0J75L71L95n23m52J33L26R2L86P0r49o43R37P64q08Q60n48
2508B40j433Q47J322j168L20O95j758p0J535j05p76J098p67j434J892N42j633
2525f53Q90L93j640O91J729j237o74R33l68o80J398L15k131R81O61j471Q38R35
2543I10j248n43J288j30o86Q42J07j764N35J716j007j94Q55j231o25J611M45j000
2561a19M56J24j500N44J627p24n98Q09r76p37J496M02j135K69L28j180N88J291
2579I65q09p65J185o98r98J611J1j059N34N19r29%J246o00q78J272k54j445J552
2598D60L94j637M51J292j317k89J546p42j307J507K14j289J074M34j826N34J364
2615H63r92j56J006j093p97J670L31j241O46J92j731R63J281o26l63M86r84k76
$$ plain form
2487 638 409 -314 -296 -346 -171 200 595 72 -380 -247 79 171 557 627 -322 -965 -28 736 -72 788 240
2508 240 -1193 -346 976 -192 128 823 -935 -1005 530 425 -351 747 -20 -1454 438 980 -653
2525 -653 237 630 -1010 -319 1410 173 -501 432 64 -616 782 1097 -1034 -53 608 -863 -25 910
2543 910 -338 -881 407 277 -409 433 540 -1224 -689 1027 20 -174 681 -550 -1175 436 881 -119
2561 -119 337 461 -1039 -495 1132 408 -190 619 -357 -1094 402 804 -331 -62 266 -914 -326 965
2579 965 156 -609 576 -122 -1120 491 502 -557 -23 496 -433 -433 813 213 -665 607 353 -1092 460
2598 460 854 -783 -332 960 -357 -646 900 158 -1149 358 572 -717 357 791 -1035 -501 863
2615 863 -129 -285 721 -372 -1169 501 832 -409 237 429 -1302 -339 942 316 -47 439 -545 -821
2633h21J445M42j106J02j92j022J058J339j183o33O75n50k24J474J18j581m1R22
2651B22p35L37J501j196j407J435K19o35Q71k6j778M08J700o24l48R64j407r12
2669a411K021M51j126J69k49j009R56J313n46r81j19m74L82J808k37j381L9m40
2687h34K14J392O39j380j008N43K81N30P44n22j433R1Q52K37L58m1j183q83J213
2706a90J142o18j38l67j096P83J831q23q35J28o63j0J720M06j523m59M41n55J371
2725E45J146j610r98N92j54O03J455j061j459J76N84K74Q72l1j864j98J023L14
2743B09N10L67j756p29R72P19N16j41p98r77K96J046Q51o05o98n39J40P38Q88
2762A009rj252n09L12J09J176L58j449q88O82K83P66O17j188j370O63J071j81
$$ plain form
2633 -821 624 1066 -40 62 -130 -1152 -94 1245 62 -571 104 -446 -670 804 922 -659 -700 222
2651 222 -513 -176 1325 129 -1278 157 376 -259 612 586 -1192 -784 916 292 -56 908 -499 -1411
2669 -1411 610 1061 -65 104 -145 -1154 -198 1115 569 -412 -531 -1005 -623 1185 948 -433 -394 -834
2687 -834 -620 772 1411 31 -977 -434 -153 377 1121 599 -834 -743 109 346 704 663 -520 -1403 -190
2706 -190 952 334 196 -171 -1267 -484 1347 524 -311 -183 -846 -856 864 1270 -253 -712 -271 -826 545
2725 545 1691 81 -917 -325 -479 124 1579 518 -941 -765 -181 93 965 934 -930 -1128 -105 209
2743 209 719 1086 -670 -1399 -427 292 808 667 -131 -1108 -812 234 1085 480 -218 -757 -617 121 1009
2762 1009 1000 -252 -761 -449 -340 836 1194 -255 -1143 -461 -178 588 1205 17 -1353 -690 381 200
2780B00O20k76j731K91J082K21N13k03j567k26J330L68M8k3j186n46J039Q35j69
2799F20J7r84j043J146R85k45j2q09p64O39J088K83n91p89o26N40J071L21l26
2818E21n58j060M54J217J86Mq95j000O16J103K08j25o43q76o2J494M32m36n37
2837D3r16j36J040J005o53m39p85k63J392N31k65n65p09r9Q41Q16j51p82o25j38
2857h58O22J349l97q31n24l50Q60Q64Q7p23o37l51P49R16J11q98q22j53N68J140
2877G22L14p45p74l04M20R89K62q26m58k23L39J016K01o32q78j34M47O37N31o81
2897B23p94J45P7O04P00o82r77J93K95O41M36m85j019L6M34M85M17k04r08m26
2917h09O33M00M79q8j028p7P2O38M73k50m82m89L1N78O46l89m37l34k0N26L75
$$ plain form
2780 200 820 544 -1187 -896 186 407 920 717 -850 -1076 254 622 670 647 -539 -1085 -46 789 620
2799 620 637 -347 -1390 -244 741 496 484 -325 -1089 -450 638 921 330 -459 -1085 -545 526 847 521
2818 521 -37 -1097 -643 574 760 764 -131 -1131 -515 588 796 671 28 -848 -910 584 1016 580 43
2837 43 -873 -1009 31 1036 383 -56 -841 -1104 288 819 554 -11 -720 -819 22 838 687 -95 -720 -858
2857 -858 -236 1113 716 -115 -639 -989 -129 735 822 99 -538 -889 -140 776 887 -11 -833 -986 -418 722
2877 722 1036 291 -483 -787 -367 622 884 58 -400 -623 -284 732 933 301 -577 -711 -264 373 904 223
2897 223 -571 -426 -349 255 955 273 -704 -511 -216 425 861 376 -643 -607 -173 312 729 525 -383 -809
2917 -809 -176 224 703 615 -413 -490 -418 220 693 443 -39 -528 -497 81 727 338 -99 -433 -453 73 448
2938D48j9p82k3L06j14M31L17p47l14L28rM56J75j75p76M04K28k18O42k46p82
2959d70J75L25n4J83J96p72J08L27K02k74N13m62n95N74J41J91k63K44o01n8M73
2980A03L38l74J3q3l38K95O11r5l71k36k03Q5M54N35o41n32K3n2L97R56o16q66
3002e97K33P2n9Q64%r47j99M03O8M63O59j136n86O25L86m3M59o41p40L29Q19o
3024D26r1q8p79k76J071O48o80j69n77l14P89R62k89r41j77oO0J210L20j373m18
3045f92J48L19Q48N54r90j078K20P24L91L32k65j423j93J026L24N40p6j394m21
3064a106J020Q11m20P7o65r72Q00J456m42m05j49q04L72J222M9q83l84j87J9J250
3084F59P89j339j042L96K27P15O75o11j500J01O50O39M76O2j555q48J267Q13M0
$$ plain form
2938 448 429 -353 -376 -70 -184 247 564 -183 -497 -169 -178 278 453 278 -498 -94 134 -84 558 312 -470
2959 -470 -295 30 -24 159 355 -417 -309 18 220 -54 459 -3 -598 -24 117 308 45 289 -312 -370 103
2980 103 441 67 80 -3 -341 -46 565 470 99 -137 -340 -255 199 734 93 -439 -416 -468 -71 885 269 -597
3002 -597 -364 -292 -351 513 513 -434 -633 -230 -162 301 960 -176 -762 -137 249 206 665 24 -716 -387 432 426
3024 426 335 247 -532 -808 263 911 231 62 -515 -829 -40 922 633 -308 -485 -491 -431 779 1099 -274 -692
3045 -692 -544 -225 623 1177 187 -891 -671 53 444 776 511 -912 -1105 -79 245 785 709 -685 -1106
3064 -1106 -86 725 305 382 -283 -1255 -455 1001 559 154 5 -799 -427 795 844 -39 -423 -610 -591 659
3084 659 1448 109 -933 -537 -310 405 1080 469 -1031 -930 -280 359 835 897 -658 -1506 -239 574 614
3103F14L2j114j094Q61J529j57j63l79j352K92J568M91j160N2o89j92J201Q04
3121A144q46n75j41k17O83J143o23j413K32M45O5R18Pj432l43P10M81M78Mr16
3141a96j103Q26J074J15l03k76j297M16J432L35n74o84m87l35J168J232p00q19
3159a76l45m56O30J588l91j173j46J12k0J004O10j431o99M89K88N10O91q44j263
3178a022P34N58pL57k72j153J20J097j7L2j39r57k91J052O03k06m33n20m95P75
3198a84R88R7q65o42p4M23R16L94r07p98j2K89Q95M88n48j188J39N38K21O09j57
3219F22j141j38M04M23K87k8n44o86M24P69r7qj35j009K84J250j39n17k24j81
3239c84j66J049L15p20m11j07J87L31P19o12o22K9J65M97K51k73n14k03K17L59
$$ plain form
3103 614 646 -468 -1562 -701 828 671 508 129 -1223 -931 637 1128 -32 20 -669 -861 340 1144
3121 1144 298 -277 -418 -635 48 1191 568 -845 -613 -168 -103 815 822 -610 -953 -243 238 716 720 -196
3141 -196 -1299 -473 601 716 413 137 -1160 -744 688 1023 449 -235 -722 -1057 111 1343 643 -176
3159 -176 -521 -977 -347 1241 850 -323 -469 -357 -377 627 1237 -194 -893 -404 -116 394 1085 241 -1022
3178 -1022 -288 270 263 620 348 -805 -685 412 395 427 288 -669 -960 92 695 489 56 -464 -959 -184
3198 -184 804 901 36 -606 -680 -257 659 1053 146 -652 -664 -375 520 1008 460 -728 -589 -51 170 779 622
3219 622 -519 -657 -253 170 457 429 -115 -801 -377 392 295 287 152 -857 -573 677 538 21 -203 -384
3239 -384 -550 499 814 94 -317 -424 -237 94 813 201 -421 -392 -227 270 521 248 -266 -469 -252 107
3259A07K51J63n99n34L93K52J92P1l64o83J51P62J40j14K4n61j21O28J48m5k11
3280E0l92r1L91L90O4o60O3%o9M92J35m18j87j0J20L67Q0j14m68o4K79J18J13
3303A89L8m24r9L31J51N4j52k75m8J12K77Q9j81N4l22J15K19R3j29l1j65%p7K49
3327F8R3R1l23l12J58N10m3n0j63j77r5K24M99k78j06l04R8J17L67Qm26j82j55
3350c81L02N28j31k78l33j53L73L14J93m52m00j3J06O87P8l26l74k15K08P22O4
3371E19k40o49j31K54Q23l7j15o29n44M84O66K29k86q06l26M28R00K64o12n19
3391c27m50L34O90O04p58m17m41M06Q40L40k94j020m03L28Q97N78k95j028m23
3410h39M12P83N53k77r05p51L03J204N78m85q12o61L81P11P53k60q97p82M20R30
$$ plain form
3259 107 358 521 -78 -612 -219 33 225 296 -68 -751 -600 162 302 188 212 -349 -470 158 306 261 50
3280 50 -342 -433 -42 348 412 -248 -185 -185 -254 238 373 -45 -232 -242 -122 245 325 211 -257 -321 -42 76 189
3303 189 227 -197 -296 35 186 240 88 -187 -235 -123 154 243 62 116 -206 -91 128 221 92 61 -104 -104 -181 68
3327 68 161 252 -71 -383 -225 285 242 192 29 -148 -243 -19 480 202 96 -208 -110 7 374 382 -44 -226 -381
3350 -381 -79 449 318 40 -293 -446 -73 241 434 -18 -418 -431 -325 362 440 114 -260 -475 -267 455 519
3371 519 279 -370 -501 -247 576 539 424 -205 -749 -265 401 630 344 -462 -788 -360 540 804 192 -327
3391 -327 -777 -443 247 851 93 -324 -765 -359 481 821 527 -493 -896 -568 329 907 612 -416 -839
3410 -839 -427 356 909 632 -273 -1024 -721 483 1061 576 -236 -897 -516 195 948 688 -209 -991 -571 359
3430C59N56k82j084l59N8R08R44l37j235m28K31R49P00j91j284o43N95Q22M56
3449G35J3j129p59M28R45O05l3j149p12J13J251O84l66p50p80J05J052R05n40
3468F18n82r70K11R65R55k74j103q37J81R72Q34j01j033r03L62P48Q72k26o49
3487D0j196L12J062M88O6q02r87J97J011O73q8p43p69k59R79J253k90j087o20
3506g60j90R54J109l82q13o69j85P92R80J88j192n70L6M98R71K96j038q75J14
3525g36N54P49L70p75p75j71P17N50K63l98q01n74Q83R54j67m45p54n9L25J003
3545G13Q6p59m55l58J84J301K48r49o61O9K50N84P16p27q84j12N75L35O87k81
3565E62j151%K84M57O44k04r17m15N01O47J67j62l76q35L87R20l6j82n06n02K00
$$ plain form
3430 359 915 633 -451 -810 -752 156 1100 763 -472 -900 -669 280 980 789 -495 -1138 -543 279 735
3449 735 748 -381 -1140 -712 233 838 805 -344 -1056 -943 308 992 626 -124 -904 -799 253 1158 618
3468 618 36 -934 -723 242 1197 923 -180 -1017 -836 136 970 869 -164 -1067 -705 43 915 689 40
3487 40 -1156 -844 218 706 772 -30 -1017 -820 191 864 776 33 -736 -995 -16 1237 947 -140 -760
3506 -760 -950 4 1113 731 -82 -751 -936 -144 836 1024 -168 -738 -702 -204 767 1063 25 -850 -736
3525 -736 -182 567 937 162 -613 -784 -67 483 746 348 -453 -1027 -144 810 643 198 -556 -615 -290 713
3545 713 799 40 -415 -773 -589 712 960 11 -650 -581 -331 253 969 242 -642 -754 -179 156 843 562
3565 562 -589 -589 -305 152 796 592 -325 -740 -239 408 575 413 37 -798 -411 509 473 291 -215 -717 -517
3586e17O57L99m11m29j24l8P30N28n54n77J49l6K54N83j15q40l45O92Q0K26J14
3607D26m83p01N46L32M9L35n00o74M02M68Lk84M02n74k39N14L96k40j65j71k05
3628c63K98M56k24n2k8k96J74L41O6n26Q5J55k13Q1L70j31l22q4L94m64N80o5
3650B32m48j04M62k46K44o8j82qQ6J86j54L13K0m94j5M34k93J95m7l45J6K51R4
3673A29k46Q3P4l23J38K84j32l4L92m06k03M73j48J86k73j58o8J26M67j62j26
3694G3q7l75j5O02N9l6m09J09k38L12L96j54k52k55n7K11L54P3l12l63K39L3L51
3717B59l5k35n22L48L58N3K94n06n76K74N61P9P9m09o03J56M86K97kj30m94l78
3739f46N50N67j19l44n12k3L60O94j1o12l49k03N88P02n4m27m96k67M34N69K54
$$ plain form
3586 -517 140 539 128 -301 -425 -463 267 795 241 -336 -187 -223 31 614 499 -341 -686 6 86 312 426
3607 426 -57 -758 -212 120 169 504 4 -670 -268 200 203 -81 321 -253 -492 22 418 178 13 -158 -363
3628 -363 -65 391 167 115 87 -209 -35 306 372 -154 -69 86 -127 -46 324 193 -129 -213 181 -283 297 232
3650 232 -216 -320 142 -104 140 72 -110 -118 -32 154 0 313 333 -161 -176 258 -35 160 113 -232 -216 35 129
3673 129 -117 -34 40 -283 -145 139 7 -27 365 -41 -244 229 81 267 -6 -164 -232 -106 361 199 73
3694 73 -14 -389 -404 198 257 221 -188 -79 -317 -5 391 237 -15 -270 -327 -116 238 311 -1 -364 -125 -92 259
3717 259 224 -11 -533 -185 173 226 520 14 -562 -288 273 352 431 22 -581 -425 61 358 356 226 -268 -646
3739 -646 -96 471 352 8 -504 -527 -167 527 516 -96 -445 -648 -60 642 588 161 -335 -602 -168 401 655
3760F55l90q32j62Q18K44M21m02r46j38O05P25Q8m21p64k06N28P41J81p07n95
3780e57k98N08J020L0n78n88l56M15Q43L44n22p37k63L49O91N72n68p07l24M76
3800b50P59K78n12q47k18N41O78L54m40q84l99P23O09K61k26p56l92K36R38K79
3820G32m30p09m40L46Q54M13l73p47m65M48R25K74n09o27n68N37P74M07m34r25
3840e17k55M98M10O28l19q79l24K65R59L59l50p46m58K14R05K85q7p51o91M32
3860d22P20M12k54q54k71L51M23O85l73n67n52K04P30L97k39n88m25J78P77M59
3880G91k88p72k91K66N73K63j84l95m03j40O06M83k14l47l66K6M11M74m8o21k73
3901d49P2M34M76k04n94k53J02M06M67l9o16l66K84K21N48q6n34l28R7L47K98
$$ plain form
3760 655 265 -567 -729 89 333 754 352 -594 -732 -127 598 686 265 -499 -705 -177 564 745 38 -557
3780 -557 -855 -347 673 703 125 -463 -819 -404 439 783 261 -476 -739 -390 301 873 305 -402 -726 -250
3800 -250 509 787 275 -572 -790 -249 429 783 343 -541 -940 -217 392 653 427 -329 -721 -485 453 732
3820 732 302 -407 -847 -501 353 766 393 -354 -819 -371 554 828 319 -308 -876 -339 435 842 408 -517
3840 -517 -772 -274 136 764 445 -434 -758 -493 466 825 475 -271 -729 -515 390 675 588 -163 -854 -422
3860 -422 298 710 456 -398 -669 -318 105 790 417 -150 -702 -498 232 629 390 -198 -623 -445 332 791
3880 791 503 -269 -560 -294 279 542 358 -37 -440 -580 26 509 295 -52 -418 -392 19 493 445 -176 -449
3901 -449 -377 57 533 329 -265 -518 -416 -10 457 418 -198 -564 -280 -59 489 403 -131 -459 -362 -15 283
3922B83N8k68o12J23M98J32P0l30m57K10K89K26N2k95j39p6J95N76k42l07k82
3943b96k2K08M25K01n16k80N9L63m6L24m94j33qK88J42J49l38k37P2K06Q7j05
3965D9o8j35r6K14M40j92o9j91j00J01L16j37k17K2On8K22K7j9j64o3L9K21N0
3989A98o2k41o1J34o0J97l3q2n0O2k05K38J15k16k2K02j36j96K11J94l23J12R0
4012F6l1j9J02n1k08K01J16k35K12j45o7k6K18p8j01J99l30Q9J40R7l9j16j06
4035a12p7J11K04j04n5P2j66k12L39o1J77j67J08k43M4L06P7l20k6K1R0N4J29
4058A89q2k03j04J78K21L8k39l46J59J20J20L47k65m35q4L05K49J00j44l75P3
4079a78J16L99j93r1q6m40M52L06M0l58q3k75J72N22J89l84m53R5M4L35J76k19
$$ plain form
3922 283 341 73 -539 -416 82 214 284 -46 -503 -293 -4 222 274 -21 -160 -236 -41 535 293 -14 -296
3943 -296 -318 -110 315 516 0 -280 -221 142 96 420 -74 -207 -215 73 215 364 26 -211 -139 67 154 49
3965 49 -19 -154 -250 -36 404 212 143 -48 -148 -47 269 132 -85 -63 -57 -115 107 134 115 -49 -112 -73 148 198
3989 198 136 -105 -166 -32 -92 105 72 -10 -60 2 -203 35 150 -66 -88 114 -22 -218 -7 187 -136 -24 66
4012 66 35 16 118 67 -141 60 176 -59 153 8 -59 -85 133 55 -46 153 -177 -88 52 149 110 -6 -112
4035 -112 -189 -78 126 22 -33 39 -127 -339 0 -61 116 -51 57 -186 -142 164 241 -79 -105 -84 6 60 189
4058 189 107 -96 -200 -22 199 237 -2 -348 -189 -69 51 398 133 -302 -386 -81 168 268 124 -251 -178
4079 -178 -62 337 144 53 -33 -473 -21 285 325 -33 -116 -391 -219 303 492 108 -345 -250 -206 129 305 86
4101H6m28J52n7L04L33q4n96j21K81K73K08m4l58m84L56L50J99p3m51k43J69L26
4123I8M38l55k67m71K05N55J70k5n96k31K46L26L17Q7q38j44J46M78K74l5m90
4144a12m04J63L36N51j96m69m18L08L43J96O7m16n63Q1O71L39J21n38n48NN30
4165D7L88J50o12l59m0O59L37k54l81j92r4L55M77q6l68n24R6L97M35Q7o18k60
4187c60R8K12M05J94n73m00j6O17L00o6k30o13L2M53M43j32l48n13J41L89M45
4208D78jm70j96j77K04M90L0m26l54J3M65L55Nl18o15Q9M59L97l0n91l06J19L83
4231CL56r5j52n09m2K72N18lk40l71j33K80L55L8j14l74j86L68K96J03l29j28
4253h7k26L43K12J05l62k42j55K25L65J94k75l22j43L03J29L05k82l74q0M18J09
$$ plain form
4101 86 -342 -190 -247 57 390 306 -290 -411 -130 143 351 307 -51 -535 -179 171 370 297 -154 -397 -228 98
4123 98 536 181 -86 -557 -352 203 373 348 -248 -479 -233 93 410 497 -341 -485 -339 139 413 378 -112
4144 -112 -516 -353 -17 534 338 -131 -549 -241 102 298 365 -51 -614 -533 138 477 598 60 -488 -483 47
4165 47 435 585 -27 -386 -426 233 570 316 -65 -257 -351 4 481 395 27 -497 -401 -4 431 518 -100 -360
4187 -360 -262 -50 355 549 -24 -424 -440 177 477 411 181 -432 -400 53 496 364 16 -497 -356 33 478
4208 478 477 7 -189 -366 -162 328 358 -68 -422 -409 56 411 416 98 -517 -428 31 428 398 -193 -499 -380 3
4231 3 359 264 112 -397 -439 -167 351 348 108 -263 -396 -116 239 277 163 -211 -397 -29 267 370 41 -87
4253 -87 -313 30 242 347 -15 -257 -412 -187 178 372 97 -225 -368 -65 64 369 87 -287 -367 51 160
4274A60J9kk94o6M2N07r0j75l64j05Q6N05Q7k43l87N0K45J98J6l56K6j44K35R3
4298D3R2j7k74J1K06j15K61k93jj11R9K53j01K20l24j23K17N4J1r7J7o9L1p2J07
4323B5L5j11J4n1J3Q0L4K6m1j54N8J72q8mm8J37k59R9J65J2k08R1J3j13R2O2K4
4350G5j58m0J29l8K11k34q8J81L5p8L4J0k1j15J7k8K06r5j53J43k3N2j4K32j25
4375A15k05M5q2J39J51j43m1k05N1K63M8k56r0k3J69RK11r0j44j14j4K09N8K60
4399C21m70l4K6K78J31j27k37l8O3K70O8k2k70l7K2kK89J6k47k48J71O2K08j9
4423A74l12j17k0L34J09o2j54m8j7J93J83j05L9l37r6J65K08J15k48l75J77J16
4445g8L91j32j95k88l2M82J30o2k47k75J14M1M05j8p8m19q9J36J89K39k80k21
$$ plain form
4274 160 179 177 -117 -183 -141 366 276 101 -263 -368 -282 223 310 67 -320 -270 -25 173 189 -167 -141 -285 -50 43
4298 43 135 118 -156 -145 61 -54 207 -86 -87 -198 -99 154 53 273 -51 -174 43 97 108 11 28 -41 -10 -82 25
4323 25 60 -51 -37 -88 -75 5 39 65 24 -130 -72 100 12 8 -40 97 -162 -63 102 114 -94 -3 10 -103 -11 51 75
4350 75 -83 -123 6 -32 179 -55 -143 38 73 -5 29 39 18 -97 -80 -108 98 3 -150 -7 -30 22 8 240 115
4375 115 -90 -45 -127 12 163 20 -21 -226 -175 88 136 -120 -210 -233 -64 -55 156 66 -78 -192 -206 3 61 321
4399 321 -149 -183 -157 121 252 125 -112 -150 -87 183 251 229 -41 -78 -56 -58 231 247 0 -248 -77 -15 193 174
4423 174 -138 -255 -275 59 168 106 -48 -96 -113 80 263 158 197 -140 -236 -71 137 252 4 -371 -194 -78
4445 -78 313 181 -14 -302 -334 148 278 216 -31 -306 -192 -151 254 236 158 -261 -350 -214 -25 214 -66 -287
4467b87J65O0M8K31r9m22m9L61L14l3n1m53j34K37L11J30j21m22o1J77K54K71
4489D27l03k20l27K92L51J82l21k05j30J32K40M28l61m30p2L68Q1J35k98k47q2
4510c60J58L52J69q3l01j96Q0L47J79j85l60r4J01L22J41K9m30j12k0M61J44k64
4532G8j56j83K1M92J36l19k22q5J7L74J23p8l90k5L2L53R0k13k37o9J08L11P4
4555B32Pk88l11J6K68M47k95n7l36r1M35K45P8m97K3o8K54K26P7m19j60M4J16
4578e4K98Q8n14j9L2J97K05j19j16k19J09K07O6Q8l48j47j8L27J65j23o3l60J2
4601c06K68L36p9k98n0j47K08J35P6j47j01j36M29O9k14ok24J18J09J34j27P2
4623A19k87J31RK16j08N2l36N2J46L6J10j74n7j12K11Q9Pj61rR5j11J88J40k40
$$ plain form
4467 -287 -122 -62 -14 217 118 -304 -353 8 322 289 238 -215 -349 -112 199 329 208 -214 -275 -98 156 427
4489 427 124 -96 -423 -131 220 402 81 -124 -254 -122 118 546 185 -245 -317 51 132 267 -31 -278 -360
4510 -360 -202 150 319 236 -65 -261 -181 166 345 160 -200 -294 -193 129 270 299 -131 -243 -263 198 342 78
4532 78 -78 -261 -240 252 388 69 -153 -238 -221 153 276 198 -192 -217 -185 168 258 45 -192 -261 -153 158 232
4555 232 239 -49 -360 -344 -76 371 76 19 -317 -408 27 272 350 -147 -124 -192 62 288 365 -54 -214 -170 -54
4578 -54 244 332 -182 -201 -169 28 233 114 -2 -221 -112 95 161 249 -99 -246 -264 63 228 105 42 -318 -306
4601 -306 -38 298 219 -79 -129 -276 -68 67 143 -4 -105 -241 188 257 43 37 -187 -69 40 174 47 119
4623 119 -168 -37 -28 188 80 132 -204 -152 -6 30 140 -34 -91 -203 8 97 104 -57 -66 29 -82 106 246 6
4647Fj65j6N6J39K20k63K2j57K17Q3Jk07l3O7Mk3J05K8j93O9l8J31m4k4Q7j7p9
4674b4rQ3k73J88L5M4n2j58K25Kj2L5j78j4J05q3J80j60J16j01O5KK9J5o5r2P1
4701b6j4J21N1j71j27Q6K16j01R2j20r6J72j12P3J10j62p9M4K42o5k4q9q7P4M2
4726E0K9j7j47j22K13n6J85k17J35j54Q3j7Q3p1J4p0M4L09p1j11j38j8q7K67L2
4751A48j75n3p6OK19P5j95O0j58K47N7k4kj87l5R2l0J50L1q5k72K04O8PJ6n8r5
4778f5n1J28J66n6k45j16L5J49L48j26k81r1K5L19J14j90k27j13N8K68J23l1k28
4801h7j75K70j01K91o8k03r5LJ70mP4j00k35K13N9J84j26j04p5O4P3J4J43j59
4825B6j04m8K11R9Jk07r0NJ83R5n7l3l57N2L90J02k0k50j65q4L78J95k04k07j01
$$ plain form
4647 6 -159 -175 -119 20 240 -23 -1 -158 59 142 143 -64 -97 -30 -26 -49 56 84 -109 -40 -78 53 9 -15 72 55 -24
4674 -24 -33 50 -223 -35 0 44 -8 -166 59 61 49 84 -94 -108 -3 -86 94 -66 50 -51 14 16 45 60 -5 -97 -26
4701 -26 -40 81 132 -39 -166 -80 136 35 127 7 -89 83 -29 44 154 -8 -87 -43 199 134 110 21 -66 8 50
4726 50 79 62 -85 -207 6 -50 135 -82 53 -101 -18 -35 48 -23 -9 -79 -35 274 203 92 -46 -64 -151 116 148
4751 148 -27 -80 -156 -150 69 144 -51 9 -149 98 155 131 129 -58 -93 -1 -31 119 150 65 -207 -3 65 72 88 30 -65
4778 -65 -116 12 178 122 -123 -239 -204 -55 293 167 -114 -205 -180 139 253 63 -164 -277 -219 49 172 141 -87
4801 -87 -262 8 -93 198 130 -73 -168 -165 5 1 75 -25 -260 -47 12 196 70 -34 -109 -45 28 42 185 26
4825 26 -78 -126 85 184 185 -22 -112 -107 76 171 114 81 -276 -224 166 268 248 -2 -167 -251 127 322 118 -89 -190
4850a90OJ25R3J35j30l02O1K23J78M2j89k31L3J22L02j17j41j68N6LK85p2n4j89
4874a19j35J11K78J51j55j86l08L22J96O0j63k53n3J46J25O1l1r0j13J46J90J33
4896C13l23q7pM5K66Nj57k62k00L12L54k21J69k57k20K43k3R3j77Q3l8NK53j9
4920A50jl53p3J47K01N1M9j48k22J78oK70k01K5j35J95k07J09N8j40q8QK30m3
4944E4m1j01o0N2P9K61j67k14r7P5K85j82M9K4p6N8J73j4j11j8j61Q2N5RN8n6
4970A6m5k30L51m7L1j53J23j88J05J21n8j63j86K42J38J47n0k39L5L6J79p1j45
4993e1P5L4n9J51Jj42j96J59l1L08j69j41L5L2Q4q1K9k9M5p9L9J24j45J16r8n4
5019d3j39L48j87J1J7j24J92l4O9q4k7l6R6j84P4j9OQ7M9q2J66n3j46n6K70k21
$$ plain form
4850 -190 -184 -59 34 169 39 -263 -202 21 199 241 52 -179 -146 -24 278 161 20 -148 -92 -89 196 124 70 -119
4874 -119 -254 -143 135 286 131 -55 -363 -41 155 215 52 -201 -254 -108 17 78 47 -43 -156 -10 180 313
4896 313 -10 -97 -104 -59 207 212 55 -207 -407 -95 259 38 207 -50 -270 -27 -50 43 -134 -51 -89 -84 169 150
4920 150 149 -204 -277 -130 71 122 171 23 -199 -21 -27 243 42 67 -68 127 -80 29 87 -53 -141 -133 97 54
4944 54 13 -88 -148 -96 -17 244 77 -137 -234 -159 126 -56 -7 17 -59 -1 172 158 47 29 -132 -50 5 14 72 16
4970 16 -29 -259 92 45 76 -77 46 -142 -37 84 26 -137 -323 -81 57 204 154 -85 -50 -14 165 94 -51
4993 -51 24 58 -1 150 151 9 -187 -28 -59 249 80 -61 -26 6 90 9 38 9 54 -25 14 138 -7 109 11 -43
5019 -43 -182 166 -21 -10 7 -117 75 41 110 26 -1 -37 59 -125 -51 -70 -64 23 72 -10 156 103 -43 -99 171 -50
5045e0P2r0J43j15P7oj03m9J60J04k10K46k30k4O0K6N4j66m7J03n1O9m5K67k16
5070b1jN3nR5N6l54J58M3J8q4mJ6M4k9K5O3k7j13L5P0p3R5j24q0J86j03K15O9
5098B23o7j08j73K8j5K53j11j18n5J10%J8N0j46R2m4K11R9l01P4j28J31j23L72
5122B72r2m37R7J61J90r1n0k36O8J25PPJ36l79j00K20K75J18l48q0Rl3K29J20
5146A88j00j56j03J07J31Q4m1j91j29R7J85n8P6l68J53q8K65L1p8j41n0p6L12
5169E0L11j79j01k11l2J64M72m05k34J23j01J34L07j00j90k72K9L83L0Nj55k41
5191b13J86K09k9p4k36j85J99R1K26l2j78j43J0K50M32m66j3k47L8Q0L42r7l16
5214a66j13J85Q8J99K1k59k03k5K40J58J48j30j89p8J80N8N6j75j10K7O9K03p8
$$ plain form
5045 -50 22 -68 75 -40 37 31 -72 -121 39 143 -67 179 -51 -75 -15 11 65 -101 -148 -45 -96 -27 -72 195 -21
5070 -21 -22 31 26 121 177 -177 -19 24 42 -42 -46 -30 14 -15 10 73 46 -67 -32 38 -35 60 -64 -144 42 -61 154 223
5098 223 156 48 -125 -97 -112 141 30 -88 -143 -33 -33 -15 35 -111 -19 -63 148 247 -54 20 -108 23 -100 272
5122 272 180 -257 -160 1 191 100 50 -186 -118 7 14 21 157 -222 -322 -102 173 291 -57 -137 -128 -161 68 188
5146 188 88 -68 -171 -64 67 151 110 -81 -210 -113 72 14 90 -278 -125 -213 52 83 5 -136 -186 -262 50
5169 50 361 182 81 -130 -162 2 474 69 -165 -42 -143 -9 298 198 8 -264 -235 148 178 183 28 -213
5191 -213 -27 182 153 79 -157 -342 -143 -52 174 142 -36 -179 -169 81 513 47 34 -213 -175 -95 247 150 -166
5214 -166 -279 -94 -6 193 214 -45 -248 -273 -33 125 273 143 -46 -124 56 114 170 -5 -115 -88 -19 184 106
5237A06j53j31j2J94Q8K23k51k30R9j14M77m7k15l33r9L76L53l1k39k69J63K05
5259A60J09j31j02k49l9L91j48L01j71l19K8K16K49j29r3k97qJ63K37j94M2j13
5281i7q9J80Q2k6m9k45K67k6J46o3l6j27L4L6R3P4l3k36k43K89K39o5Mk13qJ49
5307C7j8J34j87o7NK02J5O2k98K1K0k9K24J59k43l9j65K02J49j13k05J96l0l42
5331c10K94J18o8oj32Q1J09j9K0n7m5J0Q9nQ4k46l9J58j62K23l3mr4O1m0Q4j39
5358f8k7m6J34N4Mj73J71QR4k6P4j38k3k0K5L9j31M8Qj53K09K3Oj62km3J67k81
5386b29K22j05K32n1N0p3j31K3J0J99p9m8j12J61R2j51O7K5j30o6j3J33m1J1Q
5411DR0k59J57M0n6n7J18o5L8K01j23j52j29N3L66j27l7p1K2j15J22P0j43k8J0
$$ plain form
5237 106 -47 -178 -190 4 92 315 64 -166 -67 -181 296 249 34 -299 -398 -22 331 300 61 -208 -45 160
5259 160 269 138 36 -213 -252 139 -9 292 121 -198 -170 46 295 166 73 -224 -232 -69 168 -26 16 -97
5281 -97 -186 -6 76 50 1 -244 23 -3 143 80 44 -83 -49 -13 80 154 121 -115 -358 -69 170 105 109 -104 -112 37
5307 37 19 153 -34 -101 -96 106 121 183 -115 -94 -74 -103 121 280 37 -2 -167 35 184 71 -134 62 32 -310
5331 -310 -16 102 34 28 -104 -23 86 67 87 30 -15 -5 84 79 163 -83 -122 36 -126 97 64 60 -34 27 -13 71 -68
5358 -68 -95 -141 -7 47 51 -122 49 57 151 125 199 61 38 18 43 82 -49 -1 7 -146 63 86 92 -70 -72 -115 52 -229
5386 -229 -7 -112 120 69 119 46 -85 -62 -52 147 68 20 -92 69 161 10 77 102 -28 -94 -107 26 -15 -4 4
5411 4 94 -165 -8 32 -24 -81 37 -28 10 211 88 -64 -193 -140 226 99 62 -9 13 -102 20 90 -53 -81 -71
5436g1J50p8j9N6p2J19r7J4m8N0j17JJ18K90k56J4k44J32J49j65K42r2k13JJ94
5461E8j5J82j57k26l6N7J99J79l79L7r0L26NJ15k16l9j45k4J21J72n0j05j92Q8
5485a35L41j69Kj70m4J09J97j9M4k42j21L39R8j75J09j36o7k7R0M7M9j47k14J43
5509i8J15Q0K2k34j3J42J10J26j06j61j81K51J38q1k6j35j67mK97k2Rj11j10R9
5533f0m8K43m4q6k52R2L17m0j55j41Q0j12K63K93k06k57j64K36K9K81l15j05K2
5556a29KL99j02K7j68l21K79J00p2k7P5j88l3J92K23k16k60O6R4J4L23l04k56
5579b82J71L4J73Okk36mJ31p8L68k09k05j24J20J49J46J2j12j22j1J38M5J4k36
5603a14PK5P6J70m0m4j95l8K56rm1q3J0k35K86K31k72L8j49o5J14L32j14k36l2
$$ plain form
5436 -71 79 1 -18 38 -34 85 -12 2 -46 4 -113 -112 6 296 40 54 -190 -58 91 -74 168 76 -137 -136 58
5461 58 43 225 68 -158 -194 -137 62 241 -138 -101 -191 135 140 255 39 0 -145 -169 -48 124 74 -31 -223 -135
5485 -135 206 37 39 -131 -175 -66 131 112 156 -86 -207 132 230 55 164 28 -39 -66 24 71 120 -27 -241 -98
5509 -98 17 97 119 -115 -128 14 124 250 144 -17 -198 53 191 110 84 -51 -218 -222 75 53 62 -49 -159 -60
5533 -60 -108 135 91 5 -247 -155 162 122 -33 -174 -94 -206 57 350 144 -113 -277 -41 -12 269 -46 -151 -129
5556 -129 -127 272 170 197 29 -292 -13 87 15 -12 63 -125 -158 34 257 41 -219 -153 -59 -45 278 -26 -282
5579 -282 -111 -77 96 102 100 -136 -140 -9 -87 281 72 -133 -257 -137 12 158 170 58 -64 -75 63 108 122 -114
5603 -114 -107 -82 -6 164 124 80 -115 -153 103 94 53 -30 -20 -255 31 262 -10 28 -121 -186 -72 260 146 -90 -122
5628a22oK61m9J49m53L5o3L66J8Q6j44m2j6K19L0k53j6j43J03l7K26M5j41o6l0
5653d3M0J03k0r9j08R6J95j23j9k8p9O3J5o4K7Np6J4P7J41l8j17J13j79J09O8
5679G3R8j53j56r4K47%p7j14J89j19kP3J72k15K52l67J29P8j15q7n4J87J53j28
5703c0l6%M2j00R5j3K6r3p3J55mJ29j94N1R5j48J45k9M2P8j86J19j9o1n0R9k9
5730A1O7j18j37P4J43Q9J28j36j96J21j42J08K6j32K13k37o0L4J60j17k2o5J99
5753A1M1Q9k18P8NJ27r5J22j06j89J05N0Q0RN9j29m9m9N7M6j04j7l8R8J58J7l37
5780a79J90lM9l0J16L0j70j97K13m7rJ90j58n9J6K42j58p3n9O0q9J37K05n8l04
5805a45j30J41J13J87k52LQ1m1K79J12k82k10J79j63K99n6l7j74j76M14n0N8j04
$$ plain form
5628 -122 -128 133 84 233 -220 -185 -248 118 136 222 78 36 20 239 269 16 0 -143 -40 -77 149 194 53 -13 -43
5653 -43 -3 100 80 -19 -127 -31 164 41 22 -6 -85 -22 -7 -71 -44 -39 -115 -101 -24 117 79 -38 75 -104 5 73
5679 73 171 18 -138 -232 15 15 -62 -176 13 -106 -108 -35 137 -78 174 -193 -64 14 -101 -188 -242 -55 98 -30
5703 -30 -66 -66 -24 -124 -29 -42 -16 -109 -182 -27 -31 98 -96 -45 50 -98 47 18 60 138 -48 71 52 -9 -59 40 11
5730 11 78 -40 -177 -103 40 129 257 121 -75 46 -96 12 38 -94 119 -118 -178 -144 16 -101 -123 -188 11
5753 11 52 141 -77 1 6 133 38 160 54 -135 -30 20 100 109 168 39 -10 -59 -2 44 -60 -77 -115 -17 141 158 -179
5780 -179 11 8 57 27 143 173 3 -194 19 -28 -37 153 -5 -64 -48 194 36 -37 -96 -36 -125 12 217 159 -145
5805 -145 -275 -134 -21 166 -86 -83 -2 -43 236 348 66 -144 35 -128 171 115 78 -96 -272 142 92 150 46
5828D6k71k3K17J21J32j57j03q2J1K38R5k12j19n7NL1J46kj02j50J17L04j19j24
5852e8l6Jk02K42K47j67O6j69Q6J80n7j14j17n3N5J52m2J28k26p4J91j69K25l6
5876E3j70j10J66J12J10K3k16j30Q8K8J64m6q3j44J51J7O5p4j42nJ10l4N1M1M2
5901F7j60L5M9J22K41l61j55J53n2J45J5k0k94J58J18J81q8j93j91J83jK76k1
5924B07j34j99N6J59J40l4k14j28J02m7N2K54l67N9j4J26J51m2k84J19MRK22q6
5948A11j61j26M5R6J39Q0k85K7O1q7K75j07j61P4k70L74RP2j98k1j2K2J23o6%
5973A4j88K7J53J7K74k83j25PJ46J54j59nL8j47J86J8M8j46k00J9K28Rj15Q6k23
5998a67J13J77j76P4j53l1J17LJ29q1K6j12J13o4p0K02j43k5O0K6M6j3l4j83J12
$$ plain form
5828 46 -225 -248 -31 90 222 65 -38 -120 -109 129 224 12 -107 -164 -159 -128 18 16 -86 -236 -119 185 66 -58
5852 -58 -94 -93 -295 -53 194 27 93 -76 10 190 133 19 -98 -151 -96 56 14 142 -84 -158 33 -136 89 53
5876 53 -117 -227 -61 51 161 184 -32 -162 -74 -46 118 72 -11 -155 -4 13 78 4 -138 -143 -33 -67 -16 25 67
5901 67 -93 -58 -9 113 354 -7 -162 -9 -61 84 99 79 -215 -57 61 242 154 -39 -230 -47 -48 228 207
5924 207 73 -126 -70 89 229 195 -19 -147 -45 -92 -40 214 -153 -94 -108 18 169 127 -157 -38 -34 -25 197 111
5948 111 -50 -176 -131 -35 104 184 -101 -74 -13 -100 175 68 -93 -19 -289 85 94 166 -32 -53 -65 -43 80 14 14
5973 14 -174 -147 6 23 297 14 -111 -104 42 196 37 32 70 -77 109 127 175 29 -171 -152 76 85 -30 56 -167
5998 -167 -54 123 -53 21 -132 -163 -46 -43 86 5 31 -81 32 -32 -102 100 -43 -68 -8 18 64 51 17 -166 -54
6023e4J33PJ47k69p6J11K4K0n6K5j08K23j61J05qj03M6o2j13J17L6j37J23J29
6047I9J10j52l6Pm4J42j44Lk5K3j70K29N1P3k71K0J22j2M3k6j25P9m0J07l4R8
6073A27j58L6o8q1J67J4p9p9Q5J91j32l4r2q5K27k1o5%j31K65k28K07k6jk59K47
6099B7k3L1J00j93l0J5J43n6R9j53J0k0L4K4J23j45j76J11J68R5j63P1k98O0J13
6124c3K82k36K7p5j27N5J46j25jj24J54J86k3J19j60j38K4k2j0J96j31k08J72
6147e2R8K3J43l27k49L10Q3KP5j85n3J99Q0Rn3l58J48J57q8Q3j17J02j00p9K97
6172A48M7nk54j70L13j23K18r1l9k58J99P7J9j11n8Ql4M6Q7J10r4r6j2K79r1M1
6198A56j25r9j10J57K42j11o7k93K51r5L43k26J15k28P0K8LK14j90j29J98j21
$$ plain form
6023 -54 79 86 233 -36 -112 -1 23 43 -13 12 -96 127 -34 71 63 -40 6 -56 -169 -52 -16 -153 -30 99
6047 99 209 57 21 28 -16 126 -18 -15 -40 -17 -187 42 93 166 -105 -85 37 25 68 42 -83 -4 -44 63 29 127
6073 127 -31 5 -63 -144 23 37 -42 -121 -36 155 23 -11 -103 -188 39 18 -47 -47 -178 87 -141 66 40 39 -220 27
6099 27 4 35 135 -58 -88 -73 70 14 113 -40 -30 -50 -16 8 131 -14 -190 -79 89 184 21 92 -206 -146 -33
6124 -33 249 13 40 -35 -162 -107 39 -86 -87 -211 -57 129 106 225 65 -73 -49 -71 -81 115 -16 -224 -52
6147 -52 46 69 212 -115 -364 -54 29 31 106 -79 -132 67 147 156 103 -255 -107 50 -38 45 -72 30 -70 -149 148
6172 148 195 190 -64 -234 79 -44 174 83 44 -214 -15 62 81 -30 -88 -80 -114 -68 19 129 35 -61 -73 206 115 156
6198 156 31 -68 -178 -21 221 110 43 -250 1 -94 249 23 138 -90 -20 8 11 225 35 -94 104 -17
6220a7J70L9k59j16J7m3J12K89M9j61j70O9J21j0j68N2j30R8Q8K20o3l17J35j5
6244a0N1m1n7qR4k3L25k01j88L5j05j4N4J05j01j8O5j6q1J51p3K10l62K09j14
6269a13L11p2k51N6K6O3Kj13K02j79O4J48r5NRq8n5J25J56Q8k18k78L18r0J14
6294A35o4j53p5J77L6j7q3J9l3%J87q5p4J17j35lJ0J11J00j54j60J19l9P7j3j24
6320a24K09l10K22O2kj00N9rK1J71k17L6j55J18n0L35k07Rlj9j84K90k44L0m8
6345a10j19K86mk20J60n9M6N2J4j44k4R6J02j28%l1J23p3l7N8q5J55j54m1J36
6370aO9j45K31j52P1l9k5M3j28J04r6j05J96n4j76K8k9K01l0K1Qj03M9O9oQ9j18
6397b8L6O5N7j21q8j38N1l2L72k9n4k0j6L6p1o3Q2k2j45L46k26%j19J6L11j62
$$ plain form
6220 -17 153 192 -67 -183 -166 -209 -97 192 241 80 -90 -21 100 90 -78 -26 -156 -58 30 250 187 -130 5 -10
6244 -10 41 0 -57 -65 29 6 331 130 -58 -23 -128 -142 -88 17 -84 -102 -37 -53 -134 17 -56 154 -208 1 -113
6269 -113 198 126 -125 -69 -43 20 22 -91 111 -68 -4 144 49 54 63 -25 -80 45 201 289 71 -207 111 21 135
6294 135 71 -82 -157 20 56 39 -44 -25 -58 -58 129 44 -30 87 -48 -51 -41 70 170 16 -144 -25 -64 13 0 -124
6320 -124 85 -225 -3 59 57 -43 16 7 28 199 -18 18 -137 -19 -69 266 59 68 65 46 -138 152 -92 -62 -110
6345 -110 -229 57 53 -167 -7 -66 -20 32 46 -98 -122 -26 76 -52 -52 -83 40 -33 -70 -12 -97 58 -96 -137 -1
6370 -1 68 -77 154 2 73 34 9 52 -76 28 -68 -173 23 -31 -207 -179 -208 -7 -37 -16 -8 -111 -62 7 1 90 -28
6397 -28 8 73 130 9 -79 -217 -166 -198 174 145 91 71 55 91 20 -43 39 17 -128 218 -8 -8 -127 -111 200 38
6423C8J10j96ro9J76L6M4j75n5J15N4k15J15J67j23q1J60N0l0j16j6J20r7j2N1
6448D2o7P2j53k5J84%l4q0kP3k1J20P9j97j90K58o3L6P2j44k0m6J87j28L3N8j92
6475a48Q8R8J1J7o8l7M8K22j93j32J2n0J45j24J37L4j86r0L2L29L5k48J80k06
6499i4O4O6J02k39O5j27J34K5K53k00j89J85q5P1j67J85k69J33J0K30j32J01k29
6522a07q2J45j3R5k7j29p5J94P6Rj48K37l30J99k38K65J42l60J55O9M2Q3j79N4
6546G7j58PR0J4k5j81J52j54N8L34j1k7k34L2m9K01k7j65nj14K03J0k03J55J22
6571A02j11m9J78j26r7R0M8oN2j03K41k35J15M1n9l2j06K9P5k07J74J03k90K90
6595A17j06%J07j37J2K7n3J33J05j19j34K9n5O9Pn3N2j47K04R0o9j40q0J38R6
$$ plain form
6423 38 148 -48 -57 -126 50 86 130 -45 -100 15 69 -146 -31 136 13 -68 92 142 112 -4 -20 100 3 -9 42
6448 42 -25 47 -106 -131 53 53 19 -61 -63 10 -11 109 188 -9 -199 59 -4 32 104 -40 -60 -106 81 -47 -14 44 -148
6475 -148 -60 38 49 66 -2 -39 9 231 38 -94 -82 -132 13 -111 26 60 -126 -216 -184 145 180 -68 112 -94
6499 -94 -30 36 138 -101 -36 -163 -29 -4 249 49 -140 45 -40 31 -136 49 -220 -87 -77 153 21 122 -107
6522 -107 -189 -44 -57 38 11 -118 -193 1 77 86 -62 175 -155 44 -194 71 213 -147 8 77 119 202 23 77
6546 77 -81 -74 16 30 5 -176 -24 -178 -120 214 203 176 -58 -26 -75 126 99 -66 -71 -185 18 28 -175 -20 102
6571 102 -9 -58 120 -6 -103 -13 35 29 81 -22 219 -16 99 140 81 49 -57 -28 47 -160 14 117 -173 117
6595 117 11 11 118 -19 -7 20 -33 100 205 86 -48 -19 -74 -5 2 -51 1 -146 58 148 79 -61 -141 -3 93
6620I3j32J30K6L0k51n1M04k66j2m6J2M7L4mM8j65O1j4n7K46r0q7nk5K0J86j35
6647cLm9mJ13J9p7r1P2r8J4J06n5R1j96l4K44rl7OK01k11n2k3J68j58N8m1k61
6675c04K60J63k43N7N9l0O5K2m3k15L17O9k36Oq7Q6J10R7k35n3O2J13j24P1Q2
6700F9r1L9k07M02k33n6J34p0P6N9k47K52m4j5j80K66j87nl4J09l4J16j94J67
6724I2j52J29r8J86k13J52m1j34K31Qj13j54J45m6M6j22J83k40K03k04K90r5N9
6747A12j88J6j07K55m4p4R4q7NJ18P5j03J09j93Nj30K56l9j62J13j46J46n3P2
6771E0J34k42NP2J03q7J6Pj65J37N9j26J06J2j36M4l7J81j44j88P0K13NNJn3k
6798D0RR0J0j18Q1k00P0R7o8Q7j35k1K09j10j3j79J5j07K02J01n1J18j79j09J21
$$ plain form
6620 93 -39 91 117 147 -104 -155 249 -17 -29 -75 -63 -16 18 14 62 -103 -42 -56 -113 133 43 -44 -49 -74 -54 132 -3
6647 -3 0 -49 -53 60 79 2 -89 -17 -115 -101 5 -50 41 -155 -189 55 46 9 15 216 5 -47 -70 98 -60 -2 -43 -304
6675 -304 -44 119 -124 -67 -8 -38 27 49 6 -209 108 177 -59 -53 -140 -54 56 153 -82 -135 -73 40 -84 -13 69
6700 69 -22 17 -190 212 -21 -77 57 -13 63 122 -125 127 83 68 -112 154 -33 -38 -72 37 3 119 -75 92
6724 92 -60 69 -29 157 -56 96 55 -79 152 160 47 -107 38 -8 38 -84 99 -141 62 -142 148 53 112
6747 112 -76 -60 -167 88 44 -30 64 -23 -18 100 175 72 181 -12 -7 -137 119 80 -82 31 -115 31 -22 50
6771 50 184 -58 -53 19 122 35 51 58 -107 30 89 -37 69 81 -55 -11 -48 133 -11 -199 -129 84 89 94 95 42 40
6798 40 49 139 149 31 112 -88 -18 79 11 98 -37 -58 151 41 28 -151 -136 -243 -41 60 9 127 -52 -161 -40
6823d0P6J55k2l67R0J05M2o4J5Lr0K51j11J20j84j5j74J36J32K2l0j65k0O6J99
6848A30%j28o7P8Q3M3j16N0k24p6K33L0O6j77N5j26J36O1J2Llj45J8K56k58J10
6874D4Jl7l4J88j34P7k76p5J59J38j1j08j0j05J13J69p4M9q2j11J97K4j26N5j15
6899h4r5R5J04j37J54j45M5K44j35O4j16R5k43K28j13Q6Q9j23j70J00J65q2J49
6922A75p5k05K76o5r8p3qK1m6K22J01l34O3q5K8J19K7r0K4l3J32O8j56q4l9K19
6948H4P8j31o1Mo6Q9q2j1J76qk50K2K90J0o0j18L3M9p5J28j82J69n2q5L0K30j61
6975E0j94O2K0m9L4K0J30o4r9J50K8m0n6P8l4m3K4J9j05J97j23nO6j03J82l23
7001a78K9J74j56Q5J01j36J22L7r5J26j4O3k53k2R1k8k8P6q9J1J12q8P2r3L5P5
$$ plain form
6823 -40 36 191 169 -198 -108 -3 39 -25 -10 -7 -97 154 43 163 -21 -36 -210 -74 58 80 50 -115 -135 -69 130
6848 130 130 2 -65 13 96 139 23 73 -151 -227 6 36 102 -75 -20 -146 -10 51 63 66 63 -82 -64 192 -66 44
6874 44 45 8 -26 162 28 105 -171 -246 -87 51 40 -68 -78 -183 -70 99 25 74 -8 -119 78 102 -24 31 -84
6899 -84 -179 -84 20 -117 37 -108 -63 181 46 110 -6 89 -154 74 -39 47 136 13 -157 -57 108 26 175
6922 175 100 -105 171 106 8 -65 -73 -52 -98 124 225 -109 -46 -131 -103 16 43 -47 -23 -56 76 144 -12 -96 -135 84
6948 84 162 31 -30 -26 -92 -3 -85 -96 80 72 -178 -156 134 144 84 -34 -1 48 -27 101 -81 88 36 -49 -19 211 50
6975 50 -144 -82 -62 -111 -77 -57 73 9 -90 60 88 48 -8 70 36 -7 17 36 -69 128 5 0 66 -37 145 -178
7001 -178 -149 25 -131 -46 55 -81 41 78 -17 109 95 158 -95 -117 -26 -54 -82 -6 -95 -84 28 -60 12 -81 -46 29
7027B9pL1P0j58L3J66k46k6L3P0k1Q5o1K5j44J43J92l60M0Q1Kj9M7p3J16j35P4
7054a3M7j1P3l1on3k3j18J82rML1j82K5N7J20K7k47P6%NrR5O9j80M8kN9j7j1Q
7085A4p9q8K19K3M6k65J2K17q2j02J16j05Q4nM0k07n1K15L0J2%O6j62l6J27p9
7111d0J00R6q6k8lj22J00j21J70q8q3J34J44j61j83pO0J09J5M0j29mp4L08o1l
7137H3j04k04K44L2K0q2J60j24M0mj46K38j33o5J98j20J48j35n8j46J30MJ83k69
7161a10J91k50J54l9K11k67J43j00p2O7J82l63J91K9P7L8j64O1j0k7m5L08j18
7184H7j27Q5j60J85J15j37j43m1K10p0j33K30r9k3r7J82r3N7O9j76K62k39J73
7207A17p2j10J66k39J68q4R0k3j68J07K09l33J11K18k07M5n1K00j86R2M8k14K23
$$ plain form
7027 29 22 53 123 -35 -2 164 -82 -108 -75 -5 -26 59 -2 23 -121 22 214 -146 -106 -25 -23 -42 5 -68 48 -87 -13
7054 -13 34 23 96 65 59 6 -17 -135 47 38 42 73 -109 -84 -27 93 120 -127 -51 -51 -46 -55 40 109 -71 -23 -25 34 17 6 14
7085 14 -65 -153 66 89 135 -130 -118 99 17 -85 31 -74 10 5 45 -162 -213 2 32 44 44 110 -52 -88 39 -40
7111 -40 60 156 70 42 39 -83 17 -104 66 -22 -105 29 173 12 -171 -178 -118 -9 6 46 -83 -87 -161 147 86 83
7137 83 -21 -225 19 51 71 -11 149 25 65 61 -85 153 20 -45 153 33 181 46 -12 -158 -28 -24 159 -110
7161 -110 81 -169 -15 -54 157 -110 33 -67 -139 -72 110 -253 -62 -33 44 82 -82 -21 -31 -58 -103 205 87
7184 87 -40 45 -115 70 185 48 -95 -136 74 4 -129 101 2 -21 -118 64 -29 28 97 -79 183 -56 117
7207 117 45 -65 101 -138 30 -54 36 13 -155 -48 161 -172 -61 157 -50 -5 -56 144 -42 50 98 -116 107
7230A07l7N8l6k30K11j12Q5J00p8j72J07p7L7K00l12J21p8J60k58Q1P3N4Om7l3
7255g0N8M0o9j45J13J75k46nL0Q9O6L9P1Jn5j61O0K44j43j56o7J42K07q8p2Q3
7281A41k5p0k01KK13M5j79O4l7j00L62k77L0j75J28K7M4R9m8o5m8R2%J43k43L00
7307B22j45r4R9%j78J11j68R9M7j27J83J3p4j21L13j56Q8p8r8kN7J8N9O2ql59
7333b37K46p6j15L24j20j41P2J7j9J1j24J1J36l3P6O2R5j88J2j5J73k12o0R2j04
7358a17J48M8j04J08k62N6K1K16M0j43n6ML2K07j80l2o5J8k0j1O9P5j11m3K67
7383A65k72J55J79j91k9J20m4J10l26L9J78j13M4J28m8k18M7K22qk18K50j19J5
7406F6j24N3l1P3%Q5j60J05J30j20O8j38J0j0q2J96j08M2n7j69L05j76J0j08k5
$$ plain form
7230 107 70 128 92 -138 73 -39 46 146 68 -104 3 -74 -37 163 -149 -28 -106 54 -204 -123 -50 4 10 -37 -70
7255 -70 -12 28 -41 -186 -73 102 -144 -149 -119 -30 36 75 146 147 92 -69 -9 235 92 -64 -131 11 218 130 58 141
7281 141 116 46 -155 -153 60 105 -74 -10 -47 -147 215 -62 -32 -207 -79 -52 -8 91 43 -22 -70 22 22 165 -78 222
7307 222 77 -17 82 82 -96 15 -153 -54 -7 -134 49 62 -12 -133 180 24 112 34 -64 -66 -9 9 68 130 122 -237
7333 -237 9 -67 -182 142 22 -119 -47 -30 -49 -38 -162 -151 -15 -48 28 90 185 -3 9 -6 167 -45 -105 -13 -117
7358 -117 31 79 -25 83 -179 -123 -102 114 154 11 -45 -41 -9 198 18 -14 -79 -61 -81 -92 -23 52 -59 -102 165
7383 165 -107 48 227 36 7 127 83 193 -133 -94 84 -29 15 143 95 -123 -76 146 138 -80 170 51 66
7406 66 -58 -5 -36 37 37 122 -38 67 197 77 145 7 17 7 -75 121 13 55 -2 -171 134 -42 -32 -140 -165
7431a65K86p9j3j8Q6M6k10J74M0j89K31k27KL6R0j4n2n0k3oj11p2Q8J56l4N2l4
7458a0M0Q2o8J7qO9j76J70j50Pj4J15j64N4K2J23j03J66k17J91N7r3J7j26l1o0
7484i0J24J5J23k10P4J4j22q8J93L6Qj49J14j66R9Q3L3p7J06j10O9L7j37l2p6
7509a29J55j05K32k62LJ87j72L5J22n0m0O9j47J54j14J07O4j77K1J43k03K71j39
7532B5j61J86K57j36j40j68K5L2P0OJ2M5k55L02j18L6J53k47J0P0oq4j48K52O5
7557H3j47Q0O8Q2j44j07K09j38J51j12j54L08q7p1L8J15j25j03J14j58J95q4j4
7580am8J04m2n9L3M4j13K6n1M7J44j12j5Q7k22J08J45j22k2j00P9Q0J44k40K50
7605A44j11j79K28k9n1p8K65k57J48K9j93K40r2J1J79r5j79N7j18M7K03j08N9
$$ plain form
7431 -165 121 42 29 11 97 143 -67 107 147 -42 189 -38 -36 0 90 76 24 -26 -49 -55 -166 -238 -150 6 -28 24 -10
7458 -10 30 112 44 61 53 122 -54 116 -34 -27 -41 74 -90 -36 -14 109 6 172 -45 146 203 110 127 1 -30 -90
7484 -90 34 49 172 -38 36 50 -72 -160 33 69 77 -72 42 -124 -25 58 91 14 120 10 79 116 -21 -53 -129
7509 -129 26 -79 153 -109 -106 81 -91 -56 66 16 -24 45 -102 52 -62 45 109 -68 -47 96 -107 164 25
7532 25 -136 50 307 171 31 -137 -112 -80 -10 -4 8 53 -202 100 -18 18 171 -76 -66 4 -2 -86 -234 18 83
7557 83 -64 16 84 166 22 -85 124 -14 137 25 -129 179 92 21 59 174 49 -54 60 -98 97 13 -1
7580 -1 -49 55 13 -46 -13 31 -82 -56 -107 -60 84 -28 -43 44 -178 -70 75 -47 -69 -169 -90 -10 134 -106 144
7605 144 33 -146 82 53 2 -76 189 -68 80 109 -84 156 64 75 254 159 -20 37 -81 -34 169 61 120
7628A20j18p6J29n1K0L3J05k81M5J35j84lJ03N9j03J42Nm7P6k12R7P3p9Q3p4M4
7654D1M5j36M8O2O2p3Lq4M7K03j97P4J8k07J19l3N3J21l02p8L06j98N3J10qQ3
7680A32o9L8n1l7l1j21J32L5m4r8R2J48r1R6j36J99k22j40J06J55Mk7J09o5q1
7705C3P5k73P5P0m3J23l2L6j27J46k26L1K41N6k97l9J23P5Lj77K8J88k2nK5r9
7731a2qJ09p5j80K69n0J2N2j17L1J3P1j43Q4k2NJ32p2J6j26lk3l2L8K12n2rp3
7759D7O1j25Qlp1j5n2J81n0P7l2k2m4J33q8R4j67J95l8j90J57J9o8r1R0J41o4
7786H3L9j74J9J47J4k19J47p7p7K77k08J16Oj27j9j1K47q5p4M8j04J0Q8o0q9K4
7812e9J67o9K7J6J16m18J34J16r8R1j4Q9N2j42N2k2Mq8j50N9J31L8l0Kj46K25
$$ plain form
7628 120 2 -74 55 4 24 57 162 -119 -74 61 -123 -126 -23 36 -67 75 80 33 109 -103 -6 67 -12 71 -3 41
7654 41 86 -50 -2 60 122 49 52 -32 15 218 21 95 113 -94 25 -8 45 166 -136 -214 92 -106 -53 57 49 132
7680 132 63 101 50 13 -18 -139 -7 28 -16 -114 -22 126 35 131 -5 194 -28 -168 -62 93 97 70 179 114 33
7705 33 108 -165 -90 -20 -63 60 28 64 -63 83 -143 -112 129 185 -112 -151 -28 47 50 -127 -99 89 67 62 87 -12
7731 -12 -20 89 14 -166 103 53 65 117 0 31 44 115 -28 56 34 39 171 99 115 -11 -14 -37 -69 -31 181 129 120 47
7759 47 108 -17 -9 -12 -83 -98 -150 31 -19 58 26 4 -40 93 5 99 -68 127 89 -101 56 75 7 -84 6 147 83
7786 83 122 -52 -33 114 128 -91 56 -21 -98 179 -29 87 93 -34 -53 -64 183 98 24 72 -32 -22 66 6 -83 -59
7812 -59 108 39 66 82 198 -220 -86 30 -68 23 9 98 150 8 60 38 42 -46 -196 -137 -6 32 2 4 -142 83
7838H3j5j2j71N2R1L8k05L16j32M1j49k01K70%K4j22J49j5O9RK3p6j28J09k13
7863a65K02n5j2M4r3J58l5r3J07j32j72O0J67J45M3j54m1R5J40l07J17j03L5O8
7887A9J22n6l7j54n7j18K83l2R3j38L9J36q5p4K8P9l6j18K02j0N8r6j12m6J22
7912A2J11j03k4N5P7j97J27n9J24l19P2J31Mj04Q8r5OP2Ql5J68j04j07K16j8K0
7938A26j99P6l1l0J68j1kk45l5K16k9J14j50j42N1O4P0o3O3j71l3J97k5J23j16
7963a4q2J25R1j27J40j3m5o6k7J63j61J67l09L0P8l7K88j60j18J49k9q0J35n8
7987D0j93N4J72Q3j62j20Pl2J34m3K73j68%k07K75m9J8L0M1k74p1K85k1n8JLo5
8014d7R7N6k36R4k28K52oM6l4Lj9J59p9j37J14j15j31J67J03j27K7o3J69m5j08
$$ plain form
7838 83 68 56 -115 -63 28 66 -139 177 45 86 -63 -264 6 6 30 -92 57 42 111 120 143 67 -61 48 -165
7863 -165 37 -18 -30 14 -79 79 44 -49 58 -74 -246 -186 -19 126 169 15 -26 69 209 -98 19 -84 -49 19
7887 19 141 85 48 -106 -163 -281 2 -30 63 -75 -36 100 15 -59 -31 48 12 -106 96 86 144 48 -64 -110 12
7912 12 123 20 -4 51 128 -69 58 -1 123 -196 -124 7 11 -93 -5 -100 -94 -22 -14 -49 119 15 -92 124 106 126
7938 126 -73 3 -28 -58 110 99 97 -148 -183 33 4 118 -32 -174 -123 -59 11 -52 11 -160 -193 4 -21 102 -14
7963 -14 -96 29 120 -7 133 120 75 9 -18 145 -16 151 -158 -128 -50 -87 201 41 -77 72 43 -37 98 40
7987 40 -153 -99 73 156 -6 -126 -119 -151 -17 -60 213 45 45 -162 113 64 82 112 153 -121 -192 93 72 14 15 18 -47
8014 -47 50 106 -130 -36 -264 -12 -18 28 -6 -3 -22 137 58 -79 35 -80 -211 -44 59 -68 -41 -104 65 20 -88
8039h8R9m4L0J48k05N8P3k2pJ0j06M4rJ45n7O9j97N2O6k5Q5m8j87J60r2j3J53
8066I2r2P7o3J45n3j46Q8p9p9J09j61L27k02m9L8J85p4K4J3q5r5N4N9K0m0M7p8
8093a8m6J0J99q6r1O5k43K00J6J32j88j8R7kp0l2Q6N1j53K0P6n3R7k2j77J94K
8120D6J62j43N0L4n4j27R1N4j13M5j5K6ll5m5j46J66J6M1O4k43J2j4J77n5n5O9
8147Ej1K0j62L03n6q0j86J62M9Q4j2j22p0K41r8j55L8J8kkN8J50j51JJ6q6J92
8174A44j31m8R3j41k8K57n6qj71R6r9Q7J17j21j2L0k15
$$ plain form
8039 -88 11 -33 -3 145 -60 -2 71 49 42 52 -54 -10 -19 126 69 138 -59 -7 59 34 119 71 -116 44 -48 -61 92
8066 92 0 77 14 159 106 -40 48 -31 -110 -1 -162 165 -37 -86 -48 137 63 87 100 15 -80 -26 33 53 13 60 -18
8093 -18 -64 -54 145 59 -32 33 -210 -10 6 138 -50 -68 29 27 -43 -75 11 62 -91 -71 5 -48 49 27 -150 44 46
8120 46 208 65 115 149 95 -32 59 113 0 45 30 56 53 18 -27 -173 -7 9 50 114 -129 -117 -131 46 -9 -64 5
8147 5 -6 14 -148 155 99 19 -167 -5 44 128 116 -6 -76 165 67 -88 -50 -32 -34 -36 22 172 21 22 38 -48 144
8174 144 13 -35 58 -83 -111 146 90 82 -89 7 -92 -5 112 -9 -21 9 -206
8191b06
$$ Imaginary data points
##PAGE= N=2
##DATA TABLE= (X++(I..I)), XYDATA
0@%%%%%%%qJ6j6J6k4M0m8N6p2Q8j12J44j72K04k41K82l37M01m70N46o30P30q42
30d49R62j099J252j420J605j810K038k287K559k855L181l540L930m356M819n327
46b797N882o489P157p884Q682r566J0543j1624J2834j4194J5730j7487J9517k1891
60a1587K4711k8124L2358l7781M5002n5141P0516r6854J53951m89174L60163O17694
72E85734p46736M09448K9193q34870K41151P76273l61557q1210J35704m89745
82c36615r831N90864j01172p6791J11290l71830m0664M51399j68612j42992K11432
93A16478k48865r1670M81703p7693l18095J48069o5432j23047L63787J8977l29644
104a25432K0478j9047j151L85777m481l29828K4101j36724j04287N38384J01223
$$ plain form
0 0 0 0 0 0 0 0 0 -8 8 -8 8 -16 24 -24 32 -40 48 -64 80 -92 112 -129 153 -184 217 -253 293 -337 393 -449
30 -449 513 -586 666 -754 851 -959 1079 -1208 1351 -1504 1677 -1863 2067 -2289 2530 -2797
46 -2797 3085 -3404 3753 -4131 4551 -5015 5528 -6096 6738 -7456 8274 -9213 10304 -11587
60 -11587 13124 -15000 17358 -20423 24579 -30562 39954 -56900 97051 -392123 -31960 585734
72 585734 -161002 248446 277639 -557231 -316080 460193 98636 17426 153130 -336615
82 -336615 -346446 244418 143246 66455 177745 -194085 -234749 216650 48038 -94954 116478
93 116478 -132387 -224057 257646 179953 -138142 9927 -55505 -178552 185235 204212 -125432
104 -125432 -104954 -124001 -125152 260625 256144 -73684 -49583 -186307 -290594 247790 349013
115C49013m90899P6672N4472l17687M13484M02947n19502j50413K33951l23358
125b71320J27139N72606l27345l52321L20515j28322j52040M78618m9575m46955
135b29000J68336R1639j82806K59786R5901l36734M7551J48995j19498J27166
145G1336O7072k74091K3273J60157p6437J05555P2283k64747j2662J91628n2143
156A1224M2764P7371k40794o6011K05547J010L0509R2318k16939r9322J79324
167A7001j5589L2817J34214k38257j36072K54457j7372p2562K29267j30228k88577
178b30901K23970J10090j87869J59751N0351l07010J05450K21954j79385K5233
188h366J43518k27434l3925K29070q5707p0095J32425j07707p5189J82034k6930
$$ plain form
115 349013 -141886 -65214 -10742 -328429 85055 488002 -31500 -181913 52038 -271320
125 -271320 -144181 428425 101080 -251241 69274 -59048 -211088 267530 217955 -229000
135 -229000 -60664 30975 -151831 107955 203856 -132878 -85327 63668 -55830 71336
145 71336 138408 -135683 -112410 47747 -28690 76865 149148 -115599 -128261 63367 11224
156 11224 53988 131359 -109435 -175446 30101 31111 61620 153938 -63001 -162323 17001
167 17001 1412 34229 168443 -69814 -205886 48571 31199 -41363 187904 57676 -230901
178 -230901 -6931 103159 -84710 75041 125392 -181618 -76168 145786 -33599 -8366
188 -8366 135152 -92282 -126207 102863 17156 -52939 79486 -28221 -103410 78624 51694
199E1694j04365R4726n6408q7242J54638R504j15256P5558j0563r5441J14944
210C1789M9138j11077K1168J1530o8988Q0607N2387q6833K5937J6904r0864O8097
222b05P4545r9451J2579M6641r5325M1731R1827r7572J039Q6967j02189j7674
234e7087J28280o9009o2457J15335m2097q2732J08542j0953q9225R5947P298j03472
246f1630O9487L0204q7925O1697M7059r9553J9246N8248o9104K1037P1637p5367
258a4964k5224O2867l5187K006O3131n9555l9787N8641j7178r994O3342l4455
270A3643o1717M0608J5124r365M1932k8053o4351L9484K5500j8525M7556q045
282C3791q5528J8132N1561r681K1460l171p3453J880N8277M986J3191N514p4626
$$ plain form
199 51694 -52671 42055 -14353 -101595 53043 62547 -52709 22849 12286 -83155 31789
210 31789 80927 -30150 -8982 2548 -66440 14167 66554 -20279 5658 22562 -68302 -205
222 -205 74340 -25111 -12532 34109 -61216 -19485 72342 -25230 -24191 62776 -39413 -57087
234 -57087 71193 2184 -60273 55062 12965 -69767 38775 27822 -61403 34544 41842 -61630
246 -61630 7857 38061 -49864 11833 58892 -40661 -21415 36833 -32271 -11234 60403 -14964
258 -14964 -40188 22679 -12508 -10502 52629 -6926 -46713 11928 -5250 -15244 48098 13643
270 13643 -48074 -7466 7658 -1707 40225 12172 -52179 -12695 12805 -5720 41836 33791
282 33791 -51737 -33605 17956 8275 29735 26564 -46889 -45009 13268 18254 31445 36959 -37667
295c7667k3764O7706K0058l636O432o0074l4710O5913M1070n113q462n4375l9737
308f6359N2404N2608k522j4074m2344m3628M5270P2848k116l7684m3578l5044
320f4219L7021O6838J1531k8816m8219l7499L6578P5775J5515n0355n4444k4013
332f4307K9457P0135L2521l7843n9565l3667L0301P4787K8077m5663o4078k9500
344f9345L2737P1203L9879l3109p2878l5484L3336O5904L6350l5137p3283l4063
356g3890L5267P2858M3541l4211p8443m0180L8724O8400L2662k5267p1755m9001
368h1295M0502Q0933L8232l0601q0985m8009M2341P1460L0979j7484o6759o3116
380h3802L5396R6136K9829l8556n8785o1189J9457R7512L7388l9090m8593n3374
$$ plain form
295 -37667 -61431 6275 26333 22697 29129 -30945 -65655 258 41328 36215 27753 -26622 -66359
308 -66359 -13955 38653 36131 22057 -20287 -63915 -18645 54203 52087 14403 -29175 -64219
320 -64219 -27198 39640 51171 22355 -25864 -63363 -26785 48990 64505 14150 -40294 -64307
332 -64307 -34850 35285 67806 29963 -29602 -63269 -32968 41819 69896 24233 -39845 -69345
344 -69345 -36608 34595 74474 41365 -31513 -66997 -33661 32243 68593 33456 -39827 -73890
356 -73890 -38623 34235 77776 43565 -34878 -75058 -36334 32066 64728 39461 -32294 -81295
368 -81295 -40793 40140 78372 47771 -33214 -81223 -38882 32578 63557 46073 -20686 -83802
380 -83802 -48406 47730 77559 39003 -19782 -80971 -61514 35998 73386 34296 -14297 -67671
392f7671N754R7091N3315n4101o4568l5162K746Q0332O8793m4444p1847k7027
404e6789P775P0828O6812m5917q2811k6706J6005O4497P1585k7622r2753l5128
416g0224L3394N9323N0418k2151q2978m6719K4059P4675O4822k9327q3040l9784
428f7532J4461O5249O7251k8467q1603l1870Q807N1427Q5907r857j05506l1964
440f3697L2830K1476O1082K2607r9144n0148N2960K9145L6080K9863q5302p1382
452h3630N7703M5658O471K8793n3966q9699N4047Q1905j0860J589k7774r2258
464h2021K0891J03604J0757k5696k0607o8719o276J01880M2108m6537l5625m1080
476d7321k1743O7656P0735j4232n9217m8987N614N1988L6220P133l4412o7741
$$ plain form
392 -67671 -61917 35174 88489 34388 -30180 -65342 -62596 17736 86529 42085 -29762 -56789
404 -56789 -49014 21814 88626 42709 -40102 -66808 -50803 13694 85279 57657 -35096 -70224
416 -70224 -36830 22493 72911 50760 -32218 -78937 -54878 19797 84619 55292 -27748 -67532
428 -67532 -53071 12178 79429 50962 -30641 -62511 -53704 -2277 83630 73773 -31733 -63697
440 -63697 -30867 -9391 51691 74298 -24846 -74994 -22034 7111 43191 73054 -12248 -83630
452 -83630 -25927 19731 26202 54995 1029 -88670 -34623 47282 36422 38011 10237 -82021
464 -82021 -61130 42474 53231 27535 6928 -61791 -68067 33813 75921 29384 -6241 -47321
476 -47321 -69064 -1408 69327 55095 -4122 -53109 -47495 4493 40713 47846 13434 -54307
488e4307k767O4470K5750r79o924n9638k4364P4072K6366l7905Q049k4098m9663
501f1938O6494N7218n8315j3857J3152m6439L4011P6386n2291n1228L1761k1714
513b6760M584R0303k7008r1231L1933J4801l1782P5758K9814j06844j8794N8721
525C495j2942K0008N4653n9433o6467M2083K4244n792L9437p992o8567k484M7017
538G260J1555m762K928j7040l1001R202M0716N93k2563O632m833j9524K4662J8160
552B1985l3793M81K7757k5288l356L6973l2329k2969N3417o879l6022L7430r411
565G996n3062M5810L7911m8641R226K5452n7355N560O5331l1259k1996M4322l7665
578h370l9655O4160J2628m6290K6756J2621n1398R297L9407j9527k858K6173k4697
$$ plain form
488 -54307 -57074 7396 33146 32167 25243 -34395 -58759 15313 41679 3774 11823 -12275 -61938
501 -61938 4556 61774 3459 -10398 2754 -43685 -9674 66712 14421 -36807 -5046 -26760
513 -26760 -22176 68127 41119 -50112 -18179 -3378 -35160 40598 70412 -36432 -55226 3495
525 3495 -9447 10561 65214 5781 -60686 -18603 5641 -151 39286 31294 -37273 -39757 7260
538 7260 18815 14053 16981 -59 -31060 -21858 18858 19451 -3112 3520 -1313 -20837 3825 21985
552 21985 -11808 -11327 16430 -8858 -12214 24759 -7570 -30539 22878 15999 -20023 17407 7996
565 7996 -45066 744 38655 -9986 -760 24692 -32663 -27103 38228 6969 -15027 29295 -8370
578 -8370 -48025 16135 28763 -17527 9229 21850 -29548 -20251 19156 -371 -3229 22944 -1753
591a753k4015K2761P230p140J6482O605k7084k0479J8575K0690n967P202P709
604B0816l8827j8640M1549J4467j5298J5339j3151m5881K3367M1048j9756K568
616G601J0872m8134R05N3148j6175j5343K9720l1900k8819N6300P516m6259K2434
629A866R618m0511L4748L4866n6290q243L9309k5875K207N1233l4843n3712L4769
642a0858K5198j3377K4052P02n8276q440M4325J5922M078k739l8562k5757K8196
655a5536L9927R379j7345k7612k5298O513M5147K6177k2978l0403j3124l90K8400
668B857L7371j3691m4551r307J0648J6134L3358m477m7561q153J9581O939K5729
681B4877R248n3993k6760M2721K2577k971J1935l0851m8661L2487N0306o299q095
$$ plain form
591 -1753 -25768 -3007 4223 -2917 13565 20170 -6914 -27393 -8818 11872 5905 13107 20816
604 20816 -18011 -36651 4898 19365 4067 19406 6255 -39626 -16259 24789 5033 7601
616 7601 18473 -29661 -28756 24392 8217 -7126 22594 -9306 -38125 18175 25691 -20568 1866
629 1866 11484 -29027 5721 40587 -15703 -23946 15363 -10512 -8305 42928 8085 -45627 -10858
642 -10858 14340 963 25015 25717 -32559 -40999 3326 19248 23326 20587 -17975 -43732 -15536
655 -15536 24391 33770 16425 -11187 -36485 -29972 15175 41352 18374 -12029 -25153 -25543 2857
668 2857 40228 26537 -18014 -27321 -16673 -539 32819 28342 -19219 -27372 -7791 -852 24877
681 24877 34125 -19868 -46628 -3907 18670 15699 27634 -3217 -51878 -19391 30915 24616 16521
694A6521j7273m6390J2374O6517J1567l1773j6232k6752j0637N5993L9039l4063
706A8891l5422j3177l506L8377M3450j8870m5740j8672N388L1239L9940r979m8997
719a7078j9247J3289K5258L5715Q5n0095l1847J7261L5402K7367l388l9101l3503
732c9882R476L8568L0069l170l9614l7800P772M0786L3086n965l9703k8433M401
745c0409K8545L8437L369m8184l4134J4646L0561K6684P803l7117m2376J3196
757b8979L8014J9350M308l0613m5760J0457M5590J9627j113k5484m4478l7M8189
770I071K8053q499k6538l7896n004M5415L1975o443k2079m0282j4347M7304L8045
783C8775j2331k4769k5933j4088L1060M2755r82l2271k9236q383K9585L8241k451
$$ plain form
694 16521 -752 -47142 -34768 31749 43316 11543 -4689 -31441 -42078 13915 52954 18891
706 18891 -16531 -29708 -33214 5163 48613 29743 -15997 -34669 -29281 1958 41898 31919 -17078
719 -17078 -36325 -23036 2222 37937 38022 -12073 -43920 -26659 8743 36110 32722 -6379 -39882
732 -39882 -30406 8162 38231 35061 -4553 -42353 -34581 6205 39291 33326 -6377 -34810 -30409
745 -30409 -1864 36573 39942 -8242 -42376 -27730 2831 29515 37318 201 -42175 -28979
757 -28979 9035 28385 32693 2080 -43680 -33223 12367 31994 30881 5397 -39081 -39118 9071
770 9071 37124 28625 2087 -35809 -40813 4602 36577 30134 8055 -32227 -46574 730 38775
783 38775 26444 1675 -24258 -38346 -7286 35469 34487 2216 -27020 -35403 -5818 32423 29972
796B9972k7952k5400r398K8554L6815l556k7240k5314j0771K8533L9389m996l1713
809c077j8497p008J7895M1365M412l8840k3128Q09J6734L4002Q907l0005k6745
822b3176n487J9136L5418O150l0713k2977j595J2018L0562J5319k9432k8563K200
835b1140J1711K4799J7511k7320l0732M898J4528J7012J6071j5657l3021m528
847b5868K1247J9826P501j5402k5251l070J4889J7364J3474j4211k9640p56J7636
860b261J1667R522p755k5582o673J8000J5151M107o966k0537q767J6672J3646
873A0224K488m455j7597r165J4006J3807M378n903j8037o477J4288J0219O58P4
887H508j1020j5089J0851J9599l485p659k616r434K286J5593K236p715l701m731
$$ plain form
796 29972 2020 -23380 -32778 -4224 32591 29035 1795 -23519 -34290 -5757 33632 28636 -3077
809 -3077 -21574 -28582 -10687 30678 35090 -3750 -26878 -26069 -9335 24667 33574 3569 -23176
822 -23176 -28663 -9527 25891 32041 1328 -21649 -23244 -11226 19336 34655 5223 -23340 -21140
835 -21140 -9429 15370 32881 5561 -25171 -20273 -5745 11267 27338 11681 -21340 -25868
847 -25868 -4621 15205 22706 7304 -17947 -21017 -6128 11236 24710 10499 -19141 -19897 -2261
860 -2261 9406 18928 11173 -14409 -21082 -3082 12069 16176 9210 -11327 -20094 -3422 10224
873 10224 12712 8257 -9340 -18505 -4499 9308 13686 7783 -10254 -16731 -2443 7776 8434 8508
887 8508 -2512 -17601 -6750 12849 9364 1705 -911 -10345 -8059 7534 9770 2055 -1646 -6377
901f377n89J1083N658r551n045K821j963L578P452n189o903K739J994K44K995
916B947j228n804K062M709l064P31L749p126q28R576l399o698N140J956m888K063
932a02L633m418k918N002J111j965n32k716J96M449K455k194o078m76M299l45
948e99M796M521j3045q212J2722O010l331M987o275j6939Q233J7121m591Q11m91
963E718k2149K856K5680l755o372O760k0022j0854L0307Q937j8691M219m608k0316
977b2290K1167K3526k0749o247N850j7840J0363L0239j5440k0871R015k409j740
990g426K3545Q63k7055m738R690O732J3624p44k2001r999O513J4534J5401n269
1004A3670j9006j2545l98K1317K2240j1050k1807o137n768J2636L4378m195l4511
$$ plain form
901 -6377 -6966 4117 9775 224 -4821 -2000 -3963 -385 7067 1878 -5025 -2286 -292 -48 2947
916 2947 1719 -4085 -2023 2686 -378 353 4102 -3024 -3852 5724 2325 -4373 767 2723 -2165 -102
932 -102 3531 -887 -3805 1197 2308 343 -189 -2905 -2709 1740 4195 2001 -4077 -4553 -254 -599
948 -599 4197 8718 -4327 -12539 183 6193 2862 7849 1574 -15365 -7132 9989 5398 6209 5718
963 5718 -16431 -13575 12105 8350 1978 8738 -11284 -22138 8169 17106 -1585 2634 -1974 -22290
977 -22290 -1123 22403 1654 -4593 1257 -16583 -6220 24019 8579 -12292 -3277 -5686 -7426
990 -7426 16119 16982 -10073 -14811 -5121 1611 15235 14491 -7510 -17509 -10996 3538 18939 13670
1004 13670 -5336 -17881 -18279 3038 25278 14228 -7579 -13716 -19484 -6848 27530 23335 -11176
1017a1176k914J877j168L4784J0029m1819q091J3045q478K5583K5610m1956k3392
1030b8066K7534k875R76L4218k3460m3907K6258J9766j1483K0888o635m4755J3776
1043a7765L3312q148L611J523l7418k352M0753P788j1079n281k4807o779L2234
1056E592J7463m377j4648k7971j703K8779J6384L431j4168l4454k092L0194J2172
1069A4602O154l643m0172j1431M0463R446o471J2496l2275l1358M4581K2596k2928
1082B060J1188j1200m0452L2767L9195l0520m655J0191l8689J1746N6389k2972
1094A5048l1351J9584j8624p404N2816k807m4158P111O0j0557M1421J4314m5025
1107i572j1001J1475m611K6526K1641l2882k2422M604M041K5881J6622k5940j8145
$$ plain form
1017 -11176 -14090 -12213 -13381 21403 31432 -10387 -18478 -5433 -13911 11672 37282 -4674 -28066
1030 -28066 -532 -3407 -2431 31787 8327 -35580 -9322 10444 -1039 19849 13214 -31541 -17765
1043 -17765 15547 7399 11010 12533 -24885 -27237 13516 21304 10225 4944 -19863 -26642 5592
1056 5592 23055 18678 4030 -23941 -25644 3135 19519 22950 8782 -25672 -27764 2430 14602
1069 14602 20756 17113 -23059 -34490 5973 15419 8948 21444 -10831 -42189 2392 24988 2060
1082 2060 13248 2048 -38404 -5637 33558 3038 -1617 8574 -30115 -18369 38020 15048
1094 15048 -16303 3281 -15343 -22747 30069 27262 -16896 -9785 -9725 -20282 21139 35453 -9572
1107 -9572 -20573 -9098 -13709 12817 34458 1576 -20846 -16242 -12201 13680 30302 4362 -13783
1120a3783l021J24K8850J8251k7279j5556J115o820K5155K5938l0947j8619J3473
1133c119j3141J2220L9341k8474l3211K5258k294o798L8349j2090m4603K0294
1145h268J4614j6227K9711M278n3250J0322L5277k0774J1252K1988m7712j2482
1157c1271M4109m454p456K1313k9314k6769L6370J2841j3504J2769j4793l0036
1169c0195K4332K1853r895N220j0836k4689J6717J8379m589O525j1553k4899J7173
1182f457J9460j0002N637j336k7504R372K5365j0961j49M342k5547O779K8080
1195A7079j4550n101J2899k4222k877L4787r044j8187J6580j3615j4628L5935
1207A5056K517l0057J4815M16k4959K8041J8960l2268N00J2779j9716J1084K4500
$$ plain form
1120 -13783 -16804 -16680 12170 30421 3142 -12414 -11299 -18119 7036 32974 2027 -16592 -3119
1133 -3119 -16260 -4040 35301 6827 -26384 -1126 -3420 -10218 28131 16041 -28562 -8268
1145 -8268 6346 -9881 19830 24108 -29142 -18820 16457 -4317 6935 28923 -18789 -31271
1157 -31271 12838 8384 928 22241 -7073 -33842 2528 15369 1865 14634 -159 -30195
1169 -30195 -5863 15990 6095 11315 479 -24210 -7493 10886 6297 12822 1269 -23630 -6457
1182 -6457 13003 3001 8638 7302 -20202 -10830 14535 3574 3425 7767 -17780 -11001 17079
1195 17079 2529 -2572 10327 -13895 -16772 18015 8971 -9216 7364 -6251 -20879 15056
1207 15056 17573 -12484 2331 2747 -22212 5829 24789 -7479 -6979 5800 -13916 -2832 21668
1220B1668k0544j0318J1737j1361M124K2098j4797j1730J2573j0161n94K2121
1232A4816j0932j4336J3654o093n219J9655o677j5568J3305n52j1236J7210P84
1245H811k0080J0730O411j3431J2566L860j9779J0353Q762j7299J1161J0746k3857
1258a1046M463J9182j8001j049J9766j7528p817K3884j1018j2384K1750q226j5163
1271a3187K1213j907j8239J6073K686j6023J2898M991j7678Q459P959j3529Q721
1284B437O619j9339O608J3351j5327M778J2333j9284j665J8980q742m119J1671
1297H301j2748p098J7992k575p798J0972q436j1932J7743L668j0899P791n562
1310e81j2260J5750O159j1482O316k563j5578J3936J4381j4745j073N554j5510
$$ plain form
1220 21668 1124 -9194 2543 -8818 -4694 17404 2607 -9123 3450 -6711 -7305 14816
1232 14816 3884 -10452 3202 -2891 -8110 11545 4868 -10700 2605 2053 -9183 8027 8811
1245 8811 -11269 -539 5872 -7559 5007 8867 -10912 -559 8203 -9096 2065 12811 -11046
1258 -11046 -6583 12599 -5402 -6451 13315 -4213 -12030 11854 836 -11548 10202 1976 -13187
1271 -13187 8026 6119 -12120 3953 6639 -9384 3514 8505 -9173 -714 7245 -6284 2437
1284 2437 9056 -10283 -3675 9676 -5651 -873 11460 -7824 -9489 9491 749 -3370 8301
1297 8301 -4447 -11545 6447 3872 -3926 7046 -1390 -13322 4421 8089 -2810 4981 -581
1310 -581 -12841 2909 9068 -2414 3902 1339 -14239 -303 14078 -667 -1740 3814 -11696
1323a1696N890K0128j0574q329N768j0339K413J9588o057j1409L893o691k92J9302
1337A1595j381j5545J608j674k172J8347J533j7518J236J11m702J7564P035k0335
1351d298n038O220k311J0477R952j5274j0468N725R10Q969J0351j5086j2298O893
1365e276K233O412J1660j2704j4994N892N466N432J0026r665j7976N129R503K192
1379C330Q990n158k0701J886J4193L077M752l721j8242j243J3536N730L419l254
1393F594j7620m222J6208P749q78j658j3794q062J3984J1533l65m108j2909p032
1407a4580J2348J2330M3n638j0959o805R099J3717J910p545j1495n853J0361J2476
1421I409K65n025j0917q686J1133J4239k28o985r512p361Q731J4880J349q307
$$ plain form
1323 -11696 -5806 14322 3748 -4581 1187 -9152 -6739 12849 6792 -4617 -724 -7415 -7707 11595
1337 11595 10214 -5331 -3723 -5397 -7569 10778 12311 -5207 -3971 -3860 -8562 9002 16037 -4298
1351 -4298 -9336 -3116 -5427 5050 15002 -272 -10740 -5015 -4105 4864 15215 129 -12169 -5276
1365 -5276 -3043 3369 15029 2325 -12669 -6777 -1311 4121 14147 4482 -13494 -8365 1138 3330
1379 3330 12320 7162 -13539 -11653 2540 5617 10369 6648 -11594 -12837 699 6429 9848 6594
1393 6594 -11026 -15248 960 8709 7831 6173 -7621 -15683 -1699 9834 9469 5361 -7548 -14580
1407 -14580 -2232 10098 10141 4503 -6456 -13261 -4162 9555 11465 3920 -7575 -13428 -3067 9409
1421 9409 9674 4649 -6268 -14954 -3821 10418 10190 3205 -6307 -13668 -4937 9943 11292 2985
1435B985q323p643O475J7440J472j0855o254n836K507J6583N714j1732r346k682
1449i495K841J2858Q148j0800j2420L24L654P532J0540o472j6404j913R570O710
1463D673M291k011j2595q093R826J1923P93l685q892r300P311J4316J551o601
1477C507o523p269K241J5059N436r974p143k663k63J1203Q598q324r623j635J491
1492e882Q313Q423n547j1854j202M709M251P056o81j2371n505P762P450J560j826
1507D656o137p918L301J2378K050o561k763n771j905J3426O992j1404m851J876
1521b631m618N984J4276p831j3981N204J550j669J2394L00j6532J069P237k880
1535b128O542N451j3931n438J1221k82j131P801p775j0353Q966N444l569L068
$$ plain form
1435 2985 -5338 -12981 -6506 10934 12406 1551 -4703 -10539 -8032 8551 14265 2533 -6813 -9495
1449 -9495 -6654 6204 14352 3552 -8868 -8544 -4890 2642 13182 6710 -9694 -11607 -2037 4673
1463 4673 8964 6953 -5642 -13735 -3909 8014 8807 5122 -3770 -13070 -5759 8557 10108 3507
1477 3507 -3016 -10285 -8044 7015 12451 2477 -4666 -7329 -7592 3611 12209 3885 -5738 -7373 -5882
1492 -5882 2431 10854 5307 -6547 -7749 -3040 1211 8267 7586 -4785 -10290 -2528 4922 6482 4656
1507 4656 -1481 -9399 -6098 6280 8330 1769 -994 -6765 -8670 4756 11748 344 -4507 -2631
1521 -2631 -7249 -1265 13011 5180 -8801 -3597 -2047 -3716 8678 8978 -7554 -6485 752 -2128
1535 -2128 4414 9865 -4066 -9504 1717 1435 304 8105 330 -10023 -1057 4387 818 3886
1549C886k548r027M281P836j932j333J9o115k89Q543K056m656l014o20R07J842
1565a64M089J443p993l530P103P82j583N406m723q841P317N590o210L427K839
1580D952j1999J997J2524p232l663R454p885o659J3332n05r608P281O22r052P285
1595H44N041j0293L134O540r478K243Q958r094k945R963m145m322P423k443o275
1610d849N579K402m667K292J015n038J644L975j584j348J78j90L92p70J895J221
1626B147m931R46N384m103j604N304l867l494P843j27p422M801O97o980P615M860
1642G069j1157J540N842p852L604R765r390n487P570k933j517J0011m386r970
1656g291O622J539m770R461Q58j3298K740O874l888L200L860q562l264O342J263
$$ plain form
1549 3886 1338 -7689 -3408 4428 2496 1163 1182 -4933 -5222 3321 5377 721 -2293 -2913 -2006 -164
1565 -164 3925 5368 -2625 -6155 948 1730 147 5553 830 -8011 -694 4896 -1314 2113 4952
1580 4952 -7047 -5050 7474 242 -3421 6033 -1852 -8511 4821 4316 -5292 1989 2611 -6441 844
1595 844 5885 -4408 -1274 5266 -4212 -1969 6989 -2105 -5050 4913 768 -3554 3869 1426 -4849
1610 -4849 730 3132 -1535 757 1772 -3266 -1622 2353 769 -579 -401 -591 -199 -969 926 2147
1626 2147 -2784 -1838 3546 -557 -2161 3143 -724 -4218 3625 3498 -3924 877 1574 -5406 2209 7069
1642 7069 -4088 -2548 3294 -4558 -954 8811 -579 -6066 1504 -1429 -2946 7065 2679 -7291
1656 -7291 -669 870 -3900 5561 6419 -6879 -4139 2735 -1153 2047 5907 -2655 -5919 423 1686
1671A686O96J507n451l575M234K700J320l77n556j280L235J089L877r7q816p3
1687d881O194j193K159L692r240m976R339K256k522M430o104q525Q807N898m268
1702A066L496l297j1418O924J0416n010q25J218r928P91J2814j111n350J813o865
1717e266k830J2692K328p686J81k204m041Q588O582o562m892j33p15M792N659
1732F493l229n423k405N35O272M104l691m202k802n44P118M231m378l695k566
1747d182j494O713O492m873n957P2q70L332P870k888p550n84L8L801P015k611
1763D324p513n94J043J827O834M9q939k533L695J645M378K084q331m256M191K535
1779D39L096J745o017n644K872N010K156M9l834m930Q29N313L068K50n119m350
$$ plain form
1671 1686 2382 3889 -1562 -5137 -903 1797 3117 2740 -2816 -4096 -861 228 4105 4008 -4808 -4881
1687 -4881 1313 120 2279 5971 -3269 -8245 1094 3350 828 5258 -846 -9371 -564 5334 1066
1702 1066 4562 1265 -10153 -3229 7187 2177 1352 2570 -7358 -6567 6247 5136 -214 1599 -5266
1717 -5266 -8096 4596 6924 -762 -581 -2785 -6826 1762 8344 1782 -3110 -3243 -3958 834 6493
1732 6493 3264 -2159 -4564 -4029 2243 6347 2656 -1546 -4348 -4892 2226 6457 2079 -1616 -4182
1747 -4182 -5676 1037 7529 2656 -3301 -3229 -4099 -767 7103 4215 -3335 -3919 -3881 -80 6935 4324
1763 4324 -3189 -3783 -2740 -913 5921 5970 -2969 -5502 -1807 -162 4216 6300 -2031 -6287 -2096 439
1779 439 3535 5280 -737 -6381 -3509 1501 3657 3706 -128 -5058 -4229 1084 4152 4402 -717 -5067
1795e067K341L475K721J288m788n363K175M715K124J61l640n030Q10N530K103
1810C555m61k762n007q5N713L350j146l590m065P44M253K989K80l454m517l7N178
1827I38L494j807k258l113j450M369M256j499l160k654n01L226L636l1l690k933
1843c177J09K597L182Q13l673l426O65L149K563l25k343k532j331L359L977p65
1859B842l152k123J35K152K519Q09k726l230K87K569K587k8k399k387j73K217
1875a01K628n64k117j838p69K234K796j38k353j915L55J824J128J269j678l216
1891b455N89K642Q50m60m26j771j091K063K466j234j243p66r94J720J988j018
1907H60j098p06o19J074K171k00k267m83N07M27J457J80k093K8L49j74J696M76
$$ plain form
1795 -5067 -2726 749 3470 4758 -30 -5393 -3218 1497 3621 3782 142 -4888 -4078 1452 3555
1810 3555 3094 332 -4675 -4760 953 4303 3157 -433 -4498 -3754 499 3488 3768 314 -4203 -4240 938
1827 938 4432 2625 367 -2746 -4196 173 4429 2930 -230 -2884 -3385 -159 3477 3446 -244 -3177
1843 -3177 -3068 -471 2711 3524 -149 -3575 -2910 239 2802 2477 134 -2398 -3729 -370 3607 2842
1859 2842 -310 -2433 -2298 -146 2373 3182 456 -2774 -2487 82 2669 2641 242 -2145 -2318 -101
1875 -101 2527 1963 -154 -1992 -2761 -527 2269 2131 -222 -2137 -1782 42 1170 2439 761 -2455
1891 -2455 -1866 776 1626 1166 740 -1031 -2122 -59 2407 1173 -70 -836 -1830 -110 1878 860
1907 860 -238 -944 -1563 -489 1682 1482 -785 -1268 -761 -334 1123 1303 -790 -762 -413 -587 1109 1585
1925A585k076r19J424P96o31P48l87j947N24J929k83r77K4m82R4J016N46r73j037
1944a026O45J06K48R28o31j759Q53J383n04M0O50j458r68K231O88j791Q31o12
1962a46j572K456Q79j960J9N05j451Q15K539j529k476J986J71j513K449L45l329
1979a812P10K064j221L47J534k044k058K949J001j984J368j56l104J678K925j325
1995H72j147N04j052l44K105J142k378o25M13o62J657J448k103j370J073k10L20
2012c57J782k32l172M33K418o67J39J266k386j470L010P28j431P59n97k567J257
2029a087L728j929j970K043j875j242M522L59m145N27J312j788J424L025k941
2044c7k545K547j96p66L346q98l930J434J936j249J146J347l268j393L486K58
$$ plain form
1925 1585 -491 -1410 14 810 179 927 540 -1407 -883 1046 763 -214 -190 -672 -578 438 984 11 -1026
1944 -1026 -381 -275 -27 901 270 -1489 -636 747 243 283 933 -525 -1493 738 1426 -365 466 -146
1962 -146 -1718 738 1617 -343 -324 181 -1270 -455 2084 555 -1921 65 236 -1277 1172 1517 -1812
1979 -1812 -1102 962 -259 88 1622 -422 -2480 469 1470 -514 854 698 -2406 -728 2197 872
1995 872 -275 229 -823 -1167 938 2080 -298 -923 -510 -1172 485 1933 -170 -1540 -467 -677 -357
2012 -357 1425 1193 -1979 -1546 872 205 344 1610 -776 -2246 764 1492 61 820 223 -2344 -1087
2029 -1087 2641 712 -1258 785 -1090 -2332 2190 2549 -1596 -1069 243 -1545 -121 2904 -37
2044 -37 -2582 -35 -231 -997 2349 1451 -2479 -1045 891 -358 788 2135 -1133 -2526 960 1218
2060A218j293J475j424k399K559J528j815L85J92k386O64L374o20k836J178n2
2076b52j795K639K040k958j556K042m22k63K721p01l892J214K554j945J148K200
2092B774m122j496M033L4j989K361p86m182K635L146k590j28J587l436J99M196
2108B236j450j728J824j725j510L635J130l442M33J246k351J470K850k291j746
2123a419J678o63j14K296m71k754K90J801l64N9J148j692k197J894J869j056m02
2140i7M84j539r03K958J403k902K24Q35k388J576L188k610j516K202j557q88L722
2157B192m53m032K269J138k975K336J981m227M06K803k309J05K944k863k067L933
2173A181R6k828K493K52m050K364K927k685R9J273k492J94K691l23j352M85n02
$$ plain form
2060 1218 -75 1400 -24 -2423 136 1664 -151 234 426 -1960 -1296 2078 1458 -1378 -200 -252
2076 -252 -2047 592 2632 -326 -1882 160 -262 -525 2196 1495 -2397 -1183 1371 -574 574 2774
2092 2774 -1348 -2844 1189 1223 -766 1595 809 -3373 -738 2408 -182 -310 1277 -2159 -1960 2236
2108 2236 786 -942 882 -843 -2353 1282 2412 -1030 -597 649 -1702 -232 2618 327 -1419
2123 -1419 259 -404 -518 1778 1307 -1447 -1157 644 280 339 1487 -205 -2402 -508 1361 305 -97
2140 -97 387 -1152 -2055 903 2306 -596 -372 463 -1925 -349 2839 229 -1287 915 -642 -1530 2192
2157 2192 1739 -2293 -24 1114 -1861 475 2456 -1771 -1365 1438 -871 -766 2178 -685 -2752 1181
2173 1181 1277 -1551 942 1194 -2856 -492 2435 -250 -151 1122 -1370 -1176 1515 1192 -160 325 -177
2190a77j171J628J179j280m32j0l80N74M94M36r18j363J363P72j282O84N54j859
2208a188O24J732j246m29J221j355n55K854p70k377K131Nk322K585J110l270P49
2225e01J340k173J323J969k393j025K432j436j055L261j193k610K286M73j821
2240a123J782L63k221R27J006r69L81M94j221JJ482m90l97N81j009O2J138o78
2258A09J31J9j423Q03J102r84N7O81j381o6J902n47j172J182q00n99K192n51j457
2277h02J463o99j060K155O6k153J042M45j557J389J348k192k66J478j456O51K113
2294A965k380j214K297r07m44K059j216j532J247N21n27P58k96j691J106P72p19
2311b01J129n07k057J342R86o28Q59k77k148J084J274r78O20L56k264J21K419
$$ plain form
2190 -177 -1348 280 1459 179 -253 -263 -643 -69 425 861 -57 -1420 -57 715 -567 117 671 -1188
2208 -1188 -564 1168 -78 -507 714 -641 -1196 1658 888 -1489 642 647 -1675 910 2020 -1250 -501
2225 -501 839 -1334 -11 1958 -435 -1460 972 -464 -1519 1742 549 -2061 225 698 -1123
2240 -1123 659 1022 -1199 -272 734 -235 146 640 -581 -580 902 412 15 596 -413 -351 787 109
2258 109 240 259 -1164 -361 741 -243 -186 495 -886 -952 950 403 -769 413 -387 -986 1206 655 -802
2277 -802 661 -38 -1098 1057 1123 -1030 12 457 -1100 289 1637 -555 -821 657 -799 -148 1965
2294 1965 -415 -1629 668 -239 -683 1376 160 -1372 -125 396 -131 627 331 -1360 -254 518 -201
2311 -201 928 421 -1636 -294 692 64 923 646 -1502 -418 856 -122 498 854 -1410 -1289 1130
2328A130q80n06J205k007l18K478m59r11J036j755n97K476nj312R53p59j462K345
2346F52R52k138N70L34j869J753J594k262O0R36j982J222J973j723r52R39p74
2363g15R1K008j075j482J069m80q1K401r95j847J131j35n88K026k23k269Q73L32
2381D1o72J545M92k548L13J372j092R74J069k275m45J724j012O82J236j958p76
2398a330J708n72J11J449j386j717K039L57j206J729p31k202J870P04j105J140
2414H58j42k050R03J486j032K6P41j720j77J875m13n88Q70j364l12J794o17k39
2432a01N49j020k65J220M8k27L09q10o30J493Q5p69O63p69r70J484O29j224Q93
2451E88n30j385J524O39j066N37j34j562Q96J673j447r0J304j649m51K491q84
$$ plain form
2328 1130 250 -256 949 -1058 -1376 1102 643 -268 768 -987 -1584 892 887 -425 528 -231 -1693 652
2346 652 1604 -534 36 370 -1499 254 1848 -414 -354 582 -1400 -178 1795 72 -880 59 -715
2363 -715 -624 1384 309 -1173 -104 -584 -665 1736 741 -1106 25 -110 -698 1328 1105 -1164 -291 41
2381 41 -631 914 1406 -1142 -829 543 -549 425 1494 -781 -1226 498 -514 168 1404 -554 -1330
2398 -1330 378 -194 -83 1366 -20 -1737 302 659 -547 1182 451 -1751 119 823 -282 858
2414 858 716 -1334 -431 1055 23 49 790 -930 -1107 768 355 -233 637 -727 -1039 755 138 -101
2432 -101 448 -572 -837 383 431 204 513 -297 -927 566 651 -118 545 -224 -1194 290 919 -305 588
2451 588 58 -1327 197 836 -230 307 173 -1389 -493 1180 -267 -357 947 -702 -1153 1338 454
2468D54j378J752q55j225J854J95j271N83J93j196R55J242j242o02R67n27k75
2485c76J087m09r10J68J92K75L98j08m68n84L59O89J37j72j19n70k36Q22P83q61
2505I7q9K61j291Q23J431r34o00P82j172j14J738Q4j620O68J25j565J649J218
2523A491k053j48J242j431J17J976q44j356J356k29q93J183O57k032L80J412j027
2540a99p0J375j498o79J574L99j158M24M77j373j04J720l82j160R62p25p72J510
2558C21N85j065n8L36q48R6J700p07j193J067l79p78J534N08j396j41P51p29J37
2577b59J157m02j140Q52j05j034J256O32j651L34R20q32m02J305l42j013O83O80
2595F39j540Q38Q75j356q5J547j045o74J510k16j478J133R75j666K40J247j655
$$ plain form
2468 454 -924 828 -27 -1252 602 797 -474 109 302 -894 61 1303 61 -541 426 -101 -376
2485 -376 711 302 -608 -440 -248 27 425 317 -151 -735 -376 313 450 278 159 -411 -647 175 958 97
2505 97 8 269 -1022 -199 1232 298 -302 480 -692 -806 932 1016 -604 64 189 -1376 273 1491
2523 1491 -562 -710 532 -899 -782 1194 350 -1006 350 121 -772 411 1068 -964 -584 828 -199
2540 -199 -269 1106 -392 -1071 503 902 -256 168 645 -728 -832 888 506 -654 308 -417 -1189 321
2558 321 906 -159 -217 119 -729 -633 1067 360 -833 234 -145 -923 611 1119 -277 -418 333 -396 -259
2577 -259 898 496 -644 208 103 -931 325 957 -694 -360 560 -272 -674 631 289 -724 -41 639
2595 639 -901 -63 812 -544 -629 918 -127 -801 709 493 -985 148 1123 -543 -303 944 -711
2612g11J7J596o34q22J054n55r59J387P06j322q8P11j239L83J884j076q38M42
2630f4q6m83J405L98j393k25N18o71O55J375r28j324Q21j11k34J230Q8j626l29
2649i84J470k39m94J133q66j607J471J114j215K94K62j279P6J981m78j208P16
2666A47l99p68J927O25j857j53L74o13Q14J532j240j343M60j12N04J548o45j883
2684a082L02N84N5R53K82j582p17P86Q16P5L92o78j313L00J702l17k75j51r79
2703h47j80J327R30j067m76J95o35L99J960r38j600M77J05J42J092K98j896m86
2721a200J072q8P44P81j516j432J303M39M41O30r38j600O55J126J30K76k72j543
2739i92k11J544L63m0j25j382n87J473Q89k74n29p60m72N93J377R5q01r05j33
$$ plain form
2612 -711 -694 902 268 -554 500 -55 -1014 373 1079 -243 -331 380 -859 -476 1408 332 -506 -64
2630 -64 -150 -633 772 1170 -223 -448 70 -601 54 1429 501 -823 -2 -113 -347 883 971 -655 -984
2649 -984 486 247 -247 886 20 -1587 -116 998 -217 77 339 -940 -864 1117 639 -569 147
2666 147 -252 -1020 907 1532 -325 -478 -104 -717 97 1629 389 -954 -494 -606 -102 1446 801 -1082
2684 -1082 -780 -196 -141 812 1094 -488 -1205 -419 397 472 864 186 -1127 -827 875 558 283 132 -847
2703 -847 -1027 300 1230 163 -313 -118 -753 -354 1606 668 -932 -455 -350 -208 884 1182 -714 -1200
2721 -1200 -128 -216 528 1309 -207 -1639 -336 103 544 1174 236 -1364 -709 417 547 823 551 -992
2739 -992 -1203 341 704 664 539 -843 -1430 43 932 658 129 -631 -1103 -510 867 962 161 -744 -877
2758h77M60R52L27m44j185l06J276J84M43O9j502o17J158O45Kq9p41j193J000
2777d38J357l42k84k81j443O37J514j15m07k39j046J67J655J21m13m54q63p8J164
2796B12J017q08n12m71k98R09J234o38o46m43n11J028R68k90p84n74k05P03R22
2815H13j24q52o56k49R25J075j47p73o74m11O13J455j10r15o24r9J34J311L56
2834A048j003m51j57J23J149N42j001p39j80L5R89Q13r57p32l02R2J091N81n11
2853D30j303K15J35Q59Q35o50j162o7K05Q51P25m75j086k80K12Q48O45j88j149
2872d00m76L46Q59O06k89j341k61L51N77P84j44j120m48M83N79P20p2r16p04M29
2892d37P20M58J36q25q74M04O16N03K42q98r09P31M46K88M9p25o93K48P60J73
$$ plain form
2758 -877 -417 535 862 418 -767 -1073 203 387 830 899 -603 -1220 -62 583 585 496 -245 -1438 -438
2777 -438 919 577 293 12 -1431 -794 720 605 198 -41 -1087 -920 735 856 443 -11 -874 -952 212
2796 212 1229 421 -91 -562 -860 49 1283 645 -1 -444 -955 73 1041 751 -33 -607 -812 -109 813
2815 813 689 -163 -819 -1068 -143 932 785 12 -662 -1073 -460 995 885 -30 -654 -753 -619 692 1048
2834 1048 45 -406 -563 -440 709 1251 250 -489 -669 -634 355 1168 211 -521 -823 -731 360 941 430
2853 430 -873 -658 -523 336 1171 521 -641 -708 -503 348 1073 598 -488 -768 -556 292 937 749 -400
2872 -400 -876 -530 329 935 646 -695 -956 -605 -28 756 612 -508 -956 -473 106 826 754 -162 -866 -437
2892 -437 283 741 877 52 -822 -418 198 701 943 45 -864 -133 313 601 650 -75 -768 -520 240 413
2912D13J45l70q85j8R22K05L6j44j048L38N64M60j12l47n03j8L33M48K90p11j96
2933a98k85M73K56Q8P2p84Q5M59P2N3j3p34j15O36J90k28L22m34m86M28M32k21
2955F8Q6%o36J41P91l67J13O6n68n9O63J34l07r8J70n46L99L89l53j26J4m07J28
2978c05N43Q3k00l81J64j16J65N40j35p24NK24k9O09J45q17l02K82M04J02N95
2999H52o18j011L15M14J45M04r8r82k08Q43J7m4N72q71o63P98N91l02L0q0r13
3020h09O24Q17j21n25J05n03k60J179N35j179j16q2Q2L84Q61o51q51j36L63L90
3040A07O67J2j436m40Q91L81N08J71j080j184Q77J112N2j43l97j083K24J490K
3059G31j11l82j097m06J699N74o46m77k44o15P09J499p33j114J66j66K52J268
$$ plain form
2912 413 558 188 -697 -715 207 412 448 304 -744 -406 158 618 506 159 -344 -362 -29 419 709 -2 -198
2933 -198 -483 -10 246 334 406 -378 -293 166 238 291 278 -456 -571 65 255 27 349 -85 -571 -143 289 68
2955 68 154 154 -482 -341 450 83 196 262 -306 -365 298 432 125 27 197 -349 50 439 86 -40 -26 -433 -305
2978 -305 238 321 121 -260 -96 -212 -47 493 358 -366 -361 -137 -166 443 588 -229 -531 -249 155 257 852
2999 852 234 -777 -462 -48 97 501 403 -579 -787 56 73 29 601 -270 -933 -135 456 154 184 104 -809
3020 -809 -185 632 511 -14 91 -412 -672 507 1042 -137 -253 -335 -253 131 992 341 -510 -646 -283 107
3040 107 774 786 -650 -1090 -199 182 690 861 -219 -1403 -526 586 638 495 98 -985 -761 729 731
3059 731 620 238 -859 -1265 434 1008 362 -115 -359 -974 -265 1234 501 -613 -447 -613 -361 907
3077I07j39j205k24L89K58O38L61j246r44Q06Q28M9L36o63j352L17J231M43k44
3096E46l19r62p75J829Q37p80k73n64r37J265J342o87o32m40m06M21J436K38j431
3115b92l06J7k5J258N00j178r20P47O8M34O22n01j575L93J123j02L82l32j061
3134g48j74Q64P20n5l58q25m72P50J219j51r59j97o69M76J631K2j092o20M5K07
3154c86R65P38q38j305K38M46L68Q66l36j559j19P33L01N73L27j534o73J112M37
3173C54j36K92o03r23N90R86j81j57k28q72L94J117J65p49l6m00l05J169M70n96
3193C51q82J8j9P24P24k38j236j90M20J71J029j59j290m29N19O07M36O9n28j112
3213a015K36J125K46j20j96q79j54J025K05j18k21n76l08O74Q70m58m15j97l68
$$ plain form
3077 907 768 -437 -661 -272 -14 624 985 -261 -1205 -399 429 478 814 151 -1201 -884 347 790 546
3096 546 227 -735 -1510 319 1156 376 103 -461 -1398 -133 1209 522 -110 -550 -956 -535 901 1139 -292
3115 -292 -598 -581 -606 652 1152 -26 -946 -199 -131 303 925 424 -1151 -758 365 263 645 313 -748
3134 -748 -922 -58 662 607 249 -576 -1048 -298 921 770 -189 -386 -1055 -579 1052 1074 -18 -638 -593 -386
3154 -386 579 1317 479 -826 -588 -142 226 1092 756 -803 -922 -189 112 685 1012 -522 -1195 -83 354
3173 354 218 510 -93 -1016 -426 560 379 222 -6 -878 -484 633 798 49 13 -387 -692 477 947 351
3193 351 -531 -513 -532 192 916 678 -558 -748 -328 -157 872 713 -577 -1006 -487 120 556 625 97 -1015
3213 -1015 -779 346 592 472 276 -603 -757 268 473 355 134 -442 -750 -76 794 336 -79 -276 -644
3232f44L75R16j06r59O3O8J00N95J64p66m74K50N19L05K63p12o56K72L56L61L60
3253F50l85o16k65P01M06j35j84n25m06O54N94ok82n07k30K35O91J50n87o6k73
3274c86k7P70J49m68l96J21j9L08M16k45m64J7K56o1M60k15m31k25M09J81J93
3295C43j22k80r1n7L38m4m5k22k75K65L79j36K4R0k85q2P6L43P3j03k76j43J52
3318g8M33j08k38l2l4k12K78J94J07j94l25j10J52K45J16k85j20K5m8L17K9N6
3340A68m49o7L26J46K04k24l08k6L5M04K52j82n39N0q2N28L84m35j61l64k0L85
3362B5M01k01l44n29L53M03L99n7o39l21j09O81O74j57o21n15N5O00M93j10m50
3383C1o56K5O45N38Ro69n34R5L92P03K75q17p48J5P02N99j31l59q70lP47N91j0
$$ plain form
3232 -644 -269 647 541 -418 -355 -287 -187 408 572 -194 -668 -418 101 406 669 -43 -699 -427 -71 290 650
3253 650 265 -351 -616 85 491 356 172 -353 -759 -105 489 483 201 -306 -536 -301 390 540 -47 -113 -386
3274 -386 -413 357 506 38 -358 -237 -256 52 468 223 -241 -224 32 -29 431 216 -215 -440 -31 150 343
3295 343 221 -59 -150 -207 131 87 42 -180 -455 -190 189 53 77 167 -118 -200 -124 219 292 189 -87 -230 -78
3318 -78 355 247 9 -23 -57 -269 9 203 310 116 -209 -319 -167 78 194 -91 -211 -186 -234 83 112 168
3340 168 -281 -348 -22 124 328 104 -204 -230 -195 209 461 279 -260 -210 -292 236 620 185 24 -340 -360 25
3362 25 426 225 -119 -648 -295 108 507 450 -189 -510 -619 62 736 579 -42 -557 -502 98 591 481 31
3383 31 -625 -600 45 583 592 -77 -611 -516 -124 579 854 37 -711 -696 6 605 474 115 -755 -758 -11 580 570
3406E70m90p41j73R19N41K91q72p48j25O49Q90J97q85r48J23O31Q09J01n29r85
3426g75p4O80Q25L18p77j008M9N17O96N49p97j017j79Q50R29L11p69r27l10R65
3446E6O74J31o26j022l90R23J067J41o97p14o55P74J058K35q56r39k24P14J010
3465F60L27p82q14n47P83R28L80n11j136m00O36J051L11m04q95o45O97J019J74
3484H32n23q10n37M63J243L57q50o82m22M52J117N98q62r40l35L43J079O41n36
3503F28j236l73M15J016Q61r08j029k71L94Q23N74j15j180n08N43Q17L69k05r98
3522c83o64M17R91K64j5r35p64M14R47N17l78o95l05k51Q52J116p42o24m27L03
3542c62N19P03l7j089m74L57M73O12J68j211n17K45P04L91K51p83p68K70Q39L61
$$ plain form
3406 570 80 -661 -834 85 626 917 45 -703 -828 -179 711 908 23 -925 -802 -171 638 739 210 -775
3426 -775 -849 -169 656 974 197 -811 -762 -245 451 1000 203 -814 -993 -143 786 1097 328 -599 -909 56
3446 56 730 861 235 -787 -1177 -254 813 954 257 -457 -1112 -338 720 955 99 -840 -1064 -350 660
3465 660 987 205 -609 -1156 -373 555 935 424 -712 -1112 -476 575 886 482 -413 -1058 -361 658 832
3484 832 309 -501 -1038 -575 668 1025 175 -507 -929 -477 640 1238 376 -564 -899 -556 523 1164 628
3503 628 -608 -981 -566 450 1311 403 -626 -897 -503 320 894 779 -401 -909 -366 451 820 615 -383
3522 -383 -1047 -630 361 625 610 -325 -1089 -675 272 789 411 -284 -589 -840 12 1128 386 -238 -665 -362
3542 -362 157 860 823 -266 -740 -383 90 702 870 -341 -858 -613 91 482 733 -50 -818 -548 291 652
3562F52o2n21r14K9Q67N10o7l72o05l20Q30P59k18m23l36m15M11P88r1n07k86
3583b91l6J44N03L82p45o49K86K70L20L88n57m92J12L87J67K95k10p22l08Q31
3603G5K60J9j66n19l17O58M12j32q3k97m62K47P15j7m95Nk11j08O85L31p31J3
3625a18m4o7K76K53k10j45j75K24N9R8P5l96J13O8mM5J86j45k54K6K57j87Q7J36
3649A58m45L4L35q8M3J99k44n02O31L2j36N3p2k01j20O30l34J51P3k84L7R4K24
3672B68k65L02k29k79L2N75l22k92K68k64k25M72K16j30j49j13k49K78L88Jl69
3693h6m1j11p6O28K27p11r3J17k3R7L06j35l30n1L52K8K87j28m38q3K05J48K28
3716C17r3l18m95N83L89j06k13j22o10L74O13o2j73k84m36K49P05J34m04k08j82
$$ plain form
3562 652 590 69 -845 -816 51 561 494 122 -483 -803 27 786 568 145 -191 -606 -195 593 502 -5 -291
3583 -291 -327 -183 320 702 -43 -692 -406 -136 184 572 15 -477 -365 22 189 484 274 -448 -756 75
3603 75 335 354 188 -331 -648 10 422 290 207 -90 -552 -305 410 393 -102 -97 -308 -416 269 600 -131 -118
3625 -118 -162 -229 47 300 90 -55 -230 -6 53 151 226 -170 -57 11 7 52 238 93 -161 -135 122 -65 22 158
3649 158 -287 -253 82 -6 37 236 -8 -510 121 153 17 70 -2 -203 -323 307 -27 124 197 -87 -50 44 268
3672 268 3 305 76 -203 -171 404 82 -210 58 -206 -431 41 257 127 -22 -135 -384 -106 282 283 -86
3693 -86 -127 -238 -314 314 541 -170 -263 -146 -169 -72 234 99 -231 -282 70 98 385 257 -181 -264 -59 89 317
3716 317 224 -94 -589 -6 383 277 64 -58 -668 -294 319 257 84 -200 -636 -387 318 452 48 -160 -342
3737c42q9P66L76m01n31k83K46M65N14k82n72m93M08M07M14j32o68m76L34M73
3757A34L91j1q41k48R9O42N52l86m41m53j03P87L47O2p99m10J91O06O60k00r56
3778c77l51K75N92P08l69p53k67j16O81P91j46j051k79K7O96N36J18q28o51J36
3798f28R19L56p5n30q76K03O85R21l42n52q15M9R12L73n8n70q13N4P61Q09j57
3819F26p93n85n9Q74N11K48q92p16J21P06O88l40l58p64J1P30O47l2n53q81l6
3840h47R40P13j44m89m17l98N30P10P9o84o81R7O19N70K4o63l88k17O05N16O1
3861E36n19o40N8M97M63K88m49q43r5O96N85om27o66k60O35N29J60l44o99j38
3882f39M50N25L03o18l58m25M43P15J31l80o15mL07N19K86n46m76j52L76M13K05
$$ plain form
3737 -342 -431 335 711 310 -221 -504 -258 207 721 439 -133 -626 -218 189 603 471 -197 -673 -339 134
3757 134 525 514 -327 -575 -476 166 718 332 -109 -562 -665 122 469 531 -268 -678 -487 119 779 579 -377
3778 -377 -728 -453 139 847 478 -275 -542 -658 23 814 668 -383 -662 -635 61 597 715 -113 -764 -628
3798 -628 291 647 572 42 -834 -631 54 975 633 81 -734 -685 227 600 542 -28 -841 -787 -26 783 626
3819 626 -167 -752 -811 63 574 822 -70 -786 -665 41 729 389 31 -733 -722 8 655 623 70 -811 -847
3840 -847 93 806 662 173 -244 -642 -112 598 677 -7 -688 -591 28 598 622 -41 -429 -646 -41 475 536
3861 536 17 -623 -565 -68 395 683 234 -609 -704 -8 577 571 144 -522 -782 -147 382 542 198 -501 -639
3882 -639 -189 336 639 21 -337 -762 -319 396 527 147 -468 -472 -165 354 640 94 -382 -534 -158 255 460
3903D60k33o77o5N41M33m8l01l02l15K60L87J53L1n33k00K74M77K1j01m59k67
3924d64J45N59Q6j59j91n42L78L19L33m24k20k28J50L24K41r8k69k74K74J11K47
3945B98j94l26j20L4N48k6o2j75m11K12M30k10K69j93l21L5J90J06l3j1j65j77
3967c02L25K42j67k70j02O3K22K16r9pk28j89J97J86Q4l19N0NK8P7P2k62k8J14
3991i2J37j9k2O8k32L5P1J38M9q6j34j37L25j29Q7J14k82M9r7J94J7j43K63k84
4015a10o1J01J07R0k26J94j98J06J35q0j36J26j68q6L14J23k89J15K4k25M3J66
4037F5J3k15M7rl3L80k5k12o8n3n2L15j20J18j98j24RoL44J5m70J76O2K02Q5m6
4063B00k65j93P3L80o6j9l1l05K06L6N6j22M9j19j66K80J59j20mk02j43K93M77
$$ plain form
3903 460 227 -450 -515 26 459 411 110 -192 -507 -247 140 293 324 -209 -409 -135 342 363 262 -197 -464
3924 -464 -319 240 326 167 -24 -566 -188 131 464 40 -180 -408 -258 66 307 209 -60 -334 -60 51 298
3945 298 104 -222 -342 -308 240 214 152 -23 -434 -222 208 -2 267 74 -247 -212 -22 84 51 40 -125 -302
3967 -302 23 265 98 -172 -274 -211 11 227 128 121 -107 -296 -99 87 171 -148 -98 -93 -65 12 84 -178 -206 -92
3991 -92 45 26 4 72 -160 -125 -54 84 133 47 -87 -224 101 -28 59 173 -109 -60 -157 37 54 -89 174 -110
4015 -110 -171 -70 37 127 -99 95 -103 3 138 58 -78 48 -120 -206 108 231 -58 57 81 -144 -101 65
4037 65 78 -137 -90 -99 -132 248 223 11 -57 -110 -162 153 33 151 -47 -171 -162 -168 176 191 -279 -103 -41 161 246 200
4063 200 -65 -258 -185 195 129 110 79 -226 -20 16 72 -50 -1 -120 -286 -6 153 33 29 -173 -316 -23 454
4086D54k11j84k14j06J65L85J21m03l48Q9K73J87J93l15n52J46K49K81M01m95
4106A16n45j08N26L40J8k50m14j55N05K84N6m07l96J38J85L89J76l83m85P0K13
4127a27N78n0l29k89m1K04L34L37m21n87l2L82L77m8j66n23j88M89L45J53l16
4148H2m03j15K38N26l1j17m83k97K44O08L29n21l19l32M29M79K76m18l18l27Q0
4169c90O36K62l40o57J83K49L01L01m45m25k80M88L22K24k2q32k4M48L15J69j07
4190C76o20l10L90N84Rk03l71k84K46N05L07k76n22m38L55M24K60j43m00k72J24
4211b59L46L83l15k95l23J27M48M20k84l58l81K94N01Q7q8k89n47L33L86K26j99
4232B13l55j38r4M55J39l3l24l23J71L70K11k06j61l45R5M53P7L3m74p6J36J77
$$ plain form
4086 454 243 59 -155 -261 -96 289 410 7 -341 -252 21 208 401 86 -466 -320 -71 210 611 116
4106 116 -429 -537 -11 329 347 97 -317 -472 33 317 373 -34 -430 -292 -107 282 458 75 -410 -340 -127
4127 -127 451 401 72 -217 -258 -54 280 617 196 -391 -423 -41 336 288 122 -401 -589 -100 245 398 82
4148 82 -321 -436 -198 328 297 180 -303 -600 -356 252 581 60 -259 -591 -162 317 593 175 -143 -470 -390
4169 -390 246 508 168 -489 -306 -57 244 545 100 -325 -605 -117 205 429 407 -425 -449 -1 314 483 376
4190 376 -244 -554 -164 420 429 226 -145 -429 -183 322 629 353 -169 -607 -252 172 432 289 -111 -383 -259
4211 -259 87 470 155 -140 -463 -336 112 532 248 -110 -491 -197 304 391 303 14 -533 -200 186 412 213
4232 213 -142 -280 -374 81 220 187 -137 -460 -289 81 292 86 -75 -420 -325 128 205 238 -236 -312 -176 1
4254AJ98J27l66k05j6L64J62j69r0r7j25L94m8J30j77l77l3L30L65m20p2Q9k31
4277b66L26J77O0l46j18N3Q5K32j70n4m8q4K47K08k23j8m42L76J01k8R1j19l15
4300b75J89K30m1j80O4j98K90p0l2J84m3k05l6MJ67J87k36Rj14J58L6RL3j56q3
4325a09M4Q9j9%K6j19P2P3k5q4J1Qj42K71p3l8J11j10P5j59R8J4O2o0mk8J5N2
4353E1O9q0j45O3j64K00M6jr8J00j53R0L1K6j80r1K81j51J03K67l90p6J29K23
4377A50jn8j53O4j02l7L00j75M7k97O7R1J98L2mk50m3J90K6Kr0j34PK2K28J40
4403B20k19k89Q2J70L9K78j58k87J31q6K13J28j80j15k26K19K03O2j15q7j68J2
4425a73K85K62l00n3l14K08P7J70m4l65N9J1J80L06k77k77k6O9J80K65r5l21k9
$$ plain form
4254 1 199 326 -40 -245 -261 103 265 96 6 -91 -216 178 130 260 83 -294 -327 3 368 -52 -124 -35 -266
4277 -266 60 237 297 -49 -167 -114 -29 203 33 -21 -69 -153 94 302 79 61 -381 -5 96 68 159 40 -275
4300 -275 -86 144 103 -77 -13 -211 79 9 -23 161 118 -87 -123 -119 48 235 -1 8 -106 52 88 97 130 -26 -109
4325 -109 -65 24 5 5 31 -88 -16 57 32 -52 -41 -33 -175 96 23 -15 96 -14 61 -98 0 14 76 16 12 -16 -1 51
4353 51 120 40 -105 -42 -206 -6 40 39 -59 41 -112 -22 9 35 -145 -236 45 -106 -3 264 -126 -202 -73 150
4377 150 149 91 -62 2 -100 -137 163 -12 35 -262 -195 -104 94 126 122 -128 -171 19 45 47 -43 -177 -170 -148 80 220
4403 220 1 -288 -206 -36 3 281 123 -164 -33 -119 94 222 42 -73 -299 -80 123 185 70 -17 -185 -173
4425 -173 112 374 74 21 -293 -85 -8 162 118 -247 -188 -177 3 309 32 -245 -271 -202 -22 243 148 -173 -202
4448b02j17L78K16M5n24r7J55K04J69j05j84k09j37O79J9o9l83j98J38K36M44
4469D58k25l73j27J58K34L21j62l91k05l0M82J84j53l23j38J31K29J37N0n14N5
4490b02j68K89L47K2l87r4K3K14L46q3l77k09K18O0J07J81j20m73O7L33K22j09
4512B07j62j71rP6K42J56m57r9k9K64J92Rj70l92R0K11M63n2l38m28J02O0N34
4535B99L0l13l35j00O00K26n0k79l87L6J89M84p1k98l48J84K57J04j3o1l03p1
4557b20J22L55nk18l14M3K65O3K33j43m13j10M98Q1mp5k94n5K96l1J81q3m48K3
4581b53J78K25M7J6l72n5K78K85j88j54j69j54K70K30L0l71J32n6j6J42K77k85
4603C7j87n8J34J94J4O9l55q9J57K39K8o2k48j39R5M08r1J31k13k10l1M22j20
$$ plain form
4448 -202 -319 59 275 320 -204 -301 -146 58 227 122 -62 -271 -408 271 290 221 -162 -360 -222 14 458
4469 458 233 -140 -267 -109 125 446 284 -107 -312 -342 140 324 171 -152 -290 -159 70 207 257 -257 -202
4490 -202 -370 -81 266 288 -99 -193 -170 44 390 307 -70 -279 -61 -1 106 287 167 -306 -239 94 316 207
4512 207 45 -126 -135 -59 183 339 -118 -217 -246 18 210 219 49 -343 -253 -42 421 369 31 -397 -295 -235 299
4535 299 329 16 -319 -419 181 407 357 78 -309 -273 -84 400 329 31 -317 -133 124 228 215 154 -149 -220
4557 -220 -98 257 252 34 -280 -237 28 91 324 181 -232 -342 156 237 233 158 -136 -191 105 74 255 172 -276 -253
4581 -253 -75 150 197 213 -159 -214 64 349 161 7 -162 -316 -46 184 214 -157 -25 -81 -97 45 322 37
4603 37 -150 -208 -74 120 134 203 -152 -241 -84 155 183 121 -127 -266 -171 237 146 277 64 -146 -177 245 125
4626A25k7j16k49K27J05Rn9j22j4K50k5M9k30O3k7o5P9J62j4k22q9K29R5p2L3
4651I5j59O1nm6J91j55j42P6O4j6N8O6m2m7j72J25p8J6O0J50q2n9J45p8j74K02
4677E4p2m9J33%p7J43j59o6O9J0Kj29J66%k58L13Kj29N3r9J48R0j15K29l99K21
4703H1m4q4O3J48j33L6q1rj8J24O8k45M0n2J97qjj63j2N7J42j14J4j57J03n4J91
4730H9l1J41k60Q7j36J6K26N8j10j57RK20M7j29q4N6k6o2J95r1K2j10mP0K82k91
4756B7k9o7P2r1J18J22j21k61K79L4R5J32l07l8l8K2K01m5p1j25j02J11J57J33
4780B08J0k70k0J23M7M5q4m3r4j56J92J93j29j89j5K73K7n6j8j64j40J26L00J26
4804B92k30k70j15L37k9K88k59p7m1j34L47J67k71j56j31J08K78J23l8k98j17
$$ plain form
4626 125 98 -18 -267 -40 65 74 15 -107 -121 129 104 153 -77 -14 -41 -106 -27 135 121 -101 -190 39 134 62 95
4651 95 -64 -3 -8 -54 137 -18 -160 -84 -20 -36 22 88 46 -1 -173 -48 -126 -110 -50 100 18 -41 104 26 -148 54
4677 54 -18 -67 66 66 -11 132 -27 -93 -24 -14 -12 -141 25 25 -233 80 82 -47 6 -93 55 145 30 259 -140 81
4703 81 37 -47 16 164 31 67 -14 -23 -41 83 151 -94 -54 -106 91 83 82 -81 -93 -36 106 -8 6 -151 -48 -102 89
4730 89 58 199 -61 26 -110 -94 132 190 80 -77 -68 152 199 70 -14 42 16 -46 149 58 80 -30 -34 36 318 27
4756 27 -2 -69 3 -88 30 152 31 -230 49 83 178 310 3 -35 -73 -51 150 105 34 -91 -193 -82 75 208
4780 208 218 -52 -72 51 98 143 59 16 -78 -234 -42 151 22 -167 -182 91 118 62 44 -120 -260 -134 166 292
4804 292 62 -208 -323 14 -15 273 14 -63 -104 -238 109 276 5 -151 -282 -174 104 227 189 -109 -226
4825b26J99K26n6Q9l58l7J25J81J34j69j16k39J22K19M0o5j52J3J33J6k9J53l22
4848a19l15J99L06P1k60k3q8J78K29J32j50k06q6%L33K2j33k65j4J48J48J9l6
4871I0j15j11J30J50P6j34l01J50o2J62K51k09Ol71K67J31K6L0k18j89J38O2K17
4894A76J37m37k20J38L53N6m4k66j15R9Q4K80j79j80j61J53J55J10Or8l3k59K48
$$ plain form
4825 -226 -27 199 143 232 -126 -163 -38 143 277 108 -8 -247 -125 94 134 69 -83 -70 63 79 50 203 -119
4848 -119 -434 -235 71 142 -118 -141 -229 -51 178 310 160 -46 -132 -132 201 223 90 -175 -189 -41 107 126 90
4871 90 -25 -136 -6 144 220 86 -215 -65 -127 35 286 77 83 -288 -21 110 136 166 -52 -241 -103 -41 176
4894 176 313 -124 -344 -206 147 203 159 -107 -222 -123 -39 241 62 -118 -279 -126 29 139 145 47 14 -245 3
$$ [...]
8191B04
##END NTUPLES=NMR FID
##END=
