##TITLE=1H_E3d0307-2
 CDCl3
 8 sc, 
 4.7.2023
##JCAMPDX= 6.0         $$ Bruker NMR JCAMP-DX V2.0
##DATA TYPE= NMR FID
##DATA CLASS= NTUPLES
##ORIGIN= UXNMR, Bruker Analytische Messtechnik GmbH
##OWNER= root
$$ XWIN-NMR		Version 3.5
$$ Tue Jul  4 14:23:09 2023 Russian Standard Time (UT+4h)  she@DPX200
##.OBSERVE FREQUENCY= 200.13135
##.OBSERVE NUCLEUS= ^1H
##.DELAY= (6, 6)
##.ACQUISITION MODE= SIMULTANEOUS
##.ACQUISITION SCHEME= undefined
##.AVERAGES= 8
##.DIGITISER RES= 18
##SPECTROMETER/DATA SYSTEM= spect
##.PULSE SEQUENCE= zg30
##.SOLVENT NAME= CDCl3
##.SHIFT REFERENCE= (INTERNAL, CDCl3, 0, 15.7039)
##AUDIT TRAIL= $$ (NUMBER, WHEN, WHO, WHERE, WHAT)
$$ ##TITLE= Audit trail, XWIN-NMR		Version 3.5
$$ ##JCAMPDX= 5.01
$$ ##ORIGIN= Bruker BioSpin GmbH
$$ ##OWNER= she
$$ F:/spectra/data/she/nmr/H-F/1/audita.txt
$$ ##AUDIT TRAIL=  $$ (NUMBER, WHEN, WHO, WHERE, WHAT)
(   1,<2023-07-04 14:21:54.17 +0400>,<she>,<DPX200>,
      <created by zg, POWCHK disabled, PULCHK disabled
       configuration hash MD5:
       00 E9 B6 7A A2 85 ED C7 34 08 36 98 17 FE 4E 26
       data hash MD5: 16K
       7A 1F 2E 38 D5 C7 4E 4C CA BC E5 45 26 B6 D2 2B>)
$$ ##END=
$$ 
$$ hash MD5
$$ B3 32 66 4A 7A BB 9A EC E1 17 17 DB D3 0B 21 BF
##$RELAX= 
##$RELAX= 
##$RELAX= 
##$RELAX= 
##$RELAX= 
##$RELAX= 
$$ Bruker specific parameters
$$ --------------------------
##$DU= <F:/spectra>
##$EXPNO= 1
##$NAME= <H-F>
##$PROCNO= 1
##$TYPE= <nmr>
##$USER= <she>
##$AMP= (0..31)
100 100 100 100 100 100 100 100 100 100 100 100 100 100 100 100 100 100 
100 100 100 100 100 100 100 100 100 100 100 100 100 100 
##$AQSEQ= 0
##$AQ_mod= 1
##$AUNM= <au_zg>
##$AUTOPOS= <>
##$BF1= 200.13
##$BF2= 200.13
##$BF3= 200.13
##$BF4= 200.13
##$BF5= 200.13
##$BF6= 200.13
##$BF7= 200.13
##$BF8= 200.13
##$BYTORDA= 1
##$CFDGTYP= 0
##$CFRGTYP= 5
##$CHEMSTR= <none>
##$CNST= (0..31)
1 1 145 1 1 1 1 1 1 1 1 1 1 1 1 1 1 1 1 1 1 1 1 1 1 1 1 1 1 1 1 1 
##$CPDPRG= <>
##$CPDPRG1= <>
##$CPDPRG2= <>
##$CPDPRG3= <>
##$CPDPRG4= <mlev>
##$CPDPRG5= <mlev>
##$CPDPRG6= <mlev>
##$CPDPRG7= <mlev>
##$CPDPRG8= <mlev>
##$CPDPRGB= <>
##$CPDPRGT= <>
##$D= (0..31)
0 1.2 0 0 0 0 0 0 0 0.06 0 0.03 0 0 0 0 0.0002 0 0 0 0 0 0 0 0 0 0 0 0 
0 0 0 
##$DATE= 1688466113
##$DBL= (0..7)
120 120 120 120 120 120 120 120 
##$DBP= (0..7)
150 150 150 150 150 150 150 150 
##$DBP07= 0
##$DBPNAM0= <>
##$DBPNAM1= <>
##$DBPNAM2= <>
##$DBPNAM3= <>
##$DBPNAM4= <>
##$DBPNAM5= <>
##$DBPNAM6= <>
##$DBPNAM7= <>
##$DBPOAL= (0..7)
0.5 0.5 0.5 0.5 0.5 0.5 0.5 0.5 
##$DBPOFFS= (0..7)
0 0 0 0 0 0 0 0 
##$DE= 6
##$DECBNUC= <off>
##$DECIM= 32
##$DECNUC= <off>
##$DECSTAT= 4
##$DIGMOD= 1
##$DIGTYP= 9
##$DL= (0..7)
0 120 120 120 120 120 120 120 
##$DP= (0..7)
150 150 150 150 150 150 150 150 
##$DP07= 0
##$DPNAME0= <>
##$DPNAME1= <>
##$DPNAME2= <>
##$DPNAME3= <>
##$DPNAME4= <>
##$DPNAME5= <>
##$DPNAME6= <>
##$DPNAME7= <>
##$DPOAL= (0..7)
0.5 0.5 0.5 0.5 0.5 0.5 0.5 0.5 
##$DPOFFS= (0..7)
0 0 0 0 0 0 0 0 
##$DQDMODE= 0
##$DR= 18
##$DS= 0
##$DSLIST= <SSSSSSSSSSSSSSS>
$$ [...]
##$SUBNAM2= <"">
##$SUBNAM3= <"">
##$SUBNAM4= <"">
##$SUBNAM5= <"">
##$SUBNAM6= <"">
##$SUBNAM7= <"">
##$SUBNAM8= <"">
##$SUBNAM9= <"">
##$SW= 18.05172834244
##$SWIBOX= (0..15)
0 0 2 0 0 0 0 0 0 0 0 0 0 0 0 0 
##$SW_h= 3612.71676300578
##$TD= 16384
##$TD0= 1
##$TE= 0
##$TE2= 300
##$TE3= 300
##$TEG= 300
##$TL= (0..7)
0 120 120 120 120 120 120 120 
##$TP= (0..7)
150 150 150 150 150 150 150 150 
##$TP07= 0
##$TPNAME0= <>
##$TPNAME1= <>
##$TPNAME2= <>
##$TPNAME3= <>
##$TPNAME4= <>
##$TPNAME5= <>
##$TPNAME6= <>
##$TPNAME7= <>
##$TPOAL= (0..7)
0.5 0.5 0.5 0.5 0.5 0.5 0.5 0.5 
##$TPOFFS= (0..7)
0 0 0 0 0 0 0 0 
##$TUNHIN= 0
##$TUNHOUT= 0
##$TUNXOUT= 0
##$USERA1= <user>
##$USERA2= <user>
##$USERA3= <user>
##$USERA4= <user>
##$USERA5= <user>
##$V9= 5
##$VALIST= <valist>
##$VCLIST= <CCCCCCCCCCCCCCC>
##$VD= 0
##$VDLIST= <DDDDDDDDDDDDDDD>
##$VPLIST= <PPPPPPPPPPPPPPP>
##$VTLIST= <TTTTTTTTTTTTTTT>
##$WBST= 1024
##$WBSW= 4
##$XGAIN= (0..3)
0 0 0 0 
##$XL= 0
##$YL= 0
##$YMAX_a= 377663
##$YMIN_a= -516485
##$ZGOPTNS= <>
##$ZL1= 120
##$ZL2= 120
##$ZL3= 120
##$ZL4= 120
##$ABSF1= 10
##$ABSF2= 0
##$ABSG= 5
##$ABSL= 3
##$ALPHA= 0
##$AQORDER= 0
##$ASSFAC= 0
##$ASSFACI= 0
##$ASSFACX= 0
##$ASSWID= 0
##$AUNMP= <proc_1d>
##$AZFE= 0.1
##$AZFW= 0.1
##$BCFW= 1
##$BC_mod= 2
##$BYTORDP= 1
##$COROFFS= 0
##$CY= 11.3945322036743
##$DATMOD= 1
##$DC= 2
##$DFILT= <>
##$DTYPP= 0
##$F1P= 15.7292609196834
##$F2P= 12.9074282941183
##$FCOR= 0.5
##$FTSIZE= 0
##$FT_mod= 4
##$GAMMA= 1
##$GB= 0.15
##$INTBC= 1
##$INTSCL= 1
##$ISEN= 128
##$LB= 0.24
##$LEV0= 0
##$LPBIN= 0
##$MAXI= 10000
##$MC2= 0
##$MEAN= 0
##$ME_mod= 0
##$MI= 1.114404
##$NCOEF= 0
##$NC_proc= 0
##$NLEV= 6
##$NOISF1= 3.799351
##$NOISF2= 2.8
##$NSP= 1
##$NTH_PI= 0
##$NZP= 0
##$OFFSET= 15.70392
##$PC= 1
##$PHC0= -20630.24
##$PHC1= 10.65272
##$PH_mod= 1
##$PKNL= yes
##$PPARMOD= 0
##$PSCAL= 0
##$PSIGN= 0
##$REVERSE= no
##$SF= 200.130013532006
##$SI= 16384
##$SIGF1= 3
##$SIGF2= 2
##$SINO= 400
##$SIOLD= 16384
##$SREGLST= <1H.CDCl3>
##$SSB= 0
##$STSI= 0
##$STSR= 0
##$SW_p= 3612.71676300578
##$SYMM= 0
##$S_DEV= 0
##$TDeff= 0
##$TDoff= 0
##$TI= <>
##$TILT= no
##$TM1= 0
##$TM2= 0
##$TOPLEV= 0
##$USERP1= <user>
##$USERP2= <user>
##$USERP3= <user>
##$USERP4= <user>
##$USERP5= <user>
##$WDW= 1
##$XDIM= 8192
##$YMAX_p= 0
##$YMIN_p= 0
$$ End of Bruker specific parameters
$$ ---------------------------------
##NTUPLES= NMR FID
##VAR_NAME=  TIME,          FID/REAL,        FID/IMAG
##SYMBOL=    X,             R,               I
##VAR_TYPE=  INDEPENDENT,   DEPENDENT,       DEPENDENT
##VAR_FORM=  AFFN,          ASDF,            ASDF
##VAR_DIM=   8192,          8192,            8192
##UNITS=     SECONDS,       ARBITRARY UNITS, ARBITRARY UNITS
##FACTOR=    0.0002768,     1,               1
##FIRST=     0,             0,               0
##LAST=      2.2672688,     0,               0
##MIN=       0,             -516485,         0
##MAX=       2.2672688,     377663,          0
$$ Real data points
##PAGE= N=1
##DATA TABLE= (X++(R..R)), XYDATA
0@%%%%%%%%%%%%Oj0J2j6J6j6K2l0L2l6M4n2O0o8P7q9J02j16J33j50J70j93K16
35A14k42K70k99L34l73M13m56N05n57O13o78P47q22R04r93J093j206J332j472
54g73J630j812K023k266K555k907L339l884M597n566O951r076J2680j9800L8525
69B6216j67739l74962N83807O2835k96978L68987Q905m87787J39929K35025j01390
80c152J60369j2937l77779J08527K21475j59449J19296J38549l30243k4939K49474
91H9191r5066K5181J24241k66715l3929K98820r6140j06889J81570j62532j92837
102b35105K73499J13350j33574L3632r2482j10190J99332M6565q0968J11018j67223
113d2146k44009K94256J82064k09690Q4620M2205l20190Q6952L01706j39041l9055
$$ y = [0, 0, 0, 0, 0, 0, 0, 0, 0, 0, 0, 0, 0, 6, -4, 8, -8, 8, -8, 14, -16, 16, -20, 24, -28, 32, -36, 41, -48, 54, -62, 71, -79, 91, -102, 114, -128, 142, -157, 177, -196, 217, -239, 266, -291, 322, -356, 391, -431, 473, -520, 573, -633, 699, -773, 857, -955, 1068, -1198, 1357, -1550, 1789, -2095, 2502, -3064, 3887, -5189, 7491, -12309, 26216, -141523, -516485, 67322, 130157, -166821, 202166, 211071, -276716, -136787, 98238, -3152, 157217, 144280, -233499, -124972, 96503, -62946, 56350, 194899, -135344, -160283, 89191, -5875, 19306, 143547, -123168, -157097, 141723, 45583, -61306, 120264, -42268, -235105, 38394, 151744, 18170, 51802, -40680, -150870, 48462, 95027, 14059, 125077, -42146, -286155, 8101, 190165, -19525, 65095, 107300, -212890, -125938, 175768, 36727, -2328]
124b328J07730k62991k8814L44669p8741j50421J79755j23244k00702K57084J13654
135A55651j84024K9505R588j19671J18075Q5142j16233L8521N62j46326J31224
146B014J53118j60326m1257P9436r8248J9958J40549o7180o7009K9507o2478M5175
158b6741J47589p9037r8415O2002n0799k7041J52305p154j09034K7370l6755j7323
170f3033J54240j8081j33188P2430l131j17730J34301J08486j63762k7600Q5774
181B8706p7570K4056J14599q8125m5614P2826o9892j755J35762o7445j06791Q8502
193G259Q181o5514P7538K2269q6315K0452K4381l3038N7626R170r2550L0983N2401
206C2843n6201K2602N2552o3508k4610M3132o369R709J8571m8854l144M2769l3986
$$ y = [-2328, 105402, -157589, -186403, 158266, 79525, -70896, 108859, -14385, -215087, 41997, 155651, -28373, 1132, 10720, -108951, 9124, 94266, -21967, 16554, 17116, -129210, 2014, 155132, -5194, -46451, 32985, -65263, -45305, 95244, 28064, -38945, -9438, -71916, -26741, 120848, 41811, -56604, 5398, -45401, -72442, 79863, 72709, -36325, -8955, -45710, -63033, 91207, 73126, -60062, 12368, 9237, -108493, 25808, 134294, -29468, -57068, 28706, -48864, -24808, 89791, 1666, -43948, 28878, -41014, -42769, 92993, 25548, -81243, 7259, 15440, -50074, 27464, 49733, -36582, -16130, 8251, -24787, 32839, 42009, -50541, -19558, 32843, -23358, -756, 51796, -11712, -36322, 6810, 441, 10150, 28721, -20133, -23277, 19492, -14494]
219a4494j230O0687m3624m9293N5673K506k9257L7854r784l3347L1708p468k4085
232b4154M9049m355n7877L8609L1840n7633J2198M7215m0912r632L4912k6045
244f785k258K8899l0413J885L9896l9548k7603N3122J668m0757K2935J5379l3021
257a6601L003J9737k32P882j8597k5385L5452J6754l2316J2749J8425l5335r599
270b4063L5474J1676j3875j4121j2589J3207K0853j3471j774J7216l1570k3536
282c6573M4842K3991k6794j5835k654J639J1326O545N777J298k9126k2663M0206
295A979L7436k9505k3856J1365j0589n145L2881J7412k0697l1888r237L1580K8924
308C0660j3325k1338k019j0051r124L5161L3407l2078m2660M390K5910J7783L03
$$ y = [-14494, -15724, 44963, 1339, -47954, 7719, 10225, -19032, 18822, 9038, -24309, 7399, -69, -24154, 24895, 20540, -37337, 1272, 33112, -24521, -12323, 34892, -6020, -15652, 19260, -6785, -9043, 19856, -10557, -8672, 31224, -8324, -35927, 17195, 18863, -21894, 1041, 16420, -16601, -13598, 6139, 5907, 13789, -4808, -30193, 5259, 22013, -10303, 2446, 20871, -14464, -24063, 11411, 23087, 9212, -4909, -17498, -4291, 16562, 3091, 1317, 18533, -13037, -36573, 8269, 32260, 5466, -10369, -13023, -11384, -58, 6487, 12264, 13562, -15564, -38227, 1979, 39415, 9910, -13946, -2581, -13170, -18315, 14566, 31978, 11281, -20607, -29844, 1736, 30660, 17335, -4003, -6022, -16073, -25197, 9964, 43371, 11293, -31367, -26977, -1067, 16716, 17019]
321A7019j0391j1394j9979l987L9733L3099k9448m6524N234K8264N121J0146J1658
334B8551k7089l4909Q064M1740K4177k6077l7866p17J6329Q489J7779J7378k9559
347F290m9412J2239N0871J0858k2832k0101j0082J102J2684K9851J9764l7499
359C733n0477J8166N1613L819k1525K2j4629k8783K3191N0739K695m1412l3628
372c6476J4796L7657M747q124M689k5020l9939K5589O1526m924m8825j1135J0650
385a4789R903K0913J0046j0457k5621l2118J5565O0083N407n0107j3191J8805
397e561l127R367L5628p290m7978j7584K4151L7305P969l5972j8512J2676n100
410a4028O872M2126j240n7686j7765M0645K3276p671r445j3403j4776l101K3249
$$ y = [17019, 6628, -4766, -24745, -28732, 11001, 44100, 14652, -31872, -26638, 1626, 6747, 16893, 28551, 1462, -33447, -25383, 16357, 40534, 14457, -23409, -24126, -7797, 692, 18471, 35849, 6290, -43122, -30883, 19988, 30846, 8014, -12087, -22169, -21067, -8383, 21468, 41232, 3733, -46744, -28578, 23035, 26854, 5329, 5351, -9278, -38061, -14870, 35869, 38564, -2848, -36476, -21680, 15977, 20724, 12600, 17289, -7731, -47670, -22081, 39445, 34521, -14304, -25439, -14789, -4886, 16027, 26073, 15616, -10005, -42123, -26558, 33525, 38932, -11175, -24366, -5561, -8688, 679, 36307, 29017, -18961, -36545, -12394, 24911, 32880, -3092, -21604, -8928, -14028, -7156, 34970, 33730, -23956, -41721, -1076, 22200, 14529, 5084, -8319, -23095, -26196, -2947]
423b947M1154p415n5442p407L6233P187oJ0320j8107l3609P90L3321K9805p223
437B6654m1816j1258L0503N3o190L3491j4409n9799J4273M7535l523r798m497
450A219k1489M951K4472k286O611N993m6625j1775O2144N776m0167J0467j034
463a743k5403K6347K9857j2497j0274k0058j9886L9104L1604l6535j1930J8857
475G443k9476n922N5945O911m0693j2407K763J1591J6979n735l294k85k7815p8
489b4073M5226M126l2668N46L648o145J9762L067j6639J0011j4118k2003M7198
502A7938J6786n6103M964L5581k8949j096L9624k3670k8869K0491m026L296L4540
515C0507k9970l3861M1629j857l0166M6314Q652o1461R919L5129k0032J0280K1315
$$ y = [-2947, 38207, 30792, -24650, -32057, 4176, 11363, 11357, 21677, 3570, -30039, -29249, 4072, 33877, 26654, -15162, -26420, 4083, 4136, -2054, 31437, 17028, -42771, -28498, 19037, 15514, 5716, 1219, -20270, -15319, 9153, 6867, 13478, 19471, -27154, -38929, 23215, 28991, -11176, -709, -1743, -27146, -799, 29058, 16561, 6287, -13771, -33657, 5447, 37051, 516, -11414, 7443, -22033, -27955, 27990, 34901, -5792, -18199, -15436, -3845, 13134, 7399, 4105, 3820, -23995, -24073, 21153, 25279, -7389, -6843, -3195, -9340, 10422, 13489, -3150, 6861, -7257, -29260, 17938, 34724, -21379, -16415, 19166, -9783, -10879, 28745, 5075, -23794, -3303, -7329, -4033, 30507, 537, -33324, 8305, 6448, -23718, 22596, 31248, -30213, -20294, 14835, -5197, 5083, 26398]
528B6398l8100q248L1498j6468M30L6617k9804l3666L5616Q429k2157J5207N501
541A1253k0395j481P228P141O959j4331q171J8534m438j6175J9549L298k2222
554a3251J1428R969j2803J0118k723j9098K3649R425l1493J3574K0824l3999k008
567a6388L8147j3932j9602J8173j0780q909K5754j1864j3006L0251j6526l1996
579c0678L8408J3815l8987J1885K4406k6966o406K1785p258p30J2224j6573k670
592g745J7923j5363o277K7636k217k3676J342J0111P95l354K175R478q740k1791
606a9703J1739K5022j2307j1767J3431r987j2702J9648L840p842R177j5364j2121
619a8936L1129J780k7235J6776J0022l0294Q390L0013j7406j4278J1987o845M488
$$ y = [26398, -11702, -19950, 11548, -4920, -4490, 32127, 2323, -31343, 4273, 12702, -9455, 5752, 11253, -9142, -10623, -3395, 3746, 10705, -3626, -11797, 6737, 2299, -13876, 5673, 8971, -13251, -1823, 8146, -4657, 5461, 2738, -16360, 7289, 16714, -14779, -1205, 19619, -14380, -16388, 21759, 7827, -11775, 6398, -4382, -13291, 12463, 599, -12407, 17844, 1318, -30678, 7730, 21545, -17442, -5557, 18849, -8117, -14523, 7262, 4, -726, 11498, -5075, -7745, 10178, -5185, -11462, 16174, 13957, -9719, -8377, 1734, 2529, -825, 1350, 10828, 2088, -19703, -7964, 17058, 4751, -7016, 6415, -3572, -16274, 3374, 7214, -628, 8549, -6815, -18936, 12193, 13973, -13262, 3514, 13536, -16758, -8368, 21645, 4239, -10039, 1948, -4897, -409]
632d09J8097j9307r309J9455j6173p724L7814l622m1172O775K2398p670L057J2685
646A4895j4512j6668K632J2370J9319R3k6268p760J0623L710R454R506q520j8088
660i214j2053J4550K9874m481k6671J127N296j3799J5213K9817k0243l0750P450
673a3884J1025R537J0501j6135j3378P605o544N895L3547j0047m5012N890L1449
686A0449l229j734R929j8363j9436J0818J9892J7374q013l6653o117K7486O707
699I110k514J0607j2060l3169J768L7794J7772j9133k4033m337R529O338J2725
712A0397J4773k0411l4793N707L2680J6662j0722k1318o981L185L229J9128K0033
725C1569k3388m0503R220L5830M220p593j290j9232j5011J7701K6914P731k1274
$$ y = [-409, 17688, -1619, -10928, 8527, -7646, -15370, 22444, 18822, -22350, -15575, 6823, -847, 2210, 14895, 383, -16285, -13653, -1283, 18036, 18129, -8139, -15899, -5276, -1566, 7888, 17394, 8874, -9214, -21267, -6717, 23157, 18676, -7995, -6868, -1572, -15371, -158, 29659, 9416, -21334, -13884, -2859, 6678, 17179, 1044, -12334, -4729, -11273, -5378, 28169, 18122, -26890, -21000, 10449, 7220, 5486, 15415, -2948, -22384, -11566, 8326, 25700, 17687, -18966, -25083, 2403, 9110, 6596, 17203, 5143, -28026, -26258, 11536, 29308, 10175, -13858, -18195, -8666, -2328, 10397, 25170, 4759, -30034, -24327, 8353, 25015, 14293, -7025, -14006, -10821, -7592, 11536, 31569, 8181, -32322, -23102, 12728, 16948, 9355, 8065, -11167, -26178, -8477, 18437, 26168, 4894]
738D894k9930J362K5838J2044j733k993j7318k1937J4595L7309O101k5861k0952
751a8581j51J4472J3180R880p80k5477k4164J7035L5924O994k4239j8437n5L062
765a1337J1733K3063O43l4772k4113K0772L1192K237j2051j1446j3735k187J8946
778a055K4843J085l2028k3149J7028K5156M396m446p702j8113j0077K1297K9569
791B6804k780k9840j8009J1388J8071N165M701m802k7903j1542K7507K5050n571
804A8239k1425j4495K527J1816J3147R538p517k7429j2629K5538K4729o385j3487
817B167j0953q174R403J8303R101n986k3513j5770J9271K4498l663j2746m965
830c027j0685k157K1954J5653j1043k0635j0939J2068K0290rp078l215j4809n855
$$ y = [4894, -25036, -23674, 2164, 14208, 12475, 9482, -7836, -29773, -15178, 22131, 28232, 2371, -18581, -18732, -4260, 8920, 18800, 18020, -7457, -31621, -14586, 21338, 28332, 4093, -14344, -14399, -11337, 396, 23459, 24102, -10670, -34783, -14011, 17181, 19418, 7367, -4079, -17814, -20001, -1055, 23788, 24873, -7155, -30304, -13276, 11880, 16276, 11830, 4128, -13985, -24062, -2765, 26804, 24024, -5816, -23825, -12437, 5634, 10799, 15500, 10698, -17205, -28747, -1240, 23810, 18239, -3186, -17681, -15154, -3338, 9809, 19347, 11830, -15599, -28228, -2690, 22039, 15654, 2167, -8786, -16960, -7557, 10746, 19847, 13861, -9652, -25422, -6151, 18347, 14684, 1938, -3027, -13712, -15869, 6085, 21738, 10695, -9940, -20879, -8811, 11479, 11470, 4392, 1177, -13632, -19487]
844a9487K4051J7741j3134j7324l738L487J1298J1087l474r766j0786n885J7188
857A258J8450j0589j5260j710J82N462J1576K515j0010j2923l349J3474J4440
870A3516o324j2638J687k084l493J6001R236j5297j1418L259P342P370l67o000
884G90k796l139j496J0039J0539j0058j3328M285O255J148K009k111l656k372
898c891l280O553J0247o604j1915L856Q683l278l524O907j14r112j17Q657K666
913E734o251l868N907J756m477M40L652k97l236j887M263K093o191k016O704J942
929D268o952j864O804m62n515L511L902m275n321L075P511j302p433Q83M421j239
945A2p14M367K289p946p184R371R066n575o246J563j439k994P489Q086o241q936
$$ y = [-19487, 4564, 22305, 9171, -8153, -11891, -8404, 2894, 13981, 10507, 741, -10045, -15930, 1258, 19708, 9119, -6141, -7851, -7669, -2207, 9369, 11884, 1874, -11049, -14398, -924, 13516, 7192, -5446, -3759, -5843, -9336, 6665, 15901, 604, -10814, -7555, -213, 7157, 6790, 790, -2006, -5145, -6641, 3398, 13937, 3879, -9449, -5164, 1091, 2239, 4248, 2137, -1519, -3891, -7171, -618, 9629, 3025, -8890, -5034, 3649, 371, -3153, 3754, 3640, -5472, -5589, 3068, 5734, -517, -4385, 1522, 3278, -1199, -759, 2893, 2596, -640, -2527, 1736, 3829, -2362, -4378, 2326, 4268, -2684, -4548, 2256, 1794, -3721, -210, 3692, -583, -5904, -2829, 4682, 3380, -4053, -3170, 1251, 12, -702, 3665, 5954, -1992, -9176, 195, 9261, 3686, -2560, -997, -2436, -5430, 2059, 10145, 3904, -5032]
961e032l201K596J2318L090j2594j247L003q962N026J9910m482k1266Q78J1238
975A275n70L815M679r540p343J59N415J4098L35j9189l798J1671R26j25Q536n131
991E213j7673m93J6082Q740m939j1765n343N596L214N751Q971q838j9305l77J7390
1006B224J2393n456j3506k736R88j331J2587J7521j4130k8226N644K0034P36J634
1020H376J130j6385q638Q856J0849J2577m034k6219o137K1671N584n876Q155o353
1034C556k4058N732K5555M345r875j1326o611Q522R492J737L616p798k0049K677
1048a4485K5990O526j5841q282r07j679Q341J4362P88j7752j7329Q151K0381M165
1062A2429n337p686j1614k501J2912J4764M537j4960k2221L739K2451M482n936
$$ y = [-5032, -8233, -5637, 6681, 9771, -2823, -4070, -1067, -10029, -5003, 14907, 10425, -10841, -9963, 1275, 705, 4520, 9199, -341, -7684, -7525, -2110, 11988, 12323, -6866, -10664, 1007, 1933, 1808, 10344, 5213, -12460, -12953, 3129, 11869, 6930, -4835, -10178, -4582, -1368, 4383, 13354, 4516, -14789, -15166, 2224, 14617, 9161, -4345, -7081, -6093, -7424, 5163, 22684, 8554, -19672, -14028, 6006, 6742, 8376, 9506, -6879, -15517, -6661, 4188, 16765, 12731, -13488, -19625, 2046, 7630, 1754, 9909, 3556, -20502, -14770, 10785, 15130, 5255, -6071, -12682, -4160, 5332, 7069, 10685, 2887, -17162, -14485, 11505, 18031, 2190, -6092, -6999, -8678, -337, 14025, 14813, -2939, -20268, -12117, 8264, 12429, 7092, -594, -12208, -14709, -1797, 12967, 17504, 2544, -19677, -15938, 6513, 10995, 5059]
1075E059M406j2511k0847J6773K7126n536j4923o313m679O839J2764K138l292
1088G004r176j4953N899K5672P21j9809k646K255l262J0221J2048o965j4513p768
1102a5272Q662J7775K203j3369o813N4q49Q654J5015l372k0352r200J1030J5634
1116I800J815p618l201r076q407J6814J8469r162j5384m500O94R641J1127l068
1130G944q090m894q795O175K3296k381k1863J534O222m971R692J0646j1763j1772
1144i020J926N267R389L419j3036o573P643o71J172J2742o006j8501L235J1211
1158B197K650R86l848q724p75M209N433P622k970j4769k823J1567M253J45M55
1173E608p091o286K371P303Q505l159j3230q21P311j54K316N631p546j0134M866
$$ y = [5059, 9465, -3046, -23893, -7120, 20006, 14470, -453, -6766, -11445, -4606, 8158, 10296, 7004, -2172, -17125, -11226, 14446, 15167, -4642, -7288, -5033, -8295, 1926, 13974, 7009, -7504, -15272, -6610, 11165, 13368, -1, -6814, -6760, -7609, 1045, 16060, 12688, -7664, -16864, -5834, 9800, 11615, 3997, 796, -8280, -16687, 127, 18596, 9434, -5950, -10450, -9756, -115, 11012, 7944, -146, -5040, -13835, -7660, 15636, 13255, -8608, -7074, -852, -5823, 3869, 14515, 2752, -9020, -7094, -1827, 7562, 10981, -2055, -8628, -985, -1656, -484, 12258, 6252, -12249, -9014, 2197, 4847, 5833, 1985, -6739, -7514, -3305, 2128, 9750, 6780, -7989, -10812, 755, 5008, 5153, 5608, -1483, -7769, -5398, 1905, 10410, 7251, -5979, -6800, 511, 357, 2673, 8304, 758, -9376, -4510]
1188d510P063N79J409n812o687P423K835m624P009O57j3983J893J3139k101n674
1203a384K178k424k295N857J275j119K188p754m406J3210K105j0484K500K653
1217B100p267K071P813j266m253j936k050M462N346n476j930M927n106k889Q604
1232C150Q34n235n11J2J832L022l349q50M958l892m727P587K464q715J303M979
1248B862m490Q71L128m105J834J864n742L503N147p904j917Q426k918n599O264
1263A224N55n334M497M95l317N095k466o046Q362J874j0517L878P134p199j639
1278c404P865k396m483K280k57J662J965p288J78Q228o610l482J0880k060r854
1293f776N570M835l560P82k21l660L181N37m382O907K549j1865K442J0584n569
$$ y = [-4510, 2553, 3132, 4541, -1271, -7958, -535, 2300, -2324, 4685, 5342, -8641, -6748, 6391, 4290, -1384, 794, -1630, -3925, 1932, 3207, 2088, 4276, -3478, -7884, 5326, 7431, -3053, -553, 2100, -5167, -3096, 4717, 3451, -802, -2738, -4788, -326, 5020, -456, -2386, 2541, -2565, -5454, 3150, 3984, -1251, -1762, -1750, 82, 3104, -245, -1095, 3863, -29, -4756, 2831, 5295, -3420, -2117, 2862, -1628, -757, 2371, -1734, 100, 1964, -3778, -275, 4872, -3032, -4949, 3477, 559, -5040, 1224, 1779, -3555, 942, 1437, -1880, 3215, 749, -5297, 3065, 4939, -5578, -1700, 5434, -1765, -3404, 4461, 2065, -2418, -138, -395, 1267, 3232, -4056, -3878, 4350, -2260, -5742, 5138, 3078, -6776, -1206, 3629, 69, 851, 630, -3030, 151, 688, -3694, 3213, 5762, -6103, -3661, 6923, 1354]
1308A354k868N153l519l035K887o51K244K327r201j080J2099k713q183Q526Q12
1323D152j1714M777P674l959j494k147k225P368J300o511M922L488j1228Q51J3066
1338H320l753q734K896N55n65L737k354R92K990q944q84J3995k763j2176M785
1353a903M329p036K207P011l185l413j157M9Q062J247j0030K143M991p910J835
1368b760J0292m807p693K552K799K306K276m633k628L537m047p86J1032k987j3208
1383h755M606P653l640R58K525m151k541O5L026O560k883j0729K816Q365m367
1398d92n36P690m984q524M640N673J696k559o583J62N294j966J19O279l839j0328
1414h258L844R627r53m017k376j535J662Q82J568N579m948j0590N956R700k886
$$ y = [1354, -1514, 3639, 120, -2915, -28, -679, 1565, 3892, -5309, -6389, 5710, 2997, -5186, 3340, 4152, -7562, -2785, 4889, 930, -564, -2711, -4936, 2432, 3732, -2779, 2143, 5631, -5597, -4746, 8320, 4567, -4167, -1271, -716, -1281, 2456, 102, 1094, 4084, -4860, -5744, 8251, 5488, -6688, -1903, 2426, -4610, -2403, 4608, 1423, -1990, -3147, -3098, 4964, 6211, -3819, -1676, 3315, -4595, -2760, 7532, 2725, -4968, -2416, 383, 2689, 4965, 332, -2296, 1241, -2806, -3592, 7440, 4453, -8755, -4149, 3504, -136, 822, 3347, -804, -3345, -3280, -254, 6306, 3423, -7306, -4490, 3875, -492, -1028, 6662, 1678, -6846, -2206, 3467, 5163, 2604, -3979, -3817, 1477, -489, -370, 5909, 2070, -8258, -4414, 5213, 4260, 243, -2133, -3668, -2006, -1124, 444, 6023, 1075, -9515, -3559, 6141, 3255]
1429C255l146J208l289k789M722M314O46l876p586J843R624j048m283L264l360
1444e01p068O207P431k146n570l193Q34M644K212j476K31k678o051M352J0048
1459G276k439p647l92J243J053K963K616j458o208l546N997O719j509n125k122
1474b579m57O66M428L150k538n535m013M207P703j733m177M54k585k147O380N070
1490F294m213n598l96K423L433K224k336k743j153j577M123O491l521p569N13
1505c605L825P52J105J747l660n837J940N744K362j642m741k835K640L004J134
1520A933J038j470n972j896Q312M139n008j959N51k784J364N723L22l582k783
1535b072j417K554M945p46m834L57O10k349L523M159m225m375J033K799J779o03
$$ y = [3255, 109, 1317, -1972, -4761, -39, 4275, 4921, 1045, -6541, -4698, 4926, 3878, -405, 2859, -501, -7569, -1362, 6069, 3923, -1647, -4840, -4006, 638, 2850, 1374, 1605, -1073, -7124, -2772, 7276, 4837, -2810, -3202, -1959, -906, 2057, 4673, 3215, -2993, -6539, -542, 6177, 4668, -457, -2579, -3036, -2370, 2058, 5208, 2670, -2865, -6878, -2671, 5032, 3299, -878, -424, -3009, -5156, 1224, 6294, 2081, -3517, -3913, -1490, 1943, 4167, 1831, -912, -2065, -3642, 481, 6972, 3451, -4118, -3605, 220, 972, 2077, 3824, 164, -5673, -3733, 2011, 4373, 2731, -2010, -4845, -2205, 799, 1933, 2971, 1501, -4471, -6367, 1945, 6084, 1076, -883, -332, -3116, -1752, 3971, 4293, 711, -2072, -3489, -935, 4010, 3264, -1570, -1213, -603, -2952, 571, 4730, 505, -3870, -2837, -38, 1741, 1138]
1551A138j372j248j031J057K913J498j743l556o06L194K656q21k231M65j459k047
1567c193N152L017n306j828K253j654J355L484k480k520J325j473j69N528j995
1582A496n935M356J853n160L566M187n783j016L971j265p99K316k085j087L314
1597A929j535k036M087q96m278L500K073l678m34J267j50N70q28l71J374q51j991
1614b248K690J878l167j413K372J14k0k61j166K139k00l362M316K891o755r29
1630c121O098j508k951K989o93l386J448J463O36K520m372m761O667K534o348
1645b785L591K830q211j295Q164J124l032m38k073j40L998j52j13K161n828m537
1661f736Q154M276n165j285N81k125J145L437J607j544n322k809N644M685m123
$$ y = [1138, -234, -1482, -2513, -1456, 1457, 2955, 1212, -2344, -2950, 244, 2900, 2079, -152, 313, -1146, -3193, 1959, 4976, -330, -2158, 95, -1559, -204, 3280, 800, -1720, -395, -1868, -2037, 3491, 1496, -4439, -83, 1770, -3390, 176, 4363, -1420, -2436, 1535, 270, -529, 1787, -298, -1385, 1929, 394, -1642, 2445, 1549, -2729, 771, 2844, -834, -1268, -1, -151, 419, -409, -780, 594, -257, -2248, 442, 2320, -847, -2260, 112, 226, 206, -55, -1221, 918, 718, -2644, 1672, 4563, -2192, -3121, 2977, 1469, -1482, 1507, 814, -2572, -1124, 339, 975, 3495, -877, -5638, 1029, 3563, -2785, 806, 3636, -4575, -5870, 2294, 3418, 386, -52, -2125, -2265, 1733, 1581, 1468, 3629, -2199, -6736, 1418, 5694, 529, -756, -175, -2300, -1155, 2282, 3889, 2345, -2977, -5786, -142, 4543, 420]
1676D20j756J530l913K49O656J525l289m415k393M719N029k841j027O12n482j290
1692e666J0232L500p816k833M95p70M599L517l330k473l865k392R089O363p868
1707G82m851L157j914P2Q378Q59r560l448K690M276N406k321n851J76o21j92Q352
1724E390L330r887o080M573M152J466J552l238m736q66J807P191L775q680p077
1739g328M149K981J018L669j371p267k846M676O562K748n387p226J897L458L81
1754A14N071J031j0205m120P247M898J044j622n771k909K990L371L474J371q131
1769b147o945O663O527j426K85k138p023J038O827L249j57n816n999L092O553
1784B583N90j02o63o731k652Q505M937k716l638m078q10N473L204j84j496o020
$$ y = [420, -1336, 194, -3719, -3470, 3186, 4711, 1422, -2993, -5386, -667, 4362, 1521, 494, 1106, -4376, -5666, 4566, 8066, 250, -2583, -2088, -2858, 1741, 5258, 1928, -545, -4410, -6802, 2287, 8650, 782, -4069, -912, -2826, -2754, 5624, 6483, -3077, -6525, -3835, 441, 5847, 3526, -2325, -2149, -2770, -2962, 5390, 8720, -1167, -7247, -2674, 1478, 2944, 4496, 1258, -3478, -4344, -2537, 4654, 8429, -251, -7328, -3179, -198, 820, 4489, 3118, -4149, -6995, -2319, 4243, 6991, 1604, -5622, -3725, -267, 114, 5185, 6216, -3989, -8109, -862, 4036, 5080, 3458, -2313, -5222, -2232, 1139, 4613, 5984, -2147, -9092, -2429, 4098, 2672, 2957, 819, -6204, -5166, 1661, 4910, 4753, -1063, -7062, -3970, 2583, 3173, 3071, 2408, -4323, -6975, 1530, 6467, 3751, 113, -3965, -4775, 698, 3902, 3718, 2222, -3798]
1800c798l418O904O342k934l440j839k905K453O355O44l161l997l528M536O877
1815E091j691k948j080l642K13P416L084n045m168j100J469N270J775l320j990
1830f66k494j654O533M458m830m318k12L80L101L409j181l740k076q80M181N359
1846E370k930n152O64K9R61M597M24m277k275n05K733M577q32m323j165O69O7
1863a368L629K103m311l287P80J324L266J035l799j824Q41jK803K494k972l604
1879b891Q50J536J568J996j805l135M27J127P29K884j044m190L64J670O3J517
1895A666J18k872p25J150O65J279L53k915r50K288k02J2J912k046k074J757J154
1912E70L58J86j567q44J424L97l40J276o07k271O74J875m48l26k69q32J108l61
$$ y = [-3798, -7216, -312, 6030, 3096, -344, -2183, -5088, -2635, 3720, 4364, 1203, -2794, -6322, -1786, 5091, 3400, 452, -628, -4270, -4057, 3359, 6443, 1398, -2770, -3870, -2401, 2869, 4644, 1324, -666, -3160, -4814, 1719, 6177, 1347, -2971, -3183, -2803, 298, 3707, 2526, -1214, -3290, -4170, 11, 5370, 2440, -2712, -2048, -2019, -1058, 3539, 3963, -314, -2589, -3094, -361, 4216, 3384, -939, -2104, -1435, -1368, 2261, 4364, 53, -3234, -2454, -1130, 2136, 3171, -628, -2452, -1611, -1612, 1191, 3685, 713, -2891, -2041, -505, 1063, 3059, 1254, -1881, -1454, -327, 402, 3286, 2242, -1948, -1584, 86, 149, 1666, 1784, -1088, -1813, -663, 2, 1281, 1634, -1281, -2231, 57, -145, -133, 1779, -267, -2341, -584, 570, 928, 1114, -453, -1297, 127, 524, 184, 1460, 853, -1418, -744, 1131, 683, 357, 88, -744, 364, 3]
1930Cq45J897l4l143J159K443j725j312J711K94j432R40K36n28P69p52l30K159
1948A510j276k095K316J028j541j17J165j005q04Q38Q78R2r44j852J125K074j505
1965a13n39J604j414j813J421K228L6k455r82J844O00q15J111R39k301k020K507
1982a62K653j279j490l69J52O96j09Q39J164k947k387L132K773j987j623Q75p76
1999h45j394K487K199j626k548r57K065K386p65o74p0j939n66K942K920k026l598
2016b009M41J700J27J254P50k072k454k6L028K153j613k335r15J084N10Q99K001
2033B523j319m654K79M466J217k168p84J42j444J37L270J430k309l027l05L355
2049H09J706j624m94K04k435l28L954J855l181l392J310J945K38N25K61j841k620
$$ y = [3, -842, 1055, 1021, -2122, -963, 1480, -245, -1557, 154, 448, -984, -44, 192, -336, 433, -319, -649, 1510, 234, -1861, 455, 1483, -58, -175, 990, -15, -819, 19, 897, 989, 45, -1807, -682, 1392, -113, -652, 952, -462, -2275, -854, 1374, 1410, -1045, -2027, -183, 417, -398, 713, 1652, -649, -2669, -162, 2491, 1212, -278, -647, -495, 201, 92, 931, 2095, -852, -3239, -107, 2666, 679, -944, -69, -845, -2239, 248, 2447, 821, -1727, -2684, -619, 1767, 1002, 328, 258, -1681, -2247, 695, 3615, 1589, -2009, -1568, 132, 259, 1513, 2263, 191, -2263, -2289, 739, 2892, 1279, -1056, -1971, -887, -377, 522, 2523, 1204, -3450, -3171, 1295, 2512, 344, -440, -298, -1742, -1605, 1665, 3095, 786, -2241, -2546, 809, 2515, 891, 397, 601, -1834, -2162, 1792, 3647, 466, -2926, -1616, 329, 567, 1092, 1353, -488, -3108]
2066c108Q73L928J083k465k226L1J367Q85Q98J142k030l866J740M154L0k064m36
2083f4p06j310J931K856r35j900j671o82L094J817k219n90J96k392O16M419K45
2100B705m063r22J921R4J002J177j902j247l39N57K937P57l106j350J368P88n5
2117C22J700j50l493r91K474J570J08j523j178j19n4J238K239r62k551p97J135
2134a032J599O79q55o98l51o36Q96K673k96l447M3K033o63M91J428j562j836Q84
2152f50R15N63O81j809j648J687R67j390J376P45l250j04K632o3o37J93j097m51
2170a340J453N61j88L19j050j651J814J849j410j57J38j037R5J611M3o94m98o96
2188h38K67Q86M27n58m28l80r8Q28J59l98K77q19K3J041k77LM67q82k79J197j02
$$ y = [-3108, -2235, 1693, 2776, 311, -1915, -1884, -517, 368, 1266, 2408, 378, -3488, -1748, 2406, 2436, 372, -64, -770, -2080, -149, 2707, 1772, -128, -1799, -2481, 613, 2430, 211, -379, -183, -2575, -1959, 2460, 2705, -1358, -2280, -359, -265, 737, 1914, 12, -1235, -1574, -1017, 1920, 2677, -429, -1779, -411, 377, 322, 2022, 1872, -1621, -2612, -138, 1432, 1540, 17, -1161, -1280, -1334, -96, 2143, 1181, -1370, -2167, -1032, 567, 1246, 391, -307, -658, -1294, -398, 2275, 1979, -1468, -1425, 608, -55, 436, 1864, 302, -1534, -650, 265, 828, 1509, -300, -1948, -261, 706, -684, 692, 1437, -1813, -1917, 715, 652, 15, 208, -889, -1340, 113, 674, 486, 805, -245, -1896, -82, 1767, 357, 200, 338, -699, -604, 1007, 1050, 356, -142, -838, -571, 315, 742, 184, -244, -624, -722, 106, 265, -133, 144, -675, -652, 389, 112, 115, 582, -300, -579, 618, 516]
2209E16n39L84J14j087O99R93r88k46Q87j334K9J486r93o11J061o92o50J197O3
2228B89q95M68K20r16Q67O96j379L30J053j272O0J335o58k17O30n49o3N72o97
2247a26k9R46n86j120J165M91j205M30K60p33L68k35J83Q31q07j107J331P74j538
2266g07L45J207j055o24J401K1m26R8p68L88J034j333J46J708j406j323J734P37
2284A177j581R9P29p01q1L70l30N58k24j362J261J257j712k83J539p89q07R84
2302A04O82o98k82p6L68R11r95m37J220j67j641J417O66j259n29O56K71k2n89
2321d00j2N31l90n59Q62R22j420r13J719J91j071P22J67m08k63J08Q82K93j431
2340d70j77J458l54j002J085M65j734m47J674K91r42m60J04P78l35m71J075l7
$$ y = [516, -23, 361, 475, -612, 87, 1080, 92, -154, 733, -601, -572, 914, -79, -690, 371, -321, -971, 226, 289, -606, -138, 82, -834, 33, 729, -650, -320, 733, -539, -479, 856, 198, -19, 611, 62, -1, 571, -126, -155, 791, 205, -915, 250, 741, -464, -34, 226, -507, -139, -374, -191, 640, -167, -1274, 57, 831, -707, -362, 845, -210, -834, 567, 588, 162, 260, -508, -120, 914, -419, -273, 1435, 29, -1294, 440, 1177, -404, -305, 424, -277, -358, 12, -318, 240, 16, -1346, -85, 1172, -540, -823, 716, -73, -880, 104, 786, 88, -194, -270, 98, 1009, 14, -423, 797, 630, -1011, 406, 1072, -187, -716, -60, 211, 189, -400, -412, 119, -271, -830, 32, 954, -466, -1379, 340, 531, -540, 182, 349, -59, -322, -214, 668, 961, -470, -647, 811, 457, -545, 540, 1005, -729, -1176, 498, 789, -153, -613, -509, 269, -66, -537, 538, 501]
2358E01j868k5K068L58j658J19N96j39j81M82Q45k17k164M79K103k05j498M13
2376IK16n02o2R69O57j178j340O92J250k00q71L62j34j355P01K013m34j150o89
2395a046L53J289Q8l49J51q51r36P81J955oj973n9L59K22Q13L62l58j286j244
2414a735J316J807o87j333k9mj49R13J345o11k051l80J347R90R5q87m1p25m46
2433a265J854J700j357j651l55Q29R56N05l77p83j158j06J594J620j038k124J38
2450a018P66qJ188J39j506j327L01J579J334n43j373n09L08N26R79J131j344k419
2468a796N38J777N79Op12q74p73P90J729N79j625j399m23J246J242j01o41j137
2486i95n59P37J467J276j565j698R5Q07Q14J191n90j829m24O79J405O81n57j089
$$ y = [501, -1367, -1392, 676, 1034, -624, -505, 91, -48, -229, 253, 1098, 881, -1283, -804, 1299, 1094, -404, 9, 225, -277, -339, 630, 1287, 109, -1231, -539, 711, 511, -360, 2, -132, -1487, -786, 1227, 793, -357, -1046, -693, 596, 684, 335, 486, -365, -1301, -520, 1435, 1429, -544, -603, -244, -22, 791, 1153, 795, -491, -1735, -419, 1388, 701, -632, -661, -665, -814, 99, 1444, 833, -1218, -1598, -251, 739, 834, -53, -94, -819, -1265, 589, 2289, 932, -719, -1074, -245, 711, 1216, 839, 56, -1102, -1208, 386, 2006, 968, -1156, -1018, -252, -260, 928, 1067, -439, -1766, -1465, 114, 1448, 905, -468, -977, -669, -143, 836, 1967, 623, -1796, -1258, 519, 1098, 1104, 392, -482, -1255, -465, 1264, 1843, 218, -1181, -1604, -358, 884, 783, 142, -995, -1554, -817, 650, 1926, 361, -1337, -1242, -435, 379, 1570, 980, -849, -1273, -594, 811, 1492, 935, -154]
2504a54r51L91J120R12j17j604j138P83J032L15K81j095j389L1J708J257p90j043
2522d51l60n10J009J580j78j063r86k53J015J597J3j518o84N40j58R81J273j575
2540B72j361Q0R39N79M23n14j360j33Q34M95P04k38j654m15J115L04L39M96j465
2559e60n30P45J109K9l67j88r75R9J078N23k00q54p39L44J081O4j04m94p34l6
2579g09M11R60k82r66k47M10O07l25N95J69j094l84J219q7j96J73o36J93N51m09
2599d7K19M55o95o28J071N96j406J47Q34q15l92J062l61l55K13j16K65M19o98
2618b32l15P51M5j174Q36P66j085l06J544l04p68J68K27L6P3j21r4j36l32K28
2638a93Q52J88j022l62N82r0q1O03m02n57n85O94J258n14p23R7n2k36O59J079
$$ y = [-154, -1105, -714, 406, 1318, 1201, -403, -1541, -758, 274, 589, 870, -225, -1614, -1583, 125, 1382, 592, -451, -811, -1321, -312, 1268, 1090, 27, -959, -1212, -197, 1400, 1413, -105, -789, -249, -407, 574, 1847, 272, -1089, -1009, -70, 509, 932, 418, -942, -1075, -241, 254, 958, 720, -934, -1349, -234, 70, 409, 905, -560, -1090, -345, 764, 793, 426, 238, -737, -638, 440, 963, 763, -91, -830, -486, 595, 659, 555, 61, -673, -709, -298, 662, 380, -586, -833, -423, 184, -141, 454, 623, -471, -855, 364, 277, 81, 254, -382, -189, 362, -47, 172, 627, -68, -696, 375, 971, -435, -288, 546, -269, -661, 401, 40, -315, -102, -218, 47, 466, -232, -547, 204, 249, -925, -89, 677, -408, -714, 830, 526, -242, -74, 153, 189, 262, 141, 47, -89, -421, -193, 659, 847, -175, -537, 45, -45, -126, 477, 75, -482, -1067, -373, 885, 371, -352, -255, -307, -543, 116, 1195]
2658A195p29j071j17O39P42M20r69l16j3l18P45J704j053k218K73J129k1M95L40
2677H57j295j030O63R91R29m9k230l43J691J28Q7Q57j051j818J84K351N50p66
2695G06o98r96K7J462N05K61q72k098J29K061R30n33r08r83n50R23J911M17j726
2714c2j691L3J608J183M4n19j797r61J710J955J73j292j665j27J060J366O59o81
2732A026j814j303J129K731O6j689p64j159K07K244J245j116j523j482Q01K224
2748H23R82r14j617p02k25J680K791r66k660q66P58J179J748k70j538j932m1J996
2766B26J798p7k324j428K91J241J322R41j671k289l68J921J997j24j345j356o19
2783a864J015K000Q04j093k495l16J527J760L43p03j584j219Q16K082J345j420
$$ y = [1195, 466, -605, -722, -83, 659, 1079, 110, -206, -219, -537, 208, 1912, 859, -1359, -1086, 43, 22, 517, 857, -438, -1468, -805, 186, 1115, 1066, -1164, -1507, 184, 312, 399, 1256, 205, -1613, -1429, 922, 1472, 706, 8, -988, -961, 501, 1006, 1267, 395, -1703, -1574, 487, 1417, 884, -24, -1007, -1557, -634, 1277, 1694, -32, -1723, -1690, -82, 1101, 1145, 626, -1171, -2132, -422, 1533, 1706, 414, -1251, -1378, -318, 1048, 1707, 1026, -788, -2091, -962, 1769, 1835, 146, -618, -1777, -1570, 674, 1919, 803, -720, -2202, -1401, 823, 1805, 891, -726, -1428, -1653, 27, 2818, 1852, -808, -1674, -916, 263, 2011, 1741, 203, -1729, -1770, 226, 2024, 1947, -377, -1805, -1514, -273, 1049, 1990, 319, -1970, -2338, -417, 1580, 1456, 111, -1245, -1864, -849, 1151, 1955, 862, -1633, -1949, -422, 1338, 1681, 978, -606, -1825, -1009, 1073, 2418, 998]
2799I98j945r67R43J620R51l89j784j594Q94K072J069o28j730j474N37J700J301
2816A574o8j654j712K24J992J331l27j012j339q99J858J954j4j889j523kJ439
2833f7J148J95o71j614r32J184K348K8j716r13k98K75J678Q85q39j602q94J147
2851f58J663N31j044r71m03r1J371J630r26k028l22O81R95R40n62j210n83j59
2869a146J043J602m97j683m81N48M15Q73N72j430r47J27Q25J358J8j360n74K40
2887d97P6J043J023j132j601K87J173K29L38l19j248m7J30N40J231o28j793L51
2905h44P88P4K82M96r50j011M96P44N69k63q14m48R25L8K39Q14p89j301N38R51
2925E34j4l04j28l82j65M04K65M09m45r89M49P29k86k33M45o48k61K14N85m8m2
$$ y = [998, -947, -1914, -971, 649, 1600, 1211, -573, -2167, -1273, 799, 1868, 1240, -490, -1964, -1427, 273, 1574, 1506, -148, -1860, -1636, 356, 1687, 1360, 348, -991, -1890, -32, 1922, 1908, 19, -1504, -1506, -67, 1081, 1276, 605, -1009, -1941, -757, 1591, 1619, -97, -1010, -1308, -1033, 645, 1530, 691, -911, -1805, -658, 1005, 1536, 492, -479, -882, -973, 398, 2028, 1102, -926, -1248, -567, 428, 1368, 806, -404, -987, -1146, -103, 1499, 1002, -681, -1162, -614, -199, 674, 1246, -184, -1131, -1004, -179, 1179, 1197, -163, -737, -497, -421, 622, 1645, 513, -1088, -801, 372, 601, 939, 620, -628, -675, -545, -5, 1226, 598, -1195, -844, -56, 18, 300, 796, -154, -1165, -669, 75, 644, 381, -433, -881, 44, 82, 321, 1135, 346, -955, -417, 534, 520, 216, 88, -294, -459, -55, 210, 619, 174, -815, -366, 363, 77, -156, 289, -359, -620, -406, 179, 131, 89]
2946H9m57L12M41m60M6Q46m52r61M68O69n88P7K30l23J72j63J08L36q3o91J74
2967b10L90n58l5P71k56o95N23K20k11J00K4J6k4m68M99L62k78l63l7K52M2J05
2989A69L44j13o93m25P07N36m24m34L43m91k74R79L69m43p46PK75L23L29q0m79
3010b21p2k79M27J218k71j316K88J36J70N54L13o90q49L0P28M01J4o94n13K6M19
3031a81N46L24n00j143J38N75O85r9j32m47p58N62J261J15q87l14l21K14N08R16
3051A062m90q62l36K94P83O71o95r28O8j74K62J146R7j415p79Q94N26J87L54q17
3071a52r98L99Q53N20L76j116r56M83P81M83r1k3j144n45J346R32o71m60l34m26
3091g43L58Q66M69n73j091r6N84P32J24o71n90M9j30R67P79n16j313q0R48L16
$$ y = [89, -368, -56, 385, -75, -29, 817, 365, -596, -128, 541, -47, 30, 260, -63, 109, -54, 54, 390, 307, -384, -210, 180, -378, -413, 358, 102, -593, -70, 150, -61, 39, 63, 79, 55, -413, 86, 448, 170, -193, -230, 22, 64, 169, 513, 400, -293, -718, -11, 525, 101, -333, 10, -481, -755, 224, 593, 150, -596, -589, -314, 9, 338, 258, -221, -293, -572, -145, 1073, 802, -514, -226, -90, 80, 634, 947, 257, -592, -562, 166, 567, 581, -113, -626, -600, -181, 365, 689, 189, -954, -816, -241, 444, 345, 213, -234, -992, -430, 831, 946, 59, -255, -576, -362, 146, 1062, 572, -290, -626, -332, 451, 1122, 427, -501, -433, -607, -345, 801, 898, -517, -1296, -402, 124, 311, 665, -152, -1150, -751, 102, 622, 998, -118, -1074, -591, 190, 673, 582, 559, -585, -1130, 216, 1148, 477, 17, -317, -743, -385, 481, 950, 377, -714, -810, -226, 506, 630, -41, -631, -582, -712, 255, 1034, 518, -795, -875, 73, 389]
3111C89r6O33j066q34N21R11O51m96p37l80J25P78J49jm62q60k18J485M08r39
3131c9j49n8m91M70Q80L7q56l68J53L28P91k78n88K49n01j00J194P05j476m75
3151e72M12K86k28M64L72j164k73L25P93L36p07p59M09L41l60M88L52n77q58O98
3171b22P69j30m40N7M2l15K10M54L11q89l91M29N32j27k15m4j58l87L56O36k7
3192D51r38k68Q57R2n73O88K33j164K2O80L39k45k07r5j14M01m80M61N28q72n56
3213g60R57O66j239K04P23q07j97M96K37L6n52j85M61J00l58p5O09n12o20R58
3233A42L03o09j81L87M0P7l50M70J31n78l41Q22J52o32j2N01j43n25M69L9K3k60
3255g5m10N73L52r87J72R12o50m16O81M14p67r5M05l08J23J70k86M92n4o95N20
$$ y = [389, 293, 926, -140, -974, -453, 458, 1109, 613, -124, -504, -379, 399, 548, 547, 85, -775, -993, 492, 900, -39, -188, -246, -737, -267, 613, 650, -206, -574, -421, -93, 698, 420, -168, 81, -420, -520, 674, 1379, -97, -572, -160, 126, -102, 362, 734, -430, -703, -378, 415, 751, 44, -715, -306, 35, -325, 163, 515, -62, -920, -222, 547, 417, -23, 34, 76, -239, -29, 425, 736, -153, -544, -115, 417, 290, 75, 31, -127, -514, -158, 478, 451, -487, -755, 102, 194, -379, 309, 542, -622, -600, 80, 419, 174, -33, -128, -242, 159, -321, 140, 668, -204, -760, 197, 863, -376, -172, 551, -256, -453, 43, 280, 316, -236, -421, 40, 140, -218, -293, 316, -196, -816, 142, 445, -164, -345, 42, 82, 159, -191, 279, 410, -168, -509, 313, 465, -167, -179, 322, 179, -346, 123, 162, 185, -75, -485, 88, 440, -547, -375, 537, -113, -529, 152, 566, -201, -296, 109, -199, -76, 94, -192, 300, 246, -449, 71]
3276G1P99j017j77P43m10l12M75l8k78J45k4j52L53k34l56N87q5p36O94N60j045
3297d37O4K52K25j30m2J82k26J58j65K97M97p52k93O88j28m16N54J75p55K57k5
3318b0N9L06j90n05K34K26m56K93M71q89j91P19p3mL49m82k73M58J34O6K12m53
3340in14L45N44k13N2p8n47P7O16j08J15k28n31J92L96O5K8j41m40k21N42M36
3362C78m28j7j89m69P59N78m04K3n76j05O12K38J4j42o19l29N15O80J12p54J6
3383a07l39L6Q50R5l35o32l77L31R34J88n22m47ol57Q04R25m37r90k08L37O29
3404C72N18l92o30n03O1Q35Q01n25r41l25M32J27O29N25r39j068J28J103N04j41
3424E71p92n18j00P00O75M07o59j426K66J137M08k0k95p82n48N56J312L47j034
$$ y = [71, 870, -147, -324, 419, 9, -303, 172, 134, -144, 1, -23, -175, 178, -56, -412, 175, 90, -646, 48, 608, -437, -373, -121, 104, -26, -68, 114, -112, 46, -119, 178, 675, -77, -370, 318, 190, -226, 328, 503, -252, 5, -20, 39, 345, 155, -350, -116, 110, -346, -53, 418, -471, -662, 57, -16, -20, 329, -153, -426, 32, 166, 232, 444, -9, -523, -178, 366, 153, 205, 127, -420, -343, 273, 165, 280, 52, -479, -287, 109, 174, 202, 61, -379, -600, -58, 378, -50, -67, -256, -725, 34, 612, 208, 231, -345, -450, 162, 400, 414, 272, -347, -676, -161, 519, 631, -123, -107, -446, -410, 440, 535, 200, -432, -809, -478, 456, 644, 122, -325, -331, -688, 116, 1041, 604, -386, -594, -257, 372, 890, 498, -132, -635, -574, 261, 1062, 537, -404, -729, -297, -170, 459, 984, 45, -1023, -895, 208, 712, 571, -221, -739, -839, -139, 536, 943, 284, -1142, -876, 261, 669, 649, 354, -428, -976, -420, 892, 1239, 205]
3443B05j112o4Q16Q21J13l10p57j144P23J475M81j026j074j81N52N82P62O7j482
3462e53r71Q41J468N63r46o98l90r0P69J321k2j549j313R15J321K93m14n26p64
3481g45m27O93J836K4j958p42N05Q71P40k4o85r31n26R48J873l3j617j089O56
3500f31N43N44J157p32j920n57J185J469K18j050r94m1L25R75R01m09j859q69
3518a745J411J341k63k38p57q86jJ353J250o47j735l28R24P62N54k35o87j177
3536a104m7J540J050n62j533l00O31L48M75P35j036j567M6J642R00n11r11p39
3554i43M6M24R74O86q07j757L8J651O32n49P8o47p82L80J176Q07j169r87o3Q43
3574C1M95k3k5o43q05J52J509N68j069p86m4K79M44K69M14q92j040M87J088N17
$$ y = [205, -907, -971, -155, 666, 779, 469, -288, -1432, -709, 766, 1247, 221, -853, -1034, -482, 100, 862, 929, -553, -1524, -683, 785, 1348, 402, -296, -686, -776, -7, 1314, 1292, -257, -1570, -655, 666, 959, 545, 19, -745, -1172, -479, 1357, 1381, -577, -1319, -814, 57, 797, 773, 88, -843, -1369, -421, 1452, 1419, -198, -1287, -631, -88, 456, 1613, 881, -1039, -1596, -411, 1058, 1276, 226, -768, -809, -484, 491, 1392, 983, -876, -1745, -334, 1007, 744, 506, -251, -1137, -1138, 215, 1465, 818, -917, -1245, -321, 441, 995, 760, 73, -1104, -1151, 389, 1439, 877, -656, -956, -325, 23, 498, 1233, 197, -1370, -1324, 318, 1218, 707, -204, -943, -897, -473, 501, 1187, 380, -1377, -1339, 312, 944, 395, 473, -174, -956, -576, 600, 1407, 238, -749, -812, 31, 526, 503, 478, -165, -970, -818, 691, 1259, 190, -596, -640, -361, 83, 352, 766, -126, -1166, -679, 409, 926]
3594I26m47p32j21l0L14N20M50n26j257J91J367k25k94P9m63m10M89N97K46p77
3614a03k25n9K58L66k40J88k07o17L98O88O8o15j00L10k46KJ75L20m53l04L28
3635f8J21R5j03l6K52m13k34M30J15p7m39J39M66n98J50N19j23n82J73K87j23
3656d9J60rj65L8P0j44K65N57o95l39M58j49o4L26P8m63m01L11J52M20rm75l18
3679d45L12m7K55M68q00m39J25N58O11r6n49m71J7M37N45K62n07p69j22N11O44
3700E00L93p48q01J26J29Q22N14p17p56k93O92L78K56m6q54m20L66O08Q37j03
3720H83j438n54Q17N01L65K97p87j257M50J283N46k67q91p62J2J078M22J00o14
3739A84j305k70J691R15m74p27p10l65O90J224J66p86j314l72J403J122l29m79
$$ y = [926, 479, -253, -374, -404, -90, 430, 880, 354, -903, -712, 655, 430, 136, 215, -248, -658, -169, 428, 674, -103, -328, -387, -129, 237, -3, 185, -22, -639, -241, 447, 515, -100, -200, 110, -136, -134, 41, 361, -92, -396, -68, 53, 148, 45, 9, 261, -152, -386, 44, 159, 82, -357, -218, 248, -350, -200, 319, 196, -386, -213, 74, -49, 111, 102, -63, -25, 45, -99, 166, 723, 28, -311, 147, -2, -66, 260, 338, -125, -526, -215, -63, 357, 348, -127, -445, -133, -180, 75, 543, -257, -696, -571, -13, 598, 502, -47, -518, -501, -64, 481, 743, 236, -533, -655, -144, 500, 893, 145, -656, -530, -401, 421, 935, 218, -538, -831, -139, 239, 495, 449, -405, -825, -459, 149, 986, 883, -555, -1109, -292, 209, 574, 871, 84, -1173, -723, 560, 1106, 839, -52, -814, -802, 276, 698, 798, 184, -1121, -1391, 300, 1215, 741, 14, -696, -1061, -371, 853, 1019, 233, -1081, -1453, -50, 1072, 743, 264]
3757B64p27p93P17J547O49j226j510j41Q44J142K69m39j055q57J78K071O55j375
3775B13r29k60K52J180M74lj259j400M83J791J204j301r28l17j24O13J877n8j799
3794b91j163K21J804Q29m73j104n97l62O75J677M03j704j639P24J191P51M5o54
3812C33j104o29P53J927N40j659j321O0J057N49N07j4j724r83J383J487L65j250
3830B77r54k73M31P16J058j16k009r48J161J671L8p37m97p39j91J151J308j12
3848A235j942j075J129J280K95k46n41j053n64J569J627n32j567n73K46Q51N67
3865G06N5j49j449p78J477J567m95j309k07o8J15J090M75o28j237n58J166J496
3883A269o01o20l85k82J0J018Q97o60j585%R15N67N2l86k86n79k23J226R20p98
$$ y = [264, -463, -1256, -539, 1008, 1657, 431, -1079, -1220, -376, 766, 1035, 596, -459, -1316, -1138, 933, 1588, 213, -716, -976, -724, 456, 930, 927, -332, -1732, -1249, 542, 1746, 445, -483, -800, -924, -311, 1566, 1508, -291, -1454, -1233, 571, 1400, 927, -177, -774, -1136, -461, 1216, 1619, -85, -1724, -1000, 191, 942, 987, 333, -771, -1400, -647, 1280, 1820, 161, -1160, -1100, -43, 506, 1013, 999, -725, -1708, -325, 1162, 1527, 277, -677, -950, -519, 197, 1255, 1139, -870, -1818, -657, 1014, 1052, 315, -182, -921, -1112, 39, 1347, 1235, -707, -1782, -653, 627, 922, 676, 135, -918, -1482, 87, 1714, 1182, -385, -958, -712, 139, 706, 761, 612, -837, -1615, -138, 1429, 934, -375, -582, -650, -535, 555, 1030, 402, -835, -1393, -227, 1269, 668, 48, -337, -619, -609, 409, 1306, 646, -939, -939, -24, 543, 595, 209, -77, -656, -879, 347, 1267, 469]
3903D69j254j52P37K83J10K95l54j010K5J019N52k74r12Q2K90n0N84K65n57q28
3923f80n9Q96P02n92n16N1j36J65L63O25o08j156K30J113j21j15j98j52l14K65
3943b37N51L06n86n16K96L90j90M8L87l59o65L12O70P7l56m54K94K74n7j03L83
3964D65k41o93P4P54j81k25R6p0j56M8K71K41k58n46K25L55n6j74K40l9l41OM62
3987B57J83l03m04K30K77k19k14M96K5m89o9L18L6k87L0N4j38P9mO7P3l1l07N18
4011A78K1m31J80K20j83j90K64j06J97k17J26j16J07l3Q4P3n2m06K06K03l9j30
4033d4l59L73J51k76J00K57l4n18K96J72O7k16J5j9j30j05L17L55l88k98J71K37
4055A24j13o2J89m6l54J4M60J7j71k93L2L09j53j17L27j61m03J1L85L58m34K3
$$ y = [469, -785, -937, -200, 83, 193, 488, 134, -876, -851, 168, 720, 446, -466, -384, -94, -144, 440, 705, 148, -680, -739, 157, 859, 267, -249, -198, -334, -169, 194, 819, 211, -945, -715, 398, 277, 162, -36, -188, -502, -237, 314, 620, 34, -482, -186, 204, 14, 62, 449, 90, -575, -263, 407, 484, 128, -326, -32, 242, 185, 82, 465, 224, -469, -395, 359, 178, -47, 49, -21, -177, -129, 142, 383, 125, -421, -196, 159, 103, -71, 169, 130, -211, -205, 257, 440, 137, -267, -37, 240, 21, -193, 303, 328, -161, -230, 88, 124, -163, -133, -79, -217, -138, -142, -75, -2, -33, -340, 178, 199, -232, -52, 168, -15, -205, 59, -47, 150, -67, 59, -57, 50, 17, 101, 174, 122, -284, -78, 125, 86, -44, -403, -30, 121, -155, -55, 202, 168, -350, -54, 118, 185, -31, -16, -35, -165, -270, 47, 402, 14, -284, -113, 124, 11, -51, 138, 92, -262, -248, 212, 229, 58, -235, -203, 106, -47, -164, 163, 2, -401, -390, -5, 353, -81, -58]
4077e8M07m01j48K32K86k67m33J43M58J2k65M2J59k76j62K61M93o31l81O62K23
4098C56k56l66L55O9o28K21O57M5o79k12M24M25m39l68P33j48o63J69Q91l22o43
4119c79K13M91j52m10L81j02n3n00L94O26m59m80L94M00l85k96M58K23p82j78
4139e96P54J46n33k35L31K73l48K93M72k30o79J11O82Jo88K95K79m31l21N24M63
4160E63m47p93N21P58o19k89L19P7m57l3O46N05r64m30M18N98l07j90N87l20r73
4181h30N03R68r9r50j37M21M46l48kM19o16n62M33J074k55r58K23L54l50J50N67
4202D51L4n99o44O63P78m16n65J92J23m92K33Q98J01j308j42Q26L41m02k09M09
4222B72l54p06O60R13l05j045l6P90q4l2J37l5n11l20N15J040n28q78J42O14l85
$$ y = [-58, 349, -52, -200, 32, 318, 51, -382, -239, 219, 231, -34, 8, 167, -109, -271, -10, 483, -148, -529, 133, 356, 100, -266, 89, 158, -470, -249, 408, 453, -226, -438, -14, 411, -28, -396, 337, 189, -474, -305, 586, 264, -379, -166, 325, 173, -237, 144, 42, -11, -511, -117, 509, 50, -430, -36, 364, -21, -317, 141, 364, -418, -596, 158, 304, -229, -464, -133, 140, -208, 85, 557, 327, -352, -241, 441, 442, -246, 49, 328, -103, -424, 100, 563, 116, -677, -156, 602, -17, -306, 13, 90, -367, -400, 246, 751, -213, -643, -225, 373, 66, -124, 463, 143, -830, -327, 641, 542, -408, -545, -124, 322, -26, -28, 391, -225, -787, -354, 720, 465, -493, -270, 84, -266, -116, 451, 485, -114, -758, -95, 683, 267, -298, -106, 17, -475, -242, 656, 757, -551, -693, 133, 474, 72, -137, 272, -82, -788, -128, 785, 480, -565, -601, 189, 105, 73, 210, 175, -336, -656, -141, 899, 371, -507, -365, 249, -136]
4243a36L19M40k29p67l62Q21M35k42o34j28M61j90K27O35l03j129L82N50J67l96
4263g9L2R4m13N3M36M70l91o83P1P46j84j56J83j35l81p9O11M57p39m24M71J05
4285F5j43K0K26ko70o4Q17J59m87l14L81K2k8o1L98j85n56J42N91Q4o28J95J41
4308A03l02J8L74N3Ko71K92K87j16j07K8K72j35l43K03L29l71j97L02k7J5j45
4330a36P8K60k21k40J96K65l60J62J02J29m81k8M59K1j47r3l1J46j76K04K99m17
4352il64J58K87J67j94K1k11J12q0M5L50K2o25k68O90R7k18J4Ol06j27N06O92
4375G65n21o17mK94O11k69j09J19o91j50R47M03n12m03k48K56J61K89L83o74o61
4396f31j45R62O66n81l54n1l08K97N36M27o01j038l7J023N95k93n04j97l20k6
$$ y = [-136, 183, 623, 394, -373, -735, 86, 521, 279, -355, -483, -22, -212, 15, 650, 347, -782, -400, 150, 317, -79, -47, 47, -366, -313, 123, 593, 202, -481, -410, 336, 152, -4, 179, 44, -337, -416, 195, 652, -87, -511, -40, 65, -78, -58, 168, 166, -504, -568, 249, 408, -79, -393, -12, 10, -18, -79, 319, 134, -422, -280, 311, 395, -233, -38, 103, -199, -181, 193, 246, 248, -423, -131, 156, 40, -67, -39, 233, 98, -245, -42, 287, -84, -281, 21, -6, 9, -136, -58, 202, -19, -259, -63, 202, -158, 4, 106, 235, -246, -274, 185, 206, 59, -34, -65, 81, -95, 109, 408, -9, -373, -215, 72, 239, 45, 66, -145, -33, -113, -68, 282, 304, -321, -589, 101, 198, -20, -6, 0, -306, -433, 73, 765, 244, -373, -377, -83, 528, 259, 150, 269, -422, -572, 375, 778, 266, -137, -385, -129, 32, 321, 704, 30, -631, -776, 186, 852, 271, -83, -134, -442, -145, 391, 818, 217, -821, -858, 165, 760, 467, -37, -234, -554, -580]
4416e80J153O85j146r52J77M96P85j07j75m68p69K89J164R13j069j358J83N76
4434b03L96L84J61q20j100L01J483Q00r62r76J10m6M84P84L21j291j207N10J335
4453D64N94m70q49j44j58K65J203L19j308j197M39J203L81m3m69o82p95R75J209
4472I37M19j168j337L19P04N87L73l7j350r66R48J562K76j114r04L9N01L17O71
4491G77K22j479j139J057J685P9q23p87m07K7Q68J237k19j555j073P00J470J83
4509H23k50l88p95n66R49J549k16j563r84R55P68M90j74l07j113p30J151J628
4527A227p4j557n20K48N88M49O50n02j277n57J178J326j04j076o09L1N1P28J206
4546A406o36j698l45J087R54R2o94n45m50O5Q67J330o34j630m25R35P72K34j53
$$ y = [-580, 573, 1258, 112, -840, -663, -167, 618, 511, 336, -132, -901, -612, 552, 1465, 396, -962, -779, -203, 193, 577, 738, -82, -1182, -881, 602, 1402, 440, -536, -426, -472, 12, 796, 1117, -174, -1381, -871, 464, 1058, 588, -261, -405, -563, -298, 905, 1224, -84, -1281, -842, 361, 742, 699, 230, -452, -1247, -272, 937, 1356, 188, -1149, -830, -126, 461, 834, 797, -553, -1519, -571, 991, 1267, 153, -751, -712, -211, 106, 777, 999, -480, -1619, -562, 1123, 1202, 379, -408, -815, -788, 80, 1317, 1098, -457, -1530, -830, 640, 823, 573, 185, -610, -1176, -227, 1322, 1106, -457, -1441, -486, 282, 772, 598, 291, -822, -1552, -401, 1227, 1153, -404, -924, -676, -88, 361, 1011, 509, -768, -1325, -147, 1179, 1075, -1, -610, -579, -528, 200, 1406, 770, -928, -1273, -186, 768, 860, 166, -379, -829, -764, 103, 1433, 799, -831, -1256, -321, 451, 685, 532]
4565E32n47p80j57J037J248o54j342k9K99M80N35J11l48j151l25J128J042m68
4583F11r74k33K18K85N08O06q63j288K48J069P12l60n70l30k80J76P78P29o49
4602C93j190j34J062M87k74j56k09n63j11J122N48p15p13p5J41O20rR0k91o93
4622f70J17Q75L39m17n41j48P01k19K31K25k91p81L46N29K03l89k34r4n8J38L84
4643B46K11l22q03J73P68J53m40J9j36j05J54M43q2m10j43M4L78N5k68J69n8j90
4665a44j26N18J44l09l01J61K63k75qL30q3m38R7K88J8l01O8J60n3k53p9K74K40
4688A91l49N6L39k76k32K43L26j18l74l7K01J77p5M5p1j95j91L03N64l53l41k80
4710d47N07o0J7K25r4m66k53O95M45k49n67Q4J11j61K80M82l55o31k43P77M35
$$ y = [532, -15, -795, -952, 85, 1333, 679, -663, -692, -393, 87, 622, 733, 385, -766, -1091, 37, 1079, 611, -363, -596, -378, -93, 415, 1021, 158, -1130, -882, 187, 899, 539, -31, -361, -641, -465, 313, 1042, 393, -797, -931, 131, 618, 344, 188, -21, -584, -695, 427, 975, 260, -453, -528, -387, 233, 224, 314, 23, -670, -553, 322, 661, 244, -297, -445, 256, 37, 268, 493, 202, -579, -233, 296, 499, 110, -124, -218, -276, -138, 246, 457, 135, -668, -495, 273, 426, -14, 5, -131, -236, -82, 361, 279, -131, -274, -230, 148, 203, -65, 104, 46, -144, -270, 248, 392, 83, -218, -57, 206, -69, -77, 253, 170, -268, -171, 117, 135, -166, -98, 62, 9, -244, -323, -49, 191, -158, -102, 237, -39, -271, -28, 298, 180, -194, -231, -30, 147, 72, 117, 46, -149, -340, -37, 527, 174, -167, -447, 60, 0, 17, 242, 148, -318, -571, 124, 569, 320, -247, -163, -52, -213, 67, 549, 194, -437, -680, 97, 532]
4731E32l08j71k16k59R5L15N84k29q72r9N74M72j55l30J82n53j92P92M95l58q27
4752e28N8N07K36j47K87l10o09l17R53O46m93p08j9L89J16K53K28l25r07J0J054
4773C74K59n25k98o5j7n3O85M79o58j053K62Q79M35n23k68P3m61O9Q85M11p65
4794A25p07Q6Q56qk52J13j81q62M49R84L66j012o39N04L27j76M30R1m32r05L21
4815e22J203J01q65k48J47j5M0L75M72o63q13L84Q89j8m87l10J94k73k0Q93M33
4836H97j143p98R07N34j32k18K39m03k72K5Q56K42j015l45N21L59k10J16J86l52
4856fj008Q95O64r8n66k45K69J99k21M69K07p69o32Q37O69j78o58m8K30l41K12
4877a19M73J25q59j83O80N74p81N8L9n7l66L92M99k69m41j63N08K60l10j7K71
$$ y = [532, 224, 53, -163, -422, -327, -12, 572, 343, -529, -628, -54, 418, 263, -67, 115, -438, -630, 162, 657, 299, -528, -470, 37, 273, 126, 413, 103, -506, -823, 130, 776, 283, -425, -444, -55, 61, 314, 542, 217, -690, -680, 374, 633, 108, -190, -255, -272, -325, 360, 839, 181, -872, -610, 269, 704, 181, -87, -14, -475, -406, 479, 890, 125, -582, -496, 360, 352, 100, 213, 32, -830, -381, 603, 969, -43, -682, -178, 149, -27, 403, 494, 62, -843, -522, 681, 782, -83, -331, -184, -199, -159, 216, 688, 25, -788, -404, 485, 467, -20, -330, -136, -409, -429, 464, 897, -246, -1044, -137, 397, 265, 47, 286, -117, -389, -364, 492, 734, -281, -626, -105, 254, 44, 160, 346, -6, -1014, -119, 545, 447, -119, -364, -95, 104, -117, 352, 559, -210, -842, -5, 664, 486, -172, -220, 10, -331, -119, 354, 479, -380, -563, 117, 691, -90, -32, 7, -50, -416, -24, 475, 206, -235, -398, 110, 370, 60, 43, 314]
4898C14n21l41N67M63m47l55pM37Q0l56L58J36o80k0M36L31l64l46L73Q9j86J74
4920A35J57j11n35J9N95J66n67k02M55Q0m44J94N27m90n00M82K94j02l73L0K67
4941G7k07k14O32M3l60k57L25L67n61QL41k09j36Q2J77J66l17q4J57K06k85j40
4963a89K57L0l52O1L94j0k58j59K80J66k21j8J00r4k92K18M03j32l01L3K31j52
4985ej70K49J69l31k45J88L99l40j94K56J68k61J2K81k68o2j46K37K67k22j20
5006a38K7K33k53n7K81k50n6J17K35J79k60j65J53J64m43J65N79n34O0j56K75
5027A56Q2l46j6J91p5j14m3M70k19l95J75J97r2k09K06L01k18k28J70K0N6l29
5049b60K24K82m78q4M16K86k59l41R5M19l31j72N17j48l40j34N32R7m11PJ49j03
$$ y = [314, -207, -548, 19, 482, 35, -320, -327, 110, 190, -166, 192, 328, -352, -372, 64, 395, 31, -315, 58, 147, -39, 135, 292, 181, -354, -335, 260, 426, -141, -343, 112, 192, -252, -58, 469, -21, -521, -39, 255, 153, -220, -190, 77, -130, -344, 288, 331, -29, -286, 39, 406, -155, -147, 194, -15, -151, -69, 108, 274, -43, -127, 30, 236, -49, -189, 68, 98, -254, -193, 201, 191, -67, -226, 54, 220, -1, -19, 81, -13, -305, -87, 316, 184, -117, -84, 147, -5, -175, 74, 243, -88, -333, -145, 254, -86, -280, -24, 144, -117, -105, 176, -92, -154, -300, -63, 204, -18, -138, -111, 122, -131, -188, 93, -157, -213, -96, 139, 318, 58, -107, 46, 210, -233, -68, 511, -23, 37, -119, 156, 238, -108, -124, 67, -8, -122, -165, 305, 86, -309, -134, 63, -29, -238, -32, 269, 51, -177, -7, 13, 69, -260, -36, 246, -232, -316, 100, 386, 127, -214, -119, 300, -31, -203, 314, 166, -174, -308, 224, 321, -90, -83, 66, -37]
5071c7l53N18K23k21o08J53N60p8j43N3J80m15q3M63L19l99n52K96J44O5j54J88
5093A19P8m90r2O77J20k92n86K93K91k70K59K85k58o25N6P58K01l42n96L98Rk76
5115b83M64N08o64o34K68O86J2k97R3k44j64n8O58L17q28m57L54M92P7k50L9j66
5137g7l46J03P77J74q72k23L20R0j40M87j8k48p94L85R10m7o37l5J33j69J20N01
5159C94K58r10o14P08P13j92l80k22M1k27L07P02J73j101n23P41O60k7n22K7k51
5180b45m98O01Q88m4r63l12M60L57k4K64k58o70m01O68R25k15p07l36P6K22M26
5201B14L19j2j042m09Q77P06k14n10k79k85L50M63N39j74j093j89O61O35k19l40
5221bk0n54j1Q76O78n91r20k62P72K49k1K34l67m61j37P82P60o17r03P2K62K09
$$ y = [-37, -390, 128, 351, 130, -478, -325, 235, 157, 14, 67, 247, -168, -251, 212, 531, 132, -420, -124, 20, 85, -69, 119, 197, -293, -385, 292, 412, 120, -466, -173, 118, -152, 107, 392, 134, -491, -435, 323, 524, 182, -414, -16, -7, -283, 181, 689, 25, -609, -341, 345, 357, 60, 153, -91, -255, -313, 345, 662, -166, -623, -269, 223, 300, 50, 89, -77, -423, -320, 457, 631, -241, -464, -144, -54, -194, 293, 275, 27, -767, -382, 528, 481, -156, -191, -58, -227, -107, 394, 652, -258, -872, -164, 549, 357, -23, -245, -204, -431, -124, 578, 751, -350, -873, -132, 528, 501, -21, 6, -245, -743, -142, 746, 702, -261, -573, -113, 244, 220, 484, 226, -444, -845, -177, 748, 533, -174, -510, -434, -212, 214, 533, 521, -521, -930, -53, 653, 439, -71, -350, -635, -285, 178, 717, 543, -550, -739, -78, 557, 338, -2, -22, -576, -587, 289, 967, 376, -544, -806, -34, 215, 194, 428, 61, -400, -537, 245, 1005, 388, -515, -443, -181, 28]
5243B8J92K62m07o28o4Q43N52o37l94j35J03J40L61M78m57r77J55O09M62j71l73
5264e8k31j20J08O06M19o06n37r2L95M98p5M8m01m70J42N73N83o32n43Q5J20M17
5286B29k4J31m82m26JP18J86j71m59k0J91OL85L9j38o20R7O18M8k88k57J18m1
5309a59Q9L33J18k75n69K8N27Q8j23J29r3j72j11M68J61m74k77Q8L55L4k63J90
5331I2j6l25P7M00l9k15l25K14K69j49O2N7j8j22k92L65K30m47M1J65J30k50J98
5354A02k8j4k29K42K1j4j57QK12K6l92K06J99j40k10J78J22k55l0K77M1r1k77
5377b03M7L37j87r4J45J37m23p2M68J69k20m8j30K7l7L7K31m5n11O0K76L74j55
5400A83m9M7m26N3K93K72pp76L9M10P5n6K9j64k53r7O22K04k59m46r7L32m2J05
$$ y = [28, 220, 482, 75, -553, -617, 226, 778, 141, -253, -388, -285, -145, 216, 694, 237, -740, -585, 24, 486, 315, -58, -289, -409, -301, 305, 724, 118, -419, -511, -116, 382, 307, 355, -46, -516, -374, 199, 782, 150, -393, -308, -188, 229, 205, 336, -146, -572, -571, 147, 333, 162, -297, -317, -126, -120, 265, 304, 166, -454, -357, 261, 309, 21, -236, -118, -159, -70, 263, 381, 106, -463, -435, 92, 180, 57, 186, 93, -79, -190, 278, 439, -35, -312, -224, 131, 165, -98, 92, 76, -249, -172, 228, 189, -26, -351, -137, 132, -17, 45, 102, 84, -38, -330, 35, 265, -182, -141, 24, 154, -96, 102, 74, 60, -169, 73, 94, 80, -77, -69, 143, 169, -223, -17, 182, 42, -168, 10, 132, -123, -153, 124, 165, 74, -203, -156, 181, -6, -100, 45, 182, -241, -313, 155, 324, 104, 56, -74, -47, -84, -47, 184, 139, -372, -312, -36, 338, 183, 134, 181, -245, -192, 101, 373, 366, -410, -371, 39, 114, 58, 87, -77, -330, -427, 195, 399, 140, -306, -403, -71, -113, -8]
5424hL08j55m95j12O07L82m85k00j7oK30J04L14l41o88P2P77J73l23r4j05k57
5446c19O4O65K64n80p55J09Q04K87k96k10N3n10J95M63M83o84m84R6L86K19r5
5467A55L4k18o42L80O00M11p25m65L63L6m7O35j12o08m48K13Q12J81l87m72J68
5488a36j32K08M99J57p14n06J97Q73m9k79n1l43k90L63P02R4n87o75L65O51k84
5509F3L4K7l70l61N34O59L6o36m35K70L74k01M26j53n75m83N72O71l6n32k41P5
5531b82J84J14N34j49p59k49L34P24o5k76o3l77o5N93M41k13p29l29M18M90j63
5552A13R7j8k83l81N78M87k73n73k05K78L95j05L02r2o29l54N92N56j68l48k04
5573b35K9l9L54K50l40o62L9P35K46m2l22j06r8m7K33L55k45l19j79M55L81k24
$$ y = [-8, 300, 145, -350, -462, 145, 527, 42, -158, -175, -181, 49, 153, 467, 126, -562, -490, 287, 460, 137, 43, -62, -319, -255, 410, 674, 94, -661, -552, 252, 539, 243, 33, 86, -424, -229, 234, 717, 33, -451, -355, 31, 250, 155, 189, -29, -671, -291, 309, 720, -5, -470, -107, -71, -118, 517, 405, -203, -651, -438, 374, 555, 168, -304, -136, -268, -60, 439, 596, -118, -624, -427, 446, 397, 118, 67, -276, -566, -203, 499, 593, 6, -669, -304, 347, 63, 97, 124, -246, -607, -73, 586, 622, -14, -449, -179, 195, -6, 420, 267, -308, -791, -219, 452, 416, -116, -357, -282, -98, 16, 550, 401, -358, -607, -273, 451, 386, 110, 47, -330, -395, 198, 639, 426, -303, -632, -214, 276, 113, 210, 192, -91, -472, 106, 593, 320, -253, -458, -180, 215, 110, 412, 320, -309, -663, -71, 485, 317, -31, -235, -206, -245, 109, 359, 19, -643, -604, 131, 377, 335, 13, -93, -191, -238, -5, 350, 105, -214, -393, 62, 443, 219]
5595B19j99M2l83O4M64K58l37l16j70L62L84l52l4J12l77K6L44J85j36n27J97
5616a74J46O0k6L76l36l24m0L99K06j76j83n2J64j2J25J03j48k68M0L93J8l38
5638d7Rj2n8L2l8L74l94k01J08M02j67k05J64Oj87J05J27J34j71j53j9K56P7k49
5662a07J81j16n5J15O4N8j05k8j39K96k05J03J56j02k86J17L12k95k2n0k9R9n8
5685i6k15M79k09j10Q9P8N4k87q8L56J75l25LJ03K4p8oL04l11k32K96N1L8k06
5709a13K26J13l67jj3K61l23Q5J54J90j85p3o8L03l38lL51l2k03j16K20q6k3J82
5733A41o4m0q3J27J93k31j40L1K37r7j78P7J04m6l16K94J02l4j34l9J40j61j3
5756a30K97k4j90m0K69j16j12j18K14K2l3J7N9L9n14K20J94R4j72OK78o0k77L0
$$ y = [219, 20, 62, -321, -257, 207, 465, 128, -188, -358, 4, 388, 36, 2, 114, -263, -237, 107, 292, 156, -371, -174, -28, 32, 6, 382, 46, -278, -318, 81, 287, 111, -72, -124, 40, 28, 153, 256, 108, -160, -120, 273, 291, -47, -38, -50, -108, -76, -114, 260, -134, -335, -227, 175, 8, -197, -33, -27, -214, -109, 18, 152, -19, -172, -191, 65, 142, -107, 74, -42, -97, 18, 82, 140, 35, 7, -132, 164, -41, 62, 218, 116, -170, -53, 259, -36, -58, -108, -137, -38, -96, -311, 168, -41, -151, -62, 16, 70, -217, -305, 51, 226, -99, -96, 7, 31, -47, -53, 251, -60, -292, 4, 55, 93, -113, 113, 226, -141, -142, -155, 106, -217, -132, 22, 212, 27, -46, -114, 189, -149, -152, 199, 167, -36, -152, 68, -18, -41, 141, 77, 37, -46, 81, 274, 43, -97, -66, 171, 74, -104, -27, 77, 31, -285, 9, 111, 77, -57, -96, 44, -117, -130, 167, 143, -47, -87, 182, 66, -46, -164, 50, 72, 39, 56, 115, 154, -360, -140, 54, 148, -24, -18, 260, 200, -77, -47]
5780d7L34j88k87K10K94k66k01J50J16J2l04K19k7n8k11J76L14l47P7K71r6j60
5802a9j69L56j48j25M0J52J07l35o8K19K9k82J67K67j77j68J67K86k84r6J6K18
5824A53k47q5J73K00k90k93L72L06l94J09m0J12j48j8J55L21n70P8J69Q3k3l94
5846b71N27j08k73n6M60k60l04K00R7j55j8J09J57j76j60J31M20k83j86L09k6
5867A34r4J3lJ12l63n7L20L03l21k97L70j95m0K9K92q7k88o1K52kn8m0l2J15k78
5892b76L78Q4m0l81L5M68k81p7K1N3j70k01M47K37k68k85M39j04J16K0q3j53q3
5915a04p6K27K32k72j19R7lJ01J10j58q6k01Q5J51J06k02R8M2j51PL35o5k95o9
5939b10O0J77J94k91J06k02N4o6L93Jk03k67J60M4J99j17j4J01l62J31J63Kp8
$$ y = [-47, 287, 99, -188, 22, 316, 50, -151, -1, 115, 127, -177, 42, 15, -43, -254, -78, 236, -111, -34, 237, 141, -19, -188, 168, 20, -105, -65, 87, 194, -141, -209, 10, 39, -243, -76, 191, 14, -154, 13, 299, 15, -81, -65, 153, -94, -179, -6, 194, -96, -389, -17, 289, -105, 4, -36, 76, -72, -90, 65, 386, -184, -106, 63, 146, 123, -271, 256, 148, -125, -181, 279, 19, -285, -85, 12, -143, -161, -52, 105, -71, -231, -100, 320, 37, -149, 160, 134, 40, 53, 50, 162, -201, -258, 62, 365, 44, -253, 117, -78, -118, -89, 203, 116, -172, -233, 19, 17, -41, -81, -113, 2, -276, 102, 186, 146, -235, -200, 268, -13, -90, -69, -16, -186, -387, 60, 297, 29, -256, 183, 79, 195, 215, 132, -21, -104, -180, 47, 279, 7, -112, -15, -18, 83, 193, 35, -51, -252, -167, -16, 90, -112, -14, 28, -123, -116, 219, 154, -141, -210, -150, 27, 221, -70, 36, -166, -112, -178, 215, 216, 13, -254, -94, -50, 149, 32, 18, 119, -243, -112, 51, 53, -25]
5962b5k9k5j16K87O1Jk34j90J42J88J93l60n1K40k05RJ72P0j54j45R5O2J38j14
5986A0j91K09j61J9J52M9j66j14J24J52m5n6j33K53j59Q9J50k08Kp5l0J19Mn8
6010f4J19L7p2j14J25P2j36j65K04R3j35K1J59k8j02m6l3R4j81M7J3J29p6J05
6034F6J11k11L1J3P6j3j32P1Pm1m4J64q6O4k92L53m5k72J27O1M1m6j91K95l3k22
6060a48L1J76N0l85R4J43K03j82K8Q7q8j34L4M1J81k62oK74j45J4p6J71j90LJ73
6085H7J70j98j76J89J2j52j06L22j38j77J0L06J38l78M4K7Jo9J06K51k57p4j06
6108a68K94kr5O3k12K32j14K8K28l28k12O1M43j58n4M9j15j05nK55J76k78j61
6131a78J44P9j31K36m0j84k05J77L32m4k59j16J07l4K22J10j51k25l02L27L63
$$ y = [-25, -54, -79, -195, 92, 153, 154, -80, -270, -128, 60, 253, -107, -158, 82, -123, -114, 58, 128, -26, -171, -76, -14, 124, 10, -181, 28, -133, -114, 38, 87, -79, -193, -69, 83, 38, -18, -151, 102, -57, 32, 182, -26, -24, -99, -129, -10, -6, -64, 55, 92, 20, -94, 31, 103, -33, -198, 6, 99, -36, -15, 144, 116, 14, -32, -65, 29, -152, -105, -92, 37, -39, 66, 177, -34, -3, 10, 86, 73, -59, 12, 19, -22, -66, 98, 12, 76, -216, 137, 92, -180, -53, 8, 49, 3, -188, 107, 74, -148, -117, 59, 109, -276, -182, -39, 164, -18, 10, 97, 9, -125, -91, -50, 131, -131, -137, 137, -8, 6, -70, 101, -89, -86, 87, 257, 59, -117, 72, 84, -68, -174, 148, 10, -167, -157, 149, 287, -91, -47, -20, -19, -88, 18, 269, 12, -62, -168, 126, 124, 29, 92, -120, 112, -2, 26, 254, -74, -286, -225, 218, 60, 6, 55, -60, -165, -170, 85, 261, -17, -178, -34, 45, -86, 150, 110, -74, -279, -102, 230, 186, -73, -189, -82, -116, 106, 216, 65, -160, -462, -135, 228]
6152B28j20j48J35l82K01O3K08P6l71l04J92M48p8q1l4j36j50L07K16L4k98k97
6174b91J23J32J44J36j72k91p9M14M3L8l58j21K08M7J95J8k00j65k23L75L26q0
6196B19k79l3L6L3J78L9n7k96k47L81K32r4j13j14p4O2L61J50l05p9k85L12J30
6219A57j89M9m6j08m0K64J86j6m52j4K05K0K5k6Q3k15k86M97J44p2k73J7j18K77
6243F9J19J73l50k07j10L14J86q8j11j20J8O9K41J01k76l61M0K17L32q4j91o4
6265h3j92K51K83M2m67J17k15K91J44j58Kq0J6o5J82K51l77q2n3J18Q8O5o8l0
6289b0j58R6K34qj40j6M8o0j4J84M7o6j90j20L45N2k15o1Q5j40j60M01R9k24j68
6314a69K44k08L37j0k02j30R7o0K45m3j94o4M4Q0J6OO4j88K1O9J2J96j69pj8O3
$$ y = [228, 108, -40, 95, -287, -86, -23, 185, 261, -110, -414, -222, 226, 148, 67, 33, -103, -253, 54, 270, 304, 6, -291, -168, -36, 108, 244, 72, -219, -298, 116, 159, 197, -161, -282, -74, -27, 168, 186, -14, -179, -402, -27, 299, 219, -60, -93, -57, -24, 154, 193, 136, -160, -407, -26, 206, 112, -1, -115, -189, -127, 234, 384, 79, 0, -285, 27, 157, -32, 17, -29, -137, -177, 87, 273, 257, -195, -209, -4, 16, 41, 15, 98, -117, -403, 94, 238, 166, -107, -90, -208, 69, 188, 361, 11, -196, -306, 8, 194, 106, -5, -125, -107, -38, 203, 304, 28, -333, -293, -76, 256, 172, -19, -83, -275, -24, 259, 301, -166, -49, -264, 27, 171, 13, 15, -65, -49, -114, 68, 319, -58, -140, -193, -75, 13, 78, 10, -20, -178, -82, 152, 144, 4, -12, 36, -24, -38, 146, 193, 127, -63, -183, 162, 214, -1, -62, 23, -117, -277, 124, 223, -1, -169, 75, -133, 204, 194, -8, -138, -41, -101, 144, 101, -93, -157, -113, -33, -17, -11, 53, -135, -114, -45, -33, 163, -6, -13, -31, 32]
6340C2O9j83J87n4o4j18J04M7rnJ0j66P9J99m4r6o5P8J87n6j67m8J73q8k0K43
6366B25j62j26M3L4n3r7J26r3J74Oj21J55j23p1RR5J47k00Q7j42K66k74J30R3
6390A28o6j25j3j4J18j20m9J19q9K08j66M4P9q6PJ18j1k13K07j42P7J9Mo3j73
6415b02K4M3K46k78K11o4M3j4K61j84Q7l06N1K13O4k12j17N5rn4L08L0j36r6q
6440d4K05L7j02j53J21k23M8J94L8r3j64M4Q8j2j0J38j89k5k5L81j20q1j88J87
6464E2L0j46J04K4k98J16K8J44L6l9j48K2j13K76O3j68o2j15K5M24j87j47K9J30
6488H0k40J26K68k98M5j21Q5L4q9Q8m4P4k66O3M46q8l18L5L37l47R1L8k1nm9m1
6514a17L02j62O1r9K4M9L2Nj65r3J03R7R5j12q8J11j38K59j10K76l97j5j77K99
$$ y = [32, 101, -82, 105, 51, -13, -131, -27, 20, 11, 6, 16, -150, -71, 128, 84, -12, -77, 1, 188, 132, -35, -83, 90, 2, -18, 225, 63, -63, -20, 14, -39, -136, -10, -103, 71, 77, -44, 111, -12, -83, -74, 21, 168, -32, 55, -87, 179, -95, 35, 128, 62, -63, -76, -90, 28, -92, -141, -22, -111, 97, -69, -25, 54, -32, -25, 93, 82, -131, 76, -66, 11, 30, 34, -29, -202, -178, -135, 111, -167, 44, -20, 23, 9, 270, 86, 173, -133, -82, 131, 195, -17, -134, -79, -88, -142, 166, 196, 60, -36, -44, 161, 198, 96, -57, 64, -159, -111, 83, 121, 28, -136, -92, -4, -16, -26, 112, -77, -102, -127, 254, 134, 53, -135, 52, 82, -64, 40, 64, -234, -118, -90, 54, 90, 51, -97, -75, -188, 88, 151, -17, -79, -194, -169, 255, 68, -79, -50, 80, -160, -34, 234, -64, -19, -140, -55, -21, -110, -22, -66, 8, -258, -195, 251, 163, -155, -120, 217, -130, -39, -1, -22, -27, -76, -117, 185, 23, 84, -15, 9, 58, 90, 95, -70, -163, -60, 37, 132, 20, -68, 43, -95, 164, 54, 330, -67, -82, -259, 40]
6538D0m8j0L8p7k04J49K63M6j17j92P3k0J73j31m4L4p7o5K96Q6j05l18K17J60
6562A67j78M3N7qn4l3%l2l3P3j92Q3R5m6J65j25k7M3m7P3Rl7l9O3Nqq3J35k95
6591b26P5J51J3j36L47k26j14L9M4O3Kl5K4j6p6M8O8o5J13j07q6K80k20k0J24
6616F4j9k06K01M5k1j97J91q5J70j17j82K82k96Q9K0J30k30J34l8Jr8J7K32j6
6640G1P9j89N8Nl6rl4M9P2P5k22R3j2m8l8M7k3k4J90j55Q8R2k09O2L5K8k97L28
6668G6nK7j13n7N8p8K04o7j48q9L20m5l6p8R6j03pJ2JP3o7J48n5j13LO0k5P3j2
6697E3p5J19Q0k33Q9l4n3p2J13R1k7O4j55L3J9p4J46j10k3L5k8K1j31K81j16%
6723A3L3j40K3J54k35J26L9rNp5j0J0L7L8P6j24pNJ31j78j11K25L3o3j98K87J6
$$ y = [40, -8, -18, 20, -57, -261, -112, 151, 197, 80, -112, -39, -59, 114, -17, -61, -27, -104, -169, 127, 213, 108, -210, 7, 167, -11, 32, 89, 81, 27, -6, -6, -38, -71, 2, -190, -107, -12, -58, 107, -18, -45, -2, -49, 24, 33, -4, -43, 20, 25, 17, -66, 69, -226, -151, 0, 13, -123, 224, -2, -116, -77, -33, 30, 32, -3, 21, 5, -71, -23, 45, -20, 93, -14, -100, 180, -40, -60, 64, 45, -161, 40, 85, 64, -133, 58, -27, 143, 26, -156, 126, -170, -81, -61, 69, -161, -27, -65, -64, -162, -145, 87, 71, 150, -39, 19, 24, -12, -21, -55, -6, 66, 141, -81, 12, 0, -48, -86, -39, -62, -86, 104, -51, 37, 129, -80, -18, 17, 45, -252, 76, 71, 98, -15, -72, -14, -92, 112, 45, -103, -192, 128, 83, 47, -31, 65, -38, -45, -33, -32, 41, -26, 122, 67, -46, -43, 17, -8, 65, 53, -22, 97, 177, -56, 33, -1, -54, -126, -13, 78, 51, 115, -40, -7, 12, -62, 84, -26, -49, -14, -42, -21, -152, 129, 13, 13, 46, -94, -71, 83, -152, -26, 13, 4, 9, -66, -76, -66, -29, 9, 85, -39, -46, -41, 90, -88, -199, 26, 59, -4, -202, 85, 101]
6750A01j48q8J23j5Q6l9rnq2K45k3j61j8j29M1n5Q8J04P3r0PO3j42J00L9J15j55
6777B6l2j67K08J7j45l7QR1n4j8P2K20k94m2K06m4K9o0K57k30o3n7K49p1k91K01
6803b1J79j97j08K69O2j83j6l7L9M5m6J40l5j80J71J05q2j42m3J34j24J96J7r6
6827D7K8p9p8K6M6P2J11j06j37RJ26J7j32j55K7J87m5J61n6j13k14K17N6J23p2
6852F6k41K74j65J63l7J36l05o3K90L1j55r3J32J1N1J07j18m1l0p6q6L20k05p8
6876a12N9k2Q9j02J18R6q9j78j0K70m4j32K7l6N6P9jQ1k01q7J16L8L0j1K2j40
6902h4j96K16K80k13q2J34j38J07o1m1J89r2j06R1n2nP2k23R6J6N9R8M4j48j31
6927a70J64O2J53j70m3q8k3J57J02j41j14J06P5O1K9j3j50k14J64J84n4J5k37
$$ y = [101, -47, -135, -12, -27, 59, 20, 11, 6, -76, 169, 146, -15, -33, -162, -121, -176, -88, 16, 89, -1, 6, 69, -73, 27, 66, 181, 26, -6, -173, 35, 52, -93, -130, -122, -31, -85, -103, -31, 189, -105, -147, 59, 15, 44, -16, 241, 11, -52, -109, 140, 69, -222, -21, 158, -39, -147, 122, 184, 1, -15, -52, -13, 32, -14, 126, 91, -89, 82, 187, 105, -37, -80, 54, -70, 126, 143, 47, 75, -4, -82, -56, -10, 62, 173, 67, -70, -61, 65, 82, -50, -205, -178, 9, -36, 125, 69, -44, -258, -41, 15, 138, 66, -175, 99, -66, 97, 60, 196, -109, -172, 118, 149, -6, -99, 33, 44, 95, 202, 84, 43, 13, -63, -149, 171, -34, -112, -53, -75, 14, -88, 30, 126, 37, -141, -151, 119, 75, -57, -30, -66, -10, 69, 68, 149, -52, -139, -23, 15, 45, 34, 56, -84, -280, -64, 216, 3, -79, 55, -83, 24, -37, -78, 111, 19, -87, 4, -48, -53, 19, -204, -108, -92, -33, 65, 109, -39, -170, -6, 56, 209, 39, -4, -92, -115, 42, 144, 3, -111, -5, 70, 131, 160, 147, -3, -217, -53, 131, 77, 92, -145]
6950a45J26j71J90N5J5q8K5K2R6J8o5mk47Q2R8k6J54r9k23O4J74l5j9j9j83K76
6976G1j17J63j04Jl57K17J14RK7l5l6j64l5J66R6M0k30q6L37o1K4l7o0m9M4m3
7002a05J87j20%m5J3R7j5Q3J4l45N1K75J10l53P2k5K13j71R0j48J32j18j59J90
7026g7K17l8j36n8J23n2O2q6l6n8J32J0j11l4M0o8j13K24N6P7p8j8o5J10n9p2
7052a08J76n8N8l05J19N5O7l4J75j08K07k68n3J35j59J63L4M9j24l8M7j0j7j86
7076a83J51Q3Ll4R8k4j33J25p8l2l3j64K68j54OJ25m9j5r2Q2K35j93R8j41K11
7101A60o8m3n1l6J24k25J33J14O2j73k1nl6j5K25j49l3k7j11K90r3J37j42k9q8
7126a00J45J19j74o7j55J51K56j83J18j94q4J16J89K0j09j38k06L16n4m3K81k56
$$ y = [-145, -19, -190, 0, 55, 70, -18, 7, 29, 125, 143, 78, 74, -173, -91, 7, -19, 135, 36, -187, -123, 51, 16, -3, -22, -205, 71, -46, 117, 13, 14, -343, -126, -12, -3, 24, -11, -47, -211, -246, -80, 16, 56, -174, -260, 77, 16, 40, 3, -57, -106, -62, -105, 82, -38, -38, -83, -70, 27, 12, 95, 109, -236, -185, 90, 200, -153, -81, -106, 107, -64, 26, -122, 10, -108, -267, -77, 140, 102, -34, -92, 31, -21, 41, -45, -81, -139, -7, 3, -108, -142, -102, -170, -283, -59, -3, 74, -4, -22, -87, 23, -36, -108, 68, 10, 68, -237, -118, -63, 4, -30, 145, 37, 244, -24, -77, 58, -101, 62, 96, 145, 21, -17, 30, 20, 3, -183, -32, 51, 54, 20, 118, 94, -39, 86, 8, -24, -57, -221, 47, -107, -101, 24, -25, -40, -132, -50, 185, -8, 90, -51, 160, 92, 49, -2, -38, 86, -139, -6, 108, 170, -3, -24, -29, -65, -80, 145, -4, -37, -64, -175, 115, 22, 159, 17, -12, -100, 45, 164, -10, -77, -232, -81, 175, -8, 110, -84, -168, -52, 137, 157, 48, -90, -296, 20, -34, -77, 204, -52]
7148e2q4J03O6J87l51K06K4k21K18l2P1j4m04Q1J22K67k14L86l17k14J06J80J73
7171B87l25jj84M0K53Q9j52n7k26L74L3j05L3j16J0j5k0L49l47P2m5j13K00Rj19
7196g6K11k37P6O4R6Q3k45J34q4J26Qj63O2k5k15J26J06K61m91K25m7j08J13p
7220gn8l3j11R6J70P4K5k72J07P9j19L3J67k1k91J75J61o3J36k56p0J59Q3j00
7244F4o0q6K5J86j69R5K4n1j43P8J97Q5j63j37j66K45JJ04j26p5Ql8K15N6j67
7269BL5j34M1PJ32J6ln2j46O2J13j50P1q4J58o5J59j65J90k63J2N7J00R8k34l4
7295g7j0J11K7p5O2q2N7n5L9L4Nk74K25j6m7K37k52N5MJ93p8Lj29q0J73j70P4
7322d6K09j60Nj13K00k71K48j16K3J6J2PK6Lj52l5K98k84J35j7K9J33j89K7J29
$$ y = [-52, -136, -33, 33, 220, -131, 75, 99, -122, 96, 64, 135, 121, -283, -202, -80, 187, -27, 359, 42, -172, -66, 114, 287, -38, -39, -223, -183, 70, 159, 7, -50, -276, 98, 131, 26, 59, -57, -47, -62, -82, 267, -80, -8, -53, -166, 34, 43, -76, 135, -102, -26, 38, 134, 217, -28, 106, 22, 148, 156, -7, 55, 30, -185, -59, 47, 308, -183, 42, -5, -113, 0, -7, -65, -98, -209, -113, 57, 131, 156, -116, -9, 70, -49, -16, 151, 130, -161, 14, 175, 112, 248, -8, -78, 81, 164, 64, 4, -82, -57, 129, -40, 55, 79, 28, -115, -37, 160, 245, 82, -55, -221, 24, 25, 129, 3, -72, -64, -102, 113, 169, 2, 37, -97, -56, -49, 83, 99, 96, 44, -102, -40, 73, -77, -6, -90, 68, 3, 162, -3, 187, -76, -64, -7, 93, 191, -43, -77, -87, 24, 51, -24, 38, -44, 13, -42, -3, 31, 36, -238, -13, -29, -76, 161, -91, -36, -32, 161, 83, 86, -43, -123, 50, -120, -46, 163, 3, 8, -105, 95, -176, 72, -44, -21, -5, 7, 14, 40, 43, -109, -144, 154, -130, 5, -12, 17, 150, -39, -12, 117]
7347A17j17LN5Lnp9P7K8j31l5R0K01j58q0N2O4o2o4N6O9q2j01R9J2j10J10QrK19
7376B30j53j19Q2j74J31J04k6j32O4l8M4Pr9M7q9J42Q1p8l7O5J4l0j01K5L4L59
7402C53l50J00k6p6l1NJ6K5Pr9n4J01r6J95%o9m4j50K64r2j75K05K01k18p9J5
7428g2M4P8j28J92q3p3N0J24n4r6n5J49o1K8J0Q1o2j08J3K3J54m9j22M3n4q7J40
7455B5j3m1n5J59j12L0m6p3K09j83L9M3j5j10K02k3mO1j53o6J10nj28K36p3kk34
7482b22L73k24J42j25J14o1j05M4P8Qq9K2R9J3j10K23m9k08K05j62N6r9K10%m2
7507I1j79MJ84j14j14J94k2J5j64K28Jj28q8p3J72N4n1p0l1J86k79K63O5k89M9
7532i6NK71q9Nn0J23j07k8l3J85j76p7J10j3O4j37J0R8k44M8K78j64j61J61m6
$$ y = [117, 0, 3, 58, 61, 56, -23, 54, 82, -49, -84, 6, 207, 49, -31, 21, 85, 23, -41, 15, 84, 2, -99, 0, 12, -98, 12, 20, 11, 230, 77, -42, 40, -134, -3, 101, 75, -57, 7, -31, 13, 20, -79, -32, -121, 21, 102, 24, -13, 52, 66, 36, -65, -40, -6, 353, 3, 103, 77, 1, -30, -25, -9, 16, 23, -76, -130, -29, -125, 70, 70, 1, -43, -193, 71, -21, -196, 9, 210, -8, -87, -72, -28, 50, -78, 114, 31, -42, 8, 132, 78, -18, -73, 76, 15, 43, 53, 134, 72, -36, -23, 0, 154, 105, -17, 26, -28, -115, 25, 12, -29, -84, 75, -37, -7, -53, -126, 83, -100, -61, -18, -33, -143, 59, 36, 32, 93, -60, -126, -16, -21, -149, 87, 14, 12, -222, 151, -73, 69, -56, 58, -3, -108, -64, 14, 22, -67, -45, 54, 67, -43, 180, 131, -77, 128, -34, 22, -77, 133, 133, 91, -88, -84, 100, -14, -128, 66, 44, 59, -105, 123, 124, -4, -92, -165, 7, 61, 10, -60, -91, 95, -184, 79, 144, -145, -96, -91, 180, 91, 96, 46, 169, 62, 34, 1, 186, 10, -67, 43, 30, 94, -43, -33, 65, -179, -131, 147, -17, -178, -17, -63]
7557f3l1o6K82q5r4rJ01N8l02J24J36n4n2J07j69J04K7n0J23q8J51k02J63j50
7581c9j03L06k59J05m2o7O3J85k68J05K7K4j62K8J51p9j1n5m9L4J80m7m5M3j31
7606a06L2J48p9j37J8J90j03M3j24J84k08j13K24K2kK7n0p6K66k7M9j58K9o2J0
7631cM5L3j34K1p3j24J72J15Q1p0j75J0mK07q9j6J1k03J32R6J11j42r7K23j48
7656b1l4J08O3J39l97K85j25J83j66k41O5K56M0j08j83J02M1q8J10J2j52R2p9
7679i8J79M8N3j37j91Q1J24m1k3Q6k73N8J55ko5N8K3l0q8K31n1j85K02p2j13j9
7705i0J07J58j83r8R1J15j63O9R1j28n4m4R6r1R0K11j12r0P2JJ12j30m3J65j83
7730c1K6N8q0Lo6J55n5P1j85J62j08Q4l1j05K43j73rPjM8p7O2K1p0k09P9J91q
$$ y = [-63, -94, -160, 122, 37, -57, -66, 35, 93, -209, -85, 51, -3, -55, 52, -117, -13, 14, -36, 87, -1, 150, -52, 111, -39, -142, 164, -95, 10, -32, -99, -36, 149, -119, -14, 13, 37, -125, -97, 54, -25, -36, -91, -140, -106, 74, 27, -18, 25, -106, -74, 74, -5, -142, -124, 66, -37, 6, -118, 66, -142, -255, -31, -9, -11, 16, -34, -110, 156, 129, 178, 20, 49, -13, -3, 42, 75, -59, -38, -111, -235, -63, 52, 133, 63, -112, -102, -106, 101, 12, -4, 7, -196, -64, 32, 143, 1, -96, 127, -21, -55, 53, 116, 255, -142, 143, 18, 201, 35, -206, -141, 115, 155, 47, -136, -34, 7, -81, 29, 41, -111, -19, -98, 81, 129, 182, 45, -146, -65, 59, 18, -5, 81, -192, -134, 21, 19, -46, 12, 35, 5, -83, 148, 97, -88, 114, 42, -71, -90, 17, 175, -8, -106, -15, 100, -63, 6, 97, -31, -85, -129, -33, -124, -34, 177, 65, -25, 47, 48, 160, 30, -13, 152, -31, -5, 53, -27, -24, -90, 65, 10, 81, -104, 58, -50, 34, 3, -102, 141, -32, -41, -34, -35, 13, -64, -2, 19, -51, -260, -181, 10, 2]
7758Bl1n8P9n2J09o7N0q1l6l4O0R7k26K17j10J05J1J74j34j47K0j6j4K2L6Q8p2
7785hn1r6J63jK7K29k71p3J60j92J91l05J85K41j86J95j65m6j29MO6J77j83J47
7809G9j92L1N8p5K20Q4l84m7qJ65oO1J14j78N8J39j95N3j8m1o3L5L47k77l8K03
7835A25k13R9J15Kk68O5O9q8N6J14lj49j49K42P4r3j56j5J08J61P7j23j59r5O8
7860a36O4K18n4K6k16K0J76l1j71l8M0N0L2KJ11J9k19J2R6%J42j38lM1j03R5K12
7887B47q7K4k46r0J57K18j11j99M8N7J6N9M5j83m3K4L02q0l1k92J0J32L7Q5j8
7912H1K3j29q6K34r7q0J79j76M6J06P4k31nk44J67K56K8M1o9p4k06J41J01l6N0
7937I4k72j2K26r3K11j08Ln6j60K04K77k17r3j08KK40M0J7k72q9J05K6J59l9j80
$$ y = [2, -29, -87, -8, -60, 49, -18, 32, -49, -85, -119, -59, 38, -188, 29, -81, 24, 35, 209, 75, -72, -52, -68, -82, -60, -24, 64, -8, -59, -155, 8, 7, 34, 263, -8, -81, 79, -113, 78, -227, -42, 199, 13, 208, 43, -3, -132, -128, -62, 115, -68, 79, -113, -82, -24, -99, 121, 205, -179, -226, -234, -69, -75, -14, 100, -78, -20, 119, -76, -23, -41, -82, -145, -110, 237, -40, -78, 125, -88, 11, 126, 128, -140, -75, -6, -94, -38, 76, 73, -76, -225, 17, 91, -2, -158, -173, -65, 96, 173, 50, -109, -204, -136, -72, 146, 92, 118, -98, -78, 98, 67, -104, -142, -102, -52, -20, -18, 93, 112, -107, -95, 1, 1, 143, 5, 2, 43, -60, 35, 247, 160, 184, -62, -152, 5, 223, 112, -87, -39, 18, 34, 93, 138, -45, -88, -64, 238, 158, 127, -165, -155, -23, 14, 99, 81, 104, -25, -111, 123, 26, -54, 125, -51, -5, 101, 175, -56, -61, -305, -138, 118, 146, 187, 118, 44, -162, -21, 80, 44, 94, -178, -190, 36, -57, 154, 46, 49, -7, -167, 37, 314, 97, 4, -104, -102, 138, 178, 195, -77, -166, -61, -35, 124, 85, -95]
7962i5N8N3J20j06m8j93J41j11J38J32j58k6K6J35l2Q4j28q6K68j65J44j50L4
7985C5RQ4k45J98j24K3p8J07k43K37L4J30j79j29K28k35K74r0Q7k74o4J89J12
8008H6L1k37J87j88K2K56j30q7M2Qj83K34RO4%j52m8N7n0J12Lj43K02l4j33J37
8034F5k20J45j45j0L21j79L5j2l2k6J53l4r3l6R0j5q0kJ07P7q8q4O0k3jo5J26
8061C4k06J96q2K00j96p3J67m1K06k77R9q9J75k52mK40K3k31J17J6P1k29J38O9
8085G1k40O8J60M3j94K6m5Q1m3J7J29L7k51J77j31J59j31JJ13R7l20R3o5q9K76
8110C9j3QJ0m6J9o0j04q3K50k21K33j02j21J94q2QJ43Mj30L2j28K64k07J3J30
8135E0m1k02L3K26q7J65k17J29n2mO2j40N9o3N0K1Q4Q8k6j46o8nJ4N3j15P1L1
$$ y = [-95, -37, 16, 136, 30, -18, -211, -70, -181, -43, 89, -69, -95, -69, 66, 34, 118, -10, -96, 172, 7, 151, 1, 35, 44, 128, -117, 81, -43, -20, -98, 9, -234, 3, 37, 167, -12, -141, 87, -148, 126, 36, 123, -151, -215, -26, 86, 117, -120, 67, -121, -99, 157, 27, -60, -18, -10, -193, 41, 50, 114, 114, -38, -86, -29, -79, 33, 36, -107, 95, 61, -72, 65, -155, -10, -155, -165, 156, -23, 12, 0, -32, -58, 95, 61, -32, -68, 22, 7, -73, -75, 32, 109, 21, -63, -3, -26, -27, -92, 34, -172, 24, -58, 142, -54, -127, 40, -1, 205, -72, 27, -62, 113, -139, -143, 97, 120, -111, 6, 22, 93, -136, 2, 71, -169, -101, 59, 102, -92, -66, -111, -30, -73, -56, 73, 110, -141, 36, -95, 64, -67, -66, 47, 144, -176, -83, -148, -237, 39, 26, 34, 44, -2, 17, -43, -147, -230, 20, -201, 32, -70, -191, 3, -79, -71, 72, 76, -54, -22, -150, 114, -93, -80, 50, 9, -193, -160, 66, -21, 144, -73, 56, 4, 0, 62, -78, -19, -82, -32, -11, 73, 161, 135, -11, -79, -84, -70, -17, -132, -61, -30]
8162c0Kj7n4R1L5j72K55P6q2r5nj53K18L3J7j02j54p8K97N1Qp6o6j06k9K87j76
8189b5M5j38
$$ y = [-30, -28, -45, -99, -8, 27, -145, 110, 186, 104, 9, 4, -149, 69, 102, 119, 17, -137, -215, 82, 133, 141, 65, -1, -107, -136, 151, -25, 20, -118]
8191a18
$$ Imaginary data points
##PAGE= N=2
##DATA TABLE= (X++(I..I)), XYDATA
0@%%%%%%%%%qJ6j6K4l2L9m7N6p2Q8j04J28j53J78k15K55k97L45m01M65n35O14
31C28p00P95r02J020j150J293j451J622j811K020k246K494k764L057l379L732
47A958m118M541n004N511o070O690p376Q143r004R978j1094J2383j3888J5676
61H326j7841K0528k3969K8548l4978M4729o1426R7606l09953K37060L89033n21715
73a44052K23459J04539m49907O4655M19989j56711j8757L1958k98956N5001L53030
84A84248j47837m3733J54602k50169r6116L30448m6975j18983J20902j61263r5036
95a69912L15614l6056k23293J45025l1003j98953K51712J64012k27799m1718J8321
106c4050q8908J72015R4267j67409K5178m0804j90654K60242K45240k72918o3622
$$ y = [0, 0, 0, 0, 0, 0, 0, 0, 0, 0, -8, 8, -8, 16, -16, 23, -24, 32, -40, 48, -56, 72, -81, 97, -118, 137, -160, 185, -216, 249, -286, 328, -372, 423, -479, 541, -609, 684, -767, 855, -956, 1064, -1182, 1312, -1452, 1605, -1774, 1958, -2160, 2381, -2623, 2888, -3182, 3508, -3868, 4275, -4729, 5249, -5845, 6538, -7350, 8326, -9515, 11013, -12956, 15592, -19386, 25343, -36083, 61523, -248430, -11370, 377663, -144052, 79407, 183946, -265961, -201306, 218683, 61972, 43215, 75173, -223783, -168782, 184248, 36411, -7322, 147280, -102889, -199005, 131443, 84468, -34515, 86387, -74876, -169912, 145702, 109646, -113647, 31378, 375, -198578, 53134, 217146, -10653, -52371, -34050, -122958, 49057, 143324, -24085, 1093, -39711, -230365, 29877, 275117, 2199, -61423]
117f1423J26399k24475L0885L47704j24215j92310J31507j25497p2692L42142
127A78025k2825k73824J34171O854k04501K16185J69100k43039m2395R9435q7715
138g0529O8258J18895j33884k7590O9139j00086P2057J65810j62186j08384J28737
149B0237l3990k6679J35388n3706j15342N8064L965Q121J16923p0662j42127P4146
161b5662K7559m5379J15951R024j49497K0501M1524k6232J08671K581j62594M3912
173c9641P3000r8195P7469J22891j64134p5290J35033k7333k9231J09537o5176
184A8930r1673R0077j3108m1801J12959l7356j33591Q4229O1028q1133M1258M5239
196E5058r3053O48O1672l2090J8587K4785q3951J1289Q1387m6581j4188N8663
$$ y = [-61423, 64976, -159499, -128614, 219090, 94875, -97435, 34072, -91425, -164117, 178025, 155200, -118624, 15547, 22401, -182100, 34085, 203185, -39854, -82249, 17186, -70529, -2271, 116624, -17260, -44850, 24289, -75797, -3740, 162070, -116, -108500, 20237, -13753, -40432, 94956, 41250, -74092, -16028, -12063, -3942, 112981, 42319, -99808, -25662, 1897, -43482, 72469, 81493, -68004, -47503, -5979, -32211, 76460, 79041, -83553, -39641, 33359, -64836, 12633, 135524, -28610, -103900, 31133, 3800, -25431, 84106, 18930, -72743, 17334, 4226, -37575, 75384, 38028, -95563, -11334, 49694, -31439, 9819, 55058, -37995, -37347, 24325, -7765, 10822, 35607, -48344, -37055, 44332, -2249, -16437, 42226]
208D2226n0358m0032O0424Q284j7465J5658l3948j4260N1922j4591k4647N0725
220C3938k4112o0957N4743K7730m6537K1201R043m2264K3846J5406l1528L0622
232A1131J1685n8336K2494M8706n1043r687N7069k9783l0165M2829j0218k0007
244a5325L2605j5752j6434L8675k2559l6017M9765J5315m9750J1450K8097l1060
256a0990m531K8875m951o265q254j9653K8635K4503l6195l141K5935k6185j2387
269b4604L8923J0059k6463j2609k43J4308K0439j2699j4181J4777j5120k0532
281b7945M2221K4863l9471k1196J0769Q389J0615L575n313n228j8353j1418L7060
294H568L2333l7073l4766K0182P371n592K5937R765l0256k5192O180L4802K2238
$$ y = [42226, -8132, -48164, 12260, 20544, 3079, 18737, -15211, -29471, 22451, 7860, -16787, 33938, 9826, -51131, 3612, 31342, -15195, 6006, 15049, -27215, -3369, 12037, -19491, 11131, 22816, -35520, -13026, 35680, -15363, -25050, 32019, 2236, -27929, 14900, 4682, -15325, 17280, 1528, -14906, 23769, 1210, -34807, 14958, 30273, -19477, -8027, 20070, -10990, -15521, 13354, 8403, 2138, -6116, -25769, 2866, 27369, -8826, -11967, 13968, -12217, -24604, 14319, 24378, -2085, -14694, -14937, -629, 19810, 7111, -7070, 7707, -7413, -27945, 14276, 39139, -332, -21528, -10759, -2370, 8245, 11820, 6507, 1279, -17074, -28492, 8568, 40901, 3828, -30938, -10756, -3385, -8977, 16960, 26725, -3531, -28723, -22543, 12259, 34497]
307C4497k3514k8788L431P240J40K5407K1287l7514m1710J9296L7081R058j2747
320A3164j8883r522m130O745L3020J8208l8005m3585J7398M1530L366r040P30
333A0996k3363k4030K1977M1617Q658l6115l5043J2741L1116R296J888R38k8044
346g368l5485K3143N4722n84l9731j8625M012J4125J6358J4918Q41l8021l7909
359d9604K9914N5354n364l9531n662J942j2405K4322M3241j3025m9409j9383K8800
372a0810M0551k164k6131m284j0850k1409K9874N4392j6166n9461n083L1023J2989
385A2471Q103j508k2327k0947r673K3457N0151m681n9343j1881L6196Q147k008
398F157J9693j2588m6234l839L9895K9664o544l9809j6951K6366J0567n53K4360
$$ y = [34497, 10983, -17805, -14374, -7134, -6994, 18413, 39700, 2186, -39524, -20228, 16853, 25911, 13164, -5719, -15241, -19371, -12626, 20394, 38602, 597, -42988, -25590, 15940, 19306, 10266, 10996, -12367, -36397, -14420, 27197, 35855, -260, -35303, -22562, 8554, 17850, 19738, 20676, -7368, -42853, -19710, 35012, 34428, -5303, -23928, -19916, -5791, 10567, 25485, 26326, -11695, -49604, -19690, 35664, 30300, -9231, -14893, -12951, -25356, -1034, 42207, 29182, -20227, -39610, -10810, 29741, 27577, 1446, -2838, -13688, -35097, -5223, 49169, 33003, -26458, -31541, -518, 12471, 20574, 19066, -3261, -24208, -33881, -10424, 39727, 35046, -24297, -36178, 18, 8165, 6157, 25850, 13262, -32972, -36811, 3084, 32748, 26204, -13605, -30556, -4190, 6377, 5824, 30184]
411C0184p462n4406q505N2359K2545k5016j9004o500l069R795K2395K2158j7098
424A8376n2753j702M9447R518j8211l68j2957k2672J3750L7815J5769k1402l8828
437b4218n108L9023R724j9384J5274o089n0207J6655N8554r244k9986j485q761
450a5252N385K7128l613j2712K770k7729r780N9072J0503n5016J694K0356j8258
463a5452J8157L0434k3927k2610l570n178L2387K9574m0146k5645K8775q241j0495
476a5937M7172M610n3735j0173K1491J2598J0817r450j3895K001j2333J157L9750
489B4073K430m2166k785J8507l634J0605O007k2166L267L778j6994L2788K2160
502C5870n5297p160M9122j7769j8490L6609j4270l7784K5608J4023j0448K1582
$$ y = [30184, 22722, -31684, -40189, 12170, 34715, 9699, -9305, -15805, -18874, -9079, 13316, 35474, 18376, -34377, -36079, 13368, 22886, 4675, 4307, -8650, -31322, -17572, 20243, 36012, 14610, -24218, -29326, 9697, 19421, 37, 15311, 9222, -40985, -24330, 34224, 24980, -5006, -6491, -15252, -9867, 17261, 13648, 936, 3706, -24023, -33803, 25269, 35772, -19244, -17550, 2806, -15452, 2705, 33139, 9212, -13398, -16968, -22146, 10241, 39815, -331, -25976, 2799, -5442, -15937, 31235, 35845, -17890, -28063, -6572, 6026, 16843, 7393, -6502, -4501, -16834, -15677, 24073, 26503, -15663, -18448, 59, -3575, 7030, 13037, -9129, -5862, -2084, -19078, 13710, 35870, -19427, -26587, 22535, 4766, -13724, 22885, 8615, -29169, -3561, 10462, 14, 21596]
514B1596j7609l9762L8374J9258l8237K5253J9491n9294J221N3017j5745j2309
526d746K2148k7959j6412L9481l166j7077K9094j7045l8902L6043K2894l0267
538e914M803J2990k0548j982J5306L523N66j1224r808J6945K586j8900J2583J0970
552A1896k3425M689J8058j4549J38O836j6516J4127J6656k9860J468K8277k4851
565g056j1223L9093p294l0967J7677M356j5274K1323p22k2850K2371j334l4134
578b6034K9645K4384m1569j018L2863k2080j5216K6836j387j1959J1437r460r173
591a2731J9815o042j2535K3199J215k7332K908J7147L69m861o1M978n539j5781
605a5251J0609K5237j2388k0317J2529M59j3899J6844R213j6262L049l776j2647
$$ y = [21596, 3987, -35775, 2599, 21857, -16380, 8873, 28364, -30930, -29709, 23308, 7563, -4746, 17402, -10557, -26969, 12512, 9346, -7731, 21363, 4318, -34584, 1459, 24353, -5914, -1111, 11879, -8669, -10651, 4655, 8178, 8744, -2480, -12288, 4657, 7243, -11657, 926, 11896, -11529, -6840, 11218, -3331, -3193, 3643, -12873, 1254, 17910, -11950, -10482, 17795, -7056, -18279, 20814, 13520, -17447, 230, 4586, -10688, 10635, 9913, -12937, 9434, 8100, -26034, 3611, 27995, -13574, -14592, 18271, -3809, -19025, 7811, 6424, -5535, 5902, -3558, -12731, 7084, 1042, -11493, 11706, 12921, -14411, -11503, 5644, 6013, 1152, 1091, 6069, 530, -15251, -4642, 20595, 8207, -12110, 419, 878, -13021, 3823, 13036, -3226, -177, -3953, -16600]
618a6600K5290Q404l1566P369J9650k4542j54L2391j4119k3568J6905L856m542
631a226J4690j2987j6229K1652k649j4391K8526J121m2398N784L3702p049r272
644g26R312j1574j5457J0938J5456Q774o334k6074m955K0507P547P67K700j2109
658a228j4525m36J7874K3267r563l1200J526J7344o017O478K2418j9963l3052
671b7077J5073K2569J164Q47j4656j5299J3092N410n82K0563r689m2251Q373M1330
685A8867l443j7148N527j1051j5063J8668K1547K683j4922k9901N85L5525Q917
698B0791j5205J68p696k2654R315L8673Q433l1038k3939N847J8960Q575K012K204
712A4446j9673k6691J5400L7028O312k2992k2203r0J4367Q510R402P076k3983
$$ y = [-16600, 8690, 17094, -14472, -7103, 12547, -11995, -12149, 20242, 6123, -17445, -540, 3316, -1226, 13464, 477, -15752, 5900, 3251, -11140, 17386, 18507, -23891, -18107, 15595, 8546, -726, 8586, -2988, -18445, -7507, 7949, 16723, 10389, -15685, -20640, -133, 7414, 8181, 10881, -1228, -15753, -16189, 1685, 24952, 15389, -15811, -14285, 3059, -2958, 3520, 25938, 5975, -27077, -12004, 10565, 11729, 12576, -2080, -17379, -4287, 1123, 541, 21104, 11415, -30836, -22463, 18867, 15424, -1724, 3803, -7248, -22311, -3643, 17904, 20587, 5665, -24236, -23651, 11874, 20791, 5586, 5754, -1942, -24596, -15281, 23392, 31825, 787, -23152, -17305, 1655, 10230, 12242, 14446, -5227, -31918, -16518, 20510, 26822, 3830, -18373, -18463, -4096, 4414, 13816, 20892, -3091]
725c091l1996J7784M2253r80k3478m951q135o216K2602K2736o781k6490k1502
738b8245J1755L1400P414j5302j0502j0230r043J8617L2613n426l4830j5672J3207
751a4244K0814R738k920r905j9970j1478K4708L2858m964l2874j5699J2160J4029
764B253Q607J0276q403l2034j2854L0340L0832r244k4352r898j885O825J9829
777A0292J3988j1286l1480j3592K6906K7502n240j6642r104q080R76K2925K1407
790B8572j3856l2327q993K2111K1642j715q518p295j8217k542L1251J9709j8040
803A1782k5881o775J2940J6205P047k495j3596k0172k127K9198K1131j7092k1590
816a1425l735K537J3268J5948j242j4124j7976n292K3943K3139j1749k0963k518
$$ y = [-3091, -35087, -17303, 24950, 23970, 492, -4459, -12594, -18810, 3792, 26528, 19747, -6743, -28245, -16490, 14910, 22324, 7022, -3480, -13710, -22753, -4136, 28477, 23051, -11779, -27451, -14244, 6570, 16308, 13388, 3483, -16487, -27965, -3257, 29601, 24637, -8237, -23936, -11776, 2253, 10860, 21136, 12733, -19301, -32155, -1815, 29017, 19773, -4579, -14477, -16362, -9537, 10292, 24280, 12994, -18486, -32078, -5172, 22330, 17090, 448, -8656, -16736, -15760, 7165, 28572, 14716, -17611, -26604, -4493, 17149, 15434, 6916, -379, -18596, -21138, 10113, 29822, 11782, -14099, -20874, -7934, 8271, 15318, 12823, -773, -20945, -23072, 6126, 27257, 10165, -11425, -15160, -12623, 645, 16593, 15351, 1227, -16749, -22041, 1902, 25041, 13292, -7671, -10189]
829a0189R96L276J8954R332j9485k0144q7J7233J8359n919j6162l385m491P4K2064
844A0426J2238k0606j9462M427J1333R671N231r143j2491l792L334J5645J4060
857B0871j5480j8685M312Q248N120P074k465j2857q749M126J4251J0000j0336
870E430j5755L191O060j888J0029O311j7505j1166R683J0002L487l655q185k060
884f021K134J673P568O299j1041j2810P491J0735j398j295k467m122J15R78M776
899B615P082p185j1867M741J0682l270o204M721J349q739L37R266J560p407l516
914e835O168L228n242k68L980m01l273o85L822K333n430j989O907J907o856k227
930c861P009P05o468J886M446m440m454L792O269k214q069R96O339r14j831K282
$$ y = [-10189, -9193, -5917, 13037, 22369, 2884, -17260, -17347, -114, 18245, 12326, -3836, -7221, -11712, -11638, 10426, 22664, 2058, -17404, -12977, -1644, 8027, 13258, 4115, -8376, -12168, -8834, 6811, 20871, 5391, -13294, -8982, -734, 4386, 11460, 8995, -3862, -12611, -8485, 5766, 15766, 5430, -10325, -7134, -1074, -2962, 7067, 13378, -4127, -15293, -5610, 4392, 7879, 4224, -3961, -6021, -3887, -2214, 5354, 11653, 612, -12198, -4707, 6028, 4630, 3335, 868, -3254, -3139, -2161, 2615, 9697, 2512, -9355, -4614, 6068, 2798, -3406, 1315, 2664, -6075, -5738, 3528, 5088, -2319, -5835, 333, 3561, -1681, -1949, 2031, 1630, -1643, -2328, 1494, 3827, -1603, -3592, 3315, 5222, -1634, -3861, 3148, 3853, -2615, -729, 3717, -723, -5177, -1385, 4884, 2670, -5399, -4403, 1936, 1022, -809, 1473]
946A473Q76o212m481R408Q748p922q263L661K814j308N311N640q201r570K110
961e916O219Q454O02j4185l412Q347l167J807J4928n801k2431K537J7330O5l492
976A885K243q437o361O292P258P814k351j8672k388J6968L369n544L096l624j3973
991a2425L272J8474M653j1018j1406j311R689N991m9K031r003j5306N126K0204
1005H922P109j2358j4760K87Q388K703O839R039j4982k4818J0609K6786j487r580
1019B697p63j1065m653J5270J1089J310q351k1714j918K6289P308j4157j59j610
1033d27j7379P718K7143j061j9262q932P07J1360J0157l516m420n957j1986O568
1047i287K5175K236k2286r044P418M612O639Q474n383j7809r813J4238K1188j581
$$ y = [1473, 2349, -3863, -8344, 1064, 9812, 1890, -6373, -2712, 102, -1206, 4105, 9745, 1544, -8026, -5916, 303, 8757, 9359, -4826, -8238, 109, -3058, -1251, 13677, 7876, -14555, -12018, 5312, 5377, 1885, 4128, -4309, -10670, -4378, 2880, 10694, 8343, -10329, -12717, 4251, 7620, 2076, 5172, 1548, -12425, -9153, 9321, 13974, 2956, -8450, -9761, -72, 5919, 5870, 7901, -1102, -16408, -11282, 8922, 16031, 3673, -11087, -10800, -2412, 291, 7130, 16169, 1187, -23631, -13022, 13764, 12277, 2697, 1934, -9131, -13784, 1486, 12575, 13885, 5534, -16180, -18098, 8191, 15499, 1342, 1183, -427, -17806, -10088, 17055, 15994, -3268, -12200, -11493, -133, 10024, 6508, 2088, -3869, -15855, -9287, 15888, 18124, -4162, -13206, -5788, -1176, 5463, 13937, 8554, -9255, -19068, -4830, 16358, 14777]
1061A4777j4553p762m423L693J4987R268n649j7110j4606R677K4952K258j5553
1074d4k085m086j2727J6839K6663j2408k2940j039M817Q465J1003k812j0158o276
1088f788n861Q567K2197k755k5015k699J1288N19N674P605j0928j4318k76J2501
1102b89J4323l184j7373n837O863M879N903P832p446j9342k679J7309J3955l842
1116A1072j3550m097n63j977J5245J4275j4483j8876J717Q982Q474O231p408j1655
1130f613j830M18O492J7288m485k4895J530J4959k742K997P901j2653j1814P808
1144e639R141M695q69j2146o149J1281M468k966O613m454j7391N375J6224k62
1158G921n141m341o052J949P644L620J468n157j2250j10J4534M225n940k528m967
$$ y = [14777, 224, -7538, -11961, -8268, 6719, 15987, 10338, -6772, -21378, -11701, 13251, 15509, -44, -2129, -6215, -18942, -2103, 24560, 12152, -10788, -11827, -7010, 1455, 12458, 9646, -512, -6788, -12649, -4082, 18115, 15360, -9655, -12354, -1066, -547, 5127, 12732, 1804, -12514, -12790, -289, 14034, 10850, -6523, -12360, -5497, -618, 5285, 13117, 5671, -13671, -16350, 959, 14914, 11072, -2478, -6575, -7138, -9115, 6130, 20405, 5922, -12954, -11237, -2255, 6219, 12450, 5042, -6613, -8443, -8025, -1533, 15755, 11270, -13625, -12095, 2864, 122, 3119, 11020, -1633, -13447, -5639, 3502, 8197, 7328, -4818, -10967, 314, 4782, 1816, 8429, 3975, -13416, -8041, 8183, 7921, 2780, -1561, -7613, -5664, 1980, 5600, 7068, 1911, -10339, -10449, 4085, 8310, 2370, -158, -5125]
1173e125l347O352P665L320n415j2238R13J1664Q64k387K700n928q597P212R417
1188G070k398k643l741m980O784N943o554J753K548j1639R71J4316k158r945K574
1203b099J021k333N186K374m523O67l368l477J1631L806j2633l4O697n123M28
1218a780Q033k096o410m73Q90L259M391n403m674N476j730m249P727J633p710
1233c116k35K354J395K256k749k421M301j374n061O168M097q721m34P456l096
1248H20j963M200k941r96L782m466N88N640o034l974Q686p10p540N123L333o529
1264b981K235L265m849K542J016o298N594M504j0040J307R514n507m429Q065p31
1279C207o504K956K020j109J791m913j379Q423l268o244R080O60j1248M348P414
$$ y = [-5125, -8472, -2120, 5545, 8865, 3450, -8788, -7875, 3789, 4653, 2266, 4966, -962, -9559, -2347, 7070, 4672, 2029, -1712, -6692, 92, 6035, -519, 1234, 3782, -7857, -6886, 7430, 5272, -4673, -2099, -1078, -3411, 1775, 4149, -374, 293, -3075, -6552, 5079, 8885, -3748, -3782, 2915, -2208, -1780, 6253, 4157, -2253, -2726, -1836, 1423, 5814, 411, -4263, 1213, -517, -4766, 2961, 4594, -3116, -3351, -997, 398, 2654, -95, -2516, 1785, 411, -4650, 1518, 5615, -3106, -3540, 3916, 820, -1143, 3057, 116, -880, 2902, -1564, -976, 4664, -1370, -5344, 3342, 2632, -4908, 215, 3548, -2981, -746, 2519, -2330, 212, 1228, -5070, 524, 5028, -5012, -3705, 5809, 302, -4127, 3938, 3207, -3297, -341, 1679, 570, 2361, -2552, -3931, 4492, 1224, -5020, 4060, 4720, -6528, -2180, 5234]
1294E234n250k038J705k752J767K798l765K814M309r845q4J2000m160o994N798
1309A537j004m442M277J116n06J789n853j862J1247n25j0970N571M381j0955K339
1324c860J0347n367m563J271q19N175K518p256J236N066q507j049J2757k465j1479
1339f995L704M860j906L106r23k167L150n319k329J2473r76j4517L794Q498o023
1354a570n05P311l529n667J686J650M622Q04r987k36Q114m675j511R823l905r315
1370f890M403N864l18J00l681l425M238j3k226P820j066j3171M221J1306m469
1385B693l007K961l899k633K702K606K856k945r030K767J0652l182n092O392l030
1400H11q316N711P208j498m125m805J260O814o55k412M192k621q677M471J0536
$$ y = [5234, -16, -2054, -349, -3101, -1334, 1464, -2301, 513, 4822, -5023, -5107, 6893, 2733, -4261, 1537, 533, -3909, 368, 1484, 978, 2767, -3086, -4948, 6299, 5774, -5196, 375, 4756, -6199, -3860, 6487, 1120, -3443, -2172, -2991, 2184, 4702, -2554, -1318, 3748, -4759, -5808, 6949, 4484, -6995, -3291, 1569, -337, 2769, 1846, -321, 2829, -2490, -4819, 7654, 6678, -7839, -4045, 4453, -1570, -2075, 5236, 1707, -3960, -2274, -624, 3998, 4802, -5185, -5421, 2693, -1982, -3493, 6330, 2425, -6890, -2487, 3377, 3059, 3159, -522, -3947, 291, 278, -1948, 5872, 4806, -8365, -4144, 7162, 2693, -314, 2647, -1252, -3885, -1183, 1423, 4279, 1334, -7696, -4929, 5723, 2541, -2551, 3841, 811, -7505, -1794, 5414, 3916, -209, -5014, -3754, 3060, 2405, -7, 4185, 1564, -7113, -2642, 7894]
1415G894l045p406o29O85K377J922m48K245l680q798O007J0889m480o870J558
1430a779m80j586M876L984k668m450l851K935R542j149p703K024J53n250N934
1445E32P382m812o852q56L443M174J221l486j942p72l051L771Q964l962r822R88
1461e080M688J443J611K34k894m680p04O857N575l927o480o77K568K163K926J092
1477D715m161m638p84N193O641l163o929N21R78j229N280L646o284n678J969M380
1493D57K408J95l383l052P66J171K814M419m339p591K482N871Q10j154J75l001
1509i52m048L336O453K06m546l907r19M186L372n01j696j904l776J16P679L674
1525F773p459l730L009n24J057M896r31n108j514J262L144L763j807n500M60L055
$$ y = [7894, 4849, -2557, -3186, -2501, -124, 1798, 1350, 3595, -85, -8883, -2876, 8013, 3533, -3337, -1779, -2259, -3845, 1031, 5015, 2347, -2103, -5954, -3019, 6523, 5374, -2329, -305, -152, -5402, 532, 7914, 3102, -3750, -4606, -1163, 3011, 4232, 746, -1196, -1968, -5019, -1248, 7716, 3754, -6068, -5080, -392, 1051, 2662, 2896, 2, -4678, -5382, 1475, 7050, 3123, -3357, -4034, -1466, 697, 3623, 4715, 554, -4084, -4868, 325, 6966, 3803, -3126, -2605, -1627, -2856, 2424, 6070, -214, -5892, -3923, 457, 2865, 3060, -323, -3375, -2609, -1438, 1376, 5795, 1456, -6135, -3653, 2218, 3028, 1874, 2049, -952, -5000, -1664, 4789, 4995, 449, -3458, -4377, -191, 3181, 2680, 984, -920, -4696, -4580, 3099, 6773, -686, -4416, -1407, -1931, -874, 4022, 3091, -2017, -3531, -2269, 875, 4638, 2831, -2669, -2209, 846]
1541H46j314J543L509m479m351K505L723P41j905k019p23K45J480K042J32k419
1557d44l018Q82L653J730j869k742L28P87j084L731K831n709k877M212L84k52
1573E43K743k254l537K096M62o31L766r95o431L106M210n066R45N000n230l010
1589d283N350n0k449J802o09j498K843l65k726L204O85m413K379L380l808j448
1605b006K628K18k86l8q21J132j81k077J968J805l123j948K738M76j004p8n17
1622a114J153Q09k845K208L288n855j865P100n30m633K379J163l280J667K639
1637B284r33Q52k373m557N937M019o965K59M575o213k030Q892J177o185q16L10
1653a767M9L696P3k682J052k831l332P797M743p014k963K901n68J019L226m25
$$ y = [846, -468, 1075, 4584, 105, -4246, -1741, 1982, 2723, 818, -1201, -1924, -1679, -199, 1843, 1975, -444, -3462, -2580, 1073, 2803, 934, -1808, -1480, -693, -1777, 1954, 4785, -924, -3801, 411, 795, 543, 3286, 1032, -2505, -409, 53, -578, 3188, 2193, -4238, -1132, 3078, -1988, -1043, 3957, -1273, -4283, 1067, 1017, -1432, 370, -239, -1737, 1106, 741, -1985, 1219, 1904, -2509, -130, 3250, -558, -2006, 622, 840, 554, 516, -305, 827, 646, -1431, 537, 2342, -781, -2729, 9, 485, -519, -597, -1114, 39, 848, -1997, 211, 3499, -2356, -4221, 2879, 2349, -2284, 95, 1258, -2022, -355, 2284, 1351, 2203, -170, -4727, 1210, 5229, -1736, -1477, 3098, -3115, -5145, 3747, 4924, -1261, -2077, -1767, -1718, 1978, 2051, -631, 421, -2410, -5742, 2055, 6798, -216, -3179, -278, -846, 173, 3399, 2974]
1669B974k849l657o19N840M283n101l731K441j043l01O031J61n806l060J83M702
1685D48M548l823l857J536j787o06Q515K660r893l653M421J108K993K409m830
1700A89l621L83L23O872M853r354o339N436K005j330N650k61j0153k013O481M293
1716C414J840l598o549J163L105J74N003J315j0033m926P911O097j359j209l365
1731a017l448J673M044M375R42q911o307P078N838j522K62k028o296j08O771M807
1747F153r99o772o075L894O376m17O89J88q653k455R670N365l315l652m283o18
1763d904N086L910K16j476o443m393Q176P586m115l856r74m115K057P638J362
1778E755m318n086l354M720P511j109l902j223l581r17Q736M054o305m513r48
$$ y = [2974, 125, -3532, -4151, 1689, 5972, 871, -2860, -419, -1462, -1763, 4268, 4429, -1377, -4437, -4254, 448, 4996, 1173, -2684, -1148, -2935, -3541, 4974, 7634, -2259, -5912, -1491, -383, 2610, 5019, 189, -3432, -3049, -2726, 4146, 8999, -355, -6694, -1258, 747, -583, 5067, 4806, -5347, -7360, -879, 3414, 5254, 1656, -4893, -3730, -625, -451, 4552, 5867, -4166, -9092, -1181, 4916, 3557, 2348, -1017, -4465, -2792, 1252, 5627, 6569, -2342, -8649, -1571, 4267, 2745, 3007, 979, -5317, -5425, 1346, 6153, 5154, -1618, -7693, -3799, 2577, 2160, 2849, 3037, -5616, -8071, 1599, 6964, 3649, -3, -4286, -4904, 182, 4092, 4308, 2832, -3611, -8004, 172, 7758, 3643, -213, -1187, -5302, -3245, 4393, 5755, 1437, -3649, -7003, -2283, 5228, 4119, 217, -1006, -4587, -5504, 3232, 7286, 981, -3532, -4480]
1793d480J477N851K479l139k899l219j095P347N498n473n567M6M00K649N255j030
1809D100n777k590l80M991O041l659n628n0j63J165O001J273o723l727K083L175
1825A32L868M02n176k144L91O69N211L181o499m999K479K484K394J512k675m194
1841b964n14J672L536L307l828o018J678K965M07K794o46n056j247K223K946K925
1857D180k090m910j66K902P98J679J112m625k960K972K622J215j57m072j776K433
1873h43J326J037J265l190l784K176K955M53L43j661l319J406K589K0J151r50
1889I74l866R05L149N0R7J9k549n34K270Q44J55m82k315q69K898M56j268R22j343
1908d87k031J941J835n77m44j157p40J617P39o66N04l39j936Q46K538q26j053
$$ y = [-4480, -3003, 2848, 5327, 2188, -711, -3930, -5025, 2322, 7820, 2347, -3220, -3174, -2774, -125, 5130, 4100, -1677, -4267, -4647, 344, 6385, 2726, -2902, -2952, -3115, -1950, 4051, 5324, -1399, -5126, -3043, 132, 4000, 4402, -774, -2918, -2527, -1858, 3353, 6534, 35, -4964, -2485, -1, 2393, 3905, 1230, -2964, -3478, -1806, 1730, 5037, 1209, -4809, -3131, -166, 241, 3035, 2389, -2667, -3914, -1691, 1255, 4180, 2090, -2820, -2986, -84, 714, 2393, 3505, -1120, -4080, -1108, 1514, 2729, 2572, -1500, -3276, -843, 483, 1520, 2785, -405, -4189, -2013, 942, 1395, 1738, 77, -3242, -1836, 753, 773, 1924, 974, -2892, -1987, 1162, 1212, 1309, 1328, -1221, -1755, 515, 1359, 1514, 1032, -1283, -2152, 746, 1202, -66, 856, -487, -2518, -577, 1258, 681, 237, -920, -1660, -43, 696, 30, 534, 195, -1741, -895, 1643, 817, -236]
1925b36M16n03Q65M38j322J100N39k695O99K677j468j972J804N85j814N17O51
1942B81o79L75k06o56J493k70k367K056J723k120l78J314n00p60R70Q28m12o82
1960A0j079R39K245j279j639J337k93j771J513J970q85k617m45K191Q18j250J29
1977a06O99j581j488K573K475k039k121M10P34J084J27k97O81k090j723L332K962
1994C632k862k535J590L27j235J909J811k488k561N35K081K048j368k005K04l91
2010a308m06K760J979k720l663J367K886l4K23K25j902j772J114L311J013k500
2026E73k482J69J959R95P3K86j076l623O74M879N00l256j483P79l36O26K546M66
2044B269l057k160Q64L548J289k653j388Q76r31L27L474R27l864k892K412K928
$$ y = [-236, 180, -323, 542, 980, -342, 758, 1297, -1398, -699, 1978, 510, -1462, 342, 927, -887, -370, 281, -398, -23, -229, -885, 608, 338, -2029, 27, 1750, -370, -748, 566, 66, -694, 276, 1104, 692, 10, -1069, -130, 2115, 836, -803, 534, 241, -1530, -17, 1953, 1068, -1549, -1994, 197, 1015, -235, -106, 593, -988, -2476, 97, 2572, 533, -1588, -1178, -444, 640, 767, 470, 1151, -939, -2662, 670, 3632, 770, -1765, -175, 152, -1083, 826, 2637, 149, -2412, -1877, 204, 2252, 884, -1121, -917, -1308, -1714, 1046, 3025, 305, -3358, -1991, 895, 861, 1084, 1309, -593, -2365, -1251, 2060, 3073, 573, -1909, -1740, 219, 1214, 1287, 1573, 497, -3126, -2452, 2427, 2927, -329, -1812, -1033, -1369, -743, 1803, 2269, -788, -2948, -2084, 1464, 2753, 100, -1288, -412, -1343, -1016, 2458, 3385, -479, -3371, -959, 1969]
2060A969k85p99l57j641j245J446L623N5l760j879J432J887Q44l13k07j829k497
2077c556K041M409n34l409l35N89l86J759K520j587k883m30P03K571J686l026
2093A32j478J179q37J67L707m65m643n53L100L54k7M55j965j116O81J192J942
2110A825J66l413j200K560J187o44N82l36k462m00L213J435j241j698q79P24P77
$$ y = [1969, 1684, 885, 528, -1113, -2358, -912, 2711, 2766, -994, -2873, -1441, 446, 1290, 977, 770, -1059, -3556, -1515, 2894, 2360, -1049, -1384, -795, -1181, 578, 3098, 1511, -1372, -1802, -1099, 1472, 3158, 132, -1346, -167, -1004, -837, 2870, 2405, -2238, -2791, 309, 663, 636, 1091, -874, -1990, -1309, -117, 1825, 1991, -1422, -2622, -62, 1125, 481, 1063, 727, -1735, -2135, 1078, 2513, 1272, -426, -1305, -581, 196]
$$ [...]
8191f0
##END NTUPLES=NMR FID
##END=
