##TITLE=1H_E3d-4
 CDCl3
 8 sc, 
 15.6.2023
##JCAMPDX= 6.0         $$ Bruker NMR JCAMP-DX V2.0
##DATA TYPE= NMR FID
##DATA CLASS= NTUPLES
##ORIGIN= UXNMR, Bruker Analytische Messtechnik GmbH
##OWNER= root
$$ XWIN-NMR		Version 3.5
$$ Thu Jun 15 09:40:01 2023 Russian Standard Time (UT+4h)  she@DPX200
##.OBSERVE FREQUENCY= 200.13135
##.OBSERVE NUCLEUS= ^1H
##.DELAY= (6, 6)
##.ACQUISITION MODE= SIMULTANEOUS
##.ACQUISITION SCHEME= undefined
##.AVERAGES= 8
##.DIGITISER RES= 18
##SPECTROMETER/DATA SYSTEM= spect
##.PULSE SEQUENCE= zg30
##.SOLVENT NAME= CDCl3
##.SHIFT REFERENCE= (INTERNAL, CDCl3, 0, 15.7039)
##AUDIT TRAIL= $$ (NUMBER, WHEN, WHO, WHERE, WHAT)
$$ ##TITLE= Audit trail, XWIN-NMR		Version 3.5
$$ ##JCAMPDX= 5.01
$$ ##ORIGIN= Bruker BioSpin GmbH
$$ ##OWNER= she
$$ F:/spectra/data/she/nmr/H-F/1/audita.txt
$$ ##AUDIT TRAIL=  $$ (NUMBER, WHEN, WHO, WHERE, WHAT)
(   1,<2023-06-15 09:38:39.82 +0400>,<she>,<DPX200>,
      <created by zg, POWCHK disabled, PULCHK disabled
       configuration hash MD5:
       00 E9 B6 7A A2 85 ED C7 34 08 36 98 17 FE 4E 26
       data hash MD5: 16K
       47 9E 88 C4 61 C6 10 C2 53 2C 49 CD C8 6A DA 0E>)
$$ ##END=
$$ 
$$ hash MD5
$$ 3A 55 88 83 CE 58 D2 18 4D 3F FE 88 E5 A3 3C E0
##$RELAX= 
##$RELAX= 
##$RELAX= 
##$RELAX= 
##$RELAX= 
##$RELAX= 
$$ Bruker specific parameters
$$ --------------------------
##$DU= <F:/spectra>
##$EXPNO= 1
##$NAME= <H-F>
##$PROCNO= 1
##$TYPE= <nmr>
##$USER= <she>
##$AMP= (0..31)
100 100 100 100 100 100 100 100 100 100 100 100 100 100 100 100 100 100 
100 100 100 100 100 100 100 100 100 100 100 100 100 100 
##$AQSEQ= 0
##$AQ_mod= 1
##$AUNM= <au_zg>
##$AUTOPOS= <>
##$BF1= 200.13
##$BF2= 200.13
##$BF3= 200.13
##$BF4= 200.13
##$BF5= 200.13
##$BF6= 200.13
##$BF7= 200.13
##$BF8= 200.13
##$BYTORDA= 1
##$CFDGTYP= 0
##$CFRGTYP= 5
##$CHEMSTR= <none>
##$CNST= (0..31)
1 1 145 1 1 1 1 1 1 1 1 1 1 1 1 1 1 1 1 1 1 1 1 1 1 1 1 1 1 1 1 1 
##$CPDPRG= <>
##$CPDPRG1= <>
##$CPDPRG2= <>
##$CPDPRG3= <>
##$CPDPRG4= <mlev>
##$CPDPRG5= <mlev>
##$CPDPRG6= <mlev>
##$CPDPRG7= <mlev>
##$CPDPRG8= <mlev>
##$CPDPRGB= <>
##$CPDPRGT= <>
##$D= (0..31)
0 1.2 0 0 0 0 0 0 0 0.06 0 0.03 0 0 0 0 0.0002 0 0 0 0 0 0 0 0 0 0 0 0 
0 0 0 
##$DATE= 1686807519
##$DBL= (0..7)
120 120 120 120 120 120 120 120 
##$DBP= (0..7)
150 150 150 150 150 150 150 150 
##$DBP07= 0
##$DBPNAM0= <>
##$DBPNAM1= <>
##$DBPNAM2= <>
##$DBPNAM3= <>
##$DBPNAM4= <>
##$DBPNAM5= <>
##$DBPNAM6= <>
##$DBPNAM7= <>
##$DBPOAL= (0..7)
0.5 0.5 0.5 0.5 0.5 0.5 0.5 0.5 
##$DBPOFFS= (0..7)
0 0 0 0 0 0 0 0 
##$DE= 6
##$DECBNUC= <off>
##$DECIM= 32
##$DECNUC= <off>
##$DECSTAT= 4
##$DIGMOD= 1
##$DIGTYP= 9
##$DL= (0..7)
0 120 120 120 120 120 120 120 
##$DP= (0..7)
150 150 150 150 150 150 150 150 
##$DP07= 0
##$DPNAME0= <>
##$DPNAME1= <>
##$DPNAME2= <>
##$DPNAME3= <>
##$DPNAME4= <>
##$DPNAME5= <>
##$DPNAME6= <>
##$DPNAME7= <>
##$DPOAL= (0..7)
0.5 0.5 0.5 0.5 0.5 0.5 0.5 0.5 
##$DPOFFS= (0..7)
0 0 0 0 0 0 0 0 
##$DQDMODE= 0
##$DR= 18
##$DS= 0
##$DSLIST= <SSSSSSSSSSSSSSS>
$$ [...]
##$SUBNAM2= <"">
##$SUBNAM3= <"">
##$SUBNAM4= <"">
##$SUBNAM5= <"">
##$SUBNAM6= <"">
##$SUBNAM7= <"">
##$SUBNAM8= <"">
##$SUBNAM9= <"">
##$SW= 18.05172834244
##$SWIBOX= (0..15)
0 0 2 0 0 0 0 0 0 0 0 0 0 0 0 0 
##$SW_h= 3612.71676300578
##$TD= 16384
##$TD0= 1
##$TE= 0
##$TE2= 300
##$TE3= 300
##$TEG= 300
##$TL= (0..7)
0 120 120 120 120 120 120 120 
##$TP= (0..7)
150 150 150 150 150 150 150 150 
##$TP07= 0
##$TPNAME0= <>
##$TPNAME1= <>
##$TPNAME2= <>
##$TPNAME3= <>
##$TPNAME4= <>
##$TPNAME5= <>
##$TPNAME6= <>
##$TPNAME7= <>
##$TPOAL= (0..7)
0.5 0.5 0.5 0.5 0.5 0.5 0.5 0.5 
##$TPOFFS= (0..7)
0 0 0 0 0 0 0 0 
##$TUNHIN= 0
##$TUNHOUT= 0
##$TUNXOUT= 0
##$USERA1= <user>
##$USERA2= <user>
##$USERA3= <user>
##$USERA4= <user>
##$USERA5= <user>
##$V9= 5
##$VALIST= <valist>
##$VCLIST= <CCCCCCCCCCCCCCC>
##$VD= 0
##$VDLIST= <DDDDDDDDDDDDDDD>
##$VPLIST= <PPPPPPPPPPPPPPP>
##$VTLIST= <TTTTTTTTTTTTTTT>
##$WBST= 1024
##$WBSW= 4
##$XGAIN= (0..3)
0 0 0 0 
##$XL= 0
##$YL= 0
##$YMAX_a= 173962
##$YMIN_a= -142974
##$ZGOPTNS= <>
##$ZL1= 120
##$ZL2= 120
##$ZL3= 120
##$ZL4= 120
##$ABSF1= 10
##$ABSF2= 0
##$ABSG= 5
##$ABSL= 3
##$ALPHA= 0
##$AQORDER= 0
##$ASSFAC= 0
##$ASSFACI= 0
##$ASSFACX= 0
##$ASSWID= 0
##$AUNMP= <proc_1d>
##$AZFE= 0.1
##$AZFW= 0.1
##$BCFW= 1
##$BC_mod= 2
##$BYTORDP= 1
##$COROFFS= 0
##$CY= 11.3945322036743
##$DATMOD= 1
##$DC= 2
##$DFILT= <>
##$DTYPP= 0
##$F1P= 15.7292609196834
##$F2P= 12.9074282941183
##$FCOR= 0.5
##$FTSIZE= 0
##$FT_mod= 4
##$GAMMA= 1
##$GB= 0.15
##$INTBC= 1
##$INTSCL= 1
##$ISEN= 128
##$LB= 0.24
##$LEV0= 0
##$LPBIN= 0
##$MAXI= 10000
##$MC2= 0
##$MEAN= 0
##$ME_mod= 0
##$MI= 1.114404
##$NCOEF= 0
##$NC_proc= 0
##$NLEV= 6
##$NOISF1= 3.799351
##$NOISF2= 2.8
##$NSP= 1
##$NTH_PI= 0
##$NZP= 0
##$OFFSET= 15.70392
##$PC= 1
##$PHC0= -20777.39
##$PHC1= 4.252721
##$PH_mod= 1
##$PKNL= yes
##$PPARMOD= 0
##$PSCAL= 0
##$PSIGN= 0
##$REVERSE= no
##$SF= 200.130013532006
##$SI= 16384
##$SIGF1= 3
##$SIGF2= 2
##$SINO= 400
##$SIOLD= 16384
##$SREGLST= <1H.CDCl3>
##$SSB= 0
##$STSI= 0
##$STSR= 0
##$SW_p= 3612.71676300578
##$SYMM= 0
##$S_DEV= 0
##$TDeff= 0
##$TDoff= 0
##$TI= <>
##$TILT= no
##$TM1= 0
##$TM2= 0
##$TOPLEV= 0
##$USERP1= <user>
##$USERP2= <user>
##$USERP3= <user>
##$USERP4= <user>
##$USERP5= <user>
##$WDW= 1
##$XDIM= 8192
##$YMAX_p= 0
##$YMIN_p= 0
$$ End of Bruker specific parameters
$$ ---------------------------------
##NTUPLES= NMR FID
##VAR_NAME=  TIME,          FID/REAL,        FID/IMAG
##SYMBOL=    X,             R,               I
##VAR_TYPE=  INDEPENDENT,   DEPENDENT,       DEPENDENT
##VAR_FORM=  AFFN,          ASDF,            ASDF
##VAR_DIM=   8192,          8192,            8192
##UNITS=     SECONDS,       ARBITRARY UNITS, ARBITRARY UNITS
##FACTOR=    0.0002768,     1,               1
##FIRST=     0,             0,               0
##LAST=      2.2672688,     0,               0
##MIN=       0,             -142974,         0
##MAX=       2.2672688,     173962,          0
$$ Real data points
##PAGE= N=1
##DATA TABLE= (X++(R..R)), XYDATA
$$ [...]
1271c105M170J082m892K670K137m112J959K569m344O96L235l026N24K892l694
1286a239o29L910k094q82L266k915k030M193o75k037K926j648l238L612J071k573
1302i82K004m10l625K735K502k664Q29M92l652J787L501k400j39J268l548M19
1318a883M682j644j785J734k626j002M774K7l140J128j087j903M120J450l453
1333f08J19j53j914L227K475l207j035L98j661K543L217k874j881P92j354J622
1349b94L820k162l104Q64m00N97L707q76l744J32M10L76L206r5l934m34R87K11
1367g33K829N50l850j190J432L80K343J147l714j856J825O57J555J663l254k738
1383b954J787J469R51J517k341l431J455K101N84J245j650l641P33K762P75O06
$$ y = [-3105, 1065, 2147, -2745, -75, 2062, -2050, -91, 2478, -1866, -1170, 2065, -961, -437, 2455, -1239, -1868, 2042, -52, -934, 2332, -583, -2613, 1580, 905, -1132, 1794, 146, -3092, 520, 1591, -982, 1022, 612, -3013, -278, 2224, -440, 389, 881, -2771, -984, 2517, 117, -22, 1246, -2302, -1883, 2799, 1155, -630, 1104, -1522, -2524, 2250, 2277, -863, 265, -822, -2725, 1395, 2845, -608, -489, -642, -2556, 671, 3146, -61, -1096, -698, -2359, 184, 3401, 527, -1354, -562, -1916, -294, 3526, 1364, -1740, -876, -1276, -679, 3028, 2152, -1592, -1460, -1050, -674, 2532, 2437, -1497, -1931, -944, -733, 2096, 2646, -1204, -2394, -962, -582, 1761, 2908, -806, -2662, -837, -180, 1375, 3038, -216, -2954, -1167, 302, 1253, 2770, 429, -3002, -1547, 554, 1138, 2383, 733, -2908, -2175, 587, 1362, 1968]
1399A968j024l409j58K943J266J77q26k946p22K820J732K6r57k627q80K422K133
1416A938R6j254k395q71K185K058L28j139k525j147K309K147K63j042k372j509
1432b930K164K564O2r06j990j899J821L128j05j162j211j994P41L547N53j867
1448E16j054j277j0L048J488k059j714l64l0J985K153j517k711j93Q11J139J842
1465B053l71k967j141J597J427R98J61k268k282J512K418M41p7j266k549L23L080
1482A089Q41j016m72j742j019K681J929j443j066m59j226J227K735o95k155j16
1498i07J3O6K010O97k295j272J144O09L77J099j021k296M79K118K8k41K80j789
1516i01j278K628J509j751n3p1k128J138L206j363j839J185j164j000L377M40
$$ y = [1968, 944, -2465, -2623, 320, 1586, 1763, 937, -2009, -2731, 89, 1821, 1847, 890, -1737, -2617, -195, 1938, 2034, 780, -1615, -2486, -301, 1757, 2085, 946, -1579, -2726, -417, 1730, 1993, 951, -1421, -2930, -766, 1798, 1860, 954, -1036, -2935, -1114, 2014, 1909, 747, -464, -2458, -1717, 1830, 2383, 516, -538, -1815, -1825, 1223, 2711, 652, -1062, -1426, -1456, 529, 2682, 1165, -1546, -1739, -928, 211, 2053, 1682, -1285, -2426, -829, 598, 1596, 1757, -511, -2793, -1281, 1137, 1578, 1501, 235, -2314, -1991, 1089, 1930, 914, 442, -1300, -2319, 362, 2291, 848, -218, -677, -1903, -676, 2059, 1364, -791, -907, -894, -828, 1182, 1879, -416, -1688, -544, 65, 442, 1541, 520, -1776, -1297, 821, 849, 608, 888, -901, -2179, 449, 1958, 207, 154, 83, -2045, -907, 2299, 936, -903, 282, -882, -1882, 1495, 1935]
1532A935l070N85Q14j962J865K367k832j193K153j053m43K715r35k663J570Q44
1548F97j344J261N91k132m2J640m77k28N79q27p19J004P55l93o86j36J27o7O16
1567B19Q61j118j109J103L12o96J449m3k363P82J540j385O70J436k473o43K637
1584A179j093j072K509j192k282K546M45k409J730Q83k794J176J883k496J70K236
1600A419j935m22K367j427j433K183l53j350J849j83j885J173O24j276J074M37
1616H62j563K89Q14o48L86M37r03nL55k78L87J27p30N82J38p75P31J59j264J069
1636A70Q75j629M15J044j928M21K354j636r84J868j405j162L061k20k391J519
1652C72j38k113K457J349k821M20J185k341J143K651k227j108J845j352m34K814
$$ y = [1935, -1135, -550, 264, -1698, 167, 2534, -298, -1491, 662, -391, -834, 1881, 946, -1717, -147, 697, -647, 614, 1205, -927, -969, 671, 194, -34, 545, -282, -1001, 3, 758, 365, -321, -457, -330, -397, 219, 1080, -38, -1147, -44, 268, -428, 1021, 978, -1385, -603, 937, -448, 222, 1658, -815, -1458, 1179, 86, -986, 1523, 331, -1951, 595, 1040, -1369, 361, 1244, -1550, -374, 1509, -987, -817, 1419, -516, -938, 1429, 2, -1431, 752, 399, -951, 898, 715, -1170, 3, 627, -649, 425, 862, -701, -412, 402, -246, 140, 577, -326, -331, 24, -254, 133, 260, -470, 112, 250, -525, 206, 365, -899, 170, 1045, -584, -169, 875, -1053, -632, 1722, 86, -898, 970, -435, -1597, 1464, 1244, -1147, 372, 234, -1879, 578, 1927, -894, -474, 711, -1630, -487, 2164, -63, -1171, 674, -678, -1112, 1702]
1668A702p87k144J234O1r95J839M07k089J50O83l78R57L07j289l60L07K13J094
1686I12j90j372K13j0k60J781K09k255K41P46r43J508J413k656p56J812r23L93
1704a37K373k047k082K127p6p78K368o02l064J313J281j274J463P21l057O4K192
1721G85r33K07J399k085j215K143J92o01R92q85j484J283R73m51K45m91j107P70
1739b63Q14j13J76o95q89Q74N80l25N94o09j349R92R31p99M06J37j607M24J522
1758H01o57j36M83j300j19J675k55p15O77q17o88J606K60j114N58j60j023J182
1776B58O79j182O4L85q46N50R83q91n08N89l99J20Q54n36o57L95o3J95O69n55
1796A04o32M93r2M1Q46m88q63M81J90k48Q49k34j083K55N59k68N10J85j091o8
$$ y = [1702, 915, -1229, 5, 66, -929, 910, 1317, -772, -622, 61, -317, 640, 947, -342, -702, -395, -182, 912, 722, -650, -437, -447, -707, 1074, 1283, -972, -731, 15, -928, 580, 1993, -663, -1419, 393, -530, -137, 2236, 189, -1893, 234, 158, -620, 1748, 1146, -1918, -605, 676, -598, 865, 1586, -1471, -1407, 785, -148, 59, 1458, -627, -1842, 301, 493, -108, 884, -1, -1485, -202, 771, 320, 565, 74, -1033, -263, 551, 438, 614, -81, -970, -96, 484, 159, 753, 144, -1205, -213, 718, -81, 325, 462, -1145, -721, 801, 144, 8, 491, -809, -928, 747, 492, -223, 454, -363, -1051, 555, 815, -299, 259, 99, -924, 258, 937, -245, -181, 204, -642, -92, 891, 0, -508, 81, -318, -198, 656, 120, -537, -142, -205, -10, 659, 104, -528, -35, -127, -86, 760, 272, -591, -110, 80, -168, 681, 447, -636, -381, 178, -90, 420, 605, -486, -554]
1816e54O59j42K94K52r31k49O79O4J59L70q55n51Q92J58j01L31n04p37O74N36
1836D44k31K08l63p62M42O81j15K6k35p55K39P61n1o3j01p63R7Q45K0k08K9o63
1858e18p2Q29J68k57j4m75j93P13L53j86j38n15k66P06M12m05kl17m47N22O40
1879E38l63j84k4n57K64P98k60k99Mk30j5O79qm04p4j23L4N30M2m00j30Q5n9L51
1903A95L08n19k25J60k4J95L02k50m74J20J36J89J3p1j74j98J34L97j8k72kJ8
1925f0k12M04K49m40j29L65k17J0L75k08m77L09K74k68J52J25n33P0M91k55p6
1946e1J80l18j55L67J87k58J00j20k51K93L66k70j29P2j33p2N01Mm50k6K79j45
1968b9O5M18l96m98M15K77l61K32J81o98o9Q05k39k72L27k58n23O92L40n77J17
$$ y = [-554, 105, -37, 257, 509, -422, -671, 8, 72, 231, 601, -254, -805, 87, 245, 144, 475, -29, -766, -92, 444, 213, 421, 58, -704, -262, 419, 304, 330, 95, -660, -421, 340, 289, 226, 125, -638, -541, 304, 324, 116, 145, -518, -590, 239, 407, 150, 136, -339, -532, 181, 534, 348, 210, -305, -571, 135, 547, 142, 140, -177, -624, -102, 538, 175, -9, -33, -590, -326, 472, 212, -87, -83, -313, -328, 351, 343, -61, -135, -258, -224, 306, 348, -52, -182, -97, -156, 195, 503, -16, -241, -81, -105, 90, 392, 142, -332, -212, -76, 113, 126, 55, -119, -317, -183, 214, 196, -76, -78, -60, -272, 132, 381, -59, -188, 177, -40, -30, 345, 137, -340, -31, 243, -25, 127, 252, -281, -211, 280, 25, -51, 129, -189, -344, 23, 210, -48, 52, -68, -319, -26, 340, 70, -59, 13, -120, -192, 309, 313, -137, -163, 116, -29, 36, 454, 58, -440, -25, 252, -109, 123, 304, -394, -463, 342, 103, -169, 158, -100, -623, 69, 409, -168, -51]
1989e1K63o10J50P89l64l74K82j55l08P02K36o80p0K50j75K01L93m32m38L76N3
2010C8j57L57Jn00j37M46%n6K95l12m73L19N07l00L0K01n73o4P14o2m61L50j06
2033E7m95M75N48o47j21M39n37q6Q64k88o79M44Q2m67N25L90p87oM75l77M3O26
2055D78m08m59M35J31l09L12R8n76R9M92k14n1J81k08k81L79J07k53L7P8l56K
2077b86M98k2m21K26L2l56L28L63m53j07M15k61k00O60k25n54M51K31n90K90N33
2098E52p49r7P00m41k93O72k44o07O49K13o43K28L51o96J45P16m58l31N40k87
2118h0l42O11J81n41J43J69m19K04M83k89k85K63j11j87M68L4m02p1L23j54j03
2139a05L34r7m74L08K90l83M5L91m83k72P29j5m94L55P2p07M50O56o75k16O28
$$ y = [-51, 212, -398, -248, 541, 177, -197, 85, -70, -378, 324, 560, -120, -190, 60, -115, 86, 479, 47, -391, -15, 38, -119, 238, 239, -261, -398, 48, 48, -8, 287, -25, -498, -179, 328, 28, 58, 259, -314, -378, 336, 274, -187, 163, 57, -438, 37, 585, -62, -183, 256, -281, -367, 497, 209, -470, -26, 56, -411, 114, 504, -283, -289, 186, -191, -148, 478, 70, -389, 46, 177, -132, 180, 278, -298, -199, 293, 79, 28, 209, 1, -280, 99, 206, -47, -10, 68, -288, -286, 212, 190, -231, -5, 27, -329, -1, 362, -91, -198, 217, -44, -244, 416, 191, -363, 88, 319, -271, 19, 552, -197, -294, 406, -35, -328, 344, 100, -507, 142, 355, -288, -60, 291, -405, -260, 456, -2, -333, 207, -80, -422, 189, 370, -171, -28, 141, -278, -74, 409, 120, -165, 98, -13, -200, 268, 302, -100, -171, 152, -2, -105, 229, 132, -342, -34, 256, -127, -82, 309, -174, -446, 283, 268, -226, 129, 201, -506, -56, 600, -75, -291, 337]
2160C37m34l47Q80O0q52L20K58o01L56O89q17l24P19l30k07O78m5q28L55L13m33
2181b53K96L54n59j03L96j17q3L57k16l81L55K02k74R3P4k46j11L74N4k24m0R0
2203C8k68J52K66j00k74J45N5k87L26K23m20j16L71j77j34M93j70m02K33K15l58
2224a89K63K80m05n8L34k59j06M02k27k22K55l5j66J81R6l18J20Q4j91J07K17
2245A63k54KJ18j80R9K19n0k48J95mj07J40N1j21n1k2O0J02n7q9Q2j60P1K18r8
2270G9j41R4j15j14L22m7k25P7R5j90K56J87l68m0K04j82J25K17j94k10J82n4
2292d2L4L58l08k69K24K6p7L22r2m46J62J43j05K18nl72L4J99J8J08M5l24r1L00
2316F0K2M4J3k90j06L33m7J26J12m59o0K83R1j55K29k47l25L89J38q5Q1j89l53
$$ y = [337, -97, -444, 436, 496, -356, -36, 222, -379, -23, 666, -151, -475, 244, -86, -293, 385, 340, -488, -133, 180, -253, 43, 397, -162, -265, 131, 14, -69, 288, 72, -309, 46, 248, -26, 67, 141, -105, -216, 158, 212, -12, -52, 38, -230, -78, 188, 88, -186, -41, 14, -273, 53, 276, -144, -260, 111, -66, -200, 293, 123, -279, -46, 169, -189, 74, 354, -51, -109, 225, -34, -140, 262, 35, -187, 68, 33, -133, 48, 144, -174, -54, 30, -161, -54, 163, -91, -89, 29, -151, -52, 167, 117, -131, 64, 60, -47, 93, 144, 23, -28, -50, 10, 112, 55, -34, 48, -112, -41, 177, 79, -62, 32, -83, -197, 125, 78, -147, -70, 25, -165, 91, 278, -90, -130, 74, -108, 17, 234, 40, -170, 12, -42, -8, 350, 42, -227, -3, 23, -54, 268, 176, -270, -108, 35, -70, 148, 143, -229, -195, 4, 22, 130, 175, -149, -240, 60, 82, 126, 139, -151, -257, 76, 29, 155, 267, -192, -252, 31, 122, -33, 196, -51, -376, 13, 151, 66, 147, -42, -395]
2339c95K54L23j12Kjm50K00M09j45l6J35m73R7M48n1r9Q1m16j05N08O2k01L8j62
2363h9k99M44K81l43O6j67k59L60K55k55Rl6l11K35L91j42j28J4k49J00M68k07
2385A38j47Q7k34m5M90K9l90J38j63j91M72J27l93J25q9k95M19K80m19k6Q5l00
2407c02K32L98k79j40J50k36jN57j69l39J54q8j49L94J18l89O5K9j92K28K61l34
2429c2j17J04q1J23K08j48k15R0o6J78J13j25j04O4r5J01J64j62p1Q7n9l6L32
2452B53k38j19J15nj12L49j28l51K72N2k96L48Q7m61P6L30k23mL37l10l04L91
2474E9L6k03L14j26m00L21K09k20M1P5k80K2M37j93j63J39j24o8K28O2j39j21
2496i4K1m0Q4J58n9k11r4J43J15K6O5j05k75J68K65j23M1O5l65o1M95N2l02J33
$$ y = [-395, -141, 182, 70, 72, 71, -379, -179, 230, 85, 49, 184, -289, -192, 256, 205, 106, 187, -229, -334, 174, 236, 35, 73, -89, -388, 56, 337, -6, 60, -107, -366, -6, 249, -6, 3, -33, -344, -109, 282, 140, 12, 26, -223, -123, 345, 138, -9, 78, -156, -201, 289, 318, -72, 66, -97, -288, 184, 311, -82, 43, -46, -341, 78, 358, -61, -87, -2, -302, -70, 328, 49, -91, 59, -177, -178, 379, 210, -129, 25, -63, -212, 182, 300, -89, -24, 5, -187, 41, 302, -32, -149, -45, -126, -3, 205, 57, -158, -68, -134, 44, 157, 32, -72, -8, -103, -2, 162, 0, -71, 16, -43, -79, 253, 15, -104, 11, 6, -106, 243, 115, -236, 36, 88, -208, 140, 227, -234, -158, 172, -51, -55, 282, -28, -332, 59, 95, -108, 206, 80, -320, 1, 210, -10, 31, 106, -174, -152, 285, 92, -71, 68, -56, -124, 104, 166, 27, -94, -73, -113, -29, 129, 70, -141, -235, -92, 23, 49, 114, 9, -266, -98, 167, 44, 85, 150, -215, -276, 219, 271, -31, 102]
2520A02r4l83L70L81m10j5K27n23J75N42k26k96J88j96j98M43K87m79qJ14k10
2541b09K00L68k49l91K41Mo7M28J8o21O5L18p0M8K57l71l15K47K15j07J27K8m73
2564c09K6M46O0k17J64j85l68L06L84k63p4J78l79l9N41nl82J21o6k50L38L71
2586C98l27k08J63j23m5M24o7m38J36J16k34J96K69l59k03L98j38q8L45m2m15
2607b42J76K87k43L7K49l32j82M59j29j85K68j3m81K18L42k20k7J56l04j76M31
2628H9M6k29R1P3l39J23L60j73j16J96j98j01K74Q4k31M9N7j91J47K60k21j66
2650a16J52l5j15K24N3k70k3K20j37m2K52j65k57K50O6j71J81Q2l89J06L18j54
2672C0r0K32j64k21L44N9k68J96Nl44K05K78k60j32J82j53p1M23j30k82J16M5
$$ y = [102, 8, -375, -5, 376, -34, -49, 178, -345, -170, 372, 146, -150, 38, -158, -356, 87, 374, -105, -113, 1, -209, -9, 359, 110, -281, -40, -36, -103, 325, 343, -278, -213, 105, 35, 83, 340, -31, -346, -99, 116, 9, 136, 164, -309, -283, 163, 223, 6, 170, -15, -383, -77, 307, 44, -30, 148, -231, -270, 271, 266, -116, 5, -61, -311, 27, 398, 71, -137, 26, -97, -142, 282, 215, -223, -87, 29, -205, -9, 260, -99, -302, 96, -42, -130, 215, 173, -242, -66, 221, -22, 15, 264, -68, -250, 209, 80, -105, 163, 150, -331, -113, 229, 9, -18, 138, -166, -342, 89, 135, -94, -3, 70, -269, -146, 214, 41, -75, 121, -77, -178, 96, 180, -51, -2, 55, -136, 11, 271, 50, -116, 36, 1, -114, 110, 163, -107, -130, 90, -47, -89, 163, -2, -259, -9, 57, -114, 67, 149, -240, -134, 184, 30, -60, 172, 8, -213, 131, 190, -78, 118, 123, -221, -16, 262, 2, -130, 52, -101, -172, 251, 121, -161, -45, 0]
2694@j53J73J89k58r8J10kK7J49m3k87R5J67k9K9M1r2k81K90J75j35lk9k18OL52
2720A75j1j61K5j37j67L49K37l93l5J50k40J67L69k41k81J26oo9M38l3l97m4J90
2743A1l4J51K28l67k95K35J8J83J77j93l53L6J76J68J05j41k64j33J52K69J77
2764C06k18j77j67N3L08L06k05k64j70L1J30M53j46l50n8rJ50L28Q7m96j88J22
2786a74M9L50K15m80l55K62K6K14L33l63m28N5K40J64K32j39m71m3K61K29J80
2807C57p2n19j32K80K25K28l9n02k75L23K81J70Rm85l07K74K63K23M9l71m04K08
2829b16L00J89R5l76l66J18L44J98J35l74m51J14M19J00P5j78m81J8L90K24J3
2850B90j62m23j17L81K95M3k02l23j84L30K82L7r0k99l02L90L45pr9l10k65K59
$$ y = [0, -153, 20, 209, -49, -147, -37, -39, -12, 137, 94, -193, -98, 69, 40, 69, 110, 18, -263, 27, 202, 67, 64, 35, -183, -177, 175, 164, 3, 28, -109, -276, 73, 310, -83, -118, 32, -208, -41, 328, 87, -194, -68, -74, -143, 295, 262, -135, -179, 11, -23, 128, 356, -11, -306, -71, -53, 130, 307, 114, -239, -203, -27, 141, 246, 105, -159, -292, -140, 129, 306, 88, -89, -256, -203, 105, 411, 206, -58, -228, -197, -67, 386, 240, -110, -168, -177, -27, 301, 388, -108, -296, -174, -125, 225, 440, -40, -395, -133, -107, 107, 440, 77, -351, -296, -56, 108, 340, 201, -270, -313, -52, 177, 357, 285, -234, -366, -86, 139, 367, 328, -174, -449, -126, 155, 325, 334, -151, -458, -184, 79, 302, 351, -20, -424, -216, 84, 273, 368, -8, -374, -256, 88, 286, 421, 47, -404, -290, 129, 229, 304, 126, -355, -337, 53, 277, 290, 128, -295, -412, -31, 264, 307, 105, -218, -402, -72, 210, 247, 157, -142, -444, -54, 291, 284, 185, -125, -390, -131]
2872a31L92j5j59j92k23J05M57N4k25j49k26J04L72J07j28j86k83Q4L41J63j93
2893F9j00k09k4L93J38j31j67j18l3K49K89k08k05o2l2K22K04q1k62rj07J18L22
2916B56j15k39k5k3P9K54j1k20j57R8M7K23J9k51r3OJ61J13J06k13j56L6P8J70
2940A43K3j40j28j0L8K02K1j65r3rk0J97J10j40j01O7p0J4K60j34k03J28p8j2
2964a00K02L4k09O1M2r2P6J20j23r5R5l8OJ28l1k10J00L2p1J18Q1j27j42J49m4
2989c8Q0R7k6k56K2J77L2LL6j54j33R1J79l0n9j3j78k1K26J16j72K2q5j31J88
3014b7K14j82q4L0j65J23L56j12k77O4j2o1K51J07k16j77J30K0J42J53j93l86
3036c02J40J26J33J26j17k99r6K99K04l5m5l16j67J94L71M5k08j81j46P1M30M4
$$ y = [-131, 261, 246, 87, -105, -328, -223, 234, 288, 63, -86, -312, -208, 164, 271, 143, -43, -326, -242, 99, 262, 69, -31, -240, -264, 129, 267, 136, -31, -149, -182, 67, 356, 148, -57, -119, -151, 71, 275, 194, -68, -77, -184, -66, 256, 141, -98, -123, -146, -67, 187, 176, -44, -201, -103, -56, 167, 186, -65, -158, -152, 9, 122, 228, 15, -141, -105, -27, 143, 166, 26, -102, -112, -74, 128, 149, -16, -109, -118, -138, 59, 169, 29, -72, -5, -75, -61, 199, 65, -138, -10, -88, -100, 102, 136, -73, -12, 30, -62, 14, 134, 11, -84, 11, -27, -21, 107, 76, -134, -34, -2, -73, 45, 126, -1, -143, 6, -38, 42, 139, 113, -143, -121, 56, 88, 91, 127, -27, -160, -69, 110, 80, 21, 8, -170, -191, 35, 151, -21, 1, -84, -215, -27, 187, 5, -79, -49, -214, -91, 265, 153, -124, -60, -72, -133, 118, 225, 9, -168, -38, -18, 124, 277, 84, -302, -162, -36, 97, 223, 106, -193, -289, 10, 214, 179, 134, -182, -349, -155, 216, 261, 53, -128, -274, -203, 227, 271]
3058B71j98j39j75l2L44L20k14k84o4j0K20L66r1m78l7N0J60K61Om54j95K88J71
3081H6J06N1k28m66K49L34J20m1j56l78mM71J78j53j13k90j67M55L76j69l08j57
3103b04j29K28M54Rm26j17n4P9L95J56l64l15O4J04K88K84l52l84L5K24J20K74
3125C69j04n15r4L95J67O9k3m16k81L33M33o3j67k67j81J26N36Q2k79k63j25n4
3147c22N12L03m19l25lL0K62M71k22n13j02K16J02L82L2n21l10K20L47N5K22l76
3169D1n63K31M27P0J0j40m83QN43J60j52j34k97j75M28M46j97j65k50j31K78L97
3191C52j3k96k66o1J36M05J45l46l30l5K90K33J43j83m35q4K87K67O7r4l62j61
3213c41J73M06%q0k73k29J03M40J31k71j42j20k1M11J87k64k05r1p3L35K53j37
$$ y = [271, 73, -66, -241, -273, 71, 391, 177, -107, -171, -181, 39, 405, 314, -164, -201, -151, 9, 270, 276, -178, -373, -85, 86, 192, 243, 15, -451, -202, 132, 252, 211, 55, -323, -327, 144, 322, 169, 56, -234, -401, 54, 430, 261, -47, -204, -333, -105, 349, 358, -68, -185, -239, -160, 235, 391, 27, -288, -224, -120, 168, 452, 100, -284, -249, -25, 95, 369, 265, -250, -344, 51, 218, 287, 264, -152, -433, -100, 333, 270, 103, -164, -345, -219, 317, 399, 120, -143, -268, -322, 190, 493, 74, -251, -254, -224, 38, 509, 287, -226, -328, -112, -10, 372, 404, -117, -427, -207, 140, 195, 417, 41, -522, -291, 136, 206, 216, 76, -407, -399, 144, 304, 152, 18, -279, -454, -26, 420, 223, 58, -192, -323, -45, 352, 339, 43, -223, -284, -148, 257, 402, 56, -274, -309, -19, 214, 357, 174, -261, -345, -58, 209, 276, 182, -180, -341, -168, 238, 238, 158, -115, -344, -241, 199, 330, 59, -83, -203, -224, 187, 374, 110, -95, -186, -259, 76, 329, 192]
3235A92k75j22j5J70K95l5l54q7J32J09J87Lk39j86Q6K05J14Lj51j67o1K47J28
3258A79Rj24k22k7J61K38o7q1j29p7J01J60J4j62p2j1L7J60M8o6j83pN5J14K00
3283B48j77j23k9mJ13J63j89n4L6k8J19l7P4j39o5R8m2J20o1m1o5K3Q9l8P5p7
3309a1q4P6l2L7J14j10j9m5%J04J8l0nr2j5L6J35M0q4p6j01Q5Q5N4l4r3m7kJ17
3338B1J23j41o7k1q3J51K25j41j45qk0R4J29O2j97j01n8J42K03K1j39j88l9Q5
3362i2K54O0j15k43p4J00K31R1j73j46j29J56K04J35j75k57r3J10L53M8r4k93
3384a42o9J05J83K39j93k06k06N1L14K48j07k89j43k9K58K82o1l10k39J23J49
3405d2L06J1l29k65Q1K66K94l0k55l20K9K35L60J6l87k88L4K57L11J9k51k95o3
$$ y = [192, -83, -205, -220, -50, 245, 210, -144, -231, -99, 10, 197, 200, -39, -225, -139, 66, 180, 183, 32, -135, -196, 51, 179, 188, 64, -158, -185, -24, 214, 147, 66, -63, -140, -39, 121, 135, -27, -99, -110, -73, 87, 135, 69, -114, -121, -66, 48, 248, 71, -52, -81, -85, 28, 191, 2, -52, -16, -44, 75, 38, 112, -27, -92, 6, -36, 84, 23, -18, -83, -60, 29, -9, 66, -11, -95, -19, -51, -14, 100, -10, -29, -74, -74, 30, 48, 18, 13, -79, -94, -58, 77, 117, 33, -43, -144, -59, 26, 80, 46, -47, -94, -96, 21, 144, 3, -64, -85, -168, -17, 208, 67, -78, -86, -106, -12, 117, 179, -18, -119, -177, -35, 168, 189, 50, -138, -177, -92, 162, 222, 107, -136, -210, -110, 121, 212, 39, -107, -236, -80, 124, 259, 84, -173, -266, -156, 197, 245, 151, -142, -211, -106, 77, 316, 123, -83, -289, -238, 76, 324, 217, -72, -215, -244, 14, 296, 235, -75, -314, -191, -42, 264, 275, -54, -319, -238, 28, 322, 292, 37, -283, -254, -19, 341, 357, -30, -318, -284, -27, 284, 303, 52, -243, -306]
3428c06J70L70R6k65l37o4K27L59Q0k19l18j34K54L01O0j03m21r6K48K49J35r7
3450A89l76j59K91K80Q2j44k77k72K55L04J55j42l36j73J24M54O8j95k46k06J23
3471b01L26J80j40k98j83J06L35K13j51k55k76J52K68K14j50j92k32P5K95J46
3491B32j03k21j79ML87J39r1k57j54qL51J59j28k17k24L9L42K08m5l20j52M7J82
3514iL04o0l09k15J13J53K66M7l32k56J32J94K25k2k43j79q2L13J47N0j88l01
3536b52M0K26K04o2j31j87l4K11K57p1k29j56j5J66K22J10l52j33M9N0K08J69
3558B90k12l00M5J38J31J15j12k92l9J95J70J03r2k53j89K08K60jj8j91k47J68
3580a23K98M2j17j51k05J09K80J14k14j02r5m3K75J32r9j91n4L5Q2K00J3k52j26
$$ y = [-306, -136, 234, 330, 65, -272, -336, -109, 250, 330, 111, -207, -341, -87, 214, 274, 171, -250, -346, -98, 151, 286, 189, -187, -346, -55, 225, 307, 163, -114, -386, -131, 173, 328, 186, -150, -323, -199, 255, 323, 128, -118, -324, -201, 125, 305, 165, -133, -316, -210, 125, 338, 187, -68, -344, -192, 76, 290, 140, -52, -284, -209, 86, 232, 129, -92, -271, -267, 120, 259, 168, -89, -243, -251, 100, 259, 131, -86, -310, -271, 71, 279, 234, -86, -238, -191, -9, 295, 235, -74, -289, -176, -23, 243, 290, -42, -298, -166, 28, 253, 231, -12, -191, -273, 40, 187, 237, 49, -252, -212, 14, 218, 156, 25, -162, -196, 15, 272, 201, -28, -184, -199, -33, 189, 299, -53, -186, -137, -87, 121, 290, 78, -222, -177, -39, 92, 207, 95, -197, -236, -41, 129, 232, 140, -113, -302, -94, 166, 165, 147, -44, -291, -123, 175, 217, 100, -51, -256, -147, 133, 247, 33, -69, -164, -207, 68, 200, 101, -90, -144, -109, -27, 173, 186, -66, -192]
3603a92J01R5J20O6j97j93N5K04M4lrk24rK07N9jj15o9j74K08J65m9n6p1j47Q9
3629i6K06m8k1n4n5o6J25J08l1p8j4qj8J68q5q8l3K8J4R6J3m3j10L3M6J7J7J9
3657D2q4k3Q3l2L4K3pj33J08l8N8K5Jr6j6J15j9rM0j21r9J26L7N9J2q7j28%J07
3686b2J30Kn7j03n8Q5R9Km4j02p8R4J14L5o8q0p4K5J47R7j07n4r0L9P5J13Lj52
3714b9k8O1J1Q8Q9k00j86P0J32L5J41k12j16q4K13J55N3j90j37m3K54R6m4q3j91
3739a45JJ25K15k6j48j43m7J12K67j4j54j63j15K07K61m2j12k82lJ74J86R0k12
3762C2k42m4K46J80M6j10k81n5K24J69J23j79k84l3N1K63J21r7k62k09K09K97
3784A65J43j77k53j77J64K99J25j48k85j02R3K87J82j99k21j33O2L07J71j25k62
$$ y = [-192, -91, 4, 124, 190, -7, -200, -145, 59, 103, 100, 91, -133, -142, 65, 124, 123, 8, -61, -235, -27, 138, 89, 33, -38, -185, -96, 110, 62, 41, -13, -68, -134, -9, 99, 68, -10, -24, -32, -50, 118, 33, -55, -88, -60, -46, 50, 63, 20, -90, -57, -11, 6, 23, 42, -42, -65, 18, -14, 20, 43, 36, -97, 11, -27, 31, 56, 57, -39, -55, 60, 41, 32, 72, -49, -148, -22, 15, 74, 86, -1, -129, -129, -22, 108, 110, 53, -50, -108, -23, 76, 78, 34, -68, -146, -52, 62, 97, 29, -51, -125, -100, 47, 144, 37, -17, -107, -68, 7, 120, 123, -29, -57, 4, 15, 103, 192, -8, -194, -124, 8, 43, 184, -28, -144, -228, -15, 140, 193, 3, -134, -177, 77, 173, 129, 46, -145, -144, -19, 196, 170, 22, -121, -168, -56, 211, 197, 43, -120, -235, -28, 233, 191, 79, -203, -206, -32, 154, 244, 32, -210, -254, -8, 172, 218, 108, -173, -228, -4, 165, 288, 109, -175, -208, -157, 106, 227, 130, -132, -341, -132, 165, 308, 131, -122, -299, -135, 164, 289, 141, -144, -246, -153, 134, 316, 117, -104, -237, -175, 132, 303, 178, -84]
3805h4j92P9L22J64n2l23j44J9K90K51r1l06k04K9K69K97p3l42j92J5K32K78L
3828B45k70k38M9J79L30K8l07k61K9K18K24J06l03k73P3J81K31Q5k35l45N6Q1
3850a17L43L7k13k31q5K23K14J11k27k22p9P6L90Q9k01k66m8R1K25K04j93k43
3872a22o6R9J75J72r1k44j46J73J74Q5j28j86j75K02J07K01o8k06j77J17J76O7
3894A39J1k55j32J37J46Q4Qj71j30OJ98J01Mk06j05nJ84J30k5q6j72l1K01J13
3918A44j1j55j51L1J10J70j1j63p1N6N4R7N4j50r1rR7J73m3j00j22m3J21J12J2
3943A11n2q8j55J64J12m8l7r4K1K3J54K5j80j3qM3J02Mk4r9m1Q4L1Q5k8q4p5L8
3971b9L0J30j1j55m8J3J26K9m4qq0j0N0Q2k7l6l6l9R4j4Lk1k7m1O4K0J4o2QJ2
$$ y = [-84, -276, -197, 125, 289, 237, -86, -230, -211, 79, 330, 239, -67, -271, -242, 27, 324, 251, -91, -283, -268, -36, 242, 245, -25, -263, -214, -35, 295, 323, 16, -245, -216, 2, 226, 332, 29, -244, -171, 10, 241, 326, 91, -254, -198, -117, 226, 263, 50, -181, -266, -43, 171, 282, 55, -167, -246, -170, 220, 309, 108, -158, -206, -115, 110, 314, 121, -122, -188, -89, 86, 258, 167, -77, -223, -50, 124, 209, 81, -105, -280, -78, 29, 230, 162, -44, -221, -104, 72, 139, 150, -105, -237, -100, 46, 130, 138, -33, -163, -157, 41, 142, 146, -60, -165, -170, 14, 144, 119, 33, -139, -170, 31, 144, 133, -22, -173, -142, -32, 138, 127, -36, -107, -51, 3, 100, 154, 4, -87, -96, 1, 174, 131, 31, -91, -134, -13, 99, 111, 59, -29, -184, -20, 92, 44, 7, -87, -66, -43, 111, 136, -44, -57, -65, -22, 80, 84, 60, -39, -80, 4, 35, 120, 92, 8, -67, -29, 1, 131, 120, -35, -83, -70, 56, 85, 41, 33, -47, -57, -7, 75, 48, 12, -24, -63, 31, 17, 20, -1, -28, -69, -5, 15, 29, -33, -25, -13]
4001a3l3J28Kr2PK8n8M6N3l5n3m7R8o0O4L6l6Nm8m7k8J67m4o1N7j07j6J44M8q8
4031A7o4K0j6Q8ML7j18n1O8l5J29K1j09p8L8Q1j9L8r6m2L2R4M8K0j7j82l9J58
4059B7O4J4m6j06q3P4J95p0l5m5j28N5J76K5j44K0j29N3J49N1j14o6k9j5J93O3
4085A49j16j05l6O3J01J33o1j95j12J26J00P4M5k13j62R8K16O5J0j88k41N5K17
4108B3J63o5j53q2n1J73K15j04j65j25M3R5J95n7j53j63O1J90J45O2k63k36J07
4131a45K10Q8L3j59k50jL24O5j8j17k59j2K86K14m0k24k14p8K66K80Nk35j76q7
4155b44J83K97L9k37k24j7R0L03R8k35k52l4J68J87J40j45k89o6J34K65O8j14
4177A15k69j42K50K80L9j02l28j68J47L33Q4p4k43k72J77L72J06j79k16j29K3
$$ y = [-13, -46, 82, 84, -8, -1, 27, -31, 15, 68, 33, -20, -67, 31, -29, 35, 71, 35, 40, -8, -55, -83, 84, 40, -21, 36, -71, -87, 57, 105, 17, -47, -27, -43, 45, 49, 86, -32, -83, -15, -50, 79, 100, -9, -87, -49, 32, 13, 51, -45, -87, -55, 39, 87, 107, 90, -92, -131, 27, 91, 105, 59, -47, -130, -56, 139, 69, 34, -11, -139, -84, 92, 117, -27, -7, -136, -83, 66, 117, 3, -63, -92, -107, 86, 149, 33, -72, -108, -45, 56, 189, 128, -67, -179, -53, 47, 121, 166, -47, -209, -111, 105, 170, 180, -8, -249, -194, 23, 186, 121, -32, -114, -165, 8, 223, 119, -46, -171, -128, -33, 162, 105, -48, -211, -150, 40, 185, 247, -16, -252, -145, 65, 153, 186, 27, -223, -224, 100, 165, 147, 30, -229, -241, 45, 259, 219, -5, -219, -297, -31, 249, 254, 19, -157, -244, -61, 236, 275, 38, -186, -203, -113, 190, 288, 53, -199, -233, -65, 122, 262, 117, -172, -238, -104, 161, 229, 115, -154, -296, -46, 234, 273, 171, -157, -325, -178, 155, 239, 165, -78, -350, -173, 199, 305, 126, -90, -219, -196]
4198a96L23J49j20k69r0l0L20K07n9l54j29P6J47K49J8k76k46J28K00K13nk33
4220B3k50J9K44J87l1j63k13k6K07K45o8j55k18j0J39L01rk23j60n1J85J70J16
4243B59k24j94NN8K03Q8j34j52n4K7K01J41j30k54k0J36J85QJ7k52q1J46J92k
4267A69p6j46o2L6J67R6j71j31P2l1J43J22j45j08q3M5J48N7Qj69j3J4P7J13k3
4292A09k10J7lJ51qnm6j01P7O3J7J9q1m8lN4Q5m2l9l2m1P3N1J1n1l3M3mN7m8m7
4323a5J0j8nM7M9j01L0l9j1M1L5l7J4o6P1m8M1lnl1OM3mPL2k2Rl9m2R4J5k1k8
4356IJ2l0J7P1n9n8M3p1O9P9m6n0j5JO7JM3m9n5n5R7M7k1o4k9k2L8O5L0j4r7p
4388e3J5Q3J26j14j19oJ7J32P7q8j74n8K3J68J08o2j23q9J6K09J05q2j30j12M6
$$ y = [-196, 127, 276, 156, -113, -203, -233, 87, 294, 235, -119, -248, -172, -25, 224, 242, -34, -280, -152, 48, 261, 256, 23, -227, -208, 36, 223, 192, 29, -184, -210, -3, 242, 174, 19, -199, -209, -70, 231, 222, -1, -161, -212, -27, 143, 259, 35, -159, -154, -96, 107, 195, 61, -91, -145, -118, 83, 224, 94, -160, -180, -44, 141, 149, 166, -86, -167, -21, 171, 169, 93, -53, -115, -79, 88, 184, 13, -118, -46, -77, 66, 188, 43, -65, -148, -103, 45, 102, 110, -59, -72, -58, 19, 132, 109, -101, -84, -87, 64, 56, 51, 5, -96, -19, 44, 61, 80, -1, -49, -52, 2, 87, 45, 6, -26, -67, 6, 57, 68, 17, -16, 27, 23, 80, 32, -15, -5, -23, -28, 19, 68, -33, -3, -42, -53, -12, 23, -14, 0, -66, 5, -43, -2, -5, -10, -41, -35, 8, 4, 11, 43, 21, 30, -9, -51, 43, 58, 37, 9, 21, -9, 8, 79, 20, -38, 5, -66, 3, 82, 36, -14, -29, -28, 39, 40, 83, 34, -21, -76, 21, 68, 47, -17, -46, -68, -30, 35, 65, 51, -46, -53, -38, 45, 171, 57, -62, -68, -51, 81, 158, 70, -104, -162, -139, 29, 137, 75, -48, -137, -121, 88, 193, 111, -19, -131, -85]
4413h5J01J64K6k45j01K2J91J36j21r1j95R5J74P6jj83j92M1K43R5K7j60k07J3
4437a77J55J95l6j35j69J3J46J68jj53j86M6R6J62R4j37k52l7J62J80Q1j75k31
4460a91m9J73K38L5p6j87j86J15L51jj63j68j01P7L03J7o1k06j79J14K09J76j71
4483F9k05j29J11K22J81r3k21j52N3K54J31o2k48k7k4K29J31m9k62j22O5K15J55
4506B22r7k04r8qK50J86j49j08j85l1K78J71q3k17j04O8Q6K25l2k30j09J0J68
4529IJ88Mk35j42L3J65J41L4k34j63K9J86J38N1j77k15M0J22J97j0j26j81o8K13
4553aR0O4j28j42m5J63J67M2j23k12o9K12J40Nj39j72j3J50J27J24j99k23m0K15
4577gJ05L0j11j29J4QK10L6p0k45m4K53N7O1j57j17p4J10K67k7j19j18p4O2K01
$$ y = [-85, 16, 180, 206, -39, -140, -118, 73, 209, 88, -3, -198, -103, 71, 147, 146, -37, -229, -188, 55, 150, 177, 17, -190, -177, -22, 173, 137, 2, -167, -154, -8, 160, 159, 6, -180, -134, -38, 124, 218, 81, -171, -208, -46, 134, 215, 40, -191, -240, -67, 171, 206, 130, -57, -243, -128, 223, 222, 59, -109, -210, -133, 170, 187, 126, -80, -259, -145, 64, 240, 69, -136, -265, -154, 68, 249, 156, -65, -217, -164, 90, 221, 159, -89, -116, -140, 89, 220, 171, -91, -213, -148, 67, 222, 125, -79, -177, -185, 65, 251, 102, -6, -191, -222, 56, 227, 144, -73, -177, -109, -23, 202, 170, -60, -169, -159, 9, 197, 201, -34, -176, -143, 22, 163, 197, -37, -200, -171, 15, 153, 204, 27, -188, -148, -26, 171, 161, 35, -146, -214, -1, 89, 153, 25, -117, -162, 1, 168, 210, 87, -125, -194, 18, 158, 163, 24, -148, -161, -11, 116, 240, 41, -182, -222, -7, 98, 128, 17, -112, -98, -90, 120, 156, 86, -159, -203, 50, 107, 168, 11, -106, -180, -70, 197, 170, 51, -67, -141, -79, 122]
4602A22O6j50j05k4KJ56J02p2j59m0P6R7Q1n3j74n1O4Q7J69q7r9j06j0J24J57
4627A73j48o8p1N4P1O9k5q4j5p1R4J04p6m2l6j0Q0J10qj39Jk7Q2N7Oq5p6LP2L3
4657B8Q2p4j05O2J6j9L2L7j01k9P4j6J3M0o0NN9j5J2J3q9K1P2Qq5Q1n8L3m1k2
4687b6l0N2M0Oqm0l2n1P8O6n4m0Q6l8j6P3Pj04k1J8J9Q8m8Jo6m5J04N8q5Ql4m2
4719g6P2P0q0M4r7pP9R1l4r3n0OM3Q8L4l1j57%J33L7M9q2j04k0J1J12Q5m8k02
4748a27J9J61RO0r8r3k6N3J37pp0j56OQ8K42o1r4j05n6M7J64M5j17q2q9J26J30
4775A06L9r5j56k6J14O3N3r4q1r8N5K43K6j38n4n4L1J56M5p0j01j22L1J43J17
4800A33k5j54j11Q6J06J15r6j09r4J9J73Q7j6j50j09M7P8J73n9j71o4L7J16J09
$$ y = [122, 188, 38, -67, -91, -89, 67, 169, 97, -62, -102, -26, 71, 152, 99, -75, -126, -62, 25, 194, 107, 8, -98, -108, 16, 173, 25, -43, -114, -60, 11, 80, 55, -29, -44, -115, -21, 83, 7, -35, -71, -81, -1, 109, 101, -38, -37, -64, 18, 75, 81, -4, -80, -77, -5, 28, 110, 36, -69, -7, 9, -10, 22, 59, -42, -71, 3, -13, 0, 40, -20, -15, 44, 29, 41, 54, -35, -14, 58, 66, -19, 62, 4, 37, -4, -26, -56, -4, 36, 42, 34, -6, -38, -89, -11, 55, 1, -39, 47, 9, -7, 66, 73, -31, -52, -34, -15, 73, 25, 26, -40, -85, 19, 77, -8, 0, -34, -76, -4, 66, -14, 30, -67, -74, 5, 96, 62, -31, -81, -75, -32, 56, 90, 59, -98, -98, 35, 72, 121, 39, -65, -85, -74, 38, 123, 75, -127, -108, 53, 62, 122, 24, -69, -95, -42, 95, 88, 18, -138, -132, -44, 198, 137, 43, -62, -118, -71, 93, 138, 21, -61, -150, -24, 106, 145, 50, -106, -132, -18, 45, 98, 4, -77, -175, -120, 123, 149, 11, -43, -97, -66, 90, 135, 65, -36, -158, -127, 16, 133, 108, -46, -157, -71, 35, 150, 54, -55, -149, -130, 43, 130, 114, -36, -145, -98, -20, 153, 94, -77, -141, -104, 12, 121]
4824A21K9j64j14K5J44R0N5k11j72J10J53Q2k0j70q0lJ35N9M0j32p2L2J28QQ4
4849A57j53j20l0J74J01K2j66j42OJ82P7K1j14j92M2Q4J22P4j00k19K5J19P9J30
4873A79j25j50o7J16K15o6l0j80n2J29J19M7q3q4r5P0J61K0j53p4j01J61J12M5
4897A14n3j32n8M1J85K9p8j11n1Q5R7L0J4j95j7j8K14M5q3q5o9P4J09J8o9p0n1
4924h5M4K6J12kj44l9J01lO9J4j82j6N2R9P2n2j08o9R7N7O9j3p4j22m1J31R5k5
4952F3p0j15O4Q3P8m7o5q3M8M8O8J8j04l8Q2m8J25q1k6n8K8PN3N5j00q8Q4J0J9
4981A0O8o5j14J5J37K2m6K4q9m2P6P8j9o8%j7j3L6L3q6n1R9PNN9j12J7J5n4J56
5011H1p7o3N8l4M0O6j9o2J9k4M6Nl9jL6j6m4P1m6k9KL9j5KK8q4N8Qk7M5O0j09
$$ y = [121, 150, -14, -128, -103, 41, 131, 186, -25, -197, -87, 66, 148, 128, -42, -122, -125, 10, 69, 109, -23, -95, -63, 65, 73, 157, 4, -116, -146, 28, 129, 151, -15, -157, -151, 31, 108, 129, 15, -177, -135, -51, 71, 145, 45, -174, -149, -30, 49, 179, 54, -96, -163, -47, 168, 102, 72, -108, -160, -31, 88, 135, 52, -32, -127, -57, 104, 124, -29, -103, -204, -43, 69, 114, 61, -71, -129, -88, 97, 126, 48, -63, -114, -29, 68, 98, 112, -83, -100, -118, 96, 141, 58, -27, -96, -22, 87, 105, 36, -34, -85, -41, -15, 97, 95, -49, -88, 13, 10, 79, 93, -89, -105, -53, 46, 118, 66, -42, -111, -14, 43, 112, 99, 25, -97, -138, -7, 88, 63, -7, -122, -58, 25, 103, 56, -9, -92, -44, 4, 72, 90, -14, -52, 30, -18, 107, 26, 0, -58, -30, -23, 30, 85, -15, -103, -19, -9, 10, 78, 13, -101, -86, 51, 73, 27, 51, -38, -80, -4, 74, 55, -13, -13, -30, -43, -7, 26, -60, -111, -12, -5, 0, 59, -53, -36, -21, -75, 81, 4, -59, -1, -35, 5, 71, 52, -10, 9, -15, 31, 36, -3, -4, 32, 16, -28, 43, -3, -32, -30, 9, -6, -4, 24, -60, -2, 6, -21, 24, 84, -25]
5043b5K1oO5m7no0M8N5J8k4m0J6j14J08L0qK7j21N2J6O0l2%l6m0L0Q4m1m8j1l
5074c1PN1M5q4j2nO8M7l3r0m4M4O2K9m8K6n4m8N5O9j9l2j7m9O3J3J9l5n8J6L1
5105a4L8j4mp1pK8Q8J2oj38Q8nO9l6K1r7M0QM8pMn9n2J04L2m2p1n6N0R7pO0j46
5138d5j5N4R8Rm8j00j8n1J11R8o3n8n7nJ29L2k8l3o7j0O4O1m6o8j5M3M9Q8m1j06
5168c8j3o2N9J30Km4j36j1J38N8j4o0m2q0O6J24K4j41j9o3J47O6L3o2n8q3j1J80
5196I0k6Mj62m5Q0J48J05j68p5j2j3J27R6j05j39k9M9P2J48Kj87r9K5J56O0l2
5222G0q4j04K2J98M6n8j36r0K1J48N7Lr0j08J8Q5J02l6n5j44O7nJ51M1j16j24
5248a21l6J04J25R3j43o8l1Q0L5N4r3nj14J15K7J06p2j32j6N5J47l7n5n0o6M0
$$ y = [-25, -4, -10, 55, 8, 3, -57, -9, 46, 64, 40, 0, 16, -98, 10, 40, 32, 59, -62, -10, 6, 66, 34, 34, -2, -42, -12, 72, 31, -17, -28, -31, -24, 27, 72, -12, -24, -29, 39, 86, 53, -37, -81, -37, 25, 54, 6, 32, -22, -70, -15, 54, 35, 3, -14, -63, 0, 13, 32, -3, -61, -45, -14, 24, 10, 6, -65, -72, -44, 44, 56, 50, -88, 0, -5, 64, 28, 49, -48, -8, 0, 48, 41, 45, -14, -66, 38, 70, 28, -43, -99, -49, 48, 41, 101, -45, -60, -6, 92, 101, 53, -47, -65, -116, -5, 93, 30, -28, -85, -90, 39, 71, 43, 10, -57, -67, -3, 58, 12, -56, -71, -28, 21, 109, 68, -38, -51, -113, -54, 76, 78, 34, -102, -113, 25, 83, 69, 9, -33, -113, -47, 77, 101, -40, -59, -122, 25, 91, 124, 62, 4, -79, -90, 90, 64, 68, -94, -139, -59, 89, 194, 26, -49, -61, -74, 53, 149, 44, -95, -124, -75, -3, 145, 147, -40, -139, -114, 42, 102, 70, -14, -118, -96, 102, 148, 90, -46, -136, -115, 33, 90, 93, 3, -105, -87, -2, 100, 64, 9, -135, -68, -73, 78, 119, 3, -121, -157, -53, 72, 165, 22, -46, -77, 3, 38, 92, -1, -6, -120, -5, 22, 128, 56, -76, -92, -37, 110, 73, 18, -32, -98, -58]
5274e8J07l8K6p7n8Q4M4Q3r3m1l8K6K9Q8l1p5l5J5M1M0K6m7j17R0M4J7k7K3p4
5303b6k2J02j1l5%j5j3Q1m1N5j04l3j2J06L7n6K8n8%J8N2m8m3M0j1P9l8m0o5L9
5333c4L3N3L5r7rL4o5O2K2m7k4M3rK0M1n6j8n2L9M6O5j25J2k6P0k4L3J0j1qpP5
5365H1q1ll4NLQ9n9M7n3l5J2K2k7Ll1l1R9l5M0J1n0K5QJ3nnRm3L3J2m2N4l7L0
5399B5n5L4N0r5J3M4OM2Jo5l5L0O0oj5l4q2O8Q0j4k0n1j8J8J0L0k0m6k6K3L2Q9
5431G3p8n0K4K6J7K3k5n4m3J00N7o5K2m7j7J6R5k7Nr9L0j0P4%k0r1j5J00J5L3
5461F9l2o4k6KJ16k0p5K0m9j6Q4Q2p1k4q1L9O7N1l2k5n1p2J41K3j8o0l6qM0Q8
5491F2J3q4q1j1Q9N5O1p2j01o5Q6J42k4n8j06J7P1R8n1m3m1j8N5J06n7j1j04r
$$ y = [-58, 49, 11, 37, -40, -98, -14, 30, 113, 20, -21, -59, -33, -4, 84, 53, -22, -57, -42, -1, 39, 65, 18, -99, -9, 35, 52, 25, 48, -26, -48, 54, 43, 8, 8, -7, -20, 61, 20, 75, -29, -62, -74, 32, 69, 13, 41, -17, -17, 1, 53, 5, -38, 2, -9, 70, 32, -8, -73, -34, -1, 52, 87, -10, -19, 15, -50, 12, 34, -13, -37, 6, -3, 17, 58, 2, -16, -68, -29, 17, 82, -43, -31, -57, 13, -11, 22, 32, 21, 13, 6, 81, 0, -3, -37, -32, -29, 60, 1, 48, -5, -40, -28, -6, -33, -30, -61, -92, 7, -28, 12, 23, -27, -2, 6, 19, 14, 9, 18, -25, 8, 20, -22, 32, -5, 25, -30, 4, 54, -41, -28, 16, 22, 64, 65, 0, -35, -5, 55, 49, 34, 0, -82, -14, 66, 52, 32, -19, -37, -19, -9, 21, 1, -45, -71, -48, -16, 73, -5, -55, -31, -5, 12, 35, 10, -44, -87, 13, 70, 5, 27, -20, -37, -21, 74, 47, 52, -47, -17, -27, 47, 47, 27, -64, -79, 21, 36, 69, 37, -27, -53, -51, 65, 45, -30, -10, -59, -75, 9, 91, 20, -4, -85, -46, 21, 72, 40, 15, -36, -108, 33, 56, 38, -22, -58, -66, -26, 62, 75, -9, -90, -101, -12, 43, 104, 32, -69, -134, -48, 94, 70, 12, -94, -77, -6, 92, 41, -2, -43, -61, -6, 100, 43, 32, -72, -81]
5519h1Q1P0J4r1p1L8jO2P8q1j17M3J5O7O2n8q9J5L7J3N2pj08j4R1qP4lq3k8NM4
5551B1K5j7j00M5L3L6L5n5m8p7N4O2P5j5j28J5l2J00L7mn4r9R0O5Pm4o5j3J9J
5581c1R0j3p3o6Q6P4l0N3j30PjP5J2%m0o4j8J18pk3j0q9R4K8MM0n3l0j19J20K9
5612C3M8l8r0j4M4O8rl6k9M1j9N9Rn7q0P6jqM3J2r5L7lJ4Q9p9m3QLJ31j04n4J6
5645b8K6j9O9Rp5K2k4J9K1L8o6L5o2j1O5Qp4O5k5J1k7L9J4k7k4%K9j3J6l3l1N3
5677@Kj0pk5j7R0L0l3ml7j2K2J8K3p5J9kK6O2o3l0K5k2L9k3k4j4L3Jj3Rj9R0o8
5711iK8k0K2Lk4ll4Q6n5L2l9m0M2J4j9Po1M5L9m3K4N0r2O1K9p9O3L8j01nN0L4
5743D3o8k2L5RN4o0MMqL4l5Q9j00j5L7J0K6K7Jp5p4P4m6Q6K3j9p1J2N1J0l4N0
$$ y = [-81, 0, 70, 84, -7, -78, -40, -41, 21, 99, 18, -99, -56, -41, 26, 88, 30, -59, -44, -7, 6, 58, 51, -57, -71, 20, 12, 86, 83, 0, -28, -23, 21, 46, 29, -71, -26, 7, 43, 78, 23, -25, -102, -48, 14, 89, 74, -54, -39, -71, 29, 66, 62, 8, -91, -1, 64, 71, 27, -38, -51, -32, -31, 59, 46, -27, -93, -7, 67, 37, 90, -40, -33, -34, 41, 53, 53, 13, -51, -69, 49, 42, 19, 9, -80, 14, 42, 46, 86, 33, 3, -116, 4, 33, 81, 43, -47, -61, -17, 51, 42, 6, -23, 18, -1, 58, 67, 10, -70, 6, 5, -3, 40, 52, -43, -6, -9, 5, 94, 15, -28, -20, -17, 114, 10, -44, -28, -2, -21, 48, 57, -18, 4, -20, -1, 20, 58, -8, 27, -35, -46, 19, 27, -47, 18, -7, 4, -23, 16, 30, 3, -21, -21, 8, -5, 11, -22, -53, 0, 2, -8, -15, -40, -57, 33, 63, 30, 26, -11, -23, -1, 17, 40, -35, -16, -18, 8, 70, 7, -23, 2, -20, 19, -4, -28, -42, -9, -8, -21, -12, -31, 59, -9, 19, -1, 21, 24, 0, -3, -37, 49, -6, 26, -13, -53, -11, 3, -16, -9, -70, -25, 14, -29, -5, 45, -47, 14, 43, -36, 27, 65, -36, -41, 9, 43, -25, -47, -12, -3, 51, -9, -5, -1, -9, 25, -10, 79, -21, -36, 1, 11, 37, 64, 65, -10, -84, -10, -56, 30, 53, 34, -37, -25, 26, 36, 2, 52]
5775E2j06M4J5M6m0k8j5kL4O3o1l4k8M8J0O7jn9q7J25m9k0P0pq6J7N6O9oo4o3
5806d0n5P4O8Rl4m7k2L6P3j0n7J4l3K9k3J6k6l7%J4P7M0n8k9pL5M1m3j3o8L8O7
5838B9k5L3Pr6J7K0L0J8m0J6r0L0N1L5l0k1M3n5N1J%o1k6N5L2N2l7n8qPJ6O3p9
5871b0M5l4l9L3J5j1N2q7K0RN9J9q0l8M4pJ1J2K4q1K8J0N2K0n9J7k5K4Rj7kl0
5903b7jL3K0M5o4j1o6R9o8R1o4J6n8M8p%L6l0J1j5K2L0p3J9nK2N%j1n5N5m1L1
5936a3O8%r0N8l4O4q0j7jN7j2O3n2M5q4L7J3J8k4j9m5O1L9l1km6j7oJ5P6n3N4
5968D2k7m2Q1j35Q2j9J9pL6Oo0%R4p1k6O1L8j02k7P8k8J3K0l1rL5ML1l8p5l0O2
6000b5L4j6n3J3Nj5K5Q3p3p2P1J4O7k9j0Nm4ON9k7k6J0j2L9M2j15L2n3M0K1K3
$$ y = [52, -54, -10, 5, 51, 11, -17, -32, -34, 0, 63, 2, -32, -60, -12, -2, 65, 64, 5, -82, 43, -6, -26, 44, 37, -49, -32, 24, 93, 87, 23, -40, -95, -21, 47, 56, 22, -25, -47, -11, 62, 52, -5, 9, -24, 5, -18, -2, -28, -65, -65, -51, 26, 66, 8, -21, -28, 7, 48, 5, -8, -76, -38, 29, 4, 37, 44, -52, -35, -15, 15, 33, -7, 9, -81, -51, 0, 35, 5, -16, 27, -28, 23, 24, 24, -37, -63, -8, 24, 76, 39, -19, -27, -20, -4, 59, -20, 25, -9, -48, -15, 0, -11, 41, -46, -26, -17, 42, 61, -19, -57, -13, -20, -9, 3, 27, -54, -26, -16, 36, 56, -3, 14, -11, 13, 22, 5, 3, -27, -28, 5, 25, 70, 6, -5, -71, 28, -40, 51, -13, 3, -55, -7, -14, -14, 22, -8, 3, -12, 10, 40, -33, -14, -19, 3, 8, 8, -3, -58, -3, -44, -13, 55, 55, -35, 23, -11, 53, -27, -44, -45, 12, 0, 63, 11, 56, -28, 9, 22, 40, 16, -3, -48, 13, 52, 21, 19, -27, -44, -50, -35, 41, -12, 42, 15, -27, 54, -81, 1, -18, 1, -6, 30, 36, -24, -24, 70, -1, -27, 34, 72, -30, -57, 21, -7, 6, 26, -5, -14, 21, 25, 56, 18, -57, -87, -25, 9, -7, -60, -47, -42, -57, -32, 51, -22, -94, -23, -9, 58, 29, 19, 24, -20, -14, 45, 18, -8, 2, -10, 29, 71, -44, -12, -65, -25, -4, 19]
6031A9N8pn6J7m0L7J6n1J1nJ4k8k0L2pl4L7P3p0L0m2k6N1k9R4q1j9J9LpN3lm5
6064foNL5Pm2P2j12R4n0L2q8j3M0L8Kqj5L3j0j9K1nk8mJ9J0M6ll4Ql1K5L2J3j0
6099D8m0n3L2L7j7p0N2mK2OOk4K1l8K0l1J01p7k8L5k1kK2j8M4j2K9k2mJ1l9%J0
6132dm8N1M0j18K5L0jjM5rl8P2nn9M4q2R6l8n7P8l6K9%j6N0k6%L8J0p4J9j3J7
6165A9m4K1J1l7O2l2l6L7PPJ6o1pL9K2m3J6k2K7j2NJ8l8J1jK3k7K9l2m8O5P4m0
6198B9l3j4Ml9Q2k5oOn9N1PL2kj4K9m2ml6L8M2p6K1KJ8K2Kl5l1L3L8j4jn3Plj
6234b5OqN6m4N5o3K7Rp5J6M4KK0l2M2k8l0%L5LR1r9o4N5M1n7L5k3l0P2j2kk0J1
6268Hk6J2l9P8p2M3K0J0J7l0mJ6%o8J6L3n5N3j8%rJ8l8N2l8N1l0QmRj9k5rj1R2
$$ y = [19, 77, 70, 14, 31, -9, 28, 44, -7, 4, -1, 13, -15, -35, -3, -10, -44, -7, 66, -4, 26, -16, -42, 9, -20, 74, -7, -26, -7, -4, -11, 42, 39, -6, -12, -7, 28, 35, -7, 65, -47, 47, -3, 29, -59, -72, -32, 6, 8, 0, -15, 18, 8, -11, 10, 5, -23, -27, -8, 2, 48, 45, 11, 19, -12, 13, 45, 58, 48, 8, -45, -13, 24, 7, -63, -11, -15, 7, 13, 19, -5, 16, -22, -2, -33, 68, -9, -37, -2, -23, -25, -3, -21, 23, 11, 40, 18, 14, 25, -14, -14, -4, -52, -1, 39, -79, -54, -24, -25, -26, 19, 10, -28, 44, 39, -20, 24, -58, 38, 0, -57, 21, -15, 14, 14, -2, 48, 22, 22, 60, 70, -4, 15, 2, 19, -25, -4, 7, -30, 32, 0, -36, 1, 8, 15, 31, -30, -37, 2, 24, -19, -3, -25, 2, -10, -5, 13, -25, -14, -15, 8, -19, 10, -22, -70, -5, 69, 29, -4, -18, -14, -53, 29, 4, -2, 4, -55, -4, 3, 35, 33, 19, 48, 6, 2, -34, 4, 46, -30, -9, -7, 11, 33, 35, 0, -31, 2, 40, 26, 25, -28, -21, -24, -25, -19, -27, 29, -15, 40, -23, 4, 13, -62, -46, -2, 0, 20, -12, 30, 2, -28, -28, 7, 10, 101, 2, -62, -7, 34, -23, 12, -11, -41, 31, 19, 17, -3, 8, -18, -6, -45, 33, -39, 4, 24, 34, 51, 21, 17, 33, 33, -35, -19, 14, -41, 12, -6, -6, -15, 3, -35, 17, -21, 30, 0, 8, 4, 13, -6, -31, -40, -51, 41]
6303D1m8L3nLk2Qk4J4K4n1L8m2J2M2m8N0l2j8O6n5k5Q2m9O3o6oN2q3R6n7K9m1
6335a9N2JK7k6q2NL2l5P5Qk5On5J6RJ1K5k4m2L5Q5r7M3J7n5J9jK9r3L2R3j03J36
6368I9l5o9qo2M0J4J7ml1m7J08l0J1l4k6L0L0k0L5l1L5m3M5l5K5J8j09L2O1L4
6398E0l1k6N2j12L5L1O1m5l4m8M1mJ7K0o4M3J1k9J5J4qP6j31O2K1j7k0nJ10r5
6428a0n3P6K0m9KQ0o9M6k8l1K9j2k5M0l5j8O3nQk6NNMl1J1KkK9m3Nm4L8k8%J7
6463b9O0j4l4j5J3j9O7o8P4n8RL7j7N0l5L3r5N1Lj3L5k8j8lK4p2J21l6n3K5j2
6494a7J6%J7L9r1M4K1K9m9LKmm4L7nJ0J0l3J6nl2L8jKK5k2NJ4jl9J9Rj1r1J20
6529C1n4k3K5K0j2J1L9Qom3K8j9M0o0K1l1L2rj3K4k0K0j3m7J3M7j9K3m2M5k1M7
$$ y = [41, -7, 26, 21, 24, 2, 10, -14, 0, 24, -27, 11, -31, -19, 23, -25, 25, -7, -25, 41, -14, -39, 43, -6, 57, -9, -15, 37, -46, 50, -7, 22, -19, 33, 34, 61, 35, -47, -42, -10, -45, 30, 38, 13, 19, -36, -20, -11, 0, 25, 1, -41, -6, 79, -18, 25, 42, -13, 6, 5, 34, -59, -27, 66, -37, 99, 64, -5, -13, -75, -35, -21, -4, -8, -39, -86, 22, -8, 3, -31, -57, -27, 3, -17, 18, -13, 22, -21, 24, -11, 14, 32, -77, -45, 16, 50, 19, -7, 45, -67, -32, -1, 60, 15, -19, -67, -26, -30, -13, 7, -57, -14, -3, -32, -17, -3, -11, 65, -66, -4, 17, 0, -20, -25, 85, -10, -63, 13, 33, -16, -14, 66, -3, 43, 15, -16, 13, 1, -24, 16, -19, -37, 26, 21, 29, 3, 8, 13, 17, -14, -3, -1, -3, 26, -17, -12, -56, -18, -46, -46, -29, 31, 17, -17, -32, -19, -38, 29, -39, 35, -23, -14, 23, 6, 56, 21, 54, -41, 10, 13, 0, 35, 7, -11, -14, 10, -62, 59, 23, -30, -5, -17, -1, -1, 16, 55, -36, 8, 29, 58, 9, 12, 14, 10, -34, 3, -2, 8, 18, -15, 1, -4, -36, 2, 1, 3, 28, 6, 11, 25, 24, -15, 4, 13, 2, -89, 31, -23, -46, -21, -1, -13, -2, 37, 45, 39, -4, 24, 5, 45, -15, 6, -25, 7, -2, -15, 9, -11, 9, -4, -51, -38, 9, -10, 13, -29, 16, -5, 42]
6561D2l3k6J7MJ3qjk8K5NL4l3oRj1m0P4l6j1k1j4M0K7o6M7L4Jro8P0n3K7n3K3
6595b5J8N4p1k7Q1k5j5M6l3J0QL6n8Jj1j9O1p4P4k6rm2O7n0M7Mm0RL5k7M1l0l8
6628b8P4r3O9k1K9m1Jj5lM7lm0P2m0k5Qj1M7l8L5l9k4M6O9j23P5m1M7rl8Ll8Q8
6661D0m8l1PN2Mk2M5m6q7R3l2R5j06K4M1Pj9m3J4N5l4l0kJ3N1j4%j8j3Mj6j4P
6694b3QJ6jl6O2k9Rn2N0nj5j3N8o6P7m0M1k6Kj7RK0nj6k1k8%M9oJ4p0P6r0Q6K8
6729D6l6L6j20J21m3O0p6rm6Q4J1M0q5K1oJ0O4m6j2jk7r0J06MJ0p6Q2l3mlK7j4
6761em9N4mML2m7k3K8j2L8m0Jk1J7j0L1j1J1m0L3L0L4qn9l5M1ml1Q0n4k0Q9J5
6794F5p9J8KJ1l7Q4o3n1J8N0j4JL7K6r3nRJ8k9K1n0L2K9j2J2l8N9%k0k0M9m9J1
$$ y = [42, 9, -17, 0, 4, 17, 9, 8, -20, 5, 10, 44, 11, 5, 14, 3, -37, 37, 1, -10, -31, -45, -5, 22, -44, 3, 37, 38, 29, -39, 31, -22, 5, -48, -25, -7, 47, -24, -51, 30, 5, -10, 36, 3, 13, 21, 57, -1, 0, -11, -30, 31, -43, 31, 5, -4, -46, 21, -29, 18, 22, -18, -9, 26, -1, 40, 10, -28, 46, -47, 22, 1, 30, -11, -10, -25, -28, 19, 16, -24, 48, 8, -17, -9, -20, 27, -11, 24, -15, -39, 7, 76, -47, 28, -13, 34, 25, -13, -10, -48, 40, -8, -39, -32, 20, 24, 2, 47, 1, -86, 7, -25, 70, -36, -12, 29, 36, 17, -26, -12, 43, 9, -21, -23, -10, 41, 27, 27, 9, -4, 0, -16, -30, -23, -15, 1, 0, -36, 26, -3, 6, -46, 4, -1, -16, -29, 29, -37, 40, 0, 41, 15, 17, 0, 9, 29, 24, 8, -13, -41, -41, 8, 2, 16, -54, 22, -68, 18, 46, 10, 46, -74, 47, 4, 64, -12, -21, -67, 17, 28, 68, -17, 4, -2, 8, 72, 26, 14, 13, -14, -104, 2, 6, 16, -60, 22, -11, -15, -18, 9, -5, -54, 0, -4, 0, 32, -15, -38, -10, -22, 16, -24, -23, -44, -27, -37, -6, -17, -6, -46, -13, 17, 51, 43, -16, -51, -10, -14, -45, 35, -19, -39, 50, 65, -14, 4, 6, 17, -20, 64, 1, -50, -32, 18, 4, 5, 42, 68, -25, -30, -21, -3, -32, -11, -61, -29, 0, -12, 0, -38, 21, 21, 1, -19, 30, -19, -8]
6827hPrJ0J0rj2l3M0j4Q6q5k0K0N0n2M5j5l5L2QJj4K6m1k5RN5p8P2m1j4L0oQ4
6861G4l4l1m2RK1RKj2J4lJ7p2J07k9o2LL1l4M9j7Kj9LJ7Qj3M8r2N5j4K7Mo0QJ2
6896a4L5j8k0M%rn7R0nn5M9j1J1M0m0j0m4O0MqK0nJ7m3kj7L5oJ9m0k2M7Jj6j1
6931b1j1KQ4l3k3l0Q4k9J6m7j0L7kmn6M5Rj1k6O4m3m9P8n5Pj9J8K8j4K6l4Oj2
6964b5l6J4K4M2r9P8m0M8j5NkJ4nk7P2ll4Nl4M4r%qm5L7k6Q2j7m2j5m6L9jP0k4
6999B1l8K4k4M2j1l4L9j6k3K3M5q1J4O9k1kj1lo5M6k8ON0K9k3oL6r6K2K9n1N1
7031A3j0L8Rp7M4o1J0P4m0o0J5K0L0J8m9M0Lk3L1m7K1K8n6J5k1L8l1K0J4%l7p
7063c8N3Kk7j3N1KJ2k5j9m9P0J8k4k3j3N8n9JO3j3Np4P1l2Kk3M9O6j33N6J7l6
$$ y = [-8, -1, -10, 0, 10, 1, -11, -44, -4, -18, 68, -17, -37, -17, 33, -19, 26, 11, -24, 8, 16, 17, 3, 29, -12, -37, -28, 27, -51, 21, -20, -34, -4, -10, 74, 40, 9, -33, -24, -3, 6, 8, -4, 10, 7, 24, -48, 59, 30, -32, -29, 2, -32, 17, 0, 2, -17, -14, 3, 11, -2, 46, -46, 9, -5, 22, 26, -34, -26, -14, 21, 3, -17, -13, -13, -22, -79, 11, 6, -49, 0, -11, 0, 40, 0, -10, -54, 6, 10, 2, 22, 17, 34, -9, -11, -28, 7, 1, 20, -20, -42, 5, 6, -10, -21, -32, -30, 54, 21, -2, -32, 52, 23, 39, -8, -18, 19, 17, 13, -43, 2, 11, 0, -26, 38, -5, -54, 24, -31, -24, -43, -25, 3, -11, 15, -19, -13, -25, -61, -47, -23, 19, -80, -2, -42, 6, -9, -4, -6, 8, 3, -24, 48, 45, 11, 16, -18, 26, 17, 17, 9, -36, 1, -25, 57, 40, -2, -17, -63, -24, -25, 45, 21, -17, 7, -17, 25, 14, -20, 19, 3, -20, 3, 48, -33, -19, 50, 29, 27, 16, 13, -52, -6, -34, -28, 22, 51, 28, 22, 58, -38, -16, 13, -38, 13, 3, 41, 50, -27, 17, -44, -34, 40, 0, -60, -45, -25, 5, 23, -26, 14, 17, -6, 25, -22, -1, 27, -29, -14, -35, 3, -28, -8, 6, 6, -31, -38, 15, 17, -10, -23, 28, 30, 42, 17, -2, -51, 19, 37, 13, -10, -23, 35, -24, -23, 40, 27, 32, -42, 29, -3, -1, -24, 25, 91, -42, 14, 31, -5]
7095ej9nK0j1LNJ4k5qn9N1J3Q1o5k9L9j4K1J0m6L0J9m0K6J9r8L4M5o3P0K5o8L4
7128Dj6pJ9j4n1O3k8l1N2l5M2k0L5m7j9J17n0j6jl9Q3k6pJ3o5J2P1k3J1l1L4n2
7160b2L7mn2N8nJ6qk5L9K1n1j1K1ml1J5J7nj9kMK0k4JK6MO7j06%l3R2n4K9l6l
7195b8N6q6L1N6j1n9%O2o0J2N8m6n5Q2k3j6K8%KL0J8m1mj5R2j06KRpj7L3j7P0
7228E0k6j6M6nq9J8QM3o6M3J4K2l8l4M6m0kN5o4M7J2r6K7J9J9L4J6n7m3O0k8J6
7260iK2K1n4k9L1j5N0j4m7k2K8K0ML2n5j7N8KO0j15M6Pj8K8Mon9NL2L9k4j5rK3
7294DJ5K3%k2K3n6pO0n6N4m2Mpj8l0R8m5J0j3KM1n0j7M5k6nK8k3rL8nm3K7j5O3
7329D6l0n5M1j6k8O5o5O5K0j9MK3n7J8l7K0K2J1Ml7J9n7O7j9k4j4qL0P8n7k4m7
$$ y = [-5, -24, -29, -9, -20, -17, -12, 2, -23, -31, -90, -39, -26, 55, -10, -39, 0, -14, 7, 17, -29, 1, 20, -20, 6, 25, -73, -39, 6, -57, 13, 38, -30, 4, -12, -19, 0, -14, -65, -2, -30, -61, -9, -44, -2, -22, 13, -34, -53, 64, 14, -2, -3, -42, 41, 15, 8, 21, -44, -32, 39, 16, 27, -4, 30, -22, 15, 11, -41, 17, 12, 28, 20, -5, 34, 55, 4, -7, 14, 10, -21, -6, 11, 6, -13, -15, -11, 9, -15, -14, 12, 16, 83, -23, -23, -56, 36, -18, 11, -25, -28, 28, -58, -27, 29, 18, -41, -41, 21, -39, -27, 31, -15, -70, 12, -11, -27, 1, 1, 3, 33, 51, 10, 6, -9, 83, -23, -21, -12, -19, -36, -3, -20, 50, 24, 8, 54, 49, -40, -22, -14, 29, -37, 6, 20, 42, 4, -30, 16, -24, -26, 29, -35, 12, 24, -72, -45, -26, -7, 27, 43, -14, -57, 3, -25, -9, 13, 34, -20, -49, -18, -33, 17, 3, -44, -66, -38, -18, -14, 18, -37, -54, 4, 6, 66, -49, -3, 4, -14, 14, 18, 12, -47, -42, -10, 29, 5, -10, -19, 4, 19, 42, 42, 20, 43, -13, -20, 40, -16, 38, -4, 0, -7, -25, -55, 43, -2, 8, -5, -3, 38, -12, -29, 16, -10, -15, 13, -10, -19, 19, 14, -29, -2, -17, 46, 16, -39, 2, -14, -42, 23, -42, 23, 43, 24, 28, 51, -6, 12, -25, -5, 17, 28, 32, -5, 14, -43, 24, 5, -19, -33, -41, -11, 67, 10, -14, -61]
7361f1R1j6J4n3P7l7l9k6J18j6o7Ok6M7j2L1l3KK9J6o5N3K4q2k4J03K2q3L9Jm2
7392ipk6%K9%RJ0Nn6J1K4k6k3P5pJ2qk9P0m9k8K8k8OM8j8k6N6n2J5N1m6n4K0K0
7427cqoj4j5RM1l5K4J9n3J2M2L6r5M0K0l1K3J3j4r9M7J6K0Nj4K5k3N3k1K6k7K6
7460C9o2L7M3n4l4mK4K9q6J3Q3k2Ll5J3K6l9k2Q4q1K1N0n9j7J4P3n5P6l7Lo2M0
7492BJ4k4J5j3oO4J7o7l5K2J4%J4m8j6L2J0k0N5m8J4Oj3o2J13m6M9j4kp0M9M2
7524D8l2j2k3M9q4M5K3K0n1j0K8j7J4K4m2J1k5N0pPpKJ5n3N4k5r5P1Q0ql5m6K2
7557ik8O3L7l3n6K4l6N3m5ql7j3Q1K3k4m2M0K5n7L2j0nN6Kn7L0K6o4PQm2Q2rm8
7591c4L9k3k2L8rJ6k4n7L8M2oL2oj1prM5k0Po1N3pl6L0rn7K9K9nj3K6j8%%O6m9
$$ y = [-61, 30, 14, 28, -25, 52, 15, -24, -50, 68, 52, -15, -9, -35, 12, 0, 31, -2, 0, 29, 45, -20, 33, 57, -25, -49, 54, 76, -7, 32, 33, -9, -16, -42, -42, -13, -13, -4, 6, 11, -45, -34, -10, -36, -59, 16, 9, 21, 13, -16, 54, 5, -23, 5, -23, -17, 31, 13, -13, 43, -9, 6, 57, 11, -43, -23, -3, -11, -17, -31, -46, -37, 4, -31, -7, 12, -41, -29, 13, 49, -46, -6, 14, -17, 6, 19, 5, -94, -47, -31, -11, -6, -20, 5, -18, 35, 14, 40, 13, 39, -23, 14, 57, 3, -31, -35, -11, 18, -68, -55, 28, 6, 9, -26, -13, 13, -26, -48, 36, -45, -24, 26, -33, -50, -36, 37, -18, 58, 21, 24, -38, 2, 16, -8, 7, -6, -12, 52, 69, 2, -33, -11, 3, 3, 17, -31, -47, -15, -5, -25, 30, -18, -4, 2, -11, -73, 40, -6, 43, 29, 27, -43, 6, 48, 16, 4, -19, 30, -54, -9, 14, 34, -17, -27, 1, -16, -2, 22, -20, -9, -34, 16, 9, 16, 9, 11, 26, -27, 27, 2, -93, -22, 58, 50, 15, -31, -9, -37, 26, 63, 30, -26, -2, -38, 15, -30, -38, -75, -88, -7, 16, -8, -50, -10, 15, -42, -10, -20, -25, 31, 33, -24, 6, 32, -32, -25, -17, -59, 23, 14, -34, 5, -18, -40, -2, -11, 5, -19, -76, -38, 4, -2, 30, 24, 13, 6, -3, 42, 22, 29, -32, 21, 14, -22, 8, -1, -58, -29, 0, -5, -18, 8, -10, -10, -10, 56, 7]
7627GQK0m2j1MM8l3m8J7L5j5J9m8j6O0k2J7l3k6P5n2M8J9j5j8nK5k8N1qm8RL3
7660B7K7j7jo3l2L8J3P5m0Qm9J2N0n3J9j6k6L8k8j9J05q1M4k2j4K4j4L2k2l1P8
7691F2l5pln2L2L7n3P8qj2J7r5Q4k4l8RRlqj4k6K4K5j6R4o8o6O0j2P1j11N2j0
7724gK5m9J1Oo9Q9j0K2J8p3L4K4l8k1m1P7k9N3k5K5o5P6p9M6J7rK8r1J00o9N3
7755B9j01O5J0k5K0LM3l8L8k2l0n0N2Q5n9lk6L8pk8K0k4l3P1m3nQ7q3LJ0L2n4
7787b5oN5nr7J08q2J4P4m8JqJ3K8jj2oJm6R6k8k0J8m6L2qKK5j8m0M3k7NOJ7jJ
7823A5RPo3M7J1lk6j3j7K2RRl8M8k8j7K6PJ5m2%P1j8k6N6n5J2O5j10K5J8ojnP
7858A1Ppl4O1k0L5Qj19R2J0n6L7k6K5n7J1L0k4njM7m4k0N2m3kk7M9NK6J8l0M3
$$ y = [7, 15, 35, -7, -18, -14, 34, 1, -47, -30, 5, -10, 9, -39, -55, 5, -17, 0, -33, -59, 16, -36, 12, 31, 16, -2, -7, 18, -10, 41, 33, -15, -6, 27, 54, 37, 36, -27, -59, -21, -8, 67, 27, 35, -14, -2, 48, -5, 14, -2, -28, 10, -18, -37, 68, -13, 31, 9, -5, 19, 5, 37, 15, -16, 62, 27, 20, 17, -35, -3, 34, -19, 59, 51, 39, 56, -39, 45, 21, -17, -8, 1, -2, -10, -24, -50, -26, -1, -17, 77, 9, -57, 3, -9, 62, -49, 3, -7, 18, -31, -20, -14, -83, 6, -4, 18, 36, -37, -3, 21, -17, -38, -79, -2, -31, 22, -3, 22, -43, 33, -46, 0, 17, 8, 36, -55, 45, -24, 29, -72, -7, 3, -22, -2, 1, 44, 6, 44, 22, -8, -58, -6, 79, 20, 17, -9, 29, 22, -6, 14, -10, -43, 28, -15, -20, 67, -16, -13, -3, 29, -25, -31, 24, 19, -78, 30, -52, -38, 36, -12, -11, -19, -6, 22, 21, 9, 3, 4, -42, 54, 26, 6, 24, -22, 10, 2, 4, 29, 11, -29, 14, -13, -8, -2, 15, 14, 15, 24, 31, -32, 15, 26, 23, -3, -16, -33, -11, -2, 7, -31, 17, -11, -28, -2, 5, 20, -22, -22, 49, 31, 5, 61, 6, 18, 83, -27, -2, 16, 10, 9, 4, 11, 18, 11, -23, 38, 18, 53, 61, -58, 34, 44, -12, 25, -1, 24, -33, -22, 8, -16, -21, -22, 25, -19, -39, 13, -30, -32, -59, -10, -5, 21, 39, 9, 52]
7891E2m1k7N7m6L1j2K1J1j6j2j1L8o5lM3o4Q4j5k1oJ3j7N5j1o3j9qM3K2J3o6N6
7923A6o4N2M5l0j9j9M6j8O5o0k1pj0P7lo1K0k2K7j1N0l5N4r5M2j1K6m1k3N3J6
7954C9k2Ol5L7o0K8k8L3M9l8L3p8J1M4m6L9pk9LL8o8P3kr2P2l1O6j3Ok0n5N1R
7987A3Mk7J5k4N3Nl3m8N3K8k8l2J3J4PJ0k5m7M2k8L1j8J0L8k5k6M5J0m2kN3ll2
8020Dj7M9l2Om1M8J4n8L4l4J3m1O8j1L5k8k3NO5o5L7Kk3K7m5K0k1j6J0j8O6l1
8052aLj1L2l6NJ2j3M0o4L9k8L6M7p0L4j3pp6P8k6L2LJL0q4K5l1R5l3j5j9L4k4
8085ej6M2k8Rj1pM4m1PJ9ppnRml0N6k4k0L0pm3OM8n1RkL0K2n1K9j5J1RJ8l8l6
8122e0J14q6kK5k8J8j6L9l0k3N3m3M7J5%k3j7J2J7n2nO9m8M4Np4J20l3Jo8JM8
$$ y = [52, 11, -16, 41, -5, 26, 14, 35, 46, 30, 18, 7, 45, -20, -23, 20, -44, 40, 25, 4, -2, 11, -6, 49, 38, -25, -44, -52, -9, 13, 26, -40, 16, -48, 4, 49, 19, 0, -19, 27, 9, 74, 14, -7, -14, -24, 53, 50, -11, 9, -13, 14, 3, 53, 18, 72, -23, 19, 8, 34, -7, -30, 23, 39, 17, 23, -12, 25, -35, -7, -35, -2, 47, 9, 42, -36, -25, 19, -27, 12, 5, -24, -21, 17, -51, 22, 20, -72, 0, -31, 35, 22, 28, 8, -47, 4, 13, 17, -10, 5, -19, 34, 39, 6, -42, 11, 39, 11, -21, -8, 6, 13, 23, -2, -49, -7, -35, -4, -22, -12, 26, 1, -25, 20, 30, -12, -14, 39, 36, 4, -13, 36, 4, 10, -31, 17, 31, -27, 7, -27, -14, -55, 13, 2, 37, 9, -14, -9, 56, -9, 28, 30, 7, 34, -11, 9, -12, -28, -18, -36, 30, -1, 2, -9, 23, -13, -8, 4, -9, 31, -33, 6, -22, 14, 61, -9, 25, 12, 5, -71, 7, -19, 13, 16, 17, 47, -37, -12, -43, 52, 19, 4, -15, 19, -5, -21, 21, -7, 2, -9, -16, 28, -13, -6, 13, 6, -1, -6, 3, -1, -31, 25, 1, -19, 11, 4, -39, -33, 15, -36, -27, -29, 1, 23, -28, 1, -14, -3, 6, 24, -14, -50, 64, -22, -24, 1, -27, -9, -25, 14, -16, -39, 14, -29, 18, 33, 33, 10, -7, 5, 22, -30, -35, 34, -14, 30, 35, -39, 81, 48, 49, -19, -18, 30]
8154C0l7L9KK2p7MRj3P7p7%JK1l4NN5k0kl1L0m1L1M6m9l3P4J4k6K3rp4N4k4k4
8188c4N5pn4
$$ y = [30, -7, 32, 34, 56, -21, -17, -8, -21, 56, -21, -21, -20, 1, -33, -28, 27, 7, 5, -26, 4, -37, -6, 40, -9, -42, 32, 46, 20, 43, 34, -40, 14, -10, -34, 21, 14, -40]
8191d0
$$ Imaginary data points
##PAGE= N=2
##DATA TABLE= (X++(I..I)), XYDATA
0@%%%%%%%%%%%%qJ6j6J6k4L2l2M0m8N6p2Q8j03J19j36J52j76K03k30K65l02L42
34A82l85M34m89N47o11O82p60Q43r36J038j149J271j403J547j703J878k071K281
52A196k512K769l060L387l755M178m668N241n927O761p801R144j0949J3512j7467
67i951K4416m0062J35327j0335k33709J53175m5866q9191J95153O1328k09036
78f8751K1016N1993o4670Q5957Q5061j24813k8908L1173m2278O0657P1890r4083
90a5756j2748N1702n1413K3807P4452r1884m3467Q1681j1250p586O2487o1368
102a343o1843O1802J2600N69M8259p0502o9489P0063J7535J92Q0850o4562j20471
115i6340P3265M1082m6893R0582R548j56401K7937R8939n9331L4056P3747j28288
$$ y = [0, 0, 0, 0, 0, 0, 0, 0, 0, 0, 0, 0, 0, -8, 8, -8, 8, -16, 16, -16, 24, -24, 32, -40, 48, -55, 64, -72, 80, -96, 107, -123, 142, -160, 182, -203, 231, -258, 289, -322, 360, -400, 443, -493, 545, -604, 667, -736, 811, -892, 986, -1085, 1196, -1316, 1453, -1607, 1780, -1975, 2203, -2465, 2776, -3151, 3610, -4191, 4953, -5996, 7516, -9951, 14465, -25597, 109730, 99395, -134314, 18861, -27005, -116196, 78957, 140285, -68751, -47735, 4258, -60412, 25545, 110606, -14207, -43115, -11942, -54220, 6437, 78327, -15756, -28504, 23198, -28215, -4408, 70044, -21840, -65307, 16374, 5124, -2462, 60025, -1343, -63186, -1384, 11216, 11785, 60044, -10458, -79947, -9884, 7651, 7843, 88693, 24131, -96340, -23075, 18007, -28886, 61696, 71244, -85157, -57220, 41719, -17612, 16444, 90191, -38097]
127c8097m7960J14449k1823k5279Q7082n6764q7961Q3639K4971n3709M6143l664
139B1027p4107M2363M2879l7966J7374M549n3154K8984L8971l6458O532Q579m8917
152c9344K6959N4246l5075j0341J7161m6165N128O2157j7595k4113J5241l2460
164b4201l242N6985q131k3677J5563l6983j5693O4771j596l5399L1023k1981m5121
177d7682O1465K3168n7014K2289J5306n8282L0239N4008m9361q703L7530l9882
189a6919o386N4167k4398k8731L4481j3432j8575M0927p149l3942K3599P18k0877
202a6517K9504K736l4336J5700J1503k1052J8989J2124l1620K797J6451j4657
214h378J0613J5060k4179k438J4756j3017O715J7353k1062n083J7229j4149O09
$$ y = [-38097, -86057, 28392, 6569, -18710, 68372, 11608, -76353, 7286, 32257, -21452, 24691, 21027, -53080, -10717, 32162, -5804, 11570, 16119, -37035, -8051, 30920, -5538, 994, 9573, -39344, -12385, 41861, 6786, -3555, 13606, -32559, -27431, 34726, 17131, -6982, 8259, -24201, -27443, 29542, 21411, -2266, 13297, -23686, -39379, 25392, 23796, -11603, 19420, -2561, -47682, 13783, 36951, -20063, 2226, 17532, -40750, -10511, 43497, -5864, -14567, 22963, -16919, -23305, 30862, 6464, -22267, 12214, -1218, -19793, 21134, 13985, -19957, 3642, 4360, -16517, 12987, 15723, -18613, -2913, 8590, -12462, 6527, 18651, -12969, -10172, 6279, -8378, 2235, 17295, -6884, -9322, 5434, -7583, -868, 16485, -4577, -9660, 7569, -6580, -5971]
227e971K3111j7499j1342K2212j2100j2071K7273p134k1746K2552M17k3516J9592
240C778Q114k4299J3019J1894k4485O689J7375j8678K591J7172j9225m676J9917
253I186r452n147J6457j1676j1781J7306o95q671J2273n565j4602J3044N983q576
267a916P440k061j5426Q500J0589o731L498k99j4906N397J3674n008o9J391j4896
282a0823J012J7066j132m006K206j2086l957J6936L958o318l2r594o345J6189
296C074Q843p372k572p023q444J2594J2957n910n814n410p751R742J5926l457
310I383r714n834o329O850J6673R20j1136p815m238O393J5331K615j1469r655
324h025m078O072J5631N376j1264j1634l991N611J4179O916j0118j3718m137O806
$$ y = [-5971, 17140, -359, -11701, 10511, -1589, -13660, 13613, 6479, -15267, 7285, 7702, -15814, 3778, 11892, -12407, 612, 12506, -11979, -5290, 12085, -6593, -4002, 13170, -6055, -10731, 9186, -266, -5413, 11044, -632, -12413, 4893, 4198, -4473, 7800, 2235, -12367, 677, 6660, -1916, 5524, 3463, -11963, -3463, 7126, 395, 3893, 3594, -11312, -5915, 7759, 2751, 2682, 4073, -10823, -9811, 7255, 6123, 2117, 4323, -7763, -11720, 5216, 9174, 2856, 2824, -6770, -13115, 3074, 11917, 4545, 1973, -5050, -13494, -900, 12057, 6147, 333, -5077, -12828, -3086, 12840, 9383, -331, -6165, -12494, -5644, 11029, 11949, 813, -7002, -11240, -4847, 10484, 13099, 1630, -8025, -12103, -6031, 9600, 14976, 3712, -7922, -11913, -6302, 7877, 14793, 4675, -9043, -13180, -6374]
338f374J3868P795q513j4947o220O755J3679Q173o755j4531p309O783J4418Q489
352A5311o479j5385q695O315J4568R173m717j5031j0271O234J5429Q273n013j4147
366d435j1797M669J7072R651m710j3295j2498K630J7440J0253n615j1829j2045
379a4509p9J8364J3491o854j2594j0150k670J5607J6648n821j4177p948k798J2068
393a422J8852l285j7727q000p22Q488J8367J307j8434r985J811P575J5725L681
407A6231j8270j2568L523Q432J3616O255j6014j6047K585J0490J2164N797j3525
420B669j6716L80J1434J3422N708j2989j6599j476R207J4088Q474j2535j7117
433a2050l74O876J0871J2397r701k1298L90R527N238J2017j869k3090l518J4499
$$ y = [-6374, 7494, 15289, 6776, -8171, -14391, -7636, 6043, 14216, 7461, -7070, -14379, -7596, 6822, 15311, 8832, -6553, -15248, -8933, 5635, 14808, 10091, -4940, -15211, -8977, 6452, 14725, 9712, -4435, -16232, -11563, 5509, 15160, 10450, -2845, -15343, -12713, 4727, 14980, 9365, -2464, -14509, -14588, 3776, 17267, 10413, -2181, -12331, -15001, 606, 17254, 11433, -2744, -10692, -13490, -1422, 17430, 14145, -3582, -11582, -12304, -3816, 14551, 15858, -2576, -12561, -10750, -3175, 12550, 16231, -2039, -14607, -11084, -2652, 10964, 17219, 1205, -14842, -12257, -1767, 10397, 16194, 2669, -14047, -13667, -2233, 11189, 16897, 3908, -12691, -14167, -4960, 9128, 17602, 5067, -12050, -12424, -5548, 5323, 17720, 8019, -13279, -12889, -3362, 1876, 13893, 12024, -11066, -14584, -85]
447h5L112N473L570j9934r370J7904O487j639N123j4069j5622J6906J3880o752
461D984J005o213j8107J0618K2050n079p333j535j4834O69K4250M634j2905m684
475b480o928l763J6134J2823p597j1788o672P02J0038R369Q50q980j2758J267
489i783J2737L183o55J99j2701o013J6737N333r388L224l168j2593J2291J3236
503A2639j3181l470O260j0140L758J7726r940j2583Q931l429k909J8877k760k0460
517a0681O340N802q660J4041R269k2578n491J4143m788J838J5889j1178j7870
530a3924R574O493m094Q767K328j5389l748R658K829j84K434k962p579l28P790
545A665K928m262M30J184o248J364P940m651l945P667k492o408P586n94r056Q166
$$ y = [-85, 3027, 8500, 12070, -7864, -17234, 670, 7157, 5518, 10641, -3428, -19050, -2144, 11736, 4984, 5989, -224, -18331, -7713, 14337, 9258, 1925, 390, -14444, -13775, 10475, 15109, 2204, -2480, -9408, -13171, 2963, 15786, 8189, -3599, -10271, -9569, 469, 9838, 10688, 1708, -11050, -9783, 2954, 6137, 5482, 5681, -7020, -13033, 3704, 9037, -351, 2873, -295, -12888, -597, 12639, -542, -4012, 2248, -7892, -4134, 13592, 3652, -8931, 0, -3429, -6338, 12539, 9779, -10681, -4341, 1461, -7199, 6842, 16111, -6467, -11958, 2185, -2603, -765, 15124, 3946, -13924, -4350, 2143, -1951, 6816, 9144, -6245, -9993, -335, 2494, 2310, 4744, 1782, -5797, -6125, 1665, 4593, 331, 761, 1945, -4303, -2939, 5001, 350, -3595, 4072, 1580, -4828, 2758, 2164, -6892, 1274]
561A274N439r920K833M533j1667K913J3040p649l766Q766r457o562J5646K29r965
576d313Q576r96j3926Q823R906j0240K054P781j1735l736J1801k189m636Q312
590E482j622r751K782M577k706K163M582m061o505P64M460O86Q22L784m263r377
606h183L833P863k515J415L891j0015n035J0274J583l142N814m294r985P073N502
621D079n234M201J213j0809L345Q852p034m65P051q594k449J2697m143r417P952
636A245J52p490R903M777j3362j326P457l074K739Q190p694r936M023M825K180
651B609M340k540r425l103N457O673K946k715o289n484J243Q881N359m093n206
666a347l700k069P038Q303l922o430j205k047L481R424k116q715L00K02K0R247
$$ y = [1274, 6713, -3207, -374, 4159, -7508, -4595, 8445, 796, -2970, 5796, -3661, -10223, 5423, 5652, -4313, 4263, 3267, -10659, -1836, 8070, -2170, -116, 7665, -4070, -7806, 3995, 1806, -2830, 5482, 3860, -5891, -3109, 1468, -1238, 925, 5507, 1446, -5059, -4295, 165, 851, 1673, 5457, 1194, -8183, -4350, 3513, 998, 2413, 6304, -3711, -8746, 1528, 3111, -31, 5783, 1489, -8496, -1423, 4079, -1155, 3046, 4259, -6550, -3205, 5647, -1387, -1852, 5199, -3395, -5844, 6853, 2710, -6707, 1245, 1397, -6093, 3810, 8587, -4775, -6101, 1356, -1718, 1021, 9211, 1517, -8419, -4396, 429, 2609, 6949, 4409, -5016, -8119, -2662, 4011, 6957, 4242, -2047, -7531, -6288, 2593, 7952, 3859, -1347, -5047, -7116, -78, 8225, 4303, -2127, -3332, -5379, -1898, 7526, 5410, -3305, -3005, -2803, -2783, 6464]
682F464J158j1853j620N418q20M946N297j1253p419Q017L674M43N126o437j1841
697a0700M984R450M57J236k550j1173p24J1135M616j675k933p623l408Q369P867
712G328r75m947o106l125N753Q387J108o066o263j744M220P068L066n333q241
727e870j320N394N789K752l291q442l184O161O549J582k591p006m873N331Q296
742E277J103l492n227m994K876R198K729n120n328l040J703P776M488n190o653
757c894k125K036O473N135l992p847k288L012N521N074k327q485l726L826N869
772B262M517j239p918n080L372O211M012n19o803o036K448O823L830q45n609n816
788f390R27O640M727j107n644n161R93N848M583m34n685n475J297N957M015k85
$$ y = [6464, 7622, -4231, -5851, -433, -1253, 3693, 8990, -2263, -9682, -1665, 2009, 2452, 7578, 1141, -10700, -5716, 3734, 4191, 5427, 2877, -8296, -9020, 2115, 6731, 5056, 2123, -5500, -8908, -539, 7328, 6353, 1406, -4700, -7825, -2072, 6315, 7423, 1357, -4906, -6650, -2430, 4638, 7704, 2371, -5870, -7190, -1796, 3993, 6745, 3454, -4988, -8172, -2011, 4538, 6120, 3529, -3477, -8350, -3019, 5277, 6380, 2888, -2339, -7333, -4457, 4741, 7470, 2350, -2978, -6018, -4315, 3461, 7949, 2759, -3894, -6019, -3983, 2490, 7625, 3633, -4214, -6502, -3490, 2031, 7105, 4778, -3707, -7433, -3607, 2262, 6779, 5540, -2378, -7458, -4086, 2125, 6137, 5618, -1185, -7221, -4773, 2050, 5880, 5035, -574, -6390, -5463, 1177, 5904, 4797, -847, -6008, -5015, 833, 5416, 4982, -703, -6178, -4881, 1076, 5091, 4806]
804D806m728n959N83O645M041q63l992n652q84O577N357j142m443m949j117N236
820d84N554m8m238n246j485N088N450j7l386m682k564M412O438o2l857l555k539
837e221K772O810J098m715l508j436J629N616K624m074m639j108K053M507K305
852D713k824m195j978J634M907K252l069l659j283P82L972L290k592m294o90J003
868b031K656L282j229m463j346J562K323K422m71l665j869Q40K498K595q15l403
884a114j132P08J070K660O26l766j872J929Q39P65J652j896l363J492K305l93
900E10M96J57k654l94K815K52j013M85p50j279J445J287j155m12K81o64L74R97
918G78p20o20O73l34j29R64n26j238J022P79q91K68M18j259K48J521n12q99M98
$$ y = [4806, 78, -5881, -5298, 1347, 5388, 4525, 533, -5119, -6003, 574, 5931, 4789, 346, -4603, -5720, -484, 5070, 5022, 784, -4462, -5947, -859, 4591, 4574, 1188, -3494, -6058, -1646, 4792, 4730, 873, -2682, -5221, -2449, 4361, 5459, 744, -2764, -4200, -2571, 3045, 5669, 1595, -3044, -4152, -2099, 2408, 4713, 1889, -2306, -4284, -2650, 2257, 4509, 1440, -2219, -3502, -2720, 1252, 4542, 1950, -2344, -3034, -2031, 625, 3907, 2678, -1785, -3131, -1569, 754, 3176, 2705, -960, -2829, -1989, 509, 3104, 2289, -1114, -2246, -1538, -468, 2192, 2818, -948, -2820, -891, -52, 713, 2365, 469, -2894, -1402, 903, 510, 1006, 1163, -1491, -1885, 930, 1182, 169, 654, -96, -1375, 70, 1357, 202, -210, 71, -593, -219, 778, 58, -562, 111, -223, -352, 612, 86, -1152, -130, 649, -242, 26, 444, -815, -567, 954, 442, -457, 41]
937D1M7m46Q25M95j224p36J011P83m58k07J54j353j98K630M98k618p9M97j480
956a818J868L232k842k760J751m10j35M310o02n062O82J694j253L403K064n489
972a367j641L243q95J164L713m114m138L868P63j337L753j346n903K624L894k551
988b70R62J424m931m74N609j4k512N38j928j465M073K655k266k604j249M33K618
1005E99K599R4l806l885J939L899R14R61j618o519l9O734J096j078P03n557l580
1022f544P143L559l102J058k803o110N675O575m254r28R87o555J980R448l166
1037B963n099K891l233k002R246O87q451R11J580l045N922M556q100l968L522
1052a620N58K706M322m605o532O36L559M094K277l542n137k122K315O787K980
$$ y = [41, 88, -358, 467, 962, -262, -998, 13, 796, 338, 131, 285, -1068, -1266, 1364, 1862, -756, -835, -338, -1818, 50, 3282, 440, -2320, -569, -979, -1114, 3196, 2594, -2468, -1786, -92, -1345, 2058, 4122, -1367, -3008, 235, -660, 504, 4217, 103, -4035, -167, 596, -741, 3012, 1666, -4237, -1613, 2281, -270, 692, 2116, -2815, -3289, 2320, 2306, -206, 332, -1596, -3061, 1012, 3667, 1401, -1203, -2452, -2019, 599, 3198, 3292, -514, -4399, -2460, 1439, 2353, 3314, 1696, -4823, -4862, 1872, 2968, 1890, 2593, -2964, -6544, 599, 4158, 1056, 2114, -689, -6799, -1124, 5451, 1197, 269, 1256, -5299, -3319, 6129, 2963, -2136, 755, -2478, -4480, 4766, 5453, -2998, -2087, -507, -3552, 2370, 6926, -1174, -5142, -1620, -1062, 1644, 5966, 1361, -5171, -4535, -976, 3118, 5395, 1853, -3284, -5406, -3091, 3696, 6676]
1067F676n094m080j672p93O780O224n787n355O15k097L377R170l992q243K170
1082b101m11o83R222j06j0754J440L858l584O153M510j1235k584Q169k000M69
1097C63O655p771p725Q499L369k956M178l031r472M297P726j265K11j545p399
1112e866M03P172K545k31l057o043O0M841L171K306l203p389P06M677J127L344
1128D563m81q850m10O588o11J441L139q233l781Q475M71k611M701m794p029Q078
1144F56L834n681L197m53q614N581P717o358p06L197p535J096J0358l539n042
1159b292L591m114k299R432Q22o751J299j118l233O760L373n527r72m61k467N007
1175A050L542m103r09p64l102M712M074m536o80P67l974L102N508m359k127K747
$$ y = [6676, 1582, -2498, -4170, -4963, 1817, 8041, 2254, -3101, -2486, -4583, -1206, 7964, 3972, -4271, -2101, -2512, -3195, 6027, 5921, -4833, -3393, 465, -3119, 3034, 7544, -3691, -6275, 1894, -106, 363, 7018, -753, -8478, 21, 3390, 434, 4612, 1581, -7891, -3594, 4132, 2867, 3078, 1533, -5866, -5463, 1709, 4254, 4023, 966, -5077, -5017, -176, 2995, 5301, 2098, -5291, -4585, 92, 1219, 4563, 4082, -4768, -5178, 1410, 799, 2240, 5379, -2854, -6635, 1840, 2311, -300, 4401, -393, -7422, 656, 4490, -1191, 2006, 1553, -7061, -1480, 6237, -121, -827, 2370, -5165, -4069, 6289, 2750, -2292, 1299, -2815, -5114, 4318, 5140, -1611, -312, -1430, -4663, 2097, 5470, -57, -1029, -1490, -3957, 1050, 4592, 489, -420, -1184, -4286, 426, 4500, -36, -716, 51, -3923, -821, 4687, 328, -1799, 948]
1191I48l462Q48O059l391l592L681k228j206O464k072n720M056P6l419O117N10
1207C669p678K674L195m619L852L817p722o70N749l454K79N440m893l834N276
1222A081o52j849M685k240m640L837P95k220L471q40m448K919J448k737K819L46
1238A775m490K211K415l383J683J872m405J085L462l121K57K842l907j05M265
1253B456k842j065L811l111j788N159j922l161M464j116l959M715O12n151L389
1268D91J850m979K574K903m932Q63L856l835n1L701l607q83M156k114j530L292
1284A755k323j891M385r28k602K911j120k883M018P95l515J949K26l403K989K451
1300B814l619N18J194l138J796L375l033r41J713k537P37M073k390k131K058j871
$$ y = [948, -2514, -1666, 4393, 1002, -2590, 1091, -1137, -2343, 4121, 2049, -3671, 385, 461, -2958, 3159, 3669, -4009, -1335, 1860, -2759, 1093, 4910, -2812, -3482, 2267, -1187, -908, 4532, -361, -4195, 1081, 429, -1420, 3265, 1025, -3615, 222, 1017, -1203, 2268, 1428, -3020, -101, 1347, -1390, 1429, 1775, -2715, -504, 1911, -1472, 211, 2083, -2322, -1237, 2225, -896, -639, 2203, -1704, -1809, 2456, -386, -1451, 2360, -751, -2539, 2620, 698, -2463, 2001, 885, -3074, 1641, 2253, -2898, 491, 2341, -2638, -64, 2839, -2093, -1230, 2626, -1209, -1260, 2441, -1166, -2049, 2107, -7, -1537, 1755, -568, -2459, 1926, 998, -1604, 1307, 187, -2696, 1322, 2117, -1398, 551, 777, -2626, 363, 2814, -805, -287, 907, -2231, -435, 2940, -93, -1034, 679, -1858, -1121, 2952, 562, -1569, 489, -1382]
1316a382l86M638j221l636J885m21j460M213M95m405N66J112j541L015J740m326
1332a114o99J770j141K056K372l617k092K057l79J266K708l029k953K014M45M89
1348A53K869k086l960J694J594j00K303q56m176N82K369J44J637l37m081k21K766
1365B94N20R77J47l824r85K964R75M81K79l401j696L174J421j06M90k720k468
1382c478K926K445m99L1j866k874K211L251l71o35j341k708J337L643L8j279j065
1399b34k312N56L605P95j556j291j811ML367J446j530j698j482J31K747J805j302
1416A240j913j459K45K664J764j111j862j599MK798J892j151j947j490k47K651
1432D79K282j234k055j213n31K229K778r83k527p78l63J206L109k22k903j069
$$ y = [-1382, -1768, 2870, 1649, -1987, -102, -523, -1983, 2230, 2725, -1680, -1114, -2, -1543, 1472, 3212, -1114, -1813, -43, -1184, 872, 3244, -373, -2465, -408, -787, 479, 3187, 158, -2795, -781, -336, 153, 3022, 936, -3024, -1330, 264, 164, 2467, 1611, -2565, -1983, 386, 530, 2167, 1830, -2251, -2472, 294, 814, 1791, 1938, -1886, -2871, 93, 1068, 1549, 1828, -1573, -3269, -95, 1326, 1220, 1710, -1010, -3478, -552, 1893, 1394, 1425, -441, -3315, -1104, 2147, 1776, 1141, -200, -2908, -1571, 2072, 2110, 831, -234, -2546, -1990, 1615, 2410, 854, -437, -2248, -2244, 1123, 2569, 1039, -659, -2141, -2010, 737, 2542, 1240, -673, -2132, -1887, 777, 2541, 1430, -432, -2031, -2027, 771, 2663, 1512, -435, -1925, -2172, 479, 2761, 1527, -528, -1741, -2272, -43, 2735, 1752, -775, -1553, -1916, -710, 2399, 2177, -726, -1795]
1448a795L92O60K494Q06k859j842R17J084J418J154k009k739O89K040P77N06r48
1465G45k623m62K549J548l79p95j899j326K166K575n32j350j077j407R32L272
1481A937L16k270q42m30k29K490J749k218j823M68l6J003K146j071k729J82J275
1498h2O9J199L13k421j152J865J106l23J94q41j851Q41K495j58j326j4q24p93
1516a703K536J510k311j035R59j146P13L064j429k844J232M29j066K502P90l635
1532a434m0K124j312N96K336k536k026K662J30j322K069l29k945J366J923j528
1548b66K95J012j858k80K045k79r71N93m14o81J024P91p69p96O4M43J53K16M91
1567H13r70j216J206R37r63N58L24k121M11K249j115n22J622j806j151K862k41
$$ y = [-1795, -1403, -743, 1751, 2557, -302, -2144, -1227, -143, 1275, 2429, 420, -2319, -1630, 410, 1187, 1693, 745, -1878, -2340, 209, 1757, 1378, 583, -1316, -2642, -476, 2099, 1567, 217, -860, -2267, -1335, 1937, 2253, -17, -859, -1289, -1518, 972, 2721, 503, -1320, -852, -888, 115, 2261, 1190, -1539, -1357, -82, -13, 1186, 1499, -922, -2074, -209, 897, 574, 768, -73, -1924, -1083, 1412, 1254, -72, -86, -910, -1703, 833, 2343, 32, -1003, -44, -1190, -477, 2587, 1158, -1686, -454, -25, -1091, 1411, 2201, -1434, -1474, 650, -662, -66, 2270, -266, -2292, 370, 500, -822, 1247, 918, -2027, -661, 1262, -266, 29, 1041, -817, -1097, 948, 669, -302, 291, -123, -804, 220, 1011, 242, -554, -490, -47, 106, 322, 813, -157, -1373, -167, 770, -193, 365, 689, -1432, -1021, 1228, 113, -409, 1213, -593, -1744, 1118, 877]
1584H77j954J905o3k615J988J583k779P75J802k507N3K579j934j023K594j162
1600A19j401K247n31k054J984M99j788J249N28k045Q34J420j305J97Q57j511M8
1617f53J310n20j90O49p84k62P66k98M5K80o93K03M73p57L11O17j187M86J233
1636A029j497l13J556j335l07K373j143j811J905k15j596K515M25k997R53J229
1652G71j974J445J989k945o50K203j446j3K742j897k158K275j57j242K310k24
1668A029k796J220J112j135J100P11k226j14J584l26K54L68j377j86Q33K70N13
1685H34k00j490K66P06k25J035K58k394K9J713o71M92J220k362j210K456k7p01
1703b71J826j423k439K131J280j548J364M9l012J061K445j324Q4J114k589l82
$$ y = [877, -1077, 828, 765, -1850, 138, 1721, -1058, -283, 1519, -988, -935, 1644, -290, -1313, 1281, 119, -1282, 965, 434, -1620, 364, 863, -925, 324, 852, -1193, -359, 1061, -244, -47, 810, -701, -653, 657, 137, -53, 596, -188, -450, 316, 18, 63, 343, -350, -147, 326, -431, -120, 497, -690, -204, 1029, -468, -781, 775, -560, -867, 1506, 363, -1448, 457, 242, -1354, 1161, 1586, -1411, -458, 771, -1203, 242, 2231, -714, -1364, 839, -607, -620, 2122, 225, -1933, 342, 185, -1057, 1253, 1029, -1767, -547, 565, -570, 530, 1241, -985, -1099, 485, 159, 413, 781, -596, -782, 51, 321, 834, 634, -856, -590, 116, -109, 926, 1184, -1210, -1181, 532, -139, 353, 1573, -789, -1999, 457, 430, -271, 1555, 132, -2307, -176, 1104, -444, 920, 969, -2043, -982, 1463, 139, 223, 1337, -1252, -1634]
1719a634K872n07j035J304j402j499K438P49j543M39k03j413J293J281q90l47
1735i7j04p35P45J105n98k74k76p33R00R38o05r7j82j001Q06J362r57m46M75j006
1755g80J50J737o03r36N49o82k47J636j16j319N29k7p69J350N55j504J78M74p56
1774e81P02R58j250m31Q82n13K00R07p91q05Q48n2j64O41l44q54M71L60j93M65
1794D56m54p22N62L06j71M91k96j014N40O57l05K98n4r99K66Q76k23Q2N4q15j16
1815e81J011jk68J88q38k25J011J23k93J16n66m65R38M01n55P0k64o66Q10P59
1835G05n19j69r8o10M96R08l99l02j36m04L45P70o0n06j23l87J51Q69k9n45j05
1856a48k46L0P73J76o46j26j45j10O92L34n29k84j17j06O64M66o09k70L3k42N10
$$ y = [-1634, 1238, 731, -304, 1000, -402, -1901, 537, 1286, -257, 182, -21, -1434, -141, 1140, 250, -97, -201, -936, -191, 914, 316, 42, -234, -967, -67, 871, 266, 169, -13, -1014, -208, 1154, 197, -249, 226, -780, -630, 1107, 504, -432, 117, -565, -812, 824, 708, -611, -82, -109, -878, 472, 1027, -477, -299, 175, -581, 121, 1079, -171, -602, 280, -233, -33, 874, 83, -722, 126, 74, -90, 551, 207, -647, -176, 184, -9, 456, 2, -720, -158, 148, -23, 468, 172, -842, -302, 355, 50, 348, 294, -705, -439, 437, 214, 296, 350, -465, -581, 430, 429, 161, 349, -489, -714, 297, 420, 127, 243, -323, -788, 150, 551, -4, 66, -198, -864, -54, 705, 186, 17, -81, -691, -195, 713, 314, 12, -124, -528, -183, 587, 527, 21, -102, -489, -338, 531, 502, -43, -148, -394, -364, 409, 585, -61, -187, -332, -442, 250, 584, 55, -229, -346, -452, 212, 678, 69, -201, -168, -410, 100]
1877A00O18n20m46J13j50J63P34l04n89O9K2kN40M8o72k9J67J4L80O0n16p0J70
1900a00N2K03K33m50k64K12L02m9J77k10m64J97L12J66j60j56j98l1J60K96n6
1921A72l42L4J5k2J57K61l75k51L45K4j47L11p7n00L87L30k50j11K22l99P7M96
1943C57j48k77J80j65j94N00J43m32m4O6j83J88L27k31l76J15P5NL04j4m78j5
1965b97L91k3m2K51k30m84L86M78l79J4K31o07m4Q18j11n42K79l7m74N25M22o76
1987a51j26L80l11k4P28k95o91L62J87l04M11K86o80j06M22l3M8K26k91m78L68
2008g2L36j92P3O2m97o0N64K1k97J56j81l26L71L94l19k17K50l14j19O71L8o43
2030c01K54K08n02L21O11o05l35N23j81k10O83j33q17L58M03m77K73L96p23j43
$$ y = [100, 718, 198, -248, -135, -285, -122, 612, 308, -281, -212, -190, -192, 348, 396, -276, -305, -138, -124, 256, 316, -200, -270, -100, -48, 155, 388, -62, -326, -114, 188, 139, 316, 106, -358, -161, 151, 317, 157, 1, -197, -228, -68, 228, 172, -170, -136, -121, -143, 14, 275, -100, -351, -6, 18, -129, 182, 105, -395, -8, 322, 72, -39, 183, -216, -139, 357, 209, -68, 112, -53, -247, 253, 396, -36, -80, -14, -197, -9, 318, 87, -289, -174, -99, -94, 210, 196, -282, -297, 94, 71, 29, 280, 50, -434, -48, 430, 51, 65, 296, -311, -355, 463, 352, -190, 89, 52, -422, 103, 525, -151, -277, 103, -208, -232, 496, 201, -490, -128, 59, -245, 166, 452, -228, -334, 88, 55, 103, 329, 38, -440, -72, 264, 72, 145, 207, -290, -350, 214, 235, -62, 94, -87, -413, -42, 352, 33, -184, 66, -248, -367, 304, 342, -301, -47, 161, -341, -20, 591, -14, -349, 174, -7, -217, 466, 333, -484, -126, 277, -200, 73, 469, -254, -397]
2050c97O07k16k38N70k21n68M26K72l66J11J95m60MN61r5l18J94j8l17M24J80
2071C30l41j0J74k25q6M63p2m08J40J36l14K07L64m46k89M78j37k32N28lp08L63
2093h8L76n19J11M91n42k44Q24k32n16N14Q8o86M33M35p03J05M82m90q3P46l62
2114A40n64N31J3m80M62L27o61n4M54l20N7N02l04m32L15J47k83K73J64m87o3
2135b63L85o5j25L08j17m39K12M19l01j22K68k54k89O63L3o33J54L37m70J24P20
2156E45n06o12P24j7n26P25K04r22R3O08n08R0O89n54n69P12K6m19N03R1q02K09
2178b16M95l91K6M20n01j89M56M3k79K34l5m41L21L77k99j19K44k61p5L22J22
2199B54l24QQ8j01N5K90j05l58J65J31k05R3L30m50j86M40m5l06L85L7m89J36
$$ y = [-397, 210, -6, -244, 326, 105, -463, -37, 235, -131, -20, 175, -285, -281, 280, 185, -133, 61, 43, -274, 150, 330, -11, -21, 153, -72, -158, 305, 233, -175, -35, 101, -213, -6, 358, -88, -377, 101, -36, -268, 260, 257, -451, -88, 288, -231, -120, 371, -171, -415, 409, 177, -339, 175, 263, -423, 10, 445, -258, -153, 329, -161, -244, 502, 140, -424, 107, 120, -360, 102, 429, -232, -286, 168, -152, -95, 407, 103, -329, -14, 133, -150, 123, 287, -200, -263, 122, 57, -68, 240, 123, -316, -104, 315, 14, -108, 160, -94, -383, 280, 313, -320, -166, 171, -299, -175, 545, 39, -573, 151, 134, -392, 333, 537, -385, -292, 316, -192, -102, 587, 33, -536, 176, 202, -217, 286, 377, -425, -216, 279, -112, -86, 334, -167, -356, 100, 143, -136, 98, 63, -378, -57, 320, 21, -98, 146, -115, -190, 132, 254, -70, -62, 26, -75, -20, 270, 165, -193, -28, 103, -102, -9, 321, -129, -315, 125, 80, -226, 159, 196, -293, -157]
2221a57K81k73L2L80l51j31L57m2k63L45l1l45K12J78l69K71J92l84rK27j88O3
2243eK15k50j19J47oo9K49j19k34J92M1j34J78M8j78o4J04N5K2p5p2M0RK7J89
2268A91j10j91M5O5j08K14R2l92P5J98j34N2K04l67q9L16o3k6K41k93j77K17R0
2291E0l5J83j96k05K70Q5k10K32n4l81J25L40k14K8J34l62nL76j3j82P0k80ML26
2315H6k5k7o9j19j9K81N8j33R5k52j22M15Q6k38J50k14l13L94K74k53Lo1k53K36
2339b0L27k69j59P9k05J7M83j41k79J32k02L6N25o9l49K0j15m6M53J07l90kL6
2362c1k00L64K51l43j64K7j21K45L23k66k52L8j4P0M16k46k88O7j01Q3M18o9m15
2385b08J78m8j01M53P9n30P0J18j45L02J78m17o1J78j78K73K43m28k43K67j56
$$ y = [-157, 124, -149, -117, 263, -88, -219, 138, 96, -167, 178, 147, -198, 14, 192, -177, 94, 286, -98, -107, 120, -68, -5, 210, -40, -159, -12, -18, -87, 162, 43, -191, 1, 42, -92, 86, 134, -44, -108, -4, 51, 73, -2, -74, -34, -25, 2, 191, 81, -110, -65, 0, -108, 106, 198, -194, -119, 79, -55, -3, 201, -166, -255, 61, -2, -28, 213, -80, -257, -40, 50, 15, 198, 2, -203, 67, 152, -58, 174, 120, -261, -136, 204, -10, 18, 152, -210, -215, 161, 148, -34, 36, -244, -240, 86, 61, 34, -35, -154, -173, 108, 166, 33, 128, -124, -246, 169, 255, 17, 167, -47, -360, 34, 308, 55, 58, -3, -256, -20, 307, 38, -121, -42, -247, -230, 253, 112, -167, -35, -237, -201, 324, 255, -94, -74, -189, -235, 218, 325, -65, -67, -31, -231, 133, 384, 41, -123, -96, -217, 28, 351, 85, -167, -129, -143, -73, 343, 97, -191, -124, -225, -142, 276, 207, -208, -30, -78, -179, 274, 353, -177, -107, 11, -134, 168, 346, -71, -132, 46, -132, 141, 384, -44, -287, -20, -176]
2406a76J18L42k22l42K01m9n9M96j01m46J11J78j70K86J35m54n4L04j47R8K71
2427C20l14j32J63o6M8J99k21k32J58N9J0J50j36k16J40pP0J50k05p8J05pJK83
2451B42j93k59K20K6q8K03nl41J29L18k53oK59m00q6M73j98j66K96j51l02L25
2473D3K03m53J87J56m14J63L65k79r9K20j39j48L81q9k45J22j0n8J86J68l10j01
2495a51J46L7qJ29p7k06r5K75J06q0q5j5k51J64L41j01k62J38j63j14M82J11m37
2518a16L5P0k89L12M39l94k89K67j46l6M74j27m73J96J49k22L05K10n03j69L30
2539B3j41J19L55l76l91K90K15r9K24j3m29l9M35k3j03J65k59l39L49L67k89m5
2561dN6l09K0M99k1k79Pj1k86K67M70l64k37J45q3j04N29K4n07N7J76j74R8L54
$$ y = [-176, -58, 284, 62, -280, -79, -128, -187, 309, 208, -238, -127, 51, -119, 167, 302, -152, -206, 98, -49, 49, 320, 6, -126, 37, -29, 19, 218, -3, -235, -77, -18, -8, 142, 6, -210, -70, -77, -7, 143, -62, -140, -35, -42, -41, 242, 49, -210, 10, 36, -52, 151, 146, -195, -66, 252, -1, -7, 252, -148, -234, 239, 41, -125, 171, 20, -282, 43, 246, -207, -20, 136, -278, -115, 250, -29, -128, 92, -47, -195, 186, 97, -148, -26, -36, -94, 92, 260, -50, -151, -5, 32, 24, 153, 76, -130, -225, 50, 156, 76, -9, -24, -275, -111, 230, 129, -133, 5, -158, -272, 210, 321, -116, -81, -11, -300, 12, 451, 57, -232, 35, -111, -147, 327, 200, -273, -77, 72, -150, 155, 365, -138, -307, 23, -118, 1, 356, -20, -411, -121, 94, -5, 219, 206, -223, -262, 173, 150, 47, 212, -47, -386, -37, 330, 41, -4, 52, -257, -237, 262, 241, -38, -31, -42, -328, -61, 409, 45, -192, -47, -130, -234, 295, 319, -188, -131, 45, -129, -31, 323]
2585C23l26l26L63K4j24K72N4n00R9K93k07Q4K60l39k89M17N3k81K69K4m57J20
2607a94M20k76m7K52k01k77M21J21l70J57J13l67J86L67k53j69K27j13k20L62
2627A39J46l81M3J26k59J10L71k56k11J71k0j76K96J30l57l3K27j16j3K95k24
2648Hj75J61O9k05K59J00m35J31K05q1r3K33j55l06K85J35k40OK58l08J4L25j60
2671C1k03K63p9k49L23J68l67L4J96k91J10L52k59k11K03m8r4L24p5l11L0K57
2693A04j87J51J49k98j63K51J04j36R7nl07N0L06k4p4Q1j48j94K46K05j38j59
2715h9J29j53J5L05M3l82L3J13j33K38J82m10j13K28r7N4L35j77m91K27K07j49
2737h5L32k9m78m6L19L3L5J74l28k70K51K12mJ42j80l57J29K95J25q4j44k70J4
$$ y = [323, -3, -329, 34, 58, -66, 206, 260, -240, -141, 152, -55, 29, 289, -50, -339, 78, 131, -150, 119, 143, -314, -194, 226, -50, -97, 155, -46, -323, 98, 219, -151, 6, 119, -248, -62, 305, 52, -117, 110, -3, -223, 139, 285, -96, -53, 73, -186, -76, 295, 39, -172, -1, -21, -197, 99, 229, -128, -161, 66, -50, -63, 232, 8, -167, -6, 63, -142, 117, 217, -218, -87, 118, 37, -56, 177, 22, -284, 1, 136, -104, -98, 160, -148, -134, 191, 31, -172, 91, 12, -237, 86, 254, -113, -79, 117, -174, -64, 288, 29, -182, 21, -27, -121, 203, 128, -183, -153, 104, -83, 68, 217, -81, -244, 7, 111, -25, 72, 67, -240, -190, 116, 92, 18, 99, -49, -243, 3, 208, 70, -89, 40, -113, -98, 207, 250, -132, -99, 14, -119, 119, 301, -109, -222, 6, -91, -37, 298, 121, -370, -143, 64, -85, 247, 218, -260, -306, 13, 46, 81, 255, -73, -343, -92, 120, 116, 258, 78, -279, -150, 145, 270, 186, 42, -228, -214]
2760b14J85L16m2k65j83oJ75K24O3k63l12J37J46J67J66j61m32K9K30P3K63m1
2782B55m86r2L10J57O1J42m75l47L24K61L0J10k69m47K67L25J22mk34m02N7M36
2804A01J17M8j34m45q5N02J95Lj16n00j31N36K04m4r0m54j54L75M12p7j41l49
2826b27k68L90L79J8j50k94k94K52M64J3j23k59l86K84M85N3j60k18l07N8N35
2847B45J31k35j72k69L2M46K34k51j09l84J6M35K76k16k60j58j18L63L65j70k52
2868e1k12p0K78L86r0l59q2q2K38L31L0l56j05p1J87L75n4l17j68MQ2L28P8l29
2892b9j21%J7K93J40l46j45rJ15K88J06l15j95O3%J85K49k24k46K2P4J42J71j12
2916A23l16K3K02k5J93n4k90j05K27P7N3pk01o7Q4J84Nrj90o6M9K09O4o9j19p2
$$ y = [-214, -29, 287, 245, -20, -203, -209, -34, 190, 253, -10, -322, -185, -39, 128, 294, 133, -299, -270, -40, 33, 296, 255, -231, -323, -13, 144, 205, 347, -128, -475, -151, 110, 140, 250, -19, -466, -199, 126, 248, 244, 10, -392, -335, 101, 218, 266, 132, -313, -398, 104, 299, 302, 186, -314, -445, 91, 295, 251, 161, -293, -447, -72, 340, 263, 122, -227, -495, -105, 274, 292, 142, -152, -446, -194, 270, 283, 160, -99, -485, -201, 284, 337, 177, -41, -348, -290, 245, 376, 141, -31, -300, -268, 178, 412, 161, 52, -332, -316, 119, 395, 179, -81, -239, -357, 6, 371, 201, -51, -263, -333, -55, 331, 241, -118, -200, -282, -44, 287, 317, -39, -144, -215, -28, 347, 293, -24, -192, -188, -106, 222, 300, -29, -150, -150, -133, 160, 300, -46, -191, -200, -85, 203, 309, -6, -201, -138, -138, 47, 296, 72, -174, -152, -78, 64, 235, 123, -193, -170, 32, 7, 200, 146, -144, -249, -22, 55, 108, 101, -100, -167, -83, 101, 106, 97, -93, -159, -110, 99, 163, 94, -25, -97]
2942i7L2J06J02L0j99j63J27K9J22O2j46j57P7N8j0J76j19k21J33J05q9J35N5
2965A48k44KJ45j7l2J28j09j99K24L6m9J54j21j72jJ41L1n4N1m7j27R5J13rm0
2990D7n1j40rJ68J16j24q9K8j12J27K43j10j71Q5j46L9K92N2k94j7L3p9J84K09
3014B81j73k83J33QjK77q8l46M2Q7K1J96P2l50j83K75J12J1Q7k36k29K10J99M2
3038A64l2j34k26M5K66J78j27j55j78o9L13K73j06k78j14l1J13L65J0l29j24L9
3060a37N8K89K17m72k38J17J25J22K44j75m66JL44J30J12r1m01j16L37J98k2j6
3082A60k71k97K98L76p9j50j61k23J08N22P6l84j80q4Q2L88K68k97m12lN2L19
3104A08L00j62m20j23J69K00K50Pm98k42K52K30J50J07l21m45K05M05N9o8j28
$$ y = [-97, -65, 41, 143, 173, -26, -189, -62, -33, 89, 151, 5, -152, -75, -17, -27, 149, 30, -191, -58, 47, -42, 93, 148, -96, -94, 51, 34, 2, 130, 21, -178, 46, 82, 33, 187, 66, -106, -107, 34, 65, 11, 62, 15, -112, -17, 96, 87, 47, -4, -144, -153, 15, 131, 7, -82, -54, -166, -39, 204, 94, -77, 8, -138, -99, 193, 245, -49, -66, -33, -112, 72, 281, 108, -175, -42, -34, -35, 242, 154, -192, -150, -63, -42, 154, 226, -124, -307, -32, 80, 91, 178, -58, -287, -77, 122, 164, 132, -2, -228, -183, 83, 261, 134, -21, -199, -268, 45, 318, 212, -66, -180, -211, -98, 267, 277, -52, -176, -137, -79, 210, 427, -45, -283, -166, -41, 81, 325, 150, -316, -315, 29, 159, 271, 180, -221, -337, 0, 198, 176, 160, -111, -408, -110, 266, 187, 37, -124, -347, -239, 283, 359, -25, -205, -289, -207, 181, 449, 152, -260, -263, -211, 108, 408, 246, -174, -297, -128, 72, 322, 329, -169, -411, -159, 71, 221, 328, 7, -438, -233, 172, 231, 163, 35]
3125C5m42J03M92J38j09k39k91n9M64L55k13l44n8j32K86L99l7l99k29Q5J26L95
3147C26J25m80m02J26L13J92K23k77n58J6M69J41J6p9m22j87M44L80j24r0k51
3168i9l61L16N16j01k28j32k22M4O27O5l65k10j00lL74L41l27l63%M9K40L47j76
3191B32m29j43K15K01K69p2l86k65K05L02J02rk62l17J16L87J53j41j58k54n5
3212c09K74M01j64k55k04l2K29L76k7l39j95M7P4L47J10l37k08kJ41K59J71l28
3234B9l08P9J44K01J25j63k86p3K45R2J19j29j85j56J76K21K5k5k96j29J56K44
3256A06J56j78k39pO9J38J63j25j12r5M4J21J68j23j70r2J64K1J58pk33j24J01
3279i6R1R4O1k04j34J52MJ35J5j61n3j4J57o2P0j4j05q9J29R3l5l1m4p4O7J09
$$ y = [35, -407, -304, 188, 326, 217, -22, -313, -372, 92, 447, 234, -110, -168, -300, -14, 385, 348, -51, -280, -195, -69, 326, 451, -29, -431, -305, 8, 200, 423, 146, -412, -396, 73, 214, 230, 151, -271, -458, -14, 366, 242, 152, -99, -460, -144, 372, 271, 43, -89, -311, -267, 360, 425, 60, -150, -250, -253, 121, 462, 135, -228, -228, -179, 61, 408, 232, -197, -340, -125, 76, 345, 273, -113, -378, -173, 129, 231, 222, -40, -357, -241, 146, 299, 158, 0, -254, -309, -35, 366, 202, -53, -257, -289, -60, 316, 289, -50, -245, -198, -124, 223, 333, -4, -212, -214, -73, 186, 357, 29, -279, -200, -56, 145, 270, 107, -179, -252, -7, 85, 204, 75, -110, -266, -90, 131, 156, 131, -165, -294, -138, 106, 262, 84, -155, -162, -93, 45, 208, 83, -29, -124, -80, 41, 209, 86, -84, -176, -12, 9, 167, 160, -73, -197, -96, -5, 89, 150, -54, -188, -36, -32, 103, 118, -43, -96, -110, 47, -15, 55, 41, -64, -153, -24, 69, 34, 3, -41, -115, -48, 61]
3305F1p6M5n4p0O0J2P2K1r0o8K5M0M6L5L1j04m5K3L1J26j00r3J3N2K2N1N3j01
3333A8j3j06L2O5J69j53j23N8JM9J89j12k58M9M1J74O9n2k23l6J00J51R2m2j96
3358e7q0P6R8J98l5k45j02j0K13J68l6j89k04J3K13J84pj88k11J5K13J97M0k35
3382B9k81J0K08K33J7k31k31k7K16K21J55k13l49J9J75K26J82j83m13q2K48L27
3404B56O3j93l22j55K19L28Q1q9l50j92J50L68J34j64l44j35J60K96K16o9l92
3425a34j50P2L18K19p3l58k19J08L31K30j45k35l21J22L26J74J2l16k98K3M26
3446A12K15j34j82l13L6L53K32m8k64k51l9L00L38o9k52k58o3J81M44rl25k95
3468b91O4K20K60L8k74l00l3L06K28j0k01k21r2K73K64N0k39k57l3K25K43L7k05
$$ y = [61, -15, 30, -24, -94, -34, -22, 50, 71, -19, -87, -62, -22, 24, 59, 90, -14, -59, -36, -5, 121, 21, -72, -59, -7, 15, 66, 119, 18, 5, -101, -69, -4, 165, 12, -111, -53, -52, -3, 186, 74, -184, -135, -94, 80, 149, 97, -126, -162, -62, 89, 181, 139, -57, -137, -61, 37, 235, 200, -45, -147, -157, 56, 224, 188, -1, -205, -192, 21, 205, 198, 10, -201, -186, 27, 224, 264, 29, -252, -242, -34, 199, 216, -15, -246, -273, -57, 164, 319, 106, -243, -224, -49, 177, 359, 176, -237, -319, -71, 256, 319, 126, -196, -351, -132, 196, 277, 188, -162, -354, -204, 164, 298, 134, -210, -345, -185, 111, 327, 258, -134, -284, -212, 106, 325, 252, -106, -325, -217, 114, 344, 199, -36, -357, -235, 91, 265, 277, -39, -337, -314, 112, 327, 193, 11, -302, -266, 87, 319, 271, 7, -244, -283, 17, 355, 286, 34, -224, -287, -106, 338, 329, 4, -291, -227, -7, 253, 291, 17, -283, -316, -10, 218, 208, 7, -214, -306, -33, 231, 281, 42, -215, -248, -23, 220, 257, 52]
3491E2k05r1K07K98Q5k97k14r0J25K99J65l03k79J4J03K31K39k60l16j3J60J94
3513A04J67j19l71n6K69Q4J26q0k83j57K42K38N8j00k12j94J96K58R6j88j68j67
3535b57R6L05J50k16k09o1L2K37J43p7l35RQ7J47J74l5k91j72J49K29O7K4k38
3558d2k43P9L16J14n6j98k19PL51J11q2j77j74QK80J96j25j53j31j14K54K47p9
3581A70j92q5p5J06K68O5k30k03JJ19J38J17j76k68kK62O2J1J0k23j48K87J12
3604A26j8J1j73k26J50K14K9o6m0j72k8K73J12r9l3j10j01J83J36q0j19l7k2N2
3628c8J87n2j11n2JL9J35O5j59n8j9K6N0Q2m1j66M5K7M1Q9K9j15m8O1L4l4R5o2
3656E1j39QQ3M7j5O9r9j16J48J8j7j8Mj01lJ58o1j5L5j04j15J46Q3L8m8n7j27
$$ y = [52, -153, -244, -37, 261, 346, 49, -165, -255, -130, 169, 334, 31, -248, -234, -131, 100, 339, 79, -237, -250, -90, 104, 271, 152, -219, -275, -6, 78, 204, 124, -159, -316, -74, 164, 222, 122, -90, -284, -88, 170, 266, 78, -90, -257, -161, 144, 294, 78, -131, -192, -160, 77, 220, 143, -192, -183, -96, 51, 225, 190, -101, -273, -124, 105, 172, 196, -42, -285, -206, 110, 224, 168, -30, -249, -242, 109, 220, 138, -39, -213, -205, 75, 271, 146, -7, -138, -252, 2, 249, 170, -22, -107, -182, -76, 192, 257, 27, -176, -175, -56, 82, 199, 23, -245, -247, 15, 77, 88, 98, -125, -273, 14, 126, 108, 119, -54, -280, -130, 84, 113, 47, 7, -165, -193, 80, 192, 93, 60, -50, -151, 32, 168, 88, -31, -68, -90, -38, 149, 97, -14, -66, -65, -26, 109, 174, 15, -43, -62, -36, 14, 96, 55, -111, -66, -39, 2, 91, 120, 5, -43, 18, 52, 18, 113, 51, -88, -80, 3, 50, 35, 104, 5, -111, 37, 55, 38, 20, 24, -77, -80, 78, 17, 2, 37, -67, -182, -36, 47, 85, 37, -20, -147]
3683a47Q0J50Lk0p0j11%J77J3K2j21q5OJ07J40n0j21o1m2P6J41j1j11m4k0P5R0
3710F6J69j73k02L7J54M7pn8r3j04J19J88j6m0r5j68P5K16%n0j77n5L2K49Qo9
3736E3r4q7J1K04J52j58j64j08R6J92J35j58j39j12L8K05J64j31j67j60J16J67
3758E5J39o0j66j91O3K32J40n9j91j55rJ97K45j07j81j77LK64K41m7k62j86RK32
3782B9K61n4j99j74o9K25K53Kk92k07N4J90J96J04l02k28o4K65K68M6k03l24k5
3805b48J98L12lk02k62r1K11L03P3k32k28q2J30K99J44k20l44m6J92K40J76j66
3827A54l14j05J26L20J79j90l20j55K11K70J17j14l08j75J44K80J43o5l21j14
3847b37mL52J79j29l01q9N6K37J97r6k22k52P4K92K34r6k46k45N1K57K09j8k20
$$ y = [-147, -67, 83, 86, 66, -4, -115, -115, 62, 75, 97, -24, -109, -103, 4, 144, 94, -27, -88, -130, -54, 87, 76, -35, -79, -99, -24, 66, 235, 62, -140, -103, 51, 98, 91, 33, -60, -164, -45, 143, 127, 87, -8, -176, -101, 115, 115, 65, -112, -167, -135, 114, 122, 53, -41, -128, -117, 87, 239, 81, -83, -191, -95, 97, 232, 74, -65, -177, -139, 66, 230, 99, -68, -228, -112, 55, 194, 134, -32, -223, -160, 72, 212, 153, -38, -193, -202, -5, 240, 133, -48, -225, -222, 42, 283, 236, -26, -212, -203, 29, 290, 236, 37, -137, -206, 19, 272, 274, -18, -225, -171, 19, 215, 319, 17, -211, -275, -10, 258, 304, 101, -223, -248, -50, 262, 259, 57, -205, -296, -85, 218, 291, 59, -169, -251, -121, 178, 322, 102, -242, -288, -96, 144, 320, 154, -160, -265, -139, 181, 360, 170, -150, -305, -94, 176, 293, 179, -129, -304, -160, 120, 263, 198, -123, -237, -241, 111, 290, 161, -140, -229, -173, 64, 261, 165, -57, -309, -235, 57, 291, 195, -51, -296, -245, 12, 221, 203, -17]
3870a7k01NK30K24m3j69k29KK19K00j0j78k19m2K04K24k9j02k09o1J85J85L1j99
3894Aj79k3J32K71q2r3j77m3P7K64L4j49j29n4J00J68J19j62j62q5J32K05N2j69
3918D8j36o5J13J73N5j75p6j04P2K24K8r0j12j12J01Q9R0n9j27q5J5K15N7n3r5
3943ip3m2J44J06k8j67m6P4N8R6l4j81RO3N5P1M0j32n3j9R4R4o1k7j57L1J29L6
3971G1k6l0r1oO0J11J9k7j88O0K0R5K4oj19m5M3J11Oj00mM2r1P2O6k8r1O0lJ6
4001B1M9n8K5n6L0l4LJ23mj34L8L1q6L3Q1p7k2N4m6J7M4j4m9K0j4m0O6L1n1l3
4031e2M4oJ9P7l6j13l6J20m2J16k6j15k7P2QO4J1q3r7O5J61m1m3n6o2n6J80P1
4059A17m4p7l4p0J03J07m5j10%q4P5J49Kj40n2Q5l6J43L3j28j20J8J39P3N0q0
$$ y = [-17, -218, -213, 17, 241, 198, 29, -200, -198, 21, 221, 211, 33, -186, -228, -24, 200, 171, 69, -140, -201, -16, 169, 200, 1, -178, -201, -69, 202, 120, 27, -150, -193, -116, 148, 182, 33, -96, -150, -50, 118, 237, 75, -87, -172, -40, 165, 217, 48, -88, -153, -40, 133, 188, 13, -63, -167, -95, 129, 157, 67, -45, -157, -56, 33, 123, 64, -63, -148, -133, 82, 139, 86, -9, -82, -124, 20, 126, 98, -69, -115, -41, 17, 113, 79, -102, -93, -30, 25, 96, 136, 4, -49, -68, 26, 120, 59, 32, -125, -94, 35, 71, 45, 15, -76, -82, -22, 89, 108, 81, -107, -47, -27, 68, 92, 86, -33, -78, -35, 76, 82, -18, -22, 20, -71, 1, 67, 39, -52, 8, 5, 21, 70, 12, 37, -19, 11, -23, -20, 103, 99, -35, 3, 34, -52, -19, 62, -15, -37, 17, -29, -12, 32, 18, -31, -11, -25, -65, 1, 32, -19, -52, -8, -14, 5, 82, 46, -67, -103, 17, -25, 91, 65, -50, -77, -5, 3, 67, 78, -5, -102, -37, 124, 83, 40, -16, -78, -134, 46, 117, 73, -4, -38, -108, -5, 102, 57, -53, -53, -137, -62, 87, 89, -51, -103, -18, -54, 89, 122, -6, -126, -108, 31, 104, 154, 74]
4085G4k56K8K23K7K9p3j71p4J97J60p0k1j02j63J39K21Pj59j07r5N5K41P7j84
4109Cj34j2Q5J45R2p8k30k5P0J45J44r8k80k2J82P9J55j15j97r7J42K03jn2k12
4134a08q4J51K11P2j50k35j19O3L86J21k00k32r4K9K40K50j60k86r1P5K40J65
4156B44k7l42j79P2K96J61kl24j71J28K21J75Ll01j98R3K15J95o5j94j57p1K94
4179F6K46r9j87k29r6L04K84m7k81j37p0J87L08M0l04k00rJ36L26L2k54k47l2
4202b63K80J48N5o0l77k7K16K00O1j09k89j11K15K23P6j70k09q0J10K52J34j85
4224I0j95j29Q5K99J65k73j90j2QK39J77j37k66l0N0J54K17o9l06j15O8K22J24
4247A76J0k05j67J7K61P7nj88j99P3K19Q0P4k42r3k5J83J56r1q8j36m6J52J54
$$ y = [74, -182, -154, 69, 96, 125, 52, -119, -193, 4, 164, 94, 73, -29, -192, -53, 168, 175, 16, -91, -186, -131, 110, 187, 3, -131, -143, -58, 87, 179, 101, -129, -154, -84, 61, 205, 107, -173, -195, -13, 66, 221, 106, -91, -188, -46, 157, 156, 104, -108, -192, -41, 170, 242, 92, -143, -262, -199, 187, 308, 108, -124, -218, -189, 51, 301, 141, -145, -236, -161, 79, 244, 217, -125, -304, -232, 64, 225, 223, -101, -272, -144, 77, 252, 255, -46, -244, -151, 64, 259, 194, 0, -157, -228, 66, 312, 213, 26, -203, -299, 5, 289, 242, -39, -176, -246, -59, 249, 289, -15, -215, -224, -88, 238, 270, 16, -231, -263, 17, 165, 220, 160, -217, -244, -28, 172, 233, 124, -165, -276, -61, 162, 238, 68, -141, -221, -111, 141, 275, 90, -105, -234, -149, 150, 315, 42, -148, -160, -152, 87, 264, 127, -139, -169, -119, 35, 252, 183, -123, -238, -170, 52, 176, 186, -19, -186, -169, 92, 169, 164, -24, -223, -150, 69, 149, 223, -19, -112, -137, 46, 202, 111, 23, -113, -159, -7, 147]
4271A47j1j66j7r0O0J35O7j25j32j0P4J52P6j15j52j3J01J29K0q3j49l8J40P0
4295G0O9r5j03o1J48R9l0q3n7j6OP9O1o7l4l6M4M9K4n3r9L5J27Jn8l9p7L9j1R2
4325B4l0L5n5j1l9R9m4M3j8l0J5N4K5n4k9N6j34N7O9mJ2n7kmM9l4%K7lp1Q6OL6
4358G4j1J5j36L7M3m2N3%p7nJN6R1o5n7rrJ03LKp2p3J2O4M4K1o1j01P2Q6J07o9
4390I7j09p8L4R8R6m8j12q3K5J03Q7L1j57q3l0R7J57l8r0j37m2J47J60K0j18j63
4416a36o1J37K72q7n9j35q1R1J80Q2q8j90n2J4K29J05j60j27j47Q2K79R1j86j05
4440e2j60R4K54M5j18j64p6L1J86J54j32q9j80R4J41J93q8j94j31k5K49J98o8
4463A62j81j80LK45J78j2k39k20J24J51K06j5k72r8r4J94K62P5l11j89N1J09K12
$$ y = [147, 136, -30, -47, -137, -77, 58, 125, 0, -132, -142, -68, 84, 160, 45, -107, -120, -19, 110, 130, 47, -102, -140, 0, 70, 139, 44, -59, -120, 28, 127, 97, 14, -43, -59, -53, 26, 87, 20, -14, -50, -6, 43, 67, 14, -85, -50, 77, 78, 20, -19, -96, -57, -68, 24, -6, 29, -26, -37, -76, 23, -21, 22, 4, -26, -11, 43, 68, 14, -15, 41, -93, -36, 33, 29, 41, -16, -18, -22, 27, -7, -7, 20, 17, -54, 32, 38, 74, 63, 78, -58, -21, 22, -20, 33, 33, -44, -49, -48, 8, 99, 34, -23, -32, -41, 62, 65, 67, -5, -78, -66, -2, 42, 63, 2, -99, -27, 59, 166, 97, -12, -90, -56, 42, 138, 90, -22, -105, -80, 23, 110, 141, -16, -99, -129, -32, 125, 87, -3, -140, -182, -35, 125, 145, 27, -136, -197, -60, 212, 125, 66, -69, -150, -59, 121, 203, 115, -75, -127, -113, 116, 221, 61, -66, -213, -131, 148, 239, 53, -52, -212, -118, 136, 181, 63, -101, -177, -146, 40, 194, 62, -27, -207, -113, 28, 221, 133, -61, -192, -217, 32, 230, 162, -19, -199, -196, 49, 227, 215, -24, -244, -120, 31, 237, 222, -50, -148, -242, -48, 214, 289, -22, -211, -160, -51, 161]
4486A61O4k90r1l0J50J29J76j97k74j7J69J55J11j91k02n3J38J98Q4j11k23k5
4508a69J53J57R1j18k26o3J08J52J08m9l03m4J74J40J01r8k79j6J09K15k1j8j84
4531h0j30J34J68P8j27j09j78J32K29J8m6j89j56K22J21J04j34j40r4N9J97J12
4553A91r0j71q3L1J29K42j60j52r8N7J90J20q6j92j20Q9J25J18l9j00j75J8K06
4576E0O0qj48j12l7K37Q4m3j38p8NK35J44j17j98n9k6J14K33r0j64o8K6J24J70
4601A96qj89r2M5L4J22K6j36j33Q7%J77Lj09j50K7J59Q7m1o2j47N1L3J84l1j24
4627Ij29l5R9J64Jo5r4l2O3J19J13j53j41M2L0jO3L7j12n6J40K4M9n7j34mP4m7
4655c3N8Lm2r2Q6O2Jj4r4PM4N6MN1j19j3l8M8P0o8K1J5K6l1k4K0n%P0r0K5K6l7
$$ y = [161, 225, -65, -156, -186, -36, 93, 269, 72, -202, -219, -50, 105, 216, 25, -177, -230, -92, 106, 190, 79, -144, -169, -16, 141, 232, 114, -112, -175, -67, 85, 193, 144, -159, -203, -29, 111, 212, 114, -165, -181, -72, 143, 122, 104, -80, -210, -76, 92, 170, 43, -66, -244, -112, 117, 135, 89, -100, -256, -34, 87, 191, 57, -83, -177, -118, 79, 191, 101, -70, -153, -122, 7, 249, 89, -63, -161, -104, 86, 206, 120, -72, -192, -103, 22, 140, 101, 1, -174, -156, 50, 110, 102, -46, -158, -195, 42, 126, 83, -55, -133, -128, 107, 251, 134, -64, -123, -149, -35, 198, 108, -56, -124, -98, 26, 196, 188, -1, -93, -48, -14, 108, 134, -2, -135, -48, -48, 129, 132, 23, -127, -100, 59, 146, 105, 43, -104, -53, -20, 164, 133, 9, -120, -155, -56, 108, 109, 44, -50, -82, -19, 100, 213, 60, -81, -39, -9, -10, 53, 90, -22, -78, 62, 86, 135, 78, -56, -60, 14, -33, 25, 28, -14, -106, -20, 42, 43, 29, -65, -58, -14, 42, 46, 97, -22, -35, -73, -25, 45, -23, -2, 13, 39, 8, -16, 4, -1, -1, 69, -21, 4, 30, -7]
4688gL4k5L2r2Q8k9J0N0n4j8m1P6Nl6L4k1p4K5P5k2L6o2q8R1PM3Q1j87JJ5J43
4719I0no2o6jj9J23J8kj29m4J06P1J9p3j08L1M9L7O9l7j04j26J45J24Kp0p5p0
4747a07N3J41mm7r5k9nJ28M3n4j28j6K3R0Q8nj12j16J03M0J56Rk08n5j4J31J32
4774A42j9r2r2K0O2J03j6j18j58N1J09R8k2j24r5K3J70J48n3j38r3p2J39J70o0
4799H3m0j52K3O3J28K9j33j23p8J57J95K7j55j06m8J06J12L7n0j87PJ36O5J3q
4824A01j54j55J48J38K5k1k09r6J96J25O0q7j54k5jK02Ok0j58n6L9J77J05j60
4848B6p4q9N4J82k6L0j17j28R5R0J44r5j21r2kJ83Q9q3p2j44L7J65J47j38j35
4873g4l0k0J29J24j5j37j25QJ68O8k5q2o1lP2J40m8j50n1j0J06J36l1q9q0l3J49
$$ y = [-7, 27, 2, 34, -58, 30, 1, 11, 61, 7, -11, -52, 24, 29, -7, 27, 6, -68, -43, 32, 10, 46, -16, -104, -13, -6, 37, 118, -69, -68, -53, 90, 85, 23, -43, -44, -63, 60, 78, 76, -53, -97, 9, 80, 99, 26, -82, -51, -2, 35, 104, 67, -37, -163, -18, 106, 108, 38, -37, -107, -54, 87, 83, 36, -59, -88, -93, 35, 78, 24, -104, -120, -97, -7, 81, 76, -36, -152, -49, -9, 147, 156, -52, -107, -121, 10, 142, 123, 31, -61, -41, 21, 124, 108, -10, -168, -117, -8, 90, 68, -56, -151, -128, 42, 190, 137, -1, -94, -166, -27, 143, 83, 43, -109, -86, -23, 105, 134, 1, -122, -200, -43, 152, 179, 24, -82, -130, -24, 88, 125, 75, -112, -105, 31, 96, 109, 101, -53, -208, -60, 78, 103, 82, -127, -223, -27, 98, 158, 71, -83, -108, -109, 93, 99, 79, -79, -135, -96, 81, 186, 26, -48, -137, -83, 99, 73, 103, -14, -142, -47, 43, 187, 92, -29, -121, -123, 60, 149, 66, -6, -150, -113, 52, 199, 61, -74, -104, -124, 5, 129, 114, -23, -148, -140, 28, 96, 71, -11, -72, -75, -3, 137, 89, -61, -112, -122, -16, 120, 89, 0, -80, -113, 36]
4900C6L7K1j09m4oJ24L7M5j19j65M2O1J66l8r3r6J7J19O5l1j31j7l3Q7J32j9j14
4927b6m8NQ3N5M5r2j00k7J48pJ23j06j46J8P1P4P2m2k03N4L6P1O3j36nj14Q6J44
4955I6J0n5o4q9R5J04k4p6p7L6Lj5J20l7q3j6JQ2Q5j22L3q3j3J50N2j26L8m7O
4984a6O9J4n7Kp4L7N9K7Ko8l5N5L0k5Pq4kO8J0Jo1K3j1l6R7o4J09r3k4J4J2O3
5016D9r4O3m2l9J07j12P1n1M4mJ8M2m0qJ3pPPk1m3L2N7l3mOp3qJ00m4k2Nm1K7
5049c8J4K6K3l5o2J5N7N8r2Km9L6P2K3o2M1p0J5P5k2o9rN6K7k1Q6p2Qr1J6K4N0
5081C2no1L9j5L6M7r7m3J8J9N2P1r5p3K4P4k8K0k0m9j7N4K0J23j02p6jJ8O7j4
5111A8J9l3l7N7J7k5j5J8q3jQ2J22j13j1n4J5L2R9p1j03k1M6M8K5p6%l2J5J08
$$ y = [36, 73, 94, -15, -59, -65, 59, 96, 141, 22, -143, -101, -40, 126, 88, -5, -101, -84, 35, 100, 69, -62, -79, -112, -25, 107, 88, -26, -74, -69, 14, 69, 114, 22, -78, -105, 43, 36, 159, 53, -93, -75, -4, 70, 142, 100, -103, -49, -13, 58, 121, -15, -20, -134, -48, 96, 106, 51, -13, -102, -7, 97, 73, -3, -80, -44, -41, -56, 64, 27, -56, -72, -71, 11, 96, -26, 7, -76, -89, 61, 113, -13, 25, -22, -16, 53, 67, 10, 12, -62, -25, 34, 61, 63, -5, -40, 15, 45, 20, 27, -57, -59, 9, 19, 20, -41, -18, -29, -65, 32, -32, 77, -16, -40, -26, -14, 49, -45, 18, -24, -63, 44, -68, 3, -48, -4, -8, 10, 52, 12, 4, 17, 10, 17, 24, 3, -40, -8, 49, 16, 12, 18, -55, -63, 37, -7, -29, -24, -65, -38, -24, 2, 25, -10, -72, -57, 0, 58, -34, -32, -81, -45, 27, 50, -12, 29, -41, -26, 49, 27, -42, -51, 5, 32, 11, 97, 25, 33, -58, -42, -18, 32, 27, -34, 5, -10, 26, 73, -24, -67, -49, -30, 22, 93, -2, -75, -51, 23, -5, 15, -5, -54, -71, -17, 3, 126, 24, -52, -53, -35, 32, 18, 37, 4, -33, 24, 41, 16, 1, 19, -64, -65, 17, 139, 26, 15, -39, -24, 8, 107, 36, -67, -88, -42, 6, 31, -45, -45, -77, -62, 46]
5140D6m6rk2q4O3P0J3MJr9J4Q0N7r0j8k1j3J06l3J8r4m3O5O8J02j01q9p9P6Q5
5170B7L6k5j41J0L8O4M8Lj16j02Q3J36P3m4r8p0qO6J06k5p8j47J05P5J25q1p6
5197a6m0l8Q9O2M9j33q2j4J28J62l8r7j28K9J9J01L6q9q2n7J33J07nr4j08l3J35
5224dP6N3p3j15j13J16J58j0m6q1p0L5J20J23o7k06p4J23R4J03n8j24p4L9J21
5249D6O2m9o2r0M2Q0K7k7p4n4K1J42K6j5j12l5J3J20K6m9Nj60N4M9L9P2l6j54
5277i3OQ2J02J2j12r9N5Q6O0Lj02p5J7R9K8K9q2o8lP7j8N0Pj79M3J7J18k9j03
5306g2K1J8L5k5P8Lj11k2N5L2O0r3mLJ4N0j9Oj17R5l5P5N7j14OOM2nK2n0n4L5
5338hJ5K9l8l7pO5o0M2J1j0j03P3K8L0n2%J8k4NJ3M2l3k1L9k2M3l0Nl7j1L8lL9
$$ y = [46, 0, -9, -31, -115, -52, 18, 31, 35, 36, -63, -49, 31, 88, -2, -20, -41, -54, 52, 19, 37, -57, -100, -35, 33, 135, 34, -55, -134, -58, 27, 63, 38, -103, -93, -55, 9, 57, 60, -56, -158, -75, 61, 134, 90, -8, -78, -86, -20, 86, 61, -17, -164, -59, 16, 141, 60, -16, -56, -94, -5, 57, 106, -27, -109, -123, 5, 167, 129, 32, -96, -67, -48, 53, 89, 0, -82, -139, -6, 101, 96, 2, -106, -139, -4, 72, 125, 52, -63, -176, -60, 98, 88, 42, -39, -109, -74, 46, 169, 102, -104, -178, -55, 39, 142, 84, -40, -114, -75, 46, 108, 59, -3, -93, -51, 29, 56, 29, -45, -99, -78, 64, 90, 75, -37, -72, -59, 61, 87, 38, 43, -117, -63, -14, 25, 97, 61, -93, -87, -5, 97, 109, -3, -102, -47, 39, 99, 102, 0, -75, -58, 41, 69, 98, 16, -52, -55, 22, 4, 54, 61, -118, -75, -58, 60, 31, -72, -51, -33, 2, -23, 55, 58, -53, -75, -20, 12, 72, -21, -25, -22, -8, 42, 23, 29, -88, 7, -28, 47, 104, -10, -4, 2, 44, 39, 61, 11, -43, -8, 7, 36, -2, -39, -46, 19, -41, 1, 12, 2, -101, -28, 0, 30, -22, -22, -4, -28, -23, -10, 32, -1, -22, 17, -5, 38, 8, 13, -24, -35, 3, 0, 39]
5371C9kq2K3K2L8l1rJ6okPLLKn9N4M4j05J5L7j6j2L3mn9M3k5L9l3K2q0J38j02
5404d9P5K8j06j9N6P3j7k0J4Llp4M4K7J5n6j1J4M5L4q5Kl4O6J6L0o8l6J4j1J07
5435G4q0j2qJ7L7N6m3k8o7j2J11P2r1n8n9L4N5N5k0n4o3Q2L2%P1q0j03K4J15j9
5465C8N6o9r3j2R6R1K5j74J9l0J6R7k9rj04PN3R0j1o1p7j4O6P4M9o3r4MJ1J11
5495F3J7m3p1k1N7O5Q8j05k7j70J26L9N0l6n2o2O5M5O4M0j77k6L5L9L8m5oo6M7
5524b9N2N5k2n5j07J9R1O5K1j14q0K7Q5J8K9p2r4J8R6N1K1j06m4J8Q1RNj2p5j3
5554f2O8O8o4L7p3oRO2Kj08L5o3J30J9MLq8k8O9K8L4k4j10MN1M7L0o6m4m8N4O2
5586C2j1K0j16j0R5L6m2j5k9l9J19MK3p9k4kJ5R6l8rm1o5Q9L9K7j1j29k9Q7K5
$$ y = [39, 37, -45, -22, 0, 38, 7, -2, 14, 8, 6, 13, 16, 19, 21, -38, 16, 60, -45, -30, 7, -9, -21, 12, 8, -51, -8, -33, 6, -27, -5, -85, 53, -49, 26, 54, -52, -71, -15, 58, 41, 21, 35, 38, 35, -39, 5, 32, 47, -9, -20, -6, 39, 73, -12, -10, -44, 22, 38, 68, 0, -36, -22, -33, 74, -6, -18, -26, -9, 28, 84, 41, 13, -54, -66, 45, 117, 26, -32, -91, -57, -2, 53, 33, -21, -84, -2, 30, 30, 101, 21, -82, -58, 57, 38, 94, 25, -68, -80, 16, 107, 132, -42, -23, -53, -37, 60, 31, 22, -82, -75, -22, 68, 57, -4, -81, -95, -29, 45, 94, 31, -63, -59, -48, 63, 80, 37, -34, -55, 2, 67, 155, 50, 23, -147, -21, 18, 68, 32, -20, -82, -17, 28, 92, 132, -45, -71, -36, 3, 41, -4, -10, -76, -29, 23, 78, 56, 1, -106, -87, 4, 69, 90, -24, -104, -77, 8, 26, 55, -17, -111, -93, 3, 54, 75, -31, -75, -57, 24, 33, 38, 26, -49, -62, 6, 74, 10, 47, -26, -32, -23, 39, 41, -67, -32, -95, 35, 54, 58, 61, -27, -55, 14, 42, 76, 52, -58, -54, -3, 44, 74, 8, -36, -84, -30, 32, 21, 41, -75, -85, 10, 46, 4, -11, -40, -79, 40, 44, 67, -12, -36, -38, -23, 73, 35, 26, -15, -80, 9, 48, 75, 64, -65, -94, -7, 18]
5616A8L9o7J0Ql5M6N5j8n8k0L7PK4M5j18k7J07l3O8k4r2l8M6N1L7m0q5J1L1K4
5646Ioj1j2Lk5J3M9j2l2qK8qK9Jk1mMJ3J6q0O9p8L4J3m8P3LJjj3M4m2Om4J4L9
5682A6k6j4L5nqM3l9K9m6kL3J0K1n9Rl3R0l2m7q%nM6K2K1p9J4J8K1jJ5m8k8O7
5716C0m9K7mO2j03M7j1J2MK7p6jR4l6m4nK8k1j7K9k6Ooj9L6Q7q0kK3l5%nK1j1
5750a8L4jJ5l0%LJ2o0O1j5Jj5k4K0LO3m3n2m0N7N4J7n5PMJ5J0N3j19K3NK1N7m9
5784A4j1j8K0n1N4lJ0l5mj7P2k7K9n4N4o3K4L6k9K4o6R4LOm9l1Rk2O3M7k6p2J0
5817ij5M2KJn3l1k1P1K8j3l2k0PN2J4Mk7l8O1k2J15j15Lm8m2J13N2p5j7k2N0K1
5849C6JL2n3o9N5M3l7M8m6m0L5n2R4kk0Ko2m5P7P7j13qL4M1nm5M4k5o6R7j1NP
$$ y = [18, 57, -10, 0, 8, -27, 19, 74, 56, -2, -22, 15, 22, 46, 91, -27, -54, 53, 20, 88, 64, -28, -66, -20, 31, 68, 28, -57, -46, -15, 9, 3, -8, -20, -17, -42, -29, 20, 8, -24, -32, -4, -12, 17, 18, -3, -7, -3, 10, 26, -54, 15, -63, -29, -16, -64, 9, 12, 13, 12, -1, 43, 1, 7, -37, -23, 16, -10, -24, 11, 6, -2, 41, 2, 31, -15, -17, 16, 26, 47, -12, -3, -36, 54, 22, -25, -33, -33, -38, 8, 30, 51, -28, -14, 4, 25, 24, 39, -9, -37, 30, -19, 8, 4, 66, -37, 10, -1, 11, 15, 42, -34, -35, 59, 23, -21, -26, 2, -19, -36, -7, -33, -27, -33, -52, -16, 71, -9, -11, 12, -23, -23, -28, -7, -18, 16, 15, 30, 0, 0, 3, 15, -45, 16, 1, 2, -13, -37, -17, -14, 49, 6, -46, -86, -29, 25, 42, -13, -6, -2, 13, 23, 76, -43, -20, -15, 6, 63, 14, 3, -15, 5, -46, 8, 5, 15, -20, -24, -41, 31, 4, 33, -21, 33, -30, -6, 30, 1, 25, -41, 53, 56, 62, 13, -18, -9, -31, 32, 79, 53, -19, -9, -24, 18, 20, 21, -32, -63, -84, -13, 15, 2, -30, -50, -43, 9, 23, 27, 0, -38, 23, 1, 116, 1, 4, -44, -86, 27, 79, 4, -13, -35, 15, 36, 37, 69, 16, -53, 2, 45, 8, 56, 10, -30, 5, -47, 47, 45, 25, 27, -35, -80, -3, 74, -39, -47, -13, 28, 23, -22, 22, -3, -69, 28, 17, 22, 29]
5882B9l4k0K0J8N1o4K1o4m8J16L8o1o1L6N1M1Qr9l4P5O3o3Q7r6m1J9J8K4j1n3
5912c4l6O6j2J6rPmMk0QR8o5ll0J0N1M0o3J9k5OJ0M9r2J1jrM5m3K4m9M0J6j0J0
5947B5q5N0K6n1j1J7N3m7J7j3R6m0l0l6j9K6J9M0j6k2n3M4P6l8p7M0mM3j5J5k1
5978In2M7J0K3K7j2p4L1J0J9k3K1m0o0R7k9j1jl1Nj8L7M0j3j1o2M7nQ7r3J6K3
6010A4k4L2L9l4k3p3J02pm9J9M8J1j13Q3Lrm9nQ0r5P4KKn4j6J7QK8m8K0jjJ3j1
$$ y = [29, -5, -25, -5, 13, 64, 0, 21, -43, -91, 25, 63, 2, -59, -23, 28, 69, 77, -22, -56, 19, 82, 19, 106, 10, -31, -12, 6, 30, 19, -34, -70, -4, -16, 0, -9, -2, -6, -2, -22, -14, 84, 19, 16, -14, -4, 47, 87, 24, 43, 18, 24, 34, 83, -9, 2, 1, -8, 37, -6, 18, -31, 9, 25, 15, 25, -60, -10, 16, -35, -46, -29, 24, -23, -6, -19, 77, 37, 7, -29, -48, -22, -3, 37, 21, -1, -54, -10, 66, 28, -49, -9, -13, 30, 15, 30, 9, -43, 4, 14, 37, 64, 52, -22, 9, 19, 38, 15, 36, -4, -64, 33, 4, -7, -8, -39, -34, -52, -15, 25, 12, 1, -61, -14, -19, 68, -25, -9, 14, -10, 22, 61, 27, 4, -69, 33, 26, -23, -4, 44, 55, -58, 25, 28, 19, -30, -35, 45, -50, 24, 26, 28, -26, -42, -25, -17, 11, -37, -17, -18, -19, -6, -17]
$$ [...]
8191I
##END NTUPLES=NMR FID
##END=
