##TITLE=1H_E3d-3c
 CDCl3
 8 sc, 
 2.4.2024
##JCAMPDX= 6.0         $$ Bruker NMR JCAMP-DX V2.0
##DATA TYPE= NMR FID
##DATA CLASS= NTUPLES
##ORIGIN= UXNMR, Bruker Analytische Messtechnik GmbH
##OWNER= root
$$ XWIN-NMR		Version 3.5
$$ Tue Apr  2 14:12:48 2024 Russian Standard Time (UT+4h)  she@DPX200
##.OBSERVE FREQUENCY= 200.1311
##.OBSERVE NUCLEUS= ^1H
##.DELAY= (6, 6)
##.ACQUISITION MODE= SIMULTANEOUS
##.ACQUISITION SCHEME= undefined
##.AVERAGES= 8
##.DIGITISER RES= 18
##SPECTROMETER/DATA SYSTEM= spect
##.PULSE SEQUENCE= zg30
##.SOLVENT NAME= MeOD
##.SHIFT REFERENCE= (INTERNAL, MeOD, 0, 15.7039)
##AUDIT TRAIL= $$ (NUMBER, WHEN, WHO, WHERE, WHAT)
$$ ##TITLE= Audit trail, XWIN-NMR		Version 3.5
$$ ##JCAMPDX= 5.01
$$ ##ORIGIN= Bruker BioSpin GmbH
$$ ##OWNER= she
$$ F:/spectra/data/she/nmr/H-F/1/audita.txt
$$ ##AUDIT TRAIL=  $$ (NUMBER, WHEN, WHO, WHERE, WHAT)
(   1,<2024-04-02 14:11:12.60 +0400>,<she>,<DPX200>,
      <created by zg, POWCHK disabled, PULCHK disabled
       configuration hash MD5:
       00 E9 B6 7A A2 85 ED C7 34 08 36 98 17 FE 4E 26
       data hash MD5: 16K
       85 1C 73 17 CA 1A 0B 76 C7 38 8D 8B 03 76 DC CF>)
$$ ##END=
$$ 
$$ hash MD5
$$ 7B 88 FA 5E 4B 05 75 9F 13 17 5D CF 68 03 46 82
##$RELAX= 
##$RELAX= 
##$RELAX= 
##$RELAX= 
##$RELAX= 
##$RELAX= 
$$ Bruker specific parameters
$$ --------------------------
##$DU= <F:/spectra>
##$EXPNO= 1
##$NAME= <H-F>
##$PROCNO= 1
##$TYPE= <nmr>
##$USER= <she>
##$AMP= (0..31)
100 100 100 100 100 100 100 100 100 100 100 100 100 100 100 100 100 100 
100 100 100 100 100 100 100 100 100 100 100 100 100 100 
##$AQSEQ= 0
##$AQ_mod= 1
##$AUNM= <au_zg>
##$AUTOPOS= <>
##$BF1= 200.13
##$BF2= 200.13
##$BF3= 200.13
##$BF4= 200.13
##$BF5= 200.13
##$BF6= 200.13
##$BF7= 200.13
##$BF8= 200.13
##$BYTORDA= 1
##$CFDGTYP= 0
##$CFRGTYP= 5
##$CHEMSTR= <none>
##$CNST= (0..31)
1 1 145 1 1 1 1 1 1 1 1 1 1 1 1 1 1 1 1 1 1 1 1 1 1 1 1 1 1 1 1 1 
##$CPDPRG= <>
##$CPDPRG1= <>
##$CPDPRG2= <>
##$CPDPRG3= <>
##$CPDPRG4= <mlev>
##$CPDPRG5= <mlev>
##$CPDPRG6= <mlev>
##$CPDPRG7= <mlev>
##$CPDPRG8= <mlev>
##$CPDPRGB= <>
##$CPDPRGT= <>
##$D= (0..31)
0 1.2 0 0 0 0 0 0 0 0.06 0 0.03 0 0 0 0 0.0002 0 0 0 0 0 0 0 0 0 0 0 0 
0 0 0 
##$DATE= 1712052672
##$DBL= (0..7)
120 120 120 120 120 120 120 120 
##$DBP= (0..7)
150 150 150 150 150 150 150 150 
##$DBP07= 0
##$DBPNAM0= <>
##$DBPNAM1= <>
##$DBPNAM2= <>
##$DBPNAM3= <>
##$DBPNAM4= <>
##$DBPNAM5= <>
##$DBPNAM6= <>
##$DBPNAM7= <>
##$DBPOAL= (0..7)
0.5 0.5 0.5 0.5 0.5 0.5 0.5 0.5 
##$DBPOFFS= (0..7)
0 0 0 0 0 0 0 0 
##$DE= 6
##$DECBNUC= <off>
##$DECIM= 32
##$DECNUC= <off>
##$DECSTAT= 4
##$DIGMOD= 1
##$DIGTYP= 9
##$DL= (0..7)
0 120 120 120 120 120 120 120 
##$DP= (0..7)
150 150 150 150 150 150 150 150 
##$DP07= 0
##$DPNAME0= <>
##$DPNAME1= <>
##$DPNAME2= <>
##$DPNAME3= <>
##$DPNAME4= <>
##$DPNAME5= <>
##$DPNAME6= <>
##$DPNAME7= <>
##$DPOAL= (0..7)
0.5 0.5 0.5 0.5 0.5 0.5 0.5 0.5 
##$DPOFFS= (0..7)
0 0 0 0 0 0 0 0 
##$DQDMODE= 0
##$DR= 18
##$DS= 0
##$DSLIST= <SSSSSSSSSSSSSSS>
##$DSPFIRM= 0
$$ [...]
##$SUBNAM2= <"">
##$SUBNAM3= <"">
##$SUBNAM4= <"">
##$SUBNAM5= <"">
##$SUBNAM6= <"">
##$SUBNAM7= <"">
##$SUBNAM8= <"">
##$SUBNAM9= <"">
##$SW= 18.051750892319
##$SWIBOX= (0..15)
0 0 2 0 0 0 0 0 0 0 0 0 0 0 0 0 
##$SW_h= 3612.71676300578
##$TD= 16384
##$TD0= 1
##$TE= 0
##$TE2= 300
##$TE3= 300
##$TEG= 300
##$TL= (0..7)
0 120 120 120 120 120 120 120 
##$TP= (0..7)
150 150 150 150 150 150 150 150 
##$TP07= 0
##$TPNAME0= <>
##$TPNAME1= <>
##$TPNAME2= <>
##$TPNAME3= <>
##$TPNAME4= <>
##$TPNAME5= <>
##$TPNAME6= <>
##$TPNAME7= <>
##$TPOAL= (0..7)
0.5 0.5 0.5 0.5 0.5 0.5 0.5 0.5 
##$TPOFFS= (0..7)
0 0 0 0 0 0 0 0 
##$TUNHIN= 0
##$TUNHOUT= 0
##$TUNXOUT= 0
##$USERA1= <user>
##$USERA2= <user>
##$USERA3= <user>
##$USERA4= <user>
##$USERA5= <user>
##$V9= 5
##$VALIST= <valist>
##$VCLIST= <CCCCCCCCCCCCCCC>
##$VD= 0
##$VDLIST= <DDDDDDDDDDDDDDD>
##$VPLIST= <PPPPPPPPPPPPPPP>
##$VTLIST= <TTTTTTTTTTTTTTT>
##$WBST= 1024
##$WBSW= 4
##$XGAIN= (0..3)
0 0 0 0 
##$XL= 0
##$YL= 0
##$YMAX_a= 189967
##$YMIN_a= -137299
##$ZGOPTNS= <>
##$ZL1= 120
##$ZL2= 120
##$ZL3= 120
##$ZL4= 120
##$ABSF1= 10
##$ABSF2= 0
##$ABSG= 5
##$ABSL= 3
##$ALPHA= 0
##$AQORDER= 0
##$ASSFAC= 0
##$ASSFACI= 0
##$ASSFACX= 0
##$ASSWID= 0
##$AUNMP= <proc_1d>
##$AZFE= 0.1
##$AZFW= 0.1
##$BCFW= 1
##$BC_mod= 2
##$BYTORDP= 1
##$COROFFS= 0
##$CY= 11.3945322036743
##$DATMOD= 1
##$DC= 2
##$DFILT= <>
##$DTYPP= 0
##$F1P= 15.7292609196834
##$F2P= 12.9074282941183
##$FCOR= 0.5
##$FTSIZE= 0
##$FT_mod= 4
##$GAMMA= 1
##$GB= 0.15
##$INTBC= 1
##$INTSCL= 1
##$ISEN= 128
##$LB= 0.24
##$LEV0= 0
##$LPBIN= 0
##$MAXI= 10000
##$MC2= 0
##$MEAN= 0
##$ME_mod= 0
##$MI= 1.114404
##$NCOEF= 0
##$NC_proc= 0
##$NLEV= 6
##$NOISF1= 3.799351
##$NOISF2= 2.8
##$NSP= 1
##$NTH_PI= 0
##$NZP= 0
##$OFFSET= 15.70392
##$PC= 1
##$PHC0= -25457.95
##$PHC1= 10.98731
##$PH_mod= 1
##$PKNL= yes
##$PPARMOD= 0
##$PSCAL= 0
##$PSIGN= 0
##$REVERSE= no
##$SF= 200.130013532006
##$SI= 16384
##$SIGF1= 3
##$SIGF2= 2
##$SINO= 400
##$SIOLD= 16384
##$SREGLST= <1H.CDCl3>
##$SSB= 0
##$STSI= 0
##$STSR= 0
##$SW_p= 3612.71676300578
##$SYMM= 0
##$S_DEV= 0
##$TDeff= 0
##$TDoff= 0
##$TI= <>
##$TILT= no
##$TM1= 0
##$TM2= 0
##$TOPLEV= 0
##$USERP1= <user>
##$USERP2= <user>
##$USERP3= <user>
##$USERP4= <user>
##$USERP5= <user>
##$WDW= 1
##$XDIM= 8192
##$YMAX_p= 0
##$YMIN_p= 0
$$ End of Bruker specific parameters
$$ ---------------------------------
##NTUPLES= NMR FID
##VAR_NAME=  TIME,          FID/REAL,        FID/IMAG
##SYMBOL=    X,             R,               I
##VAR_TYPE=  INDEPENDENT,   DEPENDENT,       DEPENDENT
##VAR_FORM=  AFFN,          ASDF,            ASDF
##VAR_DIM=   8192,          8192,            8192
##UNITS=     SECONDS,       ARBITRARY UNITS, ARBITRARY UNITS
##FACTOR=    0.0002768,     1,               1
##FIRST=     0,             0,               0
##LAST=      2.2672688,     0,               0
##MIN=       0,             -137299,         0
##MAX=       2.2672688,     189967,          0
$$ Real data points
##PAGE= N=1
##DATA TABLE= (X++(R..R)), XYDATA
0 0 0 0 0 0 0 0 0 0 0 0 0 0 0 0 0 0 8 -8 8 -8 8 -16 16 -20 24 -26 32 -39 44 -52 60 -69 78 -90 102 -116 132
37 132 -148 166 -187 210 -234 260 -290 321 -355 393 -433 480 -528 582 -643 706 -776 855 -941
56 -941 1034 -1142 1262 -1396 1548 -1726 1925 -2157 2425 -2723 3020 -3152 2227 6390 189967
71 189967 -43673 -14737 -41920 -46964 181179 -113552 -47935 69330 1633 36724 -104508
82 -104508 15757 86223 -28981 -19362 -51003 69331 4984 -49260 36080 -22506 32369 -35662
94 -35662 -19120 82793 -54592 -8750 6231 14054 31789 -73752 25079 40886 -10521 -34677
106 -34677 -31879 90269 -12454 -51013 -11310 17381 89123 -94615 -32464 72733 -9990
117 -9990 31820 -98438 27684 104507 -93008 11032 -23188 38796 60009 -130016 51691
128 51691 31557 -20422 22949 -83368 77446 16345 -69696 41253 -23017 40179 -16655
139 -16655 -46990 63764 -18595 -4375 -11658 2872 40515 -48726 7284 13778 4813 1394 -46784
152 -46784 47194 8876 -30175 1342 -9221 48496 -26572 -33986 34015 5679 9583 -42466
164 -42466 8298 42877 -24119 -7010 -22112 40378 12726 -55481 26903 -4038 22166 -8436
176 -8436 -50571 63919 -15268 -14422 10870 -28888 57604 -32918 -22910 41292 -26135 25338
188 25338 -25411 -7174 42080 -37466 11534 -3247 -88 19154 -36133 22870 2768 -9949
200 -9949 8566 -19723 28530 -9728 -14940 17505 -9842 15778 -17699 -3505 22750 -16419
212 -16419 5035 -10123 7718 12540 -23127 9941 -1756 6398 -28 -17449 20181 -6925 1642
225 1642 -416 -10586 22833 -16784 2091 6201 -12410 19901 -18652 4252 9392 -16756 19037
238 19037 -15394 2845 10305 -16781 18032 -13191 1265 11987 -15553 13662 -10519 3220
250 3220 10446 -17485 11953 -5129 2329 4478 -15868 15189 -3435 -3635 2322 -7168 15228 -9595
264 -9595 -4883 8629 -2709 6454 -12630 3739 11580 -9551 202 -4648 10477 1679 -16045
277 -16045 8450 2795 2864 -7441 -8132 18654 -3983 -8501 -677 4774 12137 -16658 -3397 13149
291 13149 1270 -3445 -13623 12108 11376 -15147 -4192 3911 13139 -6434 -17392 12990 8807
304 8807 -4513 -12390 686 20495 -7866 -14403 5074 12233 2659 -19477 1046 18558 -2040
317 -2040 -14085 -5022 18046 4949 -19788 -2785 14862 7699 -15912 -10536 18826 8520 -15094
330 -15094 -10880 13386 15377 -15048 -14499 13350 14712 -10127 -17903 9821 18465 -9332 -18562 6393
344 6393 19963 -4962 -20981 3668 20895 -1430 -20852 -151 21387 1941 -21209 -3428
356 -3428 21179 5455 -20936 -7924 21045 8753 -20288 -9908 17743 12891 -17808 -14885 18414
369 18414 14361 -15333 -16697 13637 20165 -14410 -18329 10987 18888 -6351 -23954 8610 22505
382 22505 -8335 -18924 482 23713 104 -26529 3286 19655 3265 -19571 -8917 26298
394 26298 3739 -21665 -4399 15887 13706 -21451 -12629 22341 8332 -14398 -15212 14998 18492
407 18492 -19369 -13533 13562 16215 -10062 -22035 13925 19452 -10783 -18577 5580 23384 -6686
420 -6686 -22466 4965 21353 -585 -24630 1197 21834 1918 -19751 -9083 25084 5827
432 5827 -22145 -4068 13153 14981 -18089 -15647 22990 6077 -10442 -12903 6992 22906 -18581
445 -18581 -12406 13224 7412 -566 -21137 8871 20105 -15130 -8109 1795 16328 -145 -24967
458 -24967 11726 13915 -4495 -12099 -6287 25113 -2065 -22280 4630 12166 8181 -18711 -10499
471 -10499 23693 4056 -15662 -8595 12252 14653 -14421 -13962 12864 14264 -10841 -13208 7254
484 7254 12948 -1639 -18596 5183 16437 -8308 -6493 -3084 11534 5891 -20760 7258 9078
497 9078 -4010 -1315 -10213 15809 1937 -16926 8616 1866 5013 -7838 -9563 20012 -5004
510 -5004 -8271 52 2061 14536 -17521 -5091 15867 -2606 123 -13264 6528 17386 -17068
523 -17068 -2789 4196 5857 4835 -19075 5415 13685 -7107 -4089 -4051 8085 6790 -12760 -2184
537 -2184 9490 641 -3901 -3509 1171 8455 -5001 -6489 7914 -1922 693 -575 -4900 9110
551 9110 -5594 -1751 6341 -7227 5263 -3053 -529 7127 -11184 6073 2174 -3976 4967 -9978
565 -9978 8804 3124 -10335 6535 -4662 6536 648 -12311 10988 -2240 45 1301 -9856
578 -9856 12484 -2273 -5732 5406 -6735 8536 -782 -8430 7357 -3262 3011 1383 -8768
591 -8768 6247 1765 -2416 763 -5415 4695 5405 -7773 -1216 3332 1619 2630 -8282 -542
605 -542 10693 -4445 -3206 -833 1378 8729 -9292 -3483 8113 -1375 1390 -6786 1268 9017
619 9017 -7615 42 249 1633 3810 -9341 5513 2650 -5188 3902 -4765 6079 -319 -9431
633 -9431 10471 -1751 -2970 796 -4332 11489 -5310 -9463 9587 673 654 -6548 -3603 14816
647 14816 -3795 -10064 2900 5310 5316 -9846 -6348 13028 2783 -9021 -4440 5705 8970 -7306
661 -7306 -9555 8365 7119 -5018 -7345 1989 10674 -3435 -10244 4755 6721 -810 -7945 -1098
675 -1098 11347 -2661 -8712 2342 5568 2817 -10132 -1744 12455 -2747 -7228 -1189 6817 6617
689 6617 -13191 -2526 12237 375 -5952 -7508 8692 10179 -13585 -4848 8597 5935 -3882
702 -3882 -12872 7853 11889 -9051 -7739 3217 10786 -1542 -14164 4666 11139 -2673 -9676
715 -9676 -1429 12695 605 -12837 299 10179 2401 -10595 -4175 11891 3585 -10925 -4308
728 -4308 9722 6162 -9789 -7048 9773 7625 -9106 -7868 7739 8776 -6479 -10514 6690
741 6690 10611 -6443 -9449 3673 10822 -2441 -12736 3965 10714 -2436 -9486 -986 12406
754 12406 229 -12667 1234 9482 2190 -10273 -4266 12729 2096 -10423 -3395 8556 6888
767 6888 -10867 -6199 10319 5550 -7102 -8711 7752 9684 -8444 -7774 5128 9549 -3794 -11827
781 -11827 5372 9832 -3561 -9026 559 11255 -1096 -10889 1086 9203 1217 -10015 -1482
794 -1482 10035 1390 -8638 -3245 9260 3476 -9361 -2858 7152 5014 -7535 -6386 9047
807 9047 4415 -6740 -5225 4598 8288 -6349 -7619 6265 6213 -3249 -8102 3027 8918 -3498
821 -3498 -7530 1421 8205 -662 -8895 1210 7230 716 -7432 -2110 8938 653 -6915 -1469 5389
836 5389 4244 -7299 -3529 7326 2173 -4575 -4252 4462 5539 -5703 -4265 4414 4361 -3233 -5422
851 -5422 3356 5072 -2539 -5288 1896 5976 -2420 -4727 1390 4351 405 -5906 323 5613 -991
866 -991 -3821 -851 4307 1608 -5244 -595 4057 1184 -3293 -2403 3966 1983 -3448 -2074 2781 2828
882 2828 -3130 -2262 2381 2089 -1009 -3630 1733 3378 -2544 -1495 535 1937 624 -3705 992 2662
898 2662 -1366 -797 -633 1604 1047 -2825 590 1514 -538 -281 -957 1325 680 -1857 498 531 15 -227
916 -227 -770 1221 -11 -838 485 11 406 -528 -295 966 -631 -9 167 -237 568 -749 253 664
934 664 -1188 437 559 -582 115 -451 526 970 -1796 48 1908 -834 -598 -586 832 2127 -3032
951 -3032 -675 2634 -303 -111 -2691 1337 3876 -3877 -812 1280 1294 1325 -5128 1691 3887 -2436
967 -2436 -807 -1797 3559 1528 -5568 1738 1653 776 -1311 -3620 5190 200 -3536 764 96 3453
983 3453 -3064 -3018 5202 -588 -1679 -1251 1010 4209 -4248 -2421 4013 1476 -2003 -3450 2366 4396
999 4396 -3161 -4356 2978 4273 -2137 -4287 266 6150 -370 -7304 2265 4418 341 -3930 -4037
1014 -4037 8009 1207 -6821 377 1909 5014 -4642 -5595 7732 404 -2080 -3209 320 8131 -6216
1029 -6216 -3116 4346 445 1741 -7070 2369 6883 -6257 -472 -125 3850 1486 -9015 4815
1043 4815 4198 -3056 -2079 -2509 7668 -310 -8107 2809 4203 1241 -5657 -2816 7772 1500 -6503
1058 -6503 -2625 6143 3402 -5576 -4065 4311 6488 -5732 -5542 5287 3539 -764 -7468 1806 8707
1073 8707 -5181 -3304 184 4392 3114 -9974 2828 5555 -2366 -1017 -4762 7571 1364 -8489
1087 -8489 3893 845 2948 -3566 -5527 10284 -2316 -4319 588 433 7225 -8074 -3241 8318
1101 8318 -1124 -1082 -5575 3502 7871 -7873 -2568 3147 4389 -692 -8376 3809 6073 -2194 -5424
1116 -5424 -208 7389 -810 -5677 -859 5677 2378 -7537 71 4291 1776 -2954 -5366 7262 1549
1131 1549 -5192 96 31 5989 -4453 -4856 6987 -1014 -187 -3712 453 7760 -7230 -949 2770
1146 2770 730 2411 -8395 4309 5127 -5357 405 -2711 6244 563 -8873 5256 1474 725
1160 725 -2696 -4575 8843 -1165 -4782 606 1260 4929 -5589 -2591 5193 790 -1343 -4353 3335
1175 3335 3589 -3601 -1653 166 4750 -2146 -4078 3362 594 1130 -3866 -311 5558 -3671 -510
1190 -510 -284 1550 2659 -6065 2742 2038 -1540 438 -3754 5331 -326 -4426 2932 -1228 3496 -3078
1206 -3078 -3020 6394 -2852 233 -1329 -462 5825 -5738 68 2369 -908 2455 -5230 2380 2993 -3475
1222 -3475 1099 -1940 2932 388 -3910 2630 -384 1169 -1410 -1472 3608 -2055 355 -607 35 2494
1238 2494 -3553 1699 477 -892 1470 -2930 2704 -229 -1905 1943 -1843 2354 -1323 -1324 2908 -2364
1254 -2364 1626 -1143 -389 2702 -3300 2021 -513 -722 2250 -3380 2728 -542 -1640 2731 -2899
1269 -2899 2201 -485 -1530 2958 -2866 1509 142 -1176 2180 -2691 1823 249 -1449 1592 -1897
1284 -1897 2165 -859 -1537 2254 -1575 1428 -1460 -492 2810 -2491 785 -467 311 1802 -3391 1754
1300 1754 635 -774 600 -2404 2892 -233 -2149 1245 -582 2103 -2012 -1232 2832 -1057 371
1315 371 -1827 958 2713 -3474 636 448 867 537 -3635 2767 1067 -1556 -167 -1120 3408 -1253
1331 -1253 -2659 2042 373 1035 -2659 -275 3558 -1614 -984 -808 2029 1493 -3904 863 1540 576
1347 576 -1232 -2613 3703 483 -2467 -202 493 2940 -2486 -2196 3008 624 -616 -2688 1251 3252
1363 3252 -2485 -1441 551 2542 -200 -3928 1847 2113 -545 -2098 -893 4041 -763 -3018 584
1378 584 1745 1643 -3622 -691 3735 -367 -1704 -1753 2519 2277 -3804 -764 2188 1668 -1747 -3103
1394 -3103 3011 1902 -2260 -1830 888 3444 -1864 -3044 1906 2236 -530 -3220 581 3531 -1079
1409 -1079 -2714 98 3081 246 -3518 147 2897 584 -2999 -1012 3339 608 -2713 -1249 2637
1424 2637 1875 -3227 -1322 2502 1623 -1919 -2765 2692 2319 -2577 -1878 1171 2908 -1417 -3383 2060
1440 2060 2351 -924 -2657 150 3650 -893 -3000 731 2307 587 -3080 -591 3587 -144 -2597
1455 -2597 -449 2185 1470 -3033 -1184 3099 750 -2199 -1540 2016 2338 -2709 -1912 2568 1369 -1299
1471 -1299 -2486 1303 3117 -2118 -2256 1310 2019 -135 -3254 732 3082 -1112 -1935 -123 2327 693
1487 693 -3188 204 2408 100 -1595 -1197 2376 1013 -2641 -315 1709 847 -1458 -1571 2085 1406
1503 1406 -2233 -886 1524 1292 -1044 -2106 1580 2029 -1936 -1131 702 1781 -93 -3071 1260 2088
1519 2088 -1260 -935 -888 2413 584 -3276 1137 1156 253 -732 -1993 2897 273 -2145 616 -73 1759
1536 1759 -1274 -1812 2599 -416 -473 -492 -196 2206 -1737 -782 1512 -96 226 -1349 516 1761 -1434
1553 -1434 -557 467 695 -10 -1472 410 1342 -504 -1100 303 864 143 -1060 -538 1725 -241 -1111
1570 -1111 385 0 1218 -1127 -1022 1929 -760 192 -389 -531 2152 -1786 -53 955 -1036 1567
1586 1567 -1617 218 1553 -1920 1390 -612 -307 1384 -1936 1386 -90 -1015 1460 -1325 872
1601 872 -155 -1095 1652 -950 50 218 -590 1196 -990 -145 734 -383 252 -624 252 568 -442
1618 -442 -141 107 254 -198 5 -86 185 159 -693 792 -338 -380 728 -733 908 -582 -686 1653 -1258
1637 -1258 358 -83 -549 1880 -2037 171 1213 -1079 1098 -1745 674 1639 -2135 798 -406 553
1653 553 818 -2419 1470 517 -626 236 -1220 1850 -162 -1537 888 -75 762 -936 -801 1750 -419
1670 -419 -542 -256 443 903 -1285 -318 856 336 -712 -721 956 373 -639 -789 641 1107 -1379 -253
1688 -253 448 705 77 -2017 1383 939 -1150 -98 -777 1994 -130 -2294 1507 304 367 -946 -1192
1705 -1192 2648 -585 -1288 184 299 1598 -2040 -567 1905 -304 -261 -1365 1065 1536 -1948 -159
1721 -159 531 852 -264 -1981 1446 868 -914 -722 -50 1741 -676 -1528 800 1000 -54 -1586 278
1738 278 1510 -327 -1158 -326 1786 33 -1620 226 853 843 -1505 -857 2066 -46 -876 -751 849
1755 849 1680 -1942 -693 1285 583 -218 -1853 1190 1492 -1415 -647 116 1599 -354 -1976 1018 858
1772 858 -184 -1227 -351 2103 -509 -1297 258 875 810 -1779 -201 1719 -162 -804 -773 1215 844
1789 844 -1606 -282 971 836 -959 -1078 1317 646 -781 -1010 700 1415 -1110 -913 642 1003 -146
1806 -146 -1648 713 1252 -615 -849 -247 1518 -36 -1667 428 891 263 -1141 -477 1557 42 -1047
1823 -1047 -356 952 790 -1389 -399 1044 378 -569 -1061 1043 857 -1094 -505 490 957 -595 -1153 875
1841 875 722 -408 -869 189 1213 -480 -880 252 852 17 -1161 49 959 -126 -729 -220 1081
1858 1081 115 -1008 23 660 395 -827 -483 985 210 -581 -404 521 625 -760 -445 529 544 -375
1876 -375 -805 616 600 -494 -425 85 733 -217 -772 432 473 -63 -576 -98 752 -199 -550 91 372 178
1896 178 -699 -51 575 -47 -418 -205 454 240 -495 -75 425 142 -326 -313 436 242 -396 -261 333 204
1916 204 -238 -317 266 348 -349 -193 255 184 -4 -313 146 427 -237 -155 108 119 66 -423 157 200 -266 5
1938 5 -57 172 30 -394 241 127 -220 63 -111 267 41 -365 247 132 -105 -43 -105 346 -134 -304 236 46
1960 46 4 -172 -143 386 -161 -219 268 -7 179 -195 -111 559 -311 -109 126 -96 274 -437 -47 541 -349 0
1982 0 -75 88 381 -585 152 465 -304 56 -256 324 412 -705 144 364 -76 -64 -455 374 408 -631 -11
2003 -11 242 237 -56 -592 390 433 -450 -72 45 435 121 -681 375 472 -359 -126 -194 490 115 -717 376
2024 376 237 -89 -104 -393 797 -53 -737 376 25 293 -275 -676 977 -75 -600 141 -62 652 -540
2043 -540 -655 923 -78 -191 -283 -72 935 -616 -537 727 117 42 -579 -113 942 -485 -513 268 225
2062 225 214 -783 -137 831 -244 -383 -34 303 456 -744 -196 708 -65 -193 -295 244 614 -716 -178
2081 -178 620 -63 -1 -537 305 741 -808 -178 339 146 153 -877 419 741 -702 55 -130 468 292 -1094
2101 -1094 498 572 -408 -68 -456 721 288 -1058 371 225 185 -199 -705 912 246 -683 98 95 534
2120 534 -254 -672 778 147 -370 -172 -2 623 -339 -606 478 182 -112 -345 -48 670 -190 -569 380
2139 380 226 72 -390 -261 753 -113 -599 262 118 350 -431 -410 827 -196 -364 34 -19 682 -567
2158 -567 -384 792 -244 81 -287 -96 866 -667 -228 420 -145 262 -602 97 626 -544 -47 75 255
2177 255 261 -712 268 420 -188 -65 -168 412 133 -539 138 215 12 -209 -255 382 94 -369 -101 194 140 -130
2199 -130 -236 300 245 -356 -29 190 81 15 -417 264 281 -429 62 -83 172 155 -560 299 151 -268 116
2220 116 -290 419 71 -517 358 -52 79 -50 -254 546 -216 -235 146 -102 281 -327 -96 410 -171 56
2240 56 -145 108 242 -354 138 119 55 63 -346 286 92 -251 32 72 198 -77 -156 156 91 -44 -182 203 113
2263 113 -105 -9 -12 251 -95 -171 172 -80 125 -171 -109 365 -358 3 81 -28 206 -406 91 300 -276 114
2285 114 -138 232 127 -409 275 17 74 -107 -238 359 -138 -148 48 -123 286 -405 -73 268 -151 124 -237
2306 -237 167 205 -318 128 55 63 -26 -344 340 -33 -116 -37 -39 276 -256 -57 77 -2 124 -340 236 194 -198 86
2330 86 -182 270 34 -384 233 11 -12 -108 -202 430 -142 -92 23 -10 255 -344 4 258 -15 46 -322 231
2352 231 119 -355 68 -9 173 -148 -319 367 -53 -38 -79 -103 346 -209 -83 165 -8 140 -300 91 238
2373 238 -228 27 -127 226 64 -328 163 -4 122 -163 -155 331 -108 -74 -109 73 246 -285 22 145 -33
2394 -33 70 -353 278 169 -262 30 -122 207 -83 -269 225 -2 30 -113 -84 370 -181 -63 97 -38 175
2415 175 -306 62 232 -97 59 -146 120 67 -294 92 4 33 3 -205 232 2 -76 -2 -42 208 -124 -68 115
2438 115 65 19 -197 88 38 -75 -101 -108 226 -60 -133 53 -28 138 -121 -2 255 -112 90 -66 29 232 -304
2461 -304 125 32 -141 126 -190 130 105 -180 167 -198 85 80 -213 207 -71 -37 59 -173 148 -80 -83 132 -146
2484 -146 32 -93 -63 140 -151 -55 43 11 113 -77 -72 113 -22 30 35 -2 105 39 -95 86 -27 9 44 -139
2508 -139 132 -25 -157 180 -158 117 52 -212 237 -136 40 147 -240 229 -18 -205 154 -210 137 70 -223
2529 -223 214 -158 48 23 -246 208 -19 -5 81 -138 215 -30 -120 163 -154 16 8 -180 165 -75 -1 185
2551 185 -119 -5 -15 -86 220 -198 -24 111 -90 122 -125 -64 254 -187 1 68 -174 148 -159 -134 185 -202
2573 -202 48 -8 -113 298 -259 -33 195 -128 180 -143 -2 258 -166 4 -3 -43 249 -242 -32 233 -232
2594 -232 103 -95 -24 174 -260 83 125 -97 113 -255 93 177 -279 125 -43 -45 58 -283 153 85 -267 102
2616 102 -104 168 63 -310 223 82 -65 65 -217 266 64 -313 178 -1 19 -11 -252 210 16 -277 14
2637 14 -26 85 -65 -255 160 21 -85 27 -60 193 -2 -248 229 61 -87 5 -206 230 -42 -179 135
2658 135 -48 83 -61 -196 365 -106 -112 56 -121 239 -150 -190 242 -95 36 -74 -7 389 -303 -74 192
2679 192 37 105 -258 -8 324 -177 -94 -81 47 217 -265 -10 166 -62 -75 -123 91 121 -186 -42 87 28
2701 28 -90 -146 30 178 -183 -85 123 37 78 -212 62 239 -154 -82 3 112 162 -314 6 216 -132 5 -209
2724 -209 183 230 -332 34 21 85 64 -360 197 156 -208 -60 -59 253 -58 -276 168 59 24 -133 -92 294 -90
2747 -90 -173 -4 99 64 -240 -52 178 76 -134 -138 206 150 -110 -122 133 191 -174 -153 125 107 -48 -270 108
2770 108 259 -75 -132 -19 216 -27 -270 83 109 29 -174 -140 312 -42 -286 -24 89 207 -248 -118 276
2791 276 74 -55 -179 56 279 -182 -85 131 137 -48 -270 118 169 -82 -206 36 281 -46 -196 62 165
2812 165 64 -197 -58 231 -14 -129 -79 231 152 -270 -70 101 108 -103 -217 229 144 -184 -185 113 321 -138
2834 -138 -133 119 203 31 -346 78 246 -106 -174 -77 270 83 -268 3 115 37 -168 -204 259 -4 -238 -45
2856 -45 110 169 -162 -106 187 96 -99 -211 141 207 -142 -149 20 173 2 -262 93 174 -26 -105 -30 259 20
2879 20 -200 -16 157 94 -228 -71 145 111 -136 -174 163 122 -209 -102 63 180 -101 -194 175 123 8 -106
2901 -106 -19 218 -72 -137 32 88 40 -236 -40 187 -19 -79 -70 136 85 -175 -8 80 82 -70 -140 134 60 -120
2925 -120 -61 90 151 -35 -100 107 49 -66 -135 60 154 -34 -106 -22 177 -10 -155 31 75 49 -132 -91 89 52
2949 52 -49 -131 80 102 -110 -16 52 89 25 -132 101 124 -60 -44 -50 154 50 -112 106 -9 69 -35 -54 124
2973 124 50 -133 3 35 80 -129 -103 116 36 -17 -53 39 180 -41 -136 -34 52 18 -140 -88 115 60 -179 -1
2997 -1 42 63 -50 -115 126 99 -32 -26 -4 199 -31 -164 90 56 108 -139 -122 188 -28 -151 -29 20 157 -156
3021 -156 -99 165 -82 -40 -65 10 190 -186 -95 143 39 1 -246 12 237 -148 -161 4 103 108 -227 -25 280
3044 280 -52 -157 -67 180 218 -285 -45 200 54 -77 -191 129 209 -234 -149 137 163 -21 -261 137 285 -164
3066 -164 -104 -57 230 -34 -353 79 262 27 -156 -123 252 84 -329 -22 237 17 -136 -230 253 147 -298
3087 -298 -58 137 178 -136 -341 284 256 -254 -167 4 321 -59 -370 131 233 -72 -216 -104 345 -26 -343
3108 -343 -5 139 141 -273 -206 391 115 -290 -118 132 239 -195 -194 324 43 -181 -235 66 300 -195 -260 208
3130 208 132 -92 -293 97 354 -161 -261 82 254 86 -413 -25 434 -110 -268 -17 272 158 -392 -96
3150 -96 384 90 -210 -237 247 280 -328 -202 255 170 -180 -327 139 378 -212 -187 61 225 -7 -421 119 311
3172 311 -88 -174 -45 310 157 -365 26 276 21 -176 -150 327 95 -351 -77 165 149 -146 -289 250 240
3193 240 -239 -173 139 236 -180 -305 205 251 -213 -269 34 281 -44 -333 72 243 42 -262 -93 284 55
3214 55 -274 -8 168 126 -198 -174 288 93 -191 -104 134 219 -203 -221 191 98 -111 -233 79 233 -117 -207 90
3237 90 137 -42 -234 1 217 -50 -256 -48 180 97 -237 -16 272 71 -119 -139 197 136 -185 -70 124 132
3259 132 -103 -102 45 196 -107 -165 106 68 -47 -194 55 170 -38 -133 -35 110 42 -160 -69 109 -37 -122 -110
3282 -110 88 82 -133 -48 58 51 -137 -96 23 75 -61 -89 57 110 20 -113 -34 74 16 -62 -64 122 44 -105 -44 8
3308 8 0 -27 -39 92 77 -38 -68 54 57 -39 -78 20 82 -17 -19 -67 102 75 -103 -58 -11 8 -54 -7 64 76 -48 -68 1
3337 1 104 -28 -92 48 23 24 -44 -16 99 8 -140 -77 83 72 -102 -65 112 85 -102 -123 58 110 -71 -66 28 195
3363 195 -85 -146 32 124 -31 -149 25 145 22 -241 -41 168 129 -121 -59 113 62 -188 -115 169 108 -109
3385 -109 -108 88 185 -129 -170 112 156 -56 -217 74 174 -68 -172 -10 268 -30 -288 10 232 3 -210 -110
3407 -110 231 49 -272 -80 163 153 -231 -189 211 199 -207 -155 188 192 -68 -204 114 279 -73 -221 103 257
3429 257 -99 -294 17 235 -41 -258 2 246 62 -355 2 293 85 -248 -78 247 122 -287 -92 166
3449 166 264 -251 -194 275 218 -254 -231 149 276 -222 -344 122 272 -96 -327 53 307 -74 -269 1 367
3470 367 33 -314 -86 312 90 -214 -142 326 143 -321 -171 310 99 -227 -146 211 259 -237 -249 214 278 -180
3492 -180 -219 129 374 -130 -273 127 275 -75 -351 25 357 -69 -337 29 327 90 -352 -71 303 45
3512 45 -287 -171 253 155 -299 -124 213 214 -226 -259 189 164 -208 -204 212 260 -129 -324 124 316 -158 -280 64
3535 64 249 -80 -329 14 274 -64 -242 -17 304 101 -268 21 282 100 -194 -162 291 152 -196 -50 165
3556 165 203 -226 -242 213 240 -166 -224 90 289 -135 -229 140 240 -34 -275 0 285 -25 -274 -51 186 33
3578 33 -240 -66 193 10 -178 -55 195 105 -162 -108 244 73 -97 -125 161 184 -138 -137 156 128 -76 -171 81
3601 81 222 -93 -144 39 120 -23 -232 -5 254 -80 -141 -56 111 21 -153 -47 144 48 -51 -122 23 123 -162
3624 -162 -34 42 47 -23 -145 44 113 -72 15 12 115 6 -101 -8 30 10 -22 -18 73 -10 -65 16 7 14 -88 -80 75 38
3652 38 -93 -34 43 66 -18 -87 66 54 19 -52 -62 106 13 -47 -16 -6 37 -15 -101 57 46 -37 2 -29 27 24 -156 56
3680 56 20 -10 -23 -44 86 80 -44 -52 34 72 20 -93 40 -2 -37 -126 13 147 17 -133 -52 100 47 -99 -52 62
3706 62 19 -114 -44 97 129 -62 -92 141 135 -142 -80 72 168 -106 -150 101 70 -34 -143 26 223 -77 -208 11
3730 11 116 20 -176 -57 166 25 -185 -100 135 103 -217 -131 203 150 -161 -171 143 204 -140 -198 143 145 -72 -232
3754 -232 110 234 -81 -199 97 239 -30 -185 8 257 -21 -256 -2 238 12 -267 -51 187 33 -216
3774 -216 -131 181 102 -254 -195 190 180 -171 -249 131 187 -168 -203 122 222 -110 -281 113 226 -80 -305 52
3796 52 256 -40 -300 34 277 33 -316 -44 306 52 -253 -71 244 109 -313 -182 272 101 -221 -189 182
3817 182 137 -271 -245 135 205 -171 -241 79 269 -152 -297 125 281 -53 -311 50 290 -38 -306 -5 236
3838 236 14 -293 -53 275 104 -227 -123 288 171 -307 -174 254 175 -269 -226 246 207 -226 -244 157 246 -127
3860 -127 -302 102 243 -69 -243 9 265 -58 -284 26 262 -24 -290 -46 330 20 -255 -43 265 76
3880 76 -247 -124 240 156 -253 -66 167 137 -184 -186 185 193 -154 -297 105 270 -112 -219 95 205 -61 -230
3902 -230 54 258 -57 -303 10 211 42 -275 -60 200 4 -216 -130 116 23 -191 -111 162 119 -159 -150 132
3924 132 173 -174 -145 148 179 -119 -183 107 174 -57 -157 65 182 -87 -121 35 154 -10 -219 -49 125 31
3946 31 -170 -97 152 -8 -109 -81 110 44 -137 -46 106 110 -135 -131 77 96 -108 -102 6 56 -39 -145 66 101 -70
3971 -70 -73 31 115 -1 -57 -31 25 29 -17 -34 35 0 -32 2 44 41 -13 -23 -6 75 29 -45 34 17 -32 -40 -16 -10 -14 -40 -27 17
4003 17 9 -11 -45 10 -35 9 -18 32 28 -38 -19 -10 18 0 -47 32 18 46 -92 -63 54 26 -15 -44 -32 78 -32 -40 -36 26 -13
4034 -13 -91 -63 99 21 -61 -77 33 15 -73 -87 42 105 -79 -106 25 30 -41 -121 37 106 -12 -90 4 102 -10 -112
4060 -112 -33 93 70 -114 -95 159 44 -108 -90 161 88 -172 -93 122 40 -115 -55 90 130 -154 -153 66 120 -27
4084 -27 -213 64 146 -31 -161 25 164 9 -192 -10 219 -2 -182 -46 169 90 -160 -66 186 32 -211
4105 -211 -104 112 169 -187 -169 96 73 -151 -219 111 165 -117 -171 38 111 -77 -239 108 173 -140 -149 40 208
4128 208 -34 -231 54 226 -8 -208 -57 277 129 -213 -53 242 95 -177 -105 209 163 -210 -143 144 239
4149 239 -153 -217 159 250 -128 -223 71 250 -95 -196 30 202 -94 -216 -26 217 -78 -281 -47 153 56
4170 56 -252 -12 250 64 -256 -82 191 123 -228 -154 209 117 -206 -169 209 254 -176 -194 129 202 -118 -299 106
4193 106 244 -62 -247 60 269 -37 -324 -22 192 0 -206 -49 265 72 -219 -92 178 52 -224 -131
4213 -131 214 102 -172 -152 153 124 -127 -154 128 216 -164 -182 110 167 -67 -261 105 198 -70 -210 -23 259
4235 259 -69 -204 26 206 4 -181 -7 219 24 -225 -76 176 107 -214 -138 133 67 -122 -199 132 134 -189
4257 -189 -101 107 160 -81 -170 16 196 -94 -226 71 173 -37 -139 -64 192 28 -168 -18 216 23 -155
4278 -155 -100 142 42 -164 -50 124 78 -114 -65 137 48 -106 -80 97 188 -81 -75 69 84 -17 -90 25 109 -34
4302 -34 -87 15 80 10 -95 23 85 4 -99 -10 138 -2 -108 -33 69 6 -65 -52 67 33 -46 -19 0 42 -42 -7
4328 -7 -19 17 -35 -83 -5 18 -18 -53 -33 12 -40 11 16 -31 21 -13 -21 42 2 55 -3 7 -25 -3 29 -37 12 10 34 -71 37
4359 37 29 -48 -24 -12 49 43 -23 -38 62 33 -58 -74 19 22 -76 -83 -12 39 -24 -81 54 89 -14 -42 82 94 -2 -135 57
4388 57 75 -12 -83 -42 127 -13 -51 -26 98 42 -119 -37 90 60 -98 -13 113 95 -62 -77 31 75 -63 -95 113
4413 113 82 -6 -174 47 105 -72 -115 40 94 -4 -134 -34 163 40 -163 -113 160 1 -122 -73 104 103 -168
4436 -168 -151 114 96 -138 -151 61 115 -57 -103 52 154 -100 -177 78 146 -61 -179 7 168 -25 -147 13
4458 13 183 54 -167 -18 199 23 -176 -48 195 72 -184 -65 174 107 -160 -95 126 146 -103 -106 157 185
4480 185 -115 -139 135 161 -61 -145 78 191 -90 -194 24 183 6 -163 21 176 32 -259 -73 147 15
4501 15 -168 -58 194 90 -146 -110 193 88 -144 -148 143 102 -141 -140 113 175 -51 -160 93 156 -59 -226 22
4524 22 216 -99 -215 61 195 -7 -242 -23 183 -31 -199 -53 210 45 -243 6 204 42 -161 -46
4544 -46 145 75 -177 -85 159 163 -107 -167 183 209 -96 -148 74 215 -34 -139 84 224 -45 -165 -24 218 50
4567 50 -195 -8 106 -63 -157 -9 160 78 -188 -76 141 72 -111 -118 141 128 -65 -105 76 110 -102 -236 95
4590 95 128 -118 -189 51 133 -11 -118 47 158 -14 -135 6 200 -2 -162 -41 153 44 -160 -51 146
4611 146 12 -119 -67 132 104 -124 -112 126 69 -78 -58 17 100 -93 -119 94 66 -47 -100 28 81 -43 -127 73
4635 73 101 38 -61 -15 67 -16 -66 -13 90 5 -121 10 73 61 -94 -20 111 42 -65 -2 77 44 -11 -134 55 99
4661 99 5 -7 -39 57 -5 -52 12 13 -62 -53 0 32 47 -80 2 17 21 9 -35 -8 12 4 -35 15 34 -15 -17 1 26 11 -10 -31
4693 -31 20 -18 -21 36 37 -28 4 -42 62 24 -28 19 17 -10 23 -47 -44 3 -1 -55 29 30 45 4 21 12 50 -6 -31 3 129 17
4725 17 -20 -23 78 14 -34 -24 49 20 -69 -43 38 36 -46 -44 2 47 -85 -61 34 108 -28 -86 -33 106 -47 -149 -48 116
4753 116 26 -57 -45 39 39 -150 -92 96 13 -92 -88 92 63 -56 -75 121 62 -56 -96 59 69 -38 -106 30 91 13
4779 13 -144 27 114 -50 -132 -27 126 28 -161 25 124 21 -128 -75 141 32 -184 -63 174 33 -177 -113
4801 -113 131 59 -75 -137 98 85 -76 -109 142 98 -30 -21 90 124 -44 -147 31 169 -47 -250 -12 173 8
4824 8 -198 -54 169 28 -107 -132 180 54 -176 -102 112 87 -165 -125 180 130 -96 -96 67 144 -120 -159 78 154
4848 154 -64 -182 82 191 -66 -100 -6 211 -63 -143 19 160 -3 -152 -69 192 39 -168 -3 162 63 -151
4870 -151 -84 171 86 -84 -106 111 35 -90 -80 113 100 -90 -109 91 136 -113 -170 22 153 -15 -143 -13 100
4893 100 -14 -128 26 177 -11 -177 -88 165 62 -141 -1 150 81 -116 -100 132 79 -110 -73 109 90 -133
4915 -133 -105 78 93 -98 -80 73 80 6 -142 14 129 -47 -113 58 100 -66 -114 23 126 9 -109 16 117
4938 117 28 -98 25 99 72 -91 -63 88 63 -16 -32 102 -9 -48 -106 58 109 -69 -125 26 49 -54 -80 -3 127
4963 127 40 -89 63 23 -59 -119 -7 125 -31 -102 10 35 55 -61 -10 115 52 30 -24 45 59 -60 -11 55 56 -51
4989 -51 -74 58 33 -44 -72 105 63 -28 -38 7 2 -29 -84 -61 -4 -23 -46 20 24 14 -71 10 62 29 -48 16 70 7 -28 14
5019 14 44 63 -72 23 50 -3 20 5 48 -49 -14 27 -13 21 -68 -4 25 -50 -34 39 -12 3 40 -12 5 -4 34 -36 -39 -22 6
5050 6 81 -5 -20 -31 23 50 -54 -43 83 35 -33 -16 24 24 -9 11 11 67 -4 -47 21 61 -28 -32 -23 39 -8 -56 25 50 -6 -56
5082 -56 -9 78 20 -89 -41 21 74 -26 -69 52 -13 -55 -57 55 3 -62 -33 30 153 -49 -36 31 62 -25 -90 37 59
5109 59 -40 -58 38 145 19 -59 -28 129 60 -100 14 140 34 -146 -55 43 14 -114 -34 107 82 -74 -75 4 53
5134 53 -47 -78 88 65 -17 -138 65 118 -20 -55 14 143 43 -75 16 97 -28 -135 -35 109 15 -29 -73 105
5158 105 -13 -158 -68 82 -12 -115 -97 146 31 -143 2 83 105 -81 -96 65 42 -69 -88 77 110 -79 -119
5181 -119 18 99 -40 -78 22 109 -41 -92 -23 103 16 -107 -15 173 65 -125 -28 52 50 -89 -76 81 64 -54
5205 -54 -35 30 83 -91 -87 27 67 -122 -98 61 140 -80 -144 3 125 15 -94 17 107 7 -60 -25 152 -33
5229 -33 -145 -21 69 87 -54 -51 85 4 -75 -21 127 105 -81 -85 43 59 -73 -56 44 57 -55 -96 47 49 -55 -89
5255 -89 47 109 -50 -121 -39 84 -31 -149 3 55 3 -106 -5 146 29 -90 -72 125 3 -53 -70 32 71
5278 71 -77 -64 82 65 -79 -75 29 116 -5 -120 40 57 -52 -131 -17 123 5 -90 30 62 -12 -34 38 85 -8
5303 -8 -16 -9 86 -30 -75 -26 81 -1 -57 -8 29 60 -43 -27 75 66 -54 -34 82 118 -59 30 28 40 5 -15 -9 72 -19 -65
5333 -65 -47 27 -47 -12 -31 -4 19 -60 8 34 21 -11 -23 27 35 -30 12 32 18 -18 35 46 18 -18 -32 16 21 62 -56 53
5363 53 29 -26 10 -51 73 14 -41 -32 7 -36 -27 40 -23 -39 -31 0 21 44 -22 0 -30 -16 -26 55 40 -55 -29 -7 12 32 -16
5394 -16 34 -28 56 -7 60 0 -6 12 90 41 25 35 39 37 -11 12 14 -3 -71 -2 -18 1 -27 -62 45 29 -10 -4 -53 -20 -65 2
5426 2 -36 29 -15 -11 -33 31 -4 -64 15 98 5 3 -6 82 31 -73 6 36 21 -32 38 62 17 -13 -31 73 38 -61 -73 85 36
5457 36 -103 -55 -28 41 -35 -61 38 48 22 -69 29 100 -14 -33 2 46 -20 -76 -22 70 -3 -98 -6 31 29 -30 -18 95 26
5486 26 -47 -37 45 4 -61 -51 47 50 -84 -33 93 95 -78 -120 49 75 -52 -79 62 67 -61 -154 32 82 20 -107 73
5513 73 106 -55 -35 -10 83 6 -61 -15 73 3 -87 -17 72 32 -33 -68 63 43 -28 -44 38 75 -95 -36 -2 62 -59 -101
5541 -101 31 69 -74 -21 45 108 -39 -26 -26 37 -23 -79 17 70 -2 -116 -39 4 43 -96 -51 49 20 -45 -3 69 85
5568 85 -83 -27 75 97 -13 -69 15 6 -17 -77 3 76 -67 -66 8 17 -80 -111 33 49 7 -42 15 76 38 -90 -65 121
5596 121 7 -50 17 53 -37 -40 20 25 38 -55 -49 114 76 -48 -50 54 28 -46 -76 30 47 -30 -57 27 98 3 -53 60 71
5625 71 -37 -77 14 56 -31 -101 -23 56 29 -76 -3 10 4 -47 -23 21 25 -44 2 52 5 -47 3 35 89 6 -14 69 90 -23
5655 -23 -32 41 48 -65 -39 60 61 34 -18 71 17 -20 -110 27 26 9 -12 1 18 29 -31 4 18 -5 -70 15 43 -7 -36 -21 47
5686 47 40 1 -43 75 79 25 -14 -12 -18 48 -7 78 25 0 1 32 -6 19 -84 -43 43 -35 -34 21 29 -71 -23 68 7 -15 -37 5
5718 5 -9 69 7 1 6 26 7 42 -14 20 4 -11 8 -60 -3 15 5 30 1 29 83 25 33 -7 -64 -1 -11 -73 10 -11 -56 46
5750 46 -19 -60 -46 16 25 40 -102 4 33 -28 -26 6 45 34 14 -41 20 1 -23 10 73 22 -27 7 0 8 -28 35 68 48 49 -48
5782 -48 33 10 -31 -61 39 -11 -36 -5 -49 29 -72 -11 -4 44 -25 2 24 83 -17 -103 -17 90 0 -21 1 35 21 -41 21
5811 21 51 32 -12 -9 28 17 -27 49 30 33 -16 3 99 16 6 -20 11 0 0 -32 -8 -5 -31 -88 17 52 22 -91 -23 43 -53
5842 -53 -54 -12 18 20 -53 9 37 -31 -20 -34 34 69 -20 -38 51 26 -50 -86 58 51 -31 -30 52 48 -8 -33 18 100 -23 -73 26 61
5874 61 -63 -74 16 72 -106 -123 23 3 -54 -77 41 81 -5 -36 -35 18 7 -16 -27 58 59 -29 29 63 48 2 -11 86 25
5903 25 -14 -61 63 69 -37 12 60 68 -105 -56 28 8 -81 -53 26 -14 -19 -1 -21 101 9 -55 43 39 48 -55 -27 77 2 -45
5933 -45 -6 36 -23 -69 -18 24 71 12 -29 16 64 4 -47 56 61 -65 -26 29 59 13 -40 12 26 37 -10 -24 87 13 -57
5962 -57 -32 -21 25 -61 3 45 23 -43 -1 10 3 -43 8 41 67 -1 -56 41 1 6 18 70 22 -21 -26 -26 -6 -19 -52 -11 8 -12
5994 -12 -4 51 -14 9 -30 -17 91 -20 -38 -47 21 0 -88 -23 42 -15 -48 -9 36 7 44 -36 2 75 -32 38 -29 14 -7 12
6024 12 18 43 -7 -47 98 -8 -12 8 56 -11 -19 -51 -22 38 8 -27 -40 25 43 -73 16 34 -13 -33 -33 12 17 -2 -28 29 -2
6055 -2 5 30 -29 -7 29 60 -43 -22 -22 7 35 4 21 32 17 3 26 -28 53 22 -40 38 52 14 -5 -6 7 -81 -40 -28 22 2
6087 2 -5 12 13 20 -37 17 7 -1 30 -22 38 -12 -15 -45 -37 -10 -21 17 12 -33 23 8 16 21 -14 14 26 -9 8 15 32 59 18 -34 18 14
6123 14 36 -26 -20 37 66 -49 27 57 -1 13 2 5 -12 -64 -21 20 -27 -42 13 -13 1 15 -26 50 7 -85 21 22 60 23 -61
6154 -61 4 38 -19 -60 6 6 -29 -21 -10 23 0 -80 20 22 28 8 -10 56 -4 2 -6 61 -36 -58 -48 42 32 -66 -28 -28 -10 -13 18 23
6188 23 53 -18 -33 14 6 -17 -34 4 38 7 -24 47 61 -30 -58 39 99 -13 17 -8 97 63 -39 20 -14 3 -20 -17 28 -6
6218 -6 -27 -23 68 24 -40 18 50 25 -71 8 68 36 2 -4 14 67 -4 -53 -14 33 -28 -6 48 89 -1 -61 -23 29 -14 13 -33 15
6250 15 19 1 54 39 26 -69 32 43 24 -46 -65 -20 1 -16 -42 68 -23 -5 6 54 13 15 -8 19 -18 7 -38 -33 20 1 -26
6281 -26 8 64 1 -29 18 33 11 18 29 62 -42 -3 -11 -11 52 -14 -6 33 4 -68 -13 -20 -37 -13 -7 36 -31 -20 -15 30 -18 -42 -2
6314 -2 11 31 -54 -43 27 17 9 -77 23 58 -72 -13 -16 -13 -31 -57 -9 6 21 -9 29 58 19 -28 -10 37 61 -21 -36 -72 -5
6345 -5 -18 -10 -40 10 -3 -42 -21 6 -16 -64 6 -20 14 38 40 42 14 -5 19 48 35 36 45 17 2 -14 23 -7 -2 -50 11 10 16 -16 4
6380 4 -48 -21 -40 -4 16 7 -2 -46 -35 -32 -51 -63 17 47 -52 -1 71 3 -28 -19 -2 41 -5 -8 35 -5 -17 -32 8 61 -31 14 -16
6413 -16 18 -14 -95 40 52 16 -11 35 26 -95 -50 6 14 -74 -52 -23 -2 14 -35 42 1 -13 -32 35 51 11 -45 -2 -22 -54
6443 -54 -78 72 -27 -26 13 -43 24 6 -17 -4 -9 -32 -47 -32 10 47 -10 -37 -58 -33 9 -27 24 -19 -45 8 -9 -56 6 -46 7
6474 7 -40 37 -63 9 93 25 -36 -33 55 -5 -8 -17 15 12 26 30 -10 25 -39 -43 23 46 -25 12 -4 9 -6 67 14 -13 -26 -12 39
6507 39 -8 66 -57 51 -60 -6 -75 2 28 20 -61 -50 67 22 7 25 24 9 -76 10 20 -26 18 12 44 5 -12 24 25 24 27
6538 27 -44 53 58 -40 2 65 30 -17 -20 75 14 -49 -35 6 52 17 -67 59 11 -27 -3 -9 48 -6 -33 -20 81 -27 7 6 51
6569 51 80 -61 -27 13 -8 -21 -8 5 -12 5 -6 21 15 -33 24 14 18 -9 -42 -7 23 51 -24 14 28 -92 -48 -14 -11 -18 -38
6600 -38 -19 26 21 -33 -39 35 21 -17 -5 2 33 7 -28 35 61 -27 -24 -7 -8 -40 -2 14 27 -26 17 31 39 10 46 24 -1 -56 32
6633 32 45 -5 -6 -57 52 -23 13 42 5 32 20 17 10 2 -61 13 -39 -23 -16 10 37 20 90 -57 -36 -29 -25 -11 14 -5 16 -8 -14
6666 -14 20 27 21 49 -13 4 -44 -19 10 19 -46 4 -46 11 13 0 18 10 17 40 17 -17 26 24 -35 -51 3 -34 11 31 15 10 -11 17
6700 17 -24 6 37 11 8 -3 31 34 -3 -3 53 9 15 20 -17 -13 -50 -36 -11 101 4 -70 -3 -26 11 -5 10 25 -11 2 1 16 34
6733 34 -38 9 0 -26 -6 -9 33 16 3 26 -29 27 13 -9 -12 49 46 -10 -1 66 23 -15 26 61 32 -57 0 -24 -20 -60 -20 -11 -30 -11
6767 -11 -90 -15 9 -35 -83 17 -10 -41 -14 53 7 27 40 24 -1 -28 -6 -13 29 -4 -58 -25 14 40 -12 24 -6 -20 -22 26 -6
6798 -6 -16 -71 -22 19 17 -23 -10 24 -5 1 -2 37 26 19 -17 -4 6 3 10 26 38 -35 16 23 29 20 14 35 -5 -29 0 17 66 1 -28 40
6834 40 -6 -6 28 26 48 -17 -40 -39 -53 -4 28 -50 44 -61 -27 -29 -20 41 -1 49 21 26 -38 -5 6 -31 -11 -15 48 15 6 11 26 8
6868 8 76 14 9 8 37 -57 32 24 43 14 -42 26 34 61 20 28 -7 -63 -10 -48 1 -2 12 9 -11 -14 -13 -18 11 9 -60 30 6 10 42 -9 -15
6905 -15 -7 -63 -16 -20 42 -100 43 -17 13 -47 -5 -36 7 23 2 34 -35 3 -24 48 30 5 26 -29 18 15 -46 16 40 -41 -2
6936 -2 6 -3 2 -5 32 10 28 -16 2 9 -25 -14 -12 -8 26 9 7 -58 27 -11 -23 16 3 23 -20 -16 -37 -17 35 6 19 -75 -18 20 39
6971 39 -41 14 -3 -33 -17 -21 6 -40 -27 -97 -66 60 7 -13 -11 23 27 15 -4 -23 -43 -2 54 0 7 -10 9 -45 -8 -1 32 -8
7003 -8 -10 3 -51 -47 22 -14 14 27 -32 10 7 1 11 7 -9 -46 -40 45 22 11 -41 12 3 23 7 -10 38 30 12 -23 59 28 92 -40
7037 -40 55 46 50 -1 -2 22 21 -7 -14 9 71 16 -23 -6 7 -71 -5 44 -35 -17 -50 45 -11 -48 -19 15 -52 6 7 9 -21 -22 5 -13
7071 -13 7 -16 45 6 -10 7 29 25 -5 -25 -68 9 12 -32 -20 -4 21 -4 -15 6 28 39 21 -23 12 24 -82 -12 -19 52 -18
7102 -18 3 28 9 21 9 7 -28 9 4 35 24 45 23 11 17 -22 18 4 -2 12 26 1 -2 -7 -15 41 41 -53 -12 -15 7 -18 -8 33 8
7137 8 -28 -72 -53 -22 23 3 -26 -2 43 6 -19 50 10 -29 1 16 20 3 -5 -30 42 7 2 -9 -3 -2 -30 8 3 -30 56 20 13 41
7171 41 3 7 8 19 22 -3 -39 34 -11 -59 11 33 2 -32 31 16 18 5 -11 14 9 -60 36 15 -18 28 41 50 52 27 2 40 -5 -11
7205 -11 -30 18 44 -49 -25 -14 13 25 18 22 49 43 7 23 10 -4 22 -9 25 16 -74 -45 -24 -56 -14 -2 20 13 -24 -1 7 51 -7
7238 -7 1 -13 -2 27 -4 42 3 -31 -2 20 53 13 28 -15 17 11 -9 30 35 34 -13 -33 -33 14 -39 27 -44 12 -22 -9 -17 -7 -27 -24
7272 -24 -2 -2 -24 -46 -72 29 10 15 65 -17 9 -19 -5 -3 19 -4 57 5 8 -51 4 -13 13 7 -1 -2 74 0 -16 -33 -15 25 -16
7305 -16 -2 -39 69 -10 -47 11 -22 17 -38 -5 39 36 9 -37 -4 19 26 -35 16 15 7 11 -4 18 6 -33 -27 7 -13 -2 41 -47 -15
7338 -15 1 -9 50 24 7 49 -9 -28 -11 30 30 -18 -10 11 22 34 2 3 -34 -44 59 32 62 32 20 34 26 0 -24 9 40 -26
7370 -26 2 -14 -16 4 -5 -2 4 27 2 11 -41 32 2 9 -19 62 -40 -49 2 58 -22 -43 -3 -37 14 -43 -53 1 -12 -16 -4 8 -6 0
7404 0 -24 -42 43 -49 -23 19 50 -6 42 5 36 15 -4 -49 40 22 21 56 -4 70 13 39 -32 -5 -23 -35 7 10 -6 2 29 -27
7436 -27 22 4 -17 17 -28 11 12 34 -53 -21 46 27 65 16 3 15 -9 54 -25 -9 59 -13 -27 -7 -29 1 -2 -5 10 -2 -28 -30
7468 -30 -20 7 -35 32 71 33 -43 -65 50 -28 -21 8 27 27 7 -58 18 -1 -112 -16 -34 -14 7 -26 36 18 -17 46 52 20 9
7499 9 -47 25 27 29 -17 20 7 4 -32 -7 38 29 -7 -9 6 -6 -13 -40 -36 -9 -37 -24 -26 31 -68 8 5 31 20 -44 23 -38 -3 -45 -50 13
7535 13 7 -16 -12 9 -13 17 -14 13 -22 16 22 37 43 -32 -10 -8 39 14 -20 2 22 -48 11 -5 88 -11 -2 -2 36 -16 -23 -55 55 3
7569 3 -21 32 36 4 2 -44 42 -21 -58 4 82 28 48 36 -33 3 19 2 20 32 -81 -8 5 30 -43 -8 21 1 11 -33 -4
7600 -4 30 -60 -25 8 -17 -17 -28 -73 70 10 -48 21 10 6 -36 1 29 39 8 -20 23 -47 -8 45 -7 42 14 35 14 83 28
7631 28 -20 -28 -25 -31 -5 20 0 -18 -27 -29 40 -24 -6 0 -7 -35 22 -50 -31 65 -22 0 -4 -20 -27 -10 48 39 -18 -7 -16 9 -20 10 -7 -5
7667 -5 17 10 -38 39 -61 -55 -15 -32 -53 -25 -51 -44 16 -7 29 -3 -22 -15 -33 -37 20 -56 -20 -35 -38 -22 -36 -22 -34 9 -6 -32 3
7700 3 70 5 18 37 -32 -44 9 8 20 -23 -1 -16 31 -41 -13 30 -7 -6 -5 -1 29 -13 -6 -4 0 -25 -56 -35 -24 -39 -1 -29 6 -5
7734 -5 6 -27 18 7 -22 -18 -34 34 -86 13 -75 14 -32 -26 -35 44 -1 -14 -16 11 41 -40 19 32 13 -14 28 -47 9 21 -52 -5
7766 -5 -21 19 -21 59 17 -10 -25 -12 77 44 15 -70 -6 -27 -75 56 25 37 26 20 67 7 1 35 30 23 14 57 41 22 -7 -6 36
7799 36 14 -5 -6 39 -2 11 -27 10 -49 -38 -18 48 17 37 -40 -55 4 -27 14 29 -11 1 -18 -73 67 17 -26 -67 5 7 38
7830 38 -23 -15 41 3 -36 -57 26 53 -22 45 69 7 -53 -1 19 22 -8 -41 14 -31 -26 -3 -16 23 36 -11 -12 -3 -48 -48 16 -39 -48 -28
7864 -28 -14 -12 2 21 18 51 10 36 -9 7 23 -10 -6 15 -58 -22 35 11 38 -58 -16 13 -27 -43 4 21 30 25 -38 -53 28 13 -40
7897 -40 -27 0 45 -47 -42 -47 -23 -36 38 9 39 13 4 -5 25 -21 -38 -29 59 -9 -31 59 -17 82 1 12 -47 51 -24 32 52 -38 -44
7930 -44 15 19 -27 11 1 -45 -36 -40 -54 -59 13 -27 36 16 10 56 -16 -9 20 -46 43 41 -8 4 5 66 -11 -9 -22 14 44 11 -20 -9 15
7965 15 -37 40 -7 -17 6 -20 19 -29 -8 -18 11 -12 -10 7 -2 -66 15 -28 -51 54 51 56 -27 27 -14 69 -14 20 56 -17 -1 14
7997 14 19 54 4 25 38 6 27 -24 -26 -41 10 16 -3 -1 -46 -40 -36 15 1 -34 -46 -35 21 -7 60 20 0 -44 -39 -17 -2 -66 0 55
8031 55 2 -17 -8 13 10 -19 34 25 26 -8 2 11 -9 -21 -15 23 5 -16 -2 -17 11 -5 -29 -9 19 -35 -56 30 56 18 -50 -42 19 4
8065 4 -42 36 50 42 -50 -38 25 -38 -1 25 -23 55 35 9 -30 5 19 13 2 -1 12 4 -2 27 37 -38 -28 54 38 -16 -2 42 47 -2
8099 -2 36 -12 20 15 5 -2 -10 -17 -13 6 -24 -4 -21 -13 50 -4 43 -7 -47 18 -15 -19 -43 -59 4 4 2 -71 -3 -24 -20 22 -2 17 -2 -54
8135 -54 30 -32 -10 65 -3 12 -48 11 17 -60 -37 19 33 -10 -38 -8 -52 24 4 50 4 14 43 1 3 -18 23 59 47 -31 1
8166 1 -14 3 26 13 -18 18 -22 38 -3 -22 14 0 31 32 35 -21 -20 10 -33 16 -6 14 -10 -55 0
8191@
$$ Imaginary data points
##PAGE= N=2
##DATA TABLE= (X++(I..I)), XYDATA
0 0 0 0 0 0 0 0 0 0 0 0 -8 8 -8 8 -8 16 -16 24 -24 32 -40 48 -56 64 -72 88 -104 120 -136 155 -176 202 -232
33 -232 259 -296 331 -371 416 -464 516 -576 637 -707 784 -867 955 -1055 1163 -1280 1412
50 1412 -1554 1710 -1885 2081 -2298 2544 -2823 3147 -3520 3962 -4492 5140 -5956 7017 -8453
65 -8453 10520 -13743 19511 -32901 124068 30743 -137299 50281 -69898 149729 -43363
76 -43363 -127860 118405 -2009 -3899 -49854 -27756 120450 -45842 -37679 -18121 39549 42977
88 42977 -76068 30690 5577 -6789 10146 -45921 78014 -26755 -49426 43846 -6215
99 -6215 27491 -50598 -6110 66888 -32920 -23595 -20730 66237 14246 -84049 18018 18896 58789
112 58789 -51635 -77606 107507 -9168 -11427 -36396 -24187 129373 -81966 -41732 47923
123 47923 -12554 69913 -103025 -4359 98300 -63242 21092 -44531 22821 69166 -97924
134 -97924 32602 15839 -6943 20280 -63049 54817 9095 -39166 15608 -11331 37889 -31708
146 -31708 -18651 39820 -13940 5630 -33122 23091 35098 -50439 8430 3006 24647 -2452
158 -2452 -51814 41507 12121 -10237 -20080 -9523 53233 -25560 -20731 2613 15474 29454 -60072
171 -60072 13990 27086 -12052 12906 -50432 43511 21164 -51812 30079 -21103 28323 4233
183 4233 -54828 53411 -13057 -6160 7996 -30347 47454 -23699 -15024 24463 -17496 22589
195 22589 -24652 2196 25560 -25959 12688 -10987 10817 9757 -30053 22281 -3444 101
207 101 -290 -16902 27798 -12202 -7455 5974 -4651 18242 -20826 1013 12440 -6496 7372
220 7372 -17590 13426 5967 -13489 9793 -12698 15757 -3158 -14985 18591 -14698 11147
232 11147 -2925 -12974 21718 -17922 9025 1679 -13466 20743 -16519 7330 3309 -13735
244 -13735 19946 -14506 3431 4055 -10399 16836 -15782 2845 7577 -9517 10512 -13706 7271
257 7271 7686 -13293 7894 -5690 8329 -40 -13269 13511 -2407 695 -4243 -4206 15843 -10100
271 -10100 -4012 2771 2729 6503 -16661 5282 9485 -4880 -1838 -8609 15189 2207 -15413 4845
285 4845 3713 8301 -10738 -9579 17685 -590 -6701 -7666 6069 15067 -16345 -6195 9387 7177
299 7177 -2839 -17549 11326 13126 -10026 -8342 592 17888 -4241 -18630 8379 11456 -273
312 -273 -15883 -1955 20485 -3061 -15584 -1571 15243 6292 -20134 -3176 17396 4752 -14335
325 -14335 -9993 18140 9534 -17431 -8886 13436 13584 -14323 -15447 14745 13930 -11501 -16358 9673
339 9673 18518 -10019 -18285 7919 19247 -5362 -20614 4515 21047 -2513 -20768 585 21232
352 21232 1083 -21401 -2700 21148 4265 -21023 -6773 20882 8546 -21040 -9141 18996
364 18996 11240 -17240 -14239 18586 14705 -17131 -14896 13888 18921 -14133 -19650 13415 17651
377 17651 -8106 -21587 6793 24277 -9745 -19981 4527 20479 1350 -26426 2371 23574
389 23574 -1218 -17923 -7462 23556 7012 -25587 -2253 17491 9211 -17894 -14977 23535
401 23535 9410 -18377 -10818 13030 18435 -18049 -16000 17459 13532 -10485 -19829 12102 21624
414 21624 -13547 -17902 7442 21112 -5734 -23776 6674 21068 -2375 -23158 520 24156
426 24156 -762 -19727 -6058 22237 8803 -25428 -3175 16933 9050 -13653 -17800 22639
438 22639 10164 -17950 -7009 5681 19957 -12926 -19583 18978 6860 -5198 -13696 2372
450 2372 23959 -14723 -12913 9428 9713 2252 -23039 6697 20753 -10947 -9997 -2966 18750 3735
464 3735 -26466 5873 15870 1402 -13710 -11648 23099 6703 -20316 -4826 12630 12538 -13444
477 -13444 -14656 14102 13934 -11614 -14145 9598 12243 -3976 -15525 2162 19353 -8358 -10925
490 -10925 3633 6550 7282 -17934 612 17239 -9000 -2130 -4418 7432 9116 -20065 5930
503 5930 8817 -3744 -1379 -10801 16139 2223 -16557 6209 1736 9049 -9170 -12528 20590
516 20590 -1893 -6777 -3890 -16 18998 -14302 -10002 12767 1005 3205 -13725 -773 18789
529 18789 -8723 -7531 1663 4795 7000 -11424 -4500 11896 813 -6540 -1500 1838 6079 -2298
543 -2298 -8812 7621 1988 -4673 2667 -5018 5801 352 -7633 8735 -4757 -287 3728 -5814
557 -5814 8011 -6948 -896 9072 -8286 4212 -3992 777 9515 -13129 4097 2514 -1965 5961
571 5961 -12759 7023 5621 -8107 5217 -7757 6514 5225 -12120 6970 -2300 1337 5107
584 5107 -11388 6184 2065 -3346 4360 -7908 3322 5915 -5845 873 -2032 1556 6525 -7078
598 -7078 -3223 6304 470 205 -4499 -2750 10883 -2581 -7546 3315 640 5875 -5207 -7607
612 -7607 10720 -537 -2908 -1768 -2038 9980 -5733 -4557 5320 -1283 3843 -6465 347 7817
626 7817 -7786 2560 -337 -152 4633 -10395 6870 4189 -8784 3928 -2692 5813 865 -12861
640 -12861 9856 4071 -5074 -1769 -4213 12064 6 -13809 5017 6480 1415 -6865 -7059 12424
654 12424 4333 -11514 -2801 6709 6873 -6101 -9973 8359 8419 -7102 -6643 3103 9113 -2244 -11275
669 -11275 4666 8288 -3192 -6491 -978 10053 -588 -10843 3532 6310 355 -7185 -3453
682 -3453 12447 -1037 -10209 1954 5747 4842 -10017 -5494 14135 174 -8601 -3409 5996 10240
696 10240 -12059 -7703 12152 3998 -5180 -9726 5233 13672 -9676 -9288 6403 8457 -1270 -13292
710 -13292 3231 13142 -4425 -9667 217 11051 1541 -13460 305 11442 836 -9950 -3654
723 -3654 11528 3902 -11602 -3597 10187 5285 -9651 -6741 9876 7382 -9529 -7763 8519
736 8519 8211 -6958 -9722 6347 10900 -6847 -9868 5195 9786 -2496 -12124 3243 12115 -3818
750 -3818 -9570 490 10702 1214 -13279 1050 11022 118 -9165 -3937 11912 3234 -12126
763 -12126 -2024 8887 5395 -9539 -7080 11300 5336 -8557 -6865 6916 9844 -8634 -8551 7121
777 7121 8079 -3838 -11155 4630 11135 -5056 -8896 1692 10118 -436 -11548 1532 9817 40
791 40 -9342 -1699 10387 1219 -9213 -2221 8670 3711 -9719 -2938 8344 3568 -6847 -6248
805 -6248 8570 5530 -8396 -4177 5190 6924 -5228 -8543 6877 6586 -4699 -6877 2683 8929
819 8929 -3537 -8152 2644 7467 -694 -8827 1050 8144 -506 -6865 -1799 8409 1453 -8242
833 -8242 -479 5730 3019 -6141 -4411 7870 2521 -5961 -2946 4094 5308 -5320 -4996 5285 3989
848 3989 -3529 -4962 3237 5440 -3089 -4925 2015 5774 -2148 -5535 2200 4181 -246 -5027 -371
863 -371 6179 -1069 -4684 218 3717 1651 -5035 -1143 4835 576 -3373 -1957 3604 2309 -3891
878 -3891 -1889 2900 2549 -2893 -2744 2949 1928 -1558 -2780 1061 3839 -2407 -2354 1758 1304 434 -2924
895 -2924 -2 3602 -1590 -1503 461 838 1267 -2513 -311 2468 -866 -652 -316 585 1087 -1842 -26
912 -26 1203 -378 -98 -582 739 496 -1197 484 299 -56 -55 -606 893 -212 -636 549 -329 362 -219
931 -219 -295 1028 -852 -138 1017 -685 -30 192 46 862 -1225 -604 2095 -600 -1283 353 358 1645
949 1645 -1887 -1694 3327 -308 -1262 -787 98 4002 -3007 -2438 3187 249 636 -3408 -230 5360 -2969
966 -2969 -1839 458 1571 2563 -5376 391 3896 -1290 -557 -2883 3494 2458 -5266 1266 1209 1356
982 1356 -867 -4158 4918 910 -3817 396 638 3264 -2639 -3780 4739 1451 -2806 -2371 1950 4239
998 4239 -2894 -4383 3073 4359 -2688 -4133 1231 4855 60 -7251 1450 6172 -1675 -3365 -2711
1013 -2711 5934 3299 -8504 659 3913 1985 -2163 -6577 7226 2785 -5550 -504 -255 6524 -3333
1028 -3333 -6623 6805 329 -596 -3430 -957 8555 -5616 -3280 3670 807 2372 -7458 1727 7461
1043 7461 -5348 -1845 -337 4664 1986 -9177 2456 5864 -1200 -4280 -2789 7181 2074 -7349
1057 -7349 -1817 6061 3223 -6124 -3435 4776 5297 -4726 -6608 6270 3999 -3007 -4987 260 9185
1072 9185 -4214 -6158 3599 2445 2766 -7784 -525 9017 -4270 -1977 -1557 3636 4640 -9823
1086 -9823 2486 4444 -1497 -374 -6096 7984 1741 -8626 3420 629 4055 -3680 -6708 10084
1100 10084 -357 -4326 -1551 908 8256 -6705 -5128 6203 2357 -825 -7079 2304 7694 -3733
1114 -3733 -5014 413 6671 -281 -6854 589 5016 2257 -6908 -1223 6477 -98 -2679 -4236 5032
1129 5032 4183 -7468 533 1866 2731 -1228 -6951 7122 1241 -3942 -59 -1409 7192 -4339 -4921
1144 -4921 6536 -1073 1236 -4913 190 8504 -6717 -1009 1195 1882 3411 -9378 3409 5281
1158 5281 -3445 -342 -4201 6485 2006 -7990 2392 1845 2637 -3053 -4665 6506 738 -2861 -2556
1173 -2556 1807 4803 -4305 -2079 1655 3013 -478 -5401 3593 1874 -1199 -1496 -1830 5870 -2249
1188 -2249 -3139 2574 -250 2740 -4482 -171 4989 -3519 484 -1814 2224 2718 -6435 3015 888
1203 888 -94 256 -4847 6190 -523 -3546 2105 -1998 4936 -3088 -3561 5527 -2094 1095 -2418 -796
1219 -796 5435 -4252 -40 629 326 2298 -4529 1920 1585 -1184 390 -2372 3317 -635 -1878 1471
1235 1471 -1191 2472 -2340 -617 2795 -2278 1471 -1523 484 2082 -3333 2109 -552 60 1002
1250 1002 -2929 3098 -1134 -733 1348 -2144 2988 -2073 -407 2237 -2584 2555 -1948 89 2277
1265 2277 -3390 2807 -1253 -469 2117 -3080 2821 -1090 -954 2325 -2523 1993 -1165 -414 2268 -2668
1281 -2668 1509 -667 145 1196 -2808 2434 -541 -432 607 -1896 3048 -1527 -1035 1656 -1142 1958
1297 1958 -2369 -41 2581 -2159 816 -1377 1070 1625 -3459 1502 299 456 -221 -2378 3212 -518
1313 -518 -1154 143 -422 3108 -2741 -957 2384 -672 860 -2715 1160 2803 -2993 183 -235 1875
1329 1875 430 -3829 2390 984 -494 -1127 -1315 3810 -1096 -2230 722 880 1783 -3428 -291 2995
1345 2995 -741 -773 -2071 2548 1842 -3683 291 1054 1673 -1207 -3169 3412 1050 -1736 -1341 460
1361 460 3477 -2272 -2246 1750 1527 136 -3640 1156 3177 -1703 -1604 -590 3227 261 -3944 1174
1377 1174 1994 649 -2586 -1696 4211 -218 -2623 -488 1668 2502 -3565 -1456 3145 799 -1564 -2619
1393 -2619 2446 2667 -3020 -1526 1331 2710 -1207 -3504 2228 2423 -1209 -2571 317 3578 -1001
1408 -1001 -3079 648 2684 294 -3451 -81 3292 173 -2769 -892 3225 746 -3165 -767 2481
1423 2481 1659 -2985 -1640 3020 1318 -2091 -2326 2270 2736 -2858 -1885 1858 2296 -1023 -3395 1868
1439 1868 2861 -1584 -2233 363 3298 -478 -3574 1087 2494 -61 -2597 -792 3533 139 -3118
1454 -3118 62 2216 1047 -2593 -1491 3177 885 -2680 -921 1863 1972 -2322 -2302 2817 1525 -1955
1470 -1955 -1793 1100 2952 -1828 -2793 1955 1878 -584 -2609 254 3472 -1088 -2470 640 1928 749
1486 749 -2931 -307 2961 -347 -1856 -678 1957 1237 -2719 -501 2195 423 -1419 -1270 1756 1599
1502 1599 -2296 -1102 1949 950 -1188 -1669 1214 2265 -1956 -1585 1506 1139 -153 -2592 638 2879
1518 2879 -1668 -1266 185 1430 1177 -3242 487 2387 -880 -427 -1546 1858 1404 -2998 644 745
1534 745 451 -158 -2332 2318 603 -1773 490 -346 1662 -729 -1815 2060 -9 -449 -505 -159 1869
1551 1869 -1191 -1094 1091 359 -86 -1164 159 1514 -542 -1153 448 949 -134 -812 -537 1455 263
1568 263 -1697 591 329 456 -297 -1564 1904 3 -1109 623 -885 1592 -638 -1425 1921 -1070
1584 -1070 528 -156 -1202 2243 -1548 25 956 -1496 1658 -1213 -70 1327 -1861 1290 -366
1599 -366 -441 1000 -1518 1314 -54 -1043 1037 -759 741 -170 -862 1278 -386 -14 -111 -167 718 -519
1617 -519 -243 305 125 -123 -157 169 -61 309 -534 322 357 -866 796 -353 11 393 -1226 1473 -488
1636 -488 -844 1074 -983 1311 -793 -1188 2211 -1144 277 -260 -658 2287 -1906 -195 1094 -647
1652 -647 1268 -1886 390 1737 -1597 345 -588 821 897 -2122 915 509 -118 -93 -1158 1641 20
1669 20 -1233 350 175 761 -999 -621 1146 113 -596 -637 893 500 -851 -413 449 1170 -1116 -727
1687 -727 1149 174 129 -1506 631 1867 -1620 -224 66 893 647 -2602 1140 1229 -824 -163 -1217
1704 -1217 2095 356 -2274 897 381 924 -958 -1401 2388 -107 -951 -405 288 1866 -1805 -762
1720 -762 1404 215 -100 -1683 893 1552 -1528 -478 281 1194 -225 -1816 954 1115 -352 -1202 76
1737 76 1646 -405 -1263 -56 1413 323 -1937 299 1235 252 -987 -1139 2035 333 -1589 -64
1753 -64 586 1496 -1457 -1271 1854 287 -588 -1227 563 1926 -1586 -915 721 908 19 -2046 885
1770 885 1343 -741 -776 -356 1843 -97 -1841 618 857 338 -1342 -665 1951 -190 -1192 -268 889
1787 889 1037 -1587 -545 1292 479 -827 -1112 1205 876 -1127 -702 635 1365 -960 -1213 1028 745
1804 745 -320 -1358 351 1559 -833 -919 184 1098 285 -1759 394 1281 -198 -939 -491 1452 239
1821 239 -1351 -80 826 617 -1210 -692 1374 224 -675 -769 817 1067 -1187 -537 768 655 -356
1838 -356 -1164 814 913 -742 -708 173 1101 -340 -1118 454 739 -28 -1041 6 1192 -204 -823 -111
1856 -111 914 284 -1130 75 807 204 -693 -491 946 314 -841 -278 565 630 -648 -581 675 424
1874 424 -380 -650 432 758 -601 -430 302 535 -107 -828 378 608 -251 -511 -39 687 -82 -673 194
1893 194 322 115 -500 -211 679 -23 -516 -35 425 265 -493 -72 548 134 -392 -253 373 285 -459 -247
1913 -247 385 247 -254 -308 234 360 -316 -272 306 178 -98 -213 16 452 -262 -280 239 0 64 -269 7
1934 7 349 -265 -54 152 70 141 -308 178 385 -244 28 55 69 112 -332 156 281 -263 -14 -46 159 76 -355
1957 -355 235 178 -134 46 -125 281 39 -396 263 60 -5 -54 -203 450 -102 -370 254 -53 146 -199 -289
1978 -289 609 -265 -245 257 -84 334 -343 -179 648 -289 -153 62 21 387 -533 -138 642 -229 -164 -222 192
1999 192 474 -576 -241 500 56 -61 -371 182 579 -529 -299 214 123 74 -643 144 634 -524 -181 38
2019 38 216 244 -713 209 585 -296 -78 -223 462 333 -894 295 430 -251 -4 -632 700 296 -932
2038 -932 264 140 258 -144 -866 891 240 -634 110 -52 678 -214 -884 804 162 -337 -206 -213 890
2057 890 -267 -871 467 259 -12 -392 -317 976 -137 -618 233 244 287 -471 -351 900 0 -447 -67
2076 -67 169 492 -555 -462 758 -49 -268 -229 57 809 -611 -431 638 -30 79 -555 83 1057 -751
2095 -751 -317 342 4 405 -950 51 944 -728 -210 -103 314 577 -1060 144 684 -248 -19 -483
2113 -483 533 573 -936 104 338 145 -53 -687 520 469 -639 -42 128 380 -70 -679 471 390 -336
2132 -336 -160 -104 579 33 -695 373 323 -237 -217 -277 633 70 -796 277 292 9 -228 -520 773 183 -705
2153 -705 240 50 370 -151 -673 829 17 -353 33 -199 650 -349 -647 710 -127 -22 -210 -204 794 -440
2173 -440 -289 359 1 213 -517 -13 654 -388 -163 -64 212 271 -583 39 430 -107 -128 -180 352 236 -406
2194 -406 -46 330 105 -183 -196 226 321 -398 -89 305 12 -40 -281 87 372 -475 -114 197 -56 208 -478
2215 -478 110 497 -489 102 -50 146 224 -661 260 236 -261 106 -381 298 110 -445 314 -72 142 -47 -263
2236 -263 504 -138 -173 125 -54 304 -273 -60 310 -153 100 -218 121 244 -351 4 119 105 -104 -189 214
2257 214 79 -90 -146 105 190 -235 -39 -50 151 3 -302 218 -13 -75 -33 -176 343 -120 -200 263 -110 252
2279 252 -113 -139 436 -255 11 60 -39 204 -370 145 174 -187 44 -234 279 -2 -323 169 -131 153 -102
2300 -102 -208 423 -123 22 28 -9 311 -374 -29 144 -114 -3 -309 201 200 -238 46 18 258 -121 -179 254
2322 254 -1 69 -244 -7 290 -311 47 -25 96 209 -398 162 168 -118 79 -201 333 -17 -321 171 -16
2343 -16 278 -137 -224 362 -151 -29 -93 48 264 -366 11 85 2 86 -291 313 149 -184 117 -18 308 -65
2365 -65 -308 324 25 66 -176 -66 357 -212 -78 5 119 127 -333 105 128 -101 -22 -190 304 -16 -239 57
2387 57 -4 239 -200 -143 304 -166 14 -191 23 290 -307 47 -12 40 104 -322 275 173 -118 58 -152 332
2409 332 -58 -261 254 -68 96 -150 -135 316 -183 -25 -24 -40 200 -279 15 121 -73 34 -186 158 59 -207
2431 -207 64 -58 127 -80 -162 147 57 12 -155 65 126 -106 -13 -59 159 18 -188 177 6 17 29 -156 308
2454 308 -68 -45 44 -185 266 -200 -74 206 -242 156 -151 -47 265 -293 142 -4 -60 194 -229 150 63
2475 63 -203 104 -124 85 28 -164 133 -34 -5 83 -93 152 -26 -92 69 -23 80 24 -9 65 35 -10 67 -4
2499 -4 29 85 -88 36 86 -165 91 -100 -74 132 -120 139 -53 -11 178 -150 128 44 -156 189 -121 13 131
2522 131 -250 182 -112 -18 185 -310 178 56 -145 211 -299 142 117 -227 207 -58 65 52 -187 161 24
2543 24 -92 144 -195 73 16 -149 135 -46 -30 103 -118 125 47 -124 205 -136 49 12 -127 230 -61 -147
2565 -147 188 -138 30 7 -137 264 -53 -169 168 -113 243 -65 -157 386 -83 41 7 -159 319 -120 -161
2586 -161 124 -81 143 -128 -172 262 -142 -11 78 -118 306 -136 -42 196 -127 80 -80 -65 213 -271 29
2607 29 191 -96 92 -231 20 272 -329 34 112 -80 144 -265 81 233 -170 88 -58 79 128 -321 77
2628 77 172 -116 35 -212 128 226 -256 49 44 28 71 -224 156 167 -193 44 -17 89 24 -301 57 100 -169 81
2652 81 -160 123 172 -243 200 68 20 67 -218 232 84 -298 160 9 76 -36 -253 302 27 -145 43 -165
2674 -165 254 -141 -320 293 -43 69 -49 -92 350 -100 -196 93 15 110 -158 -99 167 -99 -141 -50 44 146 -138
2697 -138 -149 184 66 -102 -78 59 183 -24 -158 80 93 -53 -49 -29 274 -100 -179 103 50 39 -194 -61 275
2720 275 -97 -106 -31 61 244 -288 -52 233 -15 28 -241 95 275 -290 -80 67 121 60 -344 127 187 -123 -90
2743 -90 -53 272 37 -219 83 167 55 -178 -93 194 27 -89 -99 129 131 -173 -96 117 180 -130 -132 159 129 -68
2767 -68 -145 49 254 -204 -130 50 135 126 -297 50 216 -68 -63 -125 290 84 -285 65 131 123 -157 -203 338 51
2791 51 -186 -22 86 242 -212 -229 204 131 -93 -215 62 261 -144 -130 -24 233 23 -252 41 192 25
2812 25 -205 -29 304 4 -196 -58 195 125 -260 -82 207 105 -108 -207 209 202 -179 -94 76 262 -145 -230
2834 -230 178 130 -53 -216 -14 299 -85 -202 13 160 75 -307 -27 240 -13 -137 -139 204 143 -269 -1 175
2856 175 129 -114 -211 176 83 -109 -154 130 217 -184 -169 98 169 -1 -275 85 223 -102 -106 -4 231 35 -281
2879 -281 53 107 72 -176 -49 231 23 -129 -99 188 172 -243 -81 163 85 -111 -213 190 89 -120 -86 -55
2901 -55 230 -57 -241 119 63 56 -136 -59 200 -52 -130 44 147 181 -162 -38 172 30 -53 -160 106 88 -152
2924 -152 -78 14 140 -88 -151 146 120 -46 -118 19 195 -41 -144 -14 132 89 -194 9 104 16 -44 -97 141
2947 141 -25 8 -70 7 174 -65 -86 114 62 38 -131 11 110 -89 19 -46 85 79 -165 4 95 11 -44 -109 131
2972 131 77 -176 27 17 73 -44 -157 99 89 12 -78 -23 122 -18 -179 44 56 14 -35 -87 178 119 -172 -40
2996 -40 118 79 36 -161 94 153 -127 -70 -52 125 47 -194 76 111 -44 -103 -63 170 35 -210 26 73 84 -46
3020 -46 -220 144 26 -165 23 31 232 -63 -206 161 22 -49 -39 -19 283 -106 -202 163 155 55 -215 18 267
3043 267 -24 -230 -24 201 148 -246 -171 249 23 -98 -130 47 265 -213 -178 223 181 -54 -183 39 281 -121
3065 -121 -207 70 168 29 -261 -20 278 -93 -173 -43 185 165 -271 -17 280 25 -161 -135 230 255 -313 -88
3087 -88 264 134 -91 -335 211 288 -215 -213 87 244 -27 -421 97 333 -76 -169 -59 346 106 -422 39 309
3109 309 15 -199 -158 288 189 -353 -106 151 109 -204 -301 308 166 -225 -114 83 318 -150 -226 201 216 -109
3131 -109 -206 74 328 -113 -342 125 275 -23 -274 -96 464 4 -350 -54 201 141 -284 -206 402 79 -276
3152 -276 -127 197 341 -303 -295 265 129 -169 -249 68 358 -138 -258 186 210 4 -328 17 431 -113 -255
3173 -255 26 186 88 -310 12 290 14 -222 -72 306 183 -318 -146 231 57 -198 -240 185 252 -268 -149
3194 -149 248 228 -141 -341 137 273 -177 -269 105 272 11 -329 141 314 21 -210 -130 317 149 -335 -9
3215 -9 220 79 -202 -150 320 132 -214 -91 132 183 -153 -181 234 168 -138 -163 87 244 -82 -210 127 146 -18
3238 -18 -158 27 290 -55 -241 34 190 46 -209 0 194 79 -225 -41 210 121 -182 -113 172 84 -177
3259 -177 -136 135 141 -140 -180 137 100 -79 -164 -42 144 -33 -198 28 34 -29 -189 -93 205 -15 -60 -35 70 58
3283 58 -131 -97 90 18 -117 -95 73 106 -94 -50 66 77 -67 -128 78 104 -11 -11 -67 127 27 -90 5 111
3307 111 14 -55 -5 13 35 -75 -47 45 26 -32 -3 -25 126 -35 -60 3 44 57 -116 13 90 47 -10 -8 55 134 -25
3334 -25 -42 37 73 -51 -104 14 62 -33 -93 -48 111 55 -99 22 114 71 -114 -45 105 49 -66 -99 89 123 -42
3359 -42 -114 47 122 -71 -149 30 135 -44 -140 24 85 30 -65 -19 197 140 -193 -70 143 51 -107 -136 159 145
3383 145 -114 -64 101 151 -128 -219 136 146 -44 -178 69 226 -102 -211 39 176 10 -259 30 193 12
3404 12 -224 -100 259 82 -263 -85 184 103 -153 -212 175 145 -132 -199 167 234 -111 -183 156 259 -135 -251
3426 -251 128 205 -50 -302 -16 278 -73 -333 23 279 42 -329 -40 255 41 -226 -68 294 145 -252
3446 -252 -78 251 162 -224 -224 256 202 -224 -217 150 275 -124 -263 155 297 -119 -330 77 330 -68 -319 2
3468 2 314 2 -307 -11 350 43 -351 -57 278 122 -380 -129 293 146 -260 -162 274 200 -228 -206 260 250
3490 250 -190 -246 162 326 -138 -332 149 291 -76 -279 68 373 -92 -310 40 314 46 -337 -72 381
3510 381 31 -297 -105 266 143 -356 -112 266 104 -206 -207 272 294 -264 -221 201 190 -134 -261 122 306 -206
3532 -206 -253 39 278 -72 -279 42 352 6 -254 31 299 84 -289 -28 265 31 -227 -128 340 188 -295
3553 -295 -98 191 196 -213 -181 255 233 -202 -173 79 255 -74 -298 205 215 -53 -225 -45 250 -24 -286 81
3575 81 222 -32 -217 -156 243 38 -192 26 135 131 -183 -150 182 36 -141 -81 82 164 -112 -153 219 136 -117
3598 -117 -151 53 230 -160 -196 135 128 -57 -166 -15 209 -62 -194 -22 34 107 -181 -121 191 11 -72 -105 99
3621 99 156 -103 -73 94 7 29 -186 64 153 -82 -87 109 44 27 -143 -5 120 -94 -69 -66 41 -7 -156 35 98
3646 98 10 -56 -53 22 32 -64 -25 23 -6 -5 -33 51 87 -60 -51 -8 51 18 -95 35 44 1 18 -69 14 70 -60 -8 -58 89
3676 89 82 -91 42 101 -17 -81 -99 66 71 -132 -18 50 -6 -5 -98 12 134 -12 -83 22 108 -15 -141 34 128
3701 128 -3 -108 -39 132 80 -139 -18 127 45 -123 -116 83 153 -105 -64 61 145 -59 -138 124 105 -86 -104 16
3725 16 114 -41 -227 68 162 24 -218 -57 204 28 -188 -80 120 73 -193 -143 199 124 -162 -133 99 108 -150
3748 -150 -151 189 206 -84 -190 138 188 -111 -215 49 253 -6 -246 -2 233 -15 -253 33 201 34 -305
3769 -305 -75 279 30 -215 -94 235 161 -206 -119 223 147 -198 -172 120 236 -218 -157 120 201 -65 -259 133
3791 133 284 -88 -264 57 285 -16 -301 60 298 26 -245 -27 277 107 -224 -82 267 130 -289 -137
3811 -137 273 154 -228 -171 245 169 -165 -184 155 237 -218 -212 145 280 -111 -251 113 303 -84 -295 78 310
3833 310 -35 -352 32 316 46 -262 -71 307 87 -288 -45 222 186 -235 -174 280 186 -245 -161 187 195 -252
3855 -252 -221 175 228 -97 -247 102 251 -91 -187 50 239 -111 -270 76 243 -4 -320 2 256 54 -223
3876 -223 -74 285 84 -324 -119 207 155 -217 -173 274 124 -207 -114 179 243 -198 -171 49 168 -146 -260 123
3898 123 184 -99 -239 36 272 -6 -235 45 233 64 -222 -13 250 31 -184 -72 198 94 -215 -136 225
3919 225 150 -170 -85 151 172 -145 -136 107 189 -120 -122 109 165 -79 -150 31 180 -62 -213 9 124 -38 -129 15
3943 15 179 21 -106 -29 85 16 -154 -4 119 83 -102 -55 64 26 -62 -91 43 167 -139 -56 48 119 -24
3966 -24 -120 54 163 35 -76 53 52 -18 -129 -67 62 27 -89 -86 43 40 -20 -57 50 18 -72 -50 14 70 -1 -35 65
3993 65 84 16 -10 -22 25 -6 -29 16 -9 28 -7 -26 37 -25 17 -29 7 65 -39 3 -29 8 34 -47 11 -35 -35 21 -60 32
4023 32 52 -29 -54 48 52 -36 -105 -18 76 22 -35 -69 63 43 -73 -27 52 30 -12 -85 38 98 -85 -44 35 51 -52 -112
4051 -112 13 108 -35 -89 -4 114 -32 -167 -22 127 45 -104 -38 120 19 -128 -54 113 94 -115 -99 137 80
4074 80 -181 -58 91 78 -106 -201 128 91 -21 -153 57 212 -84 -150 52 146 16 -175 37 198 32 -146
4096 -146 -20 152 45 -219 -106 233 33 -183 -155 137 139 -145 -107 171 80 -144 -175 120 170 -160 -212 143 108
4119 108 -63 -183 103 213 -46 -178 83 255 -18 -208 -25 292 -47 -155 -9 242 92 -306 -34 195
4139 195 64 -183 -208 207 130 -198 -161 147 166 -168 -217 126 238 -105 -190 115 222 -48 -243 129 214 -39
4161 -39 -197 82 271 17 -251 -4 235 93 -222 -73 289 92 -221 -106 202 163 -216 -209 212 187 -157 -150
4183 -150 89 173 -133 -245 230 232 -176 -239 152 223 -97 -273 66 205 -40 -259 -9 281 -27 -265 -12 204
4205 204 91 -259 -108 200 61 -246 -127 202 146 -168 -110 209 179 -151 -158 152 190 -122 -169 179 140 -80 -233
4228 -233 63 185 -78 -181 66 264 29 -199 50 254 0 -159 -67 226 47 -170 -22 176 29 -168
4248 -168 -91 165 150 -150 -101 120 166 -63 -168 75 208 -87 -154 88 228 -37 -230 85 165 1 -155 -27
4270 -27 208 -30 -138 36 191 56 -106 -17 106 49 -172 -10 89 93 -142 -87 58 50 -111 -61 89 124 -60 -161
4294 -161 114 52 -63 -85 33 112 -37 -98 27 67 17 -73 2 89 -40 -81 -11 110 -18 -48 -46 45 87 -64 -44 96
4320 96 24 -96 -25 27 60 -27 -72 1 61 10 -66 27 93 -3 -40 -17 52 -21 -38 9 56 45 11 39 -18 5 2 -11 0 14
4350 14 27 -34 -77 -14 -25 10 -29 -9 -18 21 -19 -28 75 25 -32 -11 -49 36 -39 -73 47 23 -20 5 64 22 -71 -60 49 84
4380 84 -57 -99 31 111 31 -95 20 49 6 -46 37 129 12 -85 -32 92 -32 -119 -19 92 49 -102 -100 63 75
4405 75 -93 -157 87 119 -58 -118 43 76 7 -128 51 106 24 -136 12 157 14 -105 14 169 42 -126 -15
4428 -15 148 42 -124 -63 123 91 -113 -120 143 51 -167 -137 76 62 -92 -152 78 129 -85 -171 52 146 -87 -205
4452 -205 45 111 -34 -166 26 163 12 -199 -83 218 -27 -156 -31 140 152 -158 -79 212 104 -109 -202
4473 -202 144 171 -138 -113 145 162 -171 -113 143 180 -133 -154 57 191 -41 -202 55 200 -18 -200 15 205
4495 205 40 -185 -21 214 30 -181 -83 183 93 -159 -66 230 168 -94 -95 191 132 -149 -168 149 205 -102 -204
4518 -204 135 182 -98 -140 35 178 -94 -224 7 175 -28 -262 -14 233 26 -219 16 156 14 -181 -15
4539 -15 219 75 -126 -45 214 111 -232 -163 183 198 -146 -148 171 171 -119 -165 84 197 -87 -168 83 190 -88
4562 -88 -181 23 121 -34 -215 -8 201 1 -195 -31 159 35 -248 -69 155 81 -117 -136 143 105 -196 -91
4584 -91 134 140 -100 -137 149 84 -135 -135 54 164 -19 -137 40 187 12 -130 -9 174 12 -111 -75 131 8
4607 8 -136 -31 190 6 -81 -55 126 82 -164 -112 41 -13 -92 -111 73 76 -89 -119 79 107 -57 -100 36 81 -76
4632 -76 -95 34 86 -45 -63 2 96 -5 -95 0 32 54 -54 -26 71 7 -94 -123 5 13 -81 23 51 17 -35 -34 39 59
4660 59 -98 -84 79 53 -53 -34 21 40 -27 -33 7 54 -19 -15 -39 25 -14 28 13 -24 27 -19 16 33 -9 -4 -89 -29 -18 32
4690 32 31 -31 44 66 -40 5 9 -5 -16 -24 -10 35 51 9 -16 21 4 -56 -12 61 27 26 -67 -3 55 -22 -28 -10 73 55 -21 11
4722 11 72 30 -77 -64 46 35 -44 -25 23 39 -127 -76 20 79 -78 -86 33 54 -6 -106 41 53 -14 -71 -8 122 35
4749 35 -35 -6 87 15 -98 -63 113 80 -93 36 56 14 -75 -51 82 149 -64 -71 31 91 -28 -114 45 97 -58 -83
4775 -83 58 130 -22 -138 10 130 -69 -74 13 153 -30 -176 21 145 36 -95 -73 167 27 -180 -6 136
4797 136 60 -136 -138 117 101 -111 -123 96 131 -43 -71 121 124 -49 -68 61 202 -99 -175 13 142 -40 -207 -29
4821 -29 99 44 -179 -23 151 -8 -177 -2 167 53 -146 -44 128 52 -151 -153 116 138 -140 -89 158 152 -101
4844 -101 -159 102 204 -68 -166 88 134 -39 -156 0 153 -40 -165 -59 176 9 -158 -51 204 37 -202
4865 -202 9 126 115 -111 -46 170 76 -100 -76 130 87 -97 -123 131 64 -121 -43 105 158 -42 -107 74 140 -62
4889 -62 -77 47 144 36 -143 55 185 -48 -145 -23 155 29 -158 -27 123 112 -163 -100 115 53 -99 -83 151
4912 151 62 -109 -92 120 116 -81 -121 119 142 -57 -124 60 149 -67 -107 79 133 43 -108 -23 111 -32 -77 2 96
4937 96 55 -156 -52 83 63 -83 -68 108 45 -127 -54 86 47 -30 -114 84 111 -90 -115 41 131 -54 -106 17
4961 17 112 1 -42 16 80 -35 -61 -73 127 33 -75 10 80 3 -68 -17 70 24 -76 -89 2 64 -58 -84 35 53 -39
4988 -39 -69 22 79 -50 -89 -4 104 -35 -59 40 52 -29 -68 -16 62 5 -34 -7 74 -37 1 -81 39 -27 -12 26 42 4
5016 4 -32 -20 -39 -26 -67 -68 33 -21 -25 -7 -64 -12 -39 -31 -50 18 -12 -24 21 -12 41 21 27 -62 -71 23 -23 -22 75 -18 -64 44 19
5049 19 -25 21 -52 -6 9 16 12 0 16 37 37 -29 44 50 12 -37 20 17 -14 -109 -42 42 -23 -27 28 75 -19 -61 19 50 17 -53 -6
5082 -6 46 52 -9 -60 85 85 -31 -14 27 31 -51 -59 94 94 -55 -25 46 90 -91 -111 37 51 -7 -7 54 126 30 -36 -17 62 26
5113 26 -69 -5 47 1 -48 -19 111 51 -83 -3 81 66 -105 -72 155 95 -54 -75 120 35 -53 -100 19 64 -25 -86 94
5140 94 45 -20 -36 24 170 -29 -92 18 143 -63 -98 -39 114 -5 -147 -40 101 -4 -107 16 84 51 -98
5163 -98 -47 44 49 -110 -92 59 99 -90 -102 76 99 -54 -74 43 159 -9 -143 32 166 -12 -57 40 117 8
5187 8 -141 -9 128 5 -94 -11 56 83 -125 -24 119 79 -106 -78 98 97 -122 -109 102 104 -47 -114 108 129 -75
5212 -75 -98 82 123 -66 -102 -4 115 8 -86 -8 129 44 -128 65 113 25 -106 -27 142 11 -121 25 124 84
5236 84 -82 -82 103 59 -76 -65 146 110 -71 -60 56 67 -128 -67 60 56 -39 -102 24 73 -18 -97 87 146 -5 -67
5262 -67 -26 95 38 -125 7 62 -3 -18 -89 74 65 -78 -15 47 36 -90 -117 42 115 -99 -96 79 51 -60 -58 27 87
5289 87 14 -42 14 84 -29 -40 18 68 30 -58 15 42 30 -120 -43 95 49 12 -63 67 58 -83 52 51 3 -85 -36 56
5317 56 21 -4 -13 56 48 6 -3 20 6 -19 -48 -9 97 -40 -41 -23 9 -35 -123 29 55 -61 -33 -31 80 -23 -68 -2 -9 19
5347 19 -46 -31 55 8 -17 1 43 7 -7 3 27 19 9 -11 22 12 -48 -15 2 9 -33 13 -30 -33 20 39 12 2 -3 62 31 -28
5379 -28 25 -58 8 37 -16 30 56 -9 -37 -2 11 -9 -15 25 -2 9 17 -23 44 25 -70 12 -22 21 -43 -31 90 38 -45 -6 -19
5410 -19 13 -11 -15 -4 -47 -23 -57 41 68 -56 -55 7 15 3 -40 56 34 -7 5 3 14 1 -16 42 52 -29 -57 -20 50 2 -17 3
5442 3 96 15 -34 -24 66 22 -55 -52 78 -4 -92 -20 36 66 -16 -1 25 105 -98 -24 60 79 -55 -50 38 91 36 -69 42
5471 42 -3 34 -2 21 72 40 -61 7 91 -15 -60 10 98 69 -32 28 94 -18 -89 -9 28 -8 -84 -38 97 101 -43 -58
5499 -58 68 44 -53 -97 26 99 -29 -99 54 61 -71 -77 10 67 10 -136 7 144 40 -54 29 136 9 -79 -30 62
5525 62 59 -90 -86 69 20 -82 -81 69 26 -14 -75 27 73 -58 -60 51 64 -63 -105 2 45 8 -42 25 96 -28 -52
5552 -52 41 40 21 -40 6 136 9 -36 -24 50 36 -70 -81 47 48 -66 -51 34 26 -51 -42 29 54 -97 -93 12 110 -48 -89
5581 -89 35 101 -40 -40 -9 79 -34 -94 -34 114 19 -87 29 74 36 -84 62 94 18 -42 27 73 61 -56 -10 86
5607 86 52 4 -70 80 32 -36 -36 -21 42 -56 -89 24 17 -38 -12 22 58 -16 -81 -29 27 40 -56 -10 110 31 -34 12 59 17
5637 17 -33 18 38 -12 -58 -17 105 48 -69 -25 20 54 -11 -32 15 39 -71 11 -16 -47 -34 -61 35 0 -58 -56 66 61 -41
5666 -41 -31 16 54 28 -62 -17 38 7 -27 -34 0 -1 -20 -60 31 -3 -74 -34 67 23 -4 6 75 -12 -2 13 19 57 -48 -15 18
5697 18 -11 -36 -57 -5 17 -46 -16 15 1 -2 20 48 14 -29 1 -37 26 1 -20 42 -14 5 -60 -5 21 17 -65 17 -11 21 60
5728 60 -4 -2 -44 19 72 7 -7 15 18 -7 26 -32 -60 -45 -7 16 1 11 -2 19 35 -2 16 -1 39 48 3 -58 11 11 48 15
5760 15 33 132 27 -29 24 22 43 6 -23 90 36 -58 -4 24 -6 47 -12 16 35 -8 -44 -11 25 -28 0 23 30 -33 -51 -32
5790 -32 -45 -80 -39 1 43 -57 -22 11 73 -29 -54 59 25 -19 -11 6 3 -9 -44 -26 50 4 14 -36 58 2 -67 36 82
5819 82 31 20 -35 5 74 -38 -14 23 26 -40 -49 32 -1 -28 -44 13 81 -49 -68 33 56 -8 -21 -2 44 31 -56 43 29 59
5849 59 -104 17 26 41 -37 -11 37 22 -65 -36 89 10 -110 -77 -10 50 -46 -41 52 82 21 -76 32 59 -14 -32 33 109 37
5878 37 -51 8 63 16 -65 -47 55 -6 -75 12 109 -3 -5 35 80 -6 32 5 15 46 -64 -41 36 44 -74 -42 24 43 -33
5907 -33 -82 41 52 -2 -2 -2 29 17 -21 -57 26 -16 -45 -35 81 0 -27 -52 88 59 -4 -3 98 23 -57 0 -3 34 -20 -26 57
5938 57 37 -73 -47 43 70 -35 -31 21 91 -69 -57 46 106 21 -43 -13 12 -6 -66 57 64 13 -39 2 -18 9 -74 30
5966 30 12 28 -14 -10 13 47 -28 -50 8 18 -14 -46 -43 -12 26 -9 -8 -22 -5 -26 -46 28 -48 -30 -33 33 8 -54 7 -19 -27 -72 10
5999 10 -31 -1 -17 27 77 23 -12 1 76 53 -37 12 24 36 -17 -70 23 -5 32 -5 -41 77 -19 19 24 -5 -30 -25 35 -3 0
6030 0 -109 -9 60 -22 11 -13 -43 -7 17 38 24 -9 -29 14 14 -14 -35 7 -9 -28 -2 18 -14 -30 -6 -3 8 -22 37 1 19
6061 19 10 -11 2 59 8 3 28 23 -12 -16 10 0 -30 -85 -43 -41 -25 -35 -16 -43 -1 -50 17 -9 18 -22 -57 32 -30 -62 -43 38 52
6094 52 -17 -35 1 29 16 53 -9 5 -19 16 44 22 2 -39 57 46 27 -23 -1 41 -19 -13 -2 90 -26 -30 62 10 -17 -68 10
6125 10 47 -17 -41 -23 -4 37 -70 -36 57 34 31 23 1 48 6 29 74 15 15 -61 48 62 9 -7 72 41 7 20 66 34 8
6156 8 -62 21 -13 40 -105 -9 100 -4 -33 -12 34 23 -30 83 -3 35 -51 23 72 36 -9 -29 44 75 4 -5 72 58 -17
6185 -17 -24 -5 -10 -37 25 14 12 -55 -9 51 -24 -11 -5 68 62 -9 -71 -36 6 -32 0 -29 79 -3 -44 -11 -10 -7 -61 -24 36 41 9 10
6219 10 40 37 -57 -24 -14 26 -25 60 29 42 -29 1 49 41 8 -1 7 -11 50 -43 -17 32 -70 -15 21 43 -68 -15 12 26 19 -31
6251 -31 -33 7 15 -47 12 -26 3 -56 26 18 48 -40 -6 23 26 -25 -16 30 26 2 -17 29 22 -18 -19 28 7 31 -42 6 70 -43 -39 35
6285 35 21 -21 -34 -15 16 -50 -101 17 18 -18 -47 -32 9 -18 50 57 70 23 -23 7 50 -15 3 -21 28 20 4 -37 2 -16 -45
6316 -45 -40 -43 0 39 25 9 4 24 -50 -7 22 -28 -6 -40 -10 6 -17 7 8 -37 -39 11 27 19 -50 -9 19 1 -10 -43 31 54 40
6349 40 -18 -7 -19 -23 -48 -33 20 -56 -9 71 4 60 -45 46 0 -55 -61 -3 33 6 34 -49 55 -47 -13 -1 -2 1 -3 -5 8 -20
6381 -20 -19 -51 -19 -27 28 -1 51 29 -9 -32 -1 57 -25 18 -8 36 -17 11 0 35 29 16 -36 48 -7 -21 31 7 -20 23 47 45
6413 45 -27 -30 44 -18 2 -58 45 -45 7 39 7 -19 -60 -15 -7 7 -54 36 -1 20 -6 -60 4 33 56 -13 11 -13 -17 -20 41 69
6445 69 9 -18 -10 46 23 -14 -64 7 -42 1 -21 -5 -14 35 -22 40 0 -55 -42 -16 15 -32 33 -24 43 -5 4 16 29 37 24 39
6477 39 -18 10 17 -2 35 12 16 12 -8 13 -105 6 0 -8 -18 -13 -26 -33 31 -24 61 42 -23 -24 33 -56 -47 -33 14 54 19 -13 -14 20
6511 20 -27 -31 -21 7 36 -15 22 0 -15 7 44 2 49 7 18 34 44 15 31 53 35 -23 -86 -13 -1 -15 -37 9 -41 -41 8
6542 8 35 28 -38 -16 2 -23 -9 -43 6 5 -19 -18 5 89 -22 -18 40 42 0 -60 27 29 -12 7 10 -66 12 -47 7 62 25 -1 1 51
6576 51 -12 16 -26 30 6 28 -23 41 6 -28 -16 -29 -12 -6 -42 26 -2 -8 -4 11 -22 -19 -1 -10 15 22 29 50 53 -5 -51 15 4 -28
6610 -28 2 46 6 19 -2 15 -19 52 -3 -2 1 4 -48 5 17 -18 -34 -20 -23 -10 7 -32 -1 -42 9 -51 78 -2 -48 34 87 15
6642 15 -9 -24 28 32 13 -37 12 82 -21 23 15 47 38 15 -2 48 -32 -11 17 -38 19 19 -29 -8 -18 -39 31 -34 -14 13 -21 50
6674 50 -20 -45 -36 53 -27 -26 13 60 41 -44 60 19 26 44 -25 36 33 0 -38 9 7 25 19 44 16 20 15 19 40 -11 -37 -3 -4 28 -48
6709 -48 -63 -1 -9 24 -45 10 -50 -62 25 -9 -19 -30 -28 12 28 -17 -10 6 5 10 -42 52 -5 4 -4 15 50 -11 -2 -35 0 -2 15 -26 -20
6744 -20 -21 9 6 23 -1 -22 -29 -37 -50 0 -13 -13 26 -42 8 -13 -43 -40 9 41 7 32 33 57 36 -15 62 39 8 14 70 -3 20 10
6778 10 54 9 26 -25 0 41 -4 5 -36 -38 -61 -29 -33 -14 50 -27 -63 23 -6 8 -29 49 -5 51 33 -36 72 45 28 -45 -53 -7
6810 -7 14 37 -1 -1 -5 -49 21 2 20 -37 48 -18 -23 -47 45 28 -58 26 39 -26 18 12 -28 -14 -21 15 -70 11 17 3 -20 22 -27 -24
6844 -24 -5 -33 -4 -5 -46 31 -8 -29 20 7 17 -8 -9 19 11 -3 14 -30 65 4 -30 -51 19 18 -28 18 35 -39 -79 31 2 16
6876 16 -48 -31 22 36 6 35 -12 -12 -22 4 39 -3 -21 19 -6 -32 -3 -25 11 54 -21 43 0 1 28 -32 7 2 -45 18 8 14
6908 14 -23 15 25 24 -67 7 -14 -14 -53 6 49 -18 16 -19 -27 -14 13 14 -13 -15 -6 -27 32 -30 5 -10 27 -26 -41 10 8 -12 38 -16
6942 -16 -1 -3 77 -16 -18 -1 28 7 -37 12 17 -33 -14 -31 4 -6 -30 -60 14 15 32 -51 -31 74 27 -35 12 -65 4 -1 -13 -12 -9
6975 -9 -12 33 15 27 9 4 31 11 53 17 -25 -31 -46 48 13 -3 35 19 0 -47 -44 -47 32 -24 -16 27 16 -55 -55 -20 -66 2 14 13 -38
7010 -38 -9 24 -14 -42 17 -33 -3 39 -37 -4 -15 23 -36 16 37 -1 -39 31 22 -11 29 -23 11 -21 -27 0 26 -20 -21 -25 -33 2 -9
7043 -9 -56 -15 8 -10 -31 -21 -36 18 -8 9 -18 -12 -29 34 -2 -17 15 44 43 -42 35 36 35 8 -30 -27 61 21 31 -58 -3 -10 -3 -47
7077 -47 8 47 54 1 27 22 -14 17 -54 -27 -2 0 -21 10 -51 56 -2 10 15 -26 -28 5 38 -19 -35 24 1 -4 78 70 26 -25 64
7110 64 24 27 -23 -2 -23 69 36 34 32 35 11 -42 36 19 54 10 -37 -32 66 -23 -60 -48 35 17 -44 -4 -19 -15 6 16 -22 16 61
7143 61 19 26 3 32 -11 21 -31 -21 -23 16 -28 21 -2 17 -8 -4 -27 -45 -41 42 -47 40 14 -48 -39 9 -5 -21 -36 -49 40 18 -15
7176 -15 -39 -12 29 -49 -35 32 -89 21 61 -7 -31 64 23 7 5 -31 10 -18 -3 -23 -31 5 -29 29 3 11 8 -92 -10 8 -1
7207 -1 8 -16 -19 14 -33 32 -8 -49 -11 -43 -62 43 -40 -11 -37 6 33 21 7 -27 -46 -51 26 -14 28 19 -8 13 28 -59 -5 28
7239 28 -34 -30 -47 -3 -9 17 -51 -4 34 41 -9 -42 -48 -36 -92 -12 -7 9 41 11 7 14 -38 -34 34 -1 48 16 34 5 47 2 9 24 45
7274 45 -8 94 -55 45 60 -24 62 0 24 35 27 0 10 -35 38 -28 0 -22 -11 -2 -23 -54 13 17 -6 -5 -16 -38 -14 -35 -13
7305 -13 -13 3 -39 -53 -26 0 -10 11 7 43 -23 23 16 39 5 62 -25 -42 -12 -45 -28 55 -2 6 -52 -60 -46 -53 -4 21 -15 -1 -48
7338 -48 28 -23 35 46 -3 0 6 -5 17 14 -26 47 -58 31 -31 39 -3 14 55 16 20 27 -35 23 3 26 -7 -44 2 -39 -19 35
7370 35 -11 3 -9 -21 -17 -61 45 -17 -23 18 12 -30 -30 -55 20 16 -87 -24 39 9 -4 17 -36 4 24 -22 -9 -14 -13 -6 48 6 33
7403 33 35 -62 -14 -50 -22 44 33 -37 22 8 -5 31 -81 -3 74 4 29 -4 -14 -12 -41 -63 50 18 -66 -8 -2 -109 -2 -23
7433 -23 16 33 -8 -42 53 15 43 18 -1 7 -5 -19 -27 27 -13 -17 8 64 -33 -18 4 99 15 4 -36 -7 -2 10 -64 7 23 -41
7465 -41 -26 23 -12 -25 -27 -5 25 19 -3 -3 41 -14 23 -38 -26 68 28 48 13 11 -41 62 -4 12 -20 -52 -34 10 -8 -43 -2 -23
7497 -23 40 -50 7 -3 -12 -22 -20 -39 3 -8 -31 16 -53 -11 18 -11 -15 -11 3 18 -9 -21 -32 36 -42 -68 -40 24 47 -6 20 33
7529 33 -6 17 -52 -5 51 56 -33 -41 14 25 15 22 -13 -50 -58 -11 10 9 29 9 -47 29 -61 11 -11 2 -21 -98 -5 3 -26 -7 32
7562 32 38 44 5 -13 -21 -15 36 21 14 55 -47 29 4 -2 -16 51 -16 -11 -4 -56 0 -34 2 -29 -15 10 -48 47 -30 9 -43 -60 -9 26
7596 26 -47 -21 -19 43 -46 -20 20 40 11 -29 29 34 -5 -7 75 40 -11 -65 25 33 -42 47 20 -6 -45 11 -10 -47 24 -8 -29 -21 21
7629 21 26 -5 -8 36 27 -9 -3 -41 -67 23 -1 -1 29 47 -50 -27 -29 -31 1 28 -42 -5 40 -30 25 25 -8 -16 32 -7 21 34 18 -8 -40
7664 -40 26 7 6 -17 84 -12 22 13 -4 7 -15 -29 -18 41 31 44 -24 -13 -24 -58 48 22 14 40 -5 60 65 -42 13 26 39
7695 39 22 22 18 1 -11 -4 -23 -2 -31 -32 55 15 8 8 11 -39 -15 10 9 20 0 -13 4 32 -60 -12 -4 32 4 -16 -42 -4 -6 7 -14
7730 -14 -15 14 -14 -30 32 29 10 37 21 -7 9 -12 26 41 -13 8 -32 43 26 5 8 -2 -1 40 -24 -6 15 -17 -47 -35 -27 -2 -8
7763 -8 -38 -37 43 38 24 8 9 -3 28 -5 32 -44 -5 -19 3 41 -8 4 -14 42 63 13 -18 57 -34 27 17 -13 4 -70 -5 8
7795 8 -13 -5 20 -3 -8 -20 -43 11 -71 -51 20 24 20 21 57 -22 -10 -37 -1 35 30 -64 58 10 -10 -22 -3 13 5 -30 41 -27 63 30
7829 30 -34 -16 33 2 36 2 -7 -1 -15 -11 23 53 20 -54 7 -13 4 19 7 -23 -5 -24 -11 -4 -18 7 -16 -39 -10 -31 26 -13
7861 -13 -7 -15 69 73 33 -61 7 20 19 -8 -68 15 -11 -24 -87 45 -44 -16 -8 -26 -29 -30 -27 -3 -44 -79 -48 -27 -17 -49 -57 -20 13 28
7895 28 33 -1 -52 41 -51 -58 30 37 5 16 46 13 -38 -23 55 53 -36 -39 -21 0 14 -4 -6 -30 25 28 60 38 3 45 -7 -18 4 25
7929 25 -38 -40 61 -9 -42 17 -12 -34 15 -2 36 20 -21 15 79 26 -32 -2 29 25 -44 6 24 -26 39 41 36 24 -8 -14 111 3
7961 3 -104 -19 17 19 -13 18 -19 -1 -67 52 44 -33 31 14 18 -41 -17 -34 40 -4 4 -39 43 26 10 19 23 -7 8 11 18 17 -19 37
7995 37 -43 77 -23 -1 -21 18 -13 4 -20 -11 -4 0 9 -28 -15 -15 -36 -19 31 -27 -6 -46 -18 13 -2 44 -15 -43 9 -37 13 29
8027 29 -16 38 5 -8 -3 72 -15 23 -15 -47 79 -19 -27 32 53 11 -8 7 -12 71 -8 -47 44 6 -1 9 30 -20 -1 -18 2
8058 2 32 22 -45 -49 12 13 11 56 -4 -1 28 -5 22 -12 4 16 54 -13 5 -41 14 34 -40 -16 -18 -21 -43 -22 -74 19 22 25 -17 33 26
8093 26 -30 -12 4 -40 36 -31 -34 -41 -15 -45 -59 10 -21 -33 46 -5 -11 -16 17 30 -23 25 7 40 75 -8 -16 32 81 -19 -9 17
8125 17 51 -50 -35 -3 -51 -1 13 15 18 -27 -31 19 -34 -23 -58 -27 -56 4 -29 -46 -16 -18 25 -30 8 7 -12 17 12 -20 18 -11 28
8158 28 -21 41 -20 -42 32 15 -8 -23 -19 27 10 27 58 14 61 -18 -35 -57 17 -9 28 18 -6 -9 -1 -29 -25 -28 19 -6 -56 1 -24
8191b4
##END NTUPLES=NMR FID
##END=
