##TITLE=1H_E3d-3
 CDCl3
 8 sc, 
 15.6.2023
##JCAMPDX= 6.0         $$ Bruker NMR JCAMP-DX V2.0
##DATA TYPE= NMR FID
##DATA CLASS= NTUPLES
##ORIGIN= UXNMR, Bruker Analytische Messtechnik GmbH
##OWNER= root
$$ XWIN-NMR		Version 3.5
$$ Thu Jun 15 10:38:59 2023 Russian Standard Time (UT+4h)  she@DPX200
##.OBSERVE FREQUENCY= 200.13135
##.OBSERVE NUCLEUS= ^1H
##.DELAY= (6, 6)
##.ACQUISITION MODE= SIMULTANEOUS
##.ACQUISITION SCHEME= undefined
##.AVERAGES= 8
##.DIGITISER RES= 18
##SPECTROMETER/DATA SYSTEM= spect
##.PULSE SEQUENCE= zg30
##.SOLVENT NAME= CDCl3
##.SHIFT REFERENCE= (INTERNAL, CDCl3, 0, 15.7039)
##AUDIT TRAIL= $$ (NUMBER, WHEN, WHO, WHERE, WHAT)
$$ ##TITLE= Audit trail, XWIN-NMR		Version 3.5
$$ ##JCAMPDX= 5.01
$$ ##ORIGIN= Bruker BioSpin GmbH
$$ ##OWNER= she
$$ F:/spectra/data/she/nmr/H-F/1/audita.txt
$$ ##AUDIT TRAIL=  $$ (NUMBER, WHEN, WHO, WHERE, WHAT)
(   1,<2023-06-15 10:37:32.43 +0400>,<she>,<DPX200>,
      <created by zg, POWCHK disabled, PULCHK disabled
       configuration hash MD5:
       00 E9 B6 7A A2 85 ED C7 34 08 36 98 17 FE 4E 26
       data hash MD5: 16K
       41 49 86 74 8E 82 62 D5 8B 55 E4 5B C1 AB 65 33>)
$$ ##END=
$$ 
$$ hash MD5
$$ A2 93 2D E9 F7 F5 5E 30 61 CB 81 C8 BD D0 25 B6
##$RELAX= 
##$RELAX= 
##$RELAX= 
##$RELAX= 
##$RELAX= 
##$RELAX= 
$$ Bruker specific parameters
$$ --------------------------
##$DU= <F:/spectra>
##$EXPNO= 1
##$NAME= <H-F>
##$PROCNO= 1
##$TYPE= <nmr>
##$USER= <she>
##$AMP= (0..31)
100 100 100 100 100 100 100 100 100 100 100 100 100 100 100 100 100 100 
100 100 100 100 100 100 100 100 100 100 100 100 100 100 
##$AQSEQ= 0
##$AQ_mod= 1
##$AUNM= <au_zg>
##$AUTOPOS= <>
##$BF1= 200.13
##$BF2= 200.13
##$BF3= 200.13
##$BF4= 200.13
##$BF5= 200.13
##$BF6= 200.13
##$BF7= 200.13
##$BF8= 200.13
##$BYTORDA= 1
##$CFDGTYP= 0
##$CFRGTYP= 5
##$CHEMSTR= <none>
##$CNST= (0..31)
1 1 145 1 1 1 1 1 1 1 1 1 1 1 1 1 1 1 1 1 1 1 1 1 1 1 1 1 1 1 1 1 
##$CPDPRG= <>
##$CPDPRG1= <>
##$CPDPRG2= <>
##$CPDPRG3= <>
##$CPDPRG4= <mlev>
##$CPDPRG5= <mlev>
##$CPDPRG6= <mlev>
##$CPDPRG7= <mlev>
##$CPDPRG8= <mlev>
##$CPDPRGB= <>
##$CPDPRGT= <>
##$D= (0..31)
0 1.2 0 0 0 0 0 0 0 0.06 0 0.03 0 0 0 0 0.0002 0 0 0 0 0 0 0 0 0 0 0 0 
0 0 0 
##$DATE= 1686811051
##$DBL= (0..7)
120 120 120 120 120 120 120 120 
##$DBP= (0..7)
150 150 150 150 150 150 150 150 
##$DBP07= 0
##$DBPNAM0= <>
##$DBPNAM1= <>
##$DBPNAM2= <>
##$DBPNAM3= <>
##$DBPNAM4= <>
##$DBPNAM5= <>
##$DBPNAM6= <>
##$DBPNAM7= <>
##$DBPOAL= (0..7)
0.5 0.5 0.5 0.5 0.5 0.5 0.5 0.5 
##$DBPOFFS= (0..7)
0 0 0 0 0 0 0 0 
##$DE= 6
##$DECBNUC= <off>
##$DECIM= 32
##$DECNUC= <off>
##$DECSTAT= 4
##$DIGMOD= 1
##$DIGTYP= 9
##$DL= (0..7)
0 120 120 120 120 120 120 120 
##$DP= (0..7)
150 150 150 150 150 150 150 150 
##$DP07= 0
##$DPNAME0= <>
##$DPNAME1= <>
##$DPNAME2= <>
##$DPNAME3= <>
##$DPNAME4= <>
##$DPNAME5= <>
##$DPNAME6= <>
##$DPNAME7= <>
##$DPOAL= (0..7)
0.5 0.5 0.5 0.5 0.5 0.5 0.5 0.5 
##$DPOFFS= (0..7)
0 0 0 0 0 0 0 0 
##$DQDMODE= 0
##$DR= 18
##$DS= 0
##$DSLIST= <SSSSSSSSSSSSSSS>
$$ [...]
##$SUBNAM2= <"">
##$SUBNAM3= <"">
##$SUBNAM4= <"">
##$SUBNAM5= <"">
##$SUBNAM6= <"">
##$SUBNAM7= <"">
##$SUBNAM8= <"">
##$SUBNAM9= <"">
##$SW= 18.05172834244
##$SWIBOX= (0..15)
0 0 2 0 0 0 0 0 0 0 0 0 0 0 0 0 
##$SW_h= 3612.71676300578
##$TD= 16384
##$TD0= 1
##$TE= 0
##$TE2= 300
##$TE3= 300
##$TEG= 300
##$TL= (0..7)
0 120 120 120 120 120 120 120 
##$TP= (0..7)
150 150 150 150 150 150 150 150 
##$TP07= 0
##$TPNAME0= <>
##$TPNAME1= <>
##$TPNAME2= <>
##$TPNAME3= <>
##$TPNAME4= <>
##$TPNAME5= <>
##$TPNAME6= <>
##$TPNAME7= <>
##$TPOAL= (0..7)
0.5 0.5 0.5 0.5 0.5 0.5 0.5 0.5 
##$TPOFFS= (0..7)
0 0 0 0 0 0 0 0 
##$TUNHIN= 0
##$TUNHOUT= 0
##$TUNXOUT= 0
##$USERA1= <user>
##$USERA2= <user>
##$USERA3= <user>
##$USERA4= <user>
##$USERA5= <user>
##$V9= 5
##$VALIST= <valist>
##$VCLIST= <CCCCCCCCCCCCCCC>
##$VD= 0
##$VDLIST= <DDDDDDDDDDDDDDD>
##$VPLIST= <PPPPPPPPPPPPPPP>
##$VTLIST= <TTTTTTTTTTTTTTT>
##$WBST= 1024
##$WBSW= 4
##$XGAIN= (0..3)
0 0 0 0 
##$XL= 0
##$YL= 0
##$YMAX_a= 133118
##$YMIN_a= -104213
##$ZGOPTNS= <>
##$ZL1= 120
##$ZL2= 120
##$ZL3= 120
##$ZL4= 120
##$ABSF1= 10
##$ABSF2= 0
##$ABSG= 5
##$ABSL= 3
##$ALPHA= 0
##$AQORDER= 0
##$ASSFAC= 0
##$ASSFACI= 0
##$ASSFACX= 0
##$ASSWID= 0
##$AUNMP= <proc_1d>
##$AZFE= 0.1
##$AZFW= 0.1
##$BCFW= 1
##$BC_mod= 2
##$BYTORDP= 1
##$COROFFS= 0
##$CY= 11.3945322036743
##$DATMOD= 1
##$DC= 2
##$DFILT= <>
##$DTYPP= 0
##$F1P= 15.7292609196834
##$F2P= 12.9074282941183
##$FCOR= 0.5
##$FTSIZE= 0
##$FT_mod= 4
##$GAMMA= 1
##$GB= 0.15
##$INTBC= 1
##$INTSCL= 1
##$ISEN= 128
##$LB= 0.24
##$LEV0= 0
##$LPBIN= 0
##$MAXI= 10000
##$MC2= 0
##$MEAN= 0
##$ME_mod= 0
##$MI= 1.114404
##$NCOEF= 0
##$NC_proc= 0
##$NLEV= 6
##$NOISF1= 3.799351
##$NOISF2= 2.8
##$NSP= 1
##$NTH_PI= 0
##$NZP= 0
##$OFFSET= 15.70392
##$PC= 1
##$PHC0= -20778.78
##$PHC1= 5.652721
##$PH_mod= 1
##$PKNL= yes
##$PPARMOD= 0
##$PSCAL= 0
##$PSIGN= 0
##$REVERSE= no
##$SF= 200.130013532006
##$SI= 16384
##$SIGF1= 3
##$SIGF2= 2
##$SINO= 400
##$SIOLD= 16384
##$SREGLST= <1H.CDCl3>
##$SSB= 0
##$STSI= 0
##$STSR= 0
##$SW_p= 3612.71676300578
##$SYMM= 0
##$S_DEV= 0
##$TDeff= 0
##$TDoff= 0
##$TI= <>
##$TILT= no
##$TM1= 0
##$TM2= 0
##$TOPLEV= 0
##$USERP1= <user>
##$USERP2= <user>
##$USERP3= <user>
##$USERP4= <user>
##$USERP5= <user>
##$WDW= 1
##$XDIM= 8192
##$YMAX_p= 0
##$YMIN_p= 0
$$ End of Bruker specific parameters
$$ ---------------------------------
##NTUPLES= NMR FID
##VAR_NAME=  TIME,          FID/REAL,        FID/IMAG
##SYMBOL=    X,             R,               I
##VAR_TYPE=  INDEPENDENT,   DEPENDENT,       DEPENDENT
##VAR_FORM=  AFFN,          ASDF,            ASDF
##VAR_DIM=   8192,          8192,            8192
##UNITS=     SECONDS,       ARBITRARY UNITS, ARBITRARY UNITS
##FACTOR=    0.0002768,     1,               1
##FIRST=     0,             0,               0
##LAST=      2.2672688,     0,               0
##MIN=       0,             -104213,         0
##MAX=       2.2672688,     133118,          0
$$ Real data points
##PAGE= N=1
##DATA TABLE= (X++(R..R)), XYDATA
$$ [...]
734a689L026R83j255j499j557N22K769P43j243q12j403p94K536K350j351k270
750i44p68K30J495J653l15j544j460n66K009K536o07k424q73L37R13J767P79j664
768E54k216k76J920J962l6j644j540l51J021J797Q74j323k289o37J530K063L01
785A710j313j446o60M84J967J333j146k313n63J390J487O89m74j606j389O70K193
802A013J197r91k029q47Q27J457R97k80j482j762K21K209J328p62j665j184L55
819a398J401J318N0j187j805l79K052J816o04j437q59k59P77J910N21j405j686
836a174m92J450J742q3j205r56o60N20J766R15j376j543m04P68J425O33q10j099
854e83p55J09J644J266r60j554k26N31Q12Q56j9j170j008R0J322J116o57j144
$$ plain form
734 -1689 1337 2320 1065 -434 -1991 -1469 1300 2043 800 -12 -1415 -2209 327 2677 1326 -944
750 -944 -1712 -1482 13 1666 1351 -193 -1653 -2219 -210 2326 1719 -705 -1578 -1241 -328 1439 2218 554
768 554 -1662 -1938 -18 1944 1908 264 -1276 -1627 -606 1191 2065 742 -1547 -2184 -654 1409 1710
785 1710 397 -1049 -1709 -1225 742 2075 929 -1384 -1947 -557 930 1619 1145 -461 -1850 -1180 1013
802 1013 2210 1219 -810 -1657 -830 627 1624 1344 -138 -1900 -1679 530 1858 1096 -569 -1753 -1398
819 -1398 3 1321 1371 184 -1621 -2000 52 1868 1264 -173 -1032 -1291 -514 1396 1917 512 -1174
836 -1174 -1666 -216 1526 1443 238 -718 -1378 -858 908 1823 447 -1096 -1500 -732 693 1326 516 -583
854 -583 -1338 -1229 415 1681 721 -833 -1059 -528 284 1140 1121 -49 -1057 -967 355 1471 814 -330
872c30k07k7J96J201L52j230j022J95P67Q11q4p69n34P0M0P89Q17p94j138K40
892f57P33K46K09j66n10k26M4N55O30l98q96J2P49j90j89M29j69p47J01P08J6
913B84n73M7J50m2mJ32m6Op9m9J91K56l19k61N18J84n19M1M13k50k06L35J41l41
937Ik70K00M14j67l57j13K39q9n9L98Q5o67m15O41O12k85l26M8k79k78R22N97
959H60o06m35j87j56Q34Q39r02n80L83n89j8J723j05j793O9O74l35M67Q16j037
979g8p80N08k0N60O58j045q11Q96K46k08P67j86j310R0J166K38r6m53p88O7Q07
1000B28M11J42m66j094k83R70J091p9j113p11K44J29O09J344o74k204K59J354
1018A57M5M79L42j643q30J451M63J52O51j424j549J663J121q61L48N3j939K82
$$ plain form
872 -330 -537 -564 -368 833 1185 -45 -1067 -872 -105 706 622 -147 -681 -611 -571 218 1035 241 -897 -657
892 -657 76 322 531 365 -145 -371 -327 228 858 460 -436 -424 325 135 -54 375 206 -541 -440 268 284
913 284 -289 -242 -92 -134 -138 -6 -52 -46 -125 -174 17 273 -46 -307 211 395 -124 -83 330 80 -126 209 350 9
937 9 -261 -61 353 186 -171 -284 -45 -134 -193 205 290 -377 -792 -151 461 176 -150 -102 -381 -659 263 860
959 860 254 -181 -368 -524 310 1149 247 -333 50 -539 -557 1166 1061 -732 -663 11 -324 143 959 -78
979 -78 -858 -350 -370 190 848 -197 -1008 -112 134 -74 693 507 -803 -713 453 691 595 142 -646 -579 228
1000 228 639 781 315 -779 -1062 -92 999 920 -193 -904 -660 -531 78 1422 748 -1456 -1197 157
1018 157 202 681 1023 -620 -1450 1 464 616 1267 -157 -1706 -43 1078 217 565 618 -1321 -1039
1036a039K076j63q00q4r93J09J566J23o69j42r97l71K008R03j353q32j5k27J055
1055A55J292l70j371r74K45J425J074m36r69j134j57J295J125j2o54j578q74J884
1073c4J397q40l07k90j732N53K571q8j524n2o27j19J986M70j418j87k30o41J808
1092F96J207j806j009N91j91P08J428j087j503J72K08P71J410q01j927J04N07
1109e22L32J241J80j771j019N78J127R92k22j021p37k43P35J612J75j450o83j14
1127h10K90J437M11j351m32J0m88J293J284j618j184R57j24%J365m69j638L98
1145f69N88m3R93j39j700J95J154m33N78N92j632o50J353K91q0M83j017r62R66
1164a32M31j3N30p46j241O14J004j97P3j61q95N0N95L89L46n15r13L86O82k71
$$ plain form
1036 -1039 1037 874 74 -10 -1003 -894 672 795 126 -16 -1013 -1384 624 1527 174 -658 -673 -900 155
1055 155 1447 1077 -294 -1268 -1023 402 1476 1040 71 -1063 -1220 75 1200 1188 534 -1044 -1918 -34
1073 -34 1363 523 216 -74 -1806 -1253 1318 1230 -294 -346 -973 -1092 894 1364 -54 -241 -471 -1112 696
1092 696 1903 97 -912 -321 -512 196 1624 537 -966 -794 -586 185 1595 794 -1133 -1029 -522
1109 -522 -190 1051 1231 -540 -1559 -981 146 1138 916 -105 -842 -1085 -350 1262 1437 -13 -696 -810
1127 -810 -520 917 1328 -23 -455 -445 -933 360 1644 26 -1158 -201 -325 -325 1040 571 -1067 -669
1145 -669 -81 -124 869 730 -970 -775 379 -54 524 1116 -516 -1166 187 478 398 881 -136 -1098 -132
1164 -132 299 286 816 70 -1171 -557 447 250 323 162 -733 -683 -88 301 647 132 -781 -395 287 16
1184A6L68K80j017j67P93n6L6K77q93j58J000l16l87P93n44r22J074M27q81K29
1204d8J04p84O01O34o93J16K91r54K99J176n90n54O66l26l95Q40J62o53K44j46
1224a0l38P26J05p08L02J74p16M41M74m59k04K22k65J74L45n31J23L75o30J78
1244b22O48n12k64N00m8l21M72j73k52L73o9m23O86j24p25N73L14p30K48L93o23
1265b79K7N55m49n4M77m71j23O50l64m25O32q8m52M67J13m49K62J52k75L95l1
1286B70n51L49K42n15L33L62o26k08N74j71r1K88l75j62L18q6r2L83l62l90N34
1307B4J57l26K33O3m51K89K25j81J61j6n77L48N00l49r4L16m05j82N10k7j77J8
1329E9k87r5N01l5l08K24j48l52M30L43l31j66N0j75K33L31k51k1J9k99K10N74
$$ plain form
1184 16 384 664 -353 -520 273 217 253 530 -363 -521 479 163 -224 569 25 -897 177 604 -277 -48
1204 -48 56 -728 -127 507 -186 -70 221 -733 -434 742 152 -402 264 -62 -457 383 545 -108 136 -10
1224 -10 -348 378 483 -225 77 251 -465 -24 450 -9 -213 9 -256 -82 263 -268 -145 230 -400 -222
1244 -222 426 -86 -350 150 102 -219 253 80 -172 201 132 -291 395 271 -454 119 433 -297 -49 344 -279
1265 -279 -252 303 -146 -200 277 -194 -317 333 -31 -456 176 88 -364 103 216 -233 29 181 -94 301 270
1286 270 -281 68 310 -205 128 490 -136 -344 230 59 -32 256 -119 -281 37 -49 -141 242 -120 -510 24
1307 24 181 -145 88 151 -300 -11 214 33 194 178 -399 -51 449 100 6 322 -83 -265 245 218 41 59
1329 59 -228 -323 178 143 -165 59 -89 -441 -11 332 1 -165 -115 -290 -57 274 23 2 21 -278 -68 506
1351E06k66l47J79j42m3L91O7m15rr2L1L71L5m02N6q5j51K74L40l68k34R6K8K51
1375G1K24l19p9O9j25J88M53l20m16J65J45J6J75k8l03j23J03R8L46r9n51RK87
1398a4k7J03K16l77k86K21J71K14K0l20k21K52J11J04J64k60l77J37L61J08p8
1419B22j35j86K7Q4K03O5k93l48P3L86j0K8j31k87j1K61J27J17j13l47j9L49J09
1442A71m8R7k47k82K50L80m7j13k05j40J77J86j5Lk19k48N9M05N3j92k10l6k1
1465b42J60K18M9l42j51N7K35K17rk57j31N2K00J30J21j33l84O1L23kj1Rk27j90
1489b47J93K28j00o3j48p9J05J85l1q5l9j48K0K45J54k19p3K7J8O2J79m0k29L1
1513e4K0K30Q3j07k09j9R0o2J26Q1j62k99J32K17r6k1P3k48RK56J4p2Q0j20j86
$$ plain form
1351 506 240 -107 72 -70 -113 278 345 -70 -79 -171 -140 231 266 -136 -80 -165 -316 -42 298 -70 -304 -208 -180 71
1375 71 295 -24 -103 -34 -159 29 482 162 -254 -89 56 72 247 219 -84 -207 -104 -6 340 241 -310 -301 -14
1398 -14 -41 62 278 -99 -385 -164 7 221 241 -79 -300 -48 63 167 331 71 -306 -169 192 300 222
1419 222 87 -99 -72 12 215 280 -13 -361 -288 98 88 116 -15 -302 -313 -52 75 192 79 -268 -287 62 171
1442 171 123 220 -27 -309 -59 321 274 161 -44 -184 -7 179 164 167 -52 -300 -241 164 217 25 -185 -221 -242
1465 -242 -82 136 185 -157 -308 -251 -16 201 192 -65 -196 -144 56 186 307 174 -210 -149 174 172 161 170 -57 -247
1489 -247 -54 174 74 11 -137 -216 -111 74 43 -42 -81 -229 -209 36 190 -29 -102 -75 -57 5 184 144 -85 -54
1513 -54 -34 196 279 172 -37 -56 34 -28 98 179 17 -282 -150 67 -29 -50 23 -225 -216 40 54 -18 62 -58 -244
1538b44K54J53j40m4J33j54MK77j27j79O1P2l6RP4j56l3MO3L8m2n7o3P6K0J5j5
1565c7j7j8o6R1J99j35k6J34j02r5K03O8j67Q2n3j35K06P2k45kK20l13J7K95j63
1590A3k22K31K2k73K43J9l04K15J31k04L9J97j50j13L66j50r7J66p2m5P4J8pO
1614A03n6o7J08o1k0J04q2p8%J0O2m1n6o2J68q7j09K13m6p2J12L1j72Q4J40j80
1640e4J38J50l07j00L82j70j10L21j57m05K84J75k38R6O5k67N1J81j37J18J43
1661A59l02j36L79r9l0J24q5k66K20J53m7Q2j27o2J01j2M9K9q4j65M2J83k0J3
1685I9j10k21J22J16m6J23q4k93O7L77j06m7P3k83l0M08J1l1M7k11k72M28J33
1708B70j78M6k8l16J24L26j26o1m1k60J04L21o8j70L4k49o7M90N9k28n9j4j28
$$ plain form
1538 -244 10 163 23 -21 112 -42 -38 239 112 -67 -6 66 30 39 113 -43 -76 -72 -9 29 -13 -70 -133 -57 -37 -22 -37
1565 -37 -54 -72 -138 -47 152 17 -9 125 23 -72 131 199 32 114 61 -74 132 204 -41 -43 177 -136 -119 176 13
1590 13 -209 22 44 -229 14 33 -271 -56 75 -129 -90 107 -43 -156 210 60 -37 129 57 12 86 104 97 103
1614 103 47 -20 88 27 7 111 29 -49 -49 -39 23 -18 -74 -136 32 -55 -164 49 3 -69 43 74 -98 -14 126 -54
1640 -54 84 234 -73 -173 209 39 -71 250 93 -312 -28 147 -91 5 70 -197 -146 35 -102 16 159
1661 159 -143 -279 100 1 -29 95 10 -256 -36 117 70 152 25 -37 64 52 101 130 46 -119 -77 106 86 99
1685 99 -11 -232 -110 6 -40 83 -1 -294 -227 150 44 -3 70 -213 -243 165 176 145 192 -19 -291 137 270
1708 270 92 138 110 -206 -82 244 118 57 16 -244 -140 181 113 -57 -23 -272 -339 151 210 -18 -77 -91 -219
1731b19K48J61r5o6j24p0L09J85k29r4k9j08J05K71n2j85j07j43K26K38j60j49
1753h7O0k00J6L98m4k45M6j09j7L35qj70L0j17j6K88J77k95j15N9r4J48K44k42
1777D2q8l1n4J42K33j57k46P0jLK05K5k75l1P9k9K00J7j80j5O8l5K63M6l33m2
1803a24J76l3J15R2j88j00Q2N7o3J36k04r2Q4M3l2Q0j06r5K1Q2K7R9r3j36R0J74
1829I2p2J1J43k56mJ35N9Kj15m9PJ40k4j3P7j37j73J98R2j01l0pj71R6J31j0J5
1856C6m6j94J37J58o5m5N3j24K1J99j1r4Ln7L9J55l9k07P9p0l5J72P5j74m9Pm0
1883a16J57j0q0K6l4j12J50J38j16j27J15o7k2K42j23l6P0r5PR7J0p4O8m8n0P4
1909D4P7j56oQK6K2j9q0NJ9j7J24k1j06MP7p1N9R2r4L8O4p3K8N6j21l2J39l4j55
$$ plain form
1731 -219 29 190 95 29 -95 -165 144 329 100 6 -23 -131 -26 245 193 8 -99 -242 -16 222 62 -87
1753 -87 -27 -227 -211 187 143 -102 -56 -165 -182 153 145 -25 5 -112 -128 160 337 42 -73 -14 -108 40 284 42
1777 42 -46 -77 -131 11 244 87 -159 -89 -90 -87 118 143 -132 -163 -84 -113 87 104 -76 -91 -23 -58 205 251 -82 -124
1803 -124 52 19 134 226 38 -62 20 77 14 150 -54 -146 -62 -19 -51 29 -77 -172 -151 -69 -42 57 -36 -172 -82 92
1829 92 20 31 174 -82 -86 49 108 110 -5 -54 -47 93 69 56 133 -4 -177 21 113 12 -18 -25 -196 -100 31 21 36
1856 36 -10 -204 -67 91 26 -19 34 -90 -69 130 119 25 28 -29 10 165 126 -81 -2 -72 -107 65 140 -34 -83 -76 -116
1883 -116 41 31 -49 -23 -57 -169 -19 119 3 -124 -9 -76 -98 144 21 -15 55 -40 -33 64 74 0 68 20 -30 44
1909 44 121 -35 -41 -33 -7 15 -4 -84 -79 -60 -77 47 26 -80 -76 1 -70 -11 81 -13 25 89 16 44 100 -21 -53 86 52 -103
1939a03O9K8j7j4K1l1oRk7N4K0o0o2J29o8lJ00J0q0K4k7O5Q6j9q7K4pnL8N1o3
1970D9j10RJ19M2o6o2k3r2M8J25jj14k5L5n3J40M9j17k5L3j06K56O6j76q2J16
1996C5m4j3J70J4k31k5J17K7O4%j74n5J22QL2K9p0k27J66P2M3m1k4r9n3J52R1
2023H6Rj03J4j12J22J14k4j18K5p7L8J56j3j43m1J06n8J8J13r8j53J3J07j7R9
2048F3r4p6RJ43m9M4Q8j67j04J98O7j19L7Jn3J1P6J2L1m2j18k0J53n4p7M5k0j10
2076a25P0J80q7j09rRM4M8N0j08n6J14j3K3J31j34r4J15M9m8j6J58k65N5O4l4
2102A2m3O6j0j67J53O6q5j0l6j23J31J43q6j01M9N7r8J36P0j20q8J7R0J5R6l7
2128I7n0l5J1JR1K3j54o0J39n1p2J29r2m8r2J81Km6K4q0K3KJ50j21K7j9j17J38
$$ plain form
1939 -103 -34 -6 -23 -37 -16 -47 -53 -44 -71 -17 3 -57 -119 10 -58 -61 39 49 -31 -7 -34 31 117 98 11 35 28 23 61 112 49
1970 49 -61 -52 67 109 43 -19 -42 -134 -86 39 38 -76 -101 -66 -119 21 70 -47 -72 -39 -145 111 177 1 -81 35
1996 35 -9 -22 148 162 -69 -94 23 50 114 114 -60 -115 7 15 47 76 6 -221 -55 17 60 19 -5 -104 -157 -5 86
2023 86 95 -8 6 -106 16 130 106 -12 13 -64 -26 130 117 -26 -67 39 -19 -1 112 14 -139 -126 -19 -36 63
2048 63 -31 -107 -98 45 -4 40 128 -39 -143 55 122 3 40 41 -12 -1 75 87 118 76 -42 -62 91 37 -40 5 -15 -125
2076 -125 -55 125 38 -71 -80 -71 -27 21 71 -37 -93 21 8 31 162 28 -66 49 98 50 34 192 -73 -18 46 12
2102 12 -31 35 25 -142 11 77 -8 -18 -54 -177 -46 97 11 -90 -41 16 -82 54 124 4 -84 -67 23 38 134 97
2128 97 47 12 23 24 115 138 -16 -76 63 12 -60 69 -23 -71 -163 18 20 -26 -2 -82 -59 -57 93 -28 -1 -20 -137 1
2156AQ1k8r1J17m0p9J34Q7k09K5K6n0M6J08j91r1J21Lj3Q7k7j86J12R5r6M6R4
2183H2q5o6N9O2j9P7o7p0M4oK7%J8k1o6N3j9Po9J6Kn8O4O2k4q8L2k7O9nOn7N4
2216a3ql0J25j9q1M5M9j01N6O8j6j22J07k3m7J4K6q9P8j0r9Q1P2j05k5O6ml8P2
2245B9kr9J4J1M4M7k8n2N0j0RL9J6j7k3Lj0L8p5k3P5j4r5N7P4k8l2p3K2J06m0
2276A3q0O1m6k9J21O2j09l1O8m7K2krPJ7o8N5M3j8n4N7p3m6R4l6l3p3J14J8J7
2306A5m7k9O3J9r8J57k7k1Jp0R6M1n5n7RM9o9O1R2j67lmP4m6J8j0n5j1O1k6P6
2337C7q8j2M0NOMM4r4NL5R4n7Ko1R7L8n4L4m4J3n4KK6k6N9mo9K2k1L2L0p2p7O3
2371d5M9k7QJ8op8K7L0K2J4l5K0O6m6k5O3n0pN2J2j26J00n9K8j0J8j9oK7j0o7
$$ plain form
2156 1 82 54 -37 80 40 -39 95 182 -27 -2 24 -26 20 128 -63 -154 -33 -30 -43 44 17 -169 -57 38 -58 -12 82
2183 82 -3 -69 -10 52 33 110 43 -27 17 11 38 38 56 35 -31 22 3 10 -59 -43 -41 -99 -35 27 3 -85 -53 -80 -11 -16 -10 -67 -13
2216 -13 -21 -51 74 55 -26 19 68 -33 23 91 75 -47 60 37 -10 4 30 -59 19 9 -90 -9 63 -42 -67 -1 -5 -43 29
2245 29 27 -72 -58 -47 -3 44 16 -36 14 4 13 52 68 51 28 31 21 59 -16 -39 36 22 -73 -16 58 30 -2 -75 -53 53 13
2276 13 -67 -6 -52 -81 40 102 -7 -38 30 -17 5 3 -6 1 18 -50 5 48 30 -24 33 -40 -86 8 -28 -61 -134 -20 -2 15
2306 15 -32 -61 2 21 -77 80 53 32 33 -37 59 100 45 -12 -3 46 -23 38 130 -37 -40 -44 30 -16 2 -8 -63 -74 -13 -39 37
2337 37 -51 -63 -23 -18 -12 -8 36 -58 -53 -18 76 19 21 -40 57 95 41 75 31 44 -10 -8 18 -8 51 47 -22 0 -21 11 41 -31 -108 -45
2371 -45 4 -23 -15 3 -3 -81 -54 -24 -2 12 -23 -3 63 17 -8 55 5 -2 50 62 -64 36 -23 5 -5 13 -6 -12 15 5 -62
2402f2O8p7K0R9m0o7K2K1k0J20q2OK7p9P0K1K0k2j10J38j33J22Ql6o1p4L6N3N0
2431C8l7m5m1N5k7J09n0j7Jm9J02KNl3J5m2J4M6R5j24Kn5jJ21n9M6p4Nm6JR8r5
2463d0k6l4pJ4J06j7q6lP0K1j9M3M4p9k2O9K3J06j67pl6O2J7LK6q4j4NJ02j8n7
2494ej6o0M0L4K3L3q6o4l3J00Q2l4l8K3m6%P2O3j08L5p4J7J27Po7Kj0l8MQ3m3
2525B3j8q0J2L7M0K1l3n6J5RL2M8l5k5lM2l0L8j0l8j1K8PmK0o1L1n0Q4N7r1L7
2557C6n5m3O8K0J4j27L8j4J1O3J5m6lj1Q4l0k1K4k4k4Q1j01R5nk9k0j1J6M1n4
2587a2L7o6M1nm8R4k5l8K9no1L8nM0Oo5O1k9K8N%m0QLj2M1%jK8n6J3N2o6N2n0
2622hK3K6q2J19j19M2j8k0pl2P2l8nRK6P7o6l6k3Q8M4o7J7j9RK2nOJ6Nl1m7j0
$$ plain form
2402 -62 6 -71 -51 48 8 -59 -37 -16 -36 84 2 8 35 -44 26 47 67 45 -65 73 -60 62 70 34 -27 -101 -65 -12 38
2431 38 1 -44 -85 -30 -57 52 2 -15 -14 -63 39 41 46 13 28 -14 0 46 141 17 19 -36 -37 84 25 71 -3 2 -44 -43 55 -40
2463 -40 -66 -100 -107 -93 13 -4 -90 -93 -23 -2 -21 22 66 -13 -35 34 57 163 -4 -11 -47 15 32 35 61 -23 -37 -32 70 52 -5
2494 -5 -21 -81 -41 -7 16 49 -37 -101 -134 -34 48 14 -24 -1 -47 -47 25 88 -20 15 -59 -42 85 92 25 27 17 -21 -17 66 23
2525 23 5 -75 -63 -26 14 35 2 -54 -39 -30 2 50 15 -10 -13 29 -1 37 27 -11 -22 6 13 9 29 -32 -1 -51 33 90 -1 36
2557 36 -19 -62 6 26 40 -87 -49 -63 -52 11 26 -20 -23 -34 50 20 -1 23 -1 -25 56 -45 50 45 16 -4 -15 1 42 -12
2587 -12 25 -41 0 -5 -53 41 16 -22 7 2 -59 -21 -26 14 20 -45 16 -13 15 20 20 -20 -12 -9 -21 20 20 19 47 -9 4 56 -10 42 -8
2622 -8 15 41 -41 78 -41 1 -17 -37 -44 -76 -4 -42 -47 -38 -12 65 -1 -37 -60 28 72 5 22 3 12 34 29 35 51 56 25 -22 -32
2655c2J9j5k5M3J5m3L3O7l5k5k0nK1K6qp1N8J3K3oJ0m7K5qL0m7l1M0M2p0mK6j5
2688a6K9m2k7O3l5k3j4K1P1o4M9n1O4J3o9M7J7k5Rll2P5k0K5r5J00m1M4l2m9J5
2719Dk1K1l6N1l8k6N4k4K5l4P1k3p1J5K3l3N5k4j5N8M3j3l8K3k6lK6l2L7j7j7
2750A5J5k1qk3J8l5J2j1L2j0Pll2J9O2p2M7qN0j3Lm3Lk6%j8M3L0L2j3o2K2l3L0
2784IP5p4m2LL6m0O0j5m5L9l6M9J0%p9L5J4M3Jm6rM7p1O4k0M4m9k9K0k3K1k5j5
2817d8J6L5m2K7K5k8k7J3l1P8L0l2m4L0k4N8o8R5m4m0N2r%N0n3rm1J5L6JK2o2
2849a9jJj2N8k0l2KJ2J3L4J0p2jqQR3l5p0J8%J8N9j9N0o7j9N8m5J3n0J0pj5O7
2883C2o9PK4l1M8l1j1m9Q2K3%k0m9K4J7rnPM9l7J9j5K1j0K3k8nlQk4N9j0k9l1
$$ plain form
2655 -32 -13 -28 -53 -10 5 -38 -5 62 27 2 -18 -23 -2 24 16 -55 3 16 39 33 43 -4 21 13 43 -4 -35 5 47 -23 -27 -1 -16
2688 -16 13 -29 -56 7 -28 -51 -65 -44 27 -37 12 -39 25 38 -31 16 33 8 17 14 -18 57 37 62 -33 67 26 70 38 -11 4
2719 4 -17 4 -32 19 -19 -45 9 -15 10 -24 47 24 -47 -32 -9 -42 13 -11 -26 32 75 62 24 47 21 18 44 12 49 32 15
2750 15 30 9 1 -22 -4 -39 -27 -38 -6 -16 -9 -12 -44 -25 37 -35 12 4 54 41 44 1 4 -22 -22 -40 3 33 65 52 -10 12 -21 9
2784 9 84 10 -32 -29 7 -33 27 12 -33 6 -30 19 29 29 -50 -15 -1 42 43 -3 -12 35 -36 28 8 52 3 -26 -6 -29 -8 -33 -48
2817 -48 -32 3 -39 -12 13 -15 -42 -29 -60 18 48 16 -28 2 -22 36 -32 63 19 -21 31 22 22 72 19 10 -31 -16 20 21 43 -19
2849 -19 -20 -19 -31 27 7 -25 -23 -11 2 36 46 -26 -27 -35 -27 66 31 -39 -21 -21 -3 56 37 87 20 1 59 14 27 -23 -13 -20 -35 32
2883 32 -37 -30 -6 -37 11 -20 -31 -80 2 25 25 5 -44 -20 -3 -12 -17 -10 39 2 21 6 27 17 40 12 7 4 12 -12 47 37 8 -23
2917b3P%N4r4R7q5J1pL5rj7N1r9R9M1l0n5K4K0j2Qk7%J2Qj7J4jk1L9m6L2QqJ5
2952B4o8M0nm8J26p0J4N6Ln6n3P8pn9l0Q8k0J3l5j3N8jm4mM4l2m8J2LK9j1J2p2
2985g6O9o4O0L7mL8l8q2O8K9n9L8m5Q3q0lN9L2q1J2K1l1J0J5j7OK5p9M1Q3n8m0
3017c1K2l4Q9o2m5J02p0NK6M4pl7l2k3Q0k4l2O5Rq0L2j8O2Jm8K5l4Q4p6%l2O2
3049B3oj4N0n5j3jM2L7m6L6o0KJ8k6ML6kk6j8M5l2J0M3m3N0k0p0K5k9p%O9n3N5
3083B4o1N3n%K8j3L7n7mlM5k2jj4k7O7o8M0L1o0K1OJJ0k7m9J1M8p5L1PLK3q3O2
3118b1M7L3r5%K2MM5l1l1L4M0n8J07m8p5N5on3J6L7mLk0l4J4j6N4p2O6k3L7k3
3150DK7k7k2j3L3jJ8N3q9L6k2K1j3K3K7p9L1K0Lm4nk6M3J8L4j8j2Rp9L9O1k4l7
$$ plain form
2917 -23 -16 -16 38 -56 41 -44 -33 -40 -5 -14 -31 20 -79 20 61 31 -24 0 20 8 16 -11 -11 1 9 -8 6 5 -16 23 -23 9 17 9 24
2952 24 -44 -4 -9 -57 69 -1 13 69 72 16 -37 41 34 -25 -55 33 13 26 -9 -22 36 35 -9 -13 31 -1 -49 -37 -34 -5 -16 -4 -76
2985 -76 -7 -71 -11 26 22 60 22 -60 8 37 -22 16 -29 54 -26 -29 30 62 -19 -7 14 -17 -7 8 -9 -3 22 -57 -16 67 9 -31
3017 -31 -9 -43 46 -16 -61 41 -29 -24 2 46 39 2 -30 -53 27 3 -29 36 45 -35 -3 -21 41 42 -6 19 -15 69 -7 -7 -39 23
3049 23 17 3 53 -2 -15 -16 26 63 17 53 -7 -5 13 -13 -9 27 25 -1 -19 26 -6 4 47 4 54 34 -36 -11 -40 -47 -47 22 -31 24
3083 24 -37 16 11 11 39 26 63 6 2 -1 44 22 21 7 -20 47 -21 19 50 -10 11 17 18 28 1 -48 -37 11 -64 -33 -26 -23 0 -83 -21
3118 -21 26 59 -36 -36 -14 -10 35 4 -27 7 47 -11 96 48 -27 28 22 -31 -15 22 18 21 1 -33 -19 -35 19 -53 13 -10 27 4
3150 4 31 4 -18 -31 2 1 19 72 -17 19 -3 18 5 28 55 -24 7 27 30 -14 -19 -45 -2 16 50 32 20 29 -50 -11 50 26 -11
3183a1%k3O5M7l0o9J0K8m5OJ6j6RL8j7j4J9k0l3O0kllN0n5n6O0k8N4On2l6k4O9
3217@j9L0l0n3J11Mrq1O6ok2R2q4qK0Rq1O3Ql7J7j5KJk0M9j3k1j4k3N1P1j06L3
3251a5RQ0q1J4M0m0J2m5P3m1m9N7J8o4N4n6M1Kl0k9k2M8MJP6o4m6O9m4J1j0K4
3283cm8K5NO2q2Q8r0N9L1o4K4k1jN1jpj8j0M1l7J2l4m1P5M2q9K3O2o8K2J9n6j8
3316d7R6n4o1O5L2l6M3k4K5m9j0J9m1j7P8K3q3j6L9l3N0k5M4k0J1Mm5L3J1j0j
3347AN5K1l1rl2M7p0M2l1L8l0Qk2N8m1l0k1QK4J1k3j4M7n5L0J6N0q4O9n8J7L7
3379B8J0Ln4jK9K3N5n6l3L3l7qM0j5J6o3K2L0ol6j2pL4L0L1j06j0M0o1O2L5j8
3411bNq9O5l4J39n5n8N2l4%O9m0oMm8J15o2J7jp3l5Q2J6l9K9%qk5L0K5j5o2K7
$$ plain form
3183 -11 -11 -34 31 78 48 -21 -11 17 -28 -22 -6 -22 -13 25 8 -6 13 -7 -40 20 18 15 12 62 7 -49 11 -17 37 43 -9 -45 -69 0
3217 0 -19 11 -19 -72 39 43 34 -47 19 13 -9 83 -1 -9 11 20 -61 2 10 -27 -10 -25 -23 -22 -42 7 -6 -27 -41 -64 -13 58 -48 -15
3251 -15 -6 74 -7 7 47 7 19 -26 47 6 -43 14 32 -32 22 -34 7 9 -21 -50 -72 -24 -20 -19 57 -7 -53 16 -28 -17 -27 -3
3283 -3 -51 -26 -21 41 -41 47 -43 16 47 -17 7 -14 -15 36 35 28 10 0 41 4 16 -18 -59 16 58 -31 -8 54 -14 8 27 -29 -47
3316 -47 49 -5 -66 -1 31 -5 38 14 39 -10 -20 -1 -42 -59 19 42 -41 -57 -18 -51 -1 -26 18 -2 9 13 -32 1 12 2 1
3347 1 56 77 46 37 5 52 -18 24 -7 31 1 9 -13 45 4 -26 -47 -39 -15 -4 -27 -41 6 -49 -19 -3 47 -37 32 -26 -9 28
3379 28 38 41 -13 -14 15 38 93 37 4 37 0 -8 32 17 33 -30 -8 22 16 -20 -32 -39 -5 25 56 -50 -60 -20 -81 -19 16 -2
3411 -2 3 -86 -21 -55 84 29 -29 23 -11 -11 58 18 12 16 -32 83 21 38 37 -36 -71 11 27 -12 17 17 9 -16 14 39 24 -38 -11
3444a1K1Lm0N4Oj8n2L1J3N4r6o2N0mR6m9jn3O8l1mO4o4k5j5R8j9J9L4j16R5p9
3476c3N6k3Qj7M8nM1k0r6j5K4N7J9k6K7o3pJ7N7rm4k7nL0m7R5L3j41N3k6QN5m2
3509a8k1K3J8K9l2nM1o8mP4j4n2O7j16P0M8j5Kj8o9J9M5M1rm7m9J3K2Q8J2j52
3540g7N0M0j6M1%n4o8M9N0K8n5Rk0k7O5J8M4k3l0p8N6M3k8k0j9OJ3N1L0m3p2q
3572d5L5N1l4k5M7l1oKN7l3k9K2l7O5J3k2q9KN4K5qJ6pq7M4J5k0N2Jo8j3M4N4
3605D5j20Q8L0n3oK0L7l4l7J1n5P4LJ7k0L4n5qJ31j31k4J7L1j0K3k0k1k4QLM9
3636CJ3qo5M3L8o5L8J4k3M7L3l4oL8j17K8M3J1n2K6J4l6J6L1Lj8L1p6rK7K0j2
3668drN3m0j9l0N5k6O3j8J1J5k1n1O4pl8n6N3N2k0KK0q7L8J4L6p6N0r8PQ6LoJ
$$ plain form
3444 -11 10 13 -27 27 33 15 -37 -6 7 61 -35 -97 -47 -51 45 -4 -5 -58 10 -21 -25 39 -25 -50 -65 33 14 33 67 -49 46 -33
3476 -33 23 0 8 -9 39 34 75 55 -41 -56 -32 25 44 18 45 -18 -25 -8 49 40 -4 -31 -36 -6 -53 42 75 -66 -13 -39 -31 24 -18
3509 -18 -39 -16 2 31 -1 -6 35 -33 -37 37 23 -29 38 -78 -8 40 25 27 9 -60 -41 4 45 36 -11 -60 -47 -25 63 75 -77
3540 -77 -27 13 -3 38 38 -16 -84 -35 15 43 -12 -3 -23 -50 15 33 77 54 24 -54 2 45 17 -3 -22 -16 -3 48 78 35 -37 -45
3572 -45 -10 41 7 -18 29 -2 -8 -6 51 18 -11 11 -26 39 52 30 -59 -57 -3 22 14 30 23 -64 -20 -5 -25 27 28 -40 -53 -9 45
3605 45 -75 13 43 -10 -16 4 41 7 -30 -19 -74 0 3 20 0 34 -21 -29 102 -29 -53 -36 -5 -15 8 -12 -33 -57 -49 -46 3
3636 3 16 8 -57 -14 24 -41 -3 11 -12 35 68 34 28 66 -51 -23 20 31 -21 5 19 -17 -1 30 33 15 46 -30 -39 -12 8 -4
3668 -4 -13 40 0 -19 -49 6 -20 43 25 36 51 30 -21 43 36 -2 -58 -5 47 27 29 49 -38 0 14 50 -26 24 -74 -67 19 22 16 17
3702A7l9j5JQ5J5j13J2O0q7J09J5q3l4J4L4j4P0m0n5jN3j5J3j6M2k5M0l9K2m7
3732b1n0M5OO0k3j2l4J4j5L8QLll1RK0M8k7o1k2K4%P2k8n3Qn7N8M9Qk9r3J5N8
3766a6M3l0Pn5k7J42j7J7o2l2j7P4M0n8K6j11K0R7M6j0r9l4k1M6P4O4j39p1k2
3795a25J05PN1k0n4k6K0Q8lN8j54j9K5J04N6m4j29K0J7K1J2K7n3p0Q3l9N1K2j1
3824B0j08K8J29J9L0j33o2M0Q4J9J3n3p3p3J13N8J3r8l3L3k7O7P5p0n0pJ7K5M7
3853D3K3j03m0j0J13P5n4j13o7P7N8P5o6k8Mp6J13K5M0m1r7K5J3M8Q5j20j6q1
3881i5J18L5ok3l5q1O3O7P9o4j24M7O8k7k7J1n9mL8M6K1N9j25n2M1P8j6k6lKk0
3912a4L8L5j0o5k9j3N9NOoo5j6Q3Q9o9j00L3P9m2m2J15p0n7lK4N8K8pj2k5k4Q5
$$ plain form
3702 17 -22 -37 -36 49 64 -49 -37 23 -64 45 60 -23 -57 -43 -9 -23 47 7 -48 -49 4 -11 2 -14 28 3 43 4 26 -21
3732 -21 -71 -26 -20 40 17 5 -29 -15 -30 8 16 19 16 -15 -6 14 62 35 -26 -48 -24 -24 48 20 -33 -25 -82 -24 25 33 4 -89 -74 -16
3766 -16 27 -3 4 -51 -78 64 47 64 2 -30 -47 27 67 9 35 -76 -56 41 87 77 -22 -56 -77 -31 43 107 -32 -103 -125
3795 -125 -20 -13 38 18 -36 -62 -42 46 43 101 -53 -72 -47 57 113 69 -60 -40 -23 -2 10 37 -16 -86 -3 -42 9 31 20
3824 20 -88 -60 69 88 118 -15 -77 -37 47 66 79 26 -47 -120 -7 51 64 -34 -67 -34 -61 6 81 11 -39 -46 -29 -4 43
3853 43 66 -37 -77 -87 26 101 47 -66 -133 -56 2 77 11 -17 -13 -89 24 49 89 48 -49 -24 -11 37 122 2 -14 -95
3881 -95 23 58 52 29 -6 -87 -24 43 122 58 -66 -19 49 22 -5 6 -53 -57 -19 27 48 107 -18 -70 -29 49 33 7 4 6 -14
3912 -14 24 59 49 -16 -45 -58 1 6 12 6 -59 -75 8 97 28 -72 -39 40 -2 -44 71 1 -56 -59 -35 23 51 44 32 7 -17 68
3944F8ro5n6L4rL7N2m7N9p7lL9M8p3l3M2n5O1j4l3L7l1j7L4P1k0Po0l3M1J2jJ6
3977B2o1j6N9k3K0J0J6qj9KM6lp4l0O5PkJ6j1q5P6Lk4M7kNl4L0n7lJ1K0rL6J1
4012D1o1j5L8%N7n0l8O4o5n1M5M4k1m8L3LL8k2N5p4L4m0K9kj5lP9l1m8M3p0K2
4044b9N9lmj3n8K6K9N1k7q5JN4k0N3K2j34RL1R6l6l3Ll0OO6m2Q5o3r3J07Pkk2
4077A1N8r8k9M4N4kq7j2L8L4L7k8N7q6pL7pLl8o7Q2k2K1K5k1m9%N8nR3j06r0P1
4110c1N1l0L0L9j29J4N3P2m1Qo3J6oL0L8Jo5o3P4P3j5n5L7n7l3R1M1J4j99O3j8
4141f0J45ko1o9k2ON9J33o0j13k7O6j6K9lk9p3M5O6O2j3j18J8L1O2Lj8j7l6n7
4171f9O2J05m4j7j03Q9j0R9j00m2j4l3O0J10K0j46k1M8n2Q6R8j18r9J1P1J33m5
$$ plain form
3944 68 59 -6 -62 -28 -37 0 52 5 64 -13 -16 23 71 -2 -35 7 -48 13 -1 -34 3 -28 -45 -11 60 40 47 -13 -46 -5 7 6 22
3977 22 -39 -55 4 -19 1 11 27 19 0 2 48 45 -29 -59 6 13 11 27 16 -69 7 10 -14 33 31 36 2 32 -25 -28 -17 3 -6 30 41
4012 41 -20 -35 3 3 60 10 -28 36 -29 -80 -35 9 -12 -60 -27 -24 14 -8 47 -27 7 -33 -4 -6 -21 -24 55 24 -24 19 -51 -29
4044 -29 30 27 23 10 -48 -22 7 58 31 -54 -53 1 -19 34 56 -78 -69 -38 58 22 -11 -8 -38 -32 34 -8 77 14 -79 28 35 33 11
4077 11 69 -29 -58 -14 40 38 -49 -61 -23 11 48 20 77 -9 -16 21 14 17 -21 -88 -6 -28 -7 18 -3 -52 -52 6 1 94 -12 -102 -31
4110 -31 20 -10 20 59 -70 -56 -3 69 28 36 -27 -11 -17 13 51 52 -13 -76 -2 71 56 1 38 -19 -52 39 80 94 -105 -42 -60
4141 -60 85 83 22 -47 -69 -63 -4 129 69 -44 -71 -5 -21 8 5 -24 -97 -52 14 76 63 -55 -37 -6 56 59 41 24 -12 -69
4171 -69 -7 98 54 37 -66 23 13 112 12 -30 -44 -77 -17 93 113 -33 -54 -6 -58 28 126 8 -91 -80 -9 124 79
4198G9l9j27J3K0P9Q6j04j06lO6Q2Pm2p6p3K9K09j0q7m7j20J08J0J48m1o9r6l8
4226a42J93mj5p0jk5K2J07k5Jj61J0J44M5n3o2l7O7j1J09pq9j10L2N9R5m4J5q8
4255d5p9M4R5R5p4p7jP2RL2nm1j12j2J12N0n7m8l4Q1j2P9n0n8o9J7J07JJ9q1N4
4286A2j2JQ4l6m7o5J1Q5j9k4K9p4L0oJ34j00K0l9lM3oJ3l7lj00Q2Q3j4q1JR4p5
4318a9nK1Mj9pkL0J7j6o1P3j6p6R9rn7L8n8R6m9o1P4Q6j28K7J4J25q3q7P4k0k2
4350a7N0K4m7q0N3j9P9m2k2QJ5k8pJ22n2k3q1R5k8j9M6oQp0N8N6p9K5l4N4r5J11
4382E5Rk0j06k4Q6N6qm1l7N5m8K5J05qj36r3Q9J25J1q4k9o2l8J13J13J6j22o5
4410f3k4J17N7m3k9n4j0J4J65j8j41o5LN3J03O3j18r0l9J35O0M6r2q4o8J6J37
$$ plain form
4198 79 40 -87 -74 -54 25 111 7 -99 -102 -36 46 53 11 -65 -138 -109 100 90 3 -44 -164 -56 -46 102 61 -8 -104 -142
4226 -142 51 47 32 -38 -39 -64 -42 65 40 41 -120 -110 34 79 26 -36 -73 -6 -17 92 85 -4 -114 -82 -23 72 28 43 -45
4255 -45 -124 -80 15 110 36 -41 -42 30 39 71 66 25 -87 -99 13 63 6 -42 -76 5 -7 72 22 -36 -105 -88 19 20 39 -42 12
4286 12 0 1 85 49 2 -63 -52 33 14 -10 19 -55 -25 -31 103 3 23 -16 -19 24 18 31 -6 -9 -109 -27 56 42 -39 -38 56 -19
4318 -19 -24 -3 1 -18 -25 -27 3 20 4 -57 16 0 -76 23 14 -43 -5 -63 33 -16 -77 -3 83 -45 -18 -4 121 38 -49 25 5 -17
4350 -17 33 57 10 -70 -17 -36 43 1 -21 -13 2 -26 -33 89 37 14 -67 28 0 -19 27 21 29 -41 17 73 -6 19 -15 39 -56 55
4382 55 64 44 -62 -86 0 56 48 7 -30 25 -23 2 107 99 -37 -130 -41 84 95 11 -18 -80 -118 -5 108 124 2 -63
4410 -63 -87 30 87 44 15 -39 -49 -35 130 112 -29 -94 -91 -38 65 128 10 -80 -119 16 76 122 30 -54 -122 -106 31
4437C1J53n9k02j37J31J42R7j19q0q0o9K21J64o5j74j32P7J28J35m7j16q9q0J40
4461c0J81Q9k41j27j5Q0J84J08j14k15o2J17J51R2j39j80L0KJ05J74j15k14o9
4484b08Q4K09J21j29j56m4J2J27Q1M8k15j48O8J97R9q0n3j48rJ86K22q7k43r5
4508a61N1J05Q8M5j13j72k4K09R8L4j48j39L1N2J19M3Pk54r6K20J83m6j07q7m4
4533a06K7R5J33p6j55j59J91J76j5j08pj23MJ64J69j51r0r5Q9N1J45j24o0j24
4557a49j3K17R8k6j86n2J7J23N7N2j12j58qK08J34o0j82n4J3R5R8J9j24j22l4
4582a49J47J60q6q4n5jK2J29M1j65r6K2R5J31Rr7j18jM8J28J06q4k31L0J54M9
4608A04j7n4q0j03K7J80N7o7j02o6Q0Q9N2k8n7j10K1J11R9j07j06N3%o5J61L9
$$ plain form
4437 31 184 125 -77 -214 -83 59 156 37 -43 -123 -192 29 193 128 -46 -178 -101 27 162 115 -1 -90 -170 -30
4461 -30 151 240 -1 -128 -143 -63 121 229 115 -100 -162 -45 106 198 59 -121 -91 -89 16 190 75 -139 -208
4484 -208 -124 85 206 77 -79 -123 -111 16 97 145 -70 -218 -150 47 146 66 13 -135 -144 42 264 177 -66 -161
4508 -161 -110 -5 83 128 15 -157 -181 28 126 160 12 -127 -96 -44 75 118 125 -129 -225 -5 178 132 25 -62 -106
4533 -106 -79 16 149 73 -82 -241 -50 126 111 3 -4 -127 -123 41 210 59 -31 -126 -37 14 159 35 -25 -149
4557 -149 -162 55 153 127 -59 -111 -94 29 86 138 26 -132 -140 68 202 142 -40 -94 -81 14 112 131 7 -115 -149
4582 -149 -2 158 72 -12 -67 -68 -46 83 124 -41 -137 -115 -20 111 120 23 -95 -96 -48 80 186 102 -129 -99 55 104
4608 104 87 33 -47 -150 -123 57 114 47 -55 -121 -41 48 100 72 15 -95 -74 37 136 29 -77 -24 -24 -89 72 111
4634A11j46p6JJ86%p4m5J0KLM1Q9jk07N3R2J2l5J9q9RJ4J04Pj15n8M7O9J3J5p
4665D4l3o6PQ1nl7rN2m7n9Q9M1m7p7P3K2Km6M0J2m3o4M0P7q5M0O0Pj30M6pM2m5
4698b5k4P1o0M7k7L5J1p6K4m0J05o3j8j3Nk4J18mK6j05k2Q4M8k7m5o0k2K8L5J30
4728A12m8j28j0P4mN8k7n5n5PJ07O3o7m7n5K9P9K5JK7k11k3J32J60p7q4l4KK4
4757b5N9L3j1j50n7J42Q3k6q7Kp4J00rJ00j0j69l0J52M0nk3p8p2K0J60J2lj61
4785h7l4J40L1L4k8m5j38L7J44L2m1j50jN2M3R5Pj09j33J3J51J54j43l0l3l6Q4
4812IQ3qq3q7j5J64O1n5r0l6q2R9J17K2n2j78k4J42N9M1n1j01j3L1J11L8q8j42
4840a28j6Q4M3J14o5m1j44N8J35J24j29j16k7Q2K1Q5L7j94kQ2MJ21rj21m8l5L9
$$ plain form
4634 111 -35 -111 -110 76 76 2 -43 -33 -31 -28 13 102 101 -106 -53 39 51 16 35 -54 -45 -31 73 80 -35 -93 -46 23 36 51 44
4665 44 11 -55 -48 33 28 -9 -18 34 -13 -72 17 58 11 -66 7 29 31 -15 25 37 -6 -70 -30 47 -38 2 62 69 -61 -15 -22 20 -25
4698 -25 -49 22 -38 9 -18 17 28 -48 -24 -64 41 -22 -40 -53 -48 -72 46 42 68 -37 -59 25 73 46 1 -59 -81 -53 -18 112
4728 112 64 -64 -74 0 -4 54 27 -28 -83 -76 31 94 27 -20 -75 -46 33 58 59 86 -125 -148 -16 144 67 -17 -51 -49 -25
4757 -25 34 67 56 -94 -151 -9 74 48 -39 -37 -111 -11 -20 80 70 -99 -129 23 63 58 35 -43 -115 -95 65 77 74 -87
4785 -87 -121 19 50 84 56 11 -127 -90 54 86 45 -105 -106 -54 -11 84 91 -18 -151 -138 13 167 24 -6 -39 -75 9
4812 9 92 84 1 -86 -101 63 124 69 -21 -57 -139 -40 77 99 47 -131 -155 -13 46 87 36 -65 -78 -47 64 102 14 -128
4840 -128 -144 -60 -17 97 32 -9 -153 -95 40 164 35 -81 -108 -26 -5 80 117 -77 -79 3 7 128 119 -2 -50 -85 -46
4867d6R2R6j43l3n7J41m3J3k8l8n3K6J42K7j54m5M9N5J9K4k9k0j19P1P2P2j11
4894b0J9oJ4M3n0O8j04m6N6Q2pn3l8P1r5O5N1npj01K8R2j2l7nJ8p0JJ21p9n6k0
4926h2P1N7n5NK1Lj1J8J1jm5rj0J07q5K7n1m8Q7j8O7m4o0n7J03L9Rm5Oj4p5N9
4958b0R4p5j04P8P1m9kM9m2J7o3N4rqm6jN0l1N9J4K3j43M0J12Qp5m0RM2n7K7J04
4990H6j08j1k1M1R2o8J2J3m7j1M2j7mm6K7M4j8k2K7n6OL1K6K5o5k6K8J11m5o7
5020b1L7J2r4L5N5Ro9K0K6n8M9K3m8lJ1mO0nq5J0O7%j1l5M7q6j0K0Q7jm5k4N2
5053B1Jm3J9Pm5ok0J08m8n0mQ7k8J7k6Nn5J12o3P5p2l4N0N5n2lM6k4m9mJ05k9
5085E3p3l8k2O7mj5P6lr2M2Q1pp8jkM7j7K3l7j3k7L5Q7o9o9M1N0o3N0J0M6p2m3
$$ plain form
4867 -46 46 142 -1 -34 -91 50 7 20 -8 -46 -99 -73 69 96 -58 -103 -54 1 20 44 15 -5 -124 -53 19 91 -20
4894 -20 -1 -7 7 50 0 68 -36 -82 -26 56 49 -4 -42 29 -66 -1 50 45 38 -63 -35 57 45 8 3 21 -49 -48 73 -6 -62 -82
4926 -82 -11 46 -9 -4 17 20 9 27 38 37 -8 -17 -27 80 -5 22 -29 -77 10 -8 59 15 -45 -102 1 40 49 4 10 -4 -79 -20
4958 -20 74 -1 -105 -27 44 -5 -7 42 0 17 -46 8 -1 -9 -55 -56 -6 -37 22 36 59 -84 -44 68 76 1 -39 -30 12 -45 -18 86
4990 86 -22 -33 -54 -13 79 11 23 36 -11 -22 20 3 -1 -47 -20 24 6 -16 11 -45 -39 -8 18 43 -22 -48 -20 91 46 -21
5020 -21 16 28 -66 -31 24 33 -36 -16 10 -48 1 24 -24 -27 -16 -20 40 35 -50 -40 27 27 16 -19 28 -58 -68 -48 39 38 -7 -31 21
5053 21 22 -21 -2 5 -40 -46 -66 42 -6 -56 -60 27 -1 16 -10 -5 -60 52 -11 64 -8 -42 8 63 11 8 54 30 -19 -23 82 53
5085 53 -20 -58 -80 -13 -17 -32 44 41 -51 -9 72 65 -13 -14 -16 31 14 37 0 -13 -40 -5 82 13 -56 -15 35 -28 22 32 78 6 -37
5118c7J0O0n5J6nN0l1K2Lj7n8N4N3k5n4l2M8J8q7J12Lr4k4K7J00j5n6O2l9o3L5
5149a9L0PMj17R3J17p7Pq7N3r7P8L9Km8l4O7k0N8m0O0j31ON8O6J1j07l9K6J6L6
5180A8O4r0o8m1J32R9l5r1nq3M4P8QL0p5j52J42J06K0q4J5m7n4J06J06p5q5o8
5208h5K2J16L1oo0n4m1M9J75j0j42j26N1L7O1R5j01r4j6N0J95o2j12p5qR3K2J26
5236A31l3k17n2J06J37j1J5q4j00O9N6R9rk14nR7N1oL4q2m5m6O0K24q3j34p3N0
5264f5N9K2J09j20j02J0R5J20p8k4n9pj1P2N1m6p9k4Q9K8O4q6n8j7K7J02J6q2
5292Fm2j4J7J00l3nj2j41Q7P0M7p8k2l7O7J6lO4p2o7n8J72qr5J4m1P0n9P5M8m4
5323B2n0J1L9J9n8j8L3P3p8NM8m2RKJ3K3m4o0O6n8N4m2N8J6m2n0R1j5m2mK9j6
$$ plain form
5118 -37 -27 33 -22 -6 -11 39 8 30 33 16 -42 12 65 40 -14 -46 2 20 -67 45 48 -46 -70 -43 57 42 -14 48 9 -54 -19
5149 -19 11 18 22 -95 -2 115 38 45 -42 11 -86 -8 31 33 -15 -49 18 -2 56 16 76 -55 -49 9 75 86 -21 -60 -34 -18 18
5180 18 82 -8 -76 -117 15 114 79 -12 -17 -100 -56 22 30 60 -15 -167 -25 81 101 17 32 -15 -69 37 143 68 -17 -85
5208 -85 -63 53 84 78 18 -36 -77 -28 147 137 -5 -131 -80 -43 18 113 12 -82 -98 -48 147 85 -27 -102 -110 -17 5 131
5236 131 98 -119 -171 -65 72 61 76 -8 -108 -39 17 116 107 -107 -112 -15 36 30 64 -18 -63 -109 -49 175 92 -42 -115 -65
5264 -65 -6 16 125 5 -97 -87 8 128 50 26 -33 -40 -51 21 72 26 -53 -77 12 40 104 18 -40 -57 -30 72 88 6
5292 6 -36 -50 -33 67 34 29 17 -124 -37 33 80 2 -20 -57 10 26 23 87 15 -52 -110 62 54 -41 -27 -68 2 -57 18 66 22
5323 22 -28 -17 22 41 -17 -35 -2 71 -7 -2 46 4 13 15 28 51 7 -53 13 -45 9 -33 25 41 -1 -51 40 25 -17 -21 8 -8
5355hk2Q3j3Rr8PR2k2o6L2J4ok0J6K4j0n8L7nK9nKM7p2MN3m1n0L5M4j6m3rM3k5
5390a8J6POJ0l3n8R8Mk6l5M2o3k0Q5j0J2o6ML2oJ3j2M7o6KM8M3l4op6O8m3j2J6
5424c1J4l3P6L0k8J0j01R6j7j0m5L8o5k2M8J04l4p9qK4M1j7N0l1j29J03K1P6n9
5453B2n3m5Q2KJ1K9o2no5P5R2l2q0Lm1L4J13K1o9q7j5M2O3P9o1q2p4M7M0O6Qj29
5485g1l9Q8M4N9lj01q3K7Q6R9l9n3r7M9Q3J5K3j34j03P8J08M7l5j16jk4J05K5
5513C7L8j1j44rJ14R6m9j21Mj2qJ07N0o8q0m1M9J23n5k4J8q1L3O7M0k1n5m8N0
5542aM2lL2p3p6M0J01j5Kn9o5RR0NM0m6p9J1O8P0n0r6j4L2NN1N4r4q1O5M8Lm8
5575c2kJ1n5M5N5M5l5j02J3M9O3q0RL4k0j5R6P2j67k7M9J9j5M7Om3o7j8J41p8
$$ plain form
5355 -8 -30 53 40 49 -49 -42 50 28 -38 -6 8 2 -18 -2 22 12 -46 -9 -14 15 10 12 59 -13 -9 44 3 -47 -12 32 16 -27 -36 7 -18
5390 -18 -2 5 11 21 -12 -70 28 32 6 -29 13 -50 -70 15 5 17 -49 -45 -13 -19 -6 -18 29 -37 -35 13 56 22 16 -60 8 -35 -47 -31
5424 -31 -17 -50 26 56 28 38 -63 33 16 6 -39 -1 -66 -88 -40 64 30 -49 -57 -33 8 -9 41 10 -119 -16 5 81 22
5453 22 -31 -76 6 8 19 48 -14 -19 -84 -9 83 51 -29 -26 -67 -33 80 101 32 -55 -70 -28 35 114 53 -29 -103 -56 -16 50 58 -71
5485 -71 -110 -22 22 81 78 -23 -106 -79 7 106 67 14 -83 -34 49 64 87 -47 -150 -72 36 83 48 -68 -69 -93 12 37
5513 37 75 64 -80 -89 25 121 72 -49 -45 -57 -65 42 92 24 -56 -97 -48 75 20 -4 14 -67 -34 33 73 52 -3 -51 -1
5542 -1 41 38 70 -3 -79 -39 62 47 49 -10 -75 -66 24 29 69 23 -56 -45 23 93 43 -53 -67 -35 -30 21 75 -19 -100 -35 13 16 -32
5575 -32 -34 -23 -78 -33 22 67 32 -70 -57 -8 55 -25 -16 18 -2 -17 79 151 -16 -43 6 25 10 57 63 20 -47 -65 76 -2
5605bJl3L9j2MqJ1l0m7N7J9L6o4L9m2J4QN9Pj21KK7R2j7n6M1m7mK0L8K2p7Pk8
5639d5L7k9J2M2n5M9J8K1m6k4k9L1P3ml8k8l8K5K4R3j01%nN3m8k3O7J2p8kL6N1
5671E1j9n6K3l1K9lL7j1r4J8R1m5rL2k4J5p9R7Pj1m1m0R0j0k5L9m0Q9m4Pq5L0
5703a2j3J5M5J5j6p1OJ4K6L5l7l3K3J8J8o6L2M2o3J3p1R1jn5M7m3M0MJ0O0n8q
5735G%J5J0Rl5m3O4p4N3L6j5l2PL3l1J3nK2Nn0J3N7r8Q1k2K0m4k1N1n9M9j3k5
5768b2pP0o8L1J00j35N0Mnj6k2lN8m9M8m3R5p4l2L6J3r0L2kj4K3P6l5%j9M3m5
5800bJ1k5J6L0k7k9L3M2l8l5O7k7k2KK2Lm4m5Q4M5m5Kmj5Pj1K8L9j04M8J7j7m4
5833c8k2J12n7k2L5K0o6J4mM1K5n1J5L3p4k6J32l3n0K0m4RO8qN5q3K4k1K6m4k8
$$ plain form
5605 -2 -1 -34 5 -7 -3 -11 0 -30 -77 -20 -1 35 -29 10 -32 -18 -10 49 56 -65 -63 -36 56 39 -17 24 -23 -27 -7 31 53 -24 -17 -45
5639 -45 -8 -37 -25 17 -38 11 29 50 4 -20 -49 -18 55 51 13 -15 -53 -28 -4 89 -12 -12 -17 36 -12 -35 32 44 -34 -36 0 51
5671 51 32 -24 -1 -32 -3 -6 31 20 -74 -56 35 -10 -19 13 -11 4 -75 22 29 18 -23 -63 27 17 -8 31 -9 80 36 43 -42 -12
5703 -12 -25 -10 35 50 34 -37 -31 -17 9 44 7 -26 -3 15 33 -33 -1 41 -22 -9 -80 11 10 -45 2 -41 -1 3 13 73 15 7
5735 7 7 22 32 41 6 -37 27 -47 6 42 27 -5 2 35 4 17 12 34 39 -11 2 59 -39 42 20 40 -4 -25 26 -33 16 3 -22
5768 -22 -29 41 -27 4 104 -31 19 23 18 2 -20 -23 35 -14 34 -9 86 12 -20 16 29 -61 -29 -31 -45 -22 54 19 19 0 43 -2
5800 -2 9 -16 0 30 3 -26 7 49 11 -24 43 16 -6 -4 18 21 -23 -68 16 61 16 18 14 -1 6 -5 23 62 -42 6 23 6 -38
5833 -38 -60 52 -5 -27 8 28 -38 -24 -28 13 38 -13 2 35 -39 -65 67 34 -16 4 -40 -31 37 29 84 1 25 4 30 -14 -42
5864d2K1N9k3J7On5N1o8l5O1k6J3k1J0j5qP2O3r3k6%JMQK2J6j8j6M6p2O1lK3K8
5898F1q1l2Q8m3j0oN8l0k0M5L8m7jMjj0m3K9j6M2m8J0NJ0K5p4J12o2j1K5N5o2
5930A0n8mM5K1j5J4mq4O8J9O4p0n1L3L1J0l1K2m1j8L6j3R0l5n6M4o0M1L4o2j3
5961c3Ol8N5O9l2j20L7L8l3N6J7J3m1m3J16n5N1p8M5j30J9J51l1k5r0O6k0R6k7
5990C9l9K2n5j1P7Mo1l3k6P2o7O5M7m4o4K2P6J0o1Rk4L9K0k9N5l6n3mN5N0k4n1
6022b0j7O7k7K4L7r1j5J1P8k2l0K9o6L1J2J4l7nN8n3L8n2M6N2Kj26K7j7M6k9K7
6053hM2l2k7mN5J7q5J6j1j3M6nK8j9J0m6N4m4j9RJ01o5j8P6m0J8p7Q3k2j0m4N0
6085A6k0m8J4L8J9j1Lj3NLj5P6k1r8kO1Rk0k2N3q8j2M5M7mj1j5K3j9p5J07Nk1
$$ plain form
5864 -42 -21 38 15 32 38 -17 34 -34 -69 -8 -34 -21 -42 -32 -47 -55 17 80 -13 -39 -39 -38 -34 -26 -4 12 -6 -22 24 -48 13 10 33 61
5898 61 -20 -52 36 -7 -17 -23 35 5 -15 30 68 21 20 24 23 13 -30 -1 -17 25 -23 -13 -8 2 27 -47 65 3 -8 17 72 10
5930 10 -48 -52 -7 14 -1 13 9 -75 -7 12 76 6 -45 -12 19 29 -2 20 -21 -39 -3 -16 74 39 -17 27 -33 8 42 -20 -33
5961 -33 -27 -65 -10 59 27 -93 -56 -18 -51 5 22 35 -6 -49 67 12 63 -15 30 -100 -81 70 39 14 -76 -10 -30 66 39
5990 39 0 22 -33 -44 33 37 -24 -57 -83 -11 -78 -13 34 -10 -74 -52 24 34 -27 -18 -42 -3 17 -12 43 7 -46 -50 5 55 31 -20
6022 -20 -37 30 3 27 64 -27 -42 -31 47 25 -5 24 -42 -11 1 15 -22 -27 31 -22 16 -36 10 62 64 -62 -35 -52 -6 -35 -8
6053 -8 34 2 -25 -29 26 43 -42 -26 -37 -50 -4 -9 19 0 10 -36 18 -26 -45 -36 65 0 -18 58 18 36 -41 42 20 10 -34 16
6085 16 -4 -52 -38 0 19 8 11 -2 3 6 -9 67 46 -52 -54 7 16 -4 -26 27 -61 -73 -28 19 15 4 -11 12 -7 -82 25 30 9
6118Im1P3PMq4RkJ0L7j0K7j05QO0j6K4k0lN4l7k1jP1o1j4R0r1M2k7Nj6l5M0Q1
6152F7o0l3KL5K4l4o9L1j3L8j1Q5p5n1L1M0Pn5L9j3o8J0J16o1j0k5O5k0N6m1L6
6183D3o0l7L7N0jj03M4p4J27j2j4P5p3n0j6J02Nk8l5j2l5M9P1p9j3k4kP7j2L2
6213C2k2r6M3QO6M7j19n5P8K4K4K9m2m6j4M7M0K3n7o0K9l4O2O2Nq0n8J4J07kj2
6244D3m8p7L2R7K7m8n1j8K3LQ0l7p8j4J1%O8O7q4m7J8K3J2O3m0r8K9j7R1L8r3
6275b5N4o5m4Q2L7M4q0n9K7O8Kl8k1k2K1pR9n7pl8j9O1Nl9j1l4QJ5J12Nr9%K2
6308cj8M7m0O6n1o2K6Q8K8o5n0m7J52j32N0J04r1n5M1L2nq1P7J1n2J1J9K0K5j44
6338i9J42k4J6l9K5j5q7R8k2K3p4K5M9l7k1J1j2NK1J4K7l0k0oQ1m7jn%K5n3P4
$$ plain form
6118 9 -32 41 48 52 -32 -23 -25 -15 22 12 39 -66 -58 2 -14 10 -10 -13 41 4 -17 -18 53 -8 -22 68 -23 19 -8 -3 -19 -54 -14 67
6152 67 7 -26 -24 11 35 1 -68 -37 -50 -12 -23 62 -13 -64 -33 7 14 -41 -2 -15 -83 -73 43 -18 -28 -53 12 -8 48 7 43
6183 43 -17 -54 -17 33 32 -71 -27 -101 26 14 0 75 2 -48 -64 38 43 15 -20 -32 -67 -18 53 -26 -39 -63 -65 12 0 32
6213 32 10 -86 -43 -35 31 78 -41 -96 -18 6 30 59 17 -29 -43 4 44 67 10 -50 -21 -55 7 69 74 -6 -64 -50 57 55 43
6244 43 -5 -82 -50 47 74 26 -25 -43 -20 -17 63 26 -52 -66 -55 -55 13 80 -4 -51 -33 -10 2 65 25 -73 -44 -61 30 68 -25
6275 -25 29 -36 -80 2 39 83 3 -56 -29 39 41 3 -18 -40 -19 -26 73 16 9 -29 -48 13 18 -21 -32 -66 -58 -43 69 74 -25 -25 -3
6308 -3 -21 26 -14 52 1 -61 -35 53 81 16 -34 -81 71 -61 -11 93 2 -53 -12 20 15 -66 11 22 -30 -19 0 20 45 -99
6338 -99 43 19 35 -4 21 6 -81 17 -5 18 -56 -31 18 -19 -40 -29 -41 -36 -15 -1 26 -4 -24 -30 51 4 3 -2 -2 23 -30 44
6370D4o7L6k7l0N0M0o3JO8o8RL2j4J6q6J16l2k6LK6j7m7O0l9K7n8O0k2l9P0k5
6401bL0o1k8J5J13o6k9J9pJ7q6J23l8J3m2J7M2jo2QJ5mQO0l1m2n7N0M3j8K9n5
6433b7LK2j7M3J3m4nm6Q3o0M8kj02L9K8O4l9k8M9K2k4n8R5m9l2L0k8O8m2m1M2
6464Ej3NJ8jJ6n8o1N9N6Oj04P9N0p2J9N0rj03N3M2p4K2L0j4K7l5qL6l2j5k0L8
6496hN9p1M0JLo8j4Q9n2O0j4n1k1L2j1R3k3o2L0J3P6r3J7k9kk0QN5n9J8O%J0k2
6530a0OM2p8k2P3M1q8K8K0o7K8P5M3j08k7L8L6N3p1l0M8o4l2Q0K1k3n8k3P7L4
6560D2qk4l4o9L4N5N7l1m0OJ2m5L4P2l5n9O8kk1L1q8Q0l6o3J11Jm5J4l6Q5k1j0
6592C5K8r9lK3J6M7k0p7M9j5J5K4J6m5o1N0pL4pk3M4n3J9J7O1l6o4mJ2M8J0k1
$$ plain form
6370 44 -23 13 -14 -44 6 46 -17 -16 52 -16 -7 25 11 27 -59 57 25 -1 2 28 11 -36 24 -15 12 -46 14 -8 -47 23 -2
6401 -2 28 -33 -61 -46 67 1 -28 -9 -16 1 -85 38 0 13 -29 -12 30 29 -33 -25 -10 -14 -6 54 23 -19 -76 -26 17 -1 28 -27
6433 -27 -24 -2 -19 24 37 -7 -12 -58 25 -35 13 11 -91 -52 -24 40 1 -27 22 44 20 -38 57 8 -24 6 -22 46 4 -37 5
6464 5 -8 -3 15 14 30 -28 -89 -30 26 32 -72 7 57 -15 4 54 45 -58 -5 37 -37 -15 15 1 28 -7 -15 21 -11 -26 -46 -8
6496 -8 51 -20 20 21 24 -44 -58 31 -21 39 25 -26 -47 -15 -26 67 44 -18 12 25 101 8 25 -4 -6 -26 -18 37 -22 -4 2 2 12 -10
6530 -10 -4 38 -40 -62 11 52 -36 -8 12 -55 -27 48 91 -17 -44 -6 30 83 12 -18 30 -34 -66 14 35 12 -46 -69 8 42
6560 42 34 10 -24 -93 -59 -4 53 22 -18 -12 0 -45 -11 61 26 -33 35 33 12 43 -45 35 -1 -64 47 48 3 17 -19 66 45 35
6592 35 63 -36 -39 -16 0 47 27 -50 -1 -16 -1 23 39 -6 -67 -17 -24 10 3 -20 24 -29 -10 7 68 32 -32 -36 -24 24 34 13
6624A3j7K3k4OK7k8k4l1J10l6M4m3k1km5N2K6n1l8M6L2NOJ7p9Kk4R0m5J2l3LK4
6657cm8K2N9n5ko6M3Q1k5L3n3M5k8K8O1p9j4M1OJ1rj7K2o5l9Q3l1m0j7M7j8P8
6689E1o0L3n7Pj7P8L1j22M8l9K4pN9j8k1k3k9Q7j1J4r3O6l2K2k5N7M9q0o2R4j8
6720FOl0O0l4j4L7K4k8q5O1qj0j4L3M2q1pPJ02l6qmn3j5K2J01p1KK3j3pMm3Mn
6755c2K4m0N9N0n7K4p3O0Mk5K0j4J3k7O4k4j7l5L3k5L0k1L7o0j1J6L4O5r6O8p3
6786b9m6K6PR6l2Jp8OK4N3Kn7N6n0lR9o0j2l9L1nL1L3m9k1k0%L8K7m7Kl5J2k3
6820f2O8Qk3l2pRP0J1l5o5J0P2N3l6p8L0%mO8Mk0j06k6J45j3J8q6l0PJ5R1L3n2
6853C7p6kM2K5rl6l0Km1J47L8j07m7K7k8rQ6J0j8j1m3J9J09m6n2Rj1L0K0K5m1
$$ plain form
6624 13 -4 19 -5 1 28 0 -24 -55 55 19 63 20 -1 -3 -48 4 30 -21 -59 -13 19 24 30 47 -32 -30 -54 36 -9 3 -30 -27 -3
6657 -3 -51 -29 30 -25 -27 -93 -50 31 6 39 -14 31 3 31 92 13 -1 40 46 57 48 31 53 -12 -51 32 1 -39 -56 -9 -27 51
6689 51 -9 24 -33 -26 -43 35 66 -56 -8 -47 -23 -30 29 11 -10 -33 -62 25 14 28 -65 1 -31 -9 -34 23 72 -8 -70 24 6
6720 6 12 -18 42 8 -6 31 55 27 -58 3 -5 -15 -29 4 46 -35 -42 -35 67 31 23 19 -34 -49 -27 74 3 5 28 15 8 12 -31 -27 -32
6755 -32 -8 -48 11 61 4 28 -45 15 19 -6 14 0 13 -14 50 26 9 -26 7 -18 12 -9 28 -32 -43 -27 7 72 -24 44 -29
6786 -29 -75 -49 -42 54 22 23 -55 -49 -25 28 30 -27 29 -21 -24 75 15 3 -36 -5 -10 21 54 5 -16 -36 -36 2 29 -18 -16 -51 -39 -62
6820 -62 6 14 -9 -41 -48 -39 31 42 7 -58 -48 24 77 41 -37 -7 -7 -11 57 61 41 -65 -91 54 41 59 -27 -57 -50 -35 56 89 37
6853 37 -39 -41 1 26 17 -19 -49 -47 -88 59 97 -10 -57 -30 -58 -67 19 29 11 0 -43 -24 85 39 -13 -4 -15 15 35 60 19
6884A9n2mO0J8J4j4o3L0m9J03j7oq1oM6l0L4J3k1j7rP6j8j1j5j7k6K3N8j01O2
6915aj7q0L8R6m7Lj6m5N5Kj8K9Qj5QO2Mo4o5Q1jn5L6J9K2n1N3j1J9j5m2J5k1J5
6949AJ2k0l0rQ6Jn9Rn8J7L7j4N9o1%m9M1N0l0N1l3k0K2K8j7P1n3n6L7J3J7j8k8
6982ck8L8L1L0k9m1K6m1L6K1Qq4K1%J9L6on1Rmk9K7O7n7l9L5J3K6n1K6o8J03%
7015D1L5j6r9K1L7Ql4O2l1pj11R1K8jL5r3PP7k7%No2LK4J5%J2l1j7L2pM9n8qJ1
7050ik0L8k1k0k2R9p1kP2o1M7n7K4L0k8J8pm6L1QJ9L6l0o0j4K4KM1l7QK7n8K2
7083a7L9lm7lNL7j1k1Lk0K8J2k7K8J1j4k7L1m2J9m6J00j9l4OJ8m9Q2k0Jn3l6N0
7116a9rL9K1j8p6P3k1J1J4p2N5l1O5n5N6k1j8M4q8P9j1K5k8l7K4J0j8L7m9%J2
$$ plain form
6884 19 -33 -37 23 41 55 41 -22 8 -41 62 45 39 -42 -48 -2 -32 2 15 -6 -23 -32 44 26 15 0 -17 -43 -20 38 -63 -1
6915 -1 -18 -98 -60 36 -11 -8 -24 -69 -14 -12 -30 -1 7 -8 0 62 66 2 -63 18 17 -38 -2 17 39 -12 41 30 49 34 -8 7 -14 1
6949 1 13 -7 -37 -46 40 41 -18 -9 -67 -50 -13 -27 32 -29 -29 -78 -37 13 -17 34 1 -19 3 31 14 85 32 -24 13 26 43 25 -3
6982 -3 -31 7 38 68 39 -2 24 -17 19 40 48 -36 -15 -15 4 40 34 -17 -8 -12 -41 -14 53 -4 -43 -8 5 31 -20 6 -62 41 41
7015 41 76 60 -39 -18 19 27 -7 55 24 17 -94 -3 25 24 59 -34 -27 50 23 23 28 -34 -31 -7 8 8 20 -11 -28 4 -3 46 -12 -20 -9
7050 -9 -29 9 -12 -32 -54 45 -26 -28 44 -17 30 -27 -3 27 -1 17 10 -36 -5 3 22 58 28 -32 -46 -22 -20 21 -16 -8 19 -39 -17
7083 -17 22 19 -28 -31 -26 11 0 -21 -18 -38 -10 2 -25 3 14 0 -27 4 -38 -19 -65 35 16 -18 -12 6 -43 39 19 20 -33 -69 -19
7116 -19 -28 11 32 14 -62 11 -10 1 15 -57 -2 -33 32 -23 33 12 -6 38 -50 29 18 43 15 -22 2 12 -6 31 -18 -18 -6
7147fl0Q2n0MJ1l6L2j3K1qm8J9L1K6j3k9m8O5k4jj2L2l6n5L6N2l8oJ3j0j0L1m
7180b2M5l6l8PP4m6K3m8M8K5o6J7L3l3K7MJK1ko3M4o7M1K8m4L2k8KK8QK9j2n1
7213a9j6kP0o6%n2J17m9lk5J9L2l3l2K4Q0n0L3m8K0j0L1l2L3m5Q2k9Nq5J9QO8
7245D5k5m9l4J16k2l8N2m1qK4p6l0R4k6M4k7%pL2j8j9J00p2m3M7o0K8M0lRj8Q
7277B3Mj9o4J9J7J0NPJ3m7J1J2J1J4l8M4j5N4q0J2Q3m8k0m2O3m4QN1o6jK4k2K
7310a9M7n0L6p6J1P1jj1nK9omJ8o9O6l0l3Q0pp3L3k9nK4M0n9Jk0L0K3K8l9j1l5
7344d5L4J5mm5N4l6J8n1L8RrL5o0L5KN8j4j2m7K8M1j07M5M6n0PL0M3j5k1o1%N7
7377A8j0Mk9J4M7k6nLj9M2j07N7qJ5K6l0k9Pj0J1M0MNq7J1Q0Jl9J2RJ1k9K6J5
$$ plain form
7147 -6 -36 46 -4 0 11 -25 7 -6 15 7 -41 -22 9 35 22 -7 -55 10 -14 -15 -27 5 -31 -86 -50 2 -36 -42 -29 -39 -49 -18 -22
7180 -22 23 -13 -51 -44 30 -16 7 -41 7 32 -34 -17 16 -17 10 14 15 36 34 -29 15 -52 -11 17 -27 5 -23 -21 7 15 44 32 -19
7213 -19 -35 -37 33 -33 -33 -85 32 -17 -20 -45 -26 6 -27 -59 -35 45 -5 28 -20 0 -10 21 -11 22 -23 59 30 35 -50 -31 -23 45
7245 45 20 -29 -63 53 31 -7 45 4 -4 20 -56 -86 8 -18 26 -1 -1 -8 24 6 -13 87 15 -28 19 -41 -13 27 24 33 15 23
7277 23 27 8 -56 -37 -20 -10 -5 2 15 -32 -21 -9 2 16 -22 22 7 61 -19 -7 76 28 8 -34 29 -15 -7 44 -22 -23 1 -21 -19
7310 -19 28 -22 14 -62 -51 20 19 8 3 32 26 22 40 -29 37 7 -26 54 47 -26 7 -22 -27 -3 37 -22 -21 -41 -11 12 40 1 -10 -45
7344 -45 -11 4 0 -45 9 -27 -9 -60 -22 -13 -22 13 -47 -12 -10 48 34 22 -25 3 44 -63 -18 28 -22 -15 15 58 43 22 -39 -39 18
7377 18 8 12 -17 -3 44 18 13 16 -3 39 -68 -11 -19 -4 22 -8 -37 -30 -40 -29 11 15 20 -67 -56 24 25 -14 -2 7 18 -11 15 30
7411C0k9p6O0N5p1PRM3%pj0M3p1MP9j03LOkk8N7l7m%P6p0jL1L2o1l4R9o3K6j1
7446a8M9Ql6qJ3K2n9QL4k3JlJ5L1o1M6N1n6L2m1Ol8L0k7J2Pl3K8k4J9Mj1K2m5
7480d5J3K5j0kl1k1N9KL5m8J8k8J2L2K6rk4k5lO1p2K9j4N9q9L3OL5K0k7o7rQ9
7513C0Rl7l8J9K1n0l0N3l1L3l8J3J06m4oKp2L4N5k6N9j34L8O1m0pM1p9L4L1j9
7544a2K7k4J9j7Ml5P1k5n6K0l5J02J9l7o2J8J3o5J3J13p7L0mn3Q6j1k3n8k3N3
7574b9M0N2o8l6M2L6k2L4l7j5n1NP5l4M5l2%m0N6Ll7M4o3J0QL6k3Pm1j7J9j8O0
7607Ik1k8k9K9Q3Jk5l2n8K3O6L0rkq6mL0K0K7l3m7J2M1j2L2Qm2n9Q9Ol9jP0p4
7641b5O7k5k7L6m8K1%N2kj0o7MKN9%j0o8L9l2M2N6n8j3pJ8j5L9j2l1L5l5j5J5
$$ plain form
7411 30 1 -75 -15 40 -31 -24 -15 28 28 21 11 54 -17 -13 66 -37 -34 -28 -30 -58 -1 -38 -42 -42 34 -36 -37 -6 26 -35 -69 30 -33 -7 -18
7446 -18 31 39 3 -5 8 30 -29 -21 13 -10 -9 -12 3 34 -27 19 70 14 46 5 11 -27 3 -24 -12 -5 -38 -10 -34 -15 -11 -22 0 -45
7480 -45 -32 -7 -17 -19 -50 -71 -12 -10 25 -23 -5 -33 -21 11 37 28 4 -21 -24 37 -35 -6 -20 39 -50 -17 -11 24 44 17 -50 -59 30
7513 30 39 2 -36 -17 4 -46 -76 -23 -54 -21 -59 -46 60 16 10 12 -60 -26 29 3 62 -72 -34 27 -13 -20 21 -58 -24 7 -12
7544 -12 15 -9 10 -7 -3 -38 33 8 -48 -28 -63 39 58 21 -41 -23 -10 -75 -62 51 -26 4 0 -53 33 22 -1 -59 -82 -29
7574 -29 11 63 -5 -41 1 37 15 49 12 -3 -54 -49 26 -8 37 5 5 -35 21 24 -13 31 -32 -22 -14 22 -1 6 -35 -52 -33 -51 9
7607 9 -12 -40 -69 -40 43 44 19 -13 -71 -48 18 48 39 37 -49 -53 -23 -3 24 -9 -56 -44 -3 -15 17 25 -17 -76 13 19 -20 -21 49 -25
7641 -25 42 17 -10 26 -22 -1 -1 51 49 39 -28 -24 -22 37 37 27 -41 -2 -34 8 64 6 -7 -14 4 -11 28 16 -15 20 -15 -30 -15
7674a5N9o5J4J1pj4jJ7l6oK4K7kj3L0n9J2LL3j2k5j0l1N0M2j7j7Mj5J2J0l4L2
7707AK6kj0okK1p1K3K7J4n7L8k3K1J0j0J5K9n8L3j4o6J9O6n0M2K0ql0l6M0J0M9
7740F1n4l7K8L4m4qk3J0Rj6N1m%n9N0Ok0K1j2jK8j7K8j2LNm1N9J6l7jl6M1k3K3
7775B8k8k1J1J6k8K9K4k5L8pn4LM4k5K%l2J2k3L3K3j9l4N6j5L5n9NK8rJ4J0k2
7808A0k0O0o4j5K5m5L5l8M0J1K4r4M8J2L9n1On7N6l4N7Qk9Nk9J9j0O2J5j00mJ3
7840d5K6P6j18P6j0L0k4o0M7J6q9P8ll0N5L2m6K8p7J7O0m0j5pK4m3J1J4j4JJJ8
7872a1N0m1KJ5o9M1j2N1j6p6J06rK4q5M4K0k5m7Q0L0j06M4n4O0oK2j7k9NJ9j4
7903dK4J1o1j2L3L4m3J1J7m8J2M5n2O4J0p9M0ML6m0%P4j15J1J8K9k7ORk2j1K4
$$ plain form
7674 -15 44 -21 -7 4 -3 -17 -18 -1 -37 -43 -19 8 6 -7 23 -36 -24 -21 12 0 -25 -35 -66 -16 26 9 -8 -4 -19 -7 3 -31 1
7707 1 27 25 15 9 7 28 -43 -20 7 21 -36 2 -21 0 10 0 15 44 -14 19 5 -61 -42 24 -26 16 36 28 -2 -38 2 12 61
7740 61 7 -30 -2 32 -12 -20 -43 -33 -24 -40 11 7 7 -52 -2 4 -16 5 -7 -8 20 3 31 19 22 27 -14 45 61 24 23 -13 28 5 28
7775 28 0 -21 -10 6 -22 7 31 6 44 37 -17 -14 30 5 7 7 -25 -13 -36 -3 20 1 -33 23 8 43 -16 -11 17 8 22 32 10
7808 10 -10 50 -14 -29 -4 -49 -14 -52 -12 -1 23 -71 -23 -11 28 -23 -17 -74 -18 -52 5 13 -16 -11 -40 -21 -31 31 46 -54 -58 -45
7840 -45 -19 57 -61 15 5 35 11 -49 -2 14 -75 3 0 -30 25 57 11 39 -38 -21 39 -1 -16 -23 1 -42 -31 -17 -31 -30 -29 -11
7872 -11 39 -2 0 15 -54 -13 -25 26 10 -66 40 31 55 -30 14 34 9 -38 42 72 -34 10 -44 16 10 32 15 -14 -9 10 -4
7903 -4 20 31 -30 -42 -9 25 -18 -7 10 -38 -26 19 -33 31 41 -38 2 6 42 2 2 76 -39 -28 -10 19 -8 -2 7 -15 -26 -2
7935bk4M7m9lM8J1nj7l0l5L2K8l7j7L0pK1m0J14o1l2ol1N1J9k0p2M8L6LN2r9N1
7968DNo1M0J4M5j0l9k1L5n0J9l3O6m1QO8m1K0J9l7m5L9Mk2Rl6Ml6P8q3R8J4k3
8001A1J3p9L3j2L0jMk3K5R%n6M8J9m5K7LOn9L3k4P7l5n6KN0m7O7m5jL1opk5O1
8036B8k9n9R5p4rKM6k0k7R9q8L8L2j9k2K0J5r4P2rN3p6K1kok1K1rP5l7p3L8qq
8070c5K8M2l3L8p2N7l1k2KQ4q0nn5Q5l3RM7pm5m9J12o5O9p6N3pJ5jl8K4K0n9J06
8103G8l2n6pJ1j1K0k2o0O6l1M8lK4k9JMK3o2j8N5%Oqj7K4m7l1M8k1J8j7P1Ro3
8137b9rON4n4mK2j6J5J1m3jK1lO8K0k6K1k7n7L3n1K5j7M4L8k1n5PqL0l0J2j4N3
8171A5J7p8N9k8K1j1LjPj4j9L3L1j8m2KM6j8J3Q
$$ plain form
7935 -2 -26 21 -28 -31 17 28 23 6 -24 -59 -27 1 -36 -53 -23 -30 -9 -49 65 4 -28 -34 -65 -14 5 -15 -87 -39 -3 0 52 -47 4
7968 4 9 -52 -12 2 47 37 -2 -23 12 -38 -19 -52 14 -27 -19 49 8 28 47 10 -35 4 8 -14 -5 -41 -37 -73 5 -78 20 34 11
8001 11 24 -55 -22 -34 -4 -5 -1 -24 1 10 10 -46 2 21 -24 3 6 12 -47 -14 -38 39 4 -52 -50 0 -47 20 -25 -26 5 -1 -8 -33 28
8036 28 -1 -60 35 -39 -48 -46 0 -20 -47 52 -36 2 34 15 -7 13 28 -66 6 -3 50 -26 -5 -7 -13 -34 -13 -22 53 16 -57 -19 -27 -35
8070 -35 -7 35 2 40 -32 25 -6 -28 -26 58 -22 -27 -82 3 -30 -21 26 19 -26 -75 37 -28 41 -35 18 11 26 25 -13 11 31 -28 78
8103 78 46 -10 -17 -6 -17 3 -19 -79 -13 -44 4 1 25 -4 -3 1 24 -38 -56 -1 -1 5 -3 -20 4 -43 -74 -26 -47 -29 -46 25 34 -29
8137 -29 -38 -32 22 -32 -36 -14 -30 -15 -4 -47 -48 -27 -30 38 58 32 53 26 -31 2 -49 -24 -41 3 41 20 -35 -28 -36 -6 -36 -24 -38 15
8171 15 32 -46 13 -15 6 -5 -2 -3 4 -10 -29 4 35 17 -25 -23 23 5 18 26
8191B6
$$ Imaginary data points
##PAGE= N=2
##DATA TABLE= (X++(I..I)), XYDATA
0@%%%%%%%%%%%%pJ5j6J6j6J6k4L2m0M8n6O4p2Q8j04J20j36J52j76K01k25K56k90
35a54L30l73M17m67N20n78O43p15P93q76R68j069J179j299J431j577J738j915
53a004K111k331K581k861L181l555L994m517N152n946O971q343J0294j3310J8607
68A1024l0541J03211p494j80413J14148k5843o5715J35202M9493j46960N062K9931
80h895l3120P2938N0119r8544j2418K2205l6750N3819N9310q0517j7036L9445
92A0556l8287K5150O5373p4855l9427O5458j2379q906O2899m4050o9068M2122
104a5414K0794m30M2612l9167o0079L9043J0806k017P0653l4052j03415M1997
116b8669M1316l7511O2847K8930j13564m648P1444l5039K2671O4866q9122n0874
$$ plain form
0 0 0 0 0 0 0 0 0 0 0 0 0 0 -7 8 -8 8 -8 8 -16 16 -24 24 -32 32 -40 48 -56 64 -72 80 -96 105 -120 136 -154
35 -154 176 -197 220 -247 273 -305 338 -377 416 -460 508 -561 618 -681 750 -827 911 -1004
53 -1004 1107 -1224 1357 -1504 1677 -1878 2116 -2401 2751 -3195 3776 -4567 5727 -7583 11024
68 11024 -19517 83694 76200 -104213 9935 -15908 -81623 53579 103072 -43888 -38826 -8895
80 -8895 -42015 30923 81042 -17502 -29920 -7715 -44465 9354 68664 -11853 -28889 10556
92 10556 -27731 -2581 62792 -12063 -51490 13968 1589 -7317 55582 11532 -57536 -15414
104 -15414 5380 4950 47562 8395 -51684 -12641 -1835 -3852 66801 32749 -70666 -28669
116 -28669 12647 -24864 37983 66913 -46651 -51299 20145 -14894 7777 72643 -16479 -67353
128f7353Q4429r409k9053P2009k6294q4600M7951L7544l4585K7403N545n6832
140c3245J8824L3059k4542J6514R102n1856J1288M4690k0762j432J6189l9101
152b1272k581M3301j1091q785J6622l4278j2856M7862J122j9762J4830k0874k2406
165c0168L6501J0965j4927J3283k1547k8261M0324J3981k9395K2055R47m9477
177c5719K4039M1881l2273l027K3028l6159m013M4015j5946j7074K7028k0320
189d540k1322M0480K863l1384J6458M351k3186J8331J3389k1026M656M761j7083
202a3252J5574J4923k4018n14J5263j5131R10K0047j1570j0565R028n512J614
215c203J4319j0317p796J1543p922n308J8577l496j4387R462l51q498J2827P39
$$ plain form
128 -67353 17076 7667 -21386 50623 24329 -60271 -12320 25224 -9361 18042 23587 -33245
140 -33245 -14421 18638 -5904 10610 19712 -32144 -20856 23834 3072 1640 17829 -21272
152 -21272 -23853 19448 8357 -428 16194 -18084 -30940 16922 18044 -1718 13112 -7762 -30168
165 -30168 6333 17298 2371 15654 -5893 -34154 6170 20151 -9244 12811 13758 -35719
177 -35719 -11680 30201 -2072 -5099 17929 -18230 -22243 21772 5826 -11248 15780 -4540
189 -4540 -25862 14618 17481 -13903 2555 6906 -16280 2051 15440 -5586 -930 3831 -13252
202 -13252 2322 17245 -6773 -7287 7976 -7155 -6245 13802 2232 -8333 695 -4817 -3203
215 -3203 11116 799 -6997 4546 -3376 -8684 9893 6397 -7990 1472 1121 -7377 5450 6189
229F189j2550R531N81j4244J2987Q401j8623M479J3320j5157j719J4862q668m763
243e374J1312o956m935J1104o154n730J4387l854j3374J0384M397j0176N959N301
257F291r531K48L876k632N870J754j1232J497P534n305J349P459p801o626O085
272a164K515J379K369p634m149O606K78k04O993n282j1089N248P654o76J192k402
288A634p656J378N578K017L773l046j1597P72J0197J216q09P43p771n288P276
303a583P056P01l180q427l489P844N927k92l99n975q125M475J1313K386n594o609
319c971l580L863P185L399j242o600q288K507J1756M438n789o306l668K14O789
334G07P305j031q390p381J637R343O257l067o922n037p45N733Q886J341r006q065
$$ plain form
229 6189 -6361 3170 3751 -10493 2494 10895 -7728 -3249 10071 -5086 -6805 8057 -611 -5374
243 -5374 5938 -1018 -5953 5151 -1003 -6733 7654 3800 -9574 810 5207 -4969 990 6291
257 6291 -3240 -2992 884 -1748 4122 5876 -5356 -3859 3675 -1630 -281 7178 -623 -7249 -1164
272 -1164 1351 2730 5099 -2535 -6684 -78 200 -4 6989 1707 -9382 -4134 3520 2844 4036 1634
288 1634 -6022 -4644 934 2951 6724 3678 -7919 -7147 3050 4266 3457 4200 -3571 -8859 -1583
303 -1583 5473 6174 2994 -5433 -8922 -1078 4849 4557 4158 -1817 -9942 -5467 5846 8232 2638 -3971
319 -3971 -7551 -3688 3497 6896 5654 -946 -9234 -6727 5029 9467 3678 -2628 -6296 -6082 707
334 707 8012 6981 -1409 -8790 -7153 2190 8447 5380 -1542 -6579 -7324 -1591 7295 8636 -370 -8435
350h435J511P817O087k7n767o857k286N381R672K611q873q604J466N922M852L123
366G593l418r591m058O618Q688K323o308q302q53N137M910M312q17j0357o435
381a0558P590Q730O03l144n981n159L709P637L436r66o961q155L926J0901J234
396F842m387l080n280j149Q733O265l312o371n130Q53Q712M639m262m302l420
411d649k586O448R053k456q364l442J423N255N659m77n178n759k338O476Q595
426G660j497p122l550q12L272P216J643n172n411l450L660R576L38p719j460l72
442c200k130P361O901p532o471K154P06L600N613n338o703K678R12J130P453k314
458D820j0945J213O021k8L090P02q954k406N802J677K796K188q787n542P277L901
$$ plain form
350 -8435 -6924 893 6980 6953 1186 -5671 -7957 -2576 7096 9707 834 -7770 -6304 -382 4470 7593
366 7593 4175 -5416 -9474 -2856 5832 8155 1847 -6455 -7308 -2171 2739 7051 6234 -4123 -10558
381 -10558 -2968 5762 6365 3221 -2760 -7919 -4210 3427 6863 5897 -1064 -9219 -5293 5608 6842
396 6842 2455 -625 -5905 -7054 1679 7944 4632 -1739 -6869 -6016 2696 7335 3073 -1229 -4649
411 -4649 -7235 -787 8266 5810 -2554 -5996 -4573 682 6341 5864 686 -5073 -7411 -935 7660
426 7660 6163 -959 -4509 -5321 -2049 5167 6810 1638 -3773 -7223 -3563 6013 6351 -1368 -2828 -3200
442 -3200 -5330 2031 8932 1400 -5071 -2917 -2211 1389 7002 1664 -5039 -2361 -1449 -319 7134 4820
458 4820 -6125 -4912 1109 1081 4171 4873 -4081 -6487 -685 992 3788 5976 -2811 -8353 -1076 2825
474B825j045K754l106q075J366P043K428o38l259m041O19K680K897K553l362n783
490d144J273L081P97K705k004n820K224L412k427K858K320q503j110Q820j328
505B154l889L903k779m850O225L032l835J368j840n229O238N014n853K37K368
520B264o972J226R144k786m602L090l313k758P738J115n788J779J05n093M034
535h17N610m177k631K113j114q56K610J350j093k207o36K661L08k159J894Q35
551A691l246J083K496k647j3K129k527O01L342l875j854M692j430k837M606l46
567A865n124K427J830k533K820R69m803J690K575m227K021N016n149k591N373
582B159j795l267N036L41m166K032O96l311K168K381k737L43J660k985r29L012
$$ plain form
474 2825 1780 4534 1428 -6647 -5281 1762 4190 3552 293 -3748 -3129 -449 2448 5001 1639 -4144
490 -4144 -2871 210 1007 3712 1708 -4112 -1888 1524 -903 1955 4275 -4228 -5338 3482 2154
505 2154 -1735 2168 -611 -5461 764 3796 -39 1329 -511 -5740 498 5512 -341 -104 2264
520 2264 -4708 -3482 5662 2876 -1726 1364 -1949 -4707 3031 4146 -1642 137 242 -4851 -817
535 -817 4793 616 -2015 98 -1016 -1872 738 2088 995 -1212 -1848 813 1121 -1038 856 1691
551 1691 -1555 -472 2024 -623 -636 1493 -1034 -433 2909 -966 -2820 1872 442 -2395 2211 1865
567 1865 -3259 -832 998 -1535 1285 2254 -2549 -859 1716 -2511 -490 4526 -623 -3214 2159
582 2159 364 -2903 2133 2474 -1692 340 1036 -2275 -107 2274 -463 -120 1540 -1445 -2374 638
598F38P24j055l60k68n69p93J123L126j048l487J195J213k115K079K862l364j577
615a676K043j137M63L166k407k396K846q16j946L730o5m175J703J909k226J403
631D19J014l758J062L126k494K01K892l996k191N302J005l237J264k69l224J935
647i49L491o14j202j342j826J288K771M74p31j712k099M82K445J620K8k455k587
664b918J380J920K60J262o35l906o6L566N22l79R7k526r30K914P52l72P31k626
682i54k358L878K371k556k63k6k611J240L781o08j787r88j816J247L789k84k323
699b68k88j316o57L638K247k432k371n99M88K407J653j042j674j628k96K671K356
716B889j112k377j251K44J854J597k34j310k068q84K767K432j323j840m58q33
$$ plain form
598 638 1362 307 -53 -321 -890 -1683 -560 2566 1518 -1969 -774 439 -1676 403 3265 -99 -1676
615 -1676 367 -770 -307 2859 452 -1944 902 86 -1860 1870 1805 -2370 -667 1242 -984 419
631 419 1433 -2325 -1263 1863 -631 -430 2462 -1534 -3725 1577 2582 -655 609 340 -2884 -949
647 -949 2542 1928 726 -616 -2442 -1154 1617 2091 1360 -352 -2451 -1969 476 2096 2124 -331 -2918
664 -2918 -1538 382 642 1904 1269 -2637 -2703 863 1385 1006 1103 -1423 -2353 561 1313 941 1672 -954
682 -954 -3312 566 2937 381 118 92 -2519 -1279 2502 1894 107 -881 -2697 -1450 2339 2055 -268
699 -268 -556 -1872 -2529 1109 3356 924 -1447 -2046 -1558 849 2502 1460 -214 -1842 -2138 533 2889
716 2889 1777 -600 -1851 -1607 247 1844 1610 300 -1768 -2652 115 2547 1224 -616 -1074 -1907
732a907Q79L002K89k504j393j60J154K543K95k325j030j04K51K247J676k229k575
749a891K67J363J456P49j179j881p59O75J980J671j492k790k95J565J182P99j20
766A300j946j710Q66K477J206r73k095r17Q31J613J196j80j762j776L23K128J506
783B087o09j927j128L35J138J524L94j856k117L42K143J186l41j255j248n49J413
800d68K065L35j801j760L6J541J560J17j047j514q20J075K223O49j671j794l41
817a615J073J589O34r00j535j074M72K236J220j513j912k09O31J073J329k61j787
834e49j279O05J796J228o94j674o49L39Q79J489J88j826j402M78J315J054p4j288
852f4j096J7P25J358N28j421j566M13J042P22K83n67j110m82O33J378O67j098
$$ plain form
732 -1907 -1028 1974 2263 -241 -1634 -1794 -640 1903 2198 -127 -1157 -1261 -1010 1237 2913 684 -1891
749 -1891 -1624 -261 1195 1944 765 -1116 -1875 -1200 780 2451 959 -1831 -2126 -561 621 1420 1300
766 1300 -646 -2356 -1490 987 2193 1220 -875 -1792 -961 652 1848 1668 -94 -1870 -1547 581 2087
783 2087 1478 -449 -1577 -1242 -104 1420 1814 -42 -2159 -1817 326 1512 1171 -84 -1332 -1881 -468
800 -468 1597 1932 131 -1629 -1593 -52 1508 1625 578 -936 -1756 -681 1542 2191 520 -1274 -1615
817 -1615 -542 1047 1681 781 -754 -1828 -1356 880 2100 587 -1325 -1534 -903 170 1499 1238 -549
834 -549 -1828 -1223 573 1801 1107 -567 -1216 -877 2 1491 1679 -147 -1549 -1071 244 1298 1224 -64
852 -64 -1160 -1143 -418 940 1468 47 -1519 -1106 -64 658 941 374 -736 -1218 -585 793 1460 362
870C62j363L10O74L11O82P3j412p58Q15R02L91m65r58l36M47L68M71K85r27j091
890a219N41J073J5k31l31l61K4L38N28K50n04q03K17R87p5m40K77oo17J15Q01
911E79j04o32j0K79p0r9Q2k9j15o4l7Q0K34l03k28M93J97n37j6M67j21l07L39
934G8K15l44k26L54L74j64m44N4K93Jj57K38K0o21k73O81O35n89o01K22m7q1O78
957B96L28q10m67J70K10O39N47r97p29O43J25j27J238p5j903J18J226j43PN54
977H50j024q11Q20M68jL29r05q45J037O14n66J97n6j126K81J367J23p58m06k61
997f73K94R45K16m17m69o76P5J230P24n54j244l77P04N23K67N21q26j898M59J988
1017H12l8o07J52j251o16J704Q54o70L5q71j204J640J646j336m37M03j200K55
$$ plain form
870 362 -1001 -691 -17 294 976 1049 -363 -1121 -306 596 987 522 -436 -772 -325 43 514 799 -128 -1219
890 -1219 -678 395 410 179 -152 -513 -489 -151 377 627 123 -680 -463 524 449 9 286 280 -337 -222 579
911 579 475 -157 -167 112 42 -57 25 -4 -119 -183 -220 -140 94 -209 -437 56 253 -284 -300 167 46 -261 78
934 78 293 -51 -277 77 451 287 -157 -103 190 191 34 272 292 -329 -602 79 714 125 -476 -254 -301 -382 296
957 296 624 -186 -653 -483 -273 366 913 -84 -813 -170 -45 -172 1066 991 -912 -794 432 289 296 850
977 850 -174 -985 -165 303 302 631 -274 -1119 -82 532 -34 163 107 -1019 -738 629 752 -6 -412 -673
997 -673 -379 566 782 365 -104 -780 -705 525 1249 695 -549 -926 -222 301 568 1089 263 -1635 -1176 812
1017 812 774 167 319 -932 -1548 156 1010 340 375 -496 -1700 -60 1586 250 -187 216 -984 -729
1035g29K142j51j616r0j34K12J455J5j419k19j02l4J599O29j924r97O72M58O43
1054D10P90q19j537k81R50J428N00j091j176l62M89J456Q15p91j054r51r6J998
1072F78J336j546j052J92p17M38K382k97k294r9M58qJ452L81j946m24P18j93J243
1091G02R07j983j153J250M24L08Q78j068j635O47R98L88O87q64j961N12J308K53
1109E98L89j63j811o91J403J182K26p85j225k93M92Q82J111l21j752m66P72N99
1127A47R05R2j577n28Q27L2O17R61j483j459J371O87m98P42l33j736M89J206k94
1146A68L16r5j561K81J537l35k55N29j241o49J634O19q19J42n10q45J214Q24n58
1165C96n1l68j050Q01J272m49m70r2o27J90Q16J66k50m25p95N12R15l86j65K47
$$ plain form
1035 -729 1413 1262 -354 -444 -578 -366 1089 1104 -315 -534 -636 -670 929 1558 -366 -1363 -691 -233 410
1054 410 1200 381 -1156 -1437 -487 941 1441 350 -826 -1188 -699 757 1572 781 -273 -1224 -1320 678
1072 678 2014 468 -584 -392 -1109 -671 1711 1414 -880 -979 -521 -529 923 1304 -642 -1066 -348 -541 702
1091 702 1609 -374 -1527 -277 147 455 1333 265 -1370 -723 275 663 1350 486 -1475 -963 345 598
1109 598 987 824 -987 -1678 -275 907 1133 348 -877 -1170 -678 204 1315 994 -758 -1224 -452 147
1127 147 1052 1144 -433 -961 -134 -102 515 1476 -7 -1466 -95 592 94 836 503 -1233 -744 462 168
1146 168 484 389 -1172 -891 646 311 56 585 -656 -1305 329 948 129 271 -239 -1084 130 954 396
1165 396 345 -23 -1073 -272 1000 551 81 -11 -638 -448 368 534 284 -141 -936 -424 491 105 -60 187
1185A87p39k02J110om13J98m44k83J136n6p27M94o1q57P54Q44r91k56N08n29K59
1206g4P61p33l68N85n16j15J211n75r00P09J24o24P74K25q20L7K72k09N18K19
1226E01p49J60L80m93K17N56n34k66L63j03k7L27m75l8M25l52j56N63k95n56N73
1247B1R0m13L35M8l84L38J46m57M71J58p99L85N94o77o9O80m74k41O93l39k62
1268a56M84l17l44O01j56o03N62J54o16K97K97n03J27L39l20Q3K00m58J77L98
1288B46l37m3M95l91l42O58n1k53J93j02k79L50N6k88K97j85m59M42M04n32K1
1309a00J72l72N2M47k50j8Q9l76J34N80k28l41L81k60k24O06Q9m49J8L4j51M65
1331B98Q1m49K9J28m14L98L36m06l16J73r6J16L61k18j97P6j38J28N26k65m26
$$ plain form
1185 187 -552 -754 356 350 -63 135 -309 -592 544 488 -239 255 194 -663 91 935 -56 -312 196 -333 -74
1206 -74 687 -46 -414 171 -345 -460 751 176 -724 -15 109 -515 259 484 -336 -299 -27 -236 282 501
1226 501 -248 -88 292 -201 16 572 38 -228 135 32 5 332 -143 -181 244 -108 -264 299 4 -552 21
1247 21 111 -302 33 81 -303 35 181 -276 195 353 -446 -61 533 -144 -213 467 -7 -248 445 106 -156
1268 -156 328 11 -333 268 112 -491 71 225 -391 -94 203 -300 -173 166 -154 -71 129 -329 -152 246
1288 246 -91 -134 361 -30 -372 286 235 -18 175 73 -206 144 200 -88 209 24 -435 7 411 -121 -100
1309 -100 72 -300 -248 199 -51 -69 20 -356 -222 358 130 -211 170 -90 -314 292 381 -68 -50 -16 -167 298
1331 298 379 -70 -41 87 -327 71 407 1 -315 -142 -238 -122 239 21 -176 -100 -238 -110 416 151 -275
1352b75J87J02j34L57Q4m40n9K40M7K53o9m28m9K25j51K91K00m35l02J95J74R5
1374A08O7l33j71K38J6O8K94l19m95L13L67k6M2m4k72K8K24J15J18j18n23Q6M03
1397A86Np1ok75j98L54J69K2q2l54j08K62K05o1K2j56l06K51L83O4k60j45j15
1420b14J67K41J09r2k18k41J98L67m2j24j48j93J2L22J28j81p1l83L8N16j6k05
1442c0q8p9j58L05K94m3k59j64O5K12K28j03j48m4j88J64L90l0l57j16K7Q3K18
1465A79O0j44k94r7J76K02J30j27l22j7J06K34L0j09r6k09K04K86mj64pj08k9
1488a20K00K62k06j50j11K5J60J47j03j60p8qO5K13pk32j59J42N7N4J15p8j79
1511a51m9K13P9K8j05j66P9J27J37p8J09j68k05J43K59j44j61Q3k03jK33N9j36
$$ plain form
1352 -275 -88 14 -120 237 321 -119 -178 62 109 362 293 -135 -184 41 -110 181 381 -54 -356 -161 13 108
1374 108 175 -158 -329 -91 -75 -7 287 -32 -527 -214 153 127 169 125 -147 -119 105 220 338 220 -303 -217 186
1397 186 191 120 114 -161 -359 -5 164 186 104 -250 -358 -96 109 48 70 -86 -392 -141 242 306 46 -99 -214
1420 -214 -47 194 303 211 -7 -248 -50 317 275 151 3 -190 -178 144 272 91 20 -363 -325 191 175 -30
1442 -30 -118 -197 -355 -50 244 201 -58 -222 -157 55 283 180 32 -12 -200 -36 354 324 -33 -149 -122 -39 179
1465 179 239 95 -199 -296 -120 82 212 85 -237 -254 -148 86 116 7 -89 -298 -94 192 188 24 17 -91 -120
1488 -120 80 342 136 -14 -125 -100 60 207 104 -56 -134 -142 -77 136 129 -103 -262 -120 -63 -9 106 28 -151
1511 -151 -200 13 92 120 15 -151 -72 55 192 114 223 55 -150 -7 252 108 -53 30 -173 -174 59 118 -18
1534a8m0o6j21K53J38k63j6J65j34o2K75Jk15N4J93j02J4O2n3m2K6J8P4l5o7n7
1560a8pP2L7p7o1m4l7J01J25j17j96J02M1l7J60O4k00rJ02p8J31R4j94j1K29j69
1586Cj48L57r2k80K26Q8k86J02J60j96K7J71k42k1K25k25o3K55j7j78R9K7p6J38
1610E4J3j46RJ28o8J00L9r0k9R9j42Q7L4q7Ll4k5P0k2j30J59R5k41M6J51k55O4
1637a18J45p6l6K29k43n7L45j03k12K56Ml36K20K76k50J2J24k92kL07j25m7J05
1660A26j98j63L52k8k20J54n7k25K06J71j70O1q5r6K20J14j51jj5j15J42J78j01
1683I9j2q2r1J38J54q4j10K5k74O1M40j16k16L7k08k2L42O7k54M0j01j93M47K26
1707C13l71p0J85k73J48M59k29k03L6p0M0L45n3l23M9o6o8L99K9l73j23R8J2J65
$$ plain form
1534 -18 -58 -124 -245 8 146 -117 -133 32 -102 -164 111 112 -103 -49 144 42 56 118 65 23 49 67 141 106 39 -18
1560 -18 -25 47 84 7 -54 -98 -135 -34 91 -26 -222 -120 -79 -116 44 108 -92 -101 1 -77 54 148 -46 -57 172 3
1586 3 -145 212 120 -160 66 154 -132 -30 130 -66 -39 132 -110 -131 94 -131 -194 61 44 -134 -35 -8 -84 54
1610 54 67 -79 -70 58 -10 90 129 39 10 109 -33 54 88 1 4 -30 -55 15 -7 -137 22 117 -124 -78 73 -182 -118
1637 -118 27 -49 -85 144 -99 -156 189 86 -126 130 134 -202 18 294 44 56 180 -112 -114 193 68 21 126
1660 126 -72 -235 117 89 -131 23 -34 -259 -53 118 -52 9 -76 -172 48 162 11 10 -5 -120 22 200 99
1683 99 87 5 -86 52 206 122 12 37 -237 -176 264 148 -68 -31 -239 -261 81 148 -106 -66 -167 -360 87 313
1707 313 -58 -128 57 -216 -68 391 162 -41 -5 -75 -35 310 257 -66 -17 -83 -151 248 277 -96 -219 -121 -109 56
1731E6J62k77j69oJ16K04K00k78k03J06J1J20K39j74j79p6P6J83K21k27k07Q1
1753b1m9j2L13j3l92j0J30k4K32k7k78p0J32p7K67J70l49j85K41L7J0J82j37k28
1777a58P4J28MJ56k9l73J57J70j12J27k9k41n2J47Q1J9m6k05M6J12k2J32j8j79
1801a11j14J91J10m1M8j03q9J47K0L7N9j87j30K11J62j65J9j2j48O6J17p9O3j46
1825g5j50R4K42j41m7J44j42q7K13Q5j87LK4m7K04J9j65O7n0j14J93J77k28j8
1849A4Oj06J64P8j13p6l7o1O2J83j23r9M1r4M7J26N1j49K1j4L8J81p6j26Q6l0
1875fo4J82J09k66L1J3J1L6Q1j50j22R2n7J29J03j00j67O1J6K0J12k7j09O1k0
1900c1M9O7p5p9R1K5l6J5J20j30l2MK0P7j8q1k3R6q6K8N9r5r0P9pN9M6k02O4O6
$$ plain form
1731 56 218 -59 -228 -234 -118 86 286 8 -195 -89 -78 42 281 107 -72 -148 -72 111 332 105 -102 -21
1753 -21 -70 -82 231 218 -174 -184 -54 -78 154 127 -151 -221 -89 -166 101 271 -78 -263 -22 15 25 207 70 -158
1777 -158 -84 44 48 204 175 -198 -41 129 17 144 115 -126 -178 -31 50 69 23 -182 -136 -24 -46 86 68 -111
1801 -111 -225 -34 76 35 83 -20 -109 38 58 95 154 -33 -163 48 210 45 64 52 -96 -30 87 8 71 -75
1825 -75 -225 -131 111 -30 -77 67 -75 -162 51 136 -51 -48 -24 -71 133 152 -13 54 4 -110 83 260 32 14
1849 14 20 -86 78 156 43 -33 -70 -131 -69 114 -9 -108 -67 -161 -114 12 63 -86 -65 -79 -41 140 64 -62 24 -6
1875 -6 -70 112 221 -45 -14 -1 10 46 127 -23 -145 -53 -110 19 122 22 -145 -84 -68 -48 64 37 -72 -11 -31
1900 -31 18 85 10 -69 22 47 11 26 146 16 -16 -12 8 85 67 -14 -37 59 -27 1 60 -35 -125 -46 -53 6 52 -150 -86 -20
1930b0j09Q7J19j46k7J46Q0j98m5K33r9KJ20p9k5P2j13J4J11j10j55J56j6J0J2
1955B0n7n7L1k4J2Q4j8p2k7R8j3N5l9om0K1R6Qj4r7Q5l5k4J77p1j32nO4jK2J2
1986E3j25L2J9r1J38R2k40j30K42M2q7R3N1j74m2J34J08j9o9n6M1O3L7k3L6j52
2012b7j29J46J44o1j23l7n1M5J41L4r2p5n6N3J19J25r0j72rO9N0P4N7j52n5J34
2038F2k0J4J46j44j52Q5J17p5N7n7j84N8J45j28K8J03j88o0J84Q8j52k2K3j9K5
2063f6J52J2r9jl5M8J38o7q4k0N5kK9J11j12j52J5J16o0O1jj53m0R6O3n7R4o1
2091b0j77J72J22o7n9J16j20r7K40M7j61J3J7l9R9Q9j40l0M8r6P1J27j26j75J14
2116c2P3j14J10N9j65j53K07P7q5J11j20n4O8lL6P9j1j14JJ18J9n0n5O3j04k3
$$ plain form
1930 -20 -129 -42 77 -69 -96 50 130 -68 -113 120 21 23 143 64 39 111 -2 12 123 13 -142 14 -2 8 20
1955 20 -37 -94 -63 -87 -75 9 -9 -81 -108 -10 -23 32 -7 -13 -53 -32 64 72 58 -39 46 11 -13 164 93 -39 -44 20 19 41 53
1986 53 -72 -40 -21 -112 26 118 -122 -252 -10 32 -55 38 89 -85 -127 7 115 96 27 -29 12 75 112 89 125 -27
2012 -27 -156 -10 134 73 -50 -87 -138 -93 48 82 -10 -85 -141 -88 31 156 66 -106 -115 -46 4 78 135 -17 -72 62
2038 62 42 56 202 58 -94 -9 108 33 90 33 -151 -93 52 -76 -48 55 -133 -193 -9 79 -73 -95 -72 -91 -66
2063 -66 86 98 -1 -2 -37 11 149 82 -2 -22 33 31 60 171 59 -93 -78 38 -22 39 38 -115 -155 -59 4 -53 41 -20
2091 -20 -197 -25 97 30 -29 87 -33 -130 110 157 -4 9 26 -13 86 175 35 5 53 -43 28 155 29 -146 -32
2116 -32 41 -73 37 96 -69 -222 -15 62 -23 88 -32 -86 -18 -21 15 94 83 -31 -30 88 107 57 2 65 -39 -62
2142f2J14L1j40L7%r5N6Q6j11J4M7o8LJ83q2j52J64Q7j83P7J27j42j7J13nn3M2
2169G1n5j12J75k0m8M8jj76L9J04n8J0M9n6r7J26J3K3l2j0n1L2O8p9L1N0kn2R
2198aJ14m6j03P8m0l2M3R2j27K2L9j15J4NN0m0JM6p6N4O6j78N5J67j55M9R8o5
2226A5r0J02n6RN0Qo3P0Po3Q5K5j39K0J7J5n3J18j02l9N8p9J32k5k6l2J7O8q6
2255c7N2L0o6K9n2M6P9On4k4K8l6O3j4j18R4m5L1N1Mj11l4L3L5n6R6m9m6J6J4
2285c5LM7N5j74Q9M2K6K9m5p9M7M1k2K6k5n7M9N2m6l0K7j09J02k2M1j3J9j31r
2314a02O3M2j1J2k9n1J10o3L8P1j11m9J26K4m5rM9o7M6L9n9O3l1j00k7N3K0j2
2342a0R3j05n2M4L5m0J1ok2P1NK3l7Mq1P5Q4o7NJ9j5o6Q8k2pL5r1N2O4r9J3Op8
$$ plain form
2142 -62 52 83 -57 -20 -20 -115 -59 27 -84 -70 -23 -91 -88 95 13 -139 25 112 -71 6 133 -9 -26 87 82 29 71
2169 71 16 -96 79 59 11 59 58 -118 -79 25 -33 -23 26 -30 -127 -1 12 35 3 -7 -58 -26 42 -37 -6 44 42 -10 -1
2198 -1 113 67 -36 42 2 -30 13 105 -22 0 39 -76 -62 -57 -7 -47 -46 0 -76 -22 44 -134 -79 88 -67 -18 80 15
2226 15 -75 27 -29 -20 30 38 -25 45 52 -11 74 99 -40 -20 -3 12 -41 77 -25 -64 -6 -85 47 22 -4 -36 -19 49 -37
2255 -37 15 45 -21 8 -44 2 81 87 33 9 37 1 64 50 -68 26 -19 12 63 67 -44 -78 -45 -10 -66 30 -19 -65 -49 -35
2285 -35 -32 15 70 -104 -15 27 53 82 37 -42 5 46 24 50 25 -32 17 69 23 -7 20 -89 13 -9 32 19 38 -93 -102
2314 -102 -39 3 -8 4 -25 -76 34 -29 9 80 -31 -80 46 70 25 16 65 -2 44 83 24 87 56 -44 -71 -18 2 -10
2342 -10 83 -22 -74 -30 5 -35 -24 -30 -52 19 24 47 10 14 -67 8 92 25 30 49 34 -32 56 34 27 62 -29 23 87 -12 1 7 -71
2375g1k5M0O9L1o6o4J7P4l8K8J1J2J8j3K4j6oK5n5O5J0p7O5L0o7n2L7K0k7K1o7
2406d7m2K5N3m1L1jp6L1P5k9R7k2j05M0P0l0J7O4l0q5K2JN8j8m7L0l9J2j3K2n0
2437b7l5L9l1P7lk3j10M8lO5J4O5j38K2O2j4N1P8j34J2n2J7J18k9k1p3j7L4K9
2466B1O0nj19m4R0K4K3p3n9m3Q5N3K2j2n6m9K0J01O3n1%l6n4M8P9Jp2j9Ok7J38
2497A15j6j03j3l3pM3O8m6j04O2j4j0O3J6l5n3M5K3M7Rj17J7L6mP1k8R4j40J6
2526B%K8jL8r1m9P5P7k3j06J14j26QQ0m2Kk5k2N8LO0Pl9No2P0L0j3ONm4qJ9K0
2560E6m6L2L6j32Q5QJ6o3j9k2jLM0j4k3j0O9l8L9K5j16P5l3R4l8MK1l7L4n9O1
2591D7j5q3O6k8K4%n6Q6m5j8k6Q9m8K3J9q0J1M7l5jL1j9j8PO2j0pJ7m9J2K3j9
$$ plain form
2375 -71 -96 -56 13 44 -22 -86 -69 5 -33 -5 6 18 36 23 47 31 25 50 -5 60 70 -7 58 88 21 -31 6 26 -1 20 -47
2406 -47 -89 -64 -11 -52 -21 -22 -98 -67 8 -21 76 54 -51 -11 59 29 46 110 80 -5 17 18 76 58 11 41 2 14 1 23 -27
2437 -27 -62 -23 -54 23 20 -3 -113 -65 -68 -3 11 76 -62 -40 22 8 59 137 3 15 -37 -20 98 69 48 -25 -42 -8 21
2466 21 81 76 -43 -87 3 27 50 -23 -82 -125 -40 13 35 23 -33 -82 -62 39 102 51 51 15 -39 9 88 89 17 -2 4 -23 115
2497 115 99 -4 -17 -50 -57 -14 54 8 -96 -34 -48 -58 5 21 -14 -67 -22 1 48 57 -60 -43 -7 -11 60 32 126 -14 2
2526 2 2 30 29 67 -24 -73 2 79 56 -50 64 -62 -54 26 -16 -14 -39 -61 -3 0 60 67 28 33 -29 41 71 58 64 69 25 17 36 56
2560 56 10 42 78 -54 31 39 55 -8 -27 -49 -50 -47 -7 -21 -44 -54 15 -23 16 41 -75 0 -33 61 23 27 48 11 45 -14 47
2591 47 32 -51 15 -13 11 11 -45 41 -4 -22 -48 41 -7 16 35 -45 -34 13 -22 -23 8 -11 -29 -22 40 30 23 40 -9 3 26 7
2623GJ0L8m1l3J5K3j9l6N8k2L4j02M6k5P0p0J4m0J17p9M4n2Q6qJ3l9J1Q0q7J8
2653C1j2K3j5m0L3J5J3m2n6j8P6K7m1J5l4j3K7pk8k1P0J3m1L5L1j8oL4o4O9q6
2684c0J28j17L7Q2r2J9J1k5J6o2J00n5k6j1J1nk1L8J4m2K0k7K8J1K2n7m1J8P2
2713A6J6o7J9M7Kk2M6k2J7q1M4l2K4M0m6m6J1J2qJ7Nk5j2O7K6Jr7R3q2j2Q8j8
2745B1J4k5L0o6RM3l5L6m2K1k4NJ7Lk8J5J0jk9k2N3L6l8k0K4j2L9n7k2M3J14j08
2777DJ0j6nmkjPM3oo1JL0j6L6Qn5k2RL8L5n3k5K0J2Oj8j1K0N6m8N3j7j8N1q2L8
2813A7L4k7j1lj3K7J8o3N1j2q3O7P2l1q9J4RJ6m8O6j2pj2l0K5M9K4n7J6K0j2J
2845A6J1N8r6N5m0K3%%o2N5k6j1L7K5o4PJ7ql5K5L8r7L9NM2Kk4Pk2O8jL4po6p
$$ plain form
2623 7 17 55 14 -19 -4 19 0 -36 22 0 34 -68 -22 -47 23 -47 -33 -73 44 -35 9 -43 43 35 48 9 20 100 13 31
2653 31 19 42 27 -13 20 35 48 6 -50 -68 8 35 -6 9 -25 -38 -11 -18 -46 -67 3 16 -25 10 41 23 17 51 -13 56 -30
2684 -30 98 -19 18 100 8 27 38 13 29 -33 67 12 -14 -25 -14 -19 -40 -2 12 -30 -10 -37 -9 2 24 -33 -74 -56 16
2713 16 32 -35 -16 31 33 11 57 35 52 -29 15 -17 7 47 1 -45 -34 -22 -30 -13 -8 -33 -45 22 48 49 -48 45 -37 -49 39 21
2745 21 35 10 40 -26 -17 26 -9 27 -15 6 -18 -13 4 7 -21 -6 4 3 -26 -48 5 41 3 -17 7 -5 34 -23 -45 -2 112 4
2777 4 14 -2 -7 -11 -13 -14 -7 36 30 -31 -30 0 -16 20 28 -27 -49 -40 -2 33 -20 -45 -25 -13 -7 -25 -36 -16 40 -8 45 28 10 61 -21 17
2813 17 51 24 13 10 -3 24 42 -21 30 18 -65 2 74 43 -46 -32 -23 -7 -55 11 -1 -8 -20 -50 -25 24 48 -9 7 27 15 16
2845 16 27 85 -11 44 4 27 27 27 -35 20 -6 -17 20 45 -19 -12 5 -3 -38 -13 25 -72 -33 -28 14 16 -8 -1 -23 45 44 78 71 5 -2
2880bM7j8J6l3n5O9o8J09m5k4J8m4N5j1l0k2J5J0L0j7RM1j20N8K2OM1o8J1j4o5
2911g9J37o8M9Rl7l9J0O8n5l0M0l4MOM9q1N2l6J3K4Mk8JJ00o1k5M6j0m4N5o9Q9
2943F0j9m3K9lL1r1L2M5m0j6L9j02J04m2n8Q6K8p3L7K4m3mql2P0Qn9P3k6K1nJ5
2975C8j5L4k6j4P2o1qm8Q1l0m8M0Lj3J5l2q2Q1j8nM3k0k2N1k1J2J2rj2J0K9k9
3007Hk2M4Jk0jL8j3m1L6p3N3l7j9M2L9r7M0j2k9R6o9K2l6P2k3m8M2M9q4L2M2N
3039C7k0Qm7NR2k5j02OM7K0r0J05o2J1jmM3n1nM1J7k9m4M7Ol2RN8ll0J2m2N0k9
3073bK2j2P6m6m7L4j0Nj4o3K2K1m0M0JL1o4lJ6N7J0o5k3K2M0jJ6r1j2R0k8Q3q9
3106b4J5NK6J6K6r2R0m4l9%R1j01L3Km5J0P5j2q2J5J6K2k2N1K7p9l8Q0l4K0K7
$$ plain form
2880 -2 45 27 43 10 -45 24 -44 65 20 -4 14 -30 25 14 -16 -38 -23 -13 17 0 9 50 -70 -12 10 16 57 -11 0 -14 -79
2911 -79 58 -10 39 48 11 -28 -18 50 -5 -35 5 -29 -25 -19 30 -51 1 -35 -22 2 6 -22 -21 79 18 -7 39 29 -15 40 -29 60
2943 60 41 -2 27 24 55 -36 -4 41 1 -15 24 -78 26 -16 -74 12 40 -33 4 28 -15 -19 -27 -59 11 19 -40 33 7 28 23 38
2975 38 23 57 31 17 89 28 20 -28 53 23 -25 15 18 5 20 -12 -94 -13 -31 -36 7 -13 -35 16 -5 7 19 10 -2 8 37 8
3007 8 -14 30 31 11 10 48 35 -6 30 -43 10 -27 -46 -4 35 -62 -22 -34 -63 33 -36 -14 -50 22 -1 -49 -7 42 -42 -10 32 37
3039 37 17 25 -22 -17 75 50 -52 -46 1 21 -69 36 -26 -15 -16 -20 23 -28 -33 8 25 -4 -48 -1 5 -27 -18 40 37 7 19 -23 27 -2
3073 -2 20 8 84 38 -9 25 15 20 6 -57 -35 -14 -54 -14 -13 18 -46 -49 -33 24 34 -31 -54 -32 8 7 23 -68 -80 10 -18 65 -24
3106 -24 -9 -4 22 38 64 -28 62 18 -21 -21 70 -31 2 4 -41 -31 44 32 -50 -35 -19 3 -19 32 59 -20 -58 22 -12 8 35
3137C5j8j0K7j6k8K5j5k5k5N7k0K3k2M7o9MM9Km0m9N3qK1K8pj4j8JL1J4o3O5j7
3170A8k1mN4k0m8m6R2K7j8%n4oo9Q9l0M8n0L7qqL9l7K2J9m6J2N8j1l8rJ3pK0p
3204A1L9l4L2l2J8j7Ro5L5l2M0M2o8K0J8n9O6n0K8k2K8j4m0M9j1N8n9KnO0k8K2
3236D1l3Lk4Q3m2Knl6MJ7k2Q5o8n0K7M5n1J1K4n4J00n4L4J5k2l0j9j1K6J3k7P0
3268E2l5l5K4M3n4k8O5j07O3N7q0K4M7l4n5L8K7oMn8qN0l4LN8J1n4l0R2j8j0j7
3300eJ5M7n9lk6M1K9J3l5j8l1L2O5j11K7pM5nJ3Jj7Rl8N8j2k5RkOk4K4J1l7M3
3334C3mK4Po3Jn0rmP0o6L9n4K8K4kLm1M7k7M4M1n4Q1q0%j6O4M1o4j8L2k8pJ9m5
3369c4L9j0P1l4k0Qn0PO0q0K6L9o6J5P3p2M0m4qL1P6m8o6M9k9J6mL4L1Kr8O3K7
$$ plain form
3137 35 17 7 34 18 -10 15 0 -25 -50 7 -13 10 -12 35 -34 -30 19 21 -19 -68 -15 -23 -2 26 19 5 -13 -12 19 33 -30 35 18
3170 18 -3 -7 47 27 -21 -67 25 52 34 34 -20 -26 -95 -6 -36 12 -38 -1 -9 -17 22 -15 7 26 -20 -8 50 39 1 -8 5 -2 18 11
3204 11 50 16 48 16 34 17 26 -39 -4 -36 4 46 -22 -2 16 -43 23 -27 1 -21 7 -7 -47 2 -9 49 -10 -8 -13 47 19 41
3236 41 8 11 -13 70 28 30 25 -11 -7 10 -12 73 5 -45 -18 27 -24 -13 11 -43 57 3 37 52 30 0 -19 -30 -4 9 -18 52
3268 52 17 -18 6 49 -5 -33 32 -75 -12 45 -35 -11 36 2 -53 -15 12 6 10 -48 -56 -6 -40 -37 21 32 -22 -52 40 22 12 -5
3300 -5 10 57 -2 -5 -31 10 39 52 17 -1 -32 0 65 -46 -19 -26 19 14 27 28 11 20 -18 40 28 3 12 10 16 -8 16 27 -10 33
3334 33 29 53 60 -3 -2 -52 -61 -65 5 -61 -22 -76 -48 -24 -26 -23 -64 -17 -44 0 41 -13 68 -12 -12 -28 36 77 13 -5 27 -1 -8 11 -34
3369 -34 5 -5 66 32 12 20 -30 -23 37 -43 -17 22 -44 -29 44 -28 12 -32 -40 -9 67 19 -47 2 -27 -11 -15 19 50 52 -46 17 44
3402D4k7J8p2L6M2m5J28q4k4k8JM3M5m0l8j9K1k6M9jl7k3K8j2P4k5j09J27j9L5
3432F2p1O4o9Pr1R6J9K3j04J8M3m5N7K0m2j14J08KO4O4j12l0K5l2K6O3j5o7j4
3461d5L7M6j6L7m9k7Q0m4K1j5j7kk0L3k1k3l5K8o6J17M1l0l0p8Q8j9K5j1l5j4
3491d4K4j4Q7K4p8l7KRM2M0k4k2m2K1R3l5j0o3M6l2J8M0j9n1n7P4K0L1l9pj00
3522a03R5O1L1n1j1o2M3J9l8O3q5k0N8P2n1j8j2O2r0P9pj0l5p5P8J5L5n7J7l3
3552c0J2L7J6J0m8J6l0M9M9q1L3l4l2N2M0j3q1M5p1N6M2K2j15%KO6j5N4m9j6o0
3583g4Q6K5K2L9n7k9N2LNp2k2m7N6O4k6O0p5rk3PL5rl6jj7LP1j4j5N5p1LL9oj3
3618Ik8K4JM5J9k7o9N1K1k3qJ9p9J04q0J7L5J8n8k6K0L6k8N0Qq0M5j9P9p6j1J0
$$ plain form
3402 44 17 35 -37 -1 41 -4 124 40 16 -12 -11 32 77 37 -1 -20 1 -25 24 23 -14 -37 -9 -21 53 28 -81 46 27 62
3432 62 -9 55 -14 -7 -98 -2 17 40 -64 -46 -3 -48 9 29 -13 -127 -19 -17 47 111 -1 -31 -6 -38 -12 51 36 -31 -45
3461 -45 -8 38 22 59 10 -17 63 19 40 25 8 6 -14 19 -2 -25 -60 -32 -98 19 60 30 0 -78 10 -9 16 5 -30 -44
3491 -44 -20 -34 53 77 -1 -38 -36 -27 15 55 31 9 -33 -12 81 46 36 -27 19 -13 5 45 26 -25 -82 -8 12 43 4 -3 -103
3522 -103 -8 53 84 33 22 -40 3 22 -16 47 -38 -58 0 72 21 3 -9 53 -37 42 35 25 -10 -85 -7 8 43 -14 3 -30
3552 -30 -18 19 35 45 -3 13 -17 32 81 0 33 -1 -33 19 59 46 -35 10 -61 -5 37 59 -56 -56 -54 12 -3 51 2 -14 -74
3583 -74 12 37 59 98 41 12 64 67 72 0 -22 -69 -13 51 25 85 10 1 -22 -15 20 11 -25 -26 -43 -40 31 17 2 57 -14 -11 28 22 9
3618 9 -19 5 6 51 70 43 -26 25 46 23 15 34 -45 59 -21 -4 31 49 -9 -35 -15 21 -7 43 51 -29 16 -3 76 0 -11 -1
3650ajpKNRR5p4Mm4M4r5J6M3j8o0J24m6OJ2Rm5pK0M6p5R5o0JL6m9M2j2J1q1J16
3685F1J7n8l8l2K3K7L9j3k2N9o3kL9j1p7L5pL7n3P3j8p9P3%n9K7N0rj8MJ4j2J7
3718B4n0j2%P4J1k5j9n3l7R1K7m6k9pl5J07K0n9K0p0k8O6P7m0r3Qk0Q9M3M4m6
3749C2q2JO0Q4k1p1j5o4J39K9l8l8m7j1L1J06p2n2rn3P1N5L8n7o7j4l9J76K1l2
3779F1j32LPJ08pJ3m4o1JL5P4l8l8m9O7L2P9n3n2q4J3P9K7L2l3j09j3J05M8L0
3809A01j26K1m1MJ33J5q2j05JR9L6K2Mj38k8K8J53J0p5o0q9N7M4R6n8k8q0oJ31
3838C9Q2q8q9LPN7Q9j6j43Jn2J48L1Q0j02r7J9k9P2O8o1q7M6N2O2nj25J1k9J0
3868d6K5J00r8o7K4QJ62j8r1p6k2Q8N1M8qj64N6J2N8l8L8l7j52J41K3L8n6oj1
$$ plain form
3650 -1 -2 -9 -7 -2 7 102 28 32 -12 32 -63 -47 -4 -22 -82 42 -4 2 14 23 -22 -29 -9 37 -38 57 -3 -2 34 -15 27 15 26 -55 61
3685 61 78 20 -18 -50 -27 0 39 26 4 63 0 -2 37 26 -51 -16 -23 14 -39 34 16 -63 10 10 -49 -22 28 19 1 5 19 7 24
3718 24 -26 -38 -38 36 47 22 3 -50 -87 4 31 -15 -44 -51 -86 21 41 -18 2 -68 -96 -30 47 7 -86 -78 -98 -9 34 78 32
3749 32 -50 -49 11 95 74 3 -12 -76 63 92 54 16 -31 -42 -11 95 23 -29 -38 -91 -20 35 73 16 -51 -65 -104 72 93 61
3779 61 -71 -68 -61 47 40 53 9 -52 -51 -16 58 20 -18 -67 0 32 111 58 6 -78 -65 14 41 73 40 -69 -82 23 71 101
3809 101 -25 -4 -45 -41 92 107 25 -80 -79 20 56 78 82 -56 -84 -56 97 107 32 -28 -117 -60 -16 80 22 -6 -86 -92 39
3838 39 121 33 -56 -53 -46 11 100 84 -59 -58 -110 38 69 149 47 -50 -31 -60 12 80 19 -68 -22 30 92 87 -38 -27 -56 -46
3868 -46 -21 79 -19 -86 -62 -54 108 90 -1 -77 -99 -11 40 88 80 -84 -28 -16 42 4 42 5 -147 -6 17 55 -1 -7 -18
3897a8jQ1j2Om5j02K5P5J6k6j7l8nM7R7k8o6lm3R3Lpm8L1j09M4P8N2q7rK6l2Q7
3930F5k2k8n6K5j8O1N5r6m1J2J6P7K4n9M4j19LJ15j0j0p3K3k3P2nj8p2Q2m3Ql
3961a4J6Rpl4M0O6m5n8J5j6n8J23J7Lq8j4N5K0k1Pk1k8Q1J7p1M3j4j2l5RROK0
3994B0k1Pj5O0p3k8K8K7oj5M5m4l3N3r3L1Q2q3jR4Jm2l2M8k6j6KK1LJ0j8J9M0
4027D5m4Rk0K7n5N7p1P3j18K8M4ol2L5j3O6j9n0L2j5L5l9J39q7k8m9L8K3N9j7
4057D7j6r4k6P0QR8n9l1K9mj3oPj30PJ08K6k8O4p0k2P1l0M9K3j11j0J6M8J7o9
4088c1mrJ2L8Q5rj15n7P2PN2p6j0J6k5Q6j3K4l4l1M1K0L0mm3o8NL2L7J5o3j4N
4121b9J0O5k2m9m2k5Q2P8m2l1l4K4K2N0J7p2l5K7L4K6l6j5k2K6J12o8L3q2l5L
$$ plain form
3897 -18 -19 62 50 56 11 -91 -66 9 25 -1 -18 -56 -61 -14 83 55 -11 -14 -57 36 39 32 -16 15 -94 -50 28 80 -7 -16 10 -22 65
3930 65 43 15 -41 -16 -34 27 82 -14 -55 -43 -27 50 74 15 59 -60 -57 58 48 38 -35 -12 -35 37 32 14 -58 24 -19 -11 -14
3961 -14 2 11 4 -30 10 76 31 -27 -12 -28 -86 37 54 57 -31 -45 10 30 9 16 -5 -33 48 65 -6 37 23 11 -24 -15 -6 0 20
3994 20 -1 6 -9 51 -22 -50 -22 5 -1 -16 29 -15 -48 5 -88 -57 25 -58 -59 35 36 -6 -38 10 -16 -32 -30 -9 -6 4 -14 5 45
4027 45 1 10 -10 17 -38 19 -52 21 -97 -69 -25 -31 -63 -28 -41 25 6 -44 -12 -27 8 -31 108 21 -7 -56 -18 5 64 47
4057 47 31 -63 -89 -19 -11 87 28 -3 26 22 9 3 10 -120 -113 -5 21 -7 57 -13 -35 36 6 55 78 -33 -43 -27 21 38 -31
4088 -31 -35 -44 -32 6 91 82 -33 -90 -18 -11 41 -35 -45 -29 -54 32 19 43 9 -22 19 39 69 65 22 -46 -41 -9 28 43 -20 -34 -29
4121 -29 -19 46 24 -25 -67 -92 -10 68 26 -5 -39 -15 7 57 74 2 -33 -6 28 54 18 3 -19 7 119 51 84 2 -33 -30
4151c0M2N3j0q7pk9O3N6K5j12n1L2O0P9k2o5k2p3R1R3Ql7j29K5M2L0J5J2j09m3
4181a00NJ57J5p2m6l4O4L8P6lj12j38O7J33P6q2l1o7jJ20jk9l2j26L9R7J9K8l7
4210B3n5m2Q8K1K5j06m3kJ22Lm8Q0j60l4J07J03J4q4j07kO7P9Q4r7q2q9J01J44
4238A10n6o2k6m8N4P8J7O1j73l9kJ28L9r8qn6oJ19Q1n5r5l3L4O8K3j6kr3L1l6
4268f1J04K6r7n9Q8M6l8K5Ok9p5Q3O2o0m1m0J6MO5R2m4j08k0P6O2m0n6K7k9l5
4298e0K0P6l8j5k7J6P9l7k7K7k3M2q2R9m8j3n1%K1JL1L1j4m4jN6J6n8l5Q1Jk6
4330HN7l5j4k8PK4km5N7p9N7l6K4N7q7l1M2K2oL9j9N7j07K9J3L1l7m4N4J4L8o9
4362iN3p9N6o6K0K2J3M2L8j42j1M4R5l9o8l3K2P3m4O4k4j03M9O6M6p2p2K5KL5
$$ plain form
4151 -30 12 65 55 -32 -39 -68 -5 51 76 -36 -87 -55 5 84 62 -3 -25 -98 -7 86 94 57 -72 -47 -5 25 40 52 -57 -100
4181 -100 -95 62 77 5 -41 -75 -11 27 103 100 -12 -150 -83 50 126 44 13 -54 -55 65 64 35 3 -123 -84 13 32 60 23
4210 23 -32 -74 14 35 60 -46 -89 -91 31 34 -14 66 -94 -128 -21 82 96 12 -95 -97 -30 49 133 36 -46 -135 -34 110
4238 110 54 -8 -34 -82 -28 50 67 128 -45 -84 -86 42 81 -17 -25 -81 -87 32 113 58 -37 -70 -36 32 55 39 37 -56 -25 -61
4268 -61 43 69 -28 -87 1 47 9 34 40 11 -64 19 81 21 -20 -60 -44 -40 25 117 73 -35 -55 21 83 43 -13 14 -15 -50
4298 -50 -30 46 8 -7 -34 -18 61 24 -3 24 1 43 -39 60 12 -1 -52 -52 -31 -30 1 32 18 -26 -27 29 45 -13 -48 33 34 8
4330 8 65 30 16 -12 -5 19 17 -28 29 -50 7 -29 -5 52 -35 -66 -24 -2 -8 31 12 69 -38 -9 4 35 -2 -46 8 22 60 -9
4362 -9 44 -35 21 -45 -25 -3 10 52 90 -52 -63 -19 76 37 -31 -64 -42 31 -13 51 27 -76 -27 39 85 13 -59 -34 -32 3
4392CLM5o2l8m6N5R8K4j17n5P9n2J53K9o5p2r1L0J38%l0n0p9J9J63Q4r2j24j36
4421a86J53M2P1l6o0j02M0P1J26k5j82k0O7j4J81Kr9j53nR6J47Rr6j15j5NK11
4448A13J04j62j67o9J39J38R8j40q7j40R7J59J31o1k65j20J99J04P9J4j72j62
4470a70J5J86J38l6k12o0%J47N3J17j67j90k3K23J39l3j20j50o0K11J20L5m3k28
4494a08r0J43K25lj26j19j10Q5K02R7o1k53r4J60J27R2q1j11j98O6J87J89j56
4517F3j45o7J13N7J22o8r5j34m3K40J85j41j59mo8J62R4j2p4j39OJ26J03j5j48
4542d1o1PN1J55L8j32j68j4J54J44l4m0j70n7J15J46J01j75j84L3J63M5N0n3j57
4567h4q1Q8K11N4k12p6j7R2N2O6m4j64k4L9K19O1j58j62M4L9P6R6Kj43j39J27
$$ plain form
4392 3 6 51 -11 -49 -95 -40 58 82 -35 -90 -11 -63 90 119 54 -18 -109 -79 59 59 29 -21 -100 -81 82 166 74 -50 -186
4421 -186 -33 9 80 44 -16 -118 -78 -7 119 94 -88 -108 -41 -55 126 128 29 -124 -129 -33 114 123 27 -88 -103 -98 113
4448 113 217 55 -112 -181 -42 96 194 54 -33 -173 -76 83 214 153 -112 -232 -33 71 150 164 -8 -170
4470 -170 -155 31 169 133 -79 -139 -139 8 61 178 11 -179 -202 21 160 127 7 -143 -203 8 128 163 120 -108
4494 -108 -198 -55 170 167 41 -78 -188 -103 99 196 135 -118 -212 -52 75 167 86 -25 -223 -157 30 219 63
4517 63 -82 -149 -36 21 143 75 -20 -154 -197 43 228 87 -72 -76 -144 18 112 100 26 -113 -107 19 122 107 -41
4542 -41 -102 -95 -44 111 149 17 -151 -165 -11 133 99 59 -111 -168 -53 93 194 19 -165 -132 31 76 126 73 -84
4567 -84 -165 -77 134 188 -24 -100 -117 -25 27 93 49 -115 -139 -100 119 180 22 -140 -96 -57 19 115 117 -26 -165 -38
4593c8J35N1q0j48q6J36J5Q4N5k03o8k4K18N0m0q3o8kN1J67mj24j33K6J08R5l8
4620E2l2q7r5J42J11J3r4j02RM9N2O8o5n6p1Q0J30l1m4j16ON7P0K6M0j33j04Q9
4648c6N7J7n3N3r2M4RJ30r0K2j46L2Q1J0k1Lj6q2N3M5Mm4j3J3J2L8j6K2o2j6K7
4679a5O8l9k7j8M3Nq0R6K0r8N0l3N7Rk5j3K9k2j0j8J4N8o2L2nm6rQ0P0m8q7PM5
4712B8m7L2M6p2n2p4J75L3nq6m3O5k7J7N6m9p1J2Q0P2r9L5j13oM8J22j0n6q9j6
4742i4J10J18k7p7j9j22N1J78L2r0j76P9RP2O8m4q7p4rJ64M7p3o1n3M5K9R4N0
4770A40k12n4M7J30N0q0J4j07k4Q2J03N3j34j53Q2O8R6k7q4o5rJ9J52L4j14r8
4796i1n8J17J50jl7j20j09J12J47Q4j74j57Q0N9L8K1n4m1j25Q2K06o4j9j48lM2
$$ plain form
4593 -38 97 148 68 -80 -166 -30 -15 69 124 -79 -147 -171 47 97 57 -26 -94 -96 -45 122 118 -6 -139 -113 -5 90 52
4620 52 20 -67 -162 -20 91 104 10 -92 -83 -34 18 86 21 -35 -106 -26 104 73 29 -87 -81 -24 46 72 112 -21 -125 -36
4648 -36 21 38 -15 38 -54 -10 -1 129 39 61 -85 -53 28 38 17 20 4 -78 -25 20 24 -20 -33 -20 -8 30 14 36 -26 -42 -15
4679 -15 53 14 -13 -31 12 17 -63 33 53 -45 5 -28 29 38 13 0 29 7 -3 -21 -7 51 -11 21 16 -30 -39 41 111 63 -24 -17 28
4712 28 -19 13 59 -13 -65 -139 36 69 64 -22 -65 0 -27 -10 46 -3 -74 -62 18 90 -9 26 -87 -93 -45 77 67 11 -78 -94
4742 -94 16 134 107 30 11 -111 -60 118 150 60 -116 -37 -28 44 112 68 -19 -93 -102 62 109 36 -25 -78 -33 -4 90 140
4770 140 -72 -126 -79 51 101 21 35 -72 -96 -14 89 142 8 -145 -63 5 101 74 -10 -75 -84 -65 87 121 7 -91
4796 -91 -149 -32 118 117 80 -40 -149 -37 110 194 20 -137 -57 2 40 61 7 -34 -159 -77 129 65 46 -102 -105 -63
4822f3M0J38Qj32j41N7J66M3n4o8p1l6J34L9J30j87r2K6J25M2M8j01o5j05J22
4847CO2J4j12n3NQ9O7k3%j16n4Q6R9Mq3q5OO0Q3k3O1j84n2J17J71q0k3l5p9J3
4877f2O5O1N5j28p2L6M6R7r0K1o3q8J89Q2j01p5p3R7L9m1l1M1q8k1P7R4m5Pp0
4906d1J3K7M0o0M5m4o9J17Q8j22k2j3K1K9mK6J4p4j6N3O4k6p9KN1m4ON1k4j02
4936i3M2P0K1n1p2J03n8k9J10rk4p6mN6J2j8RK6K9o6N5Pl8l3K2PM9nm2M5q8j1
4968e4P8Q6j46J0K2K8L4p4J7n3lQJ13l0n9l3M8K5l2L8o2O1r0J1R1J5r8PO9l9J1
4999aQqKn2M5K7lj5KJ1p1M7L4J7j8n6nR1l2l0k3M2Mm0K4QQl8RJ4m8M7J2j3o6K6
5035d1P6m3n9J2J03k9j9o8Q8J5Nn4J11n8j32J55N4j11pJ4Q2r4j2K5K3J9p1M4J5
$$ plain form
4822 -63 -23 115 123 -9 -150 -93 73 116 62 -6 -77 -113 21 60 190 3 -89 -63 62 104 152 51 -14 -119 3
4847 3 65 79 -33 -86 -81 8 75 52 52 -64 -118 -32 67 71 -12 -97 -91 -31 52 29 90 -94 -146 -29 142 62 39 4 -75 -62
4877 -62 3 64 119 -9 -81 -45 1 98 8 29 -34 -122 67 149 48 -27 -100 -3 36 -5 -36 5 -83 -104 -27 67 22 29 -41
4906 -41 -28 -1 39 -21 24 -20 -89 28 116 -6 -28 -41 -20 9 5 31 45 -29 -45 8 72 46 -33 -31 20 -24 -18 33 9 -93
4936 -93 -51 19 40 -11 -83 20 -38 -67 43 34 10 -66 -70 -14 -2 -20 -11 15 44 -22 33 40 2 -31 -9 -2 47 42 0 45 -43 -54
4968 -54 24 110 -36 -26 -4 24 58 -16 1 -52 -55 -47 66 36 -23 -56 -8 17 -15 23 -39 22 -68 -57 34 49 -49 -42 27 -12 -1
4999 -1 7 -1 1 -51 -6 21 18 3 5 16 -55 -8 26 43 25 -31 -36 55 23 -7 -30 12 16 -24 0 8 16 -22 -13 1 -47 0 12 -1 -67 -41
5035 -41 35 -8 -67 -55 48 19 0 -68 20 35 40 -14 97 39 -93 62 116 5 -2 12 94 0 -12 13 36 55 -16 28 43
5064D3M1j07O4m2j5M0O4m5o9m6Q6L2n2j7k4J9j3L6O3k0o6l9N7J4K6n0ok0J0L2
5094dP5L0j25Q0n8J9l1Q2k9p5J1j3J00k2m4o7N7lL2K9L2r8K0J0M1l6m9N9l3m8
5124e8L4K9k9oNO4k8m3K3j0M4j5LN2n3m2J2J19r5m8L1k7kJ03o9M6o2r1J24N0j13
5155e2L1K2l2%k6J23jj81Q7K9O5o2j7Jq3K0R4Q9m1j50k0P0P5P8n8j07m2j0J66
5184F8K6m3r0j02N9J02P3J2o7j38j5J17J45n8j19l1j5L2J05M7p1j25n7R0J83l4
5210I4n9o9p3L1J42N5j6j32j40J53J18n0L7j42m6JJ76O3l2j52p0O2R5L9J3r2r4
5237h8rJ49O3J6j65o7m0M7J48Q1j21k14P6J59R0o6l3q3r4P0J53Q2j39o4KNJ34
5264I2l7ooj53J8R8J24Nk07L7KNO5J00o0j63k9J31R4n6r1l6K9R6m5Q9j38q2P8
$$ plain form
5064 43 84 -23 41 -1 -16 24 88 43 -26 -72 14 46 -6 -23 -47 -28 -41 -5 58 38 -28 -67 -10 4 30 -20 -26 -46 -36 -4
5094 -4 71 101 -24 56 -2 17 -14 68 39 -36 -25 -38 62 40 -4 -71 -14 -17 15 44 76 -22 -2 8 49 13 -36 23 -10 -58
5124 -58 -24 5 -24 -30 -25 39 11 -32 -9 -19 25 10 13 65 12 -30 -18 101 6 -42 -11 -38 -40 63 -6 40 -22 -113 11 61 -52
5155 -52 -21 1 -31 -31 -57 66 65 -116 -29 0 65 3 -14 -13 -96 -76 18 107 66 -84 -104 -34 41 119 61 -46 -88 -98 68
5184 68 94 51 -39 -141 -82 20 93 105 38 -100 -115 2 147 89 -30 -61 -76 -44 61 108 37 -88 -145 -55 128 94
5210 94 35 -34 -107 -76 66 121 105 -27 -167 -14 104 54 91 -51 -97 -96 80 143 111 -41 -111 -49 46 85 98 6 -88
5237 -88 -97 52 115 131 -34 -101 -141 -94 54 135 14 -200 -124 35 125 59 26 -57 -151 -81 72 154 15 -49 -47 -42 92
5264 92 55 49 43 -110 -92 6 130 135 -72 -35 -33 -28 37 137 77 -86 -115 16 110 54 -37 -73 -44 52 7 96 -42 -124 -46
5293d6L8M5mp2N3l0o5J17M9m8p0J7M1N9q4N4r5lpM3Q8o1m6rR9j6m5j2P8q4o2J28
5325E0Mp2m8k0J12m9M9KJ0p5nOM8L9r3J6Q3l6l3R3q5j7m1M6l9M1k7J1L2L8rL1
5357F2q3l1J4J58j15j7m2O2j8n1R3j2m7j5k3K9JLQ0j6q7K1K2k9mMP7j7j2q0R0
5388A7k6kJ7m9O6o6QM5J1m9J3K8l7L1L3mn1n1P5J9n7L1k1%NM1Rk0n4m6J17J1l9
5421Eo2M0k2jO4N0p5n2J0M7J1N9q3K6l6oN2JL8j04n1P6Q4l2j7Oo2m8J13N8n5o4
5453c0o1J9J31k8Oj3p5J0R6N9r4j12PO7J2LM3m0j06J9J14P1l5n3l2J8QO5L4j01
5483Br2l0J10O4j9j3n3m8M6P4Q4q1o2l2M3R4m5j4k8r9N4J02Lm1q4j7J11k0K9O3
5513A01j25j09L1R9J25q4n2j7k0Q4K3M9o8j18L6P1N9n7qn4o7P6R4%m9j34P5L6
$$ plain form
5293 -46 -8 37 33 -39 14 -16 -81 36 85 37 -33 -16 25 84 0 54 -41 -44 -51 -8 80 19 -27 -36 63 47 2 -10 68 -16 -78 50
5325 50 54 -18 -66 -86 26 -23 26 28 38 -37 -42 -36 12 51 -42 -26 57 21 -12 81 -4 -21 -62 -16 -55 -14 -41 -30 2 40 31 62
5357 62 -21 -52 -38 120 5 -12 -54 8 -10 -61 32 20 -27 -42 -65 -36 -35 -32 48 32 -55 -34 -12 -41 -45 -41 36 19 7 -73 17
5388 17 -9 -11 6 -43 23 -43 -35 10 21 -28 -15 13 -24 7 40 36 -15 -66 9 28 -29 2 -19 -19 -14 27 36 16 -38 -84 33 44 5
5421 5 -57 -17 -39 -40 24 74 -1 -53 -43 4 15 74 -9 17 -19 -25 27 28 66 -38 -89 -13 71 39 22 28 -34 -82 31 89 34 -30
5453 -30 -91 -72 59 31 37 24 -51 -41 55 114 20 -92 -85 -18 -6 -3 40 0 -106 -87 27 98 63 10 -22 -4 4 69 103 2
5483 2 -90 -120 -10 54 35 22 -31 -79 -33 41 125 44 -18 -50 -7 87 42 28 0 -99 -45 57 60 19 -65 -82 29 9 38 101
5513 101 -24 -133 -102 -3 122 38 -14 -31 -51 33 56 105 37 -81 -45 26 85 28 20 -34 -101 -25 69 69 20 -114 -39 -3
5541cJ8L0p9Nm1NJ61k4m5p9L0M4L5N4n3r8KJ3O6N5j03M2%q5M8L2lnj35P3J45n2
5573E3o1j1J3NJM5K1n9p7K6Q2Kj0p1RK7LJ2Q5j26l9M4Q2jk2o0J9o1L0O1O0j39
5605e7J3M0K5M0J5Nm7j25R7N2j6p0K0m9Q4J2K4o6m9k6J02J7rn7j6L4k7L4Pmr3
5636i0N3K3O1nr0L0j1K2K4J7Nk9m1K7N6n4P3j22K2M6l0P6n6k4OJ4j1O9k3j0m0
5667a2Nk4P8Oj7n0J6l9K7L1k5n5O0N5n6N1o8Lk4K8j6L4L1k2q2J3Q2k2K0jk7j1
5699a1mO5j15M2K2J3L3j01L0L1MpL8j1m2j1RK8k5QK3L2kr0K6jj4%j0M3mOM8rq6
5734d2P4J8n4j2p4J08J7o3k7J11j3p9O7q8Q4o2MK2Ol4O6k2q1M1K9L7n5%j0L0L7
5765C5j4k4J6j7k0L8kn1K0M4l9%j7J1J7J1LJ0n3j8KQ3n2oMQL7m0M0M6n5J0j1k9
$$ plain form
5541 -3 15 45 -34 -29 -70 -65 96 72 27 -52 -22 22 57 111 58 -40 -38 -25 41 96 -7 35 35 -50 -2 30 27 22 -113 -40 105 53
5573 53 -8 -19 -6 -1 0 45 66 7 -70 -44 38 40 30 -41 -32 -5 -2 10 95 -31 -70 -26 56 55 33 -27 -8 -69 -39 22 82 -57
5605 -57 -44 -4 21 61 76 81 34 -91 6 58 42 -28 -8 -57 27 39 63 -3 -52 -78 24 41 32 -25 -41 -7 -34 0 7 3 -90
5636 -90 -37 -14 47 42 -48 -18 -29 -7 17 34 39 10 -31 -4 52 -2 71 -51 -29 17 -13 63 7 -17 -11 3 -8 61 38 28 -12
5667 -12 -7 -31 47 53 36 -14 2 -37 -10 21 -4 -59 1 56 0 51 -17 -14 -38 -10 -26 8 39 17 -65 -52 30 8 28 27 0 -11
5699 -11 -15 50 -65 -23 -1 12 45 -56 -26 5 9 2 40 29 -13 -24 -15 13 -12 -4 19 51 49 -41 -15 -16 -30 -30 -40 3 -1 5 53 44 -42
5734 -42 32 50 -4 -16 -90 18 35 -28 -55 56 43 -36 31 -57 27 -35 -31 -9 -3 -37 29 7 -74 -33 -4 33 -22 -22 -32 -2 35
5765 35 21 -3 13 -4 -24 14 12 -39 -19 25 -14 -14 -31 -20 -3 8 11 21 -32 -50 -48 35 -17 -23 -19 -11 26 -14 26 72 17 27 16 -13
5799a3L2q6QL4k3j4Q3j8p3j2P3O3m9J9om5j1K5N6K0k4o9N7k1J8mQm1j0%O8J7o2
5832@J3Pqk2PP6q7n2Q8M5l2p6J5L9l7J9L6nj3k8mk8Q1m2N1L0j11J8L5J9n6k5N8
5865A1qJ7J9K2l0j39J34j6O8p1j8Oj2k6M1M9n2K5k4Rl0k3j1N4J8n1O0Rl6n3L7
5896b1L0j1N0k5K2m8k2K3mL2K5j18Q8Pk2Qj6k4K9M2k3l6J1Lj4MQK0k7m4N3K8l1
5929cJ0k0K5lm1K6j6mPJ8K3n2l7P0K5j1km3l5L2J5M5J6o8K4MQ6l6l8J4Qq9J8P7
5963D5J7n6k8j5O1n3M4L9r9qK2J15o4J7n1j7k8P8J8l3j5qK6l3K8Rn1K1p4P6P2
5994E5j2n3q1P9P3o2P7o7l2KoQ4%n8J2J8n6K4K7kMr9j4P7j8j3L5K7m7lQ8n6k2
6027a9k0N6koo0N1l5O6p0Q9l4Lm3M2K4o5N9m5j9K7k2R2k3J1m4M8j2l2l0N6l1j4
$$ plain form
5799 -13 19 -67 -59 -25 -48 -62 21 3 -70 -82 -9 54 5 24 18 -27 -38 -13 43 63 39 -30 27 6 24 20 28 -13 -23 -23 45 62 0
5832 0 13 20 12 -10 -3 73 -14 -66 22 67 35 -41 -26 13 -24 -5 31 26 13 -15 -19 -47 34 -8 43 73 -38 -20 15 34 -22 -47 11
5865 11 3 20 39 61 31 -108 26 10 78 7 -11 -5 -17 -43 -2 47 -5 20 -4 5 -25 -48 -59 -5 13 -38 22 31 -5 -58 -21
5896 -21 9 -2 48 23 45 -3 -25 -2 -6 26 51 -67 21 28 6 14 -2 -26 3 45 22 -14 -3 0 -14 -10 -2 18 -9 -53 0 28 -3
5929 -3 7 -13 12 9 -32 -6 -22 -26 -19 -1 22 -30 -67 3 28 17 15 -28 -63 -31 -16 29 45 -23 1 5 91 55 17 31 39 -50 -32 45
5963 45 62 6 -22 -37 24 -29 15 54 -45 -53 -31 84 20 37 -14 -31 -59 19 37 4 -11 -19 7 -26 2 11 -40 -19 -93 -17 55
5994 55 43 -10 -91 -12 61 -1 76 9 -23 -21 -27 57 57 -1 11 29 -27 -3 24 22 26 -73 -87 -10 -28 -41 -6 21 -26 -29 59 3 -19
6027 -19 -39 17 15 9 -51 0 -35 31 -39 50 16 19 -24 18 42 -23 36 -9 -28 -1 -23 69 46 57 13 61 49 17 -13 43 12 -2
6059bON6q8pK6N9o1j5L9j1KM8p0M3o3q9J06%O9p7N6k6l7L2N9k9n7J5j0M8j8k8
6091b4Q3o9n7K6J21j4r7k7Q9k1J1nko2j1MP1l1k3n8Q5qO0Jm3K4q4O5L8k3l8O8
6123D9r1M7J5l7K8j9NN8jm6j0rj4jL9M7Qj09K%O8m1j1Ok9M7N5k9J4p8J7J34j25
6156a1L6o1M3k5l2Q6K5r1n3N2O5j4Rn2M4k8n4J23l1o2l7R1n3N3l9J9pn0j2J24
6186E8k7p6Oj4N6j4O5l7mm6J7L2j9m2P1%k0L4K7m3m2m4N4K1K5J3j0p1J2M2N2J7
6218I3j52l4Q2O4Pj1n3k3j3N6J22j06ok6q1J43m3M7n2o6J1qJ21n7qj0j6l6K4R3
6248F2J2j53l5J24oK4K4p9l3M0Q8k6M9j39k5N3N4P3o6J1o4j6M8O8o6n6lM6kqQ2
6279H1j2p9o1N4Q3Po7o8J7j1O4K7j6o9J9PP2pr0J8N1m1J5QN3o5K3k8mN8m6l4K1
$$ plain form
6059 -2 4 60 -28 -35 -9 50 -11 -26 13 2 4 52 -18 25 -38 -127 -21 -21 48 -29 27 1 -36 -4 55 26 -31 -16 -26 22 4 -24
6091 -24 59 -10 -67 -41 80 66 -31 -58 31 10 21 16 14 -48 -59 -55 16 -15 -38 -96 -11 -19 41 42 -1 23 -61 4 42 19 -19 49
6123 49 -42 5 20 -17 11 -8 -3 55 54 8 -2 -11 -25 -26 13 60 68 -41 -39 -39 29 -12 -23 -17 -46 1 56 27 41 -37 -20 114 -11
6156 -11 25 -36 7 -18 -50 36 61 -30 -83 -31 34 20 29 -23 21 -7 -61 62 31 -31 -68 23 -30 23 -16 3 -4 -54 -66 58
6186 58 31 -45 -39 -53 3 -11 54 17 13 -33 -16 16 -3 -45 26 26 6 40 67 24 -18 -62 -8 13 38 51 41 -30 -18 24 76 93
6218 93 -59 -93 -11 53 60 49 -4 -27 -40 16 138 32 26 0 -81 62 19 66 14 -52 -41 -49 72 15 7 -3 -19 -55 -31 62
6248 62 74 -79 -114 10 4 28 52 -27 -60 -20 68 42 91 -48 -73 -20 34 107 41 52 -12 -28 20 88 22 -34 -37 9 7 -1 81
6279 81 69 -10 -71 -17 66 73 6 -62 -45 -56 8 35 19 -50 -31 -24 48 41 -49 -31 20 -21 -6 2 55 -10 13 -15 -19 39 -7 -41 -20
6312b0k1L1J9O4p7k4N4m9k9L2L3j7Ko2J06m8j7L2j0K2q7J13Nr8j6M6N4o2K4JK4
6343B5p9L6N2J0m2Oj4Q5q4PJ4lj2K7ok9j9O6l4n2M9m5J4Q7q4N9Rn2l5J0N0K8o4
6376b0j3O5r6P9J8m6lK6l1O4Oo5P3m6o8K6R7j3r7L8N3pj5n2Q2o1j8L5J8Nj13P6
6408ck1J7o1O6Kk1j7mJ41p5o3LM6k5K3k1R6j29%L6N8m2O2p1N3k8k6Q0n4o9J4M1
6440HK2o1L8mo2O8k0L6j1rJ4j7j8l8Q5k6l2Rk2O1L9j11MM3K5o5N5k4k6kM1J7K
6473A9K2p6J26j01L4MPm0l1J23j0j21K6O9r2N5nO8n6n0P2o0L2j8l6Q3k5j9j4K8
6503A4Kpqj5N0m0OM4o1m7L5O5L1m9k9oK6n3O6N3q7L3Nk5rOQ3k2r4M0M7k6jm6j
6538b0NJ2KN5p1ll4P1J2n0K2m4L1n1M9P3k3r7R8J3Jl9K3p9pN5O3k3m7n2Q0l8M5
$$ plain form
6312 -20 -41 -10 9 73 -4 -28 26 -23 -52 -20 13 -4 -2 -64 42 -6 -23 9 -1 21 -66 47 52 -46 -62 -16 38 -24 0 1 25
6343 25 -54 -18 34 44 2 8 -6 79 -5 2 16 13 1 28 22 -7 -26 40 6 -46 3 -42 -28 59 -25 34 43 -9 -44 -34 16 44 -20
6376 -20 -33 32 -64 15 33 -13 -16 10 -21 43 49 -16 57 11 -57 -31 66 53 -44 -6 47 40 25 -27 55 -6 -24 11 29 34 -79 -3
6408 -3 -24 -7 -68 -2 0 -21 -38 -42 99 24 -39 -36 10 -15 8 -13 83 -46 -46 -10 48 6 68 -3 50 22 -4 76 22 -47 -33 8
6440 8 30 -31 7 3 -59 9 -11 25 14 5 19 2 -16 -54 31 5 -27 -18 -40 21 60 -51 -47 -4 21 -44 11 -13 -39 -41 0 17 19
6473 19 41 -35 91 -10 24 28 35 -5 -36 87 77 -44 -18 51 -41 14 9 77 21 -29 43 -17 15 -3 -39 44 19 0 -14 14
6503 14 16 9 1 -14 36 -4 2 46 -15 -62 -27 38 69 20 -9 -15 11 -42 24 77 -10 23 28 3 -6 0 83 61 -33 7 54 28 27 -19 -20
6538 -20 -15 -3 -1 54 -17 -20 -54 17 29 -21 1 -43 -12 -63 -14 59 36 -61 37 50 51 12 35 -44 -51 4 67 44 -3 -55 25 -13 32
6571C2l6K0k3o7O5L0L1k4l9l2J2K0O3Nn3n2PO0K4k2j8k2n5N3L8N1o6k5l3P2KM
6603B2k6k2n5M2R4K3k2o5J0J1L5l6M1l6q3R1L6l2k0j9n0R3p5K7K3Rrp2O1P1m5
6634B2j2Mo1K9j6P8m3KJmj6L9n2R7n8n1J2P0l0Mm3J3K6j7N2m5j5l3N8k5K7Kk6
6667a1n2R2M6m4j8k7l8Q6rk3j5%k5N2M4o1K8p1LL5No8M3L2j5K0k4M8nj2k6O8r7
6700c9L2j3J7n2J0K8J9K4k8K3n9J01p2j2oM4m3M8nn4L4j3l2K6K0K0n3jkR2p5R
6732a2K7m7P6m9j3M2j4p8O7l5j4M5M2l1n2J7K8Qj9PJ2nl1K0L8n2k2rK0L2Rk8M6
6765B5Ko0jJ14j01J8n9N6j6KK6m7O4r8Q2j2K5o6P9l1l5N9L2K8l3q2L4J4k0J8m5
6796b8k0rQ8kL5l1r7j2P0k0J13m4J0j36P1M5MK2l9r4R2QRK3j03j9N4L1J9j7mj8
$$ plain form
6571 32 -4 16 -7 -74 -9 21 52 28 -11 -43 -31 -11 52 57 4 -48 -41 19 43 21 3 -19 -74 -21 17 68 2 -23 -56 16 18 22
6603 22 -4 -26 -81 -39 55 78 56 -9 1 12 47 11 52 16 -67 24 60 28 8 -11 -61 32 -43 -16 7 16 7 -65 -4 67 22
6634 22 10 14 -47 -18 -34 44 1 3 4 0 -16 23 -29 68 10 -41 -29 41 11 15 -28 -15 11 -6 46 1 -14 -47 11 -14 13 15 -11
6667 -11 -63 29 75 31 13 -14 -52 34 25 2 -13 -13 -38 14 58 -3 25 -46 -43 -8 -3 -71 -28 4 -11 9 -15 33 28 16 -10 58 -39
6700 -39 -7 -20 -3 -55 -45 -17 2 26 -2 21 -38 63 -9 -21 -27 17 -26 22 17 -37 -3 -16 -48 -22 -2 18 -35 -36 -38 54 -21 -12
6732 -12 15 -32 44 -5 -18 24 10 -68 -1 -36 -50 -5 37 6 -46 -29 -1 7 -12 -5 7 2 -29 -9 29 -23 -45 -54 -34 -2 7 -21 25
6765 25 27 -33 -34 80 -21 -3 -62 -6 -22 -20 6 -41 23 -75 7 -5 20 -46 33 2 -33 26 58 86 53 -29 5 19 -1 17 -28
6796 -28 -48 -57 31 29 64 33 -64 -76 -6 -26 87 43 53 -83 -12 33 37 59 20 -74 18 26 35 58 -45 -64 -10 21 40 23 19 1
6828Ak5J4O1L4q3q0M4OMJ17q4m2j2j2O5N6o8l3k1K9K1Q0k8j7j06K3M8M1J6j7p1
6859c9N0m7Q6L9j03j1%O5J7k0k5o4n3J00P7L9r6q6P3l%K9J6r2m2K5R7m1K5j5o3
6890f2mO2QK6k5r1j1J17rO5r4LK3l0R4m9ro1J0O9K5n6L5m1m3M1M0MK7j29Q4k2
6922cK6rKK6o7QK8PJ2n9p2J68l9Oo4RkN1N8p1k6Pj7N9m4J9k3L3j7jM2j9Pr0J9
6957c6L9K0KJ4j01oJ11M7n8%n6j1K5J1%J0M6j23L0N7l8k9K0J9PK9k7L5k0j10N5
6988c8KR8j4k7J8n0J7R1r8J4l8nrN0M2o8l0M7K8p1O4r1Q7p1N9l9N9Mk5m4M6O5
7020G3q6m6O0J1l9M0L7jm3L9n0L5J5p5K8K5J3l4K4j3M5r6M5P7r7OJ0j3p1J11j1
7051A9L4p5J7k3M3j2k1LL9l3N4%r3Q4K6n6k7m5L3M9k8LL8Jm3J3QK8l4J2k3j2k0
$$ plain form
6828 1 -24 -10 51 85 2 -78 -34 -28 -24 93 9 -33 -45 -57 8 64 -4 -37 -58 -29 -8 72 44 27 -79 -56 -8 33 49 32 -39
6859 -39 11 -36 50 89 -14 -25 -25 40 57 37 12 -52 -105 -5 72 111 15 -71 2 -1 -1 28 44 -48 -90 -65 32 -9 16 1 -62
6890 -62 -66 -4 4 30 5 -86 -97 20 11 76 -18 -15 8 -22 72 23 14 -47 -37 32 57 1 36 -5 -48 -7 33 37 64 -65 19 -3
6922 -3 23 14 16 42 -25 -17 11 18 30 -29 -101 67 28 34 -30 -21 -23 28 86 15 -11 -4 -21 38 -6 13 -10 23 6 5 47 28 35 -55 -36
6957 -36 3 23 25 39 -62 -68 43 90 32 32 -24 -35 -10 1 1 11 57 -66 -36 21 -17 -46 -26 -7 0 29 2 37 17 -93 -38
6988 -38 -36 62 48 21 39 -11 6 97 -1 13 -25 -30 -39 11 53 -15 -45 2 30 -41 23 -68 19 -52 7 -32 27 31 6 -38 8 73
7020 73 -13 -59 1 12 -27 13 50 49 6 45 -5 30 45 -30 -2 23 36 2 26 13 58 -38 7 84 -13 -7 3 -10 -81 30 19
7051 19 53 -22 -5 -28 15 3 -18 -15 24 -9 45 45 -48 36 62 6 -21 -66 -33 16 -12 -9 29 30 -13 0 8 36 2 14 -9 -21 -41
7084d1N1J5m6L5j9O1m0KJ1j8j2j4PO6n0o7K3M2Jn9O6n2K4J2o6J09o4M9m9J8K3
7115A8O5o5l2m5M7N9N3o4m1K6j4n3Q1ql2O7j15P8nJ0j1Qjm1n8J46n8k6M2k0nm0
7147c4R1p0L6m1K7K5o4k1K6KJ9l3L3K5k7mJ4QL7k3qm9L7K9n3K8mjL0j1J0n9K5
7180@R1p9rj5L2j8J4o0N7l9M7Ko3P3o3K6Mj4K1L8m5J8L4k4j3k9l7Q7k8O8m6K4
7212E4n7j2K6k8P6rp4l8L4K0K4j4QPQn6N5Pn0PK9n6j6P0jqk3k9J6J0J8%j5J9L9
$$ plain form
7084 -41 10 25 -21 14 -5 56 16 18 29 11 -1 -15 -8 58 8 -59 -36 6 7 -52 14 -38 -14 -2 -68 41 -23 26 -23 -5 18
7115 18 83 18 -14 -59 -12 47 100 36 -5 21 7 -46 35 27 -5 62 -53 25 20 30 19 27 26 -15 -73 73 15 -11 31 11 6 -34
7147 -34 57 -13 23 -18 9 34 -30 -51 -25 -23 -4 -37 -4 21 -6 -10 4 12 49 26 18 -31 6 35 -18 10 6 5 35 24 34 -25 0
7180 0 91 12 3 -12 20 2 16 -44 13 -26 21 23 -40 33 -30 -4 0 -14 7 45 0 18 52 28 15 -14 -51 36 8 76 30 54
7212 54 -3 -15 11 -17 59 50 -24 -62 -28 -8 16 2 10 17 25 -31 24 31 -19 -12 17 -39 -55 15 14 6 -17 -46 -30 -20 -2 -2 -17 2 41
$$ [...]
8191G
##END NTUPLES=NMR FID
##END=
