##TITLE=1H_E3d-2
 CDCl3
 8 sc, 
 15.6.2023
##JCAMPDX= 6.0         $$ Bruker NMR JCAMP-DX V2.0
##DATA TYPE= NMR FID
##DATA CLASS= NTUPLES
##ORIGIN= UXNMR, Bruker Analytische Messtechnik GmbH
##OWNER= root
$$ XWIN-NMR		Version 3.5
$$ Thu Jun 15 09:27:53 2023 Russian Standard Time (UT+4h)  she@DPX200
##.OBSERVE FREQUENCY= 200.13135
##.OBSERVE NUCLEUS= ^1H
##.DELAY= (6, 6)
##.ACQUISITION MODE= SIMULTANEOUS
##.ACQUISITION SCHEME= undefined
##.AVERAGES= 8
##.DIGITISER RES= 18
##SPECTROMETER/DATA SYSTEM= spect
##.PULSE SEQUENCE= zg30
##.SOLVENT NAME= CDCl3
##.SHIFT REFERENCE= (INTERNAL, CDCl3, 0, 15.7039)
##AUDIT TRAIL= $$ (NUMBER, WHEN, WHO, WHERE, WHAT)
$$ ##TITLE= Audit trail, XWIN-NMR		Version 3.5
$$ ##JCAMPDX= 5.01
$$ ##ORIGIN= Bruker BioSpin GmbH
$$ ##OWNER= she
$$ F:/spectra/data/she/nmr/H-F/1/audita.txt
$$ ##AUDIT TRAIL=  $$ (NUMBER, WHEN, WHO, WHERE, WHAT)
(   1,<2023-06-15 09:26:51.04 +0400>,<she>,<DPX200>,
      <created by zg, POWCHK disabled, PULCHK disabled
       configuration hash MD5:
       00 E9 B6 7A A2 85 ED C7 34 08 36 98 17 FE 4E 26
       data hash MD5: 16K
       51 7A 0B 26 75 10 D7 2E E9 C4 7A 75 5A BB A1 7C>)
$$ ##END=
$$ 
$$ hash MD5
$$ 90 CD 2A E6 CD 0D 62 AE 9E FC 1F EF D7 A2 4C 4D
##$RELAX= 
##$RELAX= 
##$RELAX= 
##$RELAX= 
##$RELAX= 
##$RELAX= 
$$ Bruker specific parameters
$$ --------------------------
##$DU= <F:/spectra>
##$EXPNO= 1
##$NAME= <H-F>
##$PROCNO= 1
##$TYPE= <nmr>
##$USER= <she>
##$AMP= (0..31)
100 100 100 100 100 100 100 100 100 100 100 100 100 100 100 100 100 100 
100 100 100 100 100 100 100 100 100 100 100 100 100 100 
##$AQSEQ= 0
##$AQ_mod= 1
##$AUNM= <au_zg>
##$AUTOPOS= <>
##$BF1= 200.13
##$BF2= 200.13
##$BF3= 200.13
##$BF4= 200.13
##$BF5= 200.13
##$BF6= 200.13
##$BF7= 200.13
##$BF8= 200.13
##$BYTORDA= 1
##$CFDGTYP= 0
##$CFRGTYP= 5
##$CHEMSTR= <none>
##$CNST= (0..31)
1 1 145 1 1 1 1 1 1 1 1 1 1 1 1 1 1 1 1 1 1 1 1 1 1 1 1 1 1 1 1 1 
##$CPDPRG= <>
##$CPDPRG1= <>
##$CPDPRG2= <>
##$CPDPRG3= <>
##$CPDPRG4= <mlev>
##$CPDPRG5= <mlev>
##$CPDPRG6= <mlev>
##$CPDPRG7= <mlev>
##$CPDPRG8= <mlev>
##$CPDPRGB= <>
##$CPDPRGT= <>
##$D= (0..31)
0 1.2 0 0 0 0 0 0 0 0.06 0 0.03 0 0 0 0 0.0002 0 0 0 0 0 0 0 0 0 0 0 0 
0 0 0 
##$DATE= 1686806810
##$DBL= (0..7)
120 120 120 120 120 120 120 120 
##$DBP= (0..7)
150 150 150 150 150 150 150 150 
##$DBP07= 0
##$DBPNAM0= <>
##$DBPNAM1= <>
##$DBPNAM2= <>
##$DBPNAM3= <>
##$DBPNAM4= <>
##$DBPNAM5= <>
##$DBPNAM6= <>
##$DBPNAM7= <>
##$DBPOAL= (0..7)
0.5 0.5 0.5 0.5 0.5 0.5 0.5 0.5 
##$DBPOFFS= (0..7)
0 0 0 0 0 0 0 0 
##$DE= 6
##$DECBNUC= <off>
##$DECIM= 32
##$DECNUC= <off>
##$DECSTAT= 4
##$DIGMOD= 1
##$DIGTYP= 9
##$DL= (0..7)
0 120 120 120 120 120 120 120 
##$DP= (0..7)
150 150 150 150 150 150 150 150 
##$DP07= 0
##$DPNAME0= <>
##$DPNAME1= <>
##$DPNAME2= <>
##$DPNAME3= <>
##$DPNAME4= <>
##$DPNAME5= <>
##$DPNAME6= <>
##$DPNAME7= <>
##$DPOAL= (0..7)
0.5 0.5 0.5 0.5 0.5 0.5 0.5 0.5 
##$DPOFFS= (0..7)
0 0 0 0 0 0 0 0 
##$DQDMODE= 0
##$DR= 18
##$DS= 0
##$DSLIST= <SSSSSSSSSSSSSSS>
$$ [...]
##$SUBNAM2= <"">
##$SUBNAM3= <"">
##$SUBNAM4= <"">
##$SUBNAM5= <"">
##$SUBNAM6= <"">
##$SUBNAM7= <"">
##$SUBNAM8= <"">
##$SUBNAM9= <"">
##$SW= 18.05172834244
##$SWIBOX= (0..15)
0 0 2 0 0 0 0 0 0 0 0 0 0 0 0 0 
##$SW_h= 3612.71676300578
##$TD= 16384
##$TD0= 1
##$TE= 0
##$TE2= 300
##$TE3= 300
##$TEG= 300
##$TL= (0..7)
0 120 120 120 120 120 120 120 
##$TP= (0..7)
150 150 150 150 150 150 150 150 
##$TP07= 0
##$TPNAME0= <>
##$TPNAME1= <>
##$TPNAME2= <>
##$TPNAME3= <>
##$TPNAME4= <>
##$TPNAME5= <>
##$TPNAME6= <>
##$TPNAME7= <>
##$TPOAL= (0..7)
0.5 0.5 0.5 0.5 0.5 0.5 0.5 0.5 
##$TPOFFS= (0..7)
0 0 0 0 0 0 0 0 
##$TUNHIN= 0
##$TUNHOUT= 0
##$TUNXOUT= 0
##$USERA1= <user>
##$USERA2= <user>
##$USERA3= <user>
##$USERA4= <user>
##$USERA5= <user>
##$V9= 5
##$VALIST= <valist>
##$VCLIST= <CCCCCCCCCCCCCCC>
##$VD= 0
##$VDLIST= <DDDDDDDDDDDDDDD>
##$VPLIST= <PPPPPPPPPPPPPPP>
##$VTLIST= <TTTTTTTTTTTTTTT>
##$WBST= 1024
##$WBSW= 4
##$XGAIN= (0..3)
0 0 0 0 
##$XL= 0
##$YL= 0
##$YMAX_a= 137000
##$YMIN_a= -110616
##$ZGOPTNS= <>
##$ZL1= 120
##$ZL2= 120
##$ZL3= 120
##$ZL4= 120
##$ABSF1= 10
##$ABSF2= 0
##$ABSG= 5
##$ABSL= 3
##$ALPHA= 0
##$AQORDER= 0
##$ASSFAC= 0
##$ASSFACI= 0
##$ASSFACX= 0
##$ASSWID= 0
##$AUNMP= <proc_1d>
##$AZFE= 0.1
##$AZFW= 0.1
##$BCFW= 1
##$BC_mod= 2
##$BYTORDP= 1
##$COROFFS= 0
##$CY= 11.3945322036743
##$DATMOD= 1
##$DC= 2
##$DFILT= <>
##$DTYPP= 0
##$F1P= 15.7292609196834
##$F2P= 12.9074282941183
##$FCOR= 0.5
##$FTSIZE= 0
##$FT_mod= 4
##$GAMMA= 1
##$GB= 0.15
##$INTBC= 1
##$INTSCL= 1
##$ISEN= 128
##$LB= 0.24
##$LEV0= 0
##$LPBIN= 0
##$MAXI= 10000
##$MC2= 0
##$MEAN= 0
##$ME_mod= 0
##$MI= 1.114404
##$NCOEF= 0
##$NC_proc= 0
##$NLEV= 6
##$NOISF1= 3.799351
##$NOISF2= 2.8
##$NSP= 1
##$NTH_PI= 0
##$NZP= 0
##$OFFSET= 15.70392
##$PC= 1
##$PHC0= -20777
##$PHC1= 4.252721
##$PH_mod= 1
##$PKNL= yes
##$PPARMOD= 0
##$PSCAL= 0
##$PSIGN= 0
##$REVERSE= no
##$SF= 200.130013532006
##$SI= 16384
##$SIGF1= 3
##$SIGF2= 2
##$SINO= 400
##$SIOLD= 16384
##$SREGLST= <1H.CDCl3>
##$SSB= 0
##$STSI= 0
##$STSR= 0
##$SW_p= 3612.71676300578
##$SYMM= 0
##$S_DEV= 0
##$TDeff= 0
##$TDoff= 0
##$TI= <>
##$TILT= no
##$TM1= 0
##$TM2= 0
##$TOPLEV= 0
##$USERP1= <user>
##$USERP2= <user>
##$USERP3= <user>
##$USERP4= <user>
##$USERP5= <user>
##$WDW= 1
##$XDIM= 8192
##$YMAX_p= 0
##$YMIN_p= 0
$$ End of Bruker specific parameters
$$ ---------------------------------
##NTUPLES= NMR FID
##VAR_NAME=  TIME,          FID/REAL,        FID/IMAG
##SYMBOL=    X,             R,               I
##VAR_TYPE=  INDEPENDENT,   DEPENDENT,       DEPENDENT
##VAR_FORM=  AFFN,          ASDF,            ASDF
##VAR_DIM=   8192,          8192,            8192
##UNITS=     SECONDS,       ARBITRARY UNITS, ARBITRARY UNITS
##FACTOR=    0.0002768,     1,               1
##FIRST=     0,             0,               0
##LAST=      2.2672688,     0,               0
##MIN=       0,             -110616,         0
##MAX=       2.2672688,     137000,          0
$$ Real data points
##PAGE= N=1
##DATA TABLE= (X++(R..R)), XYDATA
$$ plain form
0 0 0 0 0 0 0 0 0 0 0 0 0 0 0 0 0 0 0 0 0 -8 8 -8 8 -8 8 -16 16 -16 20 -24 26 -32 36 -40 47 -52 60 -66 74 -84
40 -84 92 -103 116 -127 141 -157 172 -190 211 -232 256 -281 310 -340 376 -414 457 -507 561 -626
60 -626 700 -787 890 -1016 1173 -1364 1600 -1850 1791 1671 137000 42939 -51302 48085 -35278
75 -35278 -95748 48376 74368 -13549 5674 -33074 -74811 31683 64907 -9996 7800 -4221
87 -4221 -58800 9309 51272 -11502 -258 3328 -49160 10698 63888 -16782 -29228 9128 -31173
100 -31173 -4236 65805 10407 -36370 -10949 -25749 -1502 57615 10565 -30993 -10559 -42858
112 -42858 -15991 83209 33005 -47921 577 -14669 -54046 47360 67342 -37329 -24560 2584
124 2584 -43101 21735 75255 -21902 -37190 21216 -27747 -22668 63274 16706 -49656 -4113
$$ packed form
0@%%%%%%%%%%%%%%%%%%%qJ6j6J6j6J6k4L2l2L6m4N0n8O8p6Q7r9J12j26J40j58
40h4J76j95K19k43K68k98L29l62M01m43M88n37N91o50P16p90Q71r64J068j187
60f26J326j487J677j906K189k537K964l450L641j20J35329r4061r4241R9387q3363
75c5278o0470J44124K5992q7917J9223l8748m1737J06494L3224p4903J7796j2021
87d221n4579O8109M1963o2774J1244L586n2488N9858N3190q0670j2446L8356m0301
100c1173K6937P0041n5398m6777K5421j4800K4247N9117m7050m1558K0434l2299
112d2858K6867R9200n0204q0926M8498j5246l9377J01406J9982j04671J2769K7144
124B584m5685O4836N3520r7157j5288N8406m8963N079Q5942m6568o6362M5543
$$ plain form
136 -4113 4296 -10128 30207 12643 -30370 -2270 751 -13134 30093 21045 -35823 -15023 10401
149 10401 -5285 18251 20064 -26789 -15311 11109 -4225 16167 27777 -23323 -27054 8838
161 8838 -375 8383 27754 -13232 -28013 6444 1774 4162 27902 -8427 -31576 7023 2462
174 2462 -9279 29851 9774 -39826 -3794 20818 -8596 8399 18258 -22386 -12707 15001 -4815
187 -4815 4727 21766 -18648 -22395 19834 7697 -9422 11635 344 -16790 4228 6295 -1866
200 -1866 10115 -4757 -19852 8612 13630 -9514 1209 6908 -12676 -3761 10644 285 1179
213 1179 1218 -12296 -339 12791 -2771 -2174 7559 -7717 -7627 10529 2969 -3547 5099 -4227 -7807
228 -7807 7445 2869 -4312 5552 -1944 -9888 6711 4980 -9068 3487 6544 -9857 -2197 8276
$$ packed form
136d113Q409j4424M0335j7564m3013K8100L021j3885M3227r048n6868K0800K5424
149A0401j5686K3536J813m6853J1478K6420j5334K0392J1610n1100l731L5892
161H838r213Q758J9371m0986j4781L4457m670K388K3740l6329k3149L8599m561
174B462j1741L9130k0077m9600L6032K4612k9414J6995R859m0644R679K7708j9816
187d815R542J7039m0414l747M2229j2137j7119K1057j1291j7134K1018K067q161
200a866J1981j4872j5095K8464N018k3144J0723N699j9584Q915J4405j0359Q94
213A179L9j3514J1957J3130j5562N97R733j5276R0J8156p560o516Q646r326l580
228g807J5252m576p181R864p496p944J6599j731j4048J2555L057j6401P660J0473
$$ plain form
242 8276 -3053 -2549 3873 -3281 289 4901 -6815 -2296 10760 -1730 -8287 6095 3209 -6859
256 -6859 1174 5198 -131 -834 -3969 -2702 7302 2816 -7028 558 3257 -5830 -975 7189 706
271 706 -4627 -3357 -1843 4097 5065 -3181 -3064 1049 -3300 -608 7978 2570 -5880 -3254 -328 1757
287 1757 5753 2276 -3758 -3208 -2468 618 7377 3677 -6067 -4669 -375 -587 4203 6685 -2382 -8439
303 -8439 -3569 2741 6049 3670 -3625 -5630 -2121 -447 3738 8306 1014 -9764 -6248 4457 7403
318 7403 3494 -1608 -4615 -4187 -1281 4286 8589 2305 -9460 -8334 3421 7839 3391 -617 -3964
333 -3964 -6594 -3198 4918 8242 1892 -7514 -8462 465 7251 5510 918 -3271 -7109 -4259 5409
348 5409 9025 1927 -5959 -6756 -1476 4767 7045 3909 -3113 -8446 -4840 5796 8681 660 -5120
$$ packed form
242H276j1329N04O422p154L570M612j1716M519J3056j2490o557J4382k886j0068
256f859Q033M024n329p03l135J267J0004m486r844P586K699r087M855Q164o483
271G06n333J270J514N940R68q246J17M113m349K692Q586n408q450K626K926K085
287A757L996l477o034N50P40L086O759l700r744J398M294k12M790K482r067o057
303h439M870O310L308k379p295k005L509J674M185M568p292j0778L516J0705K946
318G403l909n102l007M28K906N567M303o284j1765J126J1755M418m448m008l347
333c964k630L396Q116L324o350r406r48Q927O786j741m592m189l838K850R668
348E409L616p098p886p97N280O243K278l136p022n333L606J0636K885q021n780
$$ plain form
363 -5120 -4900 -4088 491 8296 6863 -4109 -9745 -4004 5117 7476 1440 -3521 -4030 -5064 -1918 8664
379 8664 9835 -3716 -10139 -2290 4574 5471 3885 -1055 -5482 -5406 -1582 6033 9533 -878 -10771
394 -10771 -4128 4714 3962 2921 1672 -5152 -7824 -912 6030 6433 -40 -7447 -5450 2546 4903
409 4903 3890 2503 -3856 -7938 -772 7037 5214 -568 -4488 -4705 -815 4077 6651 3504 -5294
424 -5294 -8434 -28 5971 3200 554 -2154 -6508 -4226 3727 6829 3755 -3439 -8422 -1696 6080
439 6080 2457 -10 1948 -4593 -7783 3602 8653 877 -2600 -2730 -3169 2716 5721 68 -1491
454 -1491 -1426 -5354 -323 8157 2269 -5474 -2678 -984 218 5194 3040 -3493 -3720 -3048 -1057 6093
470 6093 4954 -4264 -4568 -593 -687 3319 6465 -172 -5480 -3172 155 3417 4225 -13 -2420 -2507 -2862
$$ packed form
363e120K20Q12M579P805j433j0972n636N741R121K359o036m961n09j034L146J0582
379H664J171j3551o423P849O864Q97j586m940m427P6L824P615L500j0411r893
394a0771O643Q842p52j041j249o824k672O912O942M03o473p407J997P996K357
409D903j013j387o359m082P166P809j823n782l920k17L890M892K574l147q798
424e294l140Q406N999k771k646k708m354K282P953L102l074p194m983O726P776
439F080l623k467J958o541l190J1385N051p776l477j30m39N885L005n653j559
454a491O5l928N031Q480n888p743K796J694J202M976k154o533k27O72J991P150
470F093j139r218l04L975r4M006L146o637n308K308L327L262Q08m238k407q7l55
$$ plain form
487 -2862 2180 6224 197 -4033 -1187 -1028 53 3627 110 -2964 69 -1719 -1908 5441 2451 -6639
503 -6639 -1194 4308 -1080 -86 3411 -2609 -3496 1812 1155 2038 3442 -4040 -4776 3681 2305 -1236
519 -1236 3261 -117 -6246 -304 3330 57 2215 757 -5717 -1500 3715 -628 236 3339 -3024
534 -3024 -4397 2398 2009 -864 1354 338 -2168 -397 1082 1341 1158 -1245 -709 1748 -585 -1375
550 -1375 2124 435 -2058 908 935 -1149 487 -725 -1896 2499 1233 -3676 445 2348 -3394 -916
566 -916 4100 -504 -2280 829 -1001 -147 2886 -1059 -1420 3336 -1087 -3838 3614 2747 -3691 447
582 447 2741 -2637 -770 2267 -1234 14 2228 -2167 -1950 2129 -601 -1591 2447 682 -3094 -793
598 -793 993 105 673 907 -210 -1386 -1668 1180 2919 -250 -1129 787 -1267 -1668 2753 2100 -1396
$$ packed form
487b862N042M044o027m230K846J59J081L574l517l074L033j788j89P349k990r090
503f639N445N502n388R94L497o020q87N308o57Q83J404p482p36Q457j376l541
519a236M497l378o129N942L634l273K158j458o474M217N215m343Q64L103o363
534c024j373O795l89k873K218j016k506J771J479K59j83k403N36K457k333p90
550a375L499j689k493K966K7k084J636j212j171M395j266m909M121J903n742K478
566i16N016m604j776L109j830Q54L033l945l61M756m423k751P452q67o438M138
582D47K294n378J867L037l501J248K214m395K17M079k730r90M038j765l776K301
598g93J786q88N68K34j117j176k82K848J739l169q79J916k054m01M421o53l496
$$ plain form
615 -1396 -396 -856 -1675 2322 1952 -2359 -52 1072 -3123 -284 3969 -708 -2889 704 -208 -410
631 -410 2294 -577 -2397 1338 94 -1695 3117 2104 -4276 -1533 3110 613 285 1820 -1691 -2982
647 -2982 546 1866 1661 1236 -1882 -3543 -420 2041 1955 892 -1299 -2950 -2016 960 3142 1767
663 1767 -1775 -2346 -948 -363 1997 3474 -582 -3559 -742 1237 1109 2128 533 -2450 -1210 559
679 559 882 2623 962 -3892 -2277 2683 1545 -266 763 -1280 -3426 -291 2778 2261 113 -3023
695 -3023 -3296 1011 3051 890 249 -580 -3073 -1846 3030 4034 408 -2567 -2500 -327 1880 2369 1436
712 1436 -1027 -3162 -1835 1783 3257 1110 -1897 -2854 -1131 962 2099 1827 -831 -3589 -1870 2029
728 2029 2432 720 -350 -2016 -2492 669 3507 2015 -1122 -2615 -1593 1043 2532 1504 -88 -1743
$$ packed form
615a396J000m60q19L997l70m311K307J124m195K839M253m677k181L593r12k02
631d10K704k871j820L735j244j789M812j013o380K743M643k497l28J535l511j291
647b982L528J320k05m25l118j661L123K461q6j063k191j651R34K976K182j375
663A767l542n71J398N85K360J477m056k977K817J979j28J019j595k983J240J769
679E59L23J741j661m854J615M960j138j811J029k043k146L135L069n17k148l136
695c023k73M307K040k161o41q29k493J227M876J004l626k975O7K173K207M89r33
712A436k463k135J327L618J474k147l007r57J723K093J137k72k658k758J719L899
728B029M03j712j070j666m76L161K838j492l137j493J022K636J489j028j592j655
$$ plain form
744 -1743 -2647 -430 3289 2890 -1197 -3137 -1592 531 1486 1726 683 -1885 -3263 -779 2831 2935
760 2935 -477 -2825 -1784 165 1402 2225 1461 -1554 -3224 -758 2612 2862 460 -1694 -2254 -717
776 -717 1380 2418 1406 -1276 -3068 -1356 1736 2298 737 -1145 -2379 -1807 926 2629 1354 -1342
792 -1342 -2543 -1171 1140 1969 1395 -43 -2231 -2319 946 3148 1499 -1054 -1858 -1206 480 1886 1804
809 1804 343 -1952 -2702 93 2803 1780 -857 -1917 -1568 -237 1338 1793 492 -1506 -2713 -838
825 -838 2361 2213 -460 -1498 -1189 -587 1084 2158 1091 -1073 -2099 -814 1714 2249 284 -1092
841 -1092 -1300 -971 678 2098 881 -1104 -1715 -1042 497 1688 885 -942 -1568 -1191 259 1797 1050
858 1050 -833 -1259 -599 99 1186 1503 140 -1354 -1323 335 1807 1097 -724 -772 -285 -498 399 1761
$$ packed form
744a743r04K217L719l99m087j940J545K123R55K40j043k568j378K484L610J04
760B935l412k348J041J949J237Q23p64l015j670K466L370K50k402k154n60J537
776g17K097J038j012k682j792J712L092N62j561j882j234N72K733J703j275k696
792a342j201J372K311Q29n74j438k188q8L265K202j649k553q04O52J686J406q2
809A804j461k295p50K795K710j023k637j060L49J331J575M55j301j998j207J875
825h38L199j48k673j038L09O02J671J074j067k164j026J285K528N35j965j376
841a092k08L29J649J420j217j985o11O73J539J191q03j827o26L77J450J538p47
858A050j883m26O60O98J087L17j363j494L1J658J472p10j821m8M87k13Q97J362
$$ plain form
876 1761 486 -1520 -1386 54 1093 783 -377 -765 -401 -602 -149 1317 911 -1142 -1404 91 903
893 903 570 0 -282 -162 -252 -187 948 1081 -524 -1006 272 707 -7 79 276 -296 -569 83 367 13
913 13 -393 -250 -160 -105 43 60 -158 -338 -181 88 205 1 -279 76 399 -119 -177 570 381 -427 -30 743
935 743 123 -522 -24 614 236 -372 -379 82 154 -294 -68 487 -42 -1106 -459 868 472 -590 -329 -121
955 -121 -502 73 856 459 -202 -503 -706 282 1396 431 -763 -99 -88 -595 835 1493 -439 -1140 -47
974 -47 72 102 838 77 -1196 -692 66 415 708 15 -1138 -676 323 424 533 463 -692 -1226 67 1307
994 1307 891 -253 -723 -321 -102 577 1250 619 -934 -1244 -127 1121 1286 -244 -1269 -451 -166 -277
1012 -277 1259 1491 -1440 -2224 281 1014 549 775 -462 -1721 -289 676 719 1511 230 -2291 -870
$$ packed form
876A761j275k006J34J440J039l10j160l88L64k01M53J466m06k053k62J495Q12
893I03l33n70k82J20r0O5J135J33j605m82J278M35p14Q6J97n72k73O52K84l54
913A3m06J43R0N5J48J7k18j80J57K69J17k04k80L55L23n18n8P47j89q08L97P73
935G43o20o45M98O38l78o08pM61P2m48K26N55n29j064O47J327l96j062K61K08
955a21l81N75P83l97o61l01k03R88J114r65j194O64J1n07J430O58j932p01J093
974d7J19L0P36p61j273N04P58L49K93o93j153M62R99J01J09p0j155n34J293J240
994A307m16j144m70M02K19O79O73o31j553l10J117J248J65j530j025Q18K85j11
1012b77J536K32k931p84K505P33m65K26j237j259J432R65M3P92j281k521J421
$$ plain form
1029 -870 1708 910 182 541 -1017 -1684 564 1671 638 -319 -1060 -997 324 959 547 -45 -1204 -1519
1047 -1519 334 1418 492 -552 -961 -791 181 1072 1104 342 -1431 -1682 750 1954 683 -46 -658 -1524
1065 -1524 -297 1550 1444 541 -1038 -2384 -408 1982 847 -267 147 -1491 -2146 1097 2252 -68
1081 -68 -887 -956 -1182 506 1645 214 -384 -491 -1272 142 2071 636 -1077 -514 -244 177 1365 828
1099 828 -713 -978 -758 365 1714 684 -1189 -955 -578 -298 1316 1489 -673 -1715 -1021 94 1345
1116 1345 1086 -315 -831 -1073 -833 1199 2025 6 -1252 -672 -262 730 1501 277 -611 -442 -825 70
1134 70 1887 417 -1593 -419 147 -356 797 917 -997 -1053 41 35 781 833 -1110 -1145 443 297 373
1153 373 1101 -377 -1429 77 667 461 883 -85 -1302 -214 560 354 814 247 -1300 -641 623 276
$$ packed form
1029h70K578p98p28L59j558o67K248J107j033r57p41O3J321O35m12n92j159l15
1047a519J853J084r26j044m09J70R72Q91L2p62j773k51K432J204j271p29o12q66
1065a524J227J847j06r03j579j346J976K390j135j114M14j638o55L243J155k320
1081f8q19o9k26J688J139j431n98j07p81J414J929j435j713N63K70M21J188n37
1099H28j541k65K20J123J349j030j873K34L77K80J614J73k162j042O94J115J251
1116A345k59j401n16k42K40K032Q26k019j258N80M10R92P71j224q88J69l83Q95
1134G0J817j470k010J174N66n03J153J20j914n6J094oP46N2j943l5J588j46P6
1153C73P28j478j052J506N90k06M22r68j217J088P74k06M60n67j547O59J264l47
$$ plain form
1171 276 231 269 -762 -1028 14 478 643 67 -919 -582 513 152 178 744 -283 -813 241 548 346
1190 346 490 -460 -644 617 477 -443 554 387 -1126 -218 1001 17 -362 68 -564 -282 515 -73 -268
1209 -268 289 -614 -750 820 560 -682 21 230 -496 234 685 -75 -29 121 -290 309 660 -158 -143 283
1229 283 -348 -173 587 93 -372 -40 -90 -79 132 -222 -124 241 -373 -436 489 22 -650 120 309 -278 47
1250 47 201 -215 257 179 -253 334 493 -541 -113 684 -159 -369 352 -29 -199 270 -26 -287 229 -236
1270 -236 -510 441 173 -687 -31 287 -391 9 414 -275 -97 221 21 162 311 -371 -68 389 -149 37
1290 37 597 -121 -518 331 233 -81 279 -61 -472 -45 -82 -92 351 -63 -828 -33 454 -137 -84 209 -306 -253
1312 -253 182 80 262 183 -596 -191 758 175 -122 404 -23 -455 214 450 105 0 -429 -476 297 329 -256
$$ packed form
1171B76m5L8j031k66J042M64J65n76r86L37J095l61K6N66j027n30J054L07k02
1190C46J44r50j84J261j40r20R97j67j513R08J219r84l79M30o32K82P97n88j95
1209b68N57r03j36J570k60j242P03K09p26P30M51p60M6J50m11N99L51q18J5M26
1229B83o31J75P60m94m65L32n0J1K11l54R8L65o14o3R25m67o72P70J89n87L25
1250D7J54m16M72p8m32N87J59j034M28P97q43k10P21l81j70M69k96k61N16m65
1270b36k74R51k68q60O56L18o78M00M05o89J78L18k00J41J49o82L03M57n38J86
1290C7N60p18l97Q49r8l14L60l40m11M27l7j0M43m14p65P95M87n91N3K93n15N3
1312b53M35j02J82p9p79M05R49n83k97N26m27m32O69K36l45j05m29m7P73L2n85
$$ plain form
1333 -256 27 80 -638 -171 494 79 -290 -304 -422 0 434 56 -34 68 -419 -98 780 291 -270 8 -75
1354 -75 -180 402 506 -79 -205 -238 -103 540 346 -289 -177 -155 -514 47 568 -136 -588 -305 -107 199 334
1375 334 -71 -145 -2 -315 28 787 242 -586 -246 302 249 363 269 -109 -174 -147 73 589 290 -578 -490 108
1397 108 58 138 294 -189 -520 -207 98 416 288 -410 -506 -17 60 218 410 -59 -476 -137 356 405 239 -51
1419 -51 -284 -134 42 316 412 -40 -665 -236 289 174 71 69 -440 -538 -41 344 344 -47 -607 -408 283 278 111
1442 111 172 -99 -511 -54 500 442 47 -287 -260 166 367 241 140 -61 -435 -229 382 364 -102 -343 -344 -192
1464 -192 185 315 60 -323 -457 -156 205 373 159 -247 -418 -129 222 379 346 -95 -360 -156 325 348 238
1485 238 146 -272 -361 128 465 121 -206 -256 -267 5 178 55 -75 -225 -355 -128 303 237 -279 -370 25 94
$$ packed form
1333b56K83N3p18M67O65m15l69j4j18M22M34l78r0J02m87L21Q78m89n61K78q3
1354g5j05N82J04n85j26l3J35O43j94o35J12K2l59N61N21p04m52K83J98L06J35
1375C34m05p4J43l13L43P59n45q28L40N48n3J14r4l78o5K7K20N16k99q68Q8N98
1397A08n0Q0J56m83l31L13L05L18j28o98r6M89P7J58J92m69m17L39M93M9j66k90
1419e1k33J50J76K74R6m52o25M29N25j15j03kn09r8M97L85%l91n60J99O91nj67
1442A11O1k71m12M57N54n8l95l34K7M26K01j26j01k01l74K06O11j8m66k41jJ52
1464a92L77J30k55l83j34L01L61J68k14m06j71K89L51J57l3m41k65K04M81K3j10
1485B38r2m18q9M89L37l44l27n0j1K72J73j23j30j50j30K27M31o6n16r1L95O9
$$ plain form
1507 94 85 256 125 -290 -296 121 383 374 41 -319 -168 211 194 81 256 -122 -571 -120 299 162 -94 -124 -331
1530 -331 -280 109 144 -2 -12 -199 -339 134 295 -19 -54 68 -139 50 370 154 -174 -2 70 104 97 124 -11
1553 -11 -201 -106 99 69 12 -198 -202 -128 29 71 -32 50 -142 -351 -37 441 24 -181 127 24 -222 158 234
1576 234 16 115 23 -72 240 197 -233 45 276 -100 -186 306 46 -297 18 43 -188 62 81 -298 -58 94
1598 94 -168 -62 164 -156 -101 114 26 -11 92 100 37 88 66 91 96 43 122 66 -21 55 110 -25 -31 69 -122 -136 11
1625 11 -132 -120 122 -74 -190 71 71 -201 51 138 -132 -71 46 22 87 165 -109 18 235 8 -91 249 42
1648 42 -269 91 219 -12 -42 -65 -212 8 99 -51 16 27 -283 -223 159 75 -63 -25 -116 -82 112 163 102 102 -72
1673 -72 -139 201 191 54 101 -16 -171 119 154 83 44 -64 -202 62 89 -6 16 -139 -351 -111 269 66 -68
$$ packed form
1507I4rJ71j31m15oM17K62rl33l60J51L79j7j13J75l78m49M51M19j37k56l0k07
1530c31N1L89L5j46j0j87j40M73J61l14l5J22k07J89L20k16l28J72P2L4pK7j35
1553a1j90R5K05l0n7k10mP4J57M2j03Q2j92k09L14M78m17k05L08j03k46L80P6
1576B34k18R9r2r5L12m3m30K78K31l76q6M92k60l43L15K5k31K50J9l79K40J52
1598I4k62J06K26l20N5K15q8l7J03Qo3N1k2K5Nn3P9n6q7P6N5j35oJ00j91j4J47
1625A1j43J2K42j96j16K61%k72K52Q7k70O1J17k4O5P8k74J27K17k27r9L40k07
1648D2l11L60J28k31l0k3j47K20R1j50O7J1l10O0L82q4j38L8r1L4J94N1o1%j74
1673g2o7L40j0j37M7j17j55K90L5p1l9j08j38K64K7r5K2j55k12K40L80k03j34
$$ plain form
1696 -68 -64 -158 -101 218 198 109 -13 -260 -157 385 309 -64 60 32 -182 47 426 128 -100 -164 -226 132 255 -34
1720 -34 -94 -8 -238 -165 284 194 -175 -331 -153 -17 161 152 28 -93 -213 -19 318 283 55 -127 -30 41 187
1743 187 340 85 -149 -159 -76 236 221 -60 -194 -130 -125 7 276 65 -289 -257 -63 19 191 121 -146 -130 -188 -4
1767 -4 298 253 -214 -165 10 90 163 271 -14 -200 -59 31 205 282 -112 -298 -122 8 29 121 -8 -273 -216 19
1791 19 139 165 -68 -247 -144 40 65 166 166 -177 -160 114 187 193 135 -80 -139 15 80 142 144 -162 -232 -20 37 18
1817 18 78 -51 -297 -101 132 93 63 -148 -286 -74 101 9 121 27 -146 -95 188 214 26 -12 -102 -50 140 87
1841 87 81 127 -148 -122 126 197 16 -93 -107 -134 -21 70 5 -52 -191 -236 7 166 -4 -61 9 -100 -11 131 108
1866 108 29 -58 -41 98 244 61 -38 27 -22 -73 172 119 -74 -88 -54 -97 86 18 -70 -63 -94 -92 9 136 -70 -63 -1
$$ packed form
1696f8Mr4N7L19k0q9j22k47J03N42p6l73J24k8k14K29L79k98k28o4o2L58J23k89
1720c4o0Q6k30P3M49r0l69j56J78J36J78rj24j21j20J94L37l5k28j82R7P1J46
1743A87J53k55k34j0Q3L12j5k81j34O4NJ32K69k11l54L2J94Q2J72p0k67J6n8J84
1767dL02m5m67M9J75Q0P3J08k85j86J41R0J74P7l94j86J76J30K1R2j29k65N7K35
1791A9J20K6k33j79J03J84K5J01%l43J7K74P3On8k15n9J54O5O2Kl06p0K12N7j9
1817A8O0j29k46J96K33l9l0k11j38K12J75r2J12r4j73N1K83K6j88l8r0N2J90n3
1841H7oM6k75K6K48P1j81j09j4k7J13R1o5n7j39m5K43J59j70n7P0j09Q9J42k3
1866A08p9q7J7J39J46j83r9O5m9n1K45n3j93j4L4m3J83o8q8Pl1KJ01J27k06PO2
$$ plain form
1893 -1 -113 -27 76 88 -2 -28 19 70 167 -25 -28 81 44 -19 32 104 -55 -85 -5 -32 -20 -75 -35 0 8 -104 19 36
1921 36 -67 -61 5 6 -21 56 -14 38 46 -21 87 119 13 -63 99 107 -71 19 34 -64 20 22 -42 -71 7 -83 -22 98 -119
1950 -119 -79 -28 31 16 -17 -86 -53 -14 73 4 70 -12 -94 47 90 34 115 90 -16 -67 17 96 58 -41 -75 -61 -42 -63 75
1979 75 -55 -111 -143 2 -6 -19 -42 -108 -62 -32 -2 100 40 -120 -91 93 160 54 83 2 -34 -25 122 205 97 -74 -137
2006 -137 -12 103 59 35 10 -159 -129 -8 101 -1 -135 -118 -78 -26 77 86 -30 -80 -28 53 119 107 -40 -23 30
2031 30 17 115 204 15 -175 19 110 89 71 69 -108 -131 -1 36 94 4 -201 -166 37 16 -56 86 12 -167 -36 178
2057 178 151 -63 -37 -19 31 65 80 63 -25 -115 -21 141 170 35 -210 -40 27 -48 47 93 -80 -218 -59 34 26 80
2083 80 -54 -171 -58 122 90 52 56 -145 -47 124 171 39 149 53 -99 46 222 41 -53 51 -27 -76 89 40
$$ packed form
1893aj12Q6J03J2r0k6M7N1R7j92lJ09l7o3N1P2j59l0Q0k7J2n5M0L5Qj12J23J7
1921C6j03OO6Jk7P7p0N2Qo7J08L2j06p6J62Qj78R0J5r8Q4Ko4k9P8r0O1J20k17
1950a19M0N1N9j5l3o9L3L9Q7o9O6q2q2J41M3n6Q1k5j06n1Q4P9l8r9l4J4J9k1J38
1979G5j30n6l2J45qj3k3o6M6L0L0J02o0j60K9J84O7j06K9q1l6RJ47Q3j08j71o3
2006a37J25J15m4k4k5j69L0J21J09j02j34J7M0N2J03Rj16n0N2Q1O6j2j47J7N3
2031C0j3R8Q9j89j90J94R1k1j8kj77k3J30L7N8r0k05L5K03k1p2J42p4j79J31K14
2057A78k7k14K6J8N0L4J5j7q8r0R4J62K9j35k45J70O7p5R5M6j73j38J59R3qN4
2083H0j34j17J13J80l2l8Mk01R8J71M7j32J10r6j52J45J76j81r4J04p8m9J65m9
$$ plain form
2107 40 -59 -82 -98 -80 31 72 -259 -136 69 -4 -38 184 70 -154 -106 52 204 66 59 -32 -52 78 116 79 102
2132 102 25 -117 -49 134 50 -55 -24 1 -101 -48 91 -16 -92 -9 -58 -76 82 56 -107 -4 103 -21 47 77
2156 77 -14 -13 58 25 -17 135 9 -119 17 81 3 78 -21 -69 -63 21 -49 -32 74 -122 -103 49 -4 -71 -11 69 -33
2183 -33 -69 -13 19 38 11 -3 -1 95 -36 29 54 81 87 -29 22 42 -42 -87 42 2 -99 -33 40 -170 -6 34 -81 -17
2211 -17 -10 -49 -26 18 41 -62 44 51 -1 113 74 1 12 200 -24 3 98 -17 31 131 -9 34 -24 -63 -99 69 -2
2238 -2 -117 5 -50 -88 -20 -47 0 -14 -58 -44 66 -20 -112 39 7 14 21 110 22 86 15 -5 147 128 -9 -11 40 -32 -47
2267 -47 104 20 -80 -46 -89 -91 55 -65 -93 -71 -83 -39 25 -14 -102 31 5 -15 66 81 -72 4 69 11 71 71 -12 -22
2295 -22 -21 -12 -56 81 -17 -104 -30 29 -32 26 -51 -26 36 19 -106 6 52 -66 -25 57 77 26 28 -24 127 11 -41 86
$$ packed form
2107D0r9k3j6J8J11M1l31J23K05p3l4K22j14k24M8J58J52j38pr1k0J30L8l7K3
2132A02p7j42O8J83q4j05L1K5j02N3J39j07p6Q3m9j8J58k6j63J03J07j24O8L0
2156G7r1JP1l3m2J52j26j28J36O4p8P5r9m8OQ4p0J7J06j96J9J52n3o7O0Q0j02
2183c3l6N6L2J9k7j4KR6j31O5K5K7Oj16N1K0q4m5J29m0j01O6P3k10J64M0j15O4
2211a7Pl9K3M4K3j03J06Pn2J14l9p3J1J88k24K7R5j15M8J00j40M3n8l9l6J68p1
2238bj15J22n5l8O8k7M7j4m4J4J10q6r2J51l2PPQ9q8O4p1k0J52j9j37kN1p2j5
2267d7J51q4j00L4m3kJ46j20k8K2j2M4O4l9q8J33k6k0Q1J5j53P6O5n8O0%q3j0
2295b2JRm4J37r8q7P4N9o1N8p7K5O2j7j25J12M6j18M1Q2K0n1Kn2J51j16n2J27
$$ plain form
2323 86 97 -85 -71 79 86 -27 -33 -44 -29 8 -53 -24 33 -91 -69 18 -10 -126 40 -56 -93 -4 69 25 -21 -5 -38 37
2351 37 73 24 11 17 -74 45 146 -16 -78 24 -4 -10 -33 6 31 -38 -135 -73 111 15 -153 -50 33 -31 -41 -22 6 -25
2379 -25 -53 -11 130 65 -84 12 71 10 13 88 37 11 29 55 58 11 -82 -94 35 19 38 10 -65 -108 -44 31 5 -22 3 -26
2409 -26 -21 31 -6 50 -7 -62 38 142 7 -18 37 -42 -74 35 142 39 -32 -73 30 63 32 -12 -28 -87 -122 35 102
2436 102 22 -46 -120 -105 13 58 30 21 -13 -100 60 162 67 -42 -2 -48 15 98 146 -4 -48 -36 35 68 28 11 -97
2463 -97 -81 -72 27 88 -130 -130 -77 52 -8 37 -36 -61 -101 4 79 98 89 -22 -154 -44 119 72 102 -3 -58 -89 104
2490 104 140 -2 -15 -53 -7 33 73 45 -90 -35 -148 -72 94 57 -88 -79 -60 -3 50 98 53 -74 3 17 84 104 36
2517 36 -25 -51 74 71 83 41 -18 -101 -29 7 104 1 -96 -159 -89 81 36 -45 12 -36 -75 3 82 87 -49 -19 -71 -24 -4
$$ packed form
2323H6J1j82J4J50Pj13oj1J5L7o1K9N7j24K2Q7k8j16J66r6l7Q9P3m4m6J6l3P5
2351C7L6m9j3Or1J19J01j62o2J02k8ok3L9K5o9r7O2J84r6j68J03Q3o4j0J9K8l1
2379b5k8M2J41o5j49R6N9o1LP5n1k6J8K6Lm7r3j2J29j6J9k8p5m3O4P5k6k7K5k9
2409b6NN2l7N6n7n5J00J04j35k5N5p9l2J09J07j03p1m1J03L3l1m4j6n9l5J57O7
2436A02q0o8p4J5J18M5k8rl4q7J60J02r5j09M0m6O3Q3M8j50m4J2P1L3m0j7j08
2463i7J6RR9O1k18%N3J29o0M5p3k5m0J05P5J9rj11j32J10J63m7L0j05n5l1J93
2490A04L6j42j3l8M6M0M0k8j35N5j13P6J66l7j45RJ9N7N3M8m5j27P7J4O7K0o8
2517C6o1k6J25lJ2m2n9q3P2L6R7j03r7o3P0J70m5q1N7m8l9P8P9Nj36L0n2M7K0
$$ plain form
2546 -4 20 -63 12 90 -20 10 47 -39 11 -19 41 27 -40 -26 -75 -25 21 42 -12 70 -67 -86 -23 31 45 -17 -50 14 -25 6
2576 6 54 -1 49 -51 -15 64 90 -1 24 22 -8 23 7 22 -1 -28 -82 -32 -10 13 -36 -1 -36 -6 37 -66 -20 -21 3 -30 -4
2607 -4 110 34 -18 101 41 55 -6 -35 87 44 24 -48 45 69 0 -39 13 -49 -84 -24 41 -20 -96 -97 26 -51 31 -9 -72
2636 -72 -64 -66 -9 84 113 8 -8 23 28 87 78 42 19 -37 37 49 -18 38 -47 -94 -28 18 24 3 -45 -57 24 -20 -79 -36 -2 -68
2668 -68 -60 74 90 -50 3 -21 -3 60 40 64 -8 17 -47 -17 144 66 -55 -47 -11 -59 24 84 -32 -48 -76 -22 51 1 -54
2697 -54 -102 -92 52 24 19 9 -7 -79 41 76 80 -12 -6 -17 36 160 53 -45 -54 35 -63 54 75 92 -98 -101 -48 38 42 -36
2727 -36 -122 -83 -84 -20 56 65 -63 -153 -23 73 105 45 1 -43 -7 106 98 101 24 -84 -45 81 132 93 -99 -89 -127 8 81
2756 81 68 -25 -111 -125 -43 82 106 -52 -116 -74 22 98 33 89 -37 -57 -17 80 140 65 -45 -115 27 76 27 19 -1 -76
$$ packed form
2546dK4q3P5P8j10L0L7q6N0l0O0j4o7J4m9N0M6K1n4Q2j37j9O3N4J4o2l3O4l9L1
2576FM8n5N0j00L6P9K6r1K5kl0L1j6J5k3k7n4N0K2K3m9L5l5L0M3j03M6jK4l3K6
2607dJ14p6n2J19o0J4o1k9J22m3k0p2R3K4o9l9N2o2l5O0O5o1p6jJ23p7Q2m0o3
2636g2QkN7R3K9j05j6L1NN9rl6k3n6P4J2o7N6q5m7O6M6Ok1m8j2Q1m4n9M3L4o6
2668f8QJ34J6j40N3k4J8O3k0K4p2K5o4L0J61p8j21QL6m8Q3O0j16j6k8N4P3n0n5
2697e4m8J0J44k8nj0j6p2J20L5Mr2Oj1N3J24j07r8rQ9r8J17K1J7j90lN3Q6Mp8
2727c6q6L9jO4P6Rj28r0J30R6L2o0m4m4L6J13qLp7j08L9J26N1l9j92J0l8J35P3
2756H1j3r3q6j4Q2J25K4j58o4M2R6P6o5N6j26k0M0R7O0p5j10p0J42M9m9qk0p5
$$ plain form
2784 -76 -84 22 53 79 -65 -175 6 39 20 34 -39 -59 -96 14 51 63 -18 -87 -132 23 112 16 12 -75 -3 58 53 134 41
2813 41 -89 -114 29 98 58 -44 -38 -15 -9 -8 32 39 -30 -178 -15 110 144 -39 -48 -21 12 -3 64 80 -3 -67 -35 69 101
2842 101 30 -26 -42 -46 1 16 22 -53 -83 -107 0 42 13 -32 -21 -79 -35 71 -5 40 -24 -65 7 41 71 26 -25 -38 8 14
2872 14 61 18 10 30 -28 31 45 17 -41 -76 -33 17 -39 2 81 -49 -72 0 63 25 -11 -66 31 51 45 -2 4 64 43 44 17 39
2904 39 -28 -32 -54 16 10 -7 5 26 -23 -17 22 62 20 -96 -57 -21 18 -72 -76 -98 -41 -47 -36 49 49 -11 -46 0 47 58 -39 25 24
2937 24 -26 -9 68 21 26 24 -46 -54 -1 31 -46 1 -4 -47 -17 38 20 44 -44 -50 26 -6 -44 3 -1 -32 23 25 41 14 17 -27 20 1
2971 1 -46 4 -38 45 -18 -25 -24 52 -28 4 -50 20 -6 -55 -49 -15 -53 -45 -24 -34 21 10 -17 77 41 32 16 28 2 33 31 62 52 44
3005 44 -5 -6 18 35 -50 -46 15 -26 -13 -3 -4 18 -14 -40 -13 -23 -34 -15 -18 11 -24 8 21 121 17 -28 12 34 78 37 -29
$$ packed form
2784g6qJ06L1K6j44j10J81L3j9J4p3k0l7J10L7J2q1o9m5J55Q9r6mq7P2O1nQ1r3
2813D1j30k5J43O9m0j02OK3OJM0Po9j48J63J25L4j83rK7L3j5O7J6q3o4L2J04L2
2842A01p1n6j6mM7J5Op5l0k4J07M2k9m5J1n8M4J06p6M5o4m1P2L4L0m5n1j3M6O
2872A4M7m3qK0n8N9J4k8n8l5M3N0n6M1P9j30k3P2O3l8l6n5R7K0om7OO0k1Jk7K2
2904C9o7mk2P0oj7J2K1m9OL9M0m2j16L9L6L9r0mk2N7oJ1Q5%o0l5M6M7J1r7O4j
2937B4n0J7P7m7Nkp0qN3L2p7M7nm3L0N5j8K4q8oP6l2l8M7ml1N5KJ6k7Lm4M7j9
2971Am7N0m2Q3o3pJP6q0L2n4P0k6m9OL4l8QK1j0N5j1k7R4l6rj6J2k6L1kL1j0q
3005D4m9jK4J7q5MO1m1J3J0jK2l2k6K7j0j1J9lK9l5L2J3J00j04m5M0K2M4m1o6
$$ plain form
3036 -29 46 -23 -30 14 37 114 -33 0 20 42 -7 1 9 -32 -60 -12 36 21 23 -9 -77 -18 53 27 -32 -41 0 -60 45 69 -20 -8
3068 -8 -11 -22 35 29 -4 -55 -11 23 -26 -3 -13 -4 -48 -32 -14 40 -57 -47 -2 14 21 4 -24 47 -24 -8 91 55 25 40 13 12 -4
3101 -4 -8 6 26 39 -21 -44 59 -9 17 -101 -57 20 -3 27 -25 -31 -50 -15 -17 104 1 -7 -4 21 24 33 28 26 52 -10 42 59 19
3134 19 -33 -67 -16 27 -8 -89 -55 62 -12 -46 -46 53 -16 -9 -47 -16 -25 12 -23 -16 5 -37 -23 40 28 1 -46 -9 35 20 -8 -37
3166 -37 54 71 -2 -20 90 -52 -19 -14 17 -4 -16 -67 -50 -14 2 -16 3 2 -39 -31 6 59 -25 -6 -39 -5 9 27 -1 16 -14
3197 -14 -9 4 79 30 18 -72 32 7 15 10 1 52 -11 -67 14 78 -7 -96 -53 9 -1 -56 -12 -8 -15 -10 -14 30 -37 -45 2 -20 27 38
3231 38 -4 -5 -18 8 -23 8 42 -24 -42 5 37 24 -50 -78 -1 8 2 12 21 24 -1 -16 -29 64 6 -7 0 79 0 -27 -15 38 27
3264 27 -35 -13 51 73 -34 -20 -19 -11 21 -68 41 14 -18 -36 -32 48 -63 -42 -35 17 -9 -35 -9 48 61 -10 3 38 22 -33 3
$$ packed form
3036b9P5o9pM4K3P7j47L3K0K2m9QQm1k8M8M8j5Kl2o8N9P1k6n9rM1o0J05K4q9J2
3068hlj1N7ol3n1M4L4m9K3j0Rm4J6J8N4r7J0M5J6Pj7k8P1p1J6R9l6l0J5k7jj6
3101dmJ4K0J3o0k3J03o8K6j18M4P7k3L0n2oj9L5kJ21j03qLK5LRnkK6o2N2J7m0
3134A9n2l4N1M3l5q1L4J17p4l4%R9o9Pl8L1rL7l5PK1m2J4O3j2k7m7L7M4j5k8k9
3166c7R1J7p3j8J10j42L3NL1k1j2n1J7L6J6j8J9jm1QL7N3q4J9l3L4J4J8k8J7l0
3197a4NJ3P5m9j2r0J04k5QnrN1o3n6Q1O4q5q9M3O2j0n5M4MpNmM4o7qM7k2M7J1
3231C8m2jj3K6l1L1L4o6j8M7L2j3p4k8P7RoJ0RLk5j5j3R3n8j3PP9p9k7J2N3j1
3264B7o2K2O4K2j07J4JQL2q9J09k7l2j8MQ0j11K1PN2k6k6K6N7J3p1J3L5j6n5L6
$$ plain form
3295 3 56 73 8 -5 46 28 3 -31 -20 37 33 -60 -71 32 17 8 -8 18 27 -19 -5 22 -18 -62 -37 38 32 0 -9 28 1 16 -8
3328 -8 -1 16 -40 7 16 -4 43 -26 -39 38 35 -13 47 31 -13 -55 -67 -8 10 -44 0 23 36 -3 -8 1 39 -45 -50 31 34 26 -53 -69 -9
3363 -9 29 16 -14 37 -2 -24 -41 54 50 -14 -129 1 47 31 -20 -16 28 49 -57 13 51 61 23 -67 41 56 -16 -21 41 4
3393 4 -62 -36 41 19 -54 -73 10 -17 -31 -15 -22 5 -69 -42 31 26 36 -104 -64 27 7 -17 -49 -11 1 -22 1 35 33 30 -17 44
3425 44 82 51 -23 -20 -7 18 0 -31 35 57 -55 -49 27 18 7 -25 -1 1 -6 -9 -43 13 -97 -66 56 46 -10 -53 4 27 59 -61
3457 -61 -14 69 13 17 -1 55 55 -32 -47 24 53 0 -19 -38 72 -21 19 13 67 -26 -45 -14 -7 14 33 0 36 -11 -46 -4 37 54
3489 54 -64 -62 -18 107 43 -73 14 -19 3 -52 -12 -3 1 -56 -39 46 32 -57 -21 41 27 -48 -24 35 1 -28 -26 117 73 8
3519 8 18 15 -20 23 1 50 7 -75 -65 -10 52 7 -75 -124 -9 -4 -62 -33 23 -28 4 -24 21 34 -44 -42 9 14 -17 40 -4 43
$$ packed form
3295CN3J7o5j3N1j8k5l4J1N7mr3j1J03j5rj6K6Rm6J4K7m0m4K5P5ol2rL7k7J5k4
3328hPJ7n6M7Rk0M7o9j3P7lm8O0j6m4m2j2N9J8n4M4K3J3l9nRL8q4nQ1Lqp9j6O0
3363iL8j3l0N1l9k2j7R5mo4j15J30M6j6n1MM4K1j06P0L8J0l8r0J08J5p2nO2l7
3393Do6K6P7k2p3j9Q3k7j4J6pK7p4K7P3nJ0j40M0R1k0k4l2L8J2k3K3L4klm7O1
3425D4L8l1p4LJ3K5j8l1O6K2j12OP6rj1l2K4Kpll4N6j10L1J22j0n6m3N7K3L2j20
3457f1M7Q3n6Mj8N6%q7j5P1K9n3j9j9J10r3M0oN4r3j9L1PK1J9l3L6m7l5M2M1J7
3489E4j18KM4J25o4j16Q7l3K2n5M0RMn7J7Q5j4q9L6O2j4p5K4N9l4k9KJ43m4o5
3519HJ0ll5M3k2M9m3q2J0N5O2m5q2m9J15Nn8K9N6n1L2k8M5J3p8KN1Nl1N7m4M7
$$ plain form
3551 43 2 -12 24 0 46 -26 -63 53 98 80 -14 26 6 -47 -48 26 22 1 -34 -15 15 11 -9 27 -19 38 -48 -22 62 2 -79
3582 -79 44 56 37 -6 -19 73 15 8 -45 34 -25 -21 -30 63 76 75 0 -32 24 -49 4 0 49 -3 45 25 -12 13 -17 -54 34 -18
3614 -18 54 26 -20 31 18 -35 44 59 29 -66 -63 -18 -17 -83 -1 63 -43 -74 -6 28 2 -17 -44 -12 13 5 4 43 -14 13 -19 29
3646 29 48 -46 -13 44 49 54 -29 14 49 19 -44 23 -35 19 -21 -23 1 45 -10 -40 22 1 -69 -66 25 49 32 -13 11 66 -12 -33
3678 -33 -37 66 25 -25 4 92 51 -33 1 -1 20 -20 -17 39 -8 33 -66 -27 36 7 -26 26 9 31 -52 -54 50 18 -56 -44 -26
3709 -26 -5 -19 -18 -10 -13 -36 -9 29 27 -8 -46 94 60 -59 -57 -40 10 53 -40 -33 1 4 -30 16 11 23 -39 -21 26 60 39 27 -48
3742 -48 31 47 -18 15 1 36 -55 7 39 26 1 -46 43 33 1 -15 35 -55 -122 -5 4 51 -30 6 -12 2 -9 25 -32 22
3772 22 -9 3 -9 84 45 -64 4 27 4 42 -6 -13 -9 -35 32 18 -17 -38 -66 -17 7 6 -12 -7 10 34 -59 30 32 -41 -34 -34 86
$$ packed form
3551D3m1j4L6k4M6p2l7J16M5j8r4M0k0n3jP4mk1l5J9L0mk0L6m6N7q6K6Q4o0q1
3582g9J23J2j9m3j3R2n8pn3P9n9MrR3J3jp5l2N6p3N3mM9n2M8k0l7K5l0l7Q8n2
3614a8P2k8m6N1j3n3P9J5l0r5LM5Jo6Q2O4j06l1O8L4k6j9k7L2K5qjL9n7K7l2M8
3646B9J9r4L3N7NNq3M3L5l0o3O7n8N4m0kK4M4n5l0O2k1p0LR1K4j7m5K4N5p8k1
3678c3mJ03m1n0K9Q8m1q4L4kK1m0LN6m7M1r9L9O3k9l3N2j7K2q3kJ04l2p4J2J8
3709b6K1j4JQlk3K7L8kl5l8J40l4j19KJ7N0M3r3PL4Ll4M6nJ2o2J8M7L4k1j2p5
3742d8P9J6o5L3j4L5r1O2L2j3k5m7Q9j0l2j6N0r0o7J17RM7q1L6j8J4j1L4n7N4
3772B2l1J2j2R3l9j09O8K3k3L8m8pMk6O7j4l5k1k8M9K4jj8NJ7K4r3Q9Kp3P%J20
$$ plain form
3805 86 64 24 11 73 0 -1 20 28 57 -57 -63 -18 30 6 -41 -30 4 -1 -8 47 1 -2 -29 -33 48 50 9 6 -52 -1 -24 40 36 -34 4
3840 4 -14 39 5 -43 -64 -57 40 33 -16 -23 15 4 -41 38 13 -5 31 -47 3 22 63 26 -12 62 6 24 17 22 -9 3 6 29 51 -34
3874 -34 -4 2 -27 -11 -16 39 39 -52 -60 -3 68 11 -36 -9 -6 -44 6 5 3 -16 -72 -20 52 -4 -13 11 87 8 10 25 35 60 18 -34 19
3909 19 31 22 -53 -3 -2 -7 -53 5 59 -61 -49 -35 50 19 -24 -34 -39 12 -32 -29 48 -7 -62 -114 24 91 -13 -6 -25 11 34 7
3941 7 -73 66 31 -48 8 27 24 -49 -19 24 -9 38 72 41 -7 -48 -27 3 7 -67 -26 7 13 6 -22 -11 -8 72 34 10 39 39 -61
3974 -61 -13 -34 42 22 -82 0 59 46 -32 15 80 -74 -39 6 23 8 -73 -49 32 11 -31 3 30 -35 -11 8 98 6 -19
4003 -19 -23 38 6 18 -18 35 -20 25 -2 14 66 -37 -44 43 -14 -28 -16 32 -12 -11 -2 -45 -11 35 -27 -41 17 56 -28 -49 -27 34
4035 34 47 -6 -19 73 39 -8 59 61 4 -25 -9 21 46 -37 52 13 -62 -74 3 -9 -13 -24 -37 8 11 -25 -44 28 42 19 -28 44
$$ packed form
3805H6k2m0j3O2p3jK1QK9j14oM5M8k4m7J1L4npN5m6lk7mQ1Km1ln8N1k3O4mp0L8
3840Dj8N3l4m8k1PR7pm9pL8j1m5P9k5j8L6p8N0J9M1l7l8P4n6J8pNl1J2LK3K2q5
3874c4L0Ok9J6nN5%r1qN7P1n7m7K7Ll8N0jkj9n6N2P2n6rK4P6p9KJ5J0K5m2n2N3
3909A9J2rp5N0Jnm6N8N4j20J2J4Q5l1m3j0nN1m4LP7n5n5n2J38O7j04Pj9L6K3k7
3941Gq0J39l5p9N6J9lp3L0M3l3M7L4l1m8m1K1L0Mp4M1L3Opk8J1LQ0l8k4K9%j00
3974f1M8k1P6k0j04Q2N9j3p8M7O5j54L5M5J7j5q1K4Q1k1m2L4K7o5K4J9R0r2k5
4003a9mO1l2J2l6N3n5M5k7J6N2j03pQ7n7j4J2M8m4JRm3L4M6o2j4N8L9q4k1K2O1
4035C4J3n3j3R2l4m7O7Kn7k9J6L0K5q3Q9l9p5j2P7j2mj1j3M5Ll6j9P2J4k3m7P2
$$ plain form
4067 44 46 -25 57 -11 37 73 3 -3 49 27 -39 -2 38 25 15 -46 21 -53 4 0 -35 59 -10 -13 -44 7 64 -37 28 27 -25 19
4099 19 -45 23 -25 -22 -53 16 78 -8 6 -19 -61 -93 -23 -24 28 -3 -3 -33 31 81 36 -21 8 -1 19 2 64 39 -48 -39 -1 62 -43
4132 -43 -2 -14 46 20 7 38 -32 -19 -89 31 37 7 -27 -6 31 -48 -24 44 4 -42 -62 13 1 -3 55 9 21 15 19 54 -16 0
4164 0 0 17 51 36 67 -55 -60 -20 -6 32 -13 -28 0 -19 -31 5 49 -30 -33 -75 -2 19 47 27 -57 33 17 -24 63 2 -72 45
4196 45 77 -12 -7 8 49 -36 -35 19 51 17 1 -7 3 34 9 10 21 -57 3 2 102 -39 -12 3 -48 52 9 58 -49 3 14
4227 14 -4 -2 -8 -6 -22 -28 20 29 19 -54 -38 74 19 -37 18 23 43 -77 10 108 43 10 -35 3 45 48 30 -3 -8 -5 -22 51 17 -55
4261 -55 -10 60 -35 -33 22 -20 -4 -32 -58 -49 5 17 -49 -36 -37 -3 -10 37 -28 56 35 -4 4 -59 -13 -43 1 10 30 -1 44 -1 4 16
4295 16 -3 -13 4 -8 -1 3 -6 45 -40 -45 48 33 -54 36 16 -41 -50 3 7 -19 -47 -43 29 11 -41 36 57 -5 -12 59 -7 0 -10 43 -1
$$ packed form
4067D4Kp1Q2o8M8L6p0oN2k2o6L7M0j3j0o1O7p4N7ml5R4o9ll1N1N7j01O5jn2M4
4099A9o4O8m8Ll1O9O2q6J4k5m2l2P0jN2l1%l0O4N0m5n7K9rK0j7O2k5q7RL8O3j05
4132d3M1j2O0k6j3L1p0J3p0J20Ol0l4K1L7p9K4O8m0m6k0P5j2mN8m6J2oML5p0J6
4164@%J7L4j5L1j22nM0J4L8m5j5K8j9j2L6M4p9lm2P3K1K8k0q4R0j6m1Q7o1p4J17
4196D5L2q9NJ5M1q5JN4L2l4j6qJ0L1k5JJ1p8O0jJ00j41K7J5n1J00m3M9j07N2J1
4227A4j8KoKj6oM8Rj0p3J6J12n5n6N5NK0j20Q7R8o5l3m5L8M2Lj8l3nLj7P3l4p2
4261e5M5P0r5KN5m2J6k8k6RN4J2o6J3jL4pM7o5Q4k1l9Qo3M6l0M4RK0l1M5m5NJ2
4295A6j9j0J7j2PMrN1q5nR3j5q7R0k0n7rN3Mk6k8MP2j8n2P7K1o2pP1o6Pj0N3m4
$$ plain form
4330 -1 64 -12 -3 3 29 -22 56 35 -1 -2 -62 -46 -57 -10 -15 24 21 -61 33 9 -49 -28 -2 28 -8 6 -12 -41 12 36 30 -5 -35 -10
4364 -10 32 -45 -3 25 3 -41 17 96 66 5 -22 42 0 35 -17 15 -8 -35 -27 60 53 -33 -27 -15 77 118 -19 19 -51 -62 18
4395 18 87 67 6 -56 -52 61 28 -36 -33 -65 -67 -52 85 123 31 -40 -48 -65 23 115 50 -70 -94 0 33 54 24 -13 -102 -14 51
4426 51 17 64 -2 -135 -7 65 11 80 -14 -70 -91 23 115 121 -58 -127 -29 28 35 48 88 -87 -133 -67 111 90 12 -85
4454 -85 -62 -52 59 145 81 -142 -131 -45 127 131 31 -44 -127 -67 80 176 46 -97 -141 -18 111 84 10 -47 -176 -64
4480 -64 42 110 60 -116 -212 1 74 67 95 -34 -100 -214 11 150 164 -130 -118 -36 119 63 114 -17 -174 -128 31
4505 31 132 37 -23 -111 -91 1 113 142 6 -149 -141 7 191 85 -23 -27 -95 -45 64 189 -24 -226 -85 -8 28
4530 28 147 73 -82 -128 -104 102 144 31 -69 -110 -23 15 92 43 -29 -173 -131 121 174 -21 -45 -72 -38 7 124 141
$$ packed form
4330aO5p6ROK6n1P8k1l6jo0J6j1M7nL9lq2R4k4n8K1K6L0l6J4j8k9N3K4ol5l0K5
4364a0M2p7M2K8k2m4N8P9l0o1k7O4m2L5n2L2k3k7QQ7pq6OJ2R2M1j37L8p0j1Q0
4395A8O9k0o1o2MJ13l3o4Ll2kJ5J37L8r2p1qj7Q8R2o5j20k4R4L3K1l0l7q9Q8O5
4426E1l4M7o6j33J28P2n4O9r4n6k1J14R2Oj79o9R8N7PJ3M0j75m6O6J78k1p8r7
4454h5K3J0J11Q6o4k23J1Q6J72Mj00p5q3O0J47R6j30j43m4J23J29k7p4n7j29J12
4480f4J06O8n0j76r6K13P3pK8j29o6j14K25J39J4k94J2Q2J55n6N1j31j57M6J59
4505C1J01r5o0q8K0R2J12K9j36j55QJ48J84j06j08mo8N0J09J25k13k02J41P7L6
4530B8J19p4j55m6K4K06M2j13j00m1Q7L8P7m9p2j44M2K52N3j95k4k7L4M5J17J7
$$ plain form
4556 141 -79 -142 -127 90 135 72 -44 -47 -48 -72 127 188 -29 -223 -50 53 81 96 -4 -108 -120 27 78 134 -27
4581 -27 -153 -99 96 62 57 35 -58 -202 -74 119 130 5 -58 -47 3 16 110 107 -38 -129 -77 79 151 15 -133 -87
4607 -87 -37 7 53 78 -58 -172 -42 21 98 11 -9 -97 -56 47 53 84 -4 -126 -45 6 68 64 5 -58 -114 3 114 92
4635 92 -60 -110 2 43 31 60 60 -55 -41 -1 69 98 -24 -12 2 -41 13 4 52 -58 -98 1 52 35 -13 -39 -11 -29 -2
4664 -2 -1 3 -8 -111 9 38 17 -46 -37 22 -63 -47 38 15 -18 -5 56 62 19 13 71 44 -36 -33 67 42 6 -12 50 -3 -46 -39 30
4697 30 13 -3 -37 4 59 -18 81 18 -53 -126 -25 28 -13 -27 5 9 -41 14 0 25 15 -79 -43 36 14 -7 -37 14 -75 -75 91
4728 91 101 -42 -8 10 -3 -26 92 37 -67 -72 -17 59 55 21 -46 -26 -6 -45 80 94 -48 -77 13 18 57 -34 45 -20 -86
4757 -86 2 108 47 -54 -70 0 40 12 83 40 21 -115 30 143 76 26 -90 -9 95 26 53 44 -39 -93 -77 82 100
$$ packed form
4556A41k20o3J5K17M5o3j16ljk4J99O1k17j94J73J03K8J5j00j04j2J47N1N6j61
4581b7j26N4J95l4nk2r3j44J28J93J1j25o3J1N0J3R4lj45r1N2J56P2j36j48M6
4607h7N0M4M6K5j36j14J30O3P7q7k0q8M1J03OL1q8j22Q1N1O2mn9o3n6J17J11k2
4635I2j52n0J12M1j2K9%j15J4M0P0K9j22J2J4m3N4rM8j10m0R9N1j7m8k6K8j8K7
4664bJMj1j03J20K9k1o3RN9q5J6Q5k3l3J3O1Om3oN8k7q0LJ00k5l6j8O2n3m3PO9
4697C0j7j6l4M1N5p7R9o3p1p3J01N3m1j4L2Mn0N5j4K5j0r4L6P9k2k1l0N1q9%J66
4728I1J0j43L4J8j3k3J18n5j04nN5P6ml4o7K0K0l9J25J4j42k9R0NL9r1P9o5o6
4757h6Q8J06o1j01j6P0M0k8P1m3j9j36J45J13o7n0j16Q1J04o9K7rq3n4J6J59J8
$$ plain form
4784 100 -11 -49 -2 26 -67 64 49 -68 -141 -15 115 102 -23 -13 -73 26 21 74 37 -60 -125 -30 84 24 12 9 0 -67
4812 -67 -28 135 87 -114 -154 -3 59 50 28 -13 -21 -43 -11 114 82 -84 -117 -8 17 16 44 24 -126 -113 2 113 58
4839 58 5 -81 -13 32 17 85 94 -99 -99 57 107 82 -50 -41 -84 -15 16 117 24 -103 -115 26 87 12 -51 4 -106 -73
4867 -73 40 117 -14 -90 -93 27 52 -89 11 20 -102 -78 82 94 44 -64 -38 88 1 9 92 66 -63 -93 -10 137
4893 137 10 -82 3 -7 -5 7 60 -16 -77 -97 31 32 32 -25 -51 -42 -26 68 76 -10 -79 -43 65 32 -11 -16 38 -48 -32 62 90
4924 90 43 -93 38 25 24 14 58 26 -60 -67 86 89 -50 -88 32 137 -48 101 37 -54 -51 -9 88 36 -56 -107 17 -13
4952 -13 -15 79 21 -40 -125 -16 72 -31 -113 5 -16 -31 -33 76 17 -12 -58 51 74 27 -4 27 2 -51 12 117 51 -7
4980 -7 -38 72 70 40 -68 39 35 -86 59 55 32 -83 17 91 45 -19 9 25 -15 -61 -23 6 -27 -78 0 28 -11 -22 32
$$ packed form
4784A00j11l8M7K8r3J31j5j17p3J26J30j3j25J0o0R9nN3l7r7o5R5J14o0j2lro7
4812f7L9J63m8k01m0J51O2rk2m1qk2L2J25l2j66l3J09K5jK8k0j50J3J15J11n5
4839E8n3q6O8M5j5O8Rj93%J56N0k5j32Rm3O9L1J01r3j27j2J41O1p5o3N5j10L3
4867g3J13P7j31p6lJ20K5j41J00Rj22K4J60J2n0j08K6J26q7QQ3k6j29l0Q3J47
4893A37j27r2Q5j0KJ2N3p6o1k0J28J%n7k6RJ6R4Qq6o9L6J08l3m3nN4q6J6R4K8
4924I0m7j36J31j3jj0M4l2q6pJ53Lj39l8J20J05j85J49o4r1LM2R7n2r2n1J24l0
4952a3kR4n8o1q5J09Q8j03q2J18k1j5kJ09n9k9m6J09K3m7l1L1k5n3O3J05o6n8
4980gl1J10kl0j08J07mj21J45mk3j15J00P4m6o4K8J6m0m6L8K9l3n1P8K8l9j1N4
$$ plain form
5009 32 -5 -18 -8 52 20 -31 -9 16 96 -14 -53 21 52 -29 2 36 36 -27 -61 46 59 -41 -12 44 -23 -55 55 56 -72
5038 -72 46 34 -11 -4 10 -58 -35 26 -17 50 65 19 -86 -43 37 18 -9 13 37 -81 11 69 76 15 -102 -10 49 6 -41
5067 -41 13 54 -96 -41 62 55 -36 -82 48 58 -32 -47 53 18 -143 -37 84 48 -27 -119 6 19 22 59 7 39 -76
5094 -76 17 114 33 -48 -23 5 -15 22 47 11 -41 -33 -5 88 43 -63 -27 1 -36 19 51 -7 -76 -94 72 93 -13 -32 -11
5123 -11 -25 -15 46 83 8 -94 -140 39 95 -14 -58 -33 -73 -101 51 178 24 -169 -29 46 30 89 52 -57 -119 -80
5149 -80 59 100 50 -75 -83 66 5 45 119 40 -115 -43 116 99 21 -96 -114 -21 41 61 109 -13 -162 -47 109 138
5175 138 27 -82 -83 -72 -9 118 136 -55 -212 -96 103 88 70 14 -54 -89 -2 153 166 -33 -202 -54 77 117
5199 117 28 45 -115 -160 -91 145 204 -29 -145 -112 -59 -12 73 53 -80 -209 -145 105 186 -45 -90 -147 -68 94 152
$$ packed form
5009C2l7j3J0O0l2n1K2K5Q0j10l9P4L1q1L1L4%o3l4J07J3j00K9N6o7l2J10Jj28
5038g2J18j2m5PJ4o8K3O1m3O7J5m6j05M3Q0j9k7K2K4j18R2N8Po1j17R2N9m3m7
5067d1N4M1j50N5J03pr1m6J30J0r0j5J00l5j61J06J21l6p5r2J25J3LL7n2L2j15
5094g6R3R7q1q1K5K8k0L7K5l6n2QK8R3m5j06L6K8l7N5L2n8o9j8J66K1j06j9K1
5123a1j4J0O1L7p5j02m6J79N6j09m4K5m0k8J52J27j54j93J40P5j6N9l7j09o2L9
5149h0J39M1n0j25qJ49o1M0P4p9j55P2J59j7p8j17j8R3O2K0M8j22j49J15J56K9
5175A38j11j09jJ1O3J27J8j91j57J16J99j5j8n6o8l5Q7J55J3j99j69J48J31M0
5199A17q9J7j60m5O9K36N9k33j16L3N3M7Q5k0j33j29O4K50Q1k31m5n7P9J62N8
$$ plain form
5224 152 91 -64 -270 -90 118 138 48 -22 -81 -137 18 221 168 -75 -119 -52 9 117 107 50 -113 -137 -35 184
5248 184 100 -42 -195 -5 -11 57 89 19 -138 -185 14 156 105 -32 -81 -77 36 23 146 139 -91 -194 -2 131 148
5273 148 -13 -65 -71 -48 97 149 31 -50 -93 -27 16 26 16 4 -132 -138 9 110 72 -68 -97 -53 28 24 21 39 -116 -158
5301 -158 -13 143 48 -22 -36 -46 37 38 76 -26 -59 -114 14 101 44 -19 -53 37 -5 -19 62 104 -84 -120 51 41 -5
5328 -5 -38 -21 -52 -63 -41 88 127 -43 -122 48 40 30 24 21 -15 -38 12 108 38 -52 -80 -16 -10 -21 -9 41 -35 -23 64 64 34 -2
5360 -2 -46 33 28 -91 30 47 -49 -3 32 -2 -27 -54 26 24 3 -40 -7 41 -23 -74 40 12 -56 -21 17 53 -105 -50 41 63
5390 63 -21 -5 53 -4 -67 9 64 8 -51 -5 -12 -55 25 41 90 -31 -110 36 68 74 -68 -42 -35 -29 -72 46 13 -61 -66 -30 71
5421 71 12 -58 43 -48 -78 -42 158 79 -42 -104 -52 1 48 -25 60 -69 -151 -2 144 106 -81 -83 -26 7 -21 78 33
$$ packed form
5224A52o1j55k06J80K08K0r0p0n9n6J55K03n3k43m4O7O1J08j0n7j63k4J02K19
5248A84q4j42j53J90oO8L2p0j57m7J99J42n1j37m9MJ13j3J23pk30j03J92J33J7
5273A48j61n2oK3J45N2j18q1m3O6M3J0j0j2j36oJ47J01l8j40k9M4Q1mlJ8j55m2
5301a58J45J56r5p0j4j0Q3JL8j02l3n5J28Q7n7o3l4R0m2j4Q1M2j88l6J71j0m6
5328el3J7l1j1K2J29L9j70p9J70qj0oll6k3N0R6p0r0k8O4Oj1J2N0p6J2Q7%l0l6
5360bm4P9nj19J21J7r6M6L5l4k5k7Q0kk1m3L3M8o4n1J14k8o8L5L8L6j58N5R1K2
5390F3q4J6N8n7o3P6N5n6n9M6pm3Q0J6M9j21p9J46L2Oj42K6POm3J18l3p4nL6J01
5421G1n9p0J01r1l0L6K00p9j21o2N2N3M7p3Q5j29q2J49J46l8j87kN7L3k8R9m5
$$ plain form
5448 33 -98 -96 48 79 61 -26 -23 -87 -45 -21 167 92 -33 -178 -25 61 15 -84 -44 -37 -155 3 122 78 -87 -124 -30
5475 -30 92 47 70 58 -71 -102 32 183 88 -100 -112 -68 49 51 32 1 -115 -139 42 187 48 -37 -58 -40 -71 51
5501 51 163 55 -134 -202 15 140 49 -37 -6 -75 -59 24 183 70 -97 -185 -59 80 44 54 -7 -112 -145 42
5525 42 165 83 -96 -71 0 73 61 106 27 -170 -111 46 104 64 -30 -59 -19 -8 20 140 -49 -111 -78 93 94 104 -39
5552 -39 -40 -53 -52 59 121 12 -139 -126 24 86 11 12 -52 -98 -89 126 59 15 -104 -45 39 39 17 18 21 -76 -88 76 112 -25
5582 -25 -98 -21 10 19 52 61 -84 -115 -55 48 87 30 -43 -44 -19 4 0 88 -43 -164 19 58 20 3 -37 -2 -92 -53 25 88
5612 88 13 -101 -37 24 11 -41 42 -8 -35 20 31 63 -34 -61 -50 6 21 37 28 -73 2 14 59 61 -70 -72 -10 47 18 46
5642 46 44 -13 -87 -29 42 -31 -33 25 43 -3 -26 -13 7 -23 -22 58 14 -5 -40 -29 -43 47 -82 32 17 -66 10 -22 71 -18 24
$$ packed form
5448C3j31KJ44L1j8q7Lo4M2K4J88p5j25j45J53Q6m6r9M0Pj18J58J19m4j65l7R4
5475c0J22m5K3j2j29l1J34J51r5j88j2M4J17Kj9l1j16k4J81J45j39q5k1J8l1J22
5501E1J12j08j89o8K17J25r1q6L1o9J6Q3J59j13j67q8J26J39l6J0o1j05l3J87
5525D2J23q2j79K5P1P3j2M5p9j97N9J57N8m0r4k9M0J1K8J20j89o2L3J71JJ0j43
5552c9jj3JJ11O2j09j51J3J50O2p5Jo4m6RK15o7m4j19N9Q4%k2JLr7j2J64L6j37
5582b5p3P7L1RL3Rj45l1O0J03L9n7p3jK5K3mQ8j31j21J83L9l8j7m0L5r0L9P8O3
5612H8p5j14O4O1j3n2Q3n0k7N5J1L2r7k7J1N6J5J6rj01P5J2M5Kj31kO2N7k9K8
5642D6kn7p4N8P1p3kN8J8m6k3J3K0l0JQ0m4j9l5J1j4R0j29J14j5q3P6l2R3q9M2
$$ plain form
5673 24 44 2 -89 -52 54 11 -46 2 -43 -16 -22 -24 39 25 -56 11 8 7 -75 -22 37 -3 -62 36 44 4 -21 -20 -42 -8 -71 -19 77
5706 77 -31 -51 -17 32 -13 1 99 34 -30 -34 -20 14 -59 4 17 -38 10 -17 -4 62 -10 -34 77 68 -77 -83 47 62 -29 2
5736 2 45 -29 -78 40 68 -4 22 9 -32 -55 -39 -27 62 59 -76 22 58 -33 -28 19 14 -53 15 47 45 -33 1 31 -1 -57 -14 48
5768 48 22 -13 -16 38 15 -39 25 23 11 -118 5 48 -86 -43 27 101 10 6 -31 13 15 2 -10 63 -74 -86 36 76 10 -51
5798 -51 -2 43 -21 -24 41 5 -101 8 52 21 -1 -15 -6 25 -9 -55 68 -39 -122 -32 36 11 -40 -1 -18 -66 -41 47 17
5827 17 -21 -82 -74 57 -7 -40 -32 -9 -47 -74 31 72 -3 -49 -46 -20 -32 -46 5 23 -84 3 106 53 -52 -131 21 34 -35
5856 -35 37 4 -36 -105 -4 32 94 -46 82 8 -1 1 11 60 -2 -128 4 114 13 -63 -7 10 -32 7 66 58 -51 -81
5884 -81 20 105 -2 -21 -16 -53 19 1 96 27 -74 -77 23 -3 7 -7 8 -40 -44 4 85 23 -100 -7 51 3 -43 60 24
$$ packed form
5673B4K0m2r1L7J06m3n7M8m5K7okO3j4q1O7ljq2N3N9m0n9R8Qm0k5Jk2L4o3N2R6
5706G7j08k0L4M9m5J4R8o5o4mJ4L4p3O3J3n5M8k7J3O6p2k4J11rj45oJ30J5r1L1
5736BM3p4m9J18K8p2K6j3m1k3J6J2Q9lj35R8L6r1NM7no7O8L2kp8L4L0l2n6M3O2
5768D8k6l5lN4k3n4O4kj2j29J23M3j34M3P0P4r1ml7M4Kj3j2P3j37j2J22M0o6o1
5798e1M9M5o4lO5l6j06J09M4l1k2j4RL1l4m6J23j07q3R0O8k5n1L9j7m8K5Q8l0
5827A7l8o1QJ31o4l3QK3l8k7J05M1p5m6LK6j2j4N1J8j07Q7J03n3j05p9J52J3o9
5856c5P2l3m0o9J01L6O2j40J28p4rKJ0M9o2j26J32J10j01p6N6J7m2L9N9qj09l0
5884h1J01Q5j07j9Nl7P2j8R5o9j01lJ00k6J0j4J5m8mM8Q1o2j23R3N8m8m6J03l6
$$ plain form
5913 24 -56 -46 8 96 -32 -81 -37 0 -11 28 98 40 -66 -100 77 75 68 -46 -8 25 -10 73 91 27 -37 -44 45 35 -62 -22
5943 -22 -6 -68 -81 112 63 -22 -9 -38 -16 -20 -18 20 -50 -106 -62 46 81 -50 -71 -44 31 13 67 66 -40 -43 -47 43 55 13 -48
5974 -48 -46 23 -53 100 28 23 -108 -24 18 60 68 -7 -29 3 -37 34 45 28 -50 -65 49 -20 19 2 -2 -33 -62 57 82 6
6004 6 -74 -31 48 55 76 16 -34 -52 -27 57 33 2 -58 14 -1 -20 -33 31 -5 -58 -18 0 37 -62 -31 -22 -72 -78 21 -20 -5 -50
6036 -50 22 -1 28 4 -7 19 5 -82 -16 80 -45 -2 15 8 -39 11 48 20 -32 -38 29 27 15 -81 3 32 -14 -35 13 6 -12 -2
6068 -2 28 -49 -23 -7 1 54 -49 -57 -48 43 -56 -53 22 -2 -76 -13 38 -5 -107 -18 -27 -2 -22 28 -15 -22 -12 64 87 33 -67 -70 -68
6101 -68 -10 30 47 55 -59 -69 37 7 -18 -17 5 -66 -35 1 35 5 -64 -45 -37 42 54 -10 15 -8 -5 11 156 -34 -74 -64
6131 -64 34 49 -5 -41 -45 -46 -81 93 77 -15 -51 -64 -10 50 37 62 -40 -65 -44 93 89 3 -19 -34 -63 -13 147 25 -24
$$ packed form
5913B4q0J0N4Q8j28m9M4L7j1L9P0n8j06l4J77kpj14L8L3l5Q3J8o4o4pQ9j0r7M0
5943b2J6o2j3J93m9q5J3k9K2mKL8p0n6M4J08L5j31k1K7P5j8N4jj06lmR0J2m2o1
5974d8KO9p6J53p2nj31Q4M2M2Qp5k2L2m0P1J1j7p8j5J14o9L9j7ml1k9J19K5p6
6004Fq0M3P9PK1o0n0j8K5Q4k4l1o0P2j5j9j3O4l6n3M0J8L7r9L1Rn0oR9m1J5m5
6036e0P2k3K9k4j1K6j4q7O6R6j25M3J7pm7N0L7k8n2oO7kj2r6Q4K9m6k1M8pj8J0
6068bL0p7K6J6QN3j03qRR1r9LP5k4p4O3N1m3j02Q9rK5k0N0m3pJ0P6K3n4j00lK
6101f8N8M0J7Qj14j0J06l0k5JK2p1L1L6L4l0o9J9QP9J2o4K5k3LJ6J45j90m0J0
6131f4R8J5n4l6mjl5J74j6r2l6j3N4O0j3K5j02k5K1J37mq6k2j5k9N0J60j22m9
$$ plain form
6160 -24 -164 -46 83 72 16 -17 16 -29 56 66 62 -66 -133 -40 74 57 4 -4 -75 -38 26 127 60 -103 -55 7 66 15
6188 15 39 28 -49 -69 -5 86 86 -27 -82 -75 34 11 80 -27 -79 -129 -1 73 58 -20 -50 9 -38 68 48 62 -37 -102 -24
6217 -24 111 56 18 -35 -46 -4 34 109 46 -98 -89 23 71 50 26 -64 -63 -48 73 132 48 -56 -74 23 2 50 95 62 -41
6246 -41 -80 27 117 22 27 18 14 22 69 36 -9 -84 -69 7 54 77 -42 -20 -36 7 -1 105 -18 -113 -16 -17 38 47 0 -41 -34 -40 -11
6279 -11 47 58 -35 -24 -34 22 -19 0 -15 -103 -50 29 21 -12 -15 -2 17 -81 8 -5 -9 -48 -59 -10 38 4 3 -26 -43 21 46 60
6311 60 1 -43 -48 -10 2 9 -39 2 -7 33 -3 97 4 -27 -1 12 -57 -28 -15 -63 14 -36 28 21 -1 -51 -23 8 56 15 8 57
6343 57 -24 -69 -21 50 -11 -35 -2 -13 29 55 42 -27 -23 -6 -13 85 -3 26 6 -28 -22 -19 -3 17 -63 -27 17 38 -44 -13 75 -15
6375 -15 -19 -45 17 -46 24 41 5 -2 -32 40 53 31 35 -3 -19 -12 -38 2 -22 -36 -37 0 66 62 59 5 -25 -58 6 69 41 -55 -100 32
$$ packed form
6160b4j40J18J29j1n6l3L3m5Q5J0mj28o7R3J14j7n3qp1L7O4J01o7j63M8O2N9n1
6188A5K4j1p7k0O4R1%j13n5PJ09k3O9j07n2n0J28P4j5p8l0N9m7J06k0J4r9o5P8
6217b4J35n5l8n3j1M2L8P5o3j44RJ12M8k1k4r0JJ5J21N9q4j04j8R7k1M8M5l3j03
6246d1l9J07R0r5NrmQM7l3m5p5J5P6M7K3j19K2j6M3qJ06j23r5R7jN5Rm7m1PoK9
6279a1N8J1r3J1j0N6m1J9j5q8N3P9ql3lJ3J9r8Q9j3ml9j1M9M8l4jk9j7O4K5J4
6311F0n9m4nL8J2Pm8M1rM0l6J00r3l1K6J3o9K9J3m8P7n0O4pk2n0K8L1M8m1pM9
6343E7q1m5M8P1o1k4L3j1M2K6j3o9MJ7pR8q8K9k0l4OLJ6K0q0L6M4K1q2L1Q8r0
6375a5mk6O2o3P0J7l6pl0P2J3k2Ml8j6Pk6M0k4j4jL7O6mln4l0l3O4O3k8r6m5J32
$$ plain form
6409 32 16 25 25 87 48 -63 -43 20 18 -60 -6 19 2 -44 1 58 15 -59 -86 8 46 -2 -2 -73 5 31 51 28 -55 -28 27 36
6441 36 -14 -5 10 -36 -27 16 36 33 -52 4 -23 36 -13 -1 1 -12 -76 -33 78 20 -16 55 -21 43 -46 7 -4 -44 -12 11 79 33
6473 33 2 9 -23 -4 -25 42 29 -45 -65 21 61 49 3 2 -13 -24 22 68 18 -55 -53 70 58 44 -55 -53 -3 -59 6 39 -5 -67
6505 -67 5 -19 18 -50 -15 -8 7 -34 -21 1 1 2 -40 45 21 21 43 53 21 -27 25 53 56 2 -35 -9 16 45 23 66 -41 -4
6537 -4 4 -17 -5 3 -15 -44 13 48 78 58 -29 -1 16 22 9 15 28 42 -14 59 11 -22 39 9 -22 -24 -11 16 11 -82 9 46 10 21
6571 21 -73 41 -6 -10 20 6 53 -23 -8 19 -40 -19 28 -2 -1 -46 17 12 3 -60 33 46 32 -22 46 -35 -12 -20 12 26 32 26 -22
6604 -22 -28 25 30 5 24 -22 -28 17 -21 -51 28 -19 16 -25 3 -18 -17 -6 33 -18 -48 -11 58 -14 6 -1 -37 14 2 23 49 13 -34
6637 -34 -64 17 11 -12 -19 27 -10 -29 20 12 56 -14 14 -1 -26 17 -22 16 18 -50 16 48 38 -49 23 -40 -34 -32 -14 6 -5 -7 6 41
$$ packed form
6409C2j6R%O2l9j11K0O3kp8N4K5j7m6M5N7m3p4k7R4L8m8%p1P8K6K0k3q3K7N5R
6441C6n0RJ5m6RM3K0lq5N6k7N9m9J2Kj3o4M3J11n8l6P1p6O4q9N3j1m0L2K3O8m6
6473C3l1Pl2J9k1O7j3p4k0Q6M0j2m6jj5j1M6M6n0p3KJ23j2j4r9KN0n6O5L3m4o2
6505f7P2k4L7o8L5PJ5m1J3K2%Jm2Q5k4%K2J0l2m8N2K8Ln4l7K6K5K9k2M3j07L7
6537dQk1J2Qj8k9N7L5L0k0q7K8J7Oj3OJ3J4n6P3m8l3O1l0l1kJ3K7nr3R1L7l6J1
6571B1r4J14m7mL0j4M7p6J5K7n9K1M7l0Jm5O3nro3R3J3j4n4O8q1K3qL2J4Oom8
6604b2oN3Nk5J9m6oM5l8l0P9m7L5m1K8k1JJ1L9n1l0L7O9p2K0pl6N1j2K1K6l6m7
6637c4l0Q1ok3pM6l7j9M9qM4p0K8j5k5M3l9L8Ko8O6L2j0q7P2o3OKJ8K0j1kJ3L5
$$ plain form
6671 41 45 -33 -63 7 4 -27 -10 52 8 -87 -5 19 11 22 -30 57 6 27 8 -30 29 15 -16 9 -6 -33 29 15 -85 -4 72
6702 72 37 -30 -2 8 24 28 -34 -42 -28 -50 52 -27 16 -36 -57 -61 1 -8 22 31 -27 -44 -46 76 31 -10 25 -17 26 -6 12 46
6734 46 -3 -7 42 72 12 -4 -20 -5 -8 -27 24 11 -61 0 18 36 -3 51 -1 8 -7 -35 58 11 -11 -13 9 0 -31 15 52 -14 -58
6767 -58 15 76 -23 7 -11 35 -49 -100 13 23 26 10 26 -19 -4 37 43 -45 33 -49 16 87 34 -33 40 -48 -10 49 51 4 -61
6798 -61 -13 37 61 48 -60 -28 -11 19 8 17 -19 -26 -12 -19 26 -16 25 33 -67 -81 32 78 30 -51 -28 -15 15 22 46 -27 -38
6829 -38 -55 8 24 8 -13 29 -33 -6 -1 25 -13 -63 -98 -13 7 -2 -15 11 -9 -19 92 52 16 -51 -39 -49 8 3 51 -1 -102
6860 -102 -71 26 87 72 -63 -80 59 0 13 45 -16 -30 -75 50 98 -42 -33 -96 13 -19 71 40 -18 -20 -74 32 29 1
6888 1 17 -3 -66 -61 35 44 -40 48 8 25 71 41 19 -13 -55 -15 23 56 -6 -54 57 -16 13 47 47 -30 2 -51 8 59 34 -37
$$ packed form
6671D1Mp8l0P0ll1J7O2m4r5Q2K4qJ1n2Q7n1K1j9l8N9j4l1K5j5k7O2j4j00Q1P6
6702G2l5o7K8J0J6Mo2qJ4k2J02p9M3n2k1mO2rL0Rn8j7kJ22m5m1L5m2M3l2J8L4
6734D6m9mM9L0o0j6j6J5lj9N1j3p2O1J8J8l9N4n2Rj5k8R3m7k2kK2rl1M6L7o6m4
6767e8P3O1r9L0j8M6q4n1J13J0Lj6J6m5J5M1Oq8P8q2O5P1n3o7P3q8L8N9Km7o5
6798f1M8N0K4j3j08L2J7L0j1Rl6pJ4pM5m2M1Qj00j4J13M6m8q1K3J3L0PK4p3j1
6829c8j7O3J6j6k1M2o2K7NK6l8n0l5Q5K0rj3K6k0j0J11m0l6o7J2j0N7nM8n2j01
6860a02L1R7O1j5j35j7J39n9J3L2o1j4m5J25M8j40Ro3J09l2R0l1n8kn4J06lk8
6888AJ6k0o3NR6Rq4Q8m0J7M6l0k2l2m2M0L8L3o2m8J11p3K9L4%p7L2n3N9N1k5p1
$$ plain form
6920 -37 -19 -7 29 62 7 -18 4 -24 15 59 4 56 -102 2 -27 55 48 -22 -91 -6 -8 3 -24 48 11 12 27 -6 39 -45 -37
6951 -37 -47 14 40 38 29 -89 -53 47 43 4 -6 -55 -4 30 9 34 21 -4 -29 2 52 3 -2 -64 -12 -8 53 0 -31 -53 -96 -13
6983 -13 37 20 -4 -82 -50 -32 28 61 -25 -40 -76 -5 29 -15 -18 12 -19 -12 -21 16 -24 -5 -8 -19 27 -15 22 -7 -10 -38 52 -21 3
7016 3 -15 3 -1 34 39 23 -9 9 17 37 -17 -14 -10 -17 7 16 11 -1 21 -24 25 36 -28 18 -2 40 32 11 88 58 30 -62 -68 2 30 -51
7052 -51 -49 -33 -6 -12 44 22 -51 -68 37 14 25 -35 40 -22 -32 34 -35 -9 -8 -52 2 2 -33 -2 19 -24 -30 -7 20 53 12 53
7084 53 -20 17 19 20 -26 50 12 -11 49 31 -49 -118 6 -9 -8 -21 -52 1 -11 85 59 32 -11 -48 30 2 26 20 -31 25 -41 5
7116 5 40 20 -29 -34 -3 28 1 29 3 -94 10 -8 62 88 -80 44 9 -28 58 41 10 -72 -60 -3 13 19 -29 -5 -32 -20
7146 -20 13 25 -59 -55 1 9 -40 33 31 -30 -25 -29 42 53 -4 -41 9 35 17 1 60 11 -47 -51 9 69 15 14 -41 -45 50 50 27 28 -15
$$ packed form
6920c7J8J2L6L3n5k5K2k8L9M4n5N2j58J04k9Q2pp0o9Q5kJ1k7P2l7JJ5l3M5q4Q
6951c7j0O1K6krj18L6J00ml9j0m9N1L4k1K5j3k5k5L1N0m9no2N2MO1n3l1k2m3Q3
6983a3N0j7k4p8L2J8O0L3q6j5l6P1L4m4lL0l1PrL7m0J9lj1M6m2L7k9lk8R0p3K4
7016Cj8J8mL5Nj6l2J8QK0n4LMpK4Rnj2K2m5M9J1o4M6k0M2qk1P7l0k8r2oP0K8q1
7052e1KJ6K7oN6k2p3j7J05k3J1o0P5o2j0O6o9K6Jm4N4%l5L1K1m3oK3K7L3m1M1
7084E3p3L7KJm6P6l8k3O0j8q0o9J24j5Jj3l1N3j2R6k6k7m3l7P8k8K4on1N6o6M6
7116EL5k0m9nL1L1k7K8k6r7J04j8P0K6j68J24l5l7Q6j7l1q2J2N7J6Om8K4k7J2
7146b0L3J2q4MN6Qm9P3ko1NmP1J1n7l7N0K6j8j6N9m9n8mO0O0n4jn5mR5%k3Jm3
$$ plain form
7181 -15 -64 65 41 -5 -11 -6 -53 -24 34 12 -40 -41 -19 11 6 44 57 -11 -30 37 20 41 -66 -84 -53 -2 19 -32 -25 46 -13 20
7213 20 82 15 -18 -3 23 -2 10 13 31 -15 -32 -13 21 24 45 -10 -11 2 -16 7 7 -60 -47 -28 0 65 12 22 -83 -27 -26 55
7245 55 24 -10 57 -19 24 25 -16 4 -28 -35 -41 -2 3 2 -39 19 15 26 13 80 -66 -25 43 68 54 -32 -29 -40 2 53 69 5 35
7278 35 -47 -16 40 32 -27 -58 -30 -33 -16 -25 56 -32 -31 -13 0 13 26 20 11 -36 22 52 22 9 -18 14 4 -13 5 32 28 5 31 34
7312 34 21 10 2 58 12 34 9 43 17 9 50 23 26 -15 -26 -72 -15 8 6 2 -12 -38 -5 22 35 31 -2 -42 -10 20 -25 -16 -25 8
7346 8 14 -23 53 79 -50 0 -39 2 41 27 -26 -9 0 27 2 8 77 -14 3 -5 -14 21 -28 -4 11 -27 -19 14 31 -40 34 31 7 -31
7380 -31 -59 -11 19 -7 15 6 -26 28 -37 -25 31 4 -46 -18 24 -15 6 -7 -25 25 16 38 3 -59 15 -18 3 45 26 -48 20
7411 20 21 36 3 -12 -39 -27 -7 -55 -12 30 32 5 -36 41 -11 19 13 -25 35 11 29 22 -42 -8 -5 2 12 35 -76 -11 56 5 18
$$ packed form
7181a5m9J29k4m6oNm7K9N8k2n2jK2L0nL8J3o8j9O7j7K1j07j8L1N1K1n1PP1n9L3
7213B0O2o7l3J5K6k5J2LJ8m6j7J9L4LK1n5jJ3j8K3%o7J3J9K8O5n3J0j05N6JQ1
7245E5l1l4O7p6M3Jm1K0l2poL9Njm1N8mJ1j3O7j46M1O8K5j4q6Lj1M2N1J6o4L0
7278C5q2L1N6qn9l1K8lJ7rQ1q8JJ8J3J3J3orm7N8L0l0j3k7L2j0j7J8K7mk3K6L
7312C4j3j1qN6m6K2k5L4k6qM1k7Lm1j1m6N7K3kmj4k6L3K7J3ml3m0L2L0m5RrL3
7346HOl7P6K6j29N0l9M1L9j4n3J7RK7k5OO9r1J7qrL5m9K4J5l8QL3J7p1P4lk4l8
7380c1k8M8L0k6K2rl2N4o5J2N6k7n0K8M2l9K1j3j8N0rK2l5o2P4l3K1M2j9p4O8
7411B0JJ5l3j5k7J2K0m8M3M2Kk7m1P7n2L0ol8O0k4J8po4L4LPJ0K3j11O5O7n1J3
$$ plain form
7444 18 -16 -50 -10 -4 27 29 12 59 2 6 -16 0 15 -1 31 -33 20 22 32 21 6 25 4 -1 -31 26 61 -51 1 -6 19 40 -14
7477 -14 -10 -14 43 23 36 30 -19 -5 -6 -18 31 14 13 -49 -41 22 15 -22 -31 -39 8 -12 49 18 10 -56 31 62 32 8 -6 2 -20 -16 41 59
7513 59 7 8 3 -21 20 46 63 -45 -14 42 36 47 25 -34 -47 -21 38 58 60 -24 -55 12 -26 17 43 -27 23 -29 27 37 45 -20
7545 -20 33 -35 -9 9 48 29 -41 -23 15 88 45 -46 -8 -2 21 48 105 -8 -57 0 65 53 42 58 -66 -61 7 64 6 -28
7575 -28 -2 -6 -22 30 27 28 -13 -49 -12 36 70 21 -22 -28 4 6 59 70 -2 -52 -59 2 39 15 -33 11 30 11 54 74 -16 -29 -36 8
7609 8 1 -10 34 -5 -24 1 5 66 -1 9 -71 -57 74 -4 24 -33 -19 23 10 104 67 -2 -20 -9 -20 45 5 -21 -29 -37 45 81
7641 81 44 -20 5 11 -21 43 20 -66 -52 -33 26 -1 -14 -17 -69 -30 -17 53 11 -21 -17 -24 -35 -33 39 -3 47 -25 13 3 49 19 -31
7674 -31 -7 -20 -2 81 23 -27 -1 -34 -38 -44 15 60 -67 26 27 -9 -20 -3 -6 -14 29 13 -29 41 65 -55 -10 27 -22 -27 17 9 -23
$$ packed form
7444A8l4l4M0OL1Kj7M7n7Mk2J6J5j6L2o4N3KJ0j1j5J9k1nl0N7L5j12N2pK5K1n4
7477a4MmN7k0J3om9J4jj2M9j7jo2QO3pl7rqM7k0O1l1qo6Q7L1l0k4j4Qk2MN7J8
7513E9n2Jnk4M1K6J7j08L1N6oJ1k2n9j3K6N9K0Kq4l1O7l8M3K6p0N0n2N6J0Qo5
7545b0N3o8K6J8L9j9p0J8L8P3m3r1L8OK3K7N7j13m9N7O5j2j1J6j24NO8N7n8l4
7575b8K6mj6N2lJm1l6L7M8L4m9m3oL2KN3J1p2n0pO1L7k4m8M4J9j9M3K0r0j3pM4
7609Hpj1M4l9j9K5MO1o7J0q0J4J31p8K8n7J4M2j3R4l7o9j8J1j1O5m0k6qqQ2L6
7641H1l7o4K5Ol2O4k3q6J4J9N9k7j3ln2L9J3P0m2l2Mpj1KP2m2N0p2L8j0M6l0n0
7674c1K4j3J8Q3n8n0K6l3moN9M5j27R3Jl6j1J7lqM3j6m2P0K4j20M5L7m9nM4ql2
$$ plain form
7707 -23 -9 59 -40 -31 -1 18 41 30 24 -37 -20 33 14 30 -31 -2 24 -50 44 67 3 -86 36 9 7 22 -3 9 -3 -37 7
7738 7 21 19 -52 -23 -29 44 -26 47 44 -43 33 9 -10 -6 -6 -45 -52 21 74 39 5 13 8 22 17 -7 -56 -28 0 -18 -42 42 1 -52 57
7773 57 -23 31 25 -35 19 -27 59 -11 -2 -22 -5 65 11 11 -8 0 -23 48 10 11 4 -70 6 -28 8 34 -26 -20 31 -55 9 41 -43 56
7807 56 42 50 27 10 -24 -23 -8 -81 15 10 37 14 -2 -15 -6 -22 -19 -58 -3 14 63 4 -21 3 -14 52 0 -26 33 -6 -31 -13 42
7840 42 29 -28 -43 -13 4 44 22 17 -29 -1 29 52 -1 -35 0 28 9 -9 43 -36 -55 -25 -51 26 37 21 19 -12 -23 61 45
7871 45 42 -22 -57 -54 13 28 39 -43 -64 -39 16 38 87 -2 -47 2 -40 14 40 67 -66 14 27 3 9 -40 18 -16 -19 25 9 2
7903 2 -17 -68 17 42 69 -14 -24 -36 -44 -3 21 19 -56 -24 -15 -39 40 55 15 -35 3 -2 -8 18 -16 -29 -25 31 38 13 -9 -50 0 -3 22
7938 22 77 14 58 -44 -43 47 5 -27 -2 -35 25 69 17 17 -13 0 -28 31 13 -12 -34 -16 40 -58 32 39 -17 -7 0 68 34 13
$$ packed form
7707b3J4O8r9RL0J9K3j1oo1J7N3j9J6o1K9K6p4R4K3o4q9J22k7kJ5k5J2j2l4M4
7738GJ4kp1K9oP3p0P3lq7P6k4j9M%l9pP3N3l5l4QnJ4nk4m9K8K8j8k4Q4m1n3J09
7773E7q0N4oo0N4m6Q6p0Rk0J7P0n4%j9Qk3P1l8Jpp4P6l4L6K6o0ON1q6O4L2q4R9
7807E6j4Qk3j7l4JJ5p3R6nK7k3j6j3Rj6Ll9N5J7M9n9k5K4j7O6n2k6N9l9k5J8N5
7840D2j3n7j5L0J7M0k2nm6K8L0K3n3l4L5K8j9j8N2p9j9L0k6P7J1j6kl1j1Q4j6
7871D5lo4l5LO7J5J1q2k1K5N5K2M9q9m5M9m2N4K6K7j33Q0J3k4Om9N8l4lM4j6p
7903Bj9n1Q5K5K7q3j0j2qM1K4kp5L2Rk4P9J5m0n0L8noK6l4j3MN6Pk5k2m1N0lK5
7938B2N5o3M4j02JR0m2l2K5l3O0M4n2%l0J3k8N9j8k5k2J8N6r8R0Pn6J0PO8l4k1
$$ plain form
7970 13 53 -5 -34 9 3 29 -1 -40 -10 15 22 35 12 -11 -16 32 41 25 -8 -49 -21 -22 0 -4 23 19 -21 -12 -59 -55 29 5 -11 -6 3 30
8006 30 10 -5 -29 -39 -8 29 0 14 -19 29 -41 -12 -9 -33 22 54 18 -27 -64 6 5 29 19 14 7 14 21 37 -6 4 13 7 31 5
8040 5 9 -24 24 23 20 -34 -33 -37 0 63 32 -18 -17 4 -37 43 -21 11 -1 12 5 -3 13 62 21 8 4 -23 -29 1 19 -28 9 -11 11 21
8076 21 13 -30 -22 -26 -1 -19 -38 20 21 -1 0 -16 -17 30 40 75 -28 2 24 -12 36 -7 -31 -36 52 -46 8 11 54 -11 42 -24 4 20
8110 20 -34 16 58 8 -18 -28 9 27 -14 -6 22 48 32 -3 -53 3 4 -9 -13 13 74 43 23 21 -9 17 26 -6 -6 23 17 34 -6 26
8144 26 -6 -50 9 -25 14 25 -32 -27 18 26 -49 -31 21 14 8 -20 -42 -12 -48 -19 36 4 15 -3 4 55 3 26 34 23 34 24 -1
8177 -1 -8 -3 -1 60 70 -4 -17 26 8 34 27 -10 0 23
$$ packed form
7970A3M0n8k9M3oK6l0l9L0K5PJ3k3k3nM8Rj6l3m1K8jK2mK7mm0Rm7MQ4k4j6NRK7
8006C0k0j5k4j0L1L7k9J4l3M8p0K9Lk4N5L2l6m5l7P0jK4j0npPPJ6m3J0RoK4k6
8040EMl3M8jln4JmL7O3l1n0JK1m1Q0o4L2j2J3pqJ6M9m1j3mk7oL0J8m7L7k0K2J0
8076B1qm3QmK5j8j9N8Jk2Jj6jM7J0L5j03L0K2l6M8m3k4nQ8r8N4LM3o5N3o6K8J6
8110B0n4N0M2n0k6j0L7J8m1QK8K6j6l5n0N6Jj3mK6O1l1k0kl0K6Rl2%K9oJ7m0L2
8144B6l2m4N9l4L9J1n7NM5Qp5J8N2pok8k2L0l6K9N5l2J1j8PN1n2K3Qj1J1j0k5
8177apNKO1J0p4j3M3j8K6pl7J0K3
8191B3
$$ Imaginary data points
##PAGE= N=2
##DATA TABLE= (X++(I..I)), XYDATA
$$ plain form
0 0 0 0 0 0 0 0 0 0 0 0 0 0 -8 8 -8 8 -8 9 -16 16 -24 24 -32 32 -40 48 -56 64 -72 88 -96 112 -128 144 -161
35 -161 184 -203 227 -256 283 -315 353 -391 433 -478 527 -582 643 -708 780 -858 945 -1042
53 -1042 1150 -1271 1407 -1563 1741 -1950 2196 -2493 2856 -3314 3918 -4743 5948 -7876 11454
68 11454 -20301 87436 80280 -110616 8568 -7096 -77763 44087 96410 -38985 -35102 -14071
80 -14071 -43468 37497 83391 -22766 -31056 -1568 -40466 4958 62558 -12267 -27611 8547
92 8547 -25957 3847 63538 -15436 -51213 14035 278 -4886 56143 6855 -58286 -12465 5623
105 5623 5363 48404 6621 -52316 -13253 -4117 -425 71864 28790 -74240 -23337 14742 -29831
118 -29831 35805 67345 -47621 -52400 20745 -9653 12937 67571 -23369 -63609 20872 4203
$$ packed form
0@%%%%%%%%%%%%qJ6j6J6j6J7k5L2m0M8n6O4p2Q8j04J20j36J60j84K08k40K72l05
35a61L45l87M30m83N39n98O68p44Q24r11J005j109J225j351J488j638J803j987
53a042K192k421K678k970L304l691M146m689N349o170P232q661J0691j3824J9330
68A1454l1755J07737p156j90896J19184j5664p0667J21850N2323j35395L883K1031
80a4071k9397Q0965M5894j06157q290K9488l8898M5424N7600p4825j5344L6158
92H547l4504K9804N9691p8974l5777O5248j3757n164O1029m9288o5141M5821J8088
105E623k60M3041m1783n8937L9063R136L692P2289m3074j03030N0903L8079m4573
118b9831O5636L1540j14966m779P3145l0398K2590N4634r0940m0240Q4481j6669
$$ plain form
130 4203 -22024 51727 21139 -61942 -10626 28823 -3234 16811 13430 -35014 -8880 17485
142 17485 -6159 15856 17937 -37988 -20801 25152 5106 4983 14172 -26184 -20467 21371 6775
155 6775 2884 16990 -23422 -31470 17937 15752 1050 16522 -12096 -31416 11387 17599 -581
168 -581 14901 -7281 -34329 7736 19712 -7858 15064 9930 -38966 -8024 32887 -2442 -6100
181 -6100 14247 -18615 -18141 20666 4474 -5771 14361 -13137 -24275 21240 16832 -14933 3143
194 3143 4692 -16184 3114 13430 -3498 2342 -997 -16292 7451 18765 -9283 -6488 8406
207 8406 -8379 -5606 13111 1584 -5682 357 -7934 -1391 13948 -1112 -8446 5261 -3469 -8383
221 -8383 10522 6039 -7582 1447 -373 -7065 6972 6627 -6068 1814 1655 -8415 4906 8653
$$ packed form
130D203k6227P3751l0588q3081N1316L9449l2057K0045l381m8444K6134K6365
142A7485k3644K2015K081n5925J7187M5953k0046j23R189m0356N717M1838j4596
155F775l891J4106m0412q048M9407k185j4702J5472k8618j9320M2803O212j8180
168e81J5482k2182k7048M2065J1976k7570K2922n134m8896L0942M0911l5329l658
181f100K0347l2862M74L8807j6192j0245K0132k7498j1138M5515m408l1765J8076
194C143J549k0876J9298J0316j6928N840l339j5295K3743J1314k8048K795J4894
207H406j6785K773J8717j1527p266O039q291O543J5339j5060p334J3707q730m914
221h383J8905m483j3621R029j820o692J4037l45j2695P882j59j0070J3321L747
$$ plain form
235 8653 -8114 -706 8309 -7435 -4680 9831 -865 -5956 3840 -980 -2677 4442 -3840 -4293
249 -4293 9258 169 -10296 4079 5839 -6808 -437 6580 -1072 -2873 -1430 -833 6341 3557
263 3557 -7394 -1285 5508 -3118 -1687 7219 489 -6600 -2018 1354 3820 3757 -4196 -5168 1760 -175
279 -175 -757 5950 1205 -8047 -3314 2934 2859 3693 361 -5498 -3100 1159 2588 5821 1949 -7336
295 -7336 -4530 3344 2892 3153 4105 -3984 -8498 -592 6070 5254 527 -5759 -5996 439 3132 3452 4428
312 4428 -2153 -10353 -4096 7640 7475 -345 -5066 -5028 -1620 2527 5382 5549 -1116 -9730 -5556 7353
328 7353 9435 614 -4583 -4657 -3633 893 6922 6247 -1946 -8880 -5963 4296 8777 2919 -3863 -5822
344 -5822 -5158 -617 7069 7302 -2024 -8473 -4949 2669 6982 5381 -464 -6002 -6901 -683 8176 7911
$$ packed form
235H653j6767P408R015j5744K755J4511j0696n091R796m820j697P119q282m53
249d293J3551r089j0465J4375J760j2647O371P017p652j801J443N97P174k784
263C557j0951O109O793q626J431Q906o730p089M582L372K466o3p953r72O928j935
279a75n82O707m745r252M733O248p5Q34l332n859K398M259J429L233l872r285
295g336K806P874m52K61R52q089m514P906O662q16m727o286k37O435K693L20R76
312D428o581q200O257J1736j65p820m721L8L408M147K855J67o665q614M174J2909
328G353K082q821n197p4J024M526O029o75q193o934K917J0259M481n858o782j959
344e822O64M541P686K33r326o449L524P618M313j601n845n538q99O218Q859k65
$$ plain form
360 7911 -2377 -7665 -3328 801 3907 7446 3303 -7194 -9401 -272 7880 6359 -2058 -6745 -4077
375 -4077 -1055 1754 7789 6119 -6946 -11100 387 7927 4685 -84 -4019 -5767 -2257 2980 6949
390 6949 6321 -3498 -10865 -1834 8616 5096 -523 -1647 -5123 -5452 2583 7832 3966 -3464 -7891
405 -7891 -3345 5349 5980 832 -1924 -4986 -6139 1644 8317 3380 -4121 -5489 -2413 2579 5722
420 5722 4564 -365 -6624 -6499 2913 8222 2249 -2918 -3263 -4100 -820 6217 6269 -94 -5893 -7101
436 -7101 434 7772 2459 -3568 -1136 -3152 -5311 4609 9049 -1387 -6053 -2164 -533 3096 5222
451 5222 -1320 -4145 -870 -1810 1066 7797 1633 -7220 -2494 2590 1836 3717 1528 -5272 -4094 151
467 151 1483 5036 3173 -6060 -5653 1679 2222 2475 3973 -2430 -7059 -1862 3065 3844 2689 -1818
$$ packed form
360G911j0288n288M337M129L106L539m143j0497k207R129Q152j521q417m687K668
375d077L022K809O035j670j3065m154J1487P540l242m769l935j748L510N237L969
390F949o28r819p367R031J0450l520n619j124l476l29Q035N249l866p430m427
405g891M546Q694O31n148k756l062j153P783O673m937p501j368L076M992L143
420E722j158m929o259J25R412N309n973n167l45q37L280P037N2o363n799j208
436g101P535P338n313o027K432k016k159R920M440j0436m666L889J631L629K126
451E222o542k825L275r40K876O731o164q853M726N084p54J881k189o800J178M245
467A51J332L553j863r233M07P332N43K53J498o403m629N197M927P79j155m507
$$ plain form
483 -1818 -3917 -1342 216 3066 5373 -757 -5539 -836 1639 830 2902 244 -3808 -177 819 -983
499 -983 3781 2217 -6687 -2298 5607 -138 -2565 2086 -1856 -3904 2648 2630 1 1295 -3308 -4512
515 -4512 4338 4307 -2418 584 559 -5129 252 5628 481 -382 345 -4514 -1257 5270 672 -1817 1905
532 1905 -2213 -4492 2738 3319 -1821 -412 256 -2277 -400 1841 818 161 -1293 -1196 1630 318
548 318 -1557 1650 1224 -2044 518 1816 -1068 -30 475 -1235 1826 1880 -3310 -534 3174 -2067
564 -2067 -1812 3881 -115 -3682 533 442 -830 2116 -494 -2613 2148 191 -3822 2535 3710 -3786
580 -3786 -1112 3380 -1639 -1631 3005 -22 -1047 2112 -1102 -2223 2426 928 -1900 1649 966 -3195
596 -3195 -843 2002 446 -99 169 -907 -1442 -824 1250 2500 -782 -2462 331 -143 -1196 2432
$$ packed form
483a818k099K575J558K850K307o130m782M703K475q09K072k658m052L631R96j802
499i83M764j564q904M389P905n745k427M651l942k048O552j8k629J294m603j204
515d512Q850l1o725L002k5n688N381N376n147q63P27m859L257O527m598k489L722
532A905m118k279P230N81n140J409O68k533J877K241j023o57j454R7K826j312
548C18j875L207m26l268K562J298k884J038N05j710L061N4n190K776L708n241
564b067K55N693l996l567M215r1j272K946k610k119M761j957m013O357J175p496
580c786K674M492n019QM636l027j025L159l214j121M649j498k828L549o83m161
596c195K352K845j556n45K68j076n35O18K074J250l282j680K793m74j053L628
$$ plain form
612 2432 2235 -2198 -1245 384 -509 1949 2254 -2352 -1065 1905 -1562 -616 3912 -310 -3772 706
628 706 1239 -793 1314 -228 -2891 787 1348 -1740 1356 1769 -4098 -1924 3916 1218 -1384 665
644 665 -1247 -2558 1522 2910 842 -218 -1932 -2519 1028 3338 1521 -493 -1923 -2393 -348 2217
660 2217 2767 305 -2920 -2663 148 1144 1563 1948 -1628 -4130 -298 2626 1129 604 -436 -2624 -957
677 -957 1918 1448 1251 166 -3415 -1672 3748 2381 -1278 -419 -660 -2204 775 3478 1284 -1618
693 -1618 -3013 -2018 2099 3462 -87 -1864 -1340 -2131 -619 3468 3148 -1489 -3758 -1784 1288 2732
709 2732 1798 -190 -1971 -2403 -223 2992 3053 -175 -2785 -2224 477 2293 2055 402 -1778 -3044 -655
726 -655 3002 2392 -770 -1827 -1855 -1321 1484 3311 602 -2660 -2773 -344 2102 2451 433 -1496 -1876
$$ packed form
612B432j97m433R53J629q93K458L05m606J287K970l467R46M528m222l462M478
628G06N33k032K107j542k663L678N61l088L096M13n867K174N840k698k602K049
644F65j912j311M080J388k068j060j714n87L547K310j817k014j430m70K045K565
660B217N50k462l225K57K811R96M19L85l576k502L832K924j497n25j040k188J667
677i57K875m70j97j085l581J743N420j367l659Q59k41j544K979K703k194k902
693a618j395R95M117J363l549j777N24p91J512M087l20m637k269J974L072J444
709B732r34j988j781m32K180L215O1l228k610N61K701J816k38j653k180j266K389
726f55L657o10l162j057k8N34K805J827k709l262j13K429K446L49k018j929l80
$$ plain form
743 -1876 -1278 1016 3466 2012 -2265 -3293 -248 2196 2003 893 -605 -2169 -2129 663 3315 2036
759 2036 -1906 -3445 -1108 1470 1828 1138 -151 -2393 -2716 469 3314 2047 -1147 -2590 -1568 635
775 635 2387 1997 35 -1995 -2359 135 2836 2323 -410 -1986 -1895 -386 1915 2441 161 -2377 -2403
792 -2403 -92 1927 1698 -44 -1474 -2243 -1339 1709 2965 328 -2297 -2000 -194 1472 2054 915
808 915 -866 -2048 -1479 1409 3227 1129 -1904 -2079 -409 1039 1827 1110 -648 -2007 -1881 279 2734
825 2734 1626 -1616 -2284 -733 403 1318 1486 -167 -1994 -1775 190 2173 1896 -720 -1848 -858 204
842 204 1306 1922 242 -1710 -1396 167 1336 1666 272 -1485 -1492 -255 942 1606 383 -1652 -1517
859 -1517 -55 646 996 625 -819 -1737 -908 923 1783 520 -1278 -1042 178 299 609 1362 52 -1658
$$ packed form
743a876N98K294K450j454m277j028L045K444j93j110j498j564M0K792K652j279
759B036l942j539K337K578L58o90j289k242l23L185K845j267l194j443J022K203
775F35J752l90j962k030l64K494K701n13k733j576R1J509K301N26k280k538k6
792b403K311K019k29j742j430p69R04L048J256k637k625K97J806J666N82j139
808I15j781j182N69K888J818k098l033j75J670J448P88p17j758j359J26K160K455
825B734j108l242o68J551J136R15J68j653j827K19J965J983k77k616j128R90J062
842B04J102O16j680j952L14J563J169L30j394j757pJ237J197O64j223k035J35
859a517J462P01L50l71j444r18Q29J831Q60j263j798K36J220J21L10P53j310j710
$$ plain form
877 -1658 -910 960 1516 538 -678 -895 -100 159 242 944 335 -1471 -1305 578 1124 175 -533 -676 -246
896 -246 -46 59 694 603 -771 -1066 473 1013 8 -90 206 -146 -283 423 704 102 -357 -71 138 82
916 82 93 92 -247 -340 -114 -6 35 -201 -414 -147 267 -245 -433 259 312 -542 -216 614 129 -550 75 651 220
939 220 -334 -174 361 419 -60 -7 453 32 -807 -201 950 506 -855 -567 82 -163 39 655 83 -714
959 -714 -686 -378 312 1075 2 -1225 -345 392 -109 597 1231 -579 -1343 297 857 267 555 79 -1071
978 -1071 -367 761 647 381 -152 -1023 -446 710 517 3 -98 -907 -1063 399 1262 342 -914 -938 -103
997 -103 397 638 821 45 -1188 -937 574 1439 974 -552 -1365 -188 795 286 868 973 -1586 -2081 864
1016 864 1660 76 -126 -664 -1690 -48 1351 520 269 -492 -2148 -624 2162 1046 -729 -194 -665
$$ packed form
877a658P48J870N56r78j216k17P95K59Q3P02o09j806J66J883N46r49p08j43M30
896b46K00J05O35r1j374k95J539N40j005r8K96l52j37P06K81o02m59K86K09n6
916H2J1jl39r3K26J08M1k36k13K67M14n12j88O92N3q54L26Q30m85o79O25N76m31
939B20n54J60N35N8m79N3M60m21q39O06J151m44j361K88O49k45K02O16n72p97
959g14K8L08O90P63j073j227Q80P37n01P06O34j810p64J640N60n90K88m76j150
978a071P04J128j14k66n33q71N77J156j93n14j01q09j56J462Q63r20j256k4Q35
997a03N00K41J83p76j233K51J511Q65m65j526q13J177R83n09N82J05k559m95K945
1016H64P96j584k02n38j026J642J399q31k51p61j656J524K786j116j775N35m71
$$ plain form
1033 -665 -1079 1060 1947 191 -974 -892 -287 960 1250 190 -559 -1020 -833 891 1529 -19 -1203 -1002
1051 -1002 -323 581 1002 344 -654 -1595 -1161 1209 2056 -14 -1183 -839 -808 325 1935 1139 -541 -1317
1069 -1317 -1523 510 2666 961 -1189 -417 -737 -1192 1540 2431 -625 -1813 -672 -371 721 1524 -275
1086 -275 -1259 -567 -616 316 1794 189 -1829 -584 472 464 995 466 -1140 -933 125 920 1505 302
1104 302 -1516 -902 364 589 1220 963 -1187 -1858 -229 961 1289 507 -1123 -1370 -524 -29 1218 1488
1122 1488 -708 -1942 -519 473 853 1102 -210 -1246 -351 16 428 1622 287 -1782 -408 1072
1138 1072 211 410 754 -1029 -1068 602 435 360 387 -1155 -1193 743 703 -131 357 -600 -1435 199 1189 185
1158 185 124 -343 -1197 25 1109 533 253 36 -1093 -430 1178 644 -124 -13 -582 -708 456 815 328
$$ packed form
1033f65m14K139Q87j756j165Q2O05J247K90j060p49m61J87J724O38j548j184K01
1051a002O79R04M21o58r98r41M34K370Q47k070j169L44L1J133J610p96j680p76
1069a317k06K033K156j705k150P72l20m55K732Q91l056j188J141L01J092Q03j799
1086b75r84O92m9R32J478j605k018J245J056qN31n29j606K07J058P95N85j203
1104C02j818O14J266K25O31k57k150o71J629J190L28p82j630k47Q46M95J247K70
1122A488k196j234J423R92L80K49j312j036Q95L67M12J194j335k069J374J480
1138A072q61J99L44j783l9J670j67p5K7j542l8J936m0q34M88r57q35J634R90j004
1158A85o1m67q54J222J084n76k80k17j129O63J608n34p68J11n69j26J164L59m87
$$ plain form
1177 328 -248 -890 -434 642 311 -244 163 -459 -954 226 690 19 -46 -355 -587 617 726 -474 111
1196 111 521 -834 -275 1283 284 -630 117 -82 -148 644 135 -480 148 -330 -696 701 619 -875 -361
1215 -361 309 -438 -63 573 -284 -471 102 -160 134 597 -191 -400 338 20 -144 559 275 -373 27 284
1235 284 110 243 26 -113 255 -167 -405 431 133 -724 -126 375 -328 -236 178 -189 -82 197 -417 62
1255 62 419 -444 -345 696 69 -525 351 286 -227 268 201 -210 221 89 -333 344 335 -621 -147 461 -223 -211
1277 -211 334 -263 -410 151 -19 -10 57 -406 -280 382 -6 -119 467 -63 -456 354 474 -184 75 74 -313 112
1299 112 347 -33 193 126 -639 -4 671 -127 -296 88 -295 -389 221 131 -30 -85 -557 -225 648 248 -433
1320 -433 128 120 -499 159 542 75 -80 -129 -166 526 602 -201 -55 213 -366 -37 634 72 -454 -239 -201 52
$$ packed form
1177C28n76o42M56J076l31n55M07o22m95J180M64o71o5l09k32J204J09j200N85
1196A11M10j355N59J558r99r14P47j99o6P92n09o15O28m78l66J397q2j494N14
1215c61O70p47L75O36q57j87N73k62K94M63p88k09P38l18j64P03k84o48M00K57
1235B84j74J33k17j39L68m22k38Q36k98q57N98N01p03R2M14l67J07K79o14M79
1255F2L57q63R9J041o27n94Q76o5n13M95o7m11M31j32m22O77rr56M74O08o84J2
1277b11N45n97j47N61j70RO7m63J26O62l88j13N86n30l93Q10J20o58K59jl87M25
1299A12K35l80K26o7p65O35O75p98j69L84l83r4O10r0j61n5m72L32Q73m00o81
1320d33N61qo19O58L83m67j55m9l7O92P6q03J46K68n79L29O71n62n26K15L8K53
$$ plain form
1342 52 412 -40 -311 -138 -300 -145 543 169 -592 -221 54 -142 373 507 -214 -331 11 150 540 336
1362 336 -385 -222 101 -72 150 561 -117 -671 -160 224 294 182 -298 -392 -65 -160 -42 530 45 -830 -314
1383 -314 464 240 89 71 -240 -198 70 242 538 213 -570 -375 450 391 95 177 -172 -454 -14 303 275 80
1405 80 -508 -511 134 276 41 55 -230 -581 -64 405 306 -54 -195 -384 -37 274 324 255 -137 -519 10 581
1427 581 331 -28 -95 -286 -266 206 402 201 -281 -628 -305 410 368 -154 -122 -263 -492 -12 485 213 -291
1448 -291 -422 -253 260 399 138 -70 -90 -268 -30 553 448 -142 -317 -86 220 348 234 -121 -398 -295
1468 -295 25 284 258 -81 -463 -429 -25 269 243 30 -348 -413 -58 393 278 -26 -105 -229 -221 271 514 98
1490 98 -216 -158 -19 168 340 108 -124 -171 -148 74 292 194 -366 -409 66 140 -3 4 -52 -291 -218 138 348 95
$$ packed form
1342E2L60m52k71J73j62J55O88l74p61L71K75j96N15J34p21j17L42J39L90k04
1362C36p21J63L23j73K22M11o78n54N11L84P0j12m80r4L27r5J18N72m85q75N16
1383c14P78k24j51j8l11M2K68J72K96l25p83J95Q25n9k96Q2l49k82M40L17k8j95
1405H0n88lO45J42k35J4k85l51N17M69r9l60j41j89L47L11N0o9l92l82N29N71
1427E81k50l59o7j91K0M72J96k01m82l47L23P15m2n22L2j41k29M80M97k72n04
1448b91j31J69N13J39k61k08k0j78K38N83j05n90j75K31L06J28j14l55k77J03
1468b95L20K59k6l39l82L4M04K94k6k13l78o5L55M51j15l04p9j24QM92K43m16
1490I8l14N8J39J87J72k32k32m7K3K22K18r8n60m3M75P4j43Pn6k39P3L56K10k53
$$ plain form
1514 95 -161 -356 -150 331 260 36 129 -47 -388 99 569 244 -198 -118 -66 -141 255 131 -140 -108 -177 -239 179
1537 179 305 -238 -288 22 -58 -48 202 -3 -283 -78 143 84 76 72 -7 -90 63 268 176 -1 -108 -101 14 112 164
1562 164 -119 -77 -123 -255 31 324 -19 -347 -21 -23 -194 60 164 -175 -140 3 -111 140 249 -212 -97 346
1584 346 -5 -142 334 183 -257 -8 241 -85 35 95 -150 -22 147 -162 -143 127 -128 -199 29 40 -165
1605 -165 -62 -16 -99 -13 53 8 16 3 36 50 11 52 189 78 11 112 118 -68 103 32 -28 148 -19 -259 74 141
1631 141 -233 -79 131 -171 -303 106 11 -73 67 -211 -162 241 38 -175 125 77 -261 72 393 52 -72
1652 -72 34 -50 34 273 20 -71 37 -213 -189 230 185 -156 -198 -169 -141 91 101 -15 -55 -144 -143 145 133 0 1 -60
1678 -60 -81 201 260 21 19 -50 -64 120 217 -5 -5 1 -227 62 337 2 -262 -152 -112 -95 158 79 -182 -217 -256 -129
$$ packed form
1514I5k56j95K06M81p1k24R3j76l41M87M70l25m42Q0N2p5L96j24k71L2o9o2M18
1537A79J26n43n0L10q0J0K50k05k80K05K21n9qmp9q3J53K05r2j77j07PJ15R8N2
1562A64k83M2m6j32K86K93l43l28L26kj71K54J04l39L5J43j14K51J09m61J15M43
1584C46l51j37M76j51m40K49K49l26J20O0k45J28J69l09J9K70k55p1K28J1k05
1605a65J03M6q3Q6O6m5Qj3L3J4l9M1J37j11o7J01Oj86J71p1o0J76j67k40L33O7
1631A41l74J54K10l02j32M09r5q4J40k78M9M03k03k13L00m8l38L33L21l41j24
1652g2J06q4Q4K39k53r1J08k50K4M19m5l41m2K9K8K32J0j16m0q9JK88j2j33Jo1
1678f0k1K82N9k39ko9j4J84R7k22%Ok28K89K75l35k64J10M0J7K53p9k61l5l9J27
$$ plain form
1704 -129 319 207 -285 -169 62 -126 137 387 118 -210 -194 62 236 313 -24 -199 24 5 -39 295 161
1725 161 -254 -263 -21 53 119 -11 -230 -244 -131 20 259 147 -273 -244 -12 13 209 229 -9 -213 -57 121 274
1748 274 220 -85 -210 18 89 135 266 37 -315 -175 130 121 132 -64 -228 -184 -12 15 161 100 -364 -249 99
1771 99 99 58 140 -87 -233 -7 158 201 178 -122 -248 90 283 99 130 -2 -193 -77 173 129 62 -126 -232
1794 -232 -101 98 97 7 -79 -294 -153 157 176 29 -76 -83 -129 134 197 154 33 -91 -144 153 216 92 59 -14 -188
1819 -188 -5 195 100 -30 -180 -241 6 145 -20 -93 -18 -197 -166 166 133 -27 -110 -69 -49 119 69 35 30 -39 -54
1844 -54 169 219 6 -64 -13 -20 63 182 50 -19 -84 -111 82 128 -89 -103 -92 -79 -79 36 -5 -140 -129 -101 14 137
1870 137 6 -152 -41 -14 -20 220 161 -35 -32 -5 -8 133 50 -8 -20 -4 -36 -18 138 -91 -121 29 -43 -88 58 -41
$$ packed form
1704a29M48j12m92J16K31j88K63K50k69l28J6K56J74P7l37j75K23j9m4L34j34
1725A61m15rK42P4O6j30k19j4J13J51K39j12m20K9K32K5J96K0k38k04J56J78J53
1748B74n4l05j25K28P1M6J31k29l52J40L05rJ1j96j64M4J72K7J46o1m64J15L48
1771I9%m1Q2k27j46K26J65M3k3l00j26L38J93j84L1j32j91J16K50m4o7j88j06
1794b32J31J99jr0q6k15J41L10J9j47j05pm6K63O3m3j21j24n3K97O3j24l3p3j74
1819a88J83K00r5j30j50o1K47J39j65p3P5j79L1L32l3j60q3M1K0J68n0l4no9j5
1844e4K23N0k13p0N1pQ3J19j32o9o5k7J93M6k17j4J1J3%J15m1j35J1K8J15J23
1870A37j31j58J11K7oK40n9j96LK7lJ41q3n8j2J6l2J8J56k29l0J50p2m5J46r9
$$ plain form
1896 -41 -99 -105 -23 -5 78 -55 -72 36 58 -79 55 133 -43 -1 53 104 149 49 -80 47 95 3 25 141 -96 -61
1922 -61 -5 14 -41 -7 -30 13 21 -55 -30 115 -32 -24 71 80 -64 62 102 13 53 100 6 9 77 -55 52 0 0 -16 23 7
1952 7 -38 -49 -60 -82 -54 -28 -23 17 -112 -99 -2 78 24 -2 2 -93 -39 121 107 102 24 -50 67 46 64 155 60 -76 -62 73
1982 73 103 36 -103 -180 -58 5 36 40 -6 -195 -170 73 66 -34 -66 -100 -87 37 137 152 61 -94 -66 130 219 67
2008 67 5 41 -79 -7 88 202 68 -145 -70 19 -10 92 -4 -119 -126 -41 79 88 -16 -92 -127 40 28 70 118 -57
2034 -57 -179 -23 148 108 -1 15 -61 5 49 140 139 -44 -179 -114 106 97 -36 -26 -43 -172 -91 146 143 -142 -109 0
2060 0 -12 13 28 64 -22 -49 60 175 139 -47 -106 43 125 43 28 77 -68 -169 11 151 3 -62 -79 -138 -22 85
2086 85 27 -32 -62 -142 -77 134 131 -62 -33 -33 -120 18 242 10 -156 92 83 27 111 107 -8 -49 43 -14 126 69 -159
$$ packed form
1896d1n8oQ2J8Q3j33j7J08K2j37J34P8j76M2N4N1M5j00j29J27M8r2K2J16k37L5
1922f1N6J9n5L4k3M3Qp6K5J45j47QR5Rj44J26M0q9M0M7r4LO8j32J07n2%j6L9j6
1952Gm5j1j1k2K8K6NM0j29J3R7Q0n4k6Mr5N4J60j4np8p4J17k1J8R1r5j36J4J35
1982G3L0o7j39p7J22O3L1Mm6j89K5K43pj00l2l4J3J24J00J5r1j55K8J96Q9j52
2008F7o2L6j20P2R5J14j34k13P5Q9k9J02r6j15pQ5J20Rj04p6l5J67j2M2M8j75
2034e7j22J56J71m0j09J6p6O6M4R1jj83j35O5K20rj33J0j7j29Q1K37lk85L3J09
2060@j2K5J5L6q6k7J09J15l6j86n9J49Q2q2j5M9j45j01J80J40j48o5j7n9J16J07
2086H5n8n9l0q0O5K11lj93K9%q7J38K24k32j66K48rn6Q4mj15m1R2n7J40n7k28
$$ plain form
2113 -159 -156 96 62 -112 19 12 -213 -111 82 80 -78 -101 -87 -95 54 75 21 -7 -7 -84 -20 163 118 12 -6 68 -5
2140 -5 28 122 0 -86 43 28 -23 -12 29 -93 -97 120 -42 -29 -46 -70 -96 61 35 -67 55 19 -130 77 200 18
2166 18 14 2 -42 5 101 -8 59 52 -87 -89 -3 85 -44 -72 22 -65 -69 0 29 -9 -161 -47 63 40 -39 -26 4 25 20 -2
2196 -2 -36 35 -12 -18 71 92 -32 -4 99 -4 46 61 45 -78 33 -16 -67 54 -10 -93 -38 11 -70 -16 -17 -89 -59 105
2224 105 -23 1 18 -78 30 69 114 44 3 -10 14 96 21 -38 18 21 -66 -8 45 -30 -75 -103 -95 30 18 -137 -85 -25 -3
2253 -3 8 30 -42 -3 -20 -77 32 119 -65 -91 133 33 -14 68 81 21 16 43 16 96 33 -71 50 52 -87 -44 30 -81
2281 -81 -62 -27 -50 31 23 -80 -37 78 -10 54 36 -20 -48 63 47 -2 101 15 -104 5 54 15 17 -42 -8 38 56 -11
2309 -11 51 -30 -99 -25 39 12 -77 -76 -95 -27 49 -80 -12 39 -28 -41 71 115 -29 41 3 28 92 37 -35 55 27 -57 7
$$ packed form
2113a59LK52l4j74J31pk25J02J93kj58k3J4qJ49K1n4k8%p7O4J83m5j06j8P4p3
2140eL3R4j22q6J29j5n1J1M1j22mK17j62J3j7k4k6J57k6j02J22l6j49K07J23j82
2166A8mj2m4M7R6j09O7pj39kQ6Q8j29k8R4q7mO9K9l8j52J14J10k3p9J3L0K1nk2
2196bl4P1m7oQ9K1j24K8J03j03N0J5j6j23J11m9n1J21o4q3N5M9q1N4jp2L0J64
2224A05j28K4J7r6J08L9M5p0m1j3K4Q2p5n9N6Lq7N8N3p5m5k8QJ25j2j55N2O0K2
2253cJ1K2p2L9j7n7J09Q7j84k6K24j00m7Q2J3o0nK7k7Q0o3j04J21Kj39M3P4j11
2281h1J9L5k3Q1qj03M3J15q8O4j8n6k8J11j6m9J03q6j19J09M9l9Kn9L4M6J8o7
2309a1O2q1o9P4O4k7q9Jj9O8P6j29O8N1o7j3J12M4j44P0l8K5O4n5p2R0k8q4O4
$$ plain form
2338 7 91 -67 -55 -39 -87 -22 29 3 -118 13 -19 9 -33 -51 -18 16 -10 13 114 91 -39 50 94 75 39 56 55 24 -37
2367 -37 26 89 18 -141 -3 51 -49 -64 -21 -72 9 -8 7 -13 -27 -119 -73 65 -18 43 24 -22 -25 47 103 70 34 2 52
2396 52 23 58 33 56 2 -65 41 12 54 -9 26 -28 -68 95 38 -78 -128 -92 15 50 33 -40 -23 2 -37 66 121 23
2424 23 -68 -19 82 63 58 -24 40 -11 -52 65 85 -13 -66 -76 -5 4 2 -47 -90 -59 -43 -41 105 1 -161 -83 -50 -18 130
2453 130 62 -116 -12 2 17 123 50 -71 -5 -9 10 96 59 -105 -104 -119 2 33 -24 -59 -165 -114 -5 73 34 -38 -142
2480 -142 -181 -13 98 70 -42 -35 -62 -37 117 181 18 -35 -34 -12 128 116 42 -59 5 -23 -16 118 45 -173 -160 -47
2506 -47 41 35 3 -137 -153 -75 23 21 35 -52 -125 -43 40 155 21 -34 -44 -28 38 109 78 -6 2 -29 34 168 47 -40 -50
2535 -50 -58 -66 14 47 -42 -75 -144 -107 20 67 -22 -77 -42 32 22 11 57 -8 0 -26 50 98 10 -5 -55 36 25 19 -1 19 -34 -49
$$ packed form
2338GQ4j58J2J6m8O5N1k6j21J31l2K8m2j8L3L4k6K3J01k3j30Q9M4j9l6J7jl1o1
2367c7O3O3p1j59J38N4j00j5M3n1Q1j7J5k0j4r2M6J38q3O1j9m6lP2N6l3l6l2N0
2396E2k9L5k5K3n4o7J06k9M2o3L5n4m0J63n7j16n0L6J07L5j7p3J7K5l9J03N5r8
2424B3r1M9J01j9nq2O4n1m1J17K0r8n3j0P1Rkm9m3L1J6KJ46j04j62P8L3L2J48
2453A30o8j78J04J4J5J06p3j21O6mJ9Q6l7j64Jj5J21L1n7l5j06N1J09P8l9p2j04
2480a42l9J68J11k8j12Pk7K5J54O4j63n3JK2J40j2p4j01O4k8PJ34p3k18J3J13
2506d7Q8ol2j40j6P8R8kJ4q7p3Q2Q3J15j34n5j0J6O6P1l1q4Ql1O3J34j21q7j0
2535e0qqQ0L3q9l3o9L7J27M7q9n5L5P4j0j1M6o5Qk6P6M8q8j5n0R1j1ok0K0n3j5
$$ plain form
2567 -49 23 15 -3 -82 -74 4 -2 -48 -14 -20 34 -44 -16 54 82 -3 5 -23 34 -23 -4 33 12 16 -8 3 17 83 -78 5 -12 -6 35
2600 35 -28 -50 -46 45 -55 -31 -8 -63 -86 31 38 -8 -27 49 -18 114 52 -20 44 34 62 -45 41 77 -15 42 71 32 -53
2629 -53 -15 -5 21 -63 -83 -105 -86 -36 -39 11 76 -38 -116 -33 21 23 -13 -27 -2 30 72 15 46 95 -23 -3 95 90 41 -25 -33
2660 -33 -2 62 41 -12 -20 24 -42 -41 19 85 -68 -116 -12 28 6 -23 -26 -35 -25 -83 49 124 65 -90 -42 31 81 3 45 -37
2690 -37 -104 -5 65 24 -15 -75 -103 -6 63 15 -39 -3 -99 -23 50 47 83 -72 -35 3 67 130 20 -30 -27 0 33 78 77 3 -78
2721 -78 -57 19 97 40 -54 -118 -41 -33 3 30 35 -133 -227 -15 101 -30 -43 -52 -87 13 105 60 -19 6 -75 -61 117 170 51
2750 51 -15 -89 12 103 140 74 -11 -67 -64 -32 139 48 -131 -126 -82 24 51 -24 -66 -143 -96 -17 68 77 -34 -84 -98 121 83
2779 83 91 5 -70 -30 -5 94 161 30 -107 -102 2 46 33 54 -7 -33 -67 3 73 57 -46 -135 -66 81 64 -64 17 -126
$$ packed form
2567d9P2qj8p9QP8om6L4oN4p8K8P0K8q5Qk8N7n7J9L7k1Mk4J1J4O6j61Q3j7OM1
2600C5o3k2MR1j00K4K3n5k3J17Pm6j9P6o7J32o2p2O4j0K8j07Q6L6r2N7K9l9q5
2629e3L8J0K6q4k0k2J9N0lN0O5j14p8Q3N4Kl6j4K5L2M2n7L1M9j18K0R8nm9o6q
2660c3L1O4k1n3qM4o6JO0O6j53m8J04M0k2k9lrJ0n8J32P5n9j55M8P3N0p8M2q2
2690c7o7R9P0m1l9o0k8R7O9m8n4L6r6P6P3lL6j55L7L8O4O3j10n0LK7L3M5jp4q1
2721g8K1P6P8n7r4o4P7QL6K7Nj68r4K12J16j31j3rl5J00R2m5p9K5q1J4J78N3j19
2750E1o6p4J01R1L7o6q5n6LL2J71r1j79NM4J06K7p5m2p7M7P9Q5Rj11n0j4K19l8
2779H3Qq6p5M0K5R9O7j31j37NJ04M4j3K1o1k6l4P0P0j6j03q9O9J47j7j28Q1j43
$$ plain form
2807 -126 -10 27 66 108 -14 -102 -75 134 148 16 -63 -93 -26 38 50 103 10 -95 -124 -18 60 28 -53 -26 4 40 16
2834 16 41 74 -36 -28 -21 85 57 -15 -27 15 -16 2 22 79 12 -45 -67 35 40 0 -55 -86 12 14 2 -25 -27 -14 -49 -28 30
2865 30 51 -58 -81 -35 4 -1 23 -3 24 -23 -38 82 113 66 -18 65 43 34 53 3 31 -1 -8 -54 20 49 -73 -122 -91 -6
2895 -6 -44 -11 -54 -9 8 -70 18 71 11 -61 -46 43 57 -10 -17 17 -18 -63 0 35 17 -4 -29 4 74 23 2 17 -23 26 12
2926 12 -3 -2 -57 -22 -24 3 10 -50 -27 16 26 14 15 66 18 8 -6 5 87 7 12 -22 17 14 -60 -43 58 -9 -1 27 -15 13 8 -30
2960 -30 3 -7 -54 -33 38 -16 -50 -71 9 34 21 5 47 50 -30 34 -22 15 77 23 11 -24 28 16 -16 52 -22 2 -69 -9 61
2991 61 -68 -31 -37 -9 -20 -37 1 17 -90 -15 53 40 24 5 -12 64 52 9 -19 -4 19 49 -5 16 18 -32 12 -22 43 -49
3021 -49 -28 -61 -54 -46 -73 -40 -19 25 -89 -99 13 20 -17 -43 -58 34 -25 -24 -31 -25 -6 14 43 82 64 38 24 9 -31 -31 -3 29 -66
$$ packed form
2807a26J16L7L9M2j22q8K7K09J4j32p9l0O7O4J2N3r3j05k9J06P8l2q1K7L0L6k4
2834A6K5L3j10QPJ06k8p2j2M2l1J8K0N7o7n7k2J02Nm0n5l1R8Kj2k7kJ3l5K1N8
2865C0K1j09k3M6L9nK4k6K7m7j5J20L1m7q4Q3k2rJ9n0K8l2pm6P4K9j22m9L1Q5
2895fl8L3m3M5J7p8Q8N3o0p2J5Q9J4o7pL4l5m5O3L5j8k1k5L3P0n1k1J5m0M9j4
2926A2j5Jn5L5kK7Po0K3M3J0j2JN1m8j0j4J1Q2q0Nl4L9lp4J7J01o7QK8m2K8nl8
2960c0L3j0m7K1P1n4l4k1Q0K5j3j6M2Lq0O4n6L7O2n4j2l5N2j2l2O8p4K4p1O0P0
2991F1j29L7oK8j1j7L8J6j07P5O8j3j6j9j7P6j2m3k8J5K3L0n4K1Kn0M4l4O5r2
3021d9K1l3PQk7L3K1M4j14j0J12Pl7k6j5R2n9JpOJ9K0K9L9j8k6j4j5m0%K8L2r5
$$ plain form
3054 -66 -67 -32 50 -12 -8 4 -19 20 -20 -27 15 -7 -26 -27 -10 44 -13 -53 38 -28 8 -39 11 5 5 6 6 22 22 -33 -40 -25 -6 9 -52
3089 -52 -15 -12 -20 -41 6 83 16 -15 -56 21 45 41 2 -4 -18 -58 51 65 40 -30 -35 -37 -5 59 -10 -29 -19 -14 -16 36 5 -51 -88 -40
3123 -40 26 38 -65 -45 -15 88 -26 -6 48 15 -6 -44 53 73 61 -17 5 0 49 14 -35 19 19 -41 -44 -68 25 -32 -73 -49
3153 -49 -41 -66 -13 -11 -11 -25 -31 27 82 2 -41 -32 4 42 29 44 -21 20 17 40 111 62 26 -75 6 10 14 -4 -26 73 -39 -10 1
3186 1 47 -22 -10 -104 -20 3 -56 -9 -27 -2 -19 25 -1 0 8 -9 27 55 -23 -22 16 39 -45 0 35 2 -60 -55 -30 36 -6 -25 9
3219 9 -38 -15 -39 2 54 13 -57 -58 -11 71 21 9 -34 39 21 -20 51 14 30 -28 -12 -14 61 -52 -87 -41 -5 -40 -35 26 19 -37
3251 -37 -40 -21 11 -19 -37 -39 25 10 -70 -22 -18 0 -28 39 101 38 -16 -65 48 -24 73 -16 44 -18 -16 -16 39 48 -39 -21 -9 14 -64
3284 -64 -52 -33 4 -11 -60 -4 -8 -33 5 -48 -1 35 15 -18 -24 41 39 46 45 7 10 -28 27 69 71 -31 41 76 -26 -27 32 23 10 -34
$$ packed form
3054f6jL5Q2o2MJ2k3L9m0pM2k2j9jJ7N4n7m0R1o6L6m7N0o%J%J6%n5pJ5J9J5o1
3089e2L7Lqk1M7P7o7l1m1P7K4ml9oj4m0J09J4k5p0nkL2O4o9j9J0NkN2l1n6l7M8
3123d0O6J2j03K0L0J03j14K0N4l3k1l8R7K0j2p8K2nM9l5m9N4%o0lk4R3n7m1K4
3153d9Qk5N3K%j4oN8N5q0m3RL6L8j3J5o5M1lK3P1m9l6j01Q1MMj8k2R9j12K9J1
3186AM6o9J2r4Q4K3n9M7j8K5j7M4k6JQj7L6K8p8JL8K3q4M5L5l3o2NK5O6m2j9L4
3219Im7K3k4M1N2m1p0jM7Q2n0j2m3P3j8m1P1l7J6n8J6kP5j13l5M6L6l5NO1pn6
3251c7lJ9L2l0j8kO4j5q0M8MJ8k8O7O2o3n4m9J13p2R7q9O0o2K%N5Rq7J8J2K3p8
3284f4J2J9L7j5m9N6mk5L8n3M7L6k0l3oO5kPjl8Ll8N5M2Kj02P2L5j02jN9rj3m4
$$ plain form
3318 -34 -52 51 -3 -46 -2 -31 83 -61 7 24 -2 17 -67 -26 41 -6 -27 -14 26 33 -12 69 34 57 -39 -5 -2 40 -20 -40
3348 -40 29 50 -43 45 21 48 -37 -22 45 39 30 -43 -23 57 52 -39 -46 30 15 -41 -50 28 70 -23 -76 31 45 -9 -69 7 59 -24
3380 -24 -88 21 80 -3 -55 -60 19 43 38 16 14 26 23 21 102 47 -23 -34 0 81 57 41 -4 23 -34 -36 16 58 -45 -97 -61 40
3412 40 9 -16 -36 11 -32 32 -14 38 5 -28 -64 16 70 -10 -7 -29 92 74 30 9 0 22 -96 -40 73 103 -34 -103 -36
3441 -36 11 -5 -12 60 8 -40 -73 45 40 -26 -75 -24 45 -1 -20 -27 21 3 -47 30 99 19 -36 -66 5 27 -8 -20 43 36 13 -67
3473 -67 10 21 -17 -75 -31 37 28 -26 -11 39 19 -11 54 73 -25 -30 53 -3 76 22 -80 3 11 38 -23 52 44 -114 -85 -12 32
3504 32 13 -81 -104 -15 11 -20 25 21 -26 -62 -55 8 27 -15 -47 13 82 44 -15 17 -37 -8 -13 28 38 39 -48 -63 91 46 4 -17
3536 -17 33 2 -51 53 79 6 -69 -13 2 49 -15 -41 -42 0 2 -25 10 53 8 -30 -12 56 32 -6 -14 14 27 -27 47 69 -24
$$ packed form
3318c4j8J03n4m3M4k9J14j44O8J7k6J9q4M1O7m7k1J3M0Pm5Q1l5K3r6L4LM2o0k0
3348d0O9K1r3Q8k4K7q5J5O7orp3K0Q0nr1pP6j5n6rP8M2r3n3J07J4n4o0P6N2q3
3380b4o4J09N9q3n2nP9K4nk2kJ2lkQ1n5p0j1L4Q1k4j6m5K7n7kN2M2j03n2L6J01
3412D0l1k5k0M7m3O4m6N2l3l3l6Q0N4q0Lk2J21j8m4k1rK2j18N6J13L0j37o9O7
3441c6M7j6pP2n2m8l3J18no6m9N1O9m6j9pM8j8n0P7O9q0n5l0P1K2l5j2O3pk3q0
3473f7P7J1l8n8M4O8rn4J5N0k0l0O5J9r8nQ3n6P9n4j02Q3QK7o1P5qj58K9P3M4
3504C2j9r4k3Q9K6l1M5mm7l6PO3J9m2l2O0O9l8n9L2n4K9nM1J0Jq7j5J54m5m2k1
3536a7N0l1n3J04K6p3p5N6J5M7o4k6jM2Kk7L5M3m5l8J8O8k4l8qK8J3n4P4K2r3
$$ plain form
3567 -24 -39 -12 20 25 -8 -77 -27 68 -32 -35 28 82 30 -54 -41 21 35 1 -37 -23 7 -22 -18 -11 -43 -67 -27 60 32 17 -41 0
3599 0 32 -26 -24 -71 -22 -13 -28 -13 23 12 -53 -13 -7 23 -14 17 4 -12 -45 -9 85 44 22 11 -28 9 69 -47 -7 24 -43 34
3631 34 -50 25 19 -71 -104 12 17 -16 -67 -37 15 -39 -43 36 29 25 -13 15 18 5 -49 0 37 7 -56 -41 -3 34 18 -17 36 48 -17
3664 -17 -42 -4 2 -18 -23 -31 62 27 -41 -26 -5 75 -55 -22 51 27 -38 35 90 34 -15 -41 47 21 -38 -10 55 72 -42 -26 83
3695 83 55 2 -63 -11 28 -4 -64 -40 36 2 -2 -4 21 55 -5 20 20 7 58 -17 11 5 -9 8 50 24 3 -32 33 45 -13 16
3727 16 10 -47 -17 -2 14 5 -1 -58 -65 23 -22 15 -98 -24 27 29 4 56 22 -9 -17 4 66 92 -33 30 33 51 18 14 33 -1 -97
3760 -97 -6 29 38 -3 -77 -26 51 0 -30 -4 -11 -51 -16 32 27 18 -47 -47 29 23 21 23 -1 -31 -7 45 59 17 2 -14 -26 8 -19 4
3794 4 -19 -45 -6 26 17 -8 -45 -51 -65 6 1 -5 -81 -2 53 -34 21 41 -20 -40 27 58 9 27 -24 -1 38 12 -3 41 34 -61 -18
$$ packed form
3567b4j5K7L2Nl3o9N0R5j00lO3N4n2q4J3O2J4l4l8J4L0k9MPl2k4M0Q7k8j5n8M1
3599@L2n8Km7M9Rj5J5L6j1o5M0OL0l7L1j3j6l3L6R4m1k2j1l9L7O0j16M0L1o7P7
3631C4q4P5or0l3J16Nl3n1L0N2n4mP9pml8K8Lj3n4M9L7l0o3J5L8L7j6l5N3J2o5
3664a7k5L8Ok0nqR3l5o8J5K1Q0j30L3P3k4o5P3N5n6m9k6Q8k6n9K8O5J7j14J6J09
3695H3k8n3o5N2L9l2o0K4P6l4mkK5L4o0K5%j3N1p5K8oj4J7M2k6k1l5O5J2n8K9
3727A6on7L0J5J6ron7pQ8m5L7j13P4N1Kk5N2l4l1qK1O2K6j25O3LJ8l3mJ9l4r6
3760i7R1L5Rm1p4N1P7n1l0K6pm0L5M8nro5%P6okKk4l0K4N2J4m2j5j6j2L4k7K3
3794Dk3k6L9L2rk5l7oj4P1nop6P9N5q7N5K0o1k0O7L1m9J8n1K3L9k6j5M4pr5M3
$$ plain form
3827 -18 57 41 113 -85 -50 -29 -27 -2 -3 5 -4 -64 -33 44 27 -40 -71 -54 38 66 -30 -53 55 -37 -33 -11 -13 49 -51 -48 24 57
3859 57 14 -42 -18 31 -33 25 0 64 10 -51 -70 61 64 -28 17 42 25 28 12 17 -43 -25 12 55 15 -7 -26 12 -22 25 0
3890 0 -1 -67 -60 -41 -51 -39 -16 -66 -43 33 2 49 -22 -69 5 -33 23 46 90 53 6 -2 65 23 -27 -63 42 11 -50 54 23
3921 23 15 -35 -58 23 25 -28 -20 -39 -5 -70 -2 65 53 -85 -12 52 -35 37 -21 -24 10 -21 -91 16 25 -51 -27 -27 24 8 1 -15 38
3954 38 75 54 31 -63 63 -19 -46 5 -4 -41 -3 1 -35 -34 -30 -30 -15 -84 -33 -2 36 49 -28 -99 -22 52 36 -23 -2 57 -22 -45
3986 -45 50 17 -7 -36 -31 46 21 0 5 20 40 -6 -11 68 -8 -36 -80 61 91 13 -6 -6 10 -32 -32 17 13 -92 0 24 30 -35 -19
4019 -19 -32 -29 -5 3 24 -6 -41 -4 0 -86 60 -12 14 9 3 18 -10 47 13 41 -8 -17 45 102 -30 -2 51 14 -61 26 67 10
4051 10 47 -27 -7 -11 11 -22 12 -26 -21 -41 -27 59 -37 -18 -12 -16 3 -38 3 -29 -4 -10 7 9 50 -27 -12 56 31 -10 29 38 -6 18
$$ packed form
3827a8P5j6P2j98L5K1KK5jQro0L1P7j7o7l1J7R2K8r6k3J08r2MK2kO2j00LP2L3
3859E7m3n6K4M9o4N8k5O4n4o1j9J31Lr2M5K5j7Lj6No0J8L7M3m0k2j9L8l4M7k5
3890@jo6PJ9j0J2K3n0K3P6l1M7p1m7P4l8N6K3M4l7m7qO7m2n0l6J05l1o1J04l1
3921B3qn0k3Q1Kn3Qj9L4o5O8O7j2j38P3O4q7P2n8lL4l1p0J07Rp6K4%N1j6pj6N3
3954C8L7k1k3r4J26q2k7N1rl7L8Ml6JM%J5o9N1L1L8J3p7p1P7P4j6n9K1N9p9k3
3986d5R5l3k4k9NP7k5k1NJ5K0m6nP9p6k8m4J41L0p8j9%J6m2%M9mj05R2K4Oo5J6
4019a9j3LK4QK1l0l5L7Mq6J46p2K6noJ5k8N7l4K8m9rO2N7j32K8N3l7p5Q7M1n7
4051A0L7p4K0mK2l3L4l8Nk0J4Q6r6J9OmJ9m1M1l2K5oJ7KM1p7J5O8k5m1L9Rm4K4
$$ plain form
4085 18 25 46 28 8 -48 10 49 55 -41 -52 25 -29 -43 3 38 -7 -41 -45 -40 -40 -55 -13 -65 44 -56 -42 52 15 13 8 33 -27 -2
4118 -2 -31 0 54 28 2 -22 32 -87 -22 -44 52 52 -56 -59 8 0 30 -62 69 16 -19 -18 30 22 1 -54 3 -46 -9 -7 0 -13 -22
4151 -22 10 -24 -11 -14 -47 -15 9 48 7 -18 0 17 40 -12 -50 78 -10 -29 -10 -7 52 14 11 -39 6 35 26 8 12 -43 -76 10
4183 10 39 -14 34 15 -22 -35 -1 15 34 5 -54 -79 56 11 24 22 -23 -11 15 75 -15 -44 -25 -1 55 21 -1 1 -6 -20 52
4214 52 19 120 51 -24 47 23 20 30 -4 -63 -3 11 7 5 50 23 -55 -45 10 10 46 -48 -22 37 14 36 -67 17 46 -10 53
4245 53 55 -32 -102 -70 35 3 17 46 28 2 -51 10 44 58 -16 -35 -3 14 -56 -19 39 -51 -56 -16 25 48 8 -17 21 2 67
4276 67 46 -12 -24 -14 36 28 -36 -19 23 -26 -36 -18 35 -15 50 37 21 -23 -19 28 -59 10 -11 31 38 66 19 0 79 30 36 32 15
4309 15 25 -2 29 60 12 -42 -71 21 -7 -39 -65 28 -37 -34 27 -23 -59 -9 -22 90 -35 -28 22 1 32 -2 46 16 46 -9
$$ packed form
4085A8PK1j8k0n6N8L9Or6j1P7n4j4M6L5m5l4mN%j5M2n2J09j00J4R4l7knK5o0K5
4118bk9L1N4k6k6k4N4j19O5k2R6%j08lO7qL0r2J31n3l5JM8qk1n5N7m9L7KPj3r
4151b2L2l4J3ll3L2K4L9m1k5J8J7K3n2l8J28q8j9J9LN9l8ln0M5K9rj8Mn5l3Q6
4183A0K9n3M8j9l7j3L4J6J9k9n9k5J35m5J3km5J2K6O0r0k9J9K4N6l4k2Kpj4P2
4214E2l3J01o9p5P1k4lJ0l4n9O0J4mkM5k7p8J0N5%L6r4K6N9k3K2j03Q4K9n6O3
4245E3Kq7p0L2J05l2J4K9j8k6n3O1L4J4p4j9L2J7p0L7N8r0nM0M1K3m0k5L8j9O5
4276F7k1n8j2J0N0qo4J7M2m9j0J8N3n0O5j3j6m4MM7q7O9k1M2PK8m7j9P9m9Omj7
4309A5J0k7L1L1m8n4k9R2k8l2k6R3o5LO1n0l6N0j3J12j25PN0k1L1l4M8l0L0n5
$$ plain form
4339 -9 58 -1 -37 -34 -29 21 7 28 -1 -2 -42 -17 11 29 -31 11 -21 17 -32 -55 13 -11 7 17 42 -35 -52 -15 43 -10 -4 27 35
4372 35 -43 -49 44 77 57 31 -35 -48 -4 10 58 1 -55 -65 37 -1 69 4 -18 13 -56 26 40 26 -29 -71 3 28 65 93
4402 93 -13 -76 -42 -4 59 60 -3 -60 -47 -3 31 -14 -12 -92 -86 29 96 88 -18 -30 -87 -48 11 98 83 -72 -99 57 156 95
4432 95 42 -61 -89 -28 70 106 50 -94 -103 -22 92 57 38 -41 -174 -53 48 127 26 -47 -121 -51 61 38 38 -44 -84
4459 -84 -114 18 159 94 -34 -81 -36 71 93 122 -9 -126 -62 13 130 114 -19 -68 -123 -11 180 200 -39 -132 -113
4484 -113 -3 146 54 6 -39 -137 -71 97 144 -16 -111 -147 -38 122 123 101 -43 -175 -133 54 146 20 -91 -113 -63
4509 -63 48 129 93 -90 -158 -92 103 170 110 -44 -74 -29 25 124 135 -75 -209 -75 51 74 99 -47 -95 -121 -5
4534 -5 166 117 -67 -130 -110 45 96 34 0 -63 -171 -51 191 161 -44 -151 -121 -11 73 103 61 -109 -156 1 84
$$ packed form
4339iO7n9l6LNN0j4K1k9jm0K5K8J8o0M2l2L8m9k3O8k4J8J0K5p7j7L7N8n3OL1Q
4372C5p8oR3L3k0k6o6j3M4J4M8n7n6j0J02l8P0o5k2L1o9Q2J4j4n5m2P4K5L7K8
4402I3j06o3L4L8O3Jo3n7J3M4L4m5Kq0OJ15O7qj06j2n7L9N9Q7j5j55k7J56R9o1
4432I5n3j03k8O1R8L6n6j44rQ1J14l5j9p9j33J21J01P9j01p3p4P0J12k3%q2m0
4459h4l0J32J41o5j28m7M5J07K2K9j31j17O4P5J17j6j33m9n5J12J91K0k39r3J9
4484a13J10J49r2m8m5r8O6J68M7j60r5l6J09J60Jk2j44j32M2J87R2j26j11k2N0
4509f3J11Q1l6j83o8O6J95O7o0j54l0M5N4R9J1k10j34J34J26K3K5j46m8k6J16
4534eJ71m9j84o3K0J55N1o2l4o3j08J20K42l0k05j07L0J10Q4L0m2j70m7J57Q3
$$ plain form
4559 84 146 -20 -76 -43 -17 9 59 79 -111 -135 -45 148 101 26 -47 -120 -26 95 109 83 -38 -222 -88 147 149 -28
4585 -28 -98 -87 -107 -8 116 148 -36 -82 -66 33 95 40 -46 -72 -122 38 57 89 16 -96 -115 63 105 72 33 -98 -127
4612 -127 19 113 72 -75 -101 -150 -79 69 54 21 -53 -143 -58 64 80 -36 -65 -59 -103 -6 106 23 -90 -59 25 105 40
4639 40 67 -7 -31 -149 46 87 61 -29 -93 28 33 -28 27 45 -28 3 -35 27 14 -73 -11 28 -21 2 42 23 -15 -62 -1
4668 -1 39 -26 4 23 64 -48 -22 59 15 -14 -29 1 16 24 13 11 36 -66 7 89 42 7 26 0 -28 -22 26 26 23 43 -83 -17
4700 -17 -10 18 -8 51 -20 -107 -10 -57 -53 -35 3 7 -8 2 -6 -22 -9 -25 21 10 21 -33 18 29 -21 -29 77 86 -23 -10 11 37
4732 37 14 33 30 -111 -95 30 82 59 -27 -67 -34 4 -18 66 64 -84 -114 -42 78 -2 -66 7 -96 -52 -9 66 87 -71
4760 -71 -147 -22 64 46 -14 -19 -31 -55 47 90 47 -61 -68 -8 80 111 30 12 -57 -83 57 92 100 -65 -129 -34 24 12 17 -9
$$ packed form
4559H4O2j66n6L3K6K6N0K0j90k4R0J93m7p5p3p3R4J21J4k6j21j84J34K35Kj77
4585b8p0J1k0R9J24L2j84m6J6R9O2n5q6k6n0J60J9L2p3j12j9J78M2l3l9j31k9
4612a27J46R4m1j47k6m9P1J48j5l3p4r0Q5J22J6j16k9Om4R7J12q3j13L1Q4Q0o5
4639D0K7p4k4j18J95M1k6r0o4J21No1N5J8p3L1l8O2j3q7O2L9m9K3M0j9l8m7O1
4668aM0o5L0J9M1j12K6Q1m4k9j5L0J5Qj1kK5j02P3Q2m7l5J9k6k8OM8%lK0j26O6
4700a7PK8k6N9p1q7R7m7MJ8L8Mj5J0qj6J3j6M6j1J1n4N1J1n0qJ06Rj09J3K1K6
4732C7k3J9lj41J6J25N2k3q6m0L3L8k2Q4kj48l0P2J20q0o4P3j03M4M3P5K1j58
4760g1p6J25Q6j8o0nj2k4J02M3m3j08pO0Q8L1q1j8o9k6J40L5Qj65o4R5N8j2Nk6
$$ plain form
4790 -9 -123 -89 19 149 85 -115 -35 -78 -36 57 58 31 -70 -92 16 106 43 -64 7 -23 -41 45 100 73 -100 -109 21
4817 21 147 5 -39 21 -27 -18 23 168 69 -98 -114 25 81 -20 2 33 -80 -79 55 101 30 -140 -117 -33 35 29 -1
4844 -1 19 -121 -73 94 156 -24 -50 -10 -34 -47 71 92 22 -89 -16 88 44 -3 -55 -45 -89 -37 56 92 -19 -148 -38
4871 -38 54 40 3 -3 -26 -72 -52 72 159 -29 -186 -8 66 23 -41 -23 0 -86 27 36 119 5 -162 -26 125 66 9
4898 9 70 30 -59 -35 59 134 -17 -89 -22 -11 17 16 67 3 -41 10 78 38 -23 -50 21 -39 -9 117 50 -63 -139 12 22
4927 22 9 -13 -16 -65 -63 21 66 65 -62 -77 -4 56 -18 -18 -16 -21 -4 -12 62 15 22 -28 54 38 -32 10 41 -65 -12 13 87 -10 -61
4960 -61 -19 -10 -52 -38 -4 -55 -46 -72 46 52 -17 -75 -13 -45 2 17 34 -17 -28 -24 84 56 -33 -70 9 57 -69 -11 48 37 -44
4991 -44 15 60 15 18 -9 29 29 -8 -22 65 -11 -135 36 85 37 -52 -6 -12 -13 -54 46 47 -27 -56 -4 85 -8 -76 7 39 -24
$$ packed form
4790ij14L4J08J30o4k00Q0m3M2R3Jk7j01k2J08R0o3j07P1l0j8Q6N5k7j73rJ30
4817B1J26j42m4O0m8RM1J45r9j67j6J39N6j01K2L1j13JJ34M6p1j70K3Q4O8ol0
4844aK0j40M8J67O2j80k6M0k4j3J18K1p0j11P3J04m4m7n2J0m4N2R3L6j11j29J10
4871c8R2j4l7ok3m6K0J24Q7j88j57J78P4m3o4J8K3q6J13RQ3j14j67J36J51n9n7
4898IO1m0q9K4R4P5j51p2O7J1K8jN1o4m4N1O8m0o1k7P1o0L0J26o7j13p6J51J0
4927B2j3k2lm9KQ4M5jj27j5P3O0p4%KnJ7qP4m7Pn0Q2j6p0M2L1j06N3K5P4r7n1
4960f1M2Rm2J4L4n1Rk6J18Oo9n8O2l2M7J5J7n1j1MJ08k8q9l7P9M8j26N8N9j1q1
4991d4N9M5m5Lk7L8%l7j4Q7p6j24J71M9m8q9M6ojm1J00Jp4k9N2Q9r3o8Q3L2o3
$$ plain form
5022 -24 5 57 18 -13 -57 -7 112 -42 63 5 11 -4 14 27 0 -51 -22 -16 42 -65 -44 -1 41 -2 22 10 -15 -93 -48
5051 -48 42 -11 -98 -10 0 -54 -26 82 -18 -47 -31 52 23 -44 35 -17 64 -8 -3 20 17 14 -90 -4 87 -38 39 1 -47 -5
5081 -5 4 52 14 -28 -47 -50 72 -1 52 46 -16 -89 9 115 -7 -153 -91 22 -31 20 9 16 -83 -76 76 64 57 -43 -89 12
5111 12 11 37 65 33 -55 -43 73 92 -2 -24 -4 -26 -36 72 94 15 -122 -19 92 136 -65 -90 30 -16 -17 58 151 -74
5139 -74 -232 -55 94 75 -11 -40 -4 -81 8 85 62 -58 -119 -6 11 61 1 96 -23 -89 -31 148 131 -57 -62 37 27
5166 27 122 133 38 -101 -178 11 141 69 -24 -113 -98 13 17 90 45 -112 -210 -1 117 82 -22 -70 -39 -109 40 183
5192 183 94 -51 -191 -29 118 78 47 -10 -77 -80 62 205 78 -55 -165 -21 87 74 69 -21 -114 -190 26 227
5216 227 75 -132 -240 -91 36 45 132 24 -222 -170 -13 186 180 -71 -120 -89 -96 120 178 46 -165 -188 11 154
$$ packed form
5022b4K9N2l9l1m4N0J19j54J05n8Oj5J8J3k7n1K9ON8j07K1M3M2m3K4j2k5p8M5
5051d8R0n3q7Q8J0n4K8J08j00k9J6Q3k9o7P9n2Q1p2NK3llj04Q6R1j25P7l8m8M2
5081eRM8l8m2j9lJ22p3N3oo2p3R8J06j22j46O2J13n3N1j1Pr9PJ52j2pj00m6J01
5111A2jK6K8l2q8J2J16J9r4k2K0k2j0J08K2p9j37J03J11M4k01k5J20m6jP5R3k25
5139g4j58J77J49j9q6k9L6p7Q9P7k3j20o1J13J7N0o0R5j19o6N8J79j7j88nR9j0
5166B7R5J1r5j39p7J89J30p2r3q9J5J11MP3m5j57r8K09J18l5j04m8L1p0J49J43
5192A83q9j45j40J62J47m0l1n7o7lJ42J43j27j33j10J44J08j3nr0r3p6K16K01
5216B27j52k07j08J49J27RQ7j08k46N2J57J99ok51m9L1pK16N8j32k11k3J99J43
$$ plain form
5240 154 145 24 -8 -122 -49 118 242 100 -100 -104 -7 95 83 92 8 -93 -142 67 152 32 -83 -148 -49 15 132
5265 132 110 1 -138 -146 104 187 103 -84 -90 -51 -94 63 158 62 -80 -66 -11 107 126 -19 -71 -49 -87 64 137 20
5291 20 -67 -103 17 66 42 3 -66 -53 -34 43 124 45 -50 -65 14 54 -1 29 3 -96 -166 66 120 -32 -114 -28 -22 -35 22
5320 22 26 48 -70 -53 97 70 56 -37 -13 5 14 20 67 -37 -65 5 -14 68 14 -26 -22 -9 -32 -4 104 -8 -31 -15 29 0
5350 0 -37 50 13 -23 -7 48 25 -18 -47 -29 4 -78 -3 73 81 13 -41 63 31 -7 20 36 38 -16 11 42 5 -31 2 41 51
5381 51 -43 -31 6 54 -69 -39 -37 34 -56 -9 -19 11 -88 0 4 2 -103 -37 38 17 -5 -33 36 -35 -142 37 98 47 -28 -42
5411 -42 -10 16 54 46 41 -79 -72 23 66 -6 16 -37 44 -60 9 118 -12 -129 -91 -5 110 49 -35 38 -62 -52 28 85
5439 85 65 -106 -144 48 23 39 28 -8 -69 -146 74 97 57 -57 -58 -38 29 52 42 2 -133 -87 98 138 95 -40 -9
$$ packed form
5240A54rj21l2j14P3J67J24j42k00mR7J02j2Rq4j01m9K09Q5j20j15o5R9O4J17
5265A32k2j09j39qK50Q3q4j87oL9m3J57R5r6j42J4N5J18J9j45n2K2l8J51P3j17
5291B0q7l6J20M9k4l9o9J3J9P7Q1p9r5j5P9M0n5L0k6r9p0K32N4j52q2Q6Oj3N7
5320B2MK2j18J7J50k7j4r3K4J8ROM7j04k8P0j9Q2n4m0MJ3k3K8J08j12k3J6M4k9
5350@l7Q7l7l6J6N5k3m3k9J8L3q2P5P6Qo8n4J04l2l8K7J6Kn4K7L1l7l6L3L9J0
5381E1r4J2L7M8j23L0KP1r0M7j0L0r9Q8Mkj05O6P5k1k2k8O9p1j07J79O1n1p5j4
5411d2L2K6L8qnj20PR5M3p2K2n3Q1j04O9J09j30j17L8Q6J15o1q4P3j00J0Q0N7
5439H5k0j71l8J92k5J6j1l6o1p7K20K3m0j14jK0O7K3j0m0j35M6J85M0m3j35L1
$$ plain form
5466 -9 -69 -67 58 96 15 -145 -107 23 140 71 -65 -41 -89 -115 90 127 -10 -148 -103 -8 34 65 74 29 -111 -32 62
5493 62 197 -14 -131 -64 23 -25 105 64 -52 -187 -73 51 159 50 -74 -60 1 -5 103 107 -28 -180 -113 120
5517 120 133 23 -9 -15 -125 -86 87 181 -57 -141 -121 52 14 33 10 -48 -104 -26 117 220 35 -96 -56 -2 55 60
5543 60 96 -24 -100 -12 152 115 -10 -83 -127 -14 23 79 67 24 -172 -29 119 71 -30 -2 -84 -74 51 118 99 -39
5569 -39 -111 -38 34 41 2 -15 19 -110 -52 119 30 -35 -57 -29 16 33 25 34 -47 -95 37 190 109 -23 -27 -20 76 15 49 -3
5599 -3 -53 -53 35 39 59 -33 -78 -4 -82 -2 69 13 -33 -73 -21 70 27 -11 -22 8 -48 -22 27 14 -46 -78 -27 51 -42 -32 29 -16
5631 -16 -41 43 69 24 17 17 62 35 19 -7 49 -25 -85 30 30 115 -72 2 -16 -10 21 -13 45 -102 12 -15 14 -6 -30 -26 12
5662 12 37 -6 0 19 -6 -71 51 19 -31 35 12 -66 49 30 34 10 -26 31 14 33 -39 -13 18 67 50 -9 72 -69 -80 21
$$ packed form
5466io0KJ25L8q1j60L8J30J17o9j36K4m8k6K05L7j37j38M5R5M2L1Rm5j40P9R4
5493F2J35k11j17O7Q7m8J30m1j16j35J14J24J08j09j24J4O1oJ08Mj35j52O7K33
5517A20J3j10l2oj10L9J73R4k38q4K0J73l8J9k3n8n6P8J43J03j85j31M0N4N7N
5543F0L6j20p6Q8J64l7j25p3m4J13L7N6j2m3j96J43J48m8j01K8q2J0J25O7j9j38
5569c9p2P3P2Pl9j7L4j29N8J71q9o5k2K8M5J7qRq1m8J32J53q1j32mPR6o1L4n2
5599cn0%Q8MK0r2m5P4p8Q0P1n6m6m0N2R1m3l8j1L0n6K6M9j3o0l2N1P8r3J0O1m5
5631a6k5Q4K6m5p%M5k7j6k6N6p4o0J15%Q5j87P4j8OL1l4N8j47J14k7K9k0k4ML8
5662A2K5m3OJ9k5o5J22l2n0O6k3p8J15j9Mk4l6N7j7J9p2K6L1M9j7n9Q1j41j1J01
$$ [...]
8191B4
##END NTUPLES=NMR FID
##END=
