##TITLE=1H_E3b0502-2
 CDCl3
 8 sc, 
 6.2.2024
##JCAMPDX= 6.0         $$ Bruker NMR JCAMP-DX V2.0
##DATA TYPE= NMR FID
##DATA CLASS= NTUPLES
##ORIGIN= UXNMR, Bruker Analytische Messtechnik GmbH
##OWNER= root
$$ XWIN-NMR		Version 3.5
$$ Tue Feb  6 14:49:39 2024 Russian Standard Time (UT+4h)  she@DPX200
##.OBSERVE FREQUENCY= 200.1313
##.OBSERVE NUCLEUS= ^1H
##.DELAY= (6, 6)
##.ACQUISITION MODE= SIMULTANEOUS
##.ACQUISITION SCHEME= undefined
##.AVERAGES= 8
##.DIGITISER RES= 18
##SPECTROMETER/DATA SYSTEM= spect
##.PULSE SEQUENCE= zg30
##.SOLVENT NAME= CDCl3
##.SHIFT REFERENCE= (INTERNAL, CDCl3, 0, 15.7039)
##AUDIT TRAIL= $$ (NUMBER, WHEN, WHO, WHERE, WHAT)
$$ ##TITLE= Audit trail, XWIN-NMR		Version 3.5
$$ ##JCAMPDX= 5.01
$$ ##ORIGIN= Bruker BioSpin GmbH
$$ ##OWNER= she
$$ F:/spectra/data/she/nmr/H-F/1/audita.txt
$$ ##AUDIT TRAIL=  $$ (NUMBER, WHEN, WHO, WHERE, WHAT)
(   1,<2024-02-06 14:48:10.76 +0400>,<she>,<DPX200>,
      <created by zg, POWCHK disabled, PULCHK disabled
       configuration hash MD5:
       00 E9 B6 7A A2 85 ED C7 34 08 36 98 17 FE 4E 26
       data hash MD5: 16K
       6D 30 E2 16 21 33 2F 26 25 86 8F B8 DC B3 0B D2>)
$$ ##END=
$$ 
$$ hash MD5
$$ 1C 4B 71 AE 51 2A 71 83 99 2A F5 95 58 3A 99 C2
##$RELAX= 
##$RELAX= 
##$RELAX= 
##$RELAX= 
##$RELAX= 
##$RELAX= 
$$ Bruker specific parameters
$$ --------------------------
##$DU= <F:/spectra>
##$EXPNO= 1
##$NAME= <H-F>
##$PROCNO= 1
##$TYPE= <nmr>
##$USER= <she>
##$AMP= (0..31)
100 100 100 100 100 100 100 100 100 100 100 100 100 100 100 100 100 100 
100 100 100 100 100 100 100 100 100 100 100 100 100 100 
##$AQSEQ= 0
##$AQ_mod= 1
##$AUNM= <au_zg>
##$AUTOPOS= <>
##$BF1= 200.13
##$BF2= 200.13
##$BF3= 200.13
##$BF4= 200.13
##$BF5= 200.13
##$BF6= 200.13
##$BF7= 200.13
##$BF8= 200.13
##$BYTORDA= 1
##$CFDGTYP= 0
##$CFRGTYP= 5
##$CHEMSTR= <none>
##$CNST= (0..31)
1 1 145 1 1 1 1 1 1 1 1 1 1 1 1 1 1 1 1 1 1 1 1 1 1 1 1 1 1 1 1 1 
##$CPDPRG= <>
##$CPDPRG1= <>
##$CPDPRG2= <>
##$CPDPRG3= <>
##$CPDPRG4= <mlev>
##$CPDPRG5= <mlev>
##$CPDPRG6= <mlev>
##$CPDPRG7= <mlev>
##$CPDPRG8= <mlev>
##$CPDPRGB= <>
##$CPDPRGT= <>
##$D= (0..31)
0 1.2 0 0 0 0 0 0 0 0.06 0 0.03 0 0 0 0 0.0002 0 0 0 0 0 0 0 0 0 0 0 0 
0 0 0 
##$DATE= 1707216490
##$DBL= (0..7)
120 120 120 120 120 120 120 120 
##$DBP= (0..7)
150 150 150 150 150 150 150 150 
##$DBP07= 0
##$DBPNAM0= <>
##$DBPNAM1= <>
##$DBPNAM2= <>
##$DBPNAM3= <>
##$DBPNAM4= <>
##$DBPNAM5= <>
##$DBPNAM6= <>
##$DBPNAM7= <>
##$DBPOAL= (0..7)
0.5 0.5 0.5 0.5 0.5 0.5 0.5 0.5 
##$DBPOFFS= (0..7)
0 0 0 0 0 0 0 0 
##$DE= 6
##$DECBNUC= <off>
##$DECIM= 32
##$DECNUC= <off>
##$DECSTAT= 4
##$DIGMOD= 1
##$DIGTYP= 9
##$DL= (0..7)
0 120 120 120 120 120 120 120 
##$DP= (0..7)
150 150 150 150 150 150 150 150 
##$DP07= 0
##$DPNAME0= <>
##$DPNAME1= <>
##$DPNAME2= <>
##$DPNAME3= <>
##$DPNAME4= <>
##$DPNAME5= <>
##$DPNAME6= <>
##$DPNAME7= <>
##$DPOAL= (0..7)
0.5 0.5 0.5 0.5 0.5 0.5 0.5 0.5 
##$DPOFFS= (0..7)
0 0 0 0 0 0 0 0 
##$DQDMODE= 0
##$DR= 18
##$DS= 0
##$DSLIST= <SSSSSSSSSSSSSSS>
$$ [...]
##$SUBNAM2= <"">
##$SUBNAM3= <"">
##$SUBNAM4= <"">
##$SUBNAM5= <"">
##$SUBNAM6= <"">
##$SUBNAM7= <"">
##$SUBNAM8= <"">
##$SUBNAM9= <"">
##$SW= 18.0517328524113
##$SWIBOX= (0..15)
0 0 2 0 0 0 0 0 0 0 0 0 0 0 0 0 
##$SW_h= 3612.71676300578
##$TD= 16384
##$TD0= 1
##$TE= 0
##$TE2= 300
##$TE3= 300
##$TEG= 300
##$TL= (0..7)
0 120 120 120 120 120 120 120 
##$TP= (0..7)
150 150 150 150 150 150 150 150 
##$TP07= 0
##$TPNAME0= <>
##$TPNAME1= <>
##$TPNAME2= <>
##$TPNAME3= <>
##$TPNAME4= <>
##$TPNAME5= <>
##$TPNAME6= <>
##$TPNAME7= <>
##$TPOAL= (0..7)
0.5 0.5 0.5 0.5 0.5 0.5 0.5 0.5 
##$TPOFFS= (0..7)
0 0 0 0 0 0 0 0 
##$TUNHIN= 0
##$TUNHOUT= 0
##$TUNXOUT= 0
##$USERA1= <user>
##$USERA2= <user>
##$USERA3= <user>
##$USERA4= <user>
##$USERA5= <user>
##$V9= 5
##$VALIST= <valist>
##$VCLIST= <CCCCCCCCCCCCCCC>
##$VD= 0
##$VDLIST= <DDDDDDDDDDDDDDD>
##$VPLIST= <PPPPPPPPPPPPPPP>
##$VTLIST= <TTTTTTTTTTTTTTT>
##$WBST= 1024
##$WBSW= 4
##$XGAIN= (0..3)
0 0 0 0 
##$XL= 0
##$YL= 0
##$YMAX_a= 506435
##$YMIN_a= -732355
##$ZGOPTNS= <>
##$ZL1= 120
##$ZL2= 120
##$ZL3= 120
##$ZL4= 120
##$ABSF1= 10
##$ABSF2= 0
##$ABSG= 5
##$ABSL= 3
##$ALPHA= 0
##$AQORDER= 0
##$ASSFAC= 0
##$ASSFACI= 0
##$ASSFACX= 0
##$ASSWID= 0
##$AUNMP= <proc_1d>
##$AZFE= 0.1
##$AZFW= 0.1
##$BCFW= 1
##$BC_mod= 2
##$BYTORDP= 1
##$COROFFS= 0
##$CY= 11.3945322036743
##$DATMOD= 1
##$DC= 2
##$DFILT= <>
##$DTYPP= 0
##$F1P= 15.7292609196834
##$F2P= 12.9074282941183
##$FCOR= 0.5
##$FTSIZE= 0
##$FT_mod= 4
##$GAMMA= 1
##$GB= 0.15
##$INTBC= 1
##$INTSCL= 1
##$ISEN= 128
##$LB= 0.24
##$LEV0= 0
##$LPBIN= 0
##$MAXI= 10000
##$MC2= 0
##$MEAN= 0
##$ME_mod= 0
##$MI= 1.114404
##$NCOEF= 0
##$NC_proc= 0
##$NLEV= 6
##$NOISF1= 3.799351
##$NOISF2= 2.8
##$NSP= 1
##$NTH_PI= 0
##$NZP= 0
##$OFFSET= 15.70392
##$PC= 1
##$PHC0= -24592.5
##$PHC1= 8.452681
##$PH_mod= 1
##$PKNL= yes
##$PPARMOD= 0
##$PSCAL= 0
##$PSIGN= 0
##$REVERSE= no
##$SF= 200.130013532006
##$SI= 16384
##$SIGF1= 3
##$SIGF2= 2
##$SINO= 400
##$SIOLD= 16384
##$SREGLST= <1H.CDCl3>
##$SSB= 0
##$STSI= 0
##$STSR= 0
##$SW_p= 3612.71676300578
##$SYMM= 0
##$S_DEV= 0
##$TDeff= 0
##$TDoff= 0
##$TI= <>
##$TILT= no
##$TM1= 0
##$TM2= 0
##$TOPLEV= 0
##$USERP1= <user>
##$USERP2= <user>
##$USERP3= <user>
##$USERP4= <user>
##$USERP5= <user>
##$WDW= 1
##$XDIM= 8192
##$YMAX_p= 0
##$YMIN_p= 0
$$ End of Bruker specific parameters
$$ ---------------------------------
##NTUPLES= NMR FID
##VAR_NAME=  TIME,          FID/REAL,        FID/IMAG
##SYMBOL=    X,             R,               I
##VAR_TYPE=  INDEPENDENT,   DEPENDENT,       DEPENDENT
##VAR_FORM=  AFFN,          ASDF,            ASDF
##VAR_DIM=   8192,          8192,            8192
##UNITS=     SECONDS,       ARBITRARY UNITS, ARBITRARY UNITS
##FACTOR=    0.0002768,     1,               1
##FIRST=     0,             0,               0
##LAST=      2.2672688,     0,               0
##MIN=       0,             -732355,         0
##MAX=       2.2672688,     506435,          0
$$ Real data points
##PAGE= N=1
##DATA TABLE= (X++(R..R)), XYDATA
0@%%%%%%%%%%%qJ6j6J6j6K4l2L2m0N3o1P1q3R5j12J30j46J68j97K24k52K85l23
34a72L66m12M60n14N75o39P10p88Q72r66J068j177J298j431J576j738J914k108
52a106K326k567K841l151L502l911M392m962N656o520P625r098J1155j4232J9310
67A1260k9089N4312k34815n34023N16403K77257j23216L58895K09451o90979l70603
78e55147M91223K17270j55468L16092J14968o43598k48394M77833P5316k13369
88a23274K49771J06236m49890o5221M47949J5483k65304J41292M8383l19914Q8074
99a26415M10882j01706l16543M9741J4628j65686K04857L75606j24670l33397
109a12703k9132j1688m6553K96855K91874j95690l01913o9322m4289L9564L10021
$$ plain form
0 0 0 0 0 0 0 0 0 0 0 0 0 -8 8 -8 8 -8 16 -16 16 -24 29 -32 39 -44 51 -61 69 -77 91 -106 118 -134 151 -172
34 -172 194 -218 242 -272 303 -336 374 -414 458 -508 560 -617 681 -750 826 -912 1002 -1106
52 -1106 1220 -1347 1494 -1657 1845 -2066 2326 -2636 3020 -3500 4125 -4973 6182 -8050 11260
67 11260 -17829 36483 -198332 -732355 -215952 61305 -61911 296984 506435 -184544 -555147
78 -555147 -63924 153346 -2122 313970 428938 -214660 -463054 14779 90095 -123274
88 -123274 126497 232733 -217157 -282378 165571 181054 -84250 57042 105425 -214489 -126415
99 -126415 284467 182761 -133782 -84041 -69413 -235099 -30242 345364 220694 -112703
109 -112703 -141835 -153523 -200076 96779 388653 192963 -108950 -178272 -222561 -182997 127024
120A27024K15105j87307k52645p2891l0058J00680K76658Q7064j81828j47191
130f5389p6450m3719J37820K08896q023j51549o8420k9736r962J42411J29182
141A65061j00999j14750J3777k5260M362J48552M0048j65492q1218P2953K4908
152a8058K5007J20388k1561k00311l8750J15784K4567M0688J02174q9668k07313
163a47053L639J43032L9976K9024P0181j04691j90192L5323J39255K2883L4718
174G6095M2950j28059j45745O2749J21215J2876J6790K7741j05890j07554P4505
185e2327R3108k279J5820k317r5332m4976P3996N3953j4534j54p803o3295j0685
198e6825P2354K3441k4655j962k7937l4077L9686M8381j3826k1645j454k6126
$$ plain form
120 127024 342129 154822 -97823 -170714 -200772 -100092 176566 263630 81802 -65389
130 -65389 -141839 -185558 -47738 161158 153135 1586 -66834 -96570 -106532 35879 165061
141 165061 64062 -50688 -36911 -62171 -57809 90743 130791 -34701 -115919 -42966 -18058
152 -18058 6949 127337 105776 -94535 -133285 -17501 7066 47754 149928 60260 -147053
163 -147053 -143414 -382 39594 68618 138799 34108 -156084 -120761 18494 41377 76095
174 76095 119045 -9014 -154759 -92010 29205 42081 58871 86612 -19278 -126832 -52327
185 -52327 40781 38502 54322 52005 -43327 -88303 -14307 39646 25112 24958 17155 -46140 -56825
198 -56825 15529 38970 14315 12353 -15584 -49661 -9975 38406 24580 2935 1481 -24645
210b4645j8220N3031M1960l5751k1488L942l5917J384O6782Q741m4811J339O370
223B717m0373L319O9949M114n4760J2694J7598m8334Q678O3502j8842m3328L1277
236H211J3432n0464L716N8093k0190m6322M3134K2462n6589P5M4567k2578k0636
249b3089M5407J0019n3632m528M1681j5717j9699M9435O694o4535o359M1603k080
262E200o711K7230n591n0955o516M3516P364p478K0536j6594n1673Q405M7987
275A4720J2739j0029l361j8493l3924Q816M9365J5985j7757j3922k7473k2889
287d6223K9032M7675J0917k5772l0451j8972l436L1717M8339N280l8738l7979
299b8611j7547J9518M7193K9904j2051m4765l9930K29L3964M5137K3087k9545
$$ plain form
210 -24645 -42865 10166 52126 16375 -5113 -1171 -37088 -35704 31078 39819 -4992 -3653 2717
223 2717 -37656 -34337 35612 39726 -15034 -2340 15258 -33076 -24398 39104 20262 -23066 8211
236 8211 21643 -28821 -25105 32988 12798 -33524 9610 32072 -24517 -24442 20125 -2453 -23089
249 -23089 22318 32337 -21295 -25823 15858 141 -19558 29877 36571 -27964 -34323 7280 5200
262 5200 -1511 25719 20128 -30827 -37343 6173 13537 6059 26595 10001 -41672 -33267 14720
275 14720 27459 17430 14069 -4424 -38348 -29532 19833 35818 18061 4139 -23334 -46223
287 -46223 -17191 30484 41401 15629 -14822 -33794 -37230 -5513 42826 48106 9368 -28611
299 -28611 -46158 -26640 20553 50457 38406 -6359 -46289 -46060 -12096 33041 56128 26583
311B6583n3769k8849J4985N1524M2620n966m0313m6015j7389L2139N4180L1810
323F1540j8581n6471l9826M258M0946N4773J5048m3668n3554k3605J8717N1423
335A1000M6283L55n4787n9113k580M2885M9450L1790k1671o5507m2174J4730N2034
348B695M9182J0723l9404o7439l0358M1730O1095L0491r067n1438n8567n058N1988
361a3427N9890J9532l3342n7803m1938J5207O5552M9242m752m5344n8391k2631
373f8205L6602O0887L7262j8144o1845n0595K568N4022N8342J2977l5295n8392
385b9816l9870K3895O4281M2138l426m5988o1474j9225M6373O4169K1360k7415
397C5002m6027m5907p110O0381O2337k282m1838m4902l0960J7314O4975M6590
$$ plain form
311 26583 -27186 -56035 -41050 10474 53094 47128 6815 -39200 -56589 -24450 29730 61540
323 61540 42959 -13512 -53338 -49080 -8134 46639 61687 18019 -35535 -59140 -40423 11000
335 11000 57283 57638 2851 -56262 -58842 -15957 33493 65283 43612 -21895 -64069 -49339 2695
348 2695 51877 62600 23196 -44243 -74601 -32871 28224 58715 49648 -1790 -60357 -65415 -13427
361 -13427 46463 65995 32653 -25150 -67088 -51881 13671 62913 58161 12817 -45574 -68205
373 -68205 -31603 29284 66546 48402 -13443 -64038 -61470 -7448 50894 63871 28576 -29816
385 -29816 -69686 -45791 18490 60628 57202 11214 -50260 -69485 -23112 41057 62417 35002
397 35002 -11025 -56932 -64042 -3661 58676 56394 14556 -30346 -61306 -43992 20983 67573
409F7573k2036n3229l3246j1671K6250O6856L0899m4387n6362k2856Q049M1432
421b728N4370R906n3555n5218n760K5831M3428M4319q976o2912m5699P961M2312
434f721M5038J8512k4493n5932l6581J9523M9891L8349J796l9381m7603j7539
446e5141K5848N3630K9531k2350l9319k8104q994K9052N3256J8163m0127m3044
458b7599n371P006K1191M7601O389n8305l3593J8351J2975J6487M0456n165o9328
471b8905k6234M5404K0045J307L3208j2924p7765j1572O2032J8951p813K4592
483D0326j8940p9013j262P7758J2816k3864K5224j7615p8263J0455Q1371N204
495C4197l0816K1745j2896o9945J6238Q2407q613m1704K7579p155o3453K4066
$$ plain form
409 67573 45537 -7692 -40938 -52609 -26359 40497 71396 27009 -29353 -52209 -44160 -2728
421 -2728 51642 61548 7993 -47225 -52985 -27154 16274 60593 51617 -11295 -56994 -49033 -6721
434 -6721 38317 56829 32336 -23596 -60177 -40654 9237 47586 49382 10001 -37602 -55141
446 -55141 -29293 24337 53868 31518 -7801 -35905 -44899 -15847 37409 55572 15445 -27599
458 -27599 -32970 -25964 -4773 42828 49217 -9088 -42681 -24330 -11355 5132 45588 40423 -28905
471 -28905 -55139 -9735 10310 11617 44825 31901 -45864 -57436 4596 23547 15734 40326
483 40326 21386 -57627 -58889 18869 31685 7821 33045 15430 -62833 -52378 28993 34197
495 34197 3381 25126 12230 -57715 -41477 40930 32317 -9387 18192 11037 -52416 -28350
507b8350P4431k1672m6762K7611L657m9966K6861O5399l6490m9625L4740R057
519H891l8821L2131N1153m5076m9905L3595J7223k7303K8720L9001m9220m3873
531d3484L3240J4005j7262L0191K5608m6296l5415K8810J4471j2738K5458J9740
543C6328l9905k5548K3213P099o353K0153Q726k8454j4626J6448L376o587J3165
556G035N334j7758l290J0314k437j701N419k526l321O245L075n965k056J592n639
571e679K453J2119k894q347M209n147j0459J1890J3086j0013n486R841m987j4684
585a4098J1390J5037j2794m142J6455q277j6882J3221Q557j5907K642J9978q839
598F341j9137J0091O860j7222P167K4279r707j7477Q161j521j4013J3910K4023
$$ plain form
507 -28350 46081 24409 -22353 5258 8915 -41051 -14190 51209 14719 -34906 -166 8891
519 8891 -29930 2201 53354 8278 -41627 -8032 9191 -18112 10608 49609 389 -43484
531 -43484 -10244 3761 -13501 16690 42298 -3998 -39413 -10603 3868 -8870 16588 36328
543 36328 -3577 -29125 -5912 1187 -5166 14987 23713 -4741 -19367 -2919 457 -6130 7035
556 7035 12369 -5389 -8679 1635 -802 -2503 2916 390 -2931 3314 6389 424 -1632 -40 -5679
571 -5679 -3226 8893 5999 -2348 1861 -3286 -13745 -1855 11231 1218 -4268 5573 586 -14098
585 -14098 -2708 12329 -465 -4607 11848 3571 -13311 -90 8467 -7440 -4798 15180 6341
598 6341 -12796 -2705 4155 -13067 -5900 18379 8672 -8805 -644 -2165 -16178 -2268 21755
611B1755j0016j7945M783l217j2888J7210K2619j1935j5548J259p151l950J9480
624D456J4293j2195j2120P98n365k17K0197Q142j6114p361P75m474Q084J5676
638A4575m194j5076k834J547j488J1962J3728j3906j8315M360L849J655J8605
651A4468O628k4142j5359R361N534M406K0282K293l3238j5663J7465P092M443
664C570K0611n281l6748r752K1754P903L857J8543q581l9620l182K9489N313q90
678F986J5673j3137l6078L842L1144L852n364R260j4388l2889J2060L5314j534
691A4741j1271N672j5351k3910J8430L4448l132j7024j616j2538j5723K4778L2210
704B9714j0656k1577l583j0050o612K6453K7325j3742k6433n263k328J515K5991
$$ plain form
611 21755 11739 -6206 -1423 -4640 -17528 -318 22301 10366 -5182 -3923 -11074 -15024 4456
624 4456 18749 6554 -5566 -4768 -10133 -10350 9847 17989 1875 -5486 -4711 -9185 -1101 14575
638 14575 10381 -4695 -7529 -5982 -7470 4492 18220 4314 -14001 -9641 -5792 -4137 14468
651 14468 21096 -3046 -18405 -9044 -3510 896 21178 23471 -9767 -25430 -7965 -873 3570
664 3570 24181 18900 -17848 -27600 -5846 2057 5914 24457 15876 -23744 -26926 2563 7876 6986
678 6986 22659 9522 -26556 -22714 8430 12282 6918 16178 1790 -31099 -19039 16275 14741
691 14741 3470 9142 -6209 -30119 -11689 22759 19627 2603 987 -11551 -27274 -2496 29714
704 29714 19058 -2519 -6102 -16152 -22764 3689 31014 17272 -9161 -14424 -16752 -15237 10754
717A0754J9990j8563k4819m042K414Q539K2469J2085k1045k5712q75R911J0246
730A352J7603L555k3533k0749K420J4201J4457J0611m604k2692j7043R031J9533
743D142J2028L594j1770k1209r416J1795K1016J1186o005j7137j7202k273J6839
756d412J9586M892j0887j8717j1297N050J7671J7889Q17j8248j7080m216J0089
769h863J8104J1466n342j8012j6041J308J4833J5175O884j0265j9967r718P448
782a2990J6265J3362K38j3966j6708n421J2144J8039P771n350j6844j4404K642
795a5222J4950J4642K776j1326j6018q259O290J7060J2448l641j4001j3794k168
808a6263J1714J4429O780o145j5137j0244K580J2445J3477J673j1114j3575n877
$$ plain form
717 10754 30744 12181 -12638 -16680 -14266 -5727 16742 28827 7782 -17930 -18805 -8894 1352
730 1352 18955 22510 -1023 -21772 -19352 -5151 9306 19917 15313 -7379 -24422 -15391 4142
743 4142 16170 19764 7994 -13215 -22631 -10836 10180 21366 15361 -1776 -18978 -21251 -4412
756 -4412 15174 20066 9179 -9538 -20835 -15785 1886 19775 20592 2344 -14736 -18952 -8863
769 -8863 9241 20707 15365 -2647 -18688 -17380 -2547 12628 19512 9247 -10720 -20438 -12990
782 -12990 3275 16637 16875 2909 -13799 -19220 -7076 10963 18734 13384 -3460 -17864 -15222
795 -15222 -272 14370 17146 5820 -10198 -18457 -12167 4893 17341 13700 -301 -14095 -16263
808 -16263 -4549 9880 16660 10515 -4622 -14866 -12286 159 13636 15309 4195 -9380 -15257
821a5257O163J3944Q626k711j1601j2137q61R849J2791O021p329j3364o617L091
835i392J0874J0412O74r541j1822m342P414J0730O573k558j2143r246K139Q748
849a480Q628L332n148r947p003M017J1806N416j206n628r437l693P204Q732K852
864H445l454o164o192k216P624R775o32n989m427l646Q10P759O635k127p199l394
880d392K37O69O686O008n445q138m30K384R52L348M101l879q446R53N680M6J320
897A654M340m962p051L225N514j051j213M189k595q305K886P858l396l301N292
912C084j731p461L103P074l551m728O611J513q896K584Q606n555n513Q145K124
927E409q447O05P128n208n910R388L500j1082O41Q096o334m717J1218L455j2139
$$ plain form
821 -15257 -9094 4850 13476 10765 -836 -12973 -13834 -3985 8806 14827 7498 -5866 -12483 -9392
835 -9392 1482 11894 12568 3027 -8795 -13137 -5723 5007 11580 9022 -3121 -12367 -10228 -1480
849 -1480 7148 10480 5332 -4615 -11618 -7601 4205 9621 8415 2787 -6650 -10343 -3139 5593 8445
864 8445 4991 -1173 -7365 -9581 -1957 7818 7186 1197 -3230 -6876 -6066 1693 8328 6201 -998 -4392
880 -4392 -4155 -3486 3200 9208 3763 -4375 -4805 -2421 -1469 1879 5980 2101 -6345 -5392 288 334 1654
897 1654 5994 1032 -6019 -2794 2720 1669 456 4645 2050 -6255 -3369 4489 1093 -2208 3084
912 3084 1353 -6108 -3005 4069 518 -4210 2401 3914 -4982 -2398 6208 653 -4860 3285 5409
927 5409 -3038 -2433 4695 -513 -6423 2965 6465 -4617 -3976 4120 -2214 -6931 4287 7742 -4397
942d397q77R433m072n301J0306K755j3085L41R251m185m112R443J54j2713p6J1404
958D269k278n294P701m47j2944K514J1918j615l991M977l063j0975L081J3048
972F901n00n747K530m105j0129N717J2096M1m857j964m554n417O610J1529o30
987G521o275k459m406k071Q033Q546j524o658n072k309K576O923M778l082o665
1002b144m417l43N744O894N03m441n783m087L201R040M600l445n823m914k378
1017g793M870J0785K561q251o693l283j024Q047J1438q73j0902o133j020J252
1031g019R343J1402m025j3707m629J962K705R642Q032p015j3369l220M223M245
1045a430Q280M765r104j2214L25O126N212O113Q55r744q877K258P958M991L244
$$ plain form
942 -4397 -5274 4159 87 -5214 5092 7847 -5238 -4897 4354 169 -3943 5500 5654 -7059 -7135 4269
958 4269 1991 -3303 4398 3951 -8993 -6479 5439 3824 -167 4810 1747 -9228 -6147 6901
972 6901 6401 654 3184 -921 -11050 -5333 6763 6804 1947 -17 -4571 -9988 -3378 8151 7521
987 7521 1246 -1213 -5619 -7690 343 8889 7365 707 -4365 -6674 -4098 2825 7603 4521 -2144
1002 -2144 -6561 -6904 -1160 5734 6237 1796 -3987 -8074 -4873 4167 8767 5322 -501 -5415 -7793
1017 -7793 -2923 7862 10423 2172 -4521 -7804 -8828 -781 10657 9784 -1118 -7251 -8271 -7019
1031 -7019 2324 13726 9701 -4006 -8635 -6673 -3968 5674 13706 6691 -6678 -9898 -5675 -1430
1045 -1430 6850 11615 2511 -9703 -9378 -3252 1960 8073 8928 -816 -9693 -7435 523 5514 8758
1060H758k930j0438n540N933P928L877k93p268q772j129P425Q320L688m285r369
1075d095p148M021R138O361K074n785j2345m091Q018Q521M587K25q043j2387j409
1090a2358J1285P058J042M05p918j2229K348J3562M401j481r90p065r908N157
1104f691J3923J077n588l33o141p814Q266J3262l035p883r98l315m514J0308J1522
1119A2046o405j0005Q94j341k294J1337J0197r947j1276J770J087k26J0070P474
1133A3381j1692j1217L283L074P18R469M383j2364r275M935M661Q94P143K587
1147I980j2179p939O672N194L55M378k54j0844m956P132N421n28J574j159q726
1162e879k535Q354N140j563q16k850n305p3P777M242k988k763k569l933J793P315
$$ plain form
1060 8758 5828 -4610 -10150 -4217 3711 7588 7295 27 -8745 -9874 -2449 5871 9559 5274 -4095
1075 -4095 -11243 -7222 1916 8277 10351 4566 -7779 -11870 -3852 4669 9256 9481 1438 -10949 -12358
1090 -12358 -1073 5985 7027 7432 -486 -12715 -10367 3195 7596 6115 5125 -1940 -11848 -6691
1104 -6691 7232 8309 2721 2388 -3753 -11567 -3301 9961 6926 -957 -1955 -5270 -9784 524 12046
1119 12046 5641 -4364 -3470 -4811 -7105 4232 14429 4482 -6794 -5024 -3937 -4163 5907 13381
1133 13381 1689 -9528 -6245 -3171 -2453 7016 11399 -965 -10240 -5305 -644 250 7393 9980
1147 9980 -2199 -10138 -3466 1728 2083 6461 6207 -4637 -9593 -2461 2960 2432 4006 2847 -5879
1162 -5879 -8414 -60 5080 3517 2701 -149 -5454 -5527 2250 6492 3504 741 -1828 -5761 -3968 3347
1178C347K780l409m372k981n03L168N277K607m063m582j534O45M130M256M53m045
1194A174m669q09K841L408J797n31l663m053J72L535L192N66j350k921k513J114
1210b710L836J834o73r14k319k111J798L626Q01k228j579n69j522J732L241K5
1226B268k451j163n07k38J990K663n54k659o27O43k30K011J842j316k372m02J70
1243i32P54J224M51j218j915m1J196q5P83Q71j268q96N00O60N72m8J65m85l52
1262f4M17j02m17L44N10r65O8J20m15k12K4M22M55q7p2l80l32R66M93j20L18n13
1284D58j102J33M17J137J10r08o61j223K29J540M97r6n57j260k54Q14J562J287
1302B123o94j799j010J98J263J624R4o63k245j105P87J313J896l2j584k669K74
$$ plain form
1178 3347 6127 2718 -1654 -4635 -5138 -1970 3307 5914 1851 -2731 -4265 -3620 510 4766 5219 1174
1194 1174 -3495 -4304 -1463 1945 3742 3211 -452 -4505 -4333 -798 2394 2960 1610 -1311 -3824 -2710
1210 -2710 1126 2960 2287 1373 -946 -3057 -1259 2367 3168 940 -639 -1208 -2730 -998 2243 2268
1226 2268 -183 -1346 -1853 -2091 -101 2562 2008 -651 -1278 -635 -865 1146 2988 1672 -700 -1102 -932
1243 -932 -178 1046 1497 279 -1636 -1677 -481 -566 217 1088 -180 -1076 -576 84 656 608 773 288 -64
1262 -64 353 251 -166 178 688 -277 -209 -89 -504 -716 -692 -270 185 98 26 -354 -686 280 773 653 971 458
1284 458 -644 -511 -94 1043 1153 245 -416 -1639 -1410 130 627 531 -26 -1286 -1540 -726 836 2123
1302 2123 1429 -370 -1380 -1182 81 1705 1799 1136 -1109 -2214 -1427 -114 1782 1750 166 -2503 -2229
1319b229J440J826J152m69j753k188M8K702K239k80j293k146j762R48K526J646
1335B407n11j910j951j697J769L876J229k115j918j722k06K381L500O07k853k617
1351a731p76M44K490L358p81m280j836K29J388K532K663j099m740j717J490K649
1367B83K091J690k210m269j389K716K944R71N48k620m828m45M201K877J64o31
1383B093l228l812J185M579K977j216j369k861l083K088O028J428k652k303k311
1398b457j670K561N107R99l935k834j373m69L782M573o98l846k884l38J525L283
1414A326L782j489m977k330R85K320L318J605k705m721j595J854L369K707L1l510
1430c0l997n65L471L313K254j560l975k793P10L676L372K36k423m069j935J888
$$ plain form
1319 -2229 -789 1037 2189 1720 -33 -2221 -2173 529 2768 2488 1195 -951 -2713 -1765 761 2407
1335 2407 1896 -14 -1965 -3662 -1893 1983 3212 1097 -821 -2543 -2749 -368 3132 3739 886 -1731
1351 -1731 -2507 -2063 427 3785 3004 -1276 -3112 -2883 -1495 1037 3700 2601 -2139 -3856 -2366 283
1367 283 2374 4064 1854 -2415 -3804 -1088 1856 2827 3375 755 -4073 -4518 -317 2560 2724 2093
1383 2093 -1135 -4947 -3762 817 3794 2578 1209 -1652 -4735 -2647 3381 4809 2157 -146 -2457
1398 -2457 -4127 -1566 3541 4540 605 -2229 -3602 -4071 -289 4284 3586 -260 -3144 -3482 -1957 1326
1414 1326 5108 3619 -1358 -3688 -2703 -383 2935 4540 1835 -2886 -4481 -2627 742 3449 3480 -30
1430 -30 -4027 -4592 -1121 2192 4446 2886 -1089 -3882 -3172 504 3876 4112 1689 -2380 -4315 -2427
1446b427L697K444m84l905k999l34K433L668K158k013l911j940J013L137L102
1461C639N03k674m207j200K490K931K042l69l620l803K20L634K801P71j313l559
1477a714k236J161M081K406n99k099l558j005K364L690J349j801k691k168o98
1492c518K917L486M7k521k599j578J282L385K055L13l083k568m36K205K894J305
1508C586j189k902k752R27K916J680o2j189k774j967J837L286J212j314j136k098
1524a939j228K641L747r60k087l21j253j083K818L112j911k802r6k70p86L191
1540G73K818k833l089J084M40q75L364K422l469l240J577J164j122K707K175l882
1556A4l251K487Q69j192K151J708l827k432L357R34j805J977J565l758j553L553
$$ plain form
1446 -2427 1270 3714 3230 -675 -3674 -4008 -1575 2093 4251 2238 -1673 -3613 -2600 537 3639
1461 3639 4142 1468 -2739 -3939 -1449 1482 3524 3155 -465 -4268 -4048 -414 2387 3158 1845 -1714
1477 -1714 -3950 -2789 1292 3698 3099 1000 -2558 -3563 -1199 2491 3840 2039 -652 -2820 -3518
1492 -3518 -601 2885 2932 411 -2188 -3766 -2484 901 2956 3269 186 -2382 -2818 -613 2281 3586
1508 3586 2397 -505 -3257 -2330 586 2266 2204 1015 -1759 -3726 -1889 1397 2609 1295 159 -1939
1524 -1939 -3167 -526 3221 2261 174 -147 -1400 -2483 335 3447 1536 -1266 -1362 -1632 -2418 773
1540 773 3591 758 -2331 -1247 -807 -1682 1682 4104 635 -2605 -1028 136 -986 1721 3896 14
1556 14 -3237 -750 119 -1073 1078 2786 -1041 -3473 -116 818 -987 990 2555 -1203 -2756 797
1572G97Q62k083J102J310l090j206L607P7k790J157J409k643o45L118R7j947O51
1589b17J156j951m05L080j53j942N34Q04j927Q1J959J50j894K19P20j174l6J583
1607E87J70j493N56M95q95k27J148P2k14K42L22n86q17O11M03J64Q1n06m13r17
1627a217L80R75N82o31k41j36p51N35J001Q36j054n51L15m97p7J524N53j711n53
1646g18L12l50M80J204L77j856j122J161R9N01J426j58k150p92J423Q28K69R26
1664A860p60k407o55J798J071J23K48j729k213Q33J938R05K31m35j449j634J116
1681a159K429Q02n73r52j646j071J683K025N49r90j559j681j2J820J897J04j145
1698E21j808j397J028K553J167l74j553j675m94J556K559K05j476j636j441K93
$$ plain form
1572 797 1659 -424 678 1988 -1102 -2308 1299 1376 -1414 -257 1152 -1491 -2136 982 1079 -868 -217
1589 -217 939 -1012 -1417 1663 1510 -432 102 906 -1021 -940 1019 1169 -725 -506 214 -960 -996 587
1607 587 757 -736 -180 315 -580 -807 341 413 199 441 763 177 -640 -29 374 538 619 113 -300 -1217
1627 -1217 -837 138 720 89 -152 -288 -1039 -504 497 1333 279 -272 43 -454 -531 993 1546 -165 -718
1646 -718 -406 -756 -276 928 1305 -551 -1673 -512 -413 88 1514 1356 -794 -1586 -163 665 934 1860
1664 1860 1100 -1307 -1962 -164 907 1030 1278 -451 -2664 -1831 107 1012 1243 808 -641 -2275 -1159
1681 -1159 1270 2072 1499 547 -1099 -2170 -487 1538 2087 1097 -462 -2143 -2155 -335 1562 1666 521
1698 521 -1287 -2684 -1656 897 2064 1690 137 -1538 -2032 -476 2083 2288 812 -824 -2265 -1972
1714a972K362J660m06k143j317o84J110K494J464j040k445r82n4J628K743N58
1730B976k008k380p19O30K012J789J51k830k072n0J571J854J588r85k914j235
1746b622R06J967J634J020j641l174p11J649K327J244l44k484k367J18K134J982
1762A638K78r64k255j585J029K612J557k30j775k151l70J490K610R34j389j999
1778e70j835L15K072K163J02j683k485q64J263K249J658m87k143j617l24J817
1794c69K205Q24j273k077j523N37K306J746l21j628k322m69Q53K366J318j232
1810I41j637j387L61J406K219N17j778j772n17N94J668J590j56k222j729L00R40
1827f62J770P78j003j999j493J016J482J190L74q42k030n90J617J576N29m56j082
$$ plain form
1714 -1972 390 2050 1644 -499 -1816 -2500 -1390 1104 2568 1528 -917 -1899 -1953 -325 2418 2976
1730 2976 968 -1412 -2131 -1501 511 2300 2451 -379 -2451 -2501 -930 924 2512 1527 -1387 -2622
1746 -2622 -1716 251 1885 2905 1264 -1910 -2621 -972 1355 2599 2255 -229 -2596 -2478 -344 1638
1762 1638 1916 952 -1303 -2888 -1859 753 2310 2080 305 -1846 -2216 -726 1884 2818 1429 -570
1778 -570 -2405 -2090 -18 2145 2247 564 -1921 -2785 -1522 727 2385 1898 -245 -1862 -2186 -369
1794 -369 1836 2660 1387 -690 -2213 -1676 630 2376 2055 427 -1895 -2364 -1511 855 2173 941
1810 941 -696 -2083 -1722 -316 1903 2420 642 -1130 -1647 -1053 615 2205 2049 -173 -1902 -1602 -662
1827 -662 1108 1886 883 -1116 -2609 -1593 -111 1079 1453 611 -1419 -2009 -392 1184 1713 1257 175
1844A75j804L2J484J520O2r17j298j237O45J798R40m33j094j109l29R05J818O85
1862A843j023j104o88m6J386R50J03j193j359k33M49J101R60l87j323o44K47Q03
1880a58Q78L62l97j072p89R08P96L63J0p01j062j38P22P18K04l26p02l76l62R61
1900a61O41K32m80p62k69M01O96O21O9r52l48j49K75M66M07n11l98p72L37Q02
1920A45j02K05j91o70J33M39N27r2n2k73J47l95K96K95k16j04j2l23m40O33M97
1941D47n42m59N53k31l53N62M54k79l0L25j27m19L18J49m8n02O80k97p92k3P13
1962I9m53J0K44L51j018J59J107n72l81J042j70j043N37J030m79q50R31o36q78
1981i70P81J152p25q82N89l94p40J256R31p53q41O42j91n47N70J424p42j182O53
$$ plain form
1844 175 -1629 -1597 -113 1407 1469 552 -746 -1983 -1338 460 1400 967 -127 -1236 -1565 -660 1158 1843
1862 1843 820 -284 -972 -1018 368 1318 1421 228 -1131 -1364 -915 186 1146 759 -564 -1208 -961 -158
1880 -158 720 1082 685 -387 -1176 -268 528 891 901 200 -862 -1000 -278 440 644 318 -384 -760 -1122 -161
1900 -161 480 712 232 -530 -799 -398 298 919 988 36 -312 -461 -186 280 687 176 -222 -994 -657 145
1920 145 43 248 57 -613 -480 -41 486 394 342 69 216 -179 117 412 196 92 80 -243 -683 -50 447
1941 447 -95 -554 -1 -232 -585 -23 431 152 122 447 320 -99 219 368 320 -182 498 201 -591 -614 99
1962 99 -354 -344 -100 251 -767 -608 499 -73 -454 588 418 -625 -88 942 463 -387 544 -92 -970
1981 -970 -189 963 238 -644 -55 -449 -1189 67 998 245 -596 46 -145 -692 -122 1302 560 -622 31
2000C1k34k71P50R89j076j336O81L00l54N72J177j396j129M97J138l49R80K09
2018A179j388q21Q78O92p7L12k01j266q37J403Q90m09m3l49j152k94J364J206
2036A087l90j82o24n85k18J654J025r99p86m80l67K77J451L98j032q02m16R7N36
2055c56R65L58p51j113n6M95Q49O65J71j365j180O39R59M99M40o29j375r18R58
2074g45J068O57k85l57j450n75J390J175L88o70o15j002j38J362J172j46j052
2091A77j092j33K16J368P92o76j229l61n3N88J253M37r92r29k27K06J102R00N
2110A352j364r37Q6M25R06N91l39j138r20J17J392N62K87q78j049n34R83R73J004
2129A519p01q70q86J99P78N49R47j037j203n46M59R32M01L30r08j153j80J045
$$ plain form
2000 31 -203 -474 276 1265 189 -1147 -466 -166 -520 52 1229 -167 -1296 -799 339 -10 970 1179
2018 1179 -209 -1030 -152 540 463 775 574 -692 -1529 -126 764 355 312 -37 -1189 -1483 -119 1087
2036 1087 697 515 -109 -694 -912 742 1767 768 -18 -498 -865 -588 863 1261 229 -573 -989 -892 -356
2055 -356 609 967 216 -897 -953 -458 391 1056 1227 -138 -1318 -679 280 779 1219 590 -785 -1703 -745
2074 -745 323 980 695 338 -1112 -1687 -297 878 1266 596 -19 -1021 -1159 203 1375 1229 177
2091 177 -915 -1048 -832 536 1328 652 -577 -938 -991 -403 850 1287 295 -634 -861 -655 447 1347 1352
2110 1352 -12 -949 -863 -438 468 1059 720 -418 -1338 -1221 171 733 1020 142 -907 -1441 -458 515 1519
2129 1519 818 -52 -938 -739 39 588 1535 498 -705 -1251 -792 140 541 871 -37 -1190 -1370 -325
2147c25J166L52k82j105r88M89R02P45Lj69j247j024Q66J316R6k94o88q40l65
2166a392J070J108N2o21l57p02q6J224J076o33q78j2n00K28R40Q43p85j062l63
2185h50J60J90J006M08j053q27M31K3O96O36J52j199o17K61N08J066j2l35j225
2204e81j96L27N42K91Q8m32n46m87N81P64L11j98q14l64M9O94N55J4j41n58n39
2225f40R8Q74K67m26j49n84q9N15K15J96r3n02m03M33K37M47Om1o64qK38K93K57
2248D77O4m11p24J21L41K08j44J4j44j12o5L37K32L71l17l13n9N41m04K32N3m14
2270a16j29j13O29j82j75m8j33j97J91K50j04J90k79J69J1O5K15P8p9o2j36J08
2292A53m17L71j85k2j24L13k40nk5K56k33K6J11J07n0r8K6K35R7k02k35K13j21
$$ plain form
2147 -325 841 1193 911 -194 -1182 -693 209 954 957 788 -459 -1483 -617 699 795 501 -187 -1027 -1392
2166 -1392 -322 786 838 217 -140 -842 -928 296 1372 739 -139 -151 -651 -423 517 1360 575 -487 -850
2185 -850 -690 -500 506 914 -139 -966 -535 -512 184 820 972 -227 -844 -583 -75 991 979 644 -581
2204 -581 -777 -450 92 383 471 39 -507 -994 -413 351 662 464 -350 -714 -665 29 584 598 457 -101 -640
2225 -640 -542 332 599 173 24 -560 -649 -134 81 277 184 -318 -721 -288 -51 396 402 361 -303 -311 -73 220 477
2248 477 541 130 -594 -473 -132 76 -68 -54 -198 -310 -375 -38 194 565 248 -65 -124 417 13 245 298 -116
2270 -116 -245 -358 271 89 -86 -134 -267 -464 -273 -23 -127 63 -216 -47 -36 29 244 322 243 181 45 153
2292 153 -264 107 -78 -100 -224 89 -151 -156 -181 75 -158 -132 -21 86 36 -62 -36 199 296 94 -141 72 -49
2315d9n8R3k0r9L4j38o9M23j07j93j31K8J27K23L00p7N6m87R0j16K27M13j48m52
2339a30j20o9J49K27j64J82k34k25P7L13L29M53o44l09l16M64K83J78k35q9k68
2360a48l09K80L43K36l86l04m83K79N21J82K3q1n23O9J87P42j46j02k42l74j68
2381d04M54M01j45k90j98m18k64Q22M86j59l75l23o7P0O69N89n82n14J57K9k4
2402h6R37Q7q85o76K1L64J56K96K69p86n96K87M77M33M14Or01m43N40M74J62M
2424E54%q85o78J151K06K06o98K28r46j40J078K24m3o0l54n40J44R63O19n20o01
2445i2L7l18L9P93N69q20n21l39JP1R35M32q44m95J06NM89O33p2m55n96o9N81
2468G0L79L43l52p25m57L55M52K15K58k96r07m17P48O94J06k97p2n33j16Q86K28
$$ plain form
2315 -49 -107 -14 -34 -133 -99 -237 -306 117 10 -183 -314 -286 -159 64 364 287 343 -144 -54 -170 57 470 322 -130
2339 -130 -250 -319 -170 57 -107 75 -159 -384 -307 6 335 788 144 -165 -481 -17 266 444 209 120 -148
2360 -148 -457 -177 166 402 16 -288 -771 -492 29 211 234 153 -370 -301 -114 628 482 380 138 -236 -404
2381 -404 50 451 306 16 -182 -600 -864 -42 444 285 -90 -413 -480 -410 259 848 266 -248 -91 -62 -86
2402 -86 851 938 53 -623 -602 -238 -82 214 483 -303 -899 -612 -135 298 712 718 -183 -626 -86 388 550 554
2424 554 554 -331 -1009 142 348 554 -144 84 -862 -1002 76 300 257 197 -157 -697 -553 410 1029 509 -92
2445 -92 -55 -373 -334 459 1028 208 -313 -652 -651 -580 355 787 -57 -552 -446 -441 48 681 609 154 -442 -511 70
2468 70 449 792 440 -285 -742 -387 65 280 538 242 -665 -1082 -334 360 466 169 97 -436 -552 334 562
2489E62J45m90k35o14j48P97M78j25o21q9N9j6K80M03k26o56l7K28J57J079j40
2510G91m83p39r5N31L43J40J79o61n80P1L49M47N8m3n88k09K76M12n1L46j67m30
2532a03m09L97M21M5m5o6n23k79O64j1l1O2l26l53m4O51J39nk58j69P8K63M43
2555E41K75m54l11l82J7M15N03k10m30j65k33K06K68K75j38m80J5oq4O51K71p26
2577a82K86j92k2K43K92j66m67l9j27J42J88L06j05m51J50M1n9J12K10R5m73J25
2599i3N88l46j67L45l29m08M82K8j52n2L51l95n37M97N30m00k27M37k55j03L86
2620A80Q4m30J99K74k09n06M11O04p21L0K90k28n19O5N47j12l8J93k34r3M61j91
2642E7M6N5J52j26k49L2R5l7Q4J32m25K9J30J1l63L91R4k73n2m1M04j84J85K56
$$ plain form
2489 562 707 217 -18 -632 -780 17 495 370 -251 -340 -281 -297 -17 386 160 -496 -533 -305 -148 931 791
2510 791 308 -431 -526 5 348 488 667 6 -574 -503 -154 293 351 308 -280 -489 -213 199 148 494 327 -103
2532 -103 -512 -115 306 351 306 240 -283 -562 102 91 60 122 -204 -557 -601 50 189 184 -74 -243 -165 98 541
2555 541 816 362 51 -331 -314 101 604 394 -36 -201 -434 -228 40 315 177 -303 -288 -294 -378 273 544 -182
2577 -182 104 -88 -110 133 425 259 -208 -247 -374 -232 -44 262 157 -294 -144 -103 -162 -50 160 255 -218 -93
2599 -93 495 149 -18 327 -2 -410 72 100 -52 -104 247 -148 -685 -188 342 -58 -285 152 -103 -206 180
2620 180 264 -166 33 307 98 -408 3 607 -114 -84 206 -22 -541 -476 71 -41 -79 114 -120 -213 248 57
2642 57 103 158 310 184 -65 -33 62 25 109 241 -184 -155 -25 -14 -377 14 108 -165 -217 -258 146 -38 147 403
2666D03m98J20K4R9l6P6j15l87L02q9J40L8n36K15J61k14K21K6K40j02m37pM54
2689I8L07j32J49n79J3K12Q4K52j27l76k06k39L71M01J8M1m01k09R3K71P2K67
2711C80J72n51l90J55L79R4k13o6j30l17J66L89n6L68m83n35J42M74K89p8r4j58
2733f3l68L37K64L81k4m75l51rK15N32j39l24l38k79K50L68L90M4m63m01m0M07
2755h6O95l1K3p78m00K46K72M88K89n14p82qLN66L60j06l53k90k11L74O50L31
2777G38k99m86l03R8J80O22k19k30n90l53N59M76K86j18q69j58J29M05N72J79
2797F19o39l56n1K40L45O07J2m77j120K87L45K46N33k10o65k64O2M67M00J19k71
2818B29o78k37M15Q60j05k52m67k87P4K47P41J14l67p67l81R5R80N21m87l77l90
$$ plain form
2666 403 -95 25 49 148 112 188 73 -314 -12 -101 39 77 -459 -244 -83 -297 -76 -50 190 88 -349 -356 98
2689 98 405 273 422 -157 -144 68 152 404 277 -99 -305 -544 -173 228 246 287 -114 -323 -230 41 113 380
2711 380 552 1 -389 -234 145 239 26 -40 -170 -487 -321 68 12 380 -103 -638 -496 -22 267 189 95 -63
2733 -63 -431 -94 170 551 527 52 -299 -308 -93 439 300 -24 -362 -641 -391 -23 367 411 -52 -453 -493 -86
2755 -86 609 578 601 -177 -577 -331 -59 429 718 204 -578 -586 -583 -17 343 237 -116 -406 -617 -243 407 738
2777 738 439 -47 -350 -252 -72 550 331 101 -489 -842 -283 193 479 361 -508 -666 -537 -132 440 619
2797 619 -20 -376 -427 -187 158 765 777 300 -820 -533 -188 58 591 381 -284 -548 -486 -19 381 500 229
2818 229 -449 -686 -271 589 484 232 -235 -522 -448 -201 540 654 287 -480 -861 -766 214 735 248 -129 -519
2839e19m40N51J060Q8k1j180R7j93O57N86kp33j96l13o2P27N10m5r18n04K13N21
2861a16K35O20o45m70j99J05M87N12Lk12j158M5P21K78L40q6m89o54K2M54N77
2882C70K06l94n03l65L13Q01K21m01L8m99n39O63N19J94l15o60N3j61Q7J105q0
2903F53q45p7j37l8M45N03j80n01l31K69L01R7M16m5o64m84M99p9M38P0l66l46
2925d02j27N66J36K90m09L2l59J7L89L31l60j35P3m12K56N50k07k99K86l61k84
2946d29J77L74P8ml41k72L02K15J85j28R4j58l45M85j73N54m62k13k57J03o6J94
2968h7l1L06j80o5k70K30j67K19k0R3J06j98l4J21j12m9L46k47r0N7K7j24K99
2991A30l00m2K00q9P5N6J70Qp21L23J33k2L05q4M9l76l38L85L07m0P2j99m16q1
$$ plain form
2839 -519 -959 -408 652 740 719 -461 -364 -557 100 686 684 -49 -245 -558 -620 107 617 572 -346 -850 -637 -116
2861 -116 119 739 94 -376 -575 -470 17 529 532 320 -838 -793 -72 206 546 460 -29 -683 -661 -207 370
2882 370 576 182 -321 -686 -373 428 649 248 286 -213 -752 -89 430 624 309 -351 -298 -459 -372 733 653
2903 653 -192 -269 -406 -444 1 504 324 -177 -508 -239 62 159 575 530 -134 -618 -119 -198 240 310 -56 -402
2925 -402 -529 37 173 463 54 86 -273 -256 133 464 104 -31 42 -370 -114 436 229 -70 216 -145 -429
2946 -429 -252 122 200 196 -145 -417 -115 100 285 157 251 93 -252 233 60 614 152 -61 -318 -215 -281 -87
2968 -87 -118 188 8 -57 -327 -97 -264 -45 -65 28 134 -64 -98 23 -89 -138 208 -39 -129 -72 -45 -169 130
2991 130 -170 -212 -12 -101 -26 30 200 208 -513 -190 -57 -79 226 142 191 -185 -523 -138 169 129 201 2 -414 -495
3015d95K34N87j7P6l01l60l44P29M03j0k11k09n37J74L22O69k9o29o95K20j74
3036e97O70O26n28p03J92N2Q0N19L55k79r25j69O07N3M88L01q26o98K32L99L46
3057A95K28J50q50q80P46P87K78j42r8r30n16N77J205J49n45k37p51o58J057J344
3077A109k85p10n02m11l16J167R79k81p54l32l49j85J360P72n35q77l62m95O00
3096d07R34O63o79j281k48L40M59J100L14j334q52J74L24P64Q35p9j240j227R00
3115e40Q70M28M15n55j569m15O37J293L68J02r81j204o14J476J190J28m69p71
3133b11j051Q6J204J233o3q39p62q32M51J343M98m44m37j240j34L50J724L31m28
3152G79j306o63L11R39J287k53q36j040l25M38J291L34k26j161p74K30N11J235
$$ plain form
3015 -495 -261 326 309 385 84 -276 -620 109 512 502 291 82 -455 -281 41 710 681 52 -643 -423 -597
3036 -597 73 699 171 -532 -340 -288 -208 311 666 387 -538 -707 -100 -47 441 742 -84 -782 -550 -151 195
3057 195 423 573 -277 -1157 -411 376 654 512 414 -516 -1032 -455 750 899 354 117 -634 -1292 -235 1109
3077 1109 824 114 -388 -799 -1115 52 1031 750 -4 -336 -685 -870 490 1262 727 -150 -512 -1007 -407
3096 -407 527 1190 511 -770 -1018 -678 -219 881 1195 -139 -991 -817 -493 271 1106 1027 -213 -1440 -540
3115 -540 330 758 1173 618 -951 -1366 -729 564 932 1034 53 -1151 -1765 -289 901 1029 560 -211
3133 -211 -1262 -1176 28 1261 1198 359 -403 -1235 -784 559 1057 613 176 -1064 -1198 -848 876 1207 779
3152 779 -527 -1190 -879 60 1347 1094 258 -782 -1107 -669 622 956 730 -431 -1205 -975 -464 771
3170G71K88p97q00m21nJ276Q96j41q63j111l39R38J109M89l76j129q67j18Q41
3189c59J307J10n51j422m11P66R80N89J18r03j085j75M69J250R49j025q66q93
3207a152N0J128Q96k14p90o01n90P31N59R90j83j015r35K88L71J322P9m75p17
3226b58n06L76L51Q47J61n93j138k82N33O40Q27k98j064l37k86Q49R96J30m69
3245D79q77l88N32M62N41%p01p74L7J76P55N71k29o73p34n9P70O38j64J21q92
3266d09l31L60M01Q03r1p22l62k8P4P04K86k50m40m96o2L94L72K24k91m59j16
3287d39R4K50L12J98j17m96l42L64L24J74nm45k33J64L6K01qj46j21j2l45N94
3309BM34k42P6k37l47L03L33L8R8n00K43m59j88O36m06K43j27m3l4o2K80Q0J00
$$ plain form
3170 771 1059 262 -538 -959 -964 312 1208 1067 204 -907 -1246 -308 801 1290 914 -215 -1082 -1200 -359
3189 -359 948 1058 507 -915 -1326 -560 420 1009 1127 224 -861 -1036 -567 683 1632 607 -259 -1152
3207 -1152 -1102 26 922 708 -82 -683 -1273 -542 17 1007 824 -191 -1126 -838 -467 855 934 459 -258
3226 -258 -764 -388 -37 810 971 378 -760 -1042 -509 131 958 660 -404 -741 -1027 -178 818 948 479
3245 479 -398 -786 -254 208 749 749 48 -726 -689 -513 242 813 584 -89 -823 -882 -112 526 362 483 -409
3266 -409 -740 -380 21 824 733 11 -351 -379 -305 399 685 435 -5 -501 -563 -169 203 427 136 -323 -439
3287 -439 -345 -95 217 415 298 -198 -540 -176 148 322 317 -128 -361 -197 -161 40 32 -114 -235 -247 -592 2
3309 2 436 194 270 33 -314 -11 322 360 458 -42 201 -258 -446 190 -216 27 -100 -143 -177 -239 41 121 221
3332B21l3j69J53k67K52l4l5R8l0j53m20K43N92j31l59Q8n50j6Q11J18n8k32j36
3355d7n61J04N78R75o41n24j68j06m1P28L09M2o42o94J52N17M22J64m00o94n0
3376e77J54M88N86r9m13p31k02Q69N36K22r1r55o14K42P52K86K85k53r73o01L71
3397g18J128M36P5n66j102j79O35Q99M96l93r67p12m1J045P79J33o68r15n91O98
3417e28Q00M06L81r82r40l61R98J173J38m11q39j087K3J395R27%o37j376n55P85
3437f90J011J083n08j239m04o99R80J525N12j288q81m93J18J236J101P6j107j366
3455a033j66L84J002J385o12j381j080M52Q18J093P92n75j943n65O83Q64J142
3472A260K27j110j883k10J304J371K36j78q56j814R1J668P76K32P3j691j054M95
$$ plain form
3332 221 188 19 172 -95 157 123 88 186 156 3 -417 -174 418 287 -72 16 -534 -550 261 379 321 89 -47
3355 -47 -608 -504 74 1049 408 -116 -284 -390 -431 297 606 648 6 -688 -536 -19 403 567 167 -527 -577
3376 -577 -423 65 651 552 139 -592 -794 75 611 833 742 -213 -827 -585 167 453 738 485 -488 -1089 -718
3397 -718 410 846 921 355 -747 -926 -291 608 1104 711 -256 -968 -1009 36 815 948 280 -635 -1226 -528
3417 -528 272 678 1059 77 -863 -1224 -226 947 1085 674 -165 -1252 -1229 166 1093 1093 456 -920 -1475 -690
3437 -690 321 1404 896 -343 -747 -1446 -466 1059 1571 283 -598 -1091 -973 263 1364 1440 333 -1033
3455 -1033 -1199 -815 187 1572 960 -421 -1501 -1049 -231 862 1654 1079 -864 -1429 -746 118 1260
3472 1260 1487 377 -1506 -1716 -412 959 1195 1017 161 -1653 -1562 106 882 1114 1187 -504 -1558 -1063
3490a063J530J308p81n83j044q80P06J944M53o77j236p74l18J076J710L06j407
3507B70j204j48j30J370J579j75j999q94K04O57J079J404q79j766j093R76P31
3524a8Q89P89j040j791q03J352J145O33J44n65k344P4J473P77N16k46r48j625
3542a588J92J741R00m49l71r59r80N53K080L12p22o85j137n05J213J697M07j412
3560B87o51m47m60J212J422J04j552q74j95O86P10J303o46j732m34K69P18J006
3578G26N34o08j518k49M25Q19O21M31p99j271j02N17Q05N42j49j127m76P6O30
3597a73P04K01j41q60o74O25N42N32J44p35p65M5K22O01M74l93m28n73l6O03K83
3618A98K31j26r42j82O70J55M05J6l41m67j82O05L83M2J02o63o04K8N37M68n5
$$ plain form
3490 -1063 467 1775 994 411 -633 -1513 -807 1137 1590 913 -323 -1097 -1415 -339 1371 1677 270
3507 270 -934 -1082 -1212 158 1737 1562 -437 -1331 -1127 -470 609 2013 1134 -632 -1725 -749 -18
3524 -18 871 1660 620 -1171 -1974 -622 523 1156 1300 735 -1609 -1535 -62 715 1231 985 37 -1588
3542 -1588 -1396 345 1245 796 425 -534 -1514 -961 1119 1431 709 24 -1113 -1618 -405 1292 1699 287
3560 287 -364 -811 -1271 -59 1363 1467 -85 -959 -1154 -468 242 1545 899 -833 -1267 -998 -280 726
3578 726 1260 652 -866 -1115 -690 129 750 1181 382 -889 -991 -474 331 873 724 -403 -879 -803 -173
3597 -173 531 732 591 -269 -943 -318 224 756 900 165 -600 -555 -333 268 742 349 -79 -652 -688 -85 198
3618 198 429 303 -639 -821 -151 4 409 425 84 -383 -565 40 423 465 567 -96 -700 -672 -135 333 278
3639B78j44o5n98j23O49M89j52J08m91k01J87K3J98L95P5n10l77l2M41M2k2J43
3661C13j95o08K50rL91j5Q6k99j94J55J46K86j46K79k08m64l9J74K92k4k09j35
3683a73rj11N47J5J73n94k29p7N34K41L58l14l51n27K78K92K57K97k22o85o92
3704i92L01R98L17J56o48r97j02O19N66N41m3p17p82l87J140R72l17np03j045
3724a128M64P80N85K12r27m44n28L01J136N60m87l81p94n39J045O75N77m36j102
3743d31o09n8J058J240l38p04r84m59P84Q64O54O6j246j131K92J058R13N03j265
3762B07q93o91K36J219J195j51p55j075p00Q37J016Q76l55j263j007J00P12J466
3780I74O30r48j187r19M42J499Q41L30j395j510L1O61J320P00m08j435j187J89
$$ plain form
3639 278 134 69 -529 -652 -3 486 334 442 -49 -250 -63 -40 158 553 628 118 -259 -291 150 192 170 313
3661 313 118 -490 -240 -249 142 127 213 -86 -280 -125 21 307 161 440 232 -232 -271 -97 195 171 -38 -173
3683 -173 -182 -293 254 269 442 -152 -381 -458 76 317 675 361 10 -517 -239 53 310 607 385 -300 -992
3704 -992 -691 307 624 780 132 -865 -967 -348 218 759 716 -1 -783 -1170 -30 942 625 620 -83 -1128
3724 -1128 -664 116 701 913 -14 -458 -986 -685 451 1011 524 143 -651 -1190 -145 530 1107 671 -431
3743 -431 -1040 -1098 -40 1200 862 158 -826 -1285 -501 363 1017 1083 -163 -1294 -1002 56 969 1472 207
3762 207 -686 -1377 -1141 78 1273 1122 367 -708 -1408 -571 445 1321 966 -297 -1304 -1204 -492 974
3780 974 1604 656 -531 -1450 -1008 491 1332 1662 267 -1243 -1212 -551 769 1469 1061 -374 -1561 -1372
3798a372J239J207M67q85j590o77Q23J372Q63N4j294j540k58J050J459O14n27
3815A005j549j096K6J646J284Jp76j463o92N13J834R45l76j204j316k32P10J788
3833A048P00p03j627j075L65J306J281K20j243j631m42R54J600R11k49j408j418
3850a411LJ005J518N05p00j275j130J63J249J519q8j273j180l28M24J623J009
3867A633l30j394j272J44P90J372O32p18j511q15O38P68J528K7j121j675n4Q96
3885d62J177L07K4j337j495P58J346O27L96j79j851q48M98J628N66l40l76j181
3903g42r07J072J361P4j07q50j191j68J230J538j33j274m4p40M3J084J410q69
3921G87j133m19q6J95R90J380j180j412K11R0K89R03Q53j022j382j26R98l5R19
$$ plain form
3798 -1372 -133 1074 1541 656 -934 -1611 -788 584 1447 1501 207 -1333 -1591 -541 918 1532 1005
3815 1005 -544 -1640 -1614 32 1316 1317 541 -922 -1614 -1101 733 1678 1302 98 -1218 -1450 -740 1048
3833 1048 1748 1045 -582 -1657 -1292 14 1295 1515 272 -1359 -1801 -847 753 1664 1415 7 -1411
3850 -1411 -1408 -403 1115 1620 920 -355 -1485 -1322 -73 1446 1358 85 -1095 -1423 -999 624 1633
3867 1633 1303 -91 -1363 -1219 -429 943 1575 857 -654 -1469 -831 -63 1465 1492 371 -1304 -1358 -462
3885 -462 715 1022 1046 -291 -1786 -1028 318 945 1341 1162 -689 -1537 -1039 589 1155 815 439 -742
3903 -742 -1649 -577 784 858 751 -99 -1290 -1458 -228 1310 1177 -97 -141 -881 -838 246 1656 787
3921 787 -346 -765 -851 -656 334 1714 534 -878 -667 -577 -288 615 1468 446 -936 -1062 -64 -99 820
3940H20N87j342j186O77M96Q6L63M50r55j063K42J184k23N6M28r12p97M51J253
3959F15Lp3l80m15r05N42J337J2q40L10n67m74P66N86q4m76P3j36r20Q58J015
3980H47n98m92L59k20o02N62Q61k50o15j47L77o99L03J072m93m53K77j95m77N13
4000g0P51k17p94M01k3k79K99M89m83l82J95K22m19M90N66n83n95J83Q3l8L74
4021A70M97m42p60K51M27j39J01O19n24p97K71%K00O98J82q68k26j60j2M23P04
4042F15J14q84n22J04k7Q56O25l52p18l00j20L29Q58Q2j30q66k71J96M03O05N05
4063A102j014o95r1K91O85N96k65q24n43J19Q91J73M79k94j396m13Q11O40L81
4082F33J31n41j149m08R50J074J18j69o33j126O6J296P12J22n80p64q88J11J464
$$ plain form
3940 820 1407 65 -1121 -444 52 138 501 951 -4 -1067 -825 359 136 192 620 -292 -1089 -638 615
3959 615 618 545 165 -250 -1155 -613 724 736 -104 206 -361 -835 -69 517 433 -43 30 -106 -1026 -168 847
3980 847 249 -243 116 -104 -706 -144 717 467 -148 -295 82 -617 -314 758 265 -188 89 -106 -583 -70
4000 -70 681 464 -330 71 48 -231 68 557 74 -308 -113 109 -310 180 746 163 -432 -249 -166 -204 170
4021 170 667 225 -535 -284 143 4 105 724 200 -597 -326 -326 -126 572 754 -114 -340 -500 -512 -89 615
4042 615 729 -155 -677 -573 -600 256 881 529 -189 -489 -609 -280 578 660 530 -336 -607 -411 -8 597 1102
4063 1102 88 -607 -698 -407 278 874 609 -215 -758 -639 252 425 904 610 -786 -1199 -388 252 633
4082 633 764 223 -926 -1334 -384 690 808 639 6 -1120 -1054 242 954 1076 496 -268 -1156 -1045 419
4101D19P29m56n64q79p34O95J412N51l05j315o82j47P81J596J86r35r72k83J25
4120g78R50J232m08r11j340J03Q10R76N43k43j672n32J77J040J134l0n08j318
4138g75o86P01J505M90n4r66j391j12Q59J466M35j039p21j257J32J431J456m69
4156A005p09j258n97M54J788R68k79j678q88K5N69J570N76q41j337n30p2J184
4174e0J330K09j177j432O7N72R37O60J47j491j114J55J307P74L70m66j502q31
4192a535M06J490O12J53j010j334j54Q24J208O76n13q02j497J56J313R32M44o44
4210G25j276o85K61J344R39p7j167j038k36O59J090N35l64q07j214M46O24J060
4228H19L35p07j001o23N28R20R74j93j188o59k67P19J138J22k64j144p08L05O57
$$ plain form
4101 419 1148 692 128 -751 -1485 -790 622 1173 868 -447 -1129 -1276 -495 1101 1287 352 -620 -903 -778
4120 -778 172 1404 996 85 -1255 -1152 -342 634 1177 934 -738 -1270 -1093 -53 1081 1051 543 -775
4138 -775 -1461 -760 745 1235 1181 215 -1176 -1288 -429 1037 1472 433 -288 -1545 -1413 18 1474 1005
4156 1005 296 -962 -1559 -1105 683 1651 1372 -306 -1194 -1169 -600 970 1546 705 -632 -1162 -1234 -50
4174 -50 1280 1489 312 -1120 -1053 -481 456 1116 1263 -228 -1342 -1187 120 894 1264 798 -704 -1535
4192 -1535 -1129 361 973 1126 116 -1218 -1372 -548 660 1336 823 21 -1476 -1320 -7 925 1369 725
4210 725 -551 -1236 -975 369 1308 1231 64 -974 -1210 -551 539 1074 710 -97 -1311 -865 -241 819
4228 819 1154 447 -554 -1177 -649 271 1245 1052 -136 -795 -1062 -343 795 917 653 -491 -1199 -894 -237
4247b37Q35M19o53r17k51O0J089P32l06n91j103r5O63Q52M25m44p05n48K67K60
4267b48J044on92o51o70N33P28M12L60q08n64k78L40Q62N24m17r03l21kL98Q49
4288E90J96o86m84m45L27N80L26K56n23o66K2K55N26L40P2p20n87K27L52L15J21
4309C94m6n74m67O18J34J57J2j09m10l12N15K47J11R0m7q50K75L62K94k76j41
4330b3Q2m18j42M94L50k3k14j85k09j97M21P56n04j45L04m30l59M63O13o22Mj9
4352cp8k83L80N83k53m66p6k49j33Q53K67j73m71J66n19J27O27L43m56l41J50
4373ej28k92Q09M16n37q04L82l08K69M08N31m49q03L41K27qJ99O62q83o42Q1N81
4395D7l5L06K22o49q23K70P13j34N27o9l97q01L93Q14J2l2Lq09o27J021N86j2
$$ plain form
4247 -237 598 1017 364 -553 -804 -744 345 1077 771 180 -923 -1018 -355 497 922 478 -227 -775 -508 -248
4267 -248 796 790 198 -453 -1123 -590 138 550 910 102 -462 -740 -400 462 986 569 -334 -655 -657 -259 590
4288 590 786 100 -384 -829 -502 78 404 660 137 -529 -507 -252 274 614 686 -34 -621 -394 -42 273 394
4309 394 348 -226 -693 -75 59 216 228 119 -291 -603 -88 159 270 360 313 -537 -262 100 394 118 -23
4330 -23 59 -359 -501 -7 343 320 106 -79 -288 -485 -64 692 188 43 347 -83 -442 21 634 12 16 -3
4352 -3 -81 -364 16 599 346 -120 -196 -445 -578 275 542 369 -102 64 -455 -328 299 642 186 -155 -5
4373 -5 -133 -425 384 800 263 -541 -159 -467 -198 210 741 292 -511 -170 57 49 248 910 27 -615 -534 47
4395 47 12 318 540 -109 -932 -662 51 -83 444 375 -22 -823 -430 384 396 364 367 -442 -1069 -48 538 526
4417E26r9j71o46n55P05J019q4p74R4o55J3O46J013l26n37o17j74J22P60Q64n97
4438E27q03k13m27M28Q68O07n49j024l25M91N50N58K57r32p18R9J64N47P61k61
4458F05m18j183m7J035M41J99P8j025n91M29O61N78j86k77j005l41N83J133P3
4477G42j17q49q05J33Q06R27N00q50j176m9J18P34N14J18n65r98k6N70Q73K21
4497H21j30m55j210J83N78J201j65m33n00q21J61R05O00k15l85m87o37N32J076
4516F19M38m75o13o25n0O58J042P6j065m15m16K76R89N04k61q10q26K44M98N72
4536C60P65n29j312k27N44M29J75O59m86r34j64N25O08L67o9n82j107j08R41O50
4556E05J49k11m24p44j33R86M80N4l27o25n09J61J019M71m61n20k28m24M11Q92
$$ plain form
4417 526 427 256 -390 -945 -240 779 695 -79 15 -640 -627 19 1032 706 169 -448 -622 -500 260 1124 527
4438 527 -276 -489 -916 -488 380 987 438 -586 -911 -420 130 688 945 13 -705 -606 -442 105 866 605
4458 605 187 -996 -1043 -8 433 632 710 -315 -906 -477 184 762 576 299 -706 -1047 -464 669 742
4477 742 625 -224 -1029 -896 -90 837 1337 487 -689 -738 -620 114 628 746 181 -817 -843 -273 600 821
4497 821 691 236 -974 -791 -213 988 823 390 -110 -931 -770 135 735 520 135 -352 -989 -457 619
4516 619 1057 582 -31 -656 -706 -48 994 1070 5 -410 -826 -550 439 943 682 -128 -954 -710 -212 360
4536 360 1125 596 -716 -943 -399 30 205 864 378 -556 -720 -195 413 780 711 129 -978 -1086 -145 505
4556 505 654 443 19 -725 -858 128 608 662 335 -290 -799 -638 381 852 391 -129 -357 -781 -370 522
4576E22L56n81l02m03k37M20P41K32q16l61M3J92J98Q00j36r02n01L50N36K61
4596D12K52j23q95n10M36N40L69J49l63p13k73O48N44k19K66n47m68l50R58J42
4616B55p0J16k27p07Q2P66N3R8k22l58m46J66O91L62n7n04k40r9O1K50P20n67
4638A23n4j70l50K85L89K72l08j25m93j01M05M63Rl06k74l26K48L40L79j34l31
4659e9pj60J51M6L40p8l95j70j04N19K91j03k6n38p6K13N0L63K58n10l41K32q5
4682a89K92K93k28Ok58k33M20J42k78J48l21NJ44q4K43L43k53k09j92R4R9L38
4704C22K11m37k64n2J05o8M94k14j39l59K43o1M02l8Q8j82n50L04kL52K17j25
4726B47m8o41K40L38Q2j65l31N6j17K91o4M58O8j82n78Nn7N20K30o0l00k77J71
$$ plain form
4576 522 878 297 -5 -408 -645 -225 516 748 -68 -429 -386 -194 4 804 668 -234 -735 -385 151 412
4596 412 664 541 -354 -864 -428 112 481 630 267 -446 -719 -71 473 254 520 -27 -495 -845 113 255
4616 255 185 301 74 -633 -551 215 268 366 144 -214 -660 -494 197 559 502 -2 -242 -341 -280 -30 690 123
4638 123 69 -101 -451 -166 223 495 187 62 -431 -532 -127 336 345 39 -235 -561 -313 27 406 272 -59
4659 -59 -66 -226 -75 -29 311 233 -162 -332 -436 83 374 271 245 -293 -369 -156 -106 257 515 5 -336 -104 -189
4682 -189 103 396 168 174 -84 -317 103 245 -33 115 -206 -201 -57 -141 102 445 192 -17 -209 -115 -16 322
4704 322 533 96 -168 -220 -115 -183 311 97 -42 -401 -158 -219 183 145 233 51 -499 -195 -197 155 372 247
4726 247 199 -442 -202 136 218 53 -278 -222 -339 -48 -112 346 414 232 -346 -341 -398 122 352 292 -8 -285 -114
4749a14ML16O2P4p26j57L92J91J81K64k41m08p3j16O03l6j9l1p81K04L17K80J02
4772B88pl87k16J54K04K25j63p7k47m00M17M39L72l80l00l11J96J32J18O41n88
4793A10k28J55k61K39K45K45q12k4r5L58n6M24K23o92k90L67J90L57Ll21l06k02
4815c71M4M01L47j1k65m12k03J02N76N9j00o9o18J8M56N85k67q1k44m53K07M65
4837A66R9M5p0m33j76J28N34J13l28L9l17k74K18P89j02j88l76K1k64K41O41l8
4859D68n01n61L43K84J05K97k36l80j94m5N39R1K8j78l16r0K48Q7mL70k38j24
4881go51O50L60q6rk22l74j36M74K07L09l76l31m59K54K91M09r6j56l20O4Q0L25
4904B00L43l75m10mN0J42L27J89k24n11N4O0K28J46Nk44k43JK54K06P5q7L6k89
$$ plain form
4749 -114 -110 206 268 342 -384 -541 -149 42 223 487 246 -162 -235 -351 252 216 197 166 -615 -411 -94 186 288
4772 288 281 -106 -322 -168 36 261 98 21 -226 -626 -209 230 602 222 -78 -389 -193 -61 57 698 110
4793 110 -118 37 -224 15 260 505 -307 -331 -426 -68 -124 300 523 -169 -459 -92 98 455 458 137 -169 -371
4815 -371 -327 74 421 410 145 -267 -470 -368 208 267 167 98 -520 -502 -46 539 272 191 -53 -506 -299 166
4837 166 265 310 240 -193 -369 -241 293 406 78 117 -200 -474 -256 533 431 243 -133 -112 -376 -135 506 468
4859 468 -33 -594 -251 33 138 435 199 -181 -375 -420 119 210 238 60 -256 -346 -98 -11 -15 355 117 -7
4881 -7 -658 -8 352 266 257 35 -339 -475 -1 206 515 139 -192 -651 -397 -106 303 207 51 -269 -205 -125 200
4904 200 543 168 -242 -246 -196 -54 273 462 238 -273 -219 -159 69 215 220 -24 -267 -266 -12 194 269 182 218 -71
4928g1k0K11J84l5j43p6K5j34jL07L8l33j78m2L76k6J82J37m13p2j91M0K73P5
4952A13K73o29K7J22J06P2J82j53k37j24K64J68MJ3k43j4j61K88j9J79P4n01j10
4975c06K01l9K85L9j82j79q7J01K48k69L92k60J12r6m6L31l01K17j54O3k53J69
4997a4J07M1j06j10O3j26N4L76j02k48L17n00J18R6L58L8n39J52K6k03M09K7m31
5020a97P1J35K8K8j68L52k52l50J80K37q3rL01k31l64K55J40j30K38k63L57o13
5042c38N7K67J42j15R3J40l49j01L17k33J41N1k84l9M73P1k04k8L8m0l62K38J59
5065I4k42J16M9k64K02j56K09j53Q4m6l17L35J83L17m84m6n7j09K95r0rK03j07
5088Gk19j1J15O0M42J06o69L05l14J66L50m27K99k39J98l55J03J09K49k45o4K1
$$ plain form
4928 -71 -91 120 304 269 126 50 75 -59 -60 247 285 -48 -226 -268 108 82 264 401 -12 -84 -275 -235 38 113
4952 113 386 -243 -216 -94 12 84 266 113 -124 -248 16 184 188 201 -42 -56 -217 71 52 231 305 -196 -306
4975 -306 -105 -144 141 180 -2 -181 -268 -167 81 -188 204 -56 56 -40 -86 245 -56 161 7 70 -183 -14
4997 -14 93 134 28 -82 -19 -145 -91 285 183 -65 252 -248 -130 -34 324 362 -177 -25 1 -202 207 234 -197
5020 -197 -126 9 37 65 -103 249 -3 -353 -173 64 -19 -28 273 42 -322 -67 73 -57 181 -82 275 -338
5042 -338 -281 -14 128 13 106 246 -103 -204 113 -120 21 72 -212 -251 222 293 89 61 99 59 -303 -65 94
5065 94 -148 -32 17 -247 -45 -201 8 -145 -61 -107 -424 -89 94 411 -73 -119 -176 -285 10 -80 -89 114 7
5088 7 -212 -223 -108 -48 394 500 -169 136 -178 -12 338 -89 210 -29 169 -186 -83 26 275 30 -34 -13
5110a3P0J07M7q1r8l17l0M86j74o8K3J50k44q2M22J58l73R0j28l2K0K11J6o5j63
5135f8k4M8JL48Nl01q2j36n4L93Q1Rl42M2n9L7J96K42k83l8j01J1J44r9K32k42
5161d0P7Qm2p1K35j12j84L9r7J91Q4j22N7k14q8M58l70K54J03k59J17r4j72J80
5185f2K39J29o13M29k02J63j76J92J40j62m24K1M46n3nJ05m75j9J05J60N0q6K50
5208A52l07K54j39L46m46M66j60j40j05K59L9j07q7j12P9L6J47m4j36Q2j03k14
5230b40L39N1o5L1N9l17k0J76K55k35J09k13k41J27J18K32K9o3k48K46r0K72j86
5253A26j96p7m3K57k78L79j76J62K2j05k26O1L50l53j12K93k60j57M48K0j26k78
5275b69L99o4j95K86jk17Q5L9l17J98p7L7J10q9k51K31J18q0J84j59j49K02RM1
$$ plain form
5110 -13 57 164 211 130 32 -285 -315 171 -3 -71 -48 102 -142 -224 198 356 -17 73 -55 -87 -67 144 160 95 -68
5135 -68 -92 -44 -43 305 310 9 -73 -209 -263 130 211 220 -122 -80 -139 -102 94 336 53 15 -86 -75 69 -30 202 -40
5161 -40 37 45 3 -68 167 55 -129 -90 -187 4 88 -34 23 -191 -279 179 -191 63 166 -93 24 -70 -242 -62
5185 -62 177 306 -307 122 -80 83 -93 99 239 77 -347 -326 120 67 62 167 -308 -327 -222 -62 -12 -98 152
5208 152 -155 99 -40 306 -140 326 166 26 -79 180 219 112 25 -87 -8 28 175 131 -5 77 -26 -240
5230 -240 99 150 85 116 175 -142 -162 14 269 34 143 -70 -311 -184 -66 166 195 132 -116 130 40 312 126
5253 126 -70 -147 -190 67 -211 168 -8 154 176 71 -155 -94 256 -97 -209 84 -176 -333 115 135 9 -269
5275 -269 130 66 -129 157 156 -61 24 63 -254 -56 -133 -96 14 -75 -326 -95 23 -57 127 -32 -181 21 30 71
5299G1k0J66l64J04r7RL60J60m81K6N9p1J70m25J83R1l9j49J98K8O1K29l23O2
5323HJ44P6j16R4k59k68J51K87J34k33K23j94kq9o9J52J30j98Q3l66R6n2M36j48
5347B0O3r2k71L95K8k0J13k90J16k18P3p8J28J60k55j33K17m6J43j26L79m62R8
5370e8J06j46J84o3o5J24j35J44j42J56L54n41M7j13K86j94M02k20k30J20rO0
5392F7J70k61K02j31k96K59K10l18J89j83j06J74N7k48J39l67L68m7J91K26k67
5413B8K8qj09p4L4K11o9q1J68q1k88K04K30k22J60k91j04L5J81L51j54k68o6K60
5437G5mL86l47r1k83J37m2NJ82J76k14k59J21Q3m5J64K2l53L35q8J82j11J77j16
5461I2J2l73PL86j95J10J61l25j47L08K2m6q0R0j62J67j9J26J07l28j08JPQ7M09
$$ plain form
5299 71 51 217 -147 -43 -140 -131 229 389 -92 -66 -7 -78 92 -333 -150 -59 -98 -247 -49 -21 40 269 -54 8
5323 8 152 228 112 206 -53 -321 -170 117 251 18 241 47 45 -44 -113 39 169 -29 54 -312 -216 -268 168 20
5347 20 83 -9 -280 115 143 123 236 -54 62 -156 -83 -161 -33 127 -128 -261 -44 -90 53 -73 306 -156 -58
5370 -58 48 -98 86 23 -42 82 -53 91 -51 105 459 -82 -35 -148 138 -56 346 126 -104 16 7 67
5392 67 237 -24 178 47 -249 10 220 -98 91 -92 -198 -24 33 -215 -76 -443 -75 -122 69 295 28
5413 28 56 48 -61 -135 -101 110 41 -40 128 47 -241 -37 193 -29 131 -160 -264 -229 -48 303 149 -119 -185 75
5437 75 71 457 110 19 -264 -127 -169 -164 18 194 -20 -279 -158 -75 -120 44 66 -287 48 -40 142 31 208 92
5461 92 104 -269 -262 124 -71 39 200 -125 -272 36 58 12 -68 22 -140 27 8 134 241 -87 -195 -194 -187 -100 309
5486C09k74j90l5K41l84K22M01m72j07M9O0K57K3j9N5m24P9K20J6j39N5P6j37
5509a18n3KJ74R7L5j20j77J12j45K56l7n5m7o9P6J42j09K29k48l15O6J84L14M2
5533B36p5k51q4J56r9K56k3l0j85n6L4j2L09k13p2K38j65o0J56l3J69j86l82K61
5557a11L30j00j23K24m04J58L7L60j58j16k08K55j53J30j0J33k29J51j70k8LL1
5579Bo1K02K1l05K2J9K66j37J76j97M0j09K26k92R0Q5j1j06P6P1J80k54j52J45
5603cp7J20m9J03j5p3j08j11J65J33o3j53Q4j52K61J52j07J76q4l01K3J63Po7
5627B4n0R0K6r7J10K2M9q1k65K03r9N8K62Q3n14l5J48m0K00K58k64k47N4qJ08
5652eJ78N0m06j09J94P4n5Q0Q9k16Mj28L16j87K22r7M5q3M2J46R3j48qk31J51
$$ plain form
5486 309 35 -155 -190 51 -333 -111 290 -182 -289 -240 -180 77 100 81 136 -288 -209 11 27 -112 -57 19 -118
5509 -118 -171 -169 5 102 137 17 -160 -48 -193 63 26 -29 -76 -145 -69 73 -36 193 -55 -370 -304 -120 194 236
5533 236 161 -90 -174 -18 -117 139 116 86 -99 -155 -121 -133 176 -37 -109 129 -36 -96 60 27 196 10 -372 -111
5557 -111 219 119 -4 220 -184 -26 11 371 213 97 -111 144 -9 121 111 244 15 166 -4 -32 -29 2
5579 2 -59 143 164 -141 -119 -100 166 29 205 8 48 -61 165 -127 -37 48 37 -69 7 78 258 4 -148 -3
5603 -3 -80 40 -9 94 79 6 -102 -213 -48 85 22 -131 -47 -199 62 214 107 283 199 -102 -79 84 91 24
5627 24 -26 64 90 -7 103 125 174 93 -172 31 -68 -10 252 335 -179 -214 -66 -106 94 352 88 -159 -105 -113 -5
5652 -5 173 223 -183 -292 -98 -24 -79 1 90 -126 -122 -250 66 -121 101 4 49 -34 8 154 247 99 91 -140 11
5677A1j12K02J42k25n5JN2LL29m87J74k94j29J25L12j39L00k60n6K41n03L35K76
5700B43j99J50l74j16J28K06P8J61j14k27qK5K29r5p2j28j49O5K12K34j17j18
5722A4j22j42K83Q8J16Ol13J03k29R9K62L7k57j30j23K9K65J31J42l49k41J43
5744a88R7J68L48k38q9k11j14K12K42K87m35l05j56L77J9L28j11m98J10N9M3J69
5766A14P3j70p9m17M11K61k37K10k22l01N6M81k32J37K31l12j62K7P6Q8J50L5
5788B18l10k19L64j97K68pk42K0N2j41K65L80m04lj19j38K23J50J28k01r3j61
5810a67P9r1N61m5l32N3k82J34L48j47o9o6j06o3K00J69K49n22N7K3l01J48L97
5833B27K5k24l40M7J2J54J85J20k35k45J59J45J11J06k54K7l63j6L30J74J61m41
$$ plain form
5677 11 -101 101 243 18 -37 -36 16 19 348 -139 35 -259 -388 -263 49 -90 210 -50 -106 135 -368 -33 243
5700 243 44 194 -180 -296 -168 38 116 277 163 -64 -72 -47 182 87 15 -113 -262 -197 15 249 132 14
5722 14 -108 -250 33 121 237 243 -70 33 -196 -97 165 202 -55 -185 -308 -279 -14 117 259 -90 -331 -188
5744 -188 -91 77 425 187 98 -113 -227 -15 227 514 79 -226 -382 -5 14 342 231 -267 -157 -98 -55 114
5766 114 187 17 -62 -479 -68 193 -44 166 -56 -357 -301 180 -52 85 316 4 -158 -131 -55 33 183 218
5788 218 -92 -311 53 -144 124 117 -125 -105 -53 -194 71 451 47 44 -75 -213 10 160 288 87 -6 -167
5810 -167 -88 -179 382 337 5 58 -224 -90 258 111 42 -24 -130 -193 7 176 425 -97 -40 -17 -318 -170 227
5833 227 252 28 -312 -265 -253 -99 86 206 -29 -274 -115 30 141 247 -7 20 -343 -359 -29 145 306 -135
5855a35O4M9m1L5J26J08k00n4j93J27K8J20j0N7j75j42J65L5K3o9lM3j29K04J13
5880A46k02R1j56j01J05M23j55l0j05l2O3j5K64j02l90J30J20j39j46K15J56j90
5902e0O7J71k57n3K71jj56l8K68k17R6m8j01J36k34Mk4K99K8Jk05r0K25j2J17
5927A97k30Po9K15j90J03J6j2j50j46J64J7O0k4j03O5K2jpr2K6K15n5m04N19j40
5953Ck6m1J05n5j23M3NL1O7j00J08J07k74J33J34J22l65K34l13K4L67j94M0J11
5977A43k44j07K95O5k93K51j29n6j99J50L02N3k28j73k31M53J93l07M26l63M0
5998D1o6K1J23j12k4m5K44l40M61m81J32M2k30K47q3K45J20k08j76J00j12j80
6020b81L59k2Rj09j07J24j89K35J00j22j69n9p6K15M15l01n7k59ON3L73K63m5
$$ plain form
5855 -135 -71 -22 -63 -28 98 206 6 -48 -241 -114 -86 34 24 81 -94 -236 -71 -36 -13 -82 -85 -42 -171 33 146
5880 146 -56 35 -121 -222 -117 306 151 121 16 -16 47 32 296 194 -196 -66 54 -85 -231 -16 140 -50
5902 -50 17 188 -69 -122 149 148 -8 -46 222 5 101 53 -48 88 -146 -142 -166 133 161 162 -43 -133 92 80 197
5927 197 -33 -26 -95 120 -70 33 49 37 -113 -259 -95 -78 -18 -42 -145 -80 -58 -59 -66 -158 -132 83 28 -376 143 3
5953 3 -23 -64 41 -14 -137 -94 -89 -58 9 -91 17 124 -150 -17 117 239 -126 108 -205 -181 186 -8 32 143
5977 143 -101 -208 87 152 -141 110 -19 -75 -274 -124 178 231 3 -170 -401 52 245 -62 364 1 41
5998 41 -25 -4 119 7 -17 -62 182 -158 303 -178 -46 -4 -234 13 -70 175 295 87 -89 11 -101 -281
6020 -281 78 56 65 -44 -151 -27 -216 19 119 -3 -172 -231 -307 -92 323 22 -35 -294 -288 -235 138 401 356
6043C56l96m1QJ62K22j04r7r6j94o8J81M09k50l27J36J29NJ23J29k62j58l6OK07
6067D4O0K02n21K17j16J0J34o0K59m02j84J88K33K05Q3l03k71j58K85J72J99J10
6089C86m18r8J74j28R9R2j62j92j21J86K52Q1j02J30q6l70J79M56q5l10K3n04
6111e18K46K57J68J86m95l5n9j24N47K89l38K4j76p3K35j27K60l50l6RN9K6M51
6134D26K5l74k96J88k59M35J27q9o2m55M3J26L67k13J99m14J24k1N1K32q5p1J82
6157A86n38J41L25J63o1j72k56m6K15Q7N13m33Q8l63J82j03J49o3L8r3k31O54
6179C82n58K32J69l44k25K79K31P9k76J02j65l56N27J52J15j52j3k31k17J85M38
6200C54k34jk99k08N5M28O2o9p5j71j92M56M1J28j7l52l7J67J28j70R2j15J16
$$ plain form
6043 356 -40 -81 -73 89 311 207 110 14 -180 -248 -67 342 92 -235 -99 30 35 158 287 25 -133 -169 -163 44
6067 44 104 306 -215 2 -114 -104 30 -30 229 -173 -357 -169 64 269 352 49 -222 -380 -95 77 276 386
6089 386 -32 -130 44 -84 15 107 -55 -247 -368 -182 70 151 49 179 93 -277 -98 358 273 -37 -14 -518
6111 -518 -272 -15 153 339 -156 -191 -250 -374 173 462 124 148 -28 -101 134 7 267 -83 -119 -110 -51 -25 426
6134 426 451 77 -219 -31 -290 145 272 183 121 -334 -291 -165 202 -11 188 -226 -102 -123 -72 160 75 4 186
6157 186 -352 -211 114 277 216 44 -212 -258 -43 44 557 124 212 -151 31 -72 77 14 52 -41 -272 382
6179 382 -176 56 225 -119 -344 -65 166 245 -31 71 -94 -450 77 229 344 192 179 -52 -269 -84 354
6200 354 120 119 -180 -388 -333 95 157 88 13 -158 -350 106 147 275 258 -94 -131 36 164 -6 86 -29 87
6223H7k75J56K05l9%j73j80K44J52j95J67J28l97L8J3OJ54Lj07N5QK3j30L90k70
6248F3j41l13L79j81K20J08k68m1J39o7O8p2J45K7j49K29Q2l59j68L24p6nJ53
6271I7J5K8l9k36l6J62J45m2lk76K75Nj13J4K2Q9l03m5L25j11r5J13K2J0K90l67
6297e4M2Q9q2J5qJ79k23J02m2j0m03L41K01k5k11P0J13r7k08J07J48j13k05J17
6321a57K73j83j03K60j56j68J31K54j94K99l69J1m2P8J61pJ82l16k38K72n5J46
6343G9p0k5Ql17M16l0K75m89J03k9q8L05On2k59n1j53M89k1J28o6m12J98m7j12
6368b14M9K50J01l96J94l95L63L39j44l07k41K87l7J91J74l8r3l72j10J62N67
6389C30k68o6J28l06j54M86K58k71j11l29K67k86J21N99j96j42j63M4K13l5J8
$$ plain form
6223 87 -188 -32 173 134 134 -39 -219 25 177 -18 149 277 -120 -82 -69 -63 91 94 -13 42 50 73 -57 333 63
6248 63 -78 -391 -12 -193 27 135 -133 -174 -35 -102 -34 -106 39 66 -83 146 228 -131 -299 25 -51 -56 97
6271 97 112 140 101 -135 -171 -9 136 94 91 -185 90 95 -18 -4 18 107 -196 -241 84 -27 -122 -9 13 23 313 -54
6297 -54 -12 77 -5 10 2 181 -42 60 18 8 -395 -54 147 122 -89 -19 94 -3 -211 -104 44 -69 -274 -157
6321 -157 116 -67 -170 90 -66 -234 -103 151 -43 256 -113 -102 -144 -66 95 88 270 -46 -284 -12 -67 79
6343 79 9 -16 -8 -325 91 61 336 -153 -50 -79 -167 138 144 92 -167 -218 -371 118 97 225 159 -253 -55 -102 -214
6368 -214 -165 85 186 -210 -16 -411 -48 291 147 -160 -401 -114 -151 40 214 176 83 -289 -399 -237 330
6389 330 62 -4 124 -182 -336 150 408 137 26 -303 -36 -322 -201 398 202 60 -103 -59 154 119 137
6410A37l0l62j81K75K82O7k75J32k87J67R8M42l74n9l2j42O2Q9J79O7k56k16P2
6433a45J84M3MJ75m97J7J78P8J76P4m70K37m19K01M05R5J3o26J6L4J80J78L7K6
6457A94l21l82L78M56j06k33J1r6k97L75K28Q1k91P8n17L16K4M34k42k82M04n79
6479c67J54K94M90l46j61l70K11J12J39p0J0l24m8n5M33k8L3N5n27R7L91j31L54
6502C46m13jk06J98j19L29K11l40j87J52k67K83J45L1j92k3j23K65J15ok49j33
6524a84l5J57rJ50J94l17k64M96j00J33qj29k11J02M0r3M8J17P1l87K8K27MQ7
6548A17Nk49r1m2N01J34l91J41r5j45j24K82K51k14n3mp7M82k87J13r9k43m6Q2
6572e2r6J74r0J22r4m7J32J50q3k43k4O7L7J1K77j18m1m97N15J78l6o4l96R4L20
$$ plain form
6410 137 107 -255 -436 -161 121 188 -87 45 -242 -75 23 465 91 32 0 -142 -80 9 188 255 -1 -217 -145
6433 -145 39 82 86 261 -236 -219 -41 37 213 287 -183 54 -365 -164 241 336 349 -277 -261 -227 -47 131 168 194
6457 194 -127 -509 -131 325 219 -14 -3 -99 -396 -21 207 288 -3 75 -442 -126 -102 332 90 -192 212 -367
6479 -367 -213 81 571 225 64 -306 -95 17 156 86 96 -228 -276 -331 102 74 107 162 -365 -268 123 -8 346
6502 346 -67 -68 -274 -76 -195 134 345 5 -182 -30 -297 -14 131 162 -30 -53 -176 89 204 198 -51 -184
6524 -184 -219 -62 -71 79 273 -44 -308 188 88 221 213 84 -127 -25 15 -78 -30 87 158 -229 -201 26 30 117
6548 117 122 -127 -218 -260 241 375 -16 125 30 -115 -239 43 294 80 27 23 -54 428 141 254 155 -88 -134 -52
6572 -52 -148 26 -64 58 -36 -83 49 199 116 -127 -151 -84 -47 -36 241 123 82 -415 100 278 242 178 -218 -124 196
6597A96j17j68k5NjK5j68J65j9R3J26k62j02J45O1R6m9n8j61K34J14p6L3l78n
6622b96J18J45J48N0k10K53l62lL98R2j48l98K21k7l6R1J38j73J09Ok48J2L01
6645A81qK3k38m4j22J86J84P4j88J8j87L0J23K1n1k19j53K72K2J57R2N4m43J03
6669a13j05K53K25k78J2k50j50L07J96R7J8n15K09K09r6j53K18Mk14J26k3j11
6691a34K47j9m0k52J00K12k96J98j43L7j11J27R8J31l79P6K06l50L97L02n50J16
6713b7k48p8K28J80K35j24j93k44J09jK59J73k71Oj30q3M01O3k51O6l39J50J41
6736B2R5j22O3j62M9P4O7J53j44n9o1q1L17k12J72j29j37M6j40J45J46r3L9l94
6760c46K04P9K79j11J76j26l97K63m5K5j35R0l39LK87J00N8J07l62J5o2L93L9
$$ plain form
6597 196 79 -89 -114 -109 -110 -85 -253 -88 -107 -14 112 -150 -252 -107 -46 50 1 -57 -218 16 130 54 87 -291 -296
6622 -296 -178 -33 115 165 -45 208 -154 -157 241 333 185 -213 8 -19 -55 36 174 1 110 116 -132 -120 181
6645 181 173 196 -42 -86 -208 -22 162 236 48 66 -121 -91 32 53 2 -217 -370 -98 -76 81 173 227 -216 -113
6669 -113 -218 35 260 -18 -6 -256 -406 -99 97 194 212 -303 -94 115 19 -134 84 88 -126 0 -23 -134
6691 -134 113 94 54 -198 -98 114 -182 16 -127 -90 -201 -74 24 155 -224 -148 58 -292 105 407 -143 -27
6713 -27 -275 -353 -125 55 290 166 -27 -271 -162 -163 96 269 -2 4 -126 -209 192 255 4 70 -269 -119 22
6736 22 117 -5 58 -104 -55 19 86 239 95 36 -25 -106 211 -1 171 42 -95 -49 -189 -44 102 9 48 -346
6760 -346 -142 -63 216 105 281 155 -242 21 -24 1 -134 -44 -383 -380 -93 7 65 172 -190 -175 -237 156 195
6783A95j26J1j26k09K32K69o4j73j12K5MR0N6R8k12J5j73L1L34p5L8j81j53J67
6807c9j3J77O4J48m20l9P8R2j83K66j32j33K9M9K0NM28m06l67L15q1L15K15k67
6831A21k14j51K10k26M94J24k44j62o3O9L59r9j60j07m39L96K98j11J54k17n47
6852e15L26j03L65p3J13j57k01J73K73K31k20j69j94J2J87k14K92p6j94J42j06
6873a08K20J07p5j23j61j27K97L20l13L47m75J33k42o4J94J30K14o28N01l49J18
6894h4p2K87k19j02r2L37J95M2k73k05r1K00rM35q4l24J9j18Q2N08n64L34j36
6917F6j04J42k23K82m5n5m19J90N3P4K15j20l3k23J29j4O9L26k31l94K62n6K00
6940I1N3q8j09o4P8J33l4j53M21p57J88J09K09J34l9k42m1J20nM14m11j7L8j10
$$ plain form
6783 195 69 80 -46 -255 -23 246 182 9 -103 -78 -74 16 72 170 -42 -27 -200 -169 165 90 128 -53 -206 -39
6807 -39 -52 125 189 337 -83 -122 -44 48 -135 131 -1 -134 -105 -56 -36 -31 397 -9 -376 -61 -142 173 388 121
6831 121 -93 -244 -34 -260 234 358 114 -48 -111 -42 317 218 58 -49 -488 -92 206 95 249 32 -515
6852 -515 -189 -292 73 0 113 -44 -245 -72 201 432 212 43 -151 -139 48 -166 126 50 -144 -2 -108
6873 -108 112 219 144 21 -140 -267 30 350 37 384 -91 42 -200 -264 -70 60 274 -354 147 -202 -84
6894 -84 -156 131 -88 -190 -282 55 250 292 19 -186 -277 -77 -86 349 265 -59 -40 -158 -76 432 -132 202 66
6917 66 -38 104 -119 163 118 63 -356 -166 -113 -39 176 56 23 -200 -71 -85 -16 310 79 -315 -53 -109 91
6940 91 144 56 -53 -117 -39 94 60 -93 328 -429 -241 -132 77 211 172 -70 -111 9 4 418 7 -10 28 -82
6964h2J61n9KJ04l45L30k70Q1Q9L15k01r2n7j57qJ17K18j11K4j71J46j9J56j14
6988E7j66j61K94k4J69j72K71k68j44j3K05Q1r6j22J04M7j10K92q5j74Jq5j03
7011b02M36k64K29k35L3j14P0J57j18J37j22l07L03q2K60J20k35l15J66L4Q5J38
7033A74l65K84k52K20J85J4j06p6k68L57k93J28J52n5j57r5n3J17K9J90K5j36
7055A9K5l09K13R3L8j5l33J35jL7L92k14%k56M5J70N2J32j86j64n7R7O3J87l96
7080b33K38j38O7J12K63j69m7l14nj48O51k44j3o9q8J87J20j6n4m8J48l57m8N02
7104B97j23k17j4J1j7N7J10K0j49r4r3p8L81p5N7j79j4O2j1J54j6p9j75J70j44
7129a59L72p2O6l98N2o2K87J32k50j28j31N5Q4K51P0k02M5j82r4L81j2J05m8m05
$$ plain form
6964 -82 79 20 22 126 -219 111 -159 -78 11 326 125 33 -24 -181 -189 -72 146 35 59 -112 34 15 171 57
6988 57 -109 -270 24 0 169 -3 268 0 -144 -157 48 129 33 -89 15 62 -48 244 159 -15 -14 -99 -202
7011 -202 234 -30 199 -36 -3 -117 -47 110 -8 129 7 -300 3 -79 181 301 66 -249 -83 -49 36 174
7033 174 -191 93 -159 61 246 260 154 78 -190 167 -126 2 154 99 -58 -153 -206 -89 -60 130 155 19
7055 19 44 -265 -52 41 79 64 -269 -134 -135 -98 294 80 80 -176 -131 39 91 223 37 -127 -184 -87 -24 163 -233
7080 -233 5 -133 -66 46 309 140 93 -221 -226 -374 277 33 20 -49 -137 50 170 154 100 52 200 -157 -205 297
7104 297 174 -43 -57 -46 -63 -6 104 124 -25 -119 -212 -290 91 16 73 -106 -120 -58 -69 85 69 -10 -185 -15 -159
7129 -159 213 141 207 -191 -139 -201 86 218 -32 -160 -291 -236 -152 99 169 -33 12 -170 -264 117 105 210 162 -243
7153b43J44L70k00K66j69j65j45J16kN2J45j70j90K24m28L47pK39j51k59Q4Mn
7176a43L47L4j53J08k65m9J36K37l32K8j7q2M2L29r9k10O0k67J97J21p9q3J5l03
7200d28J78M68k26k26L56j84l37O13j49K23k24j98k17J76K10J84k23L40m07l26
7220c97K26L67J5j13j48j8k04N07k60P7Ok43Q4j28K87l6J36l77l57M43L25j48
7242D4L93l18j75k10L64l9l5K58k47l29J25J19N3J99Q8l90j24j12M71J59M9l63
7264b0k8k71L64J63k23K69l03k74N5M63l77K84R8n66J19L61j22n2J0K50k41m9
7286i0J08J68K9n7l54J51j21N6K78o1l5l27kL54l4J97n2k82k11J21L43J30k06
7309A03k16q3J9L3K96J63l20j32J99o6o3J39l1j6J3j01J40j28K18K10k91J30l89
$$ plain form
7153 -243 -99 271 71 337 168 3 -142 -26 -28 24 169 -1 -191 33 -395 -48 -55 184 33 -226 -142 -138 -143
7176 -143 204 238 85 193 -72 -121 15 252 -80 -52 -69 -151 -109 220 121 -89 -29 -296 -99 22 -57 -140 -125 -428
7200 -428 -250 218 -8 -234 122 -62 -399 214 65 288 64 -134 -351 -175 35 219 -4 336 -71 -397
7220 -397 -171 196 211 98 -50 -68 -272 235 -25 52 58 -185 -101 -229 58 22 158 -219 -576 -133 192 44
7242 44 437 119 -56 -266 98 59 24 282 35 -294 -169 -50 3 202 290 -100 -224 -336 135 294 343 -20
7264 -20 -48 -319 45 208 -15 254 -49 -323 -268 195 -182 102 200 -366 -247 114 -8 -60 -50 200 -41 -90
7286 -90 18 186 215 158 -196 -45 -166 -110 168 107 72 -255 -257 97 63 260 208 -74 -285 -164 179 309 103
7309 103 -113 -196 -177 -144 152 315 -5 -137 62 -4 -67 72 41 25 38 -63 77 -51 167 377 86 216 -173
7332a73J50K26j11j85J8J6N9J4j29L08O7m66J45K08p2kj34J17k37K0J40K01k49
7355f9J73j47j08m9L36m9O1l77J70rJ63P1j74N8k5j27O7K83J47j83l31k27J72
7378a74J07L15N6l05k3j00N8J05J08j51J03q7N3j89Q3o8L2J23l03L91l02J97J63
7401A92j86Pj15O9J47l0k24K32j59J03J19j6o7j67R8J22l07L24j9K9m31J28J54
7424CJ8o9J80jl90L11k21M07j89M2R0l57J25K09N8k75L6j13r0K0L57J07qm86K9
7449b07K94j34K51q0k70J58k54K54J61n1rj90m5K10j40J88q5j45R5P4m3r5K66
7472B03q3j50J41p0J77j29O6k96j0q5K15J82R6o6j30j49k5n5N11k64J47o0l17
7495a51lL88j43M6J77l16O7j4K51k01Q8l23K26j04o1L32j58K9ok28L6J34L12k28
$$ plain form
7332 -173 -23 203 92 -93 -75 -59 0 14 -115 193 260 -206 -61 147 75 73 -61 56 -181 -161 -21 180 -69
7355 -69 104 -43 -151 -200 136 87 148 -229 -59 -68 95 166 -8 50 25 -102 -35 248 395 212 -119 -346 -174
7378 -174 -67 248 304 -1 -24 -124 -66 39 147 -4 99 12 65 -124 -41 -109 -77 46 -257 134 -168 29 192
7401 192 6 13 -102 -33 114 84 -140 92 -67 36 155 139 72 -95 3 125 -182 142 123 152 -279 -151 3
7424 3 21 -48 132 131 -259 52 -169 238 49 91 181 -176 -51 158 216 -59 -23 -136 -226 -206 151 258 250 -236 -207
7449 -207 87 -47 204 124 -146 12 -242 12 173 122 113 -77 -122 88 -52 136 51 -94 1 75 32 -63 203
7472 203 120 -30 111 41 218 89 155 -141 -151 -236 -21 161 257 191 61 -88 -113 -168 343 79 226 166 -151
7495 -151 -154 234 91 137 314 -2 65 51 302 101 189 -134 92 -12 -73 259 101 130 124 -104 -68 66 378 150
7519A50j40K2k55K38J13q5J07l03Nj80M64K59o8l74K1n4j63Q5M07j45l33k4K06
7542d7J01K77M5k77l43M6K77P2l06K68j62j5n8J77J87Q8o37n9L91j03m1K95L6
7565B12j91l5L5j04L70r9r2j99k14K72k7L32l85%o6J41P6K69j94j17j70j58J42
7588b02K39K81J10n73j49M7K22K74q0p6m7j77K7j29N45k46J0k9k09J23J38J61
7610B60n0r1m68J80p5L72OP6j22j50r5J03K98l1l07o9n2J40N31n0k64k26j4j00
7634a98N1K79R3j99q3p3J44J13J34P2j58j10k23J99P6K40j08m37j93R8L89m5J41
7657B02k97P2k87M00R2k7K11n75j93L06J80Q2M0k25k61j15K45M2M51o3m45L5j17
7680b47J85M23j05l53o0Q4l51M44L5J54k21l6j08J64J49J91n84N6L70k82J63J65
$$ plain form
7519 150 10 32 -223 15 128 43 150 -153 -148 -328 136 395 327 -47 -26 -80 -243 -158 249 104 -229 -253 -47
7542 -47 54 331 376 99 -244 -198 79 151 -155 113 -49 -64 -122 55 242 330 -307 -366 25 -78 -119 176 212
7565 212 21 -14 21 -83 287 188 96 -103 -317 -45 -72 260 -125 -125 -191 -50 26 295 101 -16 -186 -344 -202
7588 -202 37 318 428 -145 -294 -247 -25 249 169 93 46 -131 -104 -233 312 66 76 47 -162 -39 99 260
7610 260 210 119 -349 -169 -244 128 134 210 88 -62 -157 -54 244 213 -94 -163 -215 -75 456 406 142 -84 -98 -198
7634 -198 -147 132 225 26 -57 -130 14 127 261 333 175 65 -158 41 117 357 249 -188 -381 -283 106 61 202
7657 202 -95 -23 -310 90 182 155 366 -209 -402 -96 84 166 206 -19 -280 -395 -150 -108 343 280 -165 -130 -247
7680 -247 -62 361 256 -97 -157 -73 -424 20 55 209 -12 -48 -156 8 157 348 -236 -180 190 -92 71 236
7702B36j63j00m5j34K83j91M63m37j7m1M8O4j80M49j94k90N6K86k1K00j63j17
7724hl50JL63L7k61L27l73K53J03j26K85k04q6o1r0J89K56Op1l53k7P2L15l20
7748a23J03j13J10k89L41k5K14k43j8o9K43j56K45j55l02J78J08k7J77p1lj45
7770b0O2qr5J81J9j99k05K16J00P7Pr7j16j52L49p3O7J24k80q2r0K61J54o3N3
7795A90j92l76K61L29pj3k9l20P6M6J73K08m00J00k29l2L77j41J24j55J3p9m1
7818a17K39j9J95l92K3o3J44L80j94j76j01l9J15M4J8K36n35K8k9K86O9LL0n48
7842d03J10K56K4L11m0l31j66j20L30N9N2l0j95k00L51n8L30k14j20k35J37J17
7864c5O6K46j23k16l08J11L08K13R2k68j10j29l9J60L59m02p2O7k7j34N68j99
$$ plain form
7702 236 73 -27 -72 -206 77 -114 349 -88 -105 -146 -98 -34 -214 235 41 -249 -193 93 72 272 109 -8
7724 -8 -358 -357 6 43 -218 109 -264 -11 92 -34 251 47 -39 -100 -190 -1 255 261 190 -163 -190 -118 197 -123
7748 -123 -20 -133 -23 -312 29 4 218 -25 -43 -112 131 -25 220 65 -237 -59 49 22 199 128 125 -20
7770 -20 42 34 -61 120 139 -60 -265 -49 51 128 135 38 -78 -230 119 46 113 237 -43 -125 -215 46 200 137 190
7795 190 -2 -378 -117 212 205 192 163 -157 -81 -35 138 346 -54 46 -183 -215 162 21 145 -10 3 -76 -117
7818 -117 122 103 298 -94 -71 -134 10 390 196 20 -81 -120 -5 39 57 293 -242 -214 -243 43 112 115 145 -403
7842 -403 -293 -37 -13 298 258 -73 -239 -359 -29 30 82 52 -143 -343 8 -50 280 66 -54 -289 -152 -35
7864 -35 31 277 154 -62 -370 -259 49 262 354 86 -24 -153 -192 -32 327 -75 -147 -80 -107 -241 327 128
7886A28o7N3k75JL88J51j83k00l04o9K23K72j41KN3N6n67N97J27k9j57k43k15
7909c99K59M51J4j25l20l57J92J58L13ln6l16j55K55J90j92K45r3k89P5J99m7
7931aL57j35Q8o37J17L05J48L8k48j37k94K95K56J94n7o28K13j05nK52K45m7m01
7954a87l17L72R5J91j58J27m36N7R6L10L94m89k03k34J41K66L67k52m8l37k08
7975d53L16K83rL90p32j32J20P4K98P8l60k03k14L33M23PK79o12k49j05N15k1
7997B6J63L49r55Q3J50Q2M40k76p7k35j36L13J41K94k41r4k10J42j96L52J08M3
8019B66o17L08J2j7M12l05j35k26K88j68L46L0p0k10o8lK87q3r3K74m00r6J41
8042a27J01J94J12m12pl6K69k52M15l00R6l03J79K35n7M9k98R0k15K01J71n4j02
$$ plain form
7886 128 61 114 -161 -160 228 379 196 -4 -308 -377 -154 118 -23 -21 32 88 -479 118 245 216 59 -184 -399
7909 -399 -140 311 325 200 -120 -477 -285 -127 186 183 127 -189 -344 -89 101 -91 154 61 -228 -153 46 -1
7931 -1 356 221 309 -328 -211 94 242 280 32 -105 -399 -104 152 346 289 -339 -126 -231 -236 16 261 214 -187
7954 -187 -504 -132 -37 154 -4 123 -313 -256 -160 150 544 55 -148 -382 -241 25 392 140 92 -245 -453
7975 -453 -137 146 137 527 -205 -337 -217 -143 155 233 -127 -330 -544 -211 212 219 498 -114 -363 -468 47 26
7997 26 189 538 -417 -334 -184 -102 338 62 -15 -250 -386 -73 68 362 121 27 -183 -41 -237 115 223 266
8019 266 -351 -43 -31 -48 364 59 -76 -302 -14 -182 164 194 124 -86 -154 -157 130 47 -46 228 -172 -268 -127
8042 -127 -26 168 280 -132 -139 -175 94 -158 257 -43 53 -250 -71 164 107 156 -142 -52 -267 -66 105 51 -51
8065e1L19m55m6K43J51k41j09J60o4j71L19J23j85j61l7N1K53m4j55J07k5q7L94
8088B89l71K16j59ok02K20J03o5j77K02j59k7o5K59L07l59Q7j12k06M79j42k09
8110i7o9j38J39K11J47j65j46oO2N0M2nJ77j89j43LM5J34J19q9j16k73N5N17j22
8135A43m7O3l55J80K27K5k05J04k44n1N4P4K77q8j42j46k37L01J52J28j04j64
8157e5j50J69K73J07k35p3j11J6j23M29J90l20q9k89Q4J05kK95j75mk91J18L65
8180B34j62O3j45k60J42L0M71Ml39o6j23
$$ plain form
8065 -51 268 -187 -233 10 161 -80 -189 -29 -93 -264 55 178 -7 -168 -205 -154 99 55 -100 7 -18 -105 289
8088 289 -82 134 -25 -31 -233 -13 90 25 -152 50 -109 -136 -201 58 365 6 93 -19 -225 254 112 -97
8110 -97 -166 -304 -165 46 193 28 -118 -124 -62 -12 30 25 202 13 -130 -127 -82 52 171 82 -34 -307 -252 265 143
8135 143 96 159 -196 -16 211 236 31 135 -109 -160 -106 -32 245 157 15 -131 -368 -67 85 213 109 -55
8157 -55 -205 -36 237 344 109 36 -75 -59 -182 247 437 117 28 -261 -177 -72 -74 221 46 42 -249 -131 234
8180 234 72 135 -10 -270 -128 -98 373 377 38 -28 -151
8191a51
$$ Imaginary data points
##PAGE= N=2
##DATA TABLE= (X++(I..I)), XYDATA
0@%%%%%%%qJ4j4J6j6K4l2M0n6P2q8J05j28J57j90K24k63L09l59M18m88N65o47
30c45P42q49R64j093J236j394J570j758J967k199K450k728L028l353L712m103
46b153M531m999N508o069O688p367Q119q954R884j0934J2123j3476J5040j6871
60h930J9051k1697K4980k9191L4818m2756N4882p5925J22657m14915J64549O37103
72D64626l48804J01115P9266n58071l39778O65896L30950k88382J3597J02256
82B22671n56724j85844N93904K12917l40343R8276J36606l66591q7182M81882
92B09572M4667l66977M6834J54544k39836L5776L79805j08692l94204P2250J78907
103A2646p7441J27484K82079j98824m00790L1325J82317K6567J90704J69631k96002
$$ plain form
0 0 0 0 0 0 0 0 0 -8 6 -8 8 -8 16 -16 24 -32 40 -48 57 -71 86 -104 120 -143 166 -193 225 -263 302 -345
30 -345 397 -452 512 -581 655 -739 831 -927 1040 -1159 1291 -1437 1591 -1762 1950 -2153
46 -2153 2378 -2621 2887 -3182 3506 -3861 4258 -4696 5188 -5746 6377 -7099 7941 -8930
60 -8930 10121 -11576 13404 -15787 19031 -23725 31157 -44768 77889 -337026 -172477 464626
72 464626 115822 216937 296203 -261868 -601646 64250 395200 106818 120415 222671
82 222671 -334053 -519897 74007 286924 -53419 44857 181463 -185128 -272310 209572
92 209572 254239 -112738 -65904 88640 -151196 -115420 264385 155693 -238511 -166261 12646
103 12646 -64795 62689 344768 145944 -254846 -223521 -41204 -14637 176067 345698 49696
114D9696l50068M9983J53647J04310K19759Q8996k91278k79467M7232J36144J27103
125E6057J85459j4209k73345j53432M5804P0488J41162J48455q2114k07912m9587
136a33174O3325M5535J04746P7723j36626j43495N4025N3105O781R6915J3677
147A02537j72411o7276J29016O8956j6085M3997l8155j79987j0261J76423M6645
158H3399l4819K9523q6224j69010N5751J99008L7085n6325J23q7234j43630Q1227
170i1126J89616O468n5451n621j02713j02498J08632J53162j4146n7211p353p5852
182e4093p2309J02816J16600l4569m3505r906o6761j9959R6114N8404m2481l2293
194a942l583l6034J013P5845J9828n3552j7115n348j7154L9987M5853k8559l9671
$$ plain form
114 49696 -300372 -250389 -96742 7568 227327 316323 25045 -254422 -207190 -71046 56057
125 56057 241516 227307 -46038 -199470 -153666 -83178 57984 206439 124325 -83587 -133174
136 -133174 -69849 -24314 80432 158155 21529 -121966 -67941 -14836 -8055 88860 102537
147 102537 -69874 -137150 -8134 60822 44737 88734 50579 -129408 -139669 36754 83399
158 83399 48580 78103 -8121 -177131 -121380 77628 114713 58388 58511 -28723 -172353 -91126
170 -91126 98490 104958 49507 43886 -58827 -161325 -52693 100469 86323 29112 21759 -54093
182 -54093 -126402 -23586 93014 58445 14940 5034 -61727 -81686 14428 72832 30351 -1942
194 -1942 -5525 -41559 -40546 35299 55127 1575 -15540 -20888 -38042 1945 47798 19239 -20432
207b0432K561j776l769M5560L3696m8581l8467J8250n853K529N7816L282o1717
220a6901q493K3819j9678K240N9119J455o7701l3L6629l0078j487O0966j4378
233B5479n6084K4404K7789m0826l215N6767j1513n4271L0836L4012n2930j1386
245c0938N3204j1367l2314L4486J3406n2233p605N0355k697k9768L2693J1608
257B8830o0706n684N7272M253k3184J2900l831m1998L82N1426J0008k7460L284
270E492q443l8395J6938N5128L972l0782j2487q039j3932J8941M7482M615l8588
283A902k0009q271k229L5390L9270j1176m2977k7629K436J9320L2023K9447j7416
296C0081n1764k6013J2781L6170M0710N704l6305m4891j7264K7815M6225K7085
$$ plain form
207 -20432 -17871 -19647 -23416 22144 55840 7259 -31208 -12958 -18811 -16282 41534 44816 -16901
220 -16901 -25394 -1575 -21253 -19013 40106 41561 -26140 -26173 10456 -19622 -21109 39857 25479
233 25479 -30605 -6201 21588 -19238 -22453 34314 22801 -31470 -634 33378 -19552 -30938
245 -30938 22266 10899 -21415 13071 26477 -25756 -33361 16994 14297 -15471 17222 28830
257 28830 -31876 -37560 19712 23965 781 13681 9850 -32148 -31766 19660 29668 2208 5492
270 5492 -2951 -41346 -24408 30720 34692 3910 -8577 -16616 -30548 -11607 35875 40490 1902
283 1902 -18107 -26378 -28607 6783 46053 34877 -8100 -35729 -33293 -13973 18050 47497 30081
296 30081 -21683 -47696 -34915 1255 41965 47669 11364 -33527 -50791 -22976 23249 50334
308E0334q100m6644m6769P34M1298M8531J7073l5180n1332k4896J4587M9370M3927
321E2933l43m4054n3866j3157L7934M9925L0571j6266o0024m2367J1255M4847
333b612M6874J6057l3822o1073l5798L0890O2501L3230p093m4285n8792j1561
345f5484M8671N8272K2969k6184n5662m6637O079O5341N6035n830m4075n2163
357c8668k9913K9535O6296L9903j9131n7660m7915m402M5708O5773K1220m2436
369B8310n8012l3870J4826N8672N1336k65m8892o1159j9624L8759O3423L4520
381F8024k4531n8521m4545k301N1032O3895J1941m0874n4754l5021J7512O5848
393A7705N0254j3210n5813m4273j1439K5926O3960M0565l6938o2818k9174O597
$$ plain form
308 50334 42234 -4410 -51179 -50445 -9147 39384 56457 21277 -30055 -54951 -40364 9006 52933
321 52933 52590 8536 -45330 -58487 -20553 29372 59943 43677 -16347 -58714 -47459 -2612
333 -2612 44262 60319 26497 -34576 -70374 -39484 23017 56247 49154 4869 -53923 -65484
345 -65484 -16813 41459 64428 38244 -17418 -64055 -57976 7365 63400 57570 13495 -38668
357 -38668 -68581 -39046 27250 67153 48022 -9638 -57553 -61955 -16247 49526 70746 28310
369 28310 -29702 -63572 -48746 9926 61262 60997 12105 -49054 -68678 -29919 33504 68024
381 68024 43493 -15028 -59573 -61874 -10842 53053 64994 24120 -30634 -65655 -48143 17705
393 17705 67959 54749 -1064 -45337 -56776 -30850 33110 73675 36737 -26081 -55255 -48658
405d8658M0324N7804J6214n0393o0375r561K6145L9650M7159O77o5701n2204J0334
418d8585L9549M2225K6840k1675o4810l9602K6553N0104L2605R696l3916o4225
430d5241k1343M1694N4182K5488j4453m3655m5530o652M5853N2928J2506k9328
442B6449m8916l1013J3263M4849M3212K380m5356m3260o149K0086L6662L6770
454D8977p160n3495l7192J7325L2000J9669K2557j0742o0730k4144M1799K9342
466A8206L501J2470j7131o1162j1972O3036L0420k0919K717j2574o0695L130P8237
479B7264K1471l5339k606j2198n5024J2343Q7102J1922n3977k81k782n4638J8606
492c8137Q8417J20n9358K223M470m6946J9616Q3842j0749o6201J4366J5020m5906
$$ plain form
405 -48658 -8334 49470 65684 15291 -45084 -54645 -28500 11150 58309 58986 -6715 -58919 -48585
418 -48585 -9036 33189 60029 38354 -26456 -66058 -39505 10599 43204 52900 18984 -45241
430 -45241 -66584 -24890 29292 54780 40327 -3328 -48858 -55510 -9657 43271 55777 26449
442 26449 -22467 -53480 -40217 4632 47844 50224 4868 -38392 -44541 -24455 12207 48977
454 48977 41817 -11678 -48870 -31545 455 20124 42681 31939 -28791 -52935 -11136 18206
466 18206 21707 34177 17046 -44116 -56088 6948 37368 16449 19166 6592 -54103 -50973 27264
479 27264 48735 13396 10790 -1408 -56432 -44089 43013 54935 958 677 -2105 -56743 -38137
492 -38137 50280 50400 -8958 -6735 -2265 -49211 -29595 54247 43498 -22703 -8337 6683 -39223
505c9223K0337P3459k3074o4632K1457K5256l8342J4218N9655l4049o1564L5728
517a0774L0830l5154J4271M4413m2274n3335M0861L7534k7490O839L1637m4321
529f963m4551M4145L2805k2899R066J8382m4070l3308L9924K9139j7920N976J4092
542B3818l7153k4459L4140J9350j2395P740N954k7615j3083K3512J1117j0200
554G26N112N347j7952n259J4670m9n676M713o69m445M345L375o459k872M530q35
570a398J080R553k428j1898K713J684p100R265J2598j1542j0645Q577o0j2133
584a1734Q999J6093j2079j0020J4709k713j7076J1819J3916j4201k617J8098o782
597F412k1033R288J3983j3576P87K1448j0001k3425Q849Q397r912R738J9769j3145
$$ plain form
505 -39223 -18886 54573 31499 -33133 -11676 13580 -24762 -10544 49111 15062 -46502 -10774
517 -10774 20056 -15098 -827 43586 1312 -52023 -11162 26372 -1118 5721 37358 -6963
529 -6963 -51514 -7369 25436 2537 11603 29985 -14085 -47393 -7469 21670 3750 9726 23818
542 23818 -13335 -37794 -3654 15696 3301 11041 16995 -10620 -23703 -191 10926 726
554 726 5838 11185 -6767 -12026 2644 2595 -3081 1632 963 -3482 863 4238 -2221 -5093 -563 -1398
570 -1398 -318 9235 6807 -5091 -2378 -694 -7794 1471 14069 2527 -8118 459 399 -11734
584 -11734 -2735 13358 1279 -8741 5968 3255 -13821 -2002 11914 -2287 -4904 13194 6412
597 6412 -14621 -5333 8650 -4926 -4139 17309 7308 -16117 -7268 1129 -8783 955 20724 7579
611G579k3317O488Q428o982J2709J8826j6166k1999N238M869o57J5605R331j8118
625A834j6075N447M085J464J4525M080k0347q914Q745K683N419J1562p193j7334
639a0019L68Q989K284O260O809j4934j8233R545J3266m10P795Q71k4222j2541
653b4172J8522J3695l64P454l225k9904j0031K8499J4978n296O348q355l2443
666b4294k741L2591J1912q121L415r714l1970L173L8400P505j5305L220q931k7751
680b8611J0641L7778K246j9445M1o863k2011J5574L7603o422k5618L30l900j4237
694b2894K0050L2096j1301k9091j675J858n156K2599K6796j9755l0697J602O413
707i155J651K2059J7236k3261l1257K385J3774O683J7161Q892k6426k6130O817
$$ plain form
611 7579 -15738 -9250 -822 -7804 4905 23731 7565 -14434 -9196 -4327 -4984 10621 19952 1834
625 1834 -14241 -8794 -4709 -3245 11280 15360 -4987 -13901 -5156 -2473 2946 14508 7315 -10019
639 -10019 -9651 -662 1622 7882 14691 -243 -18476 -8931 4335 3925 11720 12591 -11631 -24172
653 -24172 -5650 8045 7681 15135 11910 -17994 -28025 474 15452 10156 16504 8149 -24294
666 -24294 -27035 5556 17468 9347 12762 3048 -28922 -25749 12651 20156 4851 8071 -860 -28611
680 -28611 -17970 19808 22054 2609 2650 -4213 -26224 -10650 26953 20531 -5087 -4757 -8657 -22894
694 -22894 -2844 29252 17951 -11140 -12815 -10957 -16113 6486 33282 13527 -17170 -15568 -9155
707 -9155 -7504 14555 31791 8530 -22727 -20342 -6568 115 17276 26168 -258 -26388 -19571
720a9571J6578J0174J2335K93k5384k1635J0949K1731Q801M610o388k4196j4296
733b5999J4888K0623Q675k821j2792k0191o944J8346K2408K725r585j5335j4803
746b0805K363K0217J8505L67j6437j7699o721R024K0715J3316p439j9195j4599
759a8388p28J4785J7898P440j0451k1857j0663Q074J7046J4302J114j4374j7913
772a3715o357J1574J9036Q954m983j6184j6645K86J6431J5623L814j0399j6835
785i400j0067M895J8004J4562k278j4552j5010m735J1467J8428P594o996j6321
798d409j1959J943J3295J5361L608j2832j6289o381P024J5438J0546k693j2772
811a20j3475k256J0961J4499P048o543j5188r128K847J2534J2055R70j0207j2577
$$ plain form
720 -19571 -2993 7181 19516 19809 -5575 -27210 -16261 5470 14271 18881 12493 -11703 -25999
733 -25999 -11111 9512 18187 15366 2574 -17617 -24561 -6215 16193 18918 9333 -6002 -20805
746 -20805 -18442 1775 20280 20647 4210 -13489 -20210 -11186 9529 22845 15406 -3789 -18388
759 -18388 -19116 -4331 13567 21007 10556 -11301 -21964 -13890 3156 17458 18572 4198 -13715
772 -13715 -20072 -8498 10538 19492 14509 -1675 -18320 -18034 -1603 14020 17834 7435 -9400
785 -9400 -19467 -14572 3432 17994 15716 1164 -13846 -18581 -7114 11314 18908 11912 -4409
798 -4409 -16368 -14425 -1130 14231 17839 5007 -11282 -17663 -10639 4799 15345 12652 -120
811 -120 -13595 -15851 -4890 9609 16657 10114 -5074 -14202 -11355 1179 13234 14204 3997 -8580
825h580o154O308J3317Q337k413j2392j1809J28J0324J1368M957o436j1949p401
839a2395L034J2041R558j007q168j1294m732Q055J1250M382l778r000q024j021
853a1099Q439J1258J451p322p110m870J373J0098Q080k130p492o091j723K781
867d357Q241O647n004r514l000J249L577O995L032n624p980r81M191L485L736
882D693L253o795q389K607N936J670Q43R38m835o927K027P912L36k362J792m234
898a535n926M669O945j231l455K386j352n805K808R053l055n984L812N25o450
913d595K204P508l217o269M878K883q032N39R300m018o988P160M127q839m94Q142
929D289k704o548P689M786j0974j829R856l713o570Q971L783j2146k392J0638
$$ plain form
825 -8580 -14734 -8426 4891 13228 10815 -1577 -13386 -13258 -2934 8434 13391 6955 -4994 -12395
839 -12395 -9361 2680 12238 11231 3063 -8231 -12963 -4908 6342 10724 6946 -2054 -10078 -11099
853 -11099 -2660 8598 10049 2727 -4383 -9253 -7880 2218 10298 8168 676 -5415 -7138 -4357
867 -4357 3884 10531 5527 -3987 -6987 -5738 -2161 4834 7866 2242 -5738 -6719 -2528 957 4693
882 4693 7946 1151 -7238 -4631 1305 2975 3818 4756 -79 -7006 -4979 2933 3269 907 2699 -1535
898 -1535 -7461 -2792 4153 2922 -533 1853 501 -5304 -2496 6557 3502 -2482 1330 1855 -4595
913 -4595 -2391 5117 1900 -4369 509 3392 -4640 -4101 5199 1181 -5807 1353 5480 -3359 -3853 4289
929 4289 1585 -4963 2726 7512 -3462 -5291 4565 852 -5718 3253 7036 -5110 -7502 3136
943C136r62p082P477M145j2220j378J1753j275o739O671J739j1685J70J2612r91
958E371r125M627K100j1187J929J3426j551q472K326J75p723L993J3638j792j0315
973b580J021m3n880O179J2075l127r785k087l84j220O881R129m243j0049k203
988f316J027R59Q141N646n436q379k548K539N087N709J556o444p263n56L328O091
1004C141M477l421p129l844J34N558P938N75o862o572p06K503O195P868j090j1360
1020b595n887K662L851P097O848o052j2836m019N419N730O192N118p699j4667
1034a0838r76R438N459N294K521j0071j2109J836R890N629K742n12j0567j0398
1048a2662N450J0018L582L48l271r554n521P160R802K536k845n345p665j113R663
$$ plain form
943 3136 2174 -4908 2569 6714 -5506 -6884 4869 3594 -3145 3526 5265 -6420 -6250 6362 5371
958 5371 -3754 873 2973 -8214 -6285 7141 5590 -2882 -556 -381 -8104 -4111 9527 7735 -2580
973 -2580 -1559 -1602 -7482 -1303 10772 7645 -2140 -4227 -4611 -5831 1050 10179 5936 -4113 -6316
988 -6316 -5289 -4330 3811 9457 4021 -4358 -6906 -4367 720 6429 7985 1541 -5722 -6278 -2950 3141
1004 3141 7618 4197 -2932 -6776 -6642 -1084 6854 7429 567 -6005 -6711 -4208 1987 9855 8765 -2595
1020 -2595 -8482 -5820 -1969 5128 11976 5924 -6912 -10931 -5512 218 6410 11528 3829 -10838
1034 -10838 -11814 -2376 3083 8377 10898 827 -11282 -9446 444 6073 8815 8303 -2264 -12662
1048 -12662 -7212 2806 6388 6736 3465 -6089 -11610 -4450 5352 7888 5043 -302 -7967 -9080 583
1063E83Q285q66n059p172m948M050R147N769k643q003q254j582Q550R779J572
1078I208m625p582q414J280J2509Q164j352n493q577p000M347J3705N597n669
1092F098n578n851p305O813J4534J527q175m237l742m328P807J3212j768j0747
1106a740j581j085k983Q684J1663o438j1915j1K152j024P863Q674r460j2585L152
1121f634M954k24P839N728j1819j1843O051P515J89N126L529j2404j0697Q019
1135d671P868p4L631J100j2952p999R195Q691j099J094J5j0907n646J0612P949
1150F807k404n51j807q320k130R993O125l990k887j239o060m43R693M667n561
1165A893l543j532k319K391P401K554n583m584J39j73K870O615L17o584m316K52
$$ plain form
1063 583 8868 8002 2943 -4229 -9177 -5127 4020 9789 7146 -857 -9111 -10693 -2143 7636 9208
1078 9208 4583 -2999 -11413 -10133 2376 10540 9188 3695 -4882 -11882 -7535 6170 11767 6098
1092 6098 520 -5331 -12636 -5823 8711 10238 2063 -2174 -5916 -10244 -2437 10775 9007 -1740
1106 -1740 -3321 -4406 -7389 1295 12958 6520 -5395 -5406 -3254 -4278 3585 12259 2799 -9786 -6634
1121 -6634 -1680 -1904 5935 11663 -156 -11999 -5948 1567 1756 6882 10411 -1993 -12690 -4671
1135 -4671 3197 3123 6754 7854 -5098 -13097 -3902 4789 3690 4784 4799 -6108 -11754 -1142 6807
1150 6807 4403 3852 2045 -6275 -8405 1588 7713 3723 836 -403 -6463 -6906 2787 7454 1893
1165 1893 -1650 -3182 -5501 -3110 4291 6845 1262 -3322 -3183 -3356 -486 6129 6446 -138 -4454 -4202
1181d202K005L620L280k64n910m122J051L508L689K098k125n238k613K060M603
1196A440K604l45k107l574k320K248M526J725j689l093k315q21K369M057L47k641
1212D11j866j139K4K450L171J5l307j402O05L06J692K225j078l164j055P61O46
1229g05J638J180j293l154j60J882N86R13J165j803k073O71J286J301J89j40j240
1246B43j667P78J422m41K41K4j057j175Q60O48K59M2k51k85j33O67L72l36K21
1265D32M73q25j38M22j89m54J47J59K13m99l66k13p0R65M83l65k84k16m30K95
1285d60J070N69m5j184m08m2M65J154K45r68j024q39k5J296J107J46q55k028O4
1304a762J374J210J302n85j674j150kJ490J761J02j171j608k136J244K037J146
$$ plain form
1181 -4202 -2197 1423 4703 4439 -1471 -5593 -4542 -1034 2655 4753 2628 -2610 -5223 -3163 1440
1196 1440 4044 3699 1592 -1982 -4302 -2054 2472 4197 2508 -585 -2900 -3721 -1352 2705 3052 411
1212 411 -1455 -2594 -2570 -120 3051 3066 -241 -1643 -1038 -732 960 3185 2107 -1057 -2112 -1351 -705
1229 -705 933 2113 820 -2334 -2494 -612 -26 887 2052 249 -1824 -1153 133 1434 1623 1483 243
1246 243 -1424 -646 776 335 576 600 -457 -1632 -772 -124 135 177 -74 -359 -492 175 547 211 432
1265 432 905 80 -58 364 175 -279 -132 27 240 -259 -625 -838 -908 57 540 175 -109 -325 -755 -460
1285 -460 610 1179 1134 -50 -458 -500 -35 1119 1364 396 -628 -1467 -1492 -196 911 1057 202 -1826 -1762
1304 -1762 -388 822 2124 1539 -135 -1285 -1287 203 1964 2066 895 -713 -2849 -1605 432 1578
1320A578j90j358k134q59J365K914J506j730j426j742l4K047K943M03k051k422
1336a190j275O01K079L068o03l380k261J81J211K586K211j064l611k033J443K110
1352G3J959J937k042m373r63K425K393J357J61k492l942p08L713K501M94n21k557
1369e85l822P43M507K443o17j436k463k865J140N388K348k343k607k330j717K353
1385a863N010J007l089l245j086p03L403N257l30m572k843o2J157L286L681q31
1401D177n220k692J307J573L010K729k821n201j552K081K482K761J466l135m799
1416c834n62L571L082J572k3m016m209J023L959K872N38k027l933k908J660M716
1432A481K227q25k916l499j240L159M186J833j792l700k726O96L250M013K84l133
$$ plain form
1320 1578 1388 30 -2104 -2963 -1598 1316 2822 1092 -334 -2076 -2110 -63 2880 3283 1232 -1190
1336 -1190 -2465 -1864 215 3283 2680 -700 -2961 -2780 -1569 1017 3228 2164 -1447 -3480 -2037 73
1352 73 2032 3969 1927 -2446 -3409 -984 1409 2766 2927 435 -3507 -4215 -502 1999 2493 1972 -585
1369 -585 -4407 -3664 843 3286 2669 1233 -1230 -4095 -2955 2433 4781 2438 -169 -2499 -4216 -1863
1385 -1863 3147 4154 1065 -2180 -3266 -3969 -566 4691 4361 -211 -3054 -3116 -1959 1327 5008 4177
1401 4177 -1043 -3735 -2428 -855 2155 4884 2063 -3138 -4690 -2609 -127 2634 4100 965 -3834
1416 -3834 -4396 -825 2257 3829 3806 -210 -4419 -3396 563 3435 3973 1946 -1987 -4895 -3235 1481
1432 1481 3708 2883 -33 -3532 -4772 -1613 2573 4406 2614 -1086 -3812 -3116 134 4147 4431 1298
1448A298l860j522J762L501K549n51l392m061M4L270L227J397j559l606k419R65
1464b957L854K581K36k159l587k161K671L710J488j334l069k748k72K478M194
1479B925N20k753k702j554Q81L692L094q89l248k477l27J525L032K340j736l429
1495a106k078J68K511L084J91j878k868k012J987K895J782j86k611k143o88K103
1511h49L509N27j757j880j872k85K421L311p14k718j654j00k38K885K970k161
1527A395l029M6O96j17K381K360k432l672O77J574j02K037J705l587l146J383
1543a831J985m04J498J537l586l186K714K682j068R41J721l725k843L317K550
1558B302j981O29J410l462k314L482J875k313J20J808l093j844M175J244k805
$$ plain form
1448 1298 -2562 -4084 -2322 1179 3728 3177 -215 -4276 -4232 -962 2265 3662 2103 -1503 -3922 -2957
1464 -2957 897 3478 3714 1555 -2032 -4193 -1522 2188 3676 2342 -727 -3475 -3747 -1269 2925
1479 2925 3445 692 -2010 -3564 -2683 1009 4103 3214 -34 -2511 -2838 -1313 1719 4059 2323 -1106
1495 -1106 -3184 -3016 -505 2579 2770 892 -1976 -3988 -2001 894 2676 2490 -121 -2264 -2952 -849
1511 -849 2660 3187 1430 -450 -2322 -2607 -186 3125 2411 -307 -1961 -2061 -2299 586 3556 1395
1527 1395 -1634 -1588 -892 -1009 1372 3732 1300 -2372 -1695 -121 -223 1814 3519 -68 -3214 -1831
1543 -1831 154 -250 1248 2785 -801 -3987 -1273 1409 341 1282 3003 -722 -3565 -248 2302
1558 2302 321 950 2360 -1102 -3416 66 1941 -372 -252 1556 -1537 -3381 794 2038 -767
1573g67M63J513k143r57L606Q61l660O85J596j981q35L145K28k935q2J649j167
1590g81o56K567K55k768N78J171q98Q8K219j01k186oJ253o69n41J281k56j354
1608h04M90M41o30n01J207J45n83Q8J99l74l82J005N46j07l56m51r2k36L93Q08
1628H06K66q25q87k98L7O89R39J94j356r59R28M01J08J125J65j663n69M19R66
1647D86j67N51J75j975m15R23J209o35O56n67j980J03J678J325m50k28o69j872
1665a852N65K524R48j063o73j272j050R48K151O36j355j012r63q11J517K535j0
1682A763j598j173q14L22K016J704m30j613j296o42Q06J997J493j381k127j072
1698b045M87J239J886M45j616k028n44J043J779J761p49k028j200J57J076K316
$$ plain form
1573 -767 -304 1209 -934 -1891 1715 2576 -1084 -399 1197 -784 -1619 1526 1754 -1181 -1263 386 -781
1590 -781 -1437 1130 1385 -1383 -805 366 -532 -444 1775 1674 -512 -518 735 66 -475 806 550 -804
1608 -804 -314 127 -503 -1004 203 348 -235 -147 52 -322 -704 301 847 740 384 -67 -159 -395 -2 806
1628 806 1072 247 -640 -938 -901 -212 727 921 -435 -1394 -466 -65 43 1168 1333 -330 -899 -480 486
1647 486 319 870 1045 -930 -1345 -422 787 152 808 241 -1739 -1636 42 1367 917 689 20 -1852
1665 -1852 -1287 1237 2185 1122 449 -823 -1873 -925 1226 1862 507 -505 -1468 -2279 -762 1773 1763
1682 1763 165 -1008 -1822 -1500 516 2220 1790 177 -1119 -1761 -955 1042 2535 1154 -973 -2045
1698 -2045 -1558 -319 1567 2012 396 -1632 -2176 -1133 646 2407 1658 -370 -1570 -1413 -337 1979
1714A979J090k060k280r89O02K056J542J10k040k532k56J853J703J797o09k987
1730a021j626Q10K173J723M33j010l003j239J756J991J100J04j899l097j30J992
1746i43K351O37o93k297k055P43K564K113O5j659k320r85J265K680J200q60k303
1763d97j610j22J771K637N2j614k224r98N11K605J807j84j929k229j47J810K201
1780A840J113j137k581j343J67J886K106K30j850k160j229J564K272J366q39j901
1796d96j899L23J771K013J263j758k051j388R57J808J494J84k191k132N2P62K149
1813H61J045p45j948j499O98J830J487K57p29k308j228J506J646J073j4j554k083
1830a705k53J476J628M47j094j455j116K23K252J490o85j042j088q62J061J691
$$ plain form
1714 1979 3069 1009 -1271 -2260 -1658 398 1940 2050 10 -2522 -2778 -925 778 2575 1966 -1021
1730 -1021 -2647 -1837 336 2059 2492 1482 -1521 -2760 -1004 987 2087 2191 292 -2805 -2935 -943
1746 -943 1408 2045 1352 -945 -3000 -2257 307 2420 2485 826 -1494 -2479 -1214 1466 2666 1806 -497
1763 -497 -2107 -2229 -458 2179 2231 617 -1607 -2605 -2094 511 2318 2134 205 -2024 -2171 -361 1840
1780 1840 2953 1816 -765 -2108 -1941 -55 2051 2281 431 -1729 -2958 -1394 878 2244 1405 -496
1796 -496 -2395 -2072 -301 1712 2975 1217 -834 -2222 -1265 543 2037 2221 30 -2102 -2050 -1288 861
1813 861 1906 1161 -787 -2286 -1588 242 1729 1986 1257 -1051 -2279 -773 873 1946 1932 378 -1705
1830 -1705 -1958 -482 1146 1593 499 -956 -2072 -1849 403 1893 1208 166 -922 -1784 -723 968
1846I68R37o50j389j169j18J078J630J89j209j314n04L67R36J629j58j582j081
1863a440K70J000J030R78r57j178r55P30P63J246j57r25j378o21J052Q19N95l24
1881E48p37j014%J081J319k87n55o65n56K17J443N61m52j089o82J69N08N65O43
1900A017p95o31m69m4J055L53R1p07o62P7O61N25J99j51m12l90mL32N62k64l91
1921d8j14l39j49O05M31l23l21j81kL12M30K90k76m52L15j14m00M99L72m87l79
1942c31J99K19m87q5P35l26j14K04m7k67J5P13k51o59J048k44p15K27P45p77k0
1963b18N62l6r84L35P88m94m40M25M5r87O59J031l84o54K59N14p17J79J341n26
1983F98j309L25M49q74O38J287j117j270N50O76o29O17R50o59j482O49O73r8O32
$$ plain form
1846 968 1905 1255 -134 -1303 -1421 -343 1287 1476 267 -1047 -1551 -1184 -248 1381 1223 -359 -1440
1863 -1440 -1170 -170 860 1838 881 -297 -1252 -522 241 1487 1330 405 -973 -1594 -542 277 872 548
1881 548 -189 -1203 -1203 -122 1197 910 355 -310 -866 -649 794 1355 903 -186 -868 -699 -191 374 1017
1900 1017 222 -409 -878 -922 133 486 577 -130 -792 -715 -54 471 670 519 107 -283 -287 45 607 343 -48
1921 -48 -162 -501 -650 -45 386 63 -258 -439 -441 -129 301 591 315 -137 178 64 -336 163 535 48 -331
1942 -331 -132 87 -400 -485 250 -76 -190 14 -33 -300 -285 428 177 -482 566 322 -393 -166 579 -198 -218
1963 -218 344 308 -676 -341 447 -47 -487 -62 -17 -1004 -345 686 302 -352 -93 421 -296 -117 1224 698
1983 698 -611 -286 163 -711 -73 1214 97 -1173 -623 53 -576 41 991 332 -1150 -501 172 74 706
2002G06O34j262j213R65P41j60k22O92j315j148J129R32j38k60M04j236r56J713
2020FR98k96l53R6j174m00J533R18p13j086J69l79l06J351P30j120p65j93k7N14
2040d97J320M49j094j136K79O35J34J141R7j354j036O9R16N00O51k80j060j228
2058a494N39J201M75j02k15j304n04Q89J257N14l19o86j148k41J374J217j63r64
2076C26r30n75L9J179J253n63j169l16j97K29J406Q64q75j259m82O44M43J271
2094A288K67j300j258QN91Q35Q26l92j050j259J79J014R64O10p38j498n05J093
2112c25Q42P50q2m31j654k90R52J322N7m13j339p55K65J228P36j33l60j261m59
2131a350P83J081O82k02p97j256J23J130Q30K0l25j050r00N13J055O09l58o23
$$ plain form
2002 706 1340 78 -1135 -170 571 411 189 881 -434 -1582 -453 479 341 81 485 -751 -1707 6
2020 6 1004 708 355 451 -723 -1123 410 1328 615 -471 -302 -681 -987 364 1094 -26 -791 -984 -1011 -497
2040 -497 823 1272 178 -958 -679 -44 90 1231 1328 -26 -1062 -993 -77 423 1074 794 -266 -1494
2058 -1494 -955 246 721 619 404 -900 -1404 -515 742 1256 937 251 -897 -1138 236 1453 1290 326
2076 326 -604 -1179 -1140 39 1292 729 -440 -756 -953 -724 682 1546 671 -588 -1070 -426 17 1288
2094 1288 1555 255 -1003 -995 -404 431 1257 865 -185 -1444 -1265 -251 713 1323 585 -913 -1418 -325
2112 -325 517 1267 1185 754 -900 -1190 -238 1084 1141 728 -611 -1366 -1101 127 863 730 370 -891 -1350
2131 -1350 -567 514 1196 994 197 -1059 -936 194 1024 1044 719 -331 -1231 -718 337 946 588 -35
2149c5j085k59O61J734O3m84n57o63k58J127J190k31r92n23n89L18Q67Q25m83
2168F26r62n28k3J32J167O47r00j019K96K37L37O93L77p48j149M8Q37L13N14J2
2188I07j286o62L41R30K91R1k72r44o11P08J023J98nn92o48K0P12N80N5l04o05
2209g3m58j01R70K58l38n69k79o7p9R62L11l81j05p10Q7M84Q21J02m49p44n9J72
$$ plain form
2149 -35 -1120 -1379 -718 1016 1079 595 38 -625 -883 244 1434 1203 211 -312 -901 -583 284 1109 626
2168 626 -336 -864 -887 -755 412 1059 159 -860 -564 -327 10 703 1080 332 -817 -769 68 381 895 907
2188 907 -379 -1041 -700 230 521 612 340 -604 -1215 -507 516 714 709 117 -531 -511 201 781 836 532 -73
2209 -73 -531 -632 338 596 258 -311 -590 -657 -736 226 537 156 51 -659 -572 -88 733 835 386 -358 -417 -245
$$ [...]
8191b1
##END NTUPLES=NMR FID
##END=
