##TITLE=1H_E3b0502-1
 CDCl3
 8 sc, 
 6.2.2024
##JCAMPDX= 6.0         $$ Bruker NMR JCAMP-DX V2.0
##DATA TYPE= NMR FID
##DATA CLASS= NTUPLES
##ORIGIN= UXNMR, Bruker Analytische Messtechnik GmbH
##OWNER= root
$$ XWIN-NMR		Version 3.5
$$ Tue Feb  6 14:30:48 2024 Russian Standard Time (UT+4h)  she@DPX200
##.OBSERVE FREQUENCY= 200.1313
##.OBSERVE NUCLEUS= ^1H
##.DELAY= (6, 6)
##.ACQUISITION MODE= SIMULTANEOUS
##.ACQUISITION SCHEME= undefined
##.AVERAGES= 8
##.DIGITISER RES= 18
##SPECTROMETER/DATA SYSTEM= spect
##.PULSE SEQUENCE= zg30
##.SOLVENT NAME= CDCl3
##.SHIFT REFERENCE= (INTERNAL, CDCl3, 0, 15.7039)
##AUDIT TRAIL= $$ (NUMBER, WHEN, WHO, WHERE, WHAT)
$$ ##TITLE= Audit trail, XWIN-NMR		Version 3.5
$$ ##JCAMPDX= 5.01
$$ ##ORIGIN= Bruker BioSpin GmbH
$$ ##OWNER= she
$$ F:/spectra/data/she/nmr/H-F/1/audita.txt
$$ ##AUDIT TRAIL=  $$ (NUMBER, WHEN, WHO, WHERE, WHAT)
(   1,<2024-02-06 14:29:12.56 +0400>,<she>,<DPX200>,
      <created by zg, POWCHK disabled, PULCHK disabled
       configuration hash MD5:
       00 E9 B6 7A A2 85 ED C7 34 08 36 98 17 FE 4E 26
       data hash MD5: 16K
       C5 90 1A EA BA 5F 8D EF 14 E0 5E 14 F7 D9 9E F6>)
$$ ##END=
$$ 
$$ hash MD5
$$ 59 9E C7 9B 02 64 FA 40 3D F4 6E 98 C3 DA C5 D9
##$RELAX= 
##$RELAX= 
##$RELAX= 
##$RELAX= 
##$RELAX= 
##$RELAX= 
$$ Bruker specific parameters
$$ --------------------------
##$DU= <F:/spectra>
##$EXPNO= 1
##$NAME= <H-F>
##$PROCNO= 1
##$TYPE= <nmr>
##$USER= <she>
##$AMP= (0..31)
100 100 100 100 100 100 100 100 100 100 100 100 100 100 100 100 100 100 
100 100 100 100 100 100 100 100 100 100 100 100 100 100 
##$AQSEQ= 0
##$AQ_mod= 1
##$AUNM= <au_zg>
##$AUTOPOS= <>
##$BF1= 200.13
##$BF2= 200.13
##$BF3= 200.13
##$BF4= 200.13
##$BF5= 200.13
##$BF6= 200.13
##$BF7= 200.13
##$BF8= 200.13
##$BYTORDA= 1
##$CFDGTYP= 0
##$CFRGTYP= 5
##$CHEMSTR= <none>
##$CNST= (0..31)
1 1 145 1 1 1 1 1 1 1 1 1 1 1 1 1 1 1 1 1 1 1 1 1 1 1 1 1 1 1 1 1 
##$CPDPRG= <>
##$CPDPRG1= <>
##$CPDPRG2= <>
##$CPDPRG3= <>
##$CPDPRG4= <mlev>
##$CPDPRG5= <mlev>
##$CPDPRG6= <mlev>
##$CPDPRG7= <mlev>
##$CPDPRG8= <mlev>
##$CPDPRGB= <>
##$CPDPRGT= <>
##$D= (0..31)
0 1.2 0 0 0 0 0 0 0 0.06 0 0.03 0 0 0 0 0.0002 0 0 0 0 0 0 0 0 0 0 0 0 
0 0 0 
##$DATE= 1707215351
##$DBL= (0..7)
120 120 120 120 120 120 120 120 
##$DBP= (0..7)
150 150 150 150 150 150 150 150 
##$DBP07= 0
##$DBPNAM0= <>
##$DBPNAM1= <>
##$DBPNAM2= <>
##$DBPNAM3= <>
##$DBPNAM4= <>
##$DBPNAM5= <>
##$DBPNAM6= <>
##$DBPNAM7= <>
##$DBPOAL= (0..7)
0.5 0.5 0.5 0.5 0.5 0.5 0.5 0.5 
##$DBPOFFS= (0..7)
0 0 0 0 0 0 0 0 
##$DE= 6
##$DECBNUC= <off>
##$DECIM= 32
##$DECNUC= <off>
##$DECSTAT= 4
##$DIGMOD= 1
##$DIGTYP= 9
##$DL= (0..7)
0 120 120 120 120 120 120 120 
##$DP= (0..7)
150 150 150 150 150 150 150 150 
##$DP07= 0
##$DPNAME0= <>
##$DPNAME1= <>
##$DPNAME2= <>
##$DPNAME3= <>
##$DPNAME4= <>
##$DPNAME5= <>
##$DPNAME6= <>
##$DPNAME7= <>
##$DPOAL= (0..7)
0.5 0.5 0.5 0.5 0.5 0.5 0.5 0.5 
##$DPOFFS= (0..7)
0 0 0 0 0 0 0 0 
##$DQDMODE= 0
##$DR= 18
##$DS= 0
##$DSLIST= <SSSSSSSSSSSSSSS>
$$ [...]
##$SUBNAM2= <"">
##$SUBNAM3= <"">
##$SUBNAM4= <"">
##$SUBNAM5= <"">
##$SUBNAM6= <"">
##$SUBNAM7= <"">
##$SUBNAM8= <"">
##$SUBNAM9= <"">
##$SW= 18.0517328524113
##$SWIBOX= (0..15)
0 0 2 0 0 0 0 0 0 0 0 0 0 0 0 0 
##$SW_h= 3612.71676300578
##$TD= 16384
##$TD0= 1
##$TE= 0
##$TE2= 300
##$TE3= 300
##$TEG= 300
##$TL= (0..7)
0 120 120 120 120 120 120 120 
##$TP= (0..7)
150 150 150 150 150 150 150 150 
##$TP07= 0
##$TPNAME0= <>
##$TPNAME1= <>
##$TPNAME2= <>
##$TPNAME3= <>
##$TPNAME4= <>
##$TPNAME5= <>
##$TPNAME6= <>
##$TPNAME7= <>
##$TPOAL= (0..7)
0.5 0.5 0.5 0.5 0.5 0.5 0.5 0.5 
##$TPOFFS= (0..7)
0 0 0 0 0 0 0 0 
##$TUNHIN= 0
##$TUNHOUT= 0
##$TUNXOUT= 0
##$USERA1= <user>
##$USERA2= <user>
##$USERA3= <user>
##$USERA4= <user>
##$USERA5= <user>
##$V9= 5
##$VALIST= <valist>
##$VCLIST= <CCCCCCCCCCCCCCC>
##$VD= 0
##$VDLIST= <DDDDDDDDDDDDDDD>
##$VPLIST= <PPPPPPPPPPPPPPP>
##$VTLIST= <TTTTTTTTTTTTTTT>
##$WBST= 1024
##$WBSW= 4
##$XGAIN= (0..3)
0 0 0 0 
##$XL= 0
##$YL= 0
##$YMAX_a= 626707
##$YMIN_a= -935937
##$ZGOPTNS= <>
##$ZL1= 120
##$ZL2= 120
##$ZL3= 120
##$ZL4= 120
##$ABSF1= 10
##$ABSF2= 0
##$ABSG= 5
##$ABSL= 3
##$ALPHA= 0
##$AQORDER= 0
##$ASSFAC= 0
##$ASSFACI= 0
##$ASSFACX= 0
##$ASSWID= 0
##$AUNMP= <proc_1d>
##$AZFE= 0.1
##$AZFW= 0.1
##$BCFW= 1
##$BC_mod= 2
##$BYTORDP= 1
##$COROFFS= 0
##$CY= 11.3945322036743
##$DATMOD= 1
##$DC= 2
##$DFILT= <>
##$DTYPP= 0
##$F1P= 15.7292609196834
##$F2P= 12.9074282941183
##$FCOR= 0.5
##$FTSIZE= 0
##$FT_mod= 4
##$GAMMA= 1
##$GB= 0.15
##$INTBC= 1
##$INTSCL= 1
##$ISEN= 128
##$LB= 0.24
##$LEV0= 0
##$LPBIN= 0
##$MAXI= 10000
##$MC2= 0
##$MEAN= 0
##$ME_mod= 0
##$MI= 1.114404
##$NCOEF= 0
##$NC_proc= 0
##$NLEV= 6
##$NOISF1= 3.799351
##$NOISF2= 2.8
##$NSP= 1
##$NTH_PI= 0
##$NZP= 0
##$OFFSET= 15.70392
##$PC= 1
##$PHC0= -24596.63
##$PHC1= 14.45268
##$PH_mod= 1
##$PKNL= yes
##$PPARMOD= 0
##$PSCAL= 0
##$PSIGN= 0
##$REVERSE= no
##$SF= 200.130013532006
##$SI= 16384
##$SIGF1= 3
##$SIGF2= 2
##$SINO= 400
##$SIOLD= 16384
##$SREGLST= <1H.CDCl3>
##$SSB= 0
##$STSI= 0
##$STSR= 0
##$SW_p= 3612.71676300578
##$SYMM= 0
##$S_DEV= 0
##$TDeff= 0
##$TDoff= 0
##$TI= <>
##$TILT= no
##$TM1= 0
##$TM2= 0
##$TOPLEV= 0
##$USERP1= <user>
##$USERP2= <user>
##$USERP3= <user>
##$USERP4= <user>
##$USERP5= <user>
##$WDW= 1
##$XDIM= 8192
##$YMAX_p= 0
##$YMIN_p= 0
$$ End of Bruker specific parameters
$$ ---------------------------------
##NTUPLES= NMR FID
##VAR_NAME=  TIME,          FID/REAL,        FID/IMAG
##SYMBOL=    X,             R,               I
##VAR_TYPE=  INDEPENDENT,   DEPENDENT,       DEPENDENT
##VAR_FORM=  AFFN,          ASDF,            ASDF
##VAR_DIM=   8192,          8192,            8192
##UNITS=     SECONDS,       ARBITRARY UNITS, ARBITRARY UNITS
##FACTOR=    0.0002768,     1,               1
##FIRST=     0,             0,               0
##LAST=      2.2672688,     0,               0
##MIN=       0,             -935937,         0
##MAX=       2.2672688,     626707,          0
$$ Real data points
##PAGE= N=1
##DATA TABLE= (X++(R..R)), XYDATA
$$ [...]
2849b6j53K69P54m33j592L9K270L98j926j031J346R80j131l05R21N57p40j134
$$ -26 -179 90 844 411 -1181 -1142 1128 1526 -400 -1431 -85 895 -236 -541 380 937 197 -937
2867i37J76J460O82j266j270O11J273l62j347P99J065o34j236K41J147P79r79
$$ -937 -761 699 1381 115 -1155 -544 729 367 -980 -181 884 250 -986 -745 402 1181 202
2884B02j487Q49J235k25j234K63J384n16j390k34J593Q56r43j600K43J551j01
$$ 202 -1285 -436 799 574 -660 -397 987 471 -919 -1153 440 1296 353 -1247 -1004 547 446
2901D46r89J44J480k99j915o8J553O26n87p08p17J220R94j517q30J702R24j999
$$ 446 -543 -399 1081 782 -1133 -1201 352 978 391 -317 -1034 186 1180 -337 -1167 535 1459 -540
2919e40o59J807N39j641j22K59K59J135k63j958L74J896p41k078J649K390j907
$$ -540 -1199 608 1147 -494 -616 -357 -98 1037 774 -1184 -810 1086 345 -1733 -84 2306 399
2936C99k436J519J046o76P01J8j644J235O41k297J8L323M28l925O4K556j129q84
$$ 399 -2037 -518 528 -148 553 571 -1073 162 803 -1494 -1476 1847 2275 -1650 -1586 970 -159 -1043
2954a043J931p7j100R77p21j817J652K613k357j924K953M47l508P36K635j181
$$ -1043 888 811 -289 688 -33 -1850 -198 2415 58 -1866 1087 1534 -1974 -1238 1397 216
2970B16l34J387j977j082K546L00l018J508M237l352m060L373J893k777J193K324
$$ 216 -118 1269 -708 -1790 756 1056 -1962 -454 3783 431 -3629 -256 1637 -1140 53 2377
2986B377k850q77K204k177j530M942K097n764q80M395k359l535N350K642m263
$$ 2377 -473 -1350 854 -1323 -2853 2089 4186 -1578 -2458 1937 -422 -3957 1393 4035 -228
3001b28k80J492l761k00O063n86m709L186K520p404j254P895o0m169L436M69o041
$$ -228 -508 984 -2777 -2977 3086 2500 -2209 977 3497 -3907 -5161 2734 2674 -1495 1941 2410 -3631
3018c631P05M873k732j007P491j832r158K295O099m999j197Q343j023p353J654
$$ -3631 -2926 1947 -785 -1792 5699 3867 -5291 -2996 3103 -1896 -3093 5250 4227 -3126 -1472
3033a472J814m873K881Q125m007n918N264l10q865L920J0441l858m949M520k213
$$ -1472 342 -4531 -1650 6475 2468 -3450 1814 1504 -7361 -3441 7000 3142 -1807 2713 500
3048E00p654M744P024m364j38O327o541r219P996O073o623J607P504o022q198
$$ 500 -7154 -2410 4614 250 112 6439 -102 -9321 -1325 4748 -1875 -268 7236 1214 -6984
3063f984N838K352m687N525O174r328m624P830k077p307Q563P791r241l781O197
$$ -6984 -1146 1206 -3481 2044 8218 -1110 -5734 2096 19 -7288 1275 9066 -175 -3956 2241
3078B241l597n717Q922M294p814J633N551r776m680J1970K685q583M174N393j0124
$$ 2241 -1356 -7073 1849 6143 -1671 -38 5513 -4263 -8943 3027 5712 -2871 1303 6696 -3428
3093c428m870J0337N83n408P308J818j2192m54J0154l763m884J0252K107j2870
$$ -3428 -8298 2039 2622 -2786 4522 6340 -5852 -6306 3848 85 -4799 5453 7560 -5310
3107e310k56Q861m615k685J0331j223j0777M126N264q802O11J2441k972j1328
$$ -5310 -5566 3295 -1320 -4005 6326 5103 -5674 -1548 3716 -5086 -4475 7966 4994 -6334
3121f334N718M682r071P26J0750l739o632O690o85r579N338R321p014m432R493
$$ -6334 -616 4066 -5005 -4279 6471 2732 -3900 2790 2105 -7474 -2136 7185 171 -4261 5232
3136E232k072j1286N081Q574n846j381P317m588q302O807L728o763L357Q654p723
$$ 5232 3160 -8126 -3045 5529 -317 -1698 5619 1031 -7271 -464 3264 -3499 -142 8512 789
3151G89q869P886L015o826M157P582p289n192N448j486m435P763N043q787k702
$$ 789 -8080 -194 2821 -4005 152 7734 445 -4747 701 -785 -5220 2543 7586 -1201 -3903
3166c903O618m041n824Q620N983p511j492L510m935k462Q020J317n455K829L116
$$ -3903 2715 -1326 -7150 1470 7453 -58 -1550 1960 -2975 -5437 2583 3900 -1555 1274 4390
3181D390q619k378R130P23n255L732K277o769j269M835j519j093O373n21p833
$$ 4390 -4229 -6607 2523 3246 -2009 1723 4000 -2769 -4038 797 -722 -1815 4558 4037 -3796
3196c796J044M971m156j505P317O57o277O57J524l645J333N619j545l358L093
$$ -3796 -2752 2219 -1937 -3442 3875 4532 -1745 -1088 436 -3209 -1876 3743 2198 -1160 1933
3211A933p13o442K114O995j810k898K652r06m525J409L571j150N53K927l740m582
$$ 1933 1220 -5222 -3108 3887 2077 -821 1831 925 -3600 -2191 1380 230 783 3710 -30 -4612
3227d612L961K739l344Q34L966k556l861J710J389j052J802J504l254p70K885
$$ -4612 -651 2088 -1256 -422 3544 988 -2873 -1163 226 -826 976 2480 -774 -1544 1341
3242A341j828k339L516K298l380j047K500q45j641J364R79j659J374J163l671
$$ 1341 -487 -2826 690 2988 -392 -1439 1061 216 -1425 -61 918 -741 633 1796 -1875
3257a875j15L505p02k675J992K078k390j646J753J07l4J362n66k342J170J623
$$ -1875 -1990 1515 813 -1862 130 2208 -182 -1828 -75 32 -2 1360 794 -1548 -378 1245
3273A245k322k96K982K50l221K0J699k98k71R51m91r00R05k63j474J757J963k022
$$ 1245 -1077 -1373 1609 1859 -1362 -1342 357 59 -212 739 248 -652 253 -10 -1484 273 2236 214
3291B14j763J299J294j518q1J344j95o32O5p38L7J820k29k120K81K045m43j407
$$ 214 -1549 -250 1044 -474 -555 789 594 -38 27 -711 -674 1146 917 -1203 -922 1123 680 -727
3309g27L46J205n85q21L43j4P56L77j504m17J506L98j309m56J544J64j675J18
$$ -727 -381 824 239 -582 -239 -253 503 880 -624 -1041 465 863 -446 -902 642 806 -869 -751
3327g51J048K13n8o36q24R00Q50m93q27P33O23r40j136J265J150o10q32m38M92
$$ -751 297 510 452 -184 -1008 -108 742 249 -578 155 778 -162 -1298 -33 1117 507 -325 -763 -271
3346b71P40k44n73M82N29o62j204M62J865j2j773j14Q41K94j11l77J28O17n06
$$ -271 469 225 -348 134 663 1 -1203 -741 1124 1112 -661 -775 66 360 249 -128 0 617 111
3365A11j091M02J217P64j745r17J220N09k45k63L13Q1j93p40j57J238Q01j008
$$ 111 -980 -578 639 1403 -342 -1259 -39 470 225 -38 275 356 163 -577 -734 504 1305 297
3383B97j431O59J519r76o17P28L41m77p83j2R22P39m10j377j51J678K3j534O44
$$ 297 -1134 -475 1044 68 -549 179 520 43 -740 -752 170 909 499 -878 -1029 649 672 -862 -218
3402b18J041p57r49K33J252m7k74p27p88R61J466j326q30J770j26k032L91J748
$$ -218 823 66 -883 -650 602 555 281 -446 -1234 -273 1193 -133 -963 807 681 -1351 -960 788
3420G88J16q88q3m01n30J374O42j806P55J479j827j894K475J568j735o26R46k89
$$ 788 904 16 -67 -468 -998 376 1018 -788 -33 1446 -381 -2275 200 1768 33 -593 353 64
3438F4q01J336j66j590J742Q31k985K0L459r33k955J511K080k067l98J776r03
$$ 64 -737 599 433 -1157 585 1416 -1569 -1549 1910 977 -1978 -467 1613 -454 -852 924 21
3455B1j218K114R9k564J748K383l688j795L963Q32k782P11J920k805j094L287
$$ 21 -1197 917 1016 -1548 200 2583 -1105 -2900 1063 1895 -887 -176 1744 -1061 -2155 1132
3471A132p14j433K943j25m749Q08M096j369k185L344P71m688j12L250j200j34
$$ 1132 418 -1015 1928 1803 -2946 -2138 1958 589 -1596 1748 2519 -2169 -2281 969 -231 -365
3487c65L273j842l972K443K082l306K63M754j026m883J726K012k809N79L624j870
$$ -365 2908 1066 -2906 -463 1619 -1687 -1424 3330 2304 -2579 -853 1159 -1650 -1071 2553 683
3503F83j704K697j517l929K905M011l295j099L936j618m924K127K842j351J368
$$ 683 -1021 1676 159 -3770 -865 3146 -149 -1248 2688 1070 -3854 -1727 1115 -236 1132
3518A132K497l989l212L296N26k569L372M248m751m215L078k90j171L728K160
$$ 1132 3629 -360 -3572 -276 250 -2319 1053 5301 550 -3665 -587 -877 -2048 1680 3840
3533C840l901r27J497l471o64O319J656n146N5K316l772j509M874R86k227J974
$$ 3840 -61 -988 509 -2962 -3626 2693 4349 -797 -742 1574 -2198 -3707 1167 2153 -74 1900
3549A900m82n036J145M397j796k010N077K82o374J42L831j851l70M753j366m618
$$ 1900 1418 -3618 -2473 1924 128 -1882 3195 3477 -2897 -2755 1076 -775 -1145 3608 2242 -2376
3565b376J907R68m086K352O652l042n160K849N03m698K675N641k624k426K337
$$ -2376 -469 499 -3587 -1235 5417 2375 -2785 64 567 -4131 -1456 4185 1561 -865 1472
3580A472k458m209N503M408m846r20M236l855m896N400L801l896Q65K450m861
$$ 1472 -986 -5195 308 4716 -130 -1050 3186 -669 -5565 -165 3636 -260 605 3055 -1806
3595a806k537N717K61l830M063K784p074k151O627j238l594M927J935n871p78
$$ -1806 -4343 1374 1635 -2195 1868 4652 -2422 -4573 2054 816 -2778 2149 4084 -1787 -2565
3610b565L944l238j353P505k09p399K156L711n841r09Q217Qn514J796J097o479
$$ -2565 1379 -1859 -3212 4293 4084 -3315 -1159 2552 -3289 -4198 4019 4027 -1487 309 1406 -5073
3626e073J972P470k165m007N073j040q829K559Q436k732l020N358k429p637L464
$$ -5073 -3101 4369 2204 -1803 3270 2230 -6599 -4040 4396 1664 -1356 4002 1573 -6064 -2600
3641b600N300l668R99O308n004p923N540L833n803K367P119m932o239M435N87
$$ -2600 2700 -968 31 6339 1335 -6588 -1048 2785 -3018 -651 6468 1536 -4703 -268 319
3656C19m788M842N955o156l453N888l016o299O499O457n945j947M701l763n397
$$ 319 -4469 373 6328 172 -3281 2607 -409 -6708 -209 6248 303 -1644 3057 -706 -6103
3671f103O100L810m733K082M256p570m734P497K275n171L629M710p225m519N729
$$ -6103 -3 3807 -926 1156 5412 -2158 -6892 605 2880 -2291 1338 6048 -1177 -5696 33
3686C3N48l057N660K364q141r46N338k969k857P402K264p764o56M701l422k145
$$ 33 581 -2476 3184 5548 -2593 -3539 1799 -1170 -4027 3375 5639 -2125 -2781 1920 -1502 -3647
3702c647O369O61n523K459K387o116j64P013j130m927L719K215n890r64N674j652
$$ -3647 2722 3383 -2140 319 2706 -3410 -3574 3439 2309 -2618 1101 3316 -2574 -3538 2136 484
3718D84k193M260k87n537J814L551l179j255N744m12o224J462L651l221k93M848
$$ 484 -1709 2551 2264 -3273 -1459 2092 -1087 -2342 3402 2990 -3234 -1772 1879 -1342 -1635 3213
3734C213j555l781K243N78l451K068M568k851l904L430R84m148J812L634k279
$$ 3213 1658 -2123 120 698 -2753 -685 3883 1032 -2872 558 1542 -2606 -794 2840 561
3749E61j978K214r54k241L062J898l683m98L494j363l227K875K239l138k73K067
$$ 561 -1417 797 -157 -2398 664 2562 -1121 -1619 1875 512 -2715 160 2399 -739 -1012 1055
3765A055j229q03J752k69k056J687K050k795j296K937k87k518J710J821j585q35
$$ 1055 -174 -977 775 506 -1550 137 2187 -608 -1904 1033 746 -1772 -62 1759 174 -661
3781f61P82n06o93K051O06k429M91J324j747q40K475P71j806n43O47m37J17J297
$$ -661 121 -385 -1078 973 1579 -850 -359 965 -782 -1622 853 1624 -182 -725 -78 -515 -398 899
3799H99m25q86R05j65j585O70J935m78j662L85P64n35o8M95k0m32L87n59l27J307
$$ 899 474 -412 493 328 -1257 -587 1348 870 -792 -407 357 -178 -246 249 229 -203 184 -375 -702 605
3819F05M85j410l87J056J00o41j88Q07j85l94O0j50L37O87q20j102P36R10m12
$$ 605 1090 -320 -707 349 449 -192 -380 427 242 -152 -92 -242 95 782 -38 -1140 -404 506 94
3838I4m08M68K66n24o96N53M63N72o16q00J00P44R2n59L7N43M3j174J35P44O21
$$ 94 -314 154 420 -104 -800 -247 216 788 172 -628 -528 216 308 -251 -214 329 372 -802 -667 77 698
3859F98n96m93j44O77J35l97j0M78j53o73j17Q22M96m93o87k9N66L17m10l91O73
$$ 698 102 -391 -535 142 277 -120 -130 348 195 -478 -595 227 723 230 -457 -486 80 397 -13 -404 269
3880B69J2o94l04P39P69l77q10m9N17J10j74l14K57N48n76o40L86J142o22r05
$$ 269 281 -413 -717 22 791 414 -396 -445 72 182 8 -306 -49 499 -77 -717 -331 811 189 -716
3900g16K94O82j81q2O1j07J65L02o64n06J436J23j309l68J136L80r74K88N55l88
$$ -716 -422 260 79 -3 58 -49 116 418 -246 -752 684 807 -502 -870 266 646 -328 -40 515 127
3920A27l10J64k99K69Q81p45j304R08J249q49p73J230K41j650M68O52l63N56M36
$$ 127 -183 -19 -318 -49 832 87 -1217 -309 940 91 -682 548 789 -861 -393 259 -104 452 888
3939H88j241m17R91K64j473N77J865j251j520J456K70p78N88N53j148J47J011
$$ 888 -353 -770 221 485 -988 -411 1454 203 -1317 139 409 -369 219 772 -376 -229 782
3956G82j216j026K266Q60k215k49J960j245j512K003K96j082Q72N59k251j65K299
$$ 782 -434 -1460 806 1666 -549 -798 1162 -83 -1595 408 704 -378 494 1053 -1198 -1363 936
3973I36o44j771K197J228l097n07K283m72j362K582l7k358O09J436k391o20M287
$$ 936 292 -1479 718 1946 -1151 -1658 625 153 -1209 1373 1336 -1022 -413 1023 -1368 -1988 2299
3990B299j28l818J181J937l142l97L670j14k139J681L9l962J250M068j871k129
$$ 2299 2171 -1647 -466 1471 -1671 -2068 1602 1488 -651 1030 1069 -2893 -1643 2425 554 -1575
4006a575L877m70m965J201L859j787r21L440j339m113J929K454l466J151M583
$$ -1575 2302 1832 -3133 -1932 1927 140 -781 2659 1320 -2793 -864 1590 -1876 -725 3858
4021C858k749m633L320J901l930J175M375k111l340K821k42l716K767M382m147
$$ 3858 1109 -3524 -204 1697 -2233 -1058 3317 1206 -2134 687 445 -3271 -504 3878 -269
4036b69j587M469j821n130L464M148l598p79L692k475l647L886J627l865K192
$$ -269 -1856 2613 792 -4338 -874 3274 -324 -1103 2589 114 -3533 353 1980 -1885 307
4051C07L760m896l659N232J064l891K565L529m805k480L946p46k484M789J700
$$ 307 4067 -829 -4488 744 1808 -2083 482 4011 -794 -3274 672 -74 -2558 2231 3931
4066C931o271k28M546k618k789N778J762n777k77L332k964j101N701l54n056K411
$$ 3931 -2340 -2568 1978 -640 -3429 2349 4111 -1666 -1943 1389 -1575 -2676 3025 2671 -2385 26
4082B6J884n265K79O274o93m746K965J261n300O50N366j894j947M130j360n767
$$ 26 1910 -3355 -3076 3198 2505 -2241 724 1985 -3315 -2665 2701 807 -1140 2990 1630 -4137
4098d137K329M463l173r60N128j323o299K205K884k800J339M925l207l991K296
$$ -4137 -1808 2655 -518 -1478 3650 2327 -3972 -1767 1117 -1683 -344 4581 1374 -2617 -321
4113c21K41l647L416N691l540m042K394q39l512L892M469l221j118J788l627k930
$$ -321 -80 -3727 -311 5380 1840 -2202 192 -647 -4159 -267 4202 981 -137 1651 -1976 -4906
4129d906N210L325l401j19K978m586l298M435K130k084K218J244m872j759L825
$$ -4906 304 3629 228 109 3087 -1499 -4797 -362 1768 -316 1902 3146 -1726 -3485 340
4144C40j82k150M270J990n493j503L101j661j019M442J152l659K00P17l724m0
$$ 340 158 -1992 2278 4268 -1225 -2728 373 -1288 -2307 2135 3287 -372 -172 545 -3179 -3219
4160c219N729L69l462J681J23m501J4M743L21j310J883j534m389J293L812j522
$$ -3219 2510 2879 -583 1098 1221 -3280 -3266 1477 1798 488 2371 837 -3552 -2259 1553 31
4176C1r2L625k052m907J561K827j807J154K903k703k858K017J82k290K618L595
$$ 31 -61 3564 1512 -3395 -1834 993 -814 340 3243 540 -2318 -301 -119 -2409 209 3804
4192C804l614k521L130n66k863K575K738k476p31J892k038k020L379J112k877
$$ 3804 190 -2331 799 233 -2630 -55 2683 207 -524 1368 -670 -2690 689 1801 -1076
4207a076P69K862l243k431L489J324k422J285J665l409r54K950q84j377L274Q57
$$ -1076 -307 2555 -688 -3119 370 1694 -728 557 2222 -1187 -2141 809 -75 -1452 1822 2679
4223B679m753J52L056j085j552L269L60l516pJ919j637J83L483j250l446J883
$$ 2679 -2074 -1922 1134 49 -1503 1766 2126 -1390 -1397 522 -1115 -932 2551 1301 -2145 -262
4239b62J657l107M57L720j152k770J162R39k020Q13K587j990j259K751r59l129
$$ -262 1395 -1712 -1255 2465 1313 -1457 -295 644 -1376 -563 2024 34 -1225 1526 567 -2562
4255b562K110K433k124p61J975n52k079J369J073j785Q26K114k084j776K325L62
$$ -2562 -452 1981 -143 -904 1071 519 -1560 -191 882 -903 -77 2037 -47 -1823 502 864
4271H64k126R49K531k007j816J624j07j027J546J416k151l28J499j204j324K143
$$ 864 -1262 -313 2218 211 -1605 19 -88 -1115 431 1847 -304 -632 867 -337 -1661 482
4287D82J458k035r67J544l65j009J464K33j206N91M54j612K25J712k65j434L86
$$ 482 1940 -95 -1062 482 117 -892 572 805 -401 190 644 -968 -743 969 704 -730 -344
4304c44J528j474n71J298j75p38O24M63r86M04N24r14p08J376P12j299m11J081
$$ -344 1184 -290 -861 437 262 -476 148 611 -375 29 553 -361 -1069 307 1019 -280 -691 390
4322C90m48o77J264j37l57J76m71n01M80J061n61o52M71N39j234m9J214J78p06
$$ 390 -58 -735 529 392 35 211 -260 -761 -281 780 219 -433 38 577 -657 -706 508 686 -20
4341b0P1l26L6N17J93o12l36Q11m17m14L33J049q41m25j08L28N60n8o5n38M7M39
$$ -20 51 -275 -239 278 471 -141 -477 334 -83 -497 -164 885 44 -381 -489 -161 399 341 276 -262 -215 224
4363B24o58J8J036J22j136l38O46N42l5l43j41j66J11K10j53M44O13j101q27N95
$$ 224 -434 -416 620 742 -394 -732 -86 456 421 78 -63 -229 -118 92 -61 383 996 -105 -932 -337
4383c37J049k51n94j11L54l29q5M30j0J68m64m81J92J045K01j034j35L34q2j20
$$ -337 712 461 -133 -244 110 -219 -304 126 116 284 -180 -661 -469 576 777 -257 -392 -58 -140 -260
4403b60L58M74k22l84l97m62R14O53l93p78M11L3l71L18P13K07j170q9j76O07
$$ -260 98 572 350 -34 -431 -893 21 674 281 -497 -86 -53 -424 -106 607 814 -356 -445 -621 -14
4423a4P59p2r34j24L78k94k64R59M88q82q09M98K80L87O5m99m34O81On25L16P98
$$ -14 745 673 -261 -385 -7 -301 -565 394 882 0 -809 -311 -31 356 421 -78 -512 169 175 -350 -34 764
4445G64n90j085P86N81O6k28M1j076J74R38j04k46P40l71j584J25J508K98m56
$$ 764 174 -911 -125 456 522 294 335 -741 -567 371 267 21 761 390 -1194 -1069 439 737 281
4464B81K70p39j027Q01O10j87N01O85j407j405J221J112o14P7O03q07q32N88M77
$$ 281 551 -188 -1215 -414 196 9 510 1195 -212 -1617 -396 716 102 179 782 -25 -857 -269 208
4483B08m28Q15J72j497k68J863l69j392Q07Q30j055K3J066o38r77J018m00o86
$$ 208 -220 595 767 -730 -998 865 496 -896 -89 741 -314 -291 775 137 -840 178 -222 -908
4501i08J725Q83k120j197J677j94q01J715J191k523n70R71r12M16K955p23l019
$$ -908 817 1700 -420 -1617 60 -134 -935 780 1971 -552 -1122 -151 -1063 -647 2308 1585 -1434
4518a434M82J289j309j08L174m50l024M85R87j555J097K689j832j996J925J41
$$ -1434 -952 337 -972 -1080 2094 1644 -1380 -895 92 -1463 -366 2323 491 -1505 420 561
4534E61k430J342L275k581j999K577m9k614J814K027k514k99K792j804k640L035
$$ 561 -1869 -527 2748 167 -1832 745 696 -1918 -104 1923 -591 -890 1902 98 -2542 493
4550D93J511l646M68L791k193k856K783L42k697K397K773l329j799K821n96l587
$$ 493 2004 -1642 -1174 2617 424 -2432 351 693 -2004 393 3166 -163 -1962 859 263 -3324
4566c324M060L218m171j566K892j781k528M447K071l892k31K307l623j702N887
$$ -3324 736 3954 -217 -1783 1109 -672 -3200 1247 3318 -574 -805 1502 -2121 -3823 2064
4581B064J149m148J120J995m570j624N774M90l008K007R74n302r1N117j224k679
$$ 2064 3213 -935 185 2180 -2390 -4014 1760 2250 -758 1249 2223 -3079 -3170 1947 723 -1956
4597a956M576O52o334N13M149k308j414M915J47n055J005K412l853o2O427r78
$$ -1956 2620 3272 -3062 -2549 1600 -708 -2122 2793 2940 -2115 -1110 1302 -2551 -2613 3814 2836
4613B836m909K657J182n343O84O042j024l048K645n67n681K094N249k373j077
$$ 2836 -2073 584 1766 -3577 -2893 3149 2125 -923 1722 1155 -4526 -2432 2817 444 -633
4628f33M297k439o224K757M353k285k22M174k599n139K793K612l557K068M600
$$ -633 3664 1225 -4999 -2242 2111 -174 -396 3778 1179 -3960 -1167 1445 -2112 -44 4556
4643D556m042m243L957P40l842K449M641l385k927K997j105l120L728L188m021
$$ 4556 514 -3729 228 968 -2874 -425 4216 831 -2096 901 -204 -3324 404 3592 -429
4658d29n74L491k736l893M309K703l494L40K979l187l078M058R06l054K863K256
$$ -429 -1003 2488 -248 -4141 168 2871 -623 -283 2696 -491 -3569 489 1395 -1659 1204 3460
4674C460m708k126L987K91k875K945K177m270j298L314j032j574L794M31m401
$$ 3460 -1248 -3374 613 904 -1971 974 3151 -1119 -2417 897 -135 -1709 2085 2516 -1885
4689a885M10K874k248j218M068L84l773P14J684k220j19L401q08k487J679M86
$$ -1885 -1475 1399 -849 -2067 2001 2385 -1388 -674 1010 -1210 -1329 2072 1264 -1223 456 942
4705I42l127Q52L483j323k168K447j79k991J057K345j114n54K185j487k718J701
$$ 942 -2185 -1333 2150 827 -1341 1106 927 -2064 -1007 1338 224 -330 1855 368 -2350 -649
4721f49J773j716P8K816j723k861J540J201j245R43J886j954j673J698p4j440
$$ -649 1124 -592 -514 2302 579 -2282 -742 459 -786 157 2043 89 -1584 114 40 -1400
4737a400J823J834k574j070J605m28q87J515J018j313l80P39j311m54J875M88
$$ -1400 423 2257 -317 -1387 218 -210 -1097 418 1436 123 -257 482 -829 -1283 592 1080
4753A080j845R36J277j796j048J522K70n55R51P4j327k82J062r70l1J921K07k182
$$ 1080 -765 171 1448 -348 -1396 126 396 -159 792 866 -461 -743 319 -651 -682 1239 1446 -736
4771g36j60J007o31J79J225m1j042N3j08p99Q16J591o21j266P40O1j405Q83J062
$$ -736 -896 111 -520 -341 884 843 -199 -146 -254 -1053 -237 1354 733 -533 207 268 -1137 -254 808
4790H08m09n37R0j74k65O71N81j278K51J083p20r85J005L45p12k33Q44k65k82
$$ 808 399 -138 -48 -222 -487 184 765 -513 -262 821 101 -884 121 466 -246 -479 365 100 -182
4809a82N58n30n78O01Q32q00k01R00n21p90K31J103m24J44j11o34k40O97L29m76
$$ -182 376 -154 -732 -131 701 -99 -300 600 79 -711 -480 623 199 343 232 -402 -642 55 384 -92
4829i2N15L9r68n44J108N81l62l41J00k67j86M46J76k7j7j73q70L23J083J5p21
$$ -92 423 462 -506 -1050 58 639 277 -64 36 -231 -417 29 205 178 161 -12 -882 -559 524 539 -182
4850a82k3L67m89J46N80m0l27J26o42k66J264J78o45k22j52L28m41M06N65k90
$$ -182 -205 162 -327 -181 399 359 32 158 -484 -750 514 692 47 -175 -327 1 -440 -34 531 241
4870B41l17l09j08N72M86l10m83k45K95J05q1M52J56p82j93L08R7N85o0o53j44
$$ 241 -76 -385 -493 79 565 255 -228 -473 -178 -73 -154 298 454 -328 -521 -213 -116 469 409 -244 -388
4891c88M10k21M6J52L53l57q26N65O19j05j53N3m33LK72l3J9N88k02r86k12J137
$$ -388 22 -199 -153 -1 352 -5 -831 -266 353 248 95 148 -285 -282 -10 -43 -24 564 362 -624 -836 301
4913C01L32n59J25j81j90L04l8p7J50J75n00n76M40Q77m80l54M29k09m23N63J27
$$ 301 633 74 199 18 -172 132 94 17 167 342 -158 -734 -294 583 103 -251 178 -31 -454 109 236
4934B36j58J54l7n34k15Q16L79j203L50O53o29k77Q20j89l75K08J04n28L32R69
$$ 236 78 232 195 -339 -554 262 641 -562 -212 441 -188 -465 355 166 -209 -1 103 -425 -93 876
4954H76r07q94J280J81j141N49R19r25n53N75K07j87N14K73j585K59J148j000
$$ 876 -31 -925 355 536 -605 -56 863 -62 -615 -40 167 -20 494 767 -818 -559 589 -411
4972d11m07J394L22j397K3N79l53k46J305j62j250N51M06j321K90J950o13j517
$$ -411 -818 576 898 -499 -476 103 -250 -496 809 647 -603 -52 354 -967 -677 1273 660 -857
4990h57Q87N61j196L6J404o25o72J006j0j759R42J616j617n40J718m68j626P46
$$ -857 30 591 -605 -569 835 210 -462 544 534 -1225 -283 1333 -284 -824 894 426 -1200 -454
5008d54J252q60k89J172p91j042J216O89j886P79J531j240j238J371L62j423Q37
$$ -454 798 -62 -351 821 30 -1012 204 893 -993 -214 1317 77 -1161 210 572 -851 -14
5025a4J376j406p82J456r27r69J602J058j938K46J102j131j285J870J043j539
$$ -14 1362 -44 -826 630 -297 -1266 336 1394 -544 -298 804 -327 -1612 258 1301 -238
5041b38N85M52j858n10K033J99j278J460O40k708m88K026K38q55J654k76k295
$$ -238 347 799 -1059 -1569 464 663 -615 845 1485 -1223 -1711 315 553 -302 1352 1076 -1219
5058a219j32J332o86O46K077p57k555M20J113j596R99K192o61k015Q63k38j500
$$ -1219 -1351 -19 -705 -59 2018 1261 -1294 -874 239 -1357 -358 1834 1173 -842 21 -217 -1717
5075a717J451K154j419r43J611j081k106J313K178j293m2J357j614j706J447M70
$$ -1717 -266 1888 469 -474 1137 56 -2050 -737 1441 148 106 1463 -151 -1857 -410 60
5091F0j194J911J750k377j961J452O0j305K351K036k417j317Q25j199n40L085
$$ 60 -1134 777 2527 150 -1811 -359 -299 -1604 747 2783 366 -951 -126 -1325 -1865 1220
5107A220J377k457m70J034k362r23L725J028k345M70N90k807l4L422l66j444J835
$$ 1220 2597 140 -330 704 -1658 -2581 1144 2172 -173 297 887 -1920 -1954 1468 1102 -342 1493
5124A493k43l329L04L104j072j321K736l69l092J122J870k002pK708p29k896J716
$$ 1493 1250 -2079 -1775 1329 257 -1064 1672 1303 -1789 -667 1203 -799 -806 1902 1173 -1723 -7
5141gJ103k905M76L345j037k354J924Q4k967J324L012j737j031K393j254l246
$$ -7 1096 -1809 -1333 2012 975 -1379 545 629 -2338 -1014 1998 261 -770 1623 369 -2877
5157b877K238K851k222m55K316j582l321K764J858k020O02K232l152k427L406
$$ -2877 -639 2212 -10 -465 1851 269 -3052 -288 1570 -450 152 2384 -768 -3195 211
5172B11J534k807J558K039l265k131L080Q54k117K204J075l527p25L071p14j952
$$ 211 1745 -1062 496 2535 -730 -2861 219 1073 -1044 1160 2235 -1292 -2017 1054 340 -1612
5188a612L099O15l660J34K598j515j227K752K61k684R76J834k769o81L420n69
$$ -1612 1487 2102 -1558 -1424 1174 -341 -1568 1184 1445 -1239 -263 1571 -1198 -1879 1541 972
5204I72k419K047J232l337o15L013o08j108K305K16l552J95K381j384j90L123
$$ 972 -1447 600 1832 -1505 -2120 893 285 -823 1482 1698 -1854 -1659 722 -662 -852 2271
5220B271l82l888N40K068j409j2L261j066l034Q74R85j862J441K770j478k598
$$ 2271 1889 -1999 -1459 609 -800 -812 2449 1383 -1651 -777 208 -1654 -213 2557 1079 -1519
5236a519J462N58k012R82K644j659j625J550l42j800J920J521k095k19J809o60
$$ -1519 -57 501 -1511 -529 2115 456 -1169 381 39 -1761 159 1680 -415 -634 1175 515
5252E15k077J320J351j629l04K093p74j643J366j20j262R51J820j425j227J355
$$ 515 -1562 -242 1109 -520 -824 1269 495 -1148 218 98 -1164 -213 1607 182 -1045 310
5268C10j20j810J478J893j635n13N94q27o29J715Q30j224l45R04j290n79J626
$$ 310 190 -1620 -142 1751 116 -397 197 -630 -1259 456 1286 62 -283 621 -669 -1248 378
5285C78R47j562N5N89p94l95J264K24j223M96N35j214J24J128r9j059O25N10o92
$$ 378 1325 -237 -182 407 -387 -782 482 706 -517 -21 514 -700 -576 552 453 -606 19 529 -163
5304a63j74O96j91n87M55k7m63M99N16q53k97Q47K84p05K22K98p54j07O49j07
$$ -163 -337 359 168 -419 36 9 -454 45 561 -292 -589 258 542 -163 59 357 -397 -504 145 38
5324C8P4P3R3r11K76Q41l18m55K61K42n98p1M77J53k13L9Qn05N61J50l35J4M93
$$ 38 112 185 278 -633 -357 484 166 -289 -28 214 -384 -455 22 175 -38 1 9 -496 65 215 -120 -106 387
5347C87l55n77M65L39k12j62J1P2P6J24k03j78K14J85m05nL85J31o77J48K86K61
$$ 387 32 -545 -80 259 47 -115 -104 -32 44 168 -35 -213 1 186 -219 -224 161 292 -385 -237 49 310
5369C10k25L5l34K2K56J97k38K59k17l97j86M71J39K8l84K66k61J88M4O0J47Q3
$$ 310 85 120 -214 -192 64 261 23 282 65 -332 -518 -47 92 120 -264 2 -259 -71 -27 33 180 263
5391B63m05k83M61J48J49k47P2l86K67n8M2N7O4m3n25m8O99J89k90k80k36L37
$$ 263 -142 -425 36 184 333 86 158 -228 39 -19 23 80 144 101 -424 -472 227 416 126 -154 -390 -53
5413e3kL24J69m52j57k04JN72L74l26n83K02K60j43j36L59p4m82J36N9K49L67
$$ -53 -55 269 438 -14 -171 -375 -374 198 572 246 -337 -135 125 -18 -154 205 131 -351 -215 -156 93 460
5435D60j20j064L01L81P6Q8L28j57p67n1N27J10J83L41q14n26L18P33k44K4K56
$$ 460 340 -724 -423 -42 34 122 450 293 -474 -525 2 112 295 636 -178 -704 -386 347 103 127 383
5456C83n17q36R76N39l84p5L50j001nR04J79n42L38J08j019m63J587M04q48Q4
$$ 383 -134 -970 6 545 161 86 436 -565 -570 334 513 -29 309 417 -602 -1065 522 926 78 162
5476A62m5q02N52O88l97k94R9J38r39N35J041n89p52O24R9n28O65N89j121l12
$$ 162 117 -685 -133 555 158 -136 -37 101 -838 -303 738 149 -603 21 120 -408 257 846 -275 -587
5496e87Q36m74m13J388Q4j304m81J235l94j78J526m74j854M40R58n74L77J412
$$ -587 249 -225 -638 750 834 -470 -951 284 -110 -288 1238 764 -1090 -650 308 -266 111 1523
5514A523j030j864P94J207j156O22J397j134j662R95N41q17J050R93j724j055
$$ 1523 493 -1371 -577 630 -526 96 1493 359 -1303 -308 233 -584 466 1459 -265 -1320
5530a320J593p3j264J308J183j811n44J707o15j292J438N38j676L26J766j109
$$ -1320 273 200 -1064 244 1427 -384 -928 779 164 -1128 310 848 -828 -502 1264 155
5546A55j432J512K70k015J584J901j896r54R55m92j210K198J575k179j077J440
$$ 155 -1277 235 505 -1510 74 1975 79 -875 80 -412 -1622 576 2151 -28 -1105 335
5562C35j220j003L053J184k410o38R94j658l54K698Q62k033L51M43k234k3L108
$$ 335 -885 -1888 1165 2349 -61 -699 295 -1363 -1717 981 1843 -190 161 604 -1630 -1653 1455
5579A455l1k117J062L24k063K24K440q00j260J446L17k208N69J878j734p07K315
$$ 1455 1424 -693 369 693 -1370 -1146 1294 494 -766 680 997 -1211 -642 1236 -498 -1205 1110
5596A110j94j896P53J036j788l19K278p9j675J303K49k605O19K472n56j270J524
$$ 1110 916 -980 -227 809 -979 -1298 980 901 -774 529 778 -1827 -1208 1264 708 -562 962
5613I62o08k205O86K495p18o64J461j443k175J834J808j167m5J306j615j998J668
$$ 962 354 -1851 -1165 1330 612 -52 1409 -34 -2209 -375 1433 266 221 1527 -88 -2086 -418
5630d18J463j302N63J108k105j012J873L67j009R85R96k165p07J937k81j091J195
$$ -418 1045 -257 306 1414 -691 -1703 170 537 -472 513 1509 -656 -1363 574 293 -798 397
5647C97P32j858J61J328j181n90J808k5j474O31R29j599m88J951K06j407R63L50
$$ 397 1129 -729 -568 760 -421 -1011 797 772 -702 -71 858 -741 -1229 722 928 -479 484 834
5665H34j781k44J756m59m2J318q28k156K57J770m84m8J761p71k324N22O70l92
$$ 834 -947 -1191 565 106 64 1382 554 -1602 -1345 425 -59 -107 1654 883 -1441 -919 -249 -641
5683f41O79J685j309j507Q02K22j065J176J631j258j043O23l45r34J605R53j170
$$ -641 38 1723 414 -1093 -291 -69 -1134 42 1673 415 -628 -5 -350 -1284 321 1274 104
5700A04k94R02j209j130J596J078j106K75P00j389p24J253k6m55J113M55j619
$$ 104 -190 712 -497 -1627 -31 1047 -59 216 916 -473 -1197 56 30 -425 688 1143 -476
5717d76n25J203n33m62J473M61j515j47O94q92j61J682Qj211L44L71j155j14J750
$$ -476 -1001 202 -331 -793 680 1141 -374 -521 173 -719 -880 802 810 -401 -57 314 -841 -955 795
5736G95Lj197P78J10j487J34J349l00m56J169l97j652N35J185q22k26J537l70
$$ 795 798 -399 379 489 -998 -864 485 185 -271 898 501 -1151 -616 569 -253 -479 1058 688
5754F88j695O50N17q24N79J075o89j013P15K02j071O91J285r85r64J005k82p06
$$ 688 -1007 -357 160 -664 -85 990 301 -712 3 205 -866 -175 1110 125 -839 166 -116 -822
5772h22Q01J252j235o67J131n86q07J202R35j556%N48j86n59R48L33j016p1O50
$$ -822 -21 1231 -4 -671 460 -126 -933 269 1204 -352 -352 196 10 -549 399 732 -284 -355 295
5791B95m62m07J052p2j021N25P13p39l75J040l62r30N78R41p93j82O29p11n86
$$ 295 -167 -574 478 406 -615 -90 623 -116 -491 549 187 -743 -165 776 -17 -199 430 -281 -867
5810h67J111L35r25K27M64m31m75P08L45m35k51L23q23L54J146j91p04J44j14
$$ -867 244 579 -346 -119 345 -86 -561 147 492 57 -194 129 -694 -340 806 615 -89 55 -59
5829e9n81K54Q23Q0n58p0k27mN28L25l93k16J06k05j40O28L54l78o18M44j97j19
$$ -59 -640 -386 437 517 -41 -111 -338 -342 186 511 118 -98 8 -197 -337 291 645 267 -351 93 -104 -223
5851b23M78J05m22j97Q2M3J81L22K35j004j93M25K47j36N76k58q00K95J91J13
$$ -223 255 360 -62 -259 -177 -134 47 369 604 -400 -593 -168 79 -57 519 261 -539 -244 -53 60
5871F0K07Q0l36m73j8P15j1k5Q3m38m09L63K36K56j36J20m37k66N19M21m80L4
$$ 60 267 347 11 -462 -480 235 224 199 282 -156 -565 -202 34 290 154 274 -163 -429 90 511 31 65
5893F5L1o44J36M32L25P4l80k37l9M0L05Q7j75Q1o7m93M38M67p7l08k63L0L5K63
$$ 65 96 -548 -412 20 345 419 39 -198 -237 -197 108 195 20 101 34 -459 -21 446 369 61 -202 -172 -137 126
5917A26J68rm65j45J51j51M62J11k58k99q8L57L1J45K02k77l44J73k18J37P07
$$ 126 294 285 -180 -325 -174 -325 137 248 -10 -309 -397 -40 -9 136 338 61 -283 -110 -328 -191 516
5938E16k92n30L7K70P2L0l9K54m08p2q3L01KK12m81l22M42J11J24K44k99j86k24
$$ 516 224 -306 -269 1 73 103 64 318 -90 -162 -245 56 58 270 -211 -533 -91 20 144 388 89 -97 -321
5961c21K34N1K71L21m52l71J57K8K08k24M14l15m45K48K17J96o5K55m18n22N35
$$ -321 -87 -36 235 556 104 -267 -110 -82 126 -98 316 1 -444 -196 21 217 152 407 -11 -533 2
5982BM2k57M38K28n84j85L57J03k65J45J09l84K05J93m31m2K94k8k04M30J27k32
$$ 2 44 -213 225 453 -131 -316 41 144 -121 24 133 -251 -46 147 -284 -326 -32 -60 -264 166 293 61
6004F1m20L23J06k57N41J6n91k14N70l32J6O43k2o74l8M62n64J10P26q5m97J98
$$ 61 -359 -36 70 -187 354 370 -221 -435 135 -197 -181 462 440 -234 -272 190 -374 -264 462 377 -120 78
6026G8k0o99N21N69j00n25M51P8r99L63O71m10q1O18o27n43M65M66p58M45R63
$$ 78 58 -641 -120 449 349 -176 275 353 -646 -283 388 -22 -103 515 -112 -655 -190 276 -482 -37 926
6047I26p29r19P29L23q81P11P85j016p56R14k41n57Q81P09j152j85Q59o12p11
$$ 926 197 -722 7 330 -551 160 945 -71 -827 87 -154 -711 170 879 -273 -458 401 -211 -922
6066i22J101N66j050K35Q66j331r8J183j98q86O89Q85j408n22J443k87q84Q38
$$ -922 179 745 -305 -70 796 -535 -633 550 352 -534 155 1040 -368 -890 553 266 -618 220
6084B20Q59j674L9J264j163n19J664M95j739K00R19j191k62J730J88j786O34N84
$$ 220 1079 -595 -556 708 -455 -974 690 1185 -554 -354 565 -626 -888 842 1030 -756 -122 462
6102D62j337K10J707l90j551J076L01j714M37K281q94j425J201j83j271P72J527
$$ 462 -875 -665 1042 652 -899 177 478 -1236 -799 1482 588 -837 364 181 -1090 -318 1209
6119A209j167m81J034p25j250J408J134j469j59J156q60j108J453M96j369M52
$$ 1209 42 -439 595 -130 -1380 28 1162 -307 -466 690 -170 -1278 175 671 -698 -246
6135b46J538j240j280J866j85j480R43J404j291o15J073n89j232J379J425j529
$$ -246 1292 52 -1228 638 453 -1027 -84 1320 29 -586 487 -102 -1334 45 1470 -59
6151e9k64R45j253j091J979J172j215j10N96j427r41K004P79j210O18L60k124
$$ -59 -323 622 -631 -1722 257 1429 214 104 700 -727 -1668 336 1115 -95 523 883 -1241
6168a241k14K043N4j058J173L94k165j16J536j71n90J293k25j723M27J215q63
$$ -1241 -1455 588 642 -416 757 1151 -1014 -1130 406 235 -355 938 713 -1010 -583 632 -231
6185b31k60J195l4j273M05P24j281q6J383k38q57J079K9j719M16J120k06l61J101
$$ -231 -491 704 670 -603 -198 526 -755 -841 542 304 -553 526 555 -1164 -748 372 166 -195 906
6204I06j1j889J31J170m64J15J417p83j570L18P43m18N73J123j054j372M95O11
$$ 906 895 -994 -863 307 -157 -42 1375 592 -978 -660 83 -335 238 1361 307 -1065 -570 41
6222D1k13L34J046j107r32Q10o4j72P95M90j187m37Q33r1m66M44L79q17K9P79
$$ 41 -172 162 1208 101 -831 -21 -85 -257 538 1028 -159 -596 237 146 -320 124 503 -314 -285 494
6242D94m79j79N06k53o28M92Q11p35m69O85l46m86P34L79m60k07J29n87L28N49
$$ 494 15 -164 342 89 -539 -47 764 29 -440 245 -101 -587 147 526 66 -141 -12 -599 -271 278
6262B78K53n85N6M9n95L65P63K2q17K65l01k51N55K94j8m16j0j91j31L15R50n19
$$ 278 531 -54 2 51 -544 -179 584 606 -211 54 -247 -498 57 351 333 -83 -93 -284 -415 -100 850 331
6284C31n86J08k38Q6M53M82m16l27m0M4q1N10K3l87j65K03k20J39K40K6k95N9
$$ 331 -255 -147 -385 -299 154 636 220 -107 -147 -103 -184 326 349 -38 -203 0 -220 -81 159 185 -110 -51
6306e1o0j10K69K10k66m20K58M22l75J04J77k51l65L85K93j01k2J05o63q4O08
$$ -51 -111 -221 48 258 -8 -428 -170 252 -123 -19 158 -93 -458 -73 220 119 97 202 -461 -545 63
6327F3j21K17N8k20j92r1L54p2J3K21j01n31J32L49M0r6K72l06n10L52N62k80
$$ 63 -58 159 217 -3 -195 -286 68 -4 9 230 129 -402 -270 79 119 23 295 -11 -521 -169 393 113
6349A13j82J06j50n7J94J79k36n2L29k94o1L06J07l16j93Q6J8K24m5L9j71J40
$$ 113 -69 37 -113 -170 24 203 -33 -85 244 -50 -111 195 302 -14 -207 -121 -103 121 76 115 -56 84
6371H4n7k65J61M25k06k65J07M9N8n3J25J4l83J10J28j63J81J24k98j72L11J88
$$ 84 27 -238 -77 348 142 -123 -16 33 91 38 163 177 -206 -96 32 -131 50 174 -124 -296 15 203
6393B03m18K8K37r1j22K46Q2K0j71k46JP0N14l16j05K7Q2m5KQ0p0L5k3k7l7Q3
$$ 203 -215 -187 50 -41 -163 83 165 185 14 -232 -231 -161 353 37 -68 -41 41 -4 -2 78 8 43 20 -7 -44 39
6419C9J53k62m0K06J1j08n2M75n78q8J08J27J65l6j5l33J18L25l17j12K77m0k24
$$ 39 192 -70 -110 96 107 -1 -53 422 -156 -244 -136 -9 156 120 105 -228 -110 215 -102 -214 63 23 -201
6442b01J68K17k50J18k3j20L3J56K01j00l7O5m69j11O11L4k65k02K32l92K44M69
$$ -201 -33 184 -66 52 29 -91 -58 98 299 199 162 227 -242 -353 258 292 27 -175 57 -335 -91 378
6464C78m11n7K15p1m53N11K33j95j57p4J64k51K30K42k37l53L28Jl59N75L9n62
$$ 378 -33 -90 125 54 -399 112 345 150 -7 -81 83 -168 62 304 67 -286 42 43 -316 259 298 -264
6486b64m3O38l24o9K60o4k24m6K51j03r3O97l44p41K30M42k49L9L84m74n25M12
$$ -264 -307 331 7 -62 198 134 -90 -136 115 12 -81 616 272 -469 -239 203 -46 -7 377 -97 -622 -210
6508b10M69k47L54j05m65n04O70K86l91J95K61n81k08M56J41n3J89j38n85K87
$$ -210 259 12 366 261 -204 -708 -38 248 -143 52 313 -268 -476 -20 121 68 257 119 -466 -179
6528a79M54k59k65M17r6j26j52N25l60j69j0N4Q3N92M6o44J1K73m32O2N15l7l76
$$ -179 275 16 -249 168 72 -54 -206 319 -41 -210 -220 -166 -83 509 555 -89 -78 195 -237 -175 340 303 -73
6551g3j05J8j10K78O60m62m51J22J1k64N06N91m38n61K06q4M8M43P4l92l04L09
$$ -73 -178 -160 -270 8 668 206 -245 -123 -112 -376 130 721 283 -278 -72 -156 -108 335 409 17 -287 22
6573B2l46j18R64j8n70j2N0N0k24P55k79m96K19Q6n34L36M11j84m73M15J32m81
$$ 22 -324 -442 522 504 -66 -78 -28 22 -202 553 274 -222 -3 83 -451 -115 296 112 -361 54 186 -295
6595b95J38L75n95Q4N35j5l62K60L9p80L37P31k7m54J91N0q90M68O50p9l56L56
$$ -295 -157 218 -377 -293 242 227 -135 125 164 -616 -279 452 425 -29 162 212 -678 -210 440 361 5 361
6617C61n55p36N75Q31j78j96L52q06m53L55Q70j15k3L18r11n72Q89J02m94O69
$$ 361 -194 -930 -355 476 298 102 454 -352 -805 -450 420 305 282 600 -311 -883 6 108 -386 283
6637B83L69q16n89Q62n3o88Q70L17o79k31P13o27k45Q57K10p69L83L64o83p28
$$ 283 652 -164 -753 109 56 -632 238 555 -124 -355 358 -269 -514 343 553 -216 167 531 -152 -880
6657h80Q85J09j66O33Kj070j47P89j08q4Q21k74j085N3N16j27l07J253J7j354
$$ -880 5 114 -52 581 583 -487 -634 155 47 -37 784 510 -575 -522 -6 -133 -440 813 830 -524
6677e24L1O29p91K31J181k78j167L46O98q16P6R67m41n38N25M8o86N01P53o83
$$ -524 -493 136 -655 -424 757 479 -688 -342 356 -460 -384 583 142 -396 129 177 -509 -8 745 62
6697F2n13O09R8q00K62Q33q67k0Q14l42p31N85L35q02M86O90o74n46P06J0o61
$$ 62 -451 158 256 -544 -282 551 -316 -336 478 136 -595 -10 325 -477 9 699 25 -521 185 195 -466
6718d66L55R26q18o00O17Ml38M30O20p47m21P23m41m20P63L66p92o4O14m82l66
$$ -466 -111 815 -3 -603 14 18 -320 110 730 -17 -438 285 -156 -576 187 553 -239 -303 311 -171 -537
6739e37R11K68j027L41N03q26k39R82J06n19J44K82o80j48O80j20m73Q50l23o43
$$ -537 374 642 -385 -44 459 -367 -606 376 482 -37 107 389 -291 -439 241 121 -352 498 175 -468
6759d68L30N86n81m3O79k40n09J10K13k82J17P27l81p52N51l4m58M04M92n71j96
$$ -468 -138 448 -133 -176 503 263 -246 -136 77 -205 -88 639 258 -494 57 23 -435 -31 461 -110 -306
6780c06N41j55m07J19N79k75l68N90l83l19M24K74n45R5M86k81k76J0K88k74R6
$$ -306 235 80 -327 -208 371 96 -272 318 -65 -384 40 314 -231 -136 350 69 -207 -197 91 -183 -87
6801h7K99j61l95M70j64l51N22K34o17k9J01J91k69L73K22l87K6q1j50J14N06
$$ -87 212 51 -344 126 -38 -389 133 367 -250 -279 -178 13 -256 117 339 -48 -22 -103 -253 -139 367
6822C67o1l47j36l7o8l8M58J90o15K0M03j07m8K10j95k04J61J30j17R3J82k93
$$ 367 306 -41 -177 -214 -282 -320 138 328 -287 -267 136 29 -19 191 -4 -208 -47 83 -34 59 241 -52
6844e2j87J55J22j23K74l22K01k41K9P0J12J88Q3m57J67O5k3M4r4j90J9q0L87
$$ -52 -239 -84 38 -85 189 -133 68 -173 -144 -74 38 226 309 -148 19 84 61 105 11 -179 -160 -240 147
6867A47j20J7j4j5k13K02N0l1J10mk97m7K21K2K88k16m8k25k33N77p7k13O0j45
$$ 147 27 44 30 15 -198 4 54 23 133 129 -168 -215 6 28 316 100 52 -173 -406 171 94 -119 -59 -204
6891b04l7K24J11K17j95l6k91j4L70J19k70k1k2j2j48K54J13O2l46p6K10jJ4m0
$$ -204 -241 -17 94 311 116 80 -211 -225 145 264 -6 -27 -49 -61 -209 45 158 220 -126 -202 8 7 21 -19
6915a9N3j67L09j07j53L20J64m28j49J19J05N6J4j24k09J20P4j04J04M07k64k12
$$ -19 34 -133 176 69 -84 236 400 -28 -177 -58 47 103 117 -7 -216 -96 -22 -126 -22 385 121 -91
6937i1J06j09K45J35m08J63j90J33L4J2J81k8l99j10L81Q1m1k6j94j30J58J35
$$ -91 15 -94 151 286 -122 41 -149 -16 18 30 211 183 -216 -326 55 136 95 69 -125 -255 -97 38
6959C8j21J30N6j77l76L52J92p5J24O2j58l03J58K68k68p6K42j93l35O15j2l59
$$ 38 -83 47 103 -74 -450 -98 94 19 143 205 47 -256 -98 170 -98 -174 68 -125 -460 155 143 -216
6981b16K71N7m4k12L89k52j55O4M47n73K23J76j39j72J16K08k78j84N33k69k54
$$ -216 55 112 68 -144 245 -7 -162 -98 349 -224 -1 175 36 -136 -20 188 -90 -274 259 -10 -264
7002b64L48J22l46K81M1m33J15J36ok97M09J94l24j23K42n0m09O58m0n55J82L25
$$ -264 84 206 -140 141 182 -251 -136 0 -6 -303 106 300 -24 -147 95 45 -364 294 254 -301 -119 206
7024B06m65j05P18j33o43M41L68n55k08O75l07j86L19Q1o39L57M73m23j8K32k4
$$ 206 -259 -364 354 221 -422 19 387 -168 -376 299 -8 -194 125 206 -433 -76 397 -26 -44 188 164
7045A64o41M50L26k06L9K09m26l66N78Q4l85N7O55m74m48O17k2n67K26M45n49
$$ 164 -477 -27 299 93 132 341 -85 -451 127 211 -174 -117 538 64 -384 233 211 -356 -130 315 -234
7066b34j21N85l63l79P03K98q21Q1M88m08n75Q47K25n31K79K82p75Q6M59L2l87
$$ -234 -355 230 -133 -512 191 489 -332 -251 237 -171 -746 101 326 -205 74 356 -419 -333 126 158 -229
7087b29L54K88q33k07P80N8m41P94q1p49k70N56l42k0Q62K51j044o2M29k35l20
$$ -229 125 413 -420 -627 153 211 -230 564 483 -266 -536 20 -322 -342 520 771 -273 -335 94 -141 -461
7108d61J119k43q81N43j11m24J82Q02k41n71N55j40n21K16P26l21l50M65k25p14
$$ -461 658 415 -466 77 -34 -458 -276 526 285 -286 269 129 -392 -176 550 229 -121 344 119 -595
7128e95N48K40m05n9O79j11r16M57R7k61J67R95o16o55L79n3l54N69M90m83m07
$$ -595 -47 193 -212 -271 408 297 -619 -162 -65 -326 -159 836 220 -435 -56 -109 -463 106 596 113 -294
7149b94M28n58l28J032N94q69k19L45p57q7P95M00n60R6K58q27n6P94Kj95J73
$$ -294 134 -424 -752 280 874 5 -214 131 -626 -713 82 482 -78 18 276 -551 -607 187 189 -6 167
7170A67K6o33L14M32l77l9M95j41o89J86L84m38Q4N56m0m71K20O4m30J25O06j51
$$ 167 193 -440 -126 306 -71 -110 385 244 -445 -259 125 -313 -229 327 287 -184 36 100 -330 -205 401 250
7192B50n01M88j70m08J77P28o00k44O84m70m25K42O31j24n6L29q08l13Q03Q4m61
$$ 250 -251 237 67 -341 -164 564 -36 -280 404 -66 -491 -249 382 258 202 531 -277 -590 213 297 -164
7213a64K51K12o50m20Q05K96k44J79R0o89j96O59j58j39N38J1q34K34L38k18J11
$$ -164 87 299 -351 -771 34 330 86 265 355 -334 -530 129 -29 -168 370 381 -453 -219 119 -99 12
7234A2K12m5m06J91L26n52lM12P1m58L53J45o25j8O50j25k59N31p8n95M4K74k98
$$ 12 224 179 -227 -36 290 -262 -265 147 218 -240 113 258 -367 -385 265 140 -119 412 334 -261 -217 57 -241
7257b41K6P71r5o47j59L54k98J20P75k65p87N55k04k88M95N07n38m53N06k26j75
$$ -241 -215 556 461 -186 -345 9 -289 -169 606 341 -446 109 -95 -383 112 619 81 -372 134 -92 -267
7278b67M19M38m32k48L85m88J35P1M70n21j63M89m02k36L10M33l60l0K15k26r0
$$ -267 152 590 158 -90 295 -193 -58 13 483 -38 -201 288 -114 -350 -40 393 33 3 218 -8 -98
7299i8K27j01m64M50L32n30j19L00R5o28O00K43l49J95j7m66o9N10J57m35J07
$$ -98 129 28 -436 14 346 -184 -303 -3 92 -536 64 307 -42 153 136 -330 -399 111 268 -167 -60
7320f0R8k98r0N31J60k91j20M41n04j09M47p0j12J94p8n49J99N96k84j55K01o8
$$ -60 38 -260 -350 181 341 50 -70 371 -133 -242 205 135 23 217 139 -410 -211 385 101 -54 147 79
7342G9k39K02K40q8l72K40l7k30L35K83o21KM31l00Q9j78M80k10m57J54J28O6
$$ 79 -160 42 282 194 -178 62 25 -205 130 413 -208 -206 225 -75 14 -164 316 106 -351 -197 -69 -3
7364cK51k23k52K52N5j29nL0J53j21k9J08p1j3K92l84p1K75K16l48K1K45l91N2
$$ -3 248 25 -227 25 80 -49 -54 -24 129 8 -21 87 16 3 295 -89 -160 115 331 -17 4 249 -142 -90
7388i0M0O3j05J60J8j42k4K43j39J26j99J89k37j13K67m6j06oK38l08K93q9l2
$$ -90 -50 13 -92 68 86 -56 -80 163 24 150 -49 140 -97 -210 57 11 -95 -101 137 -171 122 33 1
7411Aj1P7j9q9j7J59k34k19M31m6k51K82K49l30M2J15k73R1Q1L1o2j46K87j39
$$ 1 -10 67 48 -41 -58 101 -133 -352 79 33 -218 64 313 -17 25 140 -133 -42 39 70 8 -138 149 10
7435A0o3J90r9j74K16k6k28K08Q4k01K5J47J15l39N2J97o3n4nl8L8J1o8P9J5J46
$$ 10 -53 137 38 -136 80 54 -174 34 118 -83 -58 89 204 -135 -83 114 51 -3 -8 -46 -8 3 -65 14 29 175
7461A75q1k11J28R5k46q1L47j28j36J65j90L21r1K0j51L9K72o4m86K48M5j07j5
$$ 175 94 -117 11 106 -140 -221 126 -2 -138 27 -163 158 67 87 -64 -25 247 183 -303 -55 -10 -117 -132
7484a32J92k8K3j31m5M7R8N1k4r8L7J03j80J56j57R9J44P2l66r1J75K20k97Q3
$$ -132 60 32 55 -76 -121 -74 24 75 51 -47 -10 93 -87 69 -88 11 155 227 -139 -230 -55 165 -132 -49
7508d9K25m87J9L03J52j41J35k3j68l24L49M2mK87l39J6m1K88k49k48N50k68j11
$$ -49 176 -311 -292 11 163 22 157 134 -34 -358 -9 33 29 316 -23 -7 -48 240 -9 -257 293 25 -86
7531h6Q7K52n39L36J39j32k21K22J63m78m5L81k01L01J62n0n18J83M5j34J54L91
$$ -86 1 253 -286 50 189 57 -164 58 221 -257 -302 79 -122 179 341 291 -227 -44 1 -133 21 412
7553D12l77m22L12L5k57N51L51q56p4M11k92n2O60J78p05l04N51k71j49N14L18
$$ 412 35 -387 -75 -40 -297 254 605 -251 -325 86 -206 -258 402 580 -125 -429 122 -149 -298 216 534
7574E34n91J5J41j16l53N61m4l49L57J52n04o0N53l01k88O77Q1q32J41L24k52
$$ 534 -57 -42 99 -17 -370 191 147 -202 155 307 -197 -257 296 -5 -293 384 465 -367 -226 98 -154
7595a54k16Q73r6n64P6K32m99o7Q53R7p03J48J64o71K31P98l05m29N39m4q20J95
$$ -154 -370 503 407 -157 -81 151 -348 -415 438 535 -168 -20 144 -527 -296 502 197 -232 307 263 -557 -362
7617c62R40m48k57M76j45q87L96N25m16J39M35k87p46O87K78n06J7O62m70o88
$$ -362 578 130 -127 349 204 -683 -287 238 -178 -39 396 109 -637 50 328 -178 -161 501 31 -657
7637f57R39p5p95N20N40n32m28P12l11m77O81N52r40J60M38l27o42O51M41o47
$$ -657 282 207 -588 -68 472 -60 -488 224 -87 -564 117 669 -271 -111 327 0 -642 9 450 -197
7657a97j7Q15q53l60Q21J01m66J91O34q07p04J328l69l68M59K74p44l73J045j63
$$ -197 -214 601 -252 -612 209 310 -156 35 669 -138 -842 486 117 -251 208 482 -262 -635 410 247
7677B47m46N84J07r88q5R16o13j07R25%r88K50O88r33K61N33l2p12L61L58p74
$$ 247 -199 385 492 -496 -581 335 -278 -385 540 540 -448 -198 490 -443 -182 351 319 -393 -32 326 -448
7698d48n4Q76k81l34N53kq47K76O25l41l07P08l38o59J78O36k79q5O57k82n67
$$ -448 -502 374 93 -241 312 310 -537 -261 364 23 -284 424 86 -573 -395 241 -38 -123 534 252 -315
7719c15J17L01n14L81Q67q39m17L79P8n33O75M08n37n45M22q6l34O72N46r41m9
$$ -315 -198 103 -411 -30 837 -2 -419 -40 38 -495 180 588 51 -494 -72 -158 -492 180 726 -215 -264
7740b64M93m56k03L95N90p14K56J15l21j65L42J80k79K35J52l90l45M34J00l86
$$ -264 229 -227 -430 -35 555 -159 97 212 -109 -274 68 248 -31 204 356 -34 -379 55 155 -231
7760b31N14L1m32r3L41m9l31N82n3o55K03M99m47q5L68m1k90K83M3k38l8L23p
$$ -231 283 314 -118 -211 130 81 -250 332 279 -376 -173 326 -121 -206 162 121 -169 114 157 -81 -119 204 197
7783A97j44J06k20q9J0L34r7k3K45l61j70q8K58K3J59N3k45k80L16K50m12L87
$$ 197 53 159 -61 -150 -140 194 97 74 319 -42 -212 -300 -42 -19 140 193 -52 -332 -16 234 -178 209
7805B09l8j02l36K80P6m65N87k9l25M3K89Q7k01l3K13m66R7K14qj44K87m9k45
$$ 209 171 69 -267 13 89 -376 211 182 -143 -100 189 276 75 42 255 -211 -114 100 92 -52 235 186 -59
7828e9J73PLl96L91j36q6j28L82k28k11M38j92n2K54L4l94J4J83q3k59N87Q3n15
$$ -59 114 121 124 -272 119 -17 -103 -231 151 -77 -288 150 -42 -94 160 194 -200 -186 -3 -86 -345 242 325 -190
7852a90l2K82k27K07K04k16j39M6J48j48j28M17L3m33K26L0n8J17J19k36j92K08
$$ -190 -222 60 -167 40 244 28 -111 -65 83 -65 -193 224 257 -176 50 80 22 139 258 22 -170 38
7874C8k34Q7K15K43l69k04M50k74j02J77k5k4K7j7j62m4M49j55k08J76J02l14
$$ 38 -196 -109 106 349 -20 -224 226 -48 -150 27 2 -22 5 -12 -174 -218 231 76 -132 44 146 -168
7896a68M3M8k6L7N7q2K2l1J18p8k74L88j0j35O3J45j70r3O1K47L3j74L3k7k38
$$ -168 -125 -77 -103 -66 -9 -91 -69 -100 18 -60 -334 54 44 -91 -28 117 -53 -146 -85 162 195 21 54 27 -211
7921b11L14Q9l09K98M3k10r7K77j09m9m0L6j62J55m4q0n2J71k7p3l5K57j97O4
$$ -211 103 192 -117 181 224 14 -83 194 85 36 -4 32 -130 25 -19 -99 -151 20 -7 -80 -115 142 -55 9
7945IM4m3p2J14L23m37J71n0q0j58L18J46l09n4M90m93J79J34k03l4N7o5j04R9
$$ 9 53 10 -62 52 375 -62 109 59 -21 -179 139 285 -24 -78 412 -81 98 232 29 -5 52 -13 -117 -18
7969a8K86l48o4K97K7l05J07J13j38k53L15J73j06l8j17J23l6K7rqL3K17l08m6
$$ -18 268 -80 -144 153 180 -125 -18 95 -43 -296 19 192 86 48 -69 54 18 45 36 28 61 278 -30 -76
7993g6K15j5j78J54R5m08J8N04m31J6K78k39k48K96J24r9K17rl70p8K68P2k47
$$ -76 139 124 -54 100 195 -213 -195 309 -122 -106 172 -67 -315 -19 105 6 223 214 -156 -234 34 106 -141
8016a41n0J97o2j60J49K58l30J06K66k51q8J08P8j90K71Rk84j7K0o6J43O5R8r2
$$ -141 -191 6 -56 -216 -67 191 -139 -33 233 -18 -106 2 80 -110 161 170 -114 -131 -111 -177 -34 31 129 37
8040C7m7J46k24k08M97Q1k90K16j92l09P8L33o2l13N17p5k11j45L13k08j39M67
$$ 37 -10 136 -88 -296 201 282 -8 208 16 -293 -215 118 56 -257 260 185 -26 -171 142 -66 -205 262
8062B62j97l49J17K21l35j6N16rl38K98q3k96N3M30r7k47K94p8m28L07J31n3j2
$$ 262 65 -284 -167 54 -281 -297 219 210 -128 170 87 -209 -156 274 177 -70 224 146 -282 25 156 103 91
8085I1K17m4o76J72N8P1K42K29l93m79M13J70l11L34M14n26K8J87j73l47M51O9
$$ 91 308 264 -412 -240 -182 -111 131 360 -33 -512 -99 71 -240 94 508 -18 10 197 24 -323 128 197
8107A97j02j12P7j37k03M56o2l62K92K37m26j09L39J57k12K28J18m47l04M49j30
$$ 197 95 -17 60 -77 -280 176 114 -248 44 281 -145 -254 85 242 30 258 376 -71 -375 74 -56
8128e6j17M38J01m67jJ7J3k5M18nn42J38J55k80J86M01p6p20M01N3k74K42K18
$$ -56 -173 265 366 -101 -102 -85 -72 -97 321 316 -226 -88 67 -213 -27 374 298 -422 -21 32 -242 0 218
8151B18k85q5N18l80l11M85J78m07N4r6j80l2M78J49m35J36L60m13l15N43Pl58
$$ 218 -67 -152 366 -14 -325 160 338 -69 -15 -111 -291 -323 155 304 -131 5 365 -48 -363 180 187 -171
8173a71L82O5m61j42N68k90j97L68J12l58r8N58n24k68Q32K43q87L47
$$ -171 211 276 -185 -327 241 -49 -246 122 234 -124 -222 336 -188 -456 376 619 -268 79
8191G9
$$ Imaginary data points
##PAGE= N=2
##DATA TABLE= (X++(I..I)), XYDATA
0@%%%%%%Qj6J6j6J6k4M0m8N6p3R7j21J45j76K14k57L08l62M19m94N81o75P78q92
$$ 0 0 0 0 0 0 0 8 -8 8 -8 8 -16 24 -24 32 -41 56 -65 80 -96 118 -139 169 -193 226 -268 313 -362 416 -476
30d76J020j167J331j508J705j922K162k426K713l029L378l761M174m624N118n659
$$ -476 544 -623 708 -800 905 -1017 1145 -1281 1432 -1597 1781 -1980 2194 -2430 2688 -2971
46b971O250o892P595q370R222j0159J1196j2348J3631j5077J6715j8582K0743
$$ -2971 3279 -3613 3982 -4388 4834 -5325 5871 -6477 7154 -7923 8792 -9790 10953
59A0953k3272K6279k9928L4462m0276M8042n9002P5760j04846J69436n66412J75875
$$ 10953 -12319 13960 -15968 18494 -21782 26260 -32742 43018 -61828 107608 -458804 -282929
71b82929Q01166n66960K23259L59700n71059m91824O27709J55640l07131L24405
$$ -282929 518237 -48723 174536 534236 -36823 -528647 99062 254702 -52429 271976
81B71976J69307q71935k08383P01202l3129m06705N83030L64309o23991j93696
$$ 271976 441283 -430652 -639035 62167 29038 -377667 205363 569672 -54319 -248015
91b48015M53060k01288k84295M51521J05271n26772J36993L52168m78594k40537
$$ -248015 205045 3757 -280538 170983 276254 -250518 -113525 238643 -239951 -480488
101d80488O55917J70734m25841J69604K78391m59649k41234L85944K0302j82725
$$ -480488 175429 346163 -79678 89926 368317 -91332 -332566 53378 73680 -109045
111a09045L25078J2136n90761Q319M90422j18727j57510M57013O8961n71698q4487
$$ -109045 216033 228169 -362592 -354273 136149 17422 -140088 316925 385886 -185812 -270299
122b70299L29180p5065l0284L06406j34735l86678J57951J71343k45228J18970
$$ -270299 58881 -16184 -46468 259938 125203 -261475 -103524 67819 -177409 -58439
132e8439M17117j93052l99425J69775J70104k10715N9379K41189j84422j68251
$$ -58439 358678 165626 -233799 -64024 106080 -104635 -45256 195933 11511 -156740
142a56740J97207l7174j94818K41386K08087k91009j17582K75627k8085k50973
$$ -156740 40467 3293 -191525 49861 257948 -33061 -150643 124984 96899 -154074
152a54074J15906J50793j58080p912J43679j29953q6498J98813j9162k02200J63753
$$ -154074 -38168 112625 -45455 -53367 90312 -39641 -126139 72674 53512 -148688 15065
163A5065K23911k18424j92589J79040M9416j50741R3605J32569j28435n7968O7066
$$ 15065 238976 20552 -172037 7003 56419 -94322 -717 131852 3417 -54551 12515
174A2515r8902k6217K38759M9631k35511k5561J40374r4916r0845J78853Q3823
$$ 12515 -86387 -112604 126155 175786 -59725 -85286 55088 -39828 -130673 48180 132003
185A32003j26512k9331L472q3519O8903J61362o6210j21709R0500L5580j61704
$$ 132003 5491 -23840 -20368 -103887 -34984 126378 60168 -61541 28959 64539 -97165
196i7165m811J77410N205j06319P398O977k7480N2207J6148p0165L7962R4322
$$ -97165 -101976 75434 80639 -25680 -18282 -11305 -38785 13422 29570 -40595 -2633 91689
208I1689q1726j10470R5888Q5551j00945m2184R0105J4748m4715m174k1973p137
$$ 91689 9963 -100507 -4619 80932 -20013 -62197 27908 42656 -2059 -6233 -28206 -35343
220c5343O9276J5012p9627R134Q2913n3448j01693O2946R3031l2230l5309M962
$$ -35343 33933 48945 -30682 -21548 61365 7917 -93776 -30830 62201 29971 -5338 -376
232c76k2403N353L7105k3579k0771O9666J9874j10688l4974J07108K6816p5345
$$ -376 -22779 -17426 19679 -3900 -24671 44995 64869 -45819 -80793 26315 53131 -22214
244b2214j839M4161p044j6776j0188j1525L2646M0780m6185o0768N8195O3293
$$ -22214 -24053 20108 13064 -3712 -13900 -25425 7221 48001 1816 -58952 -757 62536
256F2536p1332n5284P3266M4623n0752l1486J9281J8232L866j0849j9305J2984
$$ 62536 -8796 -64080 9186 53809 3057 -28429 -9148 9084 12950 2101 -17204 -4220
268d220M0171k2084o6728K0937P4165j2993n5502N819L5564L32k5132r344K0252
$$ -4220 35951 13867 -52861 -31924 42241 29248 -26254 -20435 15129 15461 -9671 -19015 1237
281A237K4978o659m3075j1697N6810K4615n6929l1479M1666K9414k7575k7151
$$ 1237 26215 19556 -23519 -35216 21594 46209 -10720 -42199 -533 28881 1306 -25845
293b5845K7199L4189k6186m9505L741N4969K8417m3611m0679K9435L2435k1876
$$ -25845 1354 35543 9357 -40148 -36407 18562 46979 3368 -37311 -7876 24559 2683
305B683k4487K3009L5347j9887n2168K137N1529K2027l3743l9067J1452L3601
$$ 2683 -21804 1205 36552 16665 -35503 -33366 18163 40190 6447 -32620 -21168 12433
317A2433n631k0676J3393K6215q944m4401j4226M7305L8201k2349m2481l880L3424
$$ 12433 6802 -13874 -481 25734 16790 -27611 -41837 5468 43669 21320 -21161 -25041 8383
330H383R054k9186J84L6729M01n0215k5506M7283N1473k4169n1423k465L0974
$$ 8383 17437 -11749 -11565 25164 25565 -24650 -50156 -2873 48600 24431 -26992 -29457 1517
343A517J0311j9530k663L7000P023n4898l1698M6638N5711j8502n1006j267K4502
$$ 1517 11828 -7702 -10365 26635 33658 -21240 -52938 -6300 49411 30909 -20097 -21364 3138
356C138j835q938N608J6998Q266l2409l9073K5910O1259K951n3167j8029K9128
$$ 3138 1303 -7635 -2027 14971 23237 -9172 -48245 -22335 38924 41875 -11292 -29321 -193
369a93M804j4082J2446J6386J077j4377l7796p037O1120L3550n6916m5012M1623
$$ -193 4611 -9471 2975 19361 20438 6061 -31735 -38772 22348 55898 -1018 -46030 -4407
382d407K9431l9191o130M6087p43l8663j4838N182L4896M1391l2663o7841J9960
$$ -4407 25024 -14167 -20297 25790 25047 -13616 -28454 -23272 11624 53015 20352 -47489 -27529
395b7529O0955k7058l9495N8862L0060p9068l5950N0482K4715O009J2271m0916
$$ -27529 33426 6368 -33127 25735 55795 -23273 -59223 -8741 15974 21983 34254 -6662
407f662m3954M1441L4112m4752Q704P7144l5902j01345K8692P4580j3198j0110
$$ -6662 -50616 -9175 24937 -19815 -11111 66033 30131 -71214 -42522 32058 18860 8750
419H750J7261l8465k3338M6566j971m5471N2345N4837r2818n9342R8988L9542
$$ 8750 26011 -12454 -35792 10774 8803 -36668 15677 70514 -22304 -81646 17342 56884
431E6884p7406l532M7236k4446j4913L3309j6224k0319M8866q695q0968M2580
$$ 56884 -20522 -24054 23182 -1264 -16177 17132 908 -19411 29455 20760 -60208 -17628
443a7628R9303o2513q8376O0256M1824n3971R813N1638l1272l1083K4431k6270
$$ -17628 81675 19162 -69214 -8958 32866 -21105 -11292 40346 9074 -22009 2422 -23848
455b3848k0814R2360L2948j12637k6107Q0847j9446m5590O8020L6718o5791k3889
$$ -23848 -44662 47698 80646 -31991 -58098 22749 3303 -42287 25733 62451 -3340 -27229
467b7229J3181l0942L3298R3158m5372r8727N2384M3983q5639O932J15808j2227
$$ -27229 -14048 -44990 -11692 81466 36094 -62633 -10249 33734 -51905 -44973 70835 58608
479E8608q8104P862J2399l2066M9537N3032o8075j8239P6760n2268r8392Q9156
$$ 58608 -29496 -21634 -9235 -41301 8236 61268 -6807 -25046 51714 -554 -98946 -9790
491i790R2892q1342l6650P3658k7197p2071N0650L0902n2124N0532O6457j04776
$$ -9790 83102 1760 -34890 38768 11571 -60500 -9850 21052 -31072 19460 85917 -18859
503a8859o1859J05056J660r7612O9815J05737q0510p5406M6174k1350l9250J04025
$$ -18859 -80718 24338 25998 -71614 -1799 103938 23428 -51978 -5804 -27154 -66404 37621
515C7621M8441j01163M417O1897j12183o6657J63066Q1385j09761j9260M8926
$$ 37621 86062 -15101 -10684 51213 -60970 -127627 35439 116824 7063 -12197 36729
526C6729q4351m9104J08082L7472l6648N7270j4575j56373R80J41959j3698n7254
$$ 36729 -47622 -96726 11356 48828 12180 69450 54875 -101498 -100518 41441 27743 -29511
538b9511R7010K3109j48312l6973Q7329m820P337R7028l3411j16150L3994L6864
$$ -29511 67499 90608 -57704 -94677 -7348 -12168 -4831 92197 58786 -57364 -23370 13494
550A3494q9350K7962J51509j9805j21100J8580K3152p5222L0945J00651k9678
$$ 13494 -75856 -47894 103615 83810 -37290 -18710 4442 -70780 -39835 60816 31138
561C1138k5963N7051p2551j15928R3492J13294p3936k4314R7110m8659j28001
$$ 31138 5175 62226 -10325 -126253 -32761 80533 6597 -17717 79393 30734 -97267
572i7267M5840P3961l0556M2975N7102j08460o4999R3370r529q3674J05386J08431
$$ -97267 -51427 22534 -8022 34953 92055 -16405 -81404 11966 2437 -81237 24149 132580
584A32580j25851r0956Q5688n716o5097R5687O3972r8030q738N5580r5919m3866
$$ 132580 6729 -84227 1461 -4255 -69352 26335 90307 -7723 -16461 39119 -56800 -100666
596a00666J58493M3074j33972J0780Q2598r8787n9777J28172L2029p5855M3247
$$ -100666 57827 100901 -33071 -22291 60307 -38480 -98257 29915 61944 -13911 29336
607B9336J2564j26047J4922J38776m1245q3439J05695K9359j60549o001J40201
$$ 29336 41900 -84147 -69225 69551 28306 -55133 50562 79921 -80628 -86629 53572
618E3572k3539n9205P7828j0544j07625M4512O8136q0900M843J28812n3592j38579
$$ 53572 30033 -29172 48656 38112 -69513 -25001 43135 -37765 -32922 95890 42298 -96281
630i6281P4647Q3144j00288p740J18604l4793q4470N6806N725q6820N9677R9895
$$ -96281 -21634 61510 -38778 -46518 72086 37293 -47177 9629 15354 -71466 -11789 88106
642H8106q5340n5843J03668j8931j28760N8144J12759n5736l3684O0234m8639
$$ 88106 2766 -53077 50591 31660 -97100 -38956 73803 18067 -15617 44617 -4022
653d022p6618P2420M6189o2736M1602P9809j10299j00081J05216N9026p1525L0601
$$ -4022 -80640 -8220 37969 -24767 16835 96644 -13655 -113736 -8520 50506 -21019 9582
665I582O8729p9953o8178N6146R843k3415P8653K5653j18105k0456R1999l2859
$$ 9582 78311 -1642 -69820 -13674 -3831 -27246 51407 77060 -41045 -61501 30498 -2361
677b361n8169R1921M7283r5995k3632N5518k8670j9968P2542m246p3234M3435
$$ -2361 -60530 31391 78674 -17321 -40953 14565 -14105 -34073 38469 34223 -39011 4424
689D424M7715q8397k5512J00236j023p6881L6999N0571n7350k6330M1768j7205
$$ 4424 52139 -36258 -61770 38466 37443 -39438 -2439 48132 -9218 -35548 6220 -10985
701a0985j2938O9486m80q5636J6689N6850n5465k8541R1789K6976q2458k1698
$$ -10985 -23923 45563 45083 -40553 -23864 32986 -22479 -51020 40769 67745 -14713 -36411
713c6411L4767j5659J291N1292j0272m1466K1875j083n3743K7720P8650k3119
$$ -36411 -1644 -17303 -16012 35280 25008 -16458 5417 4334 -49409 -21689 56961 33842
725C3842o4687J7086K6410k9167K951L8678j0990k0483J2771j6925k1577M3485
$$ 33842 -30845 -13759 12651 -16516 -13565 25113 14123 -6360 6411 -10514 -32091 11394
737A1394K9616m8156k6297M0117J1519l2736N867K6209j2583j5887M411q41J3467
$$ 11394 41010 -7146 -33443 6674 18193 -14543 -8676 17533 4950 -10937 -6526 -7367 6100
750F100K2274k3687l7592K0257L5572j5355k1295K2234R531l1239j2282K1985
$$ 6100 28374 4687 -32905 -12648 22924 7569 -13726 8508 18039 -13200 -25482 -3497
762c497J8639M483j4405k5137J733K5261L302j4892O628J5384j7763k5983J3633
$$ -3497 15142 19625 5220 -19917 -18184 7077 10379 -4513 2115 17499 -264 -26247 -12614
775a2614K8965N232j4944j9463m713J6755R443q236j038J1972m379k6762l803
$$ -12614 16351 21583 6639 -12824 -17537 -782 8661 425 -613 11359 6980 -19782 -23585
788b3585L2175J7973j8457k2167r26J6258P509r346o96J2877k951k3051q338K6615
$$ -23585 8590 26563 8106 -14061 -14987 1271 8780 -566 -1262 11615 8664 -14387 -22725 3890
802C890K3807j7007k6841J339J5976M201p306R30J2085k979k1052o682J9264K1594
$$ 3890 27697 10690 -16151 -14812 1164 5365 -1941 -1011 11074 8095 -12957 -19639 -375 21219
816B1219n992k4025n724J3872O864n253k031P639K749j6259j2719J4737K2169
$$ 21219 15227 -8798 -14522 -650 6214 961 -1070 6569 9318 -6941 -19660 -4923 17246
829A7246m71k2737j2838J4917J2978p686n954R114P078j3338j7332J0771K5992
$$ 17246 16775 -5962 -18800 -3883 9095 1409 -4545 4569 11647 -1691 -19023 -8252 17740
842A7740R88k4034j2677J4507J5362j0192j0659J2924Q508j5567j4941R690K2016
$$ 17740 18728 -5306 -17983 -3476 11886 1694 -8965 3959 12467 -3100 -18041 -8351 13665
855A3665J630j8727r774Q145J2434l217j0217O527J2639j0746j7426N612J8973
$$ 13665 15295 -3432 -13206 -5061 7373 4156 -6061 466 13105 2359 -15067 -9455 9518
868I518M474j3602j0919M478R905J668r250l536J4677K990k0841m315K1522R078
$$ 9518 13992 390 -10529 -6051 3854 5522 -3728 -7264 7413 10403 -10438 -14753 6769 15847
882A5847j5890j2801Q729J3545k032j1709m321J1546R213j6276j2612K2221J3344
$$ 15847 -43 -12844 -4115 9430 7398 -4311 -8632 2914 12127 -4149 -16761 5460 18804
895A8804k1776j5010J4410J4079n756q340n87M148N950m838j4723J1339K4156
$$ 18804 -2972 -17982 -3572 10507 4751 -3589 -4176 -28 5922 1084 -13639 -2300 21856
908B1856j5233k6479J3648J9160j1396q625R966P48n441M749p262j1278K3184
$$ 21856 6623 -19856 -6208 12952 1556 -7069 2897 3645 -1796 2953 -4309 -15587 7597
921G597J4723l3912r091L6973p79l5194Q723K7481j0702j1460J1526q701j0367
$$ 7597 22320 -11592 -20683 16290 15511 -19683 -10960 16521 5819 -5641 5885 -2816 -13183
934a3183K4118j665l1733K3874L3811m2181l2907M5382K1345l8255K337L1203
$$ -13183 10935 9270 -22463 1411 35222 -6959 -39866 5516 26861 -11394 -9057 22146
946B2146k3485k1907K7728q14j7888L5805R377n9955k990N7033j3544l9974L9590
$$ 22146 -1339 -23246 4482 3668 -14220 21585 30962 -28993 -31983 25050 11506 -28468 11122
959A1122K7904n4535j5714M0797j1273j3219M3859q201n5030K5848L9512n0000
$$ 11122 39026 -15509 -31223 9574 -1699 -14918 28941 20740 -34290 -8442 31070 -18930
971a8930j7469P1024K709o8236J6360M2294l9612j4007M6968j1970k8058M1888
$$ -18930 -36399 34625 37334 -30902 -14542 27752 -11860 -25867 21101 9131 -18927 22961
983B2961J105o7140J5850O4086l3918l6295O3974J2495p9282j190N2230j9380
$$ 22961 24066 -43074 -27224 36862 2944 -33351 30623 43118 -36164 -37354 14876 -4504
995d504l227N3179k2015o2826K5580K6328m6562J9855Q1594l2119q0799K5709
$$ -4504 -7731 45448 23433 -39393 -13813 12515 -34047 -14192 67402 35283 -45516 -19807
1007a9807K6451l9689K6274O1325l5423m1530K9628j7086m6984O0643O3826o2815
$$ -19807 6644 -33045 -6771 54554 19131 -22399 7229 -9857 -56841 3802 67628 4813
1019D813l6716N5862j6807o1221M5296N0421m0930o147L5478m0764l4450N8404
$$ 4813 -31903 23959 7152 -54069 -8773 41648 718 -5429 30049 -10715 -45165 13239
1031A3239R403n9011L6367O2307o3460n0412N8856O754n0461L9684M8704m8518
$$ 13239 22642 -36369 -2 62305 -1155 -51567 7289 14043 -36418 3266 51970 3452
1043C452k3733L3421l3913l2597P7661L8033p1807r421M3772m7581l7289P4607
$$ 3452 -20281 13140 -20773 -53370 24291 62324 -9483 -18904 24868 -22713 -60002 14605
1055A4605L7485m7465k591J1300n5111l185P8589L31m9871L3297J4334p7411n737
$$ 14605 52090 4625 2034 13334 -41777 -44962 33627 33958 -15913 17384 31718 -45693 -51430
1068e1430Q1692L524m3764K0496M437m9275J2263M5897k4435j1763M7352k1271
$$ -51430 30262 33786 -9978 10518 14955 -34320 -22057 23840 -595 -12358 34994 13723
1080A3723o2087L5982M9098m1920j7762M7466p223m1787K1788J6465l3185J3609
$$ 13723 -48364 -12382 36716 -5204 -22966 24500 17277 -24510 -2722 13743 -19442 -5833
1092e833L6846l3616k1200M5192p309n3754K3612M8772k2534j9390K3248j6347
$$ -5833 31013 -2603 -23803 21389 14080 -39674 -16062 32710 10176 -9214 14034 -2313
1104b313l1049K9713K1702k1649J8373K1290n5900l3315N3877K6192k7314J2314
$$ -2313 -33362 -3649 18053 -3596 14777 36067 -19833 -53148 729 26921 -393 11921
1116A1921J7951m3782k7199L1657J2245K018L3691j2142o2206L217M1902j3907
$$ 11921 29872 -13910 -41109 -9452 2793 4811 38502 26360 -35846 -32629 9273 -4634
1128d634o578M7126k48n8754o120K7863q571Q757L6770k1686l7239K3900O871
$$ -4634 -11212 35914 35666 -23088 -29208 -1345 -9916 -1159 35611 13925 -23314 586 7457
1141G457l8840J7158N0815k0556l5989K4077P739l4325R252K7892j7388J720L3079
$$ 7457 -31383 -14225 36590 16034 -19955 4122 11861 -22464 -13212 14680 -2708 -988 32091
1154C2091k6299m2464K9402K4041l2386O255M8816j7039n0311Q481J6254j2092
$$ 32091 5792 -36672 -7270 16771 -15615 -9360 39456 22417 -27894 -19413 -3159 -15251
1166a5251K3415K8127l0211k2284J8298j4742k2340M4283L9134l8940l0219K0152
$$ -15251 8164 36291 6080 -16204 2094 -12648 -34988 9295 48429 9489 -20730 -578
1178e78o488j8860L1942K2429k4029m743O827k8496m950M4533P442l5519N295
$$ -578 -7066 -25926 6016 28445 4416 -327 6500 -21996 -26946 17587 25029 -10490 -5195
1191e195K1762k4607j3992K8606M298j5733J2521J014k4118J0362K3005k3266
$$ -5195 16567 -8040 -22032 6574 10872 -4861 7660 8674 -15444 -5082 17923 -5343
1203e343j6637L4188J0780l4642q21K4322j3935j2912J9588L838r912R604l329
$$ -5343 -21980 12208 22988 -11654 -12475 11847 -2088 -15000 4588 8426 -1486 8118 4789
1216D789k5752R546L1188j1368k1437K0555P494l0698j897K7331l10r117O254
$$ 4789 -20963 -11417 19771 8403 -13034 7521 15015 -15683 -17580 9751 9441 324 6578
1229F578q536j4527J5470J3726j7328k052K2229j0433k6220J4301K1472j0938
$$ 6578 -1958 -16485 -1015 12711 -4617 -6669 15560 5127 -21093 -6792 14680 3742
1241C742p098O913n767l941J0766j791j1602J2151J1850k2083j0804K4506N908
$$ 3742 -3356 3557 -2210 -6151 4615 2824 -8778 3373 15223 -6860 -17664 6842 12750
1254A2750k0066L10J3159l517o000K666o10k08Q111l694j3380Q702J5448j2750
$$ 12750 -7316 -7006 6153 2636 -3364 -698 -1308 -1516 6595 2901 -10479 -1777 13671 921
1268I21j3325J2945Q897j0242m642O054J643k234o1l333n52J0249K38j4316O84
$$ 921 -12404 541 9438 -804 -5446 608 2251 17 -44 -3377 -3929 6320 6558 -7758 -7074
1283g074J3994j187j1078J476Q685k46o654k192L164M719J460p865m187J0279
$$ -7074 6920 5733 -5345 -3869 4816 4570 -2084 -4276 -1112 3607 5067 -2798 -6985 3294
1297C294M045j1556m177J0844N630q247p145O085O280l161m993L70N693K996p468
$$ 3294 7339 -4217 -8394 2450 8080 -167 -7312 -1227 5053 1892 -3101 -2731 2962 5958 -1510
1312a510n684O877P000m307p420J932P468j711p425J118O313K221n055n817L099
$$ -1510 -7194 -317 6683 2376 -5044 -3112 4356 2645 -4780 -3662 2651 4872 -183 -6000 -2901
1327b901P526o53n967j491N430K820p119l954R104N379p630q058K994R136K51
$$ -2901 4625 3972 -1995 -3486 1944 4764 -2355 -6309 2795 8174 544 -7514 -4520 4616 4867
1342D867p546j145N294J491n190l883P212P900o688j0134K945R207J239p161j660
$$ 4867 -2679 -3824 1470 2961 -2229 -6112 1100 9000 2312 -7822 -4877 4330 5569 -1592 -3252
1357c252O152P9o614j463O222N748l856q698m6O834L115k907m042K140L694m278
$$ -3252 2900 2979 -3635 -5098 1124 6872 3016 -5682 -5728 1106 4221 1314 -2728 -588 3106 -1172
1373a172m508N324Q220k385j0661j842Q414L623l333k345q53J834N6n194J663
$$ -1172 -5680 -356 7864 5479 -5182 -7024 1390 5013 1680 -665 -1518 316 372 -4822 -3159
1388c159R898J555j3257o592J1895P890p673l149N694j729n298M97K815M820M006
$$ -3159 6739 8294 -4963 -11555 340 8230 557 -2592 3102 1373 -3925 -3428 -613 4207 8213
1403H213p455j1307M505J3190k595r601O441M561j0840l703Q937M473m66j169
$$ 8213 758 -10549 -6044 7146 4551 -5050 1391 5952 -4888 -8591 346 4819 4353 3184
1417C184p266m412J0062O922j0235l138J2156k785j4299N325J1824l612n651J14
$$ 3184 -4082 -8494 1568 8490 -1745 -4883 7273 4488 -9811 -4486 7338 3726 -1925 -1811
1431a811j633K750P208n406j0116Q307R247j2348m229J6801M35j6605o09Q737
$$ -1811 -3444 -694 6514 1108 -9008 -701 8546 -3802 -8031 8770 9205 -7400 -8009 728
1445G28R65K741L272r417o166Q658j192r016J3840J4505j8127j6060J0191N193
$$ 728 1693 4434 7706 -1711 -7877 781 -411 -9427 4413 18918 791 -15269 -5078 115
1459A15l058R302M914j2399l900N135r657q27K5394L662k6142j865J4687r830
$$ 115 -2943 6359 11273 -1126 -5026 109 -9548 -10375 15019 18681 -7461 -9326 5361 -4469
1473d469p231J7480N401j1653K057O4j6093O604K1666j1499j3878K2076N315l0122
$$ -4469 -11700 5780 11181 -472 1585 1649 -14444 -7840 13826 2327 -11551 10525 15840 -14282
1487a4282q64K3821n522j0002J6853J294k0228M509Q082j7959N612L2050r856
$$ -14282 -15146 8675 3153 -6849 10004 11298 -8930 -4421 3661 -14298 -8686 23364 13508
1500A3508k8734J3056R328k4120L401L2417l787j9538Q488n295k3622J9100K8960
$$ 13508 -15226 -2170 7158 -16962 -13561 18856 15069 -4469 4019 -1276 -24898 -5798 23162
1513B3162j8743j1504K2664j1965l3387J8506L0984j3893q515J6169j5313k1344
$$ 23162 4419 -7085 15579 3614 -29773 -11267 19717 5824 -2691 13478 -1835 -23179
1525b3179K2186J1527k0117J3921K2420l1760k3323L2597R325k6958J2720K4491
$$ -23179 -993 10534 -9583 4338 26758 -5002 -28325 4272 13597 -13361 -641 23850
1537B3850k4844j6416K2839n738j6947K7892J1467l4603R17K8956k1336k2442
$$ 23850 -994 -17410 5429 -309 -17256 10636 22103 -12500 -11583 17373 -3963 -26405
1549b6405L5148J5245l2503K302K0794k4731j0114L4867j918k6666K1955J2987
$$ -26405 8743 23988 -8515 -6213 14581 -10150 -20264 14603 12685 -13981 7974 20961
1561B0961m1841m928M4501m803k9082K3028J1294l8288j07L2815j2606r990L2095
$$ 20961 -20880 -25808 18693 13890 -15192 7836 19130 -19158 -19265 13550 944 -9046 23049
1574B3049q895m3830J7018L3421k7022r213M2974p684m6513J3645K4830k3251
$$ 23049 14154 -29676 -12658 20763 -6259 -15472 27502 19818 -26695 -13050 11780 -11471
1586a1471N245L5799k0898l2256K5227O675l4933J9000M5067k6968l3466K7628
$$ -11471 -6226 29573 8675 -23581 1646 8321 -26612 -7612 37455 10487 -22979 4649
1598D649K030l3801K1162L4454k4130j2586K4646j9720l2460L5267K9321l3601
$$ 4649 6679 -27122 -5960 28494 4364 -8222 16424 -3296 -35756 -489 28832 -4769
1610d769l965L3661k3414l6469K9409K2895k2129P931K1259k9508k0292K9589
$$ -4769 -8734 24927 1513 -34956 -5547 17348 -4781 3150 24409 -5099 -25391 4198
1622D198J265k4419K7161K6909l8709k2027K9885k036k2671K5674K1727k6717
$$ 4198 5463 -18956 8205 35114 -3595 -25622 4263 2227 -20444 5230 26957 240
1634B40r479J5147j8124j2221L6504J2869l0678L039J8073k7480j5707L3707J2695
$$ 240 -9239 5908 -12216 -24437 12067 24936 -5742 -2703 15370 -12110 -27817 5890 18585
1647A8585j8467O363N109k8043l295K8420l167j2925K3202K665l7310j885K8549
$$ 18585 118 6481 11590 -16453 -19748 8672 5505 -7420 15782 18447 -18863 -20748 7801
1660G801l838j0294J7970J380k3403K206J1917j2127L798K4143j0865k3983J4341
$$ 7801 3963 -6331 11639 13019 -10384 -8178 3739 -8388 -4590 19553 8688 -15295 -954
1673i54J0640k0637j00K3852l884j5804Q144K136j4512P108J3887j1764l071J7489
$$ -954 9686 -10951 -11051 12801 8917 -6887 1257 3393 -11119 -4011 9876 -1888 -4959 12530
1687A2530p013k1110R538J5755r618l699J2700m797j3596O273M123p590J0246
$$ 12530 5517 -15593 -6055 9700 82 -3617 9083 4286 -9310 -3037 1086 -6504 3742
1700C742J1085j6524j1592J3942L323j1157P208J2639j0065j0476M874R41m63
$$ 3742 14827 -1697 -13289 653 3976 -7181 27 12666 2601 -7875 -3001 -2060 -2523
1713b523J0583k73j3512J834Q332q038m282J4319L955j3965l394P094q31l74N909
$$ -2523 8060 7787 -5725 -3891 4441 -3597 -7879 6440 10395 -3570 -6964 130 -701 -1075 4834
1728D834l327n092N431j94p773M942R919o278r211N296N598m540p63K350l256
$$ 4834 1507 -3585 1846 1652 -6121 -1179 8740 2462 -6749 -1453 4145 -395 -1158 1192 -2064
1743b064R34M688m527k774P386j41j0113Q93J1344M15p786l35J707k030K122K465
$$ -2064 -1130 3558 -969 -3743 3643 3502 -6611 -5718 5626 6041 -1745 -2080 -373 -2403 -281 2184
1759B184j578J987J152q348m232R748P002o368m485L358j069l934L479M071K94
$$ 2184 606 2593 3745 -4603 -8835 913 7915 1547 -2938 420 -649 -4583 -1104 2967 3261
1774C261l00l815o001L900Q392p07o593O34L173l384k421M587L207j718l269l618
$$ 3261 2961 -854 -6855 -2955 5437 4730 -1863 -1229 1944 -1440 -3861 726 3933 2215 -1054 -4672
1790d672J512O260J242n586k119M567L18m466J533O004o81o041k414K854M867
$$ -4672 -3160 3100 4342 -1244 -3363 1204 1522 -2944 -1411 4593 3912 -2129 -4543 -1689 3178
1805C178O36m275j894K177O77k544Q8M967J417o204l456L221M267J258k858k305
$$ 3178 3814 -461 -2355 -178 499 -2045 -1957 3010 4427 -1777 -5233 -2012 2255 3513 655 -1650
1821a650J001J041j592NL242K332m152n021J990N032J181k654k728N46K109j335
$$ -1650 -649 392 -1200 -1195 2047 4379 227 -4794 -2804 2228 3409 755 -1973 -1427 682 -653
1837f53j503K931L435k497n891j18O513J943l924j928J621J257j800j740L000
$$ -653 -2156 775 4210 1713 -4178 -4296 2217 4160 236 -1692 -71 1186 -614 -2354 646
1852F46L360k074n238j069N013L435l914k396K460R80k498p45K685K847j710l733
$$ 646 4006 1932 -3306 -4375 638 4073 159 -2237 223 1203 -1295 -2040 645 3492 1782 -1951
1868a951j267K692M005j142m218K82L327j894k561K295L374j222l649r81K378
$$ -1951 -3218 -526 3479 2337 -1881 -1599 1728 -166 -2727 -432 2942 1720 -1929 -2910 -532
1883e32K431Q69l913j641M328Q71n160O80N763o45n979j94M157J059r45q06k576
$$ -532 1899 2768 -1145 -2786 1542 2413 -2747 -2067 3696 3051 -2928 -3122 1035 2094 1149 343 -2233
1900b233R27L450k892k735N842K828p562l340O416K751l515K11J685l269K67K888
$$ -2233 -1306 2144 -748 -3483 2359 5187 -2375 -5715 701 3452 -63 148 1833 -1436 -1169 1719
1916A719l249j82O796j957r055K454Q127l529n280M956K711n045N47J965m282
$$ 1719 -1530 -1712 5084 3127 -5928 -3474 4653 1124 -4156 800 3511 -1534 -987 978 -3304
1931c304K626N950n310m871Q512K238j1544p51J1461p80p672M302K519p165Q14
$$ -3304 -678 5272 -38 -4909 3603 5841 -5703 -6454 5007 4227 -3445 857 3376 -3789 -2975
1946b975M851m166J532Q661n684j1483O435Q565p548k099J0897j694j0900K819
$$ -2975 1876 -2290 -758 7903 2219 -9264 -2829 5736 -1812 -3911 6986 5292 -5608 -2789
1960b789L591m085M559O280p912n660Q752k66j0894N364J2021o247p547O155l55
$$ -2789 802 -3283 1276 7556 -356 -6016 2736 2470 -8424 -3060 8961 2714 -4833 1322 967
1975I67o260M453M028m363L093N596r716q267J1017N625r371K384R604p865r031
$$ 967 -5293 -840 3188 -1175 1918 7514 -2202 -10469 548 6173 -3198 -814 8790 925 -8106
1990h106M970K698r52P087J501j1272j300P785n062m306J3464M415j3873k882
$$ -8106 -3136 -438 -1390 5697 7198 -4074 -5374 2411 -2651 -6957 6507 10922 -2951 -5833
2004e833O352l606J40Q942j496p731L979J161j0322L366J4733m992j0697O861
$$ -5833 519 -3087 -2947 5995 4499 -3232 747 1908 -8414 -5048 9685 4693 -6004 857
2018H57K916r343K070Q338m330j725P658n770j0086R446P323j1666nJ4073n510
$$ 857 3773 -5570 -3500 4838 508 -1217 6441 671 -9415 31 7354 -4312 -4317 9756 4246
2033D246j3418O010O101o414M026Q342q846o375Q399l388r345J3869J2057j4678
$$ 4246 -9172 -3162 2939 -3475 551 8893 47 -6328 2071 -1317 -10662 3207 15264 586
2047E86q486R267l523p375J2781Q727j0508l099L380j1558k478K0674M183j5171
$$ 586 -7900 1367 -2156 -9531 3250 11977 1469 -1630 1750 -9808 -12286 8388 12571 -2600
2061b600K343N627j4670l724J8161M300q185L786j574j5539L620J5563n208n249
$$ -2600 -257 5370 -9300 -13024 5137 9437 1252 5038 3464 -12075 -8455 7108 1900 -3349
2075c349J4477k767k1033K723J4639n302k341J2864l137j3960M839L245j1466
$$ -3349 11128 8361 -12672 -9949 4690 -612 -2953 9911 6774 -7186 -2347 898 -10568
2088a0568P116J8704q687j3690R719J69j7011O404J9521m183p120O632r084j5960
$$ -10568 -3452 15252 6565 -7125 2594 2763 -14248 -7844 11677 7494 374 7006 -2078 -18038
2102a8038J3173J4813r527J738J3007j5775k0172J3744J4803o858L578J0051j5855
$$ -18038 -4865 9948 421 2159 15166 -609 -20781 -7037 7766 908 4486 14537 -1318
2115a318j3993J2673L416p506J5259J0137k3156j0571J6848n13j1541J4557J1593
$$ -1318 -15311 -2638 778 -6728 8531 18668 -4488 -15059 1789 1276 -10265 4292 15885
2128A5885j7292o797J1218p093o366J7896L449j7180N025J1979j6184r405J9535
$$ 15885 -1407 -8204 3014 -4079 -10445 7451 10900 -6280 -1255 10724 -5460 -14865 4670
2141D670M988j4684O114R454j5870o011J4773k479p475J5427L916k1857k222J6685
$$ 4670 9658 -5026 1088 10542 -5328 -11339 3434 955 -6520 8907 12823 -9034 -11256 5429
2155E429n561q152J6672M938j9249j680R853p433R35J6697m872j6588O699P114
$$ 5429 -132 -8284 8388 13326 -5923 -7603 2250 -5183 -4248 12449 7577 -9011 -2312 4802
2169D802j3592J626K0271m515j7022N938N751j0418M554J2854q179p578R424k621
$$ 4802 -8790 -7164 13107 8592 -8430 -2492 3259 -7159 -2605 10249 2070 -5508 3916 1295
2183A295j2108R979J3033j2332p765J2412j284j1631P528P343q873J96Q611p502
$$ 1295 -10813 -834 12199 -133 -7898 4514 3230 -8401 -873 6470 -2403 -2207 6404 -1098
2197a098p162J1724K629j2782L915J2774q583r273Q906K022p883N196O255p762
$$ -1098 -8260 3464 6093 -6689 -2774 10000 1417 -7856 1050 3072 -4811 385 6640 -1122
2211a122k173O790n561o677J2043O697j2240k644Q417m693o366R193M951o373
$$ -1122 -3295 3495 -2066 -8743 3300 9997 -2243 -4887 3530 -1163 -7529 1664 6615 242
2225B42j45J612p075l33J1063l62q644M372L923r454k003R887J153m839J593K27
$$ 242 97 1709 -5366 -5699 5364 5002 -3642 730 4653 -4801 -6804 3083 4236 -603 990 1217
2241A217n316J779N853l850k234O904q47q920K511P225l501l752L677J460l305
$$ 1217 -4099 -2320 3533 -317 -2551 4353 3506 -5414 -2903 4322 821 -2931 746 2206 -1099
2256a099P94Q83l013J665M368l714l056N254J209o294m56N456M41k727O73K18
$$ -1099 -305 578 -2435 -770 3598 -116 -3172 2082 3291 -3003 -3459 1997 2438 -289 384 602
2272F02j985Q48J105j980J843L387l835m298L035L427j896j374J983L03j840k23
$$ 602 -1383 -535 570 -1410 433 3820 -15 -4313 -1278 2149 253 -1121 862 1165 -675 -898
2288h98o4N18K677k57l933r4L560k12k581L69K796o30k704o8J656J266n29k386
$$ -898 -962 -444 2233 1976 -1957 -2051 1509 1297 -1284 -915 1881 1251 -1453 -1521 135 1401 872 -1514
2306a514j95K943N03k766m97K365J094k548j065K264J161j267j579J56J665O61
$$ -1514 -1709 1234 1737 -1029 -1526 839 1933 -615 -1680 584 1745 478 -1101 -945 720 1381
2322A381j910p50J582R79j247j764J101K098m61k052L08J191P17j206j449J681
$$ 1381 -529 -1279 303 1282 35 -1729 -628 1470 1009 -1043 -735 456 1173 -33 -1482 199
2338A99J678j143k214N48K099J39k073o10J809P11j388j558J356K391r59k500
$$ 199 1877 734 -1480 -932 1167 1306 -767 -1377 432 1143 -245 -1803 -447 1944 985 -1515
2354a515L38K369L30k332n09K308O03k217r58J401J537k37j876q76J943J290j892
$$ -1515 -1177 1192 1522 -810 -1319 989 1592 -625 -1583 -182 1355 1118 -758 -1634 309 1599 -293
2371b93j205J597J341j965j487J981J416m87j284o73P44J557m93j687L44K161
$$ -293 -1498 99 1440 -525 -2012 -31 1385 898 -386 -1059 -315 1242 749 -938 -594 1567
2387A567q70l228J115L609o54k538l61R39Q22j90o16L3J417J08k691q75L686J625
$$ 1567 697 -2531 -1416 2193 1539 -999 -1360 -421 401 211 -405 -372 1045 1153 -1538 -2413 1273 2898
2405B898l553r36K308j33j421K30O38K90N66j082j805J629K893k464k640K930
$$ 2898 -655 -1591 717 584 -837 -607 31 321 887 -195 -2000 -371 2522 58 -2582 348
2421C48J924k356q39J215k30l92N11o59j27K868m36m952P10M850j024l264K341
$$ 348 2272 -84 -923 292 62 -330 181 -478 -605 2263 1827 -3125 -2415 2435 1411 -1853 488
2438D88J558l282q20J672j54J468K338l152l879L618K730m993P54O391k478n799
$$ 488 2046 -1236 -2056 -384 -538 930 3268 116 -3763 -145 2585 -2408 -1654 4737 2259 -3540
2454c540J873K420j972J673K836l904j865M449j626n802N723N706o625l300O119
$$ -3540 -1667 753 -1219 454 3290 -614 -2479 1970 344 -5458 265 5971 -654 -3954 2165
2469B165o50n209L193L593m332P36M631n646m043Q225J480q749K933Q056o261
$$ 2165 1515 -3694 -501 3092 -1240 -504 4127 -1519 -5562 2663 4143 -4606 -1673 6383 122
2484A22o278O666K425n741L353M581p192j614P417m092n789R676M581j1551k006
$$ 122 -6156 510 2935 -2806 547 5128 -2064 -3678 3739 -353 -6142 3534 8115 -3436 -5442
2499e442Q909l042n963Q105L753q961K57N406p299p44J2085j804j1156M710O431
$$ -5442 3467 425 -5538 2567 6320 -2641 -2384 3022 -4277 -5021 7064 5260 -5896 -1186 5245
2514E245r760k068J2552o64q891M353J659r016L244J0011n764m876R375j440j3216
$$ 5245 -4515 -6583 5969 5305 -3586 767 2426 -6590 -3346 6665 901 -3975 5400 3960 -9256
2529i256L989J2002n501m568Q939j943j1065M766N879o603K695J0802p955j1169
$$ -9256 -5267 6735 1234 -3334 5605 3662 -7403 -2637 3242 -3361 -666 10136 2181 -8988
2543h988Q282L980r491L590J3161o664j0060O053k73p620Q618R139q769m076P952
$$ -8988 -706 3274 -6217 -2627 10534 3870 -6190 -137 -410 -8030 588 9727 958 -3118 4834
2558D834o205j0805J1624J0624q782k833P144p640q431R960N110n859N001N292
$$ 4834 -1371 -12176 -552 10072 1290 -1543 5601 -2039 -10470 -510 4600 -1259 3742 9034
2572I034j3608o777J2286K320p656Q022P335j2818o746P946o95k591J0316K884
$$ 9034 -4574 -11351 935 3255 -4401 3621 10956 -1862 -8608 -662 -1357 -3948 6368 9252
2586I252j1971j611O411p235l158J4709L980j2254p97M485p423j593J1510J432
$$ 9252 -2719 -4330 2081 -5154 -8312 6397 10377 -1877 -2674 1811 -5612 -7205 4305 5737
2600E737o180L605m0j1722R72J3056j768n866O878M74j1484n5P782j424K3O883
$$ 5737 -443 3162 3122 -8600 -7628 5428 3660 -2206 4672 5146 -6338 -6393 1389 -35 -12 6871
2616F871l599r488L804M200o496K472J1332m192j0017L057K462m981L725P177
$$ 6871 3272 -6216 -2412 1788 -4708 -2236 9096 4904 -5113 -2056 406 -4575 -850 6327
2630F327l864l843L066l742n907Q482P162p295k308N102m569n684O531N147l617
$$ 6327 2463 -1380 1686 -2056 -7963 519 7681 386 -1922 3180 -1389 -7073 -542 4605 988
2645I88O26J851p522k212Q882N82n852N089L197r141l008P481R12k969M326K46
$$ 988 1614 3465 -4057 -6269 2613 3195 -2657 2432 5629 -3512 -6520 961 1873 -1096 3230 3476
2661C476p392J259N300n120o72R368j440r612K182N315m752r15P075o10n410K670
$$ 3476 -3916 -2657 2643 -2477 -3149 6219 4779 -4833 -2651 2664 -2088 -3003 4072 3462 -1948 722
2677G22j17o428M157P660m962m214O401r33q745K914P782k310k122L754l666n980
$$ 722 605 -5823 -1666 5994 1032 -3182 3219 2286 -6459 -3545 4237 1927 -195 3559 -107 -6087
2693f087M980L932m536K592O223p159p429N842M224l973K219M622n229m735M060
$$ -6087 -1107 2825 -1711 881 7104 -55 -7484 -1642 2582 -1391 828 5450 221 -4514 -454
2708d54m79k573O717L103q385j768N634k079m141N742M257n750j693K892l019
$$ -454 -933 -3506 3211 6314 -2071 -3839 1795 -284 -4425 1317 5574 -176 -1869 1023 -1996
2723a996j011N710o44m767L778K811o667k003O799L61m646L006K878m901j198
$$ -1996 -3007 2703 2059 -2708 1070 3881 -2786 -4789 2010 2371 -2275 731 3609 -1292 -2490
2738b490L347k227l77N471m26o377J248L827l451j932O090J193n045o00J664k258
$$ -2490 857 -1370 -1747 3724 3298 -3079 -1831 1996 -1455 -3387 2703 3896 -1149 -1749 -85 -2343
2754b343J742M147k548k944L001J67m918J780O068j625m823J882J184k467J489
$$ -2343 -601 3546 998 -1946 1055 1222 -3696 -1916 4152 2527 -2296 -414 770 -1697 -208
2769b08J872k042j14K110k154k060L159K430l859j699M071l08k368J045J013j431
$$ -208 1664 -378 -492 1618 -536 -2596 563 2993 -866 -2565 1506 1198 -1170 -125 888 -543
2785e43M27P99j554M51K384j452l133J569L558j971j903K013j15j252J24N83Q5
$$ -543 -116 683 -871 -420 1964 512 -2621 -1052 2506 535 -1368 645 530 -722 -598 -15 70
2802G0R06J07k499n74L206O14k509j28K401j406j620Q71J486K41p85j035q08J143
$$ 70 976 1083 -1416 -1990 1216 1830 -679 -807 1594 188 -1432 -561 925 1166 381 -654 -1462 -319
2820c19J670j238j214J462Q23k218n16K199R31j217j443N46N62N99j71j064J32
$$ -319 1351 113 -1101 361 1184 -1034 -1550 649 1580 363 -1080 -534 28 627 456 -608 -476
2837d76J325r29j495J258J911q36k267K62J871K22q63j46L69J31j57j138L92J692
$$ -476 849 -80 -1575 -317 1594 758 -1509 -1247 624 846 -17 -163 206 337 180 -958 -566 1126
2855A126J46k065o84J579J135j370q38J267L84j014m84O44R74L82j381j155J069
$$ 1126 1272 -793 -1477 102 1237 -133 -971 296 680 -334 -818 -174 800 1182 -199 -1354 -285
2872b85J559o53j524R66Q97r44r91M52J004N05j011j494J231J205l20j301m8J347
$$ -285 1274 621 -903 63 960 16 -975 -523 481 986 -25 -1519 -288 917 597 -704 -752 595
2890E95l4j695L61J745K88r20j490K02J919j83j180p7J358m16j656r0J901L12
$$ 595 561 -1134 -773 972 1260 340 -1150 -948 971 788 -392 -469 889 473 -1183 -1273 628 940
2908I40r83n91k3J073O82j353p47J805L44j435j142J960P34j837j71Q72K26K10
$$ 940 -43 -634 -657 416 1098 -255 -1002 803 1147 -288 -1430 530 1264 -573 -744 128 354 564
2926E64k01j469K34K113m86k096J401J975j842k304J679J675j075P8J12j302O99
$$ 564 363 -1106 -872 1241 755 -1341 60 2035 193 -2111 -432 1243 168 246 358 -944 -245
2943b45J011j623k36K867K1l773l5L357p58j789J581N72j782O45J37j406J434
$$ -245 766 -857 -1093 1774 1795 -1978 -2013 1344 586 -1203 378 950 -832 -187 -50 -1456 -22
2960b2K484k065k559K723J191l005k13L137o72j801J159n06j729K272J339l019
$$ -22 2462 397 -2162 561 1752 -1253 -1466 1671 999 -802 357 -149 -1878 394 1733 -1286
2976a286P45L435k671l961L107L431l039l93K707k269k099K597k46j645L725J546
$$ -1286 -541 2894 223 -3738 -631 2800 -239 -632 2075 -194 -2293 304 58 -1587 2138 3684
2992C684n708j960N629n61m098M284L015n114j886L140j696p23N296j18n837J905
$$ 3684 -2024 -3984 1645 1084 -3014 1270 4285 -829 -2715 425 -1271 -1994 3302 3184 -2653 -748
3008g48L323n464j516P965Q82o523J681K131m973L4O167j514k998M903n86q766
$$ -748 2575 -2889 -4405 3560 4442 -2081 -400 1731 -3242 -3208 2959 1445 -1553 3350 2764 -6002
3024f002J938Q140l169l649O910m64q396J189N051l145Q36P339l853q120M284
$$ -6002 -4064 4076 907 -2742 4168 3704 -4692 -3503 1548 -1597 -761 6578 2725 -5395 -1111
3039a111L002p157K866J0593m284q353L692J135n917M010Q470m663m336N359l866
$$ -1111 1891 -5266 -2400 8193 3909 -4444 -752 383 -5534 -1524 6946 2283 -2053 3306 -560
3054e60q339Q010Q445o974k519O546m496q218O317O232n363J969N602q262o253
$$ -560 -8899 -889 7556 582 -1937 4609 113 -8105 -1788 4444 -919 1050 6652 -1610 -7863
3069g863Q863J837p751O469P726j0043o403P894j15n556P156N496r209j645O307
$$ -7863 1000 2837 -4914 1555 9281 -762 -7165 729 614 -4942 2214 7710 -1499 -3144 3163
3084C163o291m695J1874M068j0522L04O572p548n438J1375L476p918K752L466
$$ 3163 -3128 -7823 4051 8119 -2403 -2099 4473 -3075 -8513 2862 6338 -1580 1172 4638
3098D638j0678j030J1848j228p474P479K735j2616j180J1618j708n657P429Q61
$$ 4638 -6040 -7070 4778 3550 -3924 3555 6290 -6326 -7506 4112 2404 -3253 4176 5037
3112E037j1423K423Q398o219k099J1098k130j2491M277P964p498j563J0572k267
$$ 5037 -6386 -3963 4435 -1784 -3883 7215 5085 -7406 -3129 4835 -2663 -4226 6346 4079
3126D079r634N092L108q082L407R923o369p065P992P96j0361L673J0839n592n141
$$ 4079 -5555 -463 2645 -5437 -2030 7893 1524 -5541 2451 3247 -7114 -3441 7398 1806 -3335
3141c335O781k657q161O295O660o785m8P674o336r234Q090O682p282Q78P119o351
$$ -3335 3446 789 -7372 -1077 5583 -1202 -1250 6424 88 -9146 -1056 5626 -1656 -778 6341 -10
3157a0o800O431J880m164N301M694r308m536P834k29o061P070N944q891l865N283
$$ -10 -6810 -379 1501 -2663 2638 7332 -1976 -6512 1322 1093 -4968 2102 8046 -845 -4710 573
3173E73j995k784P481K216p209K77M188o220k531R860J818p478J358L317n961
$$ 573 -1422 -4206 3275 5491 -1718 -1441 2747 -3473 -6004 3856 5674 -1804 -446 2871 -3090
3188c090j715O505L31k878L591N08p894M89O921k385k751O017O90p397k32L657
$$ -3090 -4805 1700 2031 -847 2744 3252 -4642 -4153 2768 383 -2368 3649 4339 -3058 -3290 367
3204C67j581J93M933j299m922J742J289m611J781P156j966n319K042O04l507J230
$$ 367 -1214 -1021 3912 2613 -2309 -567 722 -3889 -2108 5048 3082 -2237 -195 409 -3098 -1868
3220a868M703j001j779J741k732l822M165M090l450o71L313j886m244K017K863
$$ -1868 2835 1834 55 1796 -936 -4758 -593 3497 47 -624 2689 803 -3441 -1424 1439
3235A439j004L31J295k973j508L334k54k804K908K351l612j862K871J44j893J307
$$ 1439 435 766 2061 -912 -2420 914 660 -2144 764 3115 -497 -2359 512 656 -1237 70
3251G0J112j576K43J307k497n89L575k03k730J211K138k623j691K245J003p48
$$ 70 1182 -394 -151 1156 -1341 -1930 1645 1442 -1288 -77 2061 -562 -2253 -8 995 247
3267B47N22l87j934J020J941j851q69K991k6l134k44K500Oj022P91j48j442J000
$$ 247 769 382 -1552 -532 1409 -442 -1311 1680 1654 -1480 -1724 776 782 -240 551 403 -1039 -39
3285c9K53j098J174J834j965k106J636J449j336l20J307m40r37M00k90J53J341
$$ -39 214 -884 290 2124 159 -1947 -311 1138 -198 -518 789 349 -588 -188 -478 -325 1016
3302A016j15k070J00K165o42j450N16J591p73j138P82J60K65M6r83l80J645M68
$$ 1016 901 -1169 -1069 1096 454 -996 -480 1111 338 -800 -18 142 407 453 -530 -910 735 1203
3320A203j597m44J414J55j593n2J346K25m74o49k42O16R40o85q29O06P85j029
$$ 1203 -394 -838 576 731 -862 -914 432 657 183 -466 -708 -92 848 163 -666 -60 725 -304
3338c04p22J180J301r32j226MR37N89k81r00M44M87p04r15Q47J401m13j639j10
$$ -304 -1026 154 1455 523 -703 -699 238 827 546 -354 90 577 -127 -1042 -195 1206 793 -846 -956
3357i56J156J77j6o48L18L59m31p40L56J159L29j625q40J185Q45m91k04l2K21
$$ -956 200 377 361 -287 31 390 -41 -781 -425 734 1063 -562 -1402 -217 628 137 -67 -99 122
3376A22l28m14J63R31N23r66j359Q49J617o56r72O73L97q11l86N08O29J86o48
$$ 122 -206 -620 -457 474 997 31 -1328 -479 1138 482 -490 183 580 -231 -617 -109 520 706 58
3395E8r78J13J479L27j674K19J628j045j194Q07Q91p0o71n43k34Q85J297j080
$$ 58 -920 -807 672 999 -675 -456 1172 127 -1067 -260 631 561 -110 -653 -887 -2 1295 215
3413B15j148J291J07j421M5K208j97j721j64N58j87R15M77j265k81J622j235j670
$$ 215 -933 358 465 -956 -911 1297 1100 -621 -785 -227 -414 501 978 -287 -568 1054 -181 -1851
3431a851K412J392k198q55J362j00p27R87K59j579R21J183k422k78L300m60l246
$$ -1851 561 1953 -245 -1100 262 162 -565 422 681 -898 23 1206 -1216 -1494 1806 1346 -1900
3448a900J202K485j811j100J637K25j866J628P31k452O73K525k750j883M141R49
$$ -1900 -698 1787 -24 -1124 513 738 -1128 500 1231 -1221 -548 1977 -773 -2656 1485 2434
3464B434l522K06K249j748j935L293O62k212J227O02l930O20M793j010l384K321
$$ 2434 -1088 -882 1367 -381 -2316 977 1639 -573 654 1256 -2674 -2054 2739 1729 -1655 666
3480F66J209m137l65M202k86j571K166j249l967K367L087k770o45M228j122n187
$$ 666 1875 -2262 -2627 1575 1289 -282 1884 635 -3332 -965 2122 -648 -1293 2935 1813 -3374
3496c374J550L499k097m05L418j689k482K087j60l417K476M352k909k788L318
$$ -3374 -1824 1675 -422 -827 2591 902 -1580 507 347 -3070 -594 3758 849 -1939 1379
3511A379n79m380J897M445j716p00J811l143l035L626K326k619J825L042m782
$$ 1379 800 -3580 -1683 2762 1046 346 2157 -986 -4021 -395 1931 -688 1137 4179 -603
3526f03m349L854K539j758K032J786m386k002K643r41q13N023J606o193j205L666
$$ -603 -4952 -1098 1441 -317 1715 3501 -885 -2887 -244 -1185 -1998 3025 4631 -1562 -2767 899
3542H99k249j550N240J293m291O80M65l602N81N477j299l159L247P61o328L01
$$ 899 -1350 -2900 2340 3633 -658 22 487 -3115 -2534 2943 1644 -1515 1732 2493 -3835 -3534
3558c534N345r24j540L410r76n086J446K881k702J216N403k589o730K708L007
$$ -3534 1811 887 -653 2757 1781 -3305 -1859 1022 -1680 -464 4939 2350 -4380 -1672 1335
3573A335l651J543N734l162m582K337p1l127M548M593n131k944L991j724m581
$$ 1335 -2316 -773 4961 1799 -2783 -446 -517 -3644 904 5497 366 -2578 1413 -311 -4892
3588d892N389M660m766j802L063l366k471N974J509m905J877L355o164k675P268
$$ -4892 497 5157 391 -1411 1652 -1714 -4185 1789 3298 -1607 270 3625 -2539 -5214 2054
3603B054J122n163K893K780o129j316N229j142k522N918L76q124P89N913l966
$$ 2054 3176 -1987 906 3686 -2443 -3759 1470 328 -2194 3724 4100 -4024 -3235 2678 -1288
3618a288k117P776L06p684Q17L191l907P85P158j519o346L120J243p213K351R438
$$ -1288 -3405 4371 4677 -3007 -2190 1001 -2906 -2121 5037 3518 -2828 292 1535 -5678 -3327 6111
3634F111k876n792L988n96o668L410P144l517j979M742l766p692N858O280n201
$$ 6111 3235 -2557 1431 835 -5833 -2423 4721 1204 -775 3967 201 -7491 -1633 4647 -554
3649e54o27O554m170p249M508L865m027K224N585o118n213N826P4n588N561O450
$$ -554 -1181 5373 1203 -6046 -1538 2327 -1700 524 6109 -9 -5222 604 678 -4910 651 7101
3665G101o635m739N086r46n367N964N277n681j173M317n445m403P938M116o339
$$ 7101 466 -4273 813 -133 -5500 464 5741 60 -1113 3204 -2241 -6644 1294 5410 -929
3680i29O94M351o062m565O910L053m302K650K440p554j908P005o01l761N441K389
$$ -929 -235 4116 -1946 -6511 399 3452 -850 1800 4240 -3314 -5222 1783 1182 -2579 2862 5251
3696E251q008j940O308j315l030N171J592o280M99L871m179j250O940r8o501K313
$$ 5251 -2757 -4697 1611 296 -2734 2437 4029 -2251 -1752 2119 -2060 -3310 3630 3532 -2969 -656
3712f56L679n098j779O016R7m081K927J081n322R50M925k378k543M810K47o412
$$ -656 3023 -2075 -3854 2162 2259 -1822 1105 2186 -3136 -2186 2739 361 -2182 2628 2875 -3537
3728c537Q42N199k333j551L850q20m539J736K389k787R85M321k546m748L070K363
$$ -3537 -2695 2504 171 -1380 2470 1650 -2889 -1153 1236 -1551 -566 3755 1209 -3539 -469 1894
3744A894l284M35L901k230k984K404M47k076K048J754l102j394L452k34l563K487
$$ 1894 -1390 -955 2946 716 -2268 136 583 -1493 555 2309 -793 -2187 1265 1031 -2532 -45
3760d5K606k938j165K456m62j682J526N85k021J101K022k475j466K864M60k796
$$ -45 2561 -377 -1542 914 452 -1230 296 881 -1140 -39 1983 -492 -1958 906 1366 -1430
3776a430R81K171j580j453J109K20n20J494M99k521O8J728r35r87K178N77k199
$$ -1430 -449 1722 142 -1311 -202 18 -502 992 1491 -1030 -962 766 -169 -1156 1022 1599 -600
3793f00o42J185j80K60R37l89j277M88O90j468K75K311n87k141M19J254o15j83
$$ -600 -1242 -57 -237 23 960 571 -706 -218 472 -996 -721 1590 1003 -1138 -719 535 -80 -263
3811b63M36J51n14L86k46o10J249M87j386p91J430L44q47j39O14p7m83j25L71
$$ -263 173 324 -190 196 -50 -660 589 1076 -310 -1101 329 673 -174 -313 301 224 -259 -384 -13
3830a3J42K07n75q87Q71R31m07q71M65N84o83m09N71N27L0l85p96rJ120J52p84
$$ -13 129 336 -239 -1126 -255 676 269 -602 -137 447 -236 -645 -74 453 483 98 -698 -707 413 565 -219
3851b19P8M81r2n45p3J085Q1r44n33K67P79J07n64l18M97K27q93k51J053N78n60
$$ -219 -141 340 248 -297 -370 715 796 -148 -681 -414 365 472 -92 -410 87 314 -579 -830 223 801 241
3872B41q04J37P80J54n28l28O96J80r66l0Q01M17o79p95K12P78p1j77j60Q5M95
$$ 241 -563 -426 354 508 -20 -348 348 528 -438 -468 333 750 71 -724 -512 266 195 18 -142 -57 438
3893D38n73p41R64P36m80j022K61Q66j44n14K3L16j32K23n02o2J128J10j388l41
$$ 438 -135 -876 88 824 344 -678 -417 449 305 -209 -186 130 -2 221 -281 -343 785 895 -493 -834
3913h34J175L09j057j51J233o15k68L17j76J4N89o37r85R07J263p64j144Q64N56
$$ -834 341 650 -407 -558 675 60 -208 109 -67 -53 536 -101 -1086 -179 1084 320 -824 40 596
3932E96j187k1J222k35k47M78r74o24J408J90j244L59J594j125j785J334R81q70
$$ 596 -591 -612 610 375 128 606 -368 -992 416 606 -638 -279 1315 190 -1595 -261 720 -150
3950a50J40R01j329j5J044o87j305J961J127k286o97K086m09j697J333J293j600
$$ -150 -10 891 -438 -453 591 -96 -1401 560 1687 -599 -1296 790 381 -1316 17 1310 -290
3967b90J37Q00j496n77K678j3k659J621J636k743j210K932lj727J688N88k472
$$ -290 -153 647 -849 -1426 1252 1239 -1420 201 1837 -906 -2116 816 813 -914 774 1362 -1110
3984a110j02K049j510q35L611m7m085O00K850k175j267L846L29l239R78Q25k919
$$ -1110 -1212 837 -673 -1508 2103 2056 -2029 -1429 1421 -754 -2021 1825 2154 -1085 -107 718 -2201
4001b201N81M499j328l566K876Q67m833R48M652j152k520K427k63m020J746L548
$$ -2201 -1620 2879 1551 -2015 861 1728 -3105 -2157 2495 1343 -1177 1250 987 -3033 -1287 2261
4017B261k692o11M187k130n202L079L578l443m84M639j819m394K633J602l404
$$ 2261 -431 -1042 3145 1015 -4187 -1108 2470 -973 -1457 3182 1363 -3031 -398 1204 -2200
4032b200J830M248l513l415M430j11m775K775M667l539k594L588j152l970L741
$$ -2200 -370 3878 365 -3050 1380 1269 -3506 -731 3936 397 -2197 1391 239 -3731 10
4047A0L456m412J38M068l974m030N459K404m234O61L926m172l388M926J029l266
$$ 10 3466 -946 -808 3260 -714 -4744 715 3119 -1115 -454 3472 -700 -4088 838 1867 -1399
4063a399K682K031n691j498O023j294l324M262K399o293j218M868j443k174M863
$$ -1399 1283 3314 -2377 -3875 2148 854 -2470 1792 4191 -2102 -3320 1548 105 -2069 2794
4078B794M58n908R10L687l840p74O442o66n982J734L004m255n5N579j080l847
$$ 2794 3252 -2656 -1746 1941 -1899 -2673 3769 3103 -2879 -1145 1859 -2396 -2451 3128 2048 -1799
4094a799K775K82n333K074N629k725k859M300o61n983J960M757k084q03M052k780
$$ -1799 976 1258 -4075 -2001 3628 903 -1956 2344 1683 -4300 -2340 2417 333 -470 3582 802
4110H02m679K493K498k729J882M842l834n439K812J805k682K832M246l674l642
$$ 802 -3877 -1384 1114 -1615 267 5109 1275 -4164 -1352 453 -2229 603 4849 1175 -2467
4125b467K202r83k434M971L728m505k189K807k598l053N108L318l406k31J383
$$ -2467 -265 -1248 -3682 1289 5017 512 -1677 1130 -1468 -4521 587 3905 499 268 1651
4140A651m025j600M790J049k710K570J702n551j843M388J51j577L398Q44m479
$$ 1651 -2374 -3974 816 1865 -845 1725 3427 -2124 -3967 421 572 -1005 2393 3237 -1242
4155a242p90J760j552N2N271Nm913L70J554l241K99N211L68l254J94l80l256J921
$$ -1242 -2032 -272 -1824 -1772 3499 3504 -1409 -1039 515 -2726 -2427 2784 3152 -102 92 -288 -3544 -1623
4173a623M483j399j908K246j180m835K108M298j326p30K163k291l120K168J976
$$ -1623 2860 1461 -447 1799 619 -4216 -2108 2190 864 134 2297 6 -3114 -946 1030
4188A030j914J367K844l511k858K985J067k866J883K742k267k246K246q28j850
$$ 1030 -884 483 3327 -184 -3042 -57 1010 -1856 27 2769 502 -1744 502 -326 -2176
4203b176K780K012l250k89K862k594k626L871J918l090M66J381k210j474L294
$$ -2176 604 2616 -634 -923 1939 -655 -3281 590 2508 -582 -116 1265 -945 -2419 875
4218H75L40j994J550J313m084n85M055m49k234K169R23l572k67K795p82q41K704
$$ 875 1215 -779 771 2084 -2000 -2585 1470 1021 -1213 956 1879 -1693 -1960 835 53 -788 1916
4235A916n56l834J401K624k313n78L375o86l284J067J735j606R9K541j576j959
$$ 1916 1360 -2474 -1073 1551 -762 -1340 2035 1349 -1935 -868 867 -739 -640 1901 325 -1634
4251a634K262K81k922J733K616k022j971K231L31k318Q10J985j685j19J775j372
$$ -1634 628 909 -2013 -280 2336 314 -1657 574 905 -1413 -603 1382 -303 -422 1353 -19
4267a9k055K129J287j893J95K168j343k608J624J236j136P51J198j967p63J713
$$ -19 -2074 55 1342 -551 -356 1812 469 -2139 -515 721 -415 336 1534 -433 -1196 517
4283E17n05j256J865J234k041j238J675J47j197J122Q06j505j44R71r28k85J651
$$ 517 12 -1244 621 1855 -186 -1424 251 398 -799 323 1129 -376 -520 451 -477 -762 889
4300H89j71j751O86J266p08j145J312Q5q84L10M15o04K38N33q57l94J294M35j367
$$ 889 718 -1033 -347 919 211 -934 378 463 -421 -111 304 -300 -62 471 -386 -780 514 949 -418
4319d18l27J228l59o58Q21M66q09m5r4n78O51J141m13j381N90N48r63K15R46K6
$$ -418 -745 483 124 -534 287 753 -56 -101 -195 -773 -122 1019 606 -775 -185 363 -600 -385 561 587
4339E87p29l42M20jL49K13n81m21O54m1p06L82R74q71p13N47M60J17p2O0o40J15
$$ 587 -142 -484 -64 -65 284 497 -84 -505 149 108 -598 -216 758 -113 -826 -279 181 298 226 286 -354 -239
4361b39N88j66m97R26m6j218k75J068M94p23k39P0K5K19M13m24O3M10n98r19J074
$$ -239 349 183 -314 612 566 -652 -927 141 635 -88 -327 -257 -232 -13 400 -24 39 449 -149 -1068 6
$$ [...]
8191B31
##END NTUPLES=NMR FID
##END=
