##TITLE=1H_E3C-NA
 DMSO-d6
 8sc, 
 16.2.2024
##JCAMPDX= 6.0         $$ Bruker NMR JCAMP-DX V2.0
##DATA TYPE= NMR FID
##DATA CLASS= NTUPLES
##ORIGIN= UXNMR, Bruker Analytische Messtechnik GmbH
##OWNER= root
$$ XWIN-NMR		Version 3.5
$$ Fri Feb 16 13:53:01 2024 Russian Standard Time (UT+4h)  she@DPX200
##.OBSERVE FREQUENCY= 200.1313
##.OBSERVE NUCLEUS= ^1H
##.DELAY= (6, 6)
##.ACQUISITION MODE= SIMULTANEOUS
##.ACQUISITION SCHEME= undefined
##.AVERAGES= 43
##.DIGITISER RES= 18
##SPECTROMETER/DATA SYSTEM= spect
##.PULSE SEQUENCE= zg30
##.SOLVENT NAME= DMSO
##.SHIFT REFERENCE= (INTERNAL, DMSO, 0, 15.7039)
##AUDIT TRAIL= $$ (NUMBER, WHEN, WHO, WHERE, WHAT)
$$ ##TITLE= Audit trail, XWIN-NMR		Version 3.5
$$ ##JCAMPDX= 5.01
$$ ##ORIGIN= Bruker BioSpin GmbH
$$ ##OWNER= she
$$ F:/spectra/data/she/nmr/H-F/1/audita.txt
$$ ##AUDIT TRAIL=  $$ (NUMBER, WHEN, WHO, WHERE, WHAT)
(   1,<2024-02-16 13:51:58.67 +0400>,<she>,<DPX200>,
      <created by zg, POWCHK disabled, PULCHK disabled
       terminated by command 'halt'
       configuration hash MD5:
       00 E9 B6 7A A2 85 ED C7 34 08 36 98 17 FE 4E 26
       data hash MD5: 16K
       FA A2 96 D7 E6 48 43 A6 25 7E 18 D7 AA B8 D6 70>)
$$ ##END=
$$ 
$$ hash MD5
$$ 40 B4 4C 43 40 78 53 1D 58 D6 95 65 AD A4 3C E2
##$RELAX= 
##$RELAX= 
##$RELAX= 
##$RELAX= 
##$RELAX= 
##$RELAX= 
$$ Bruker specific parameters
$$ --------------------------
##$DU= <F:/spectra>
##$EXPNO= 1
##$NAME= <H-F>
##$PROCNO= 1
##$TYPE= <nmr>
##$USER= <she>
##$AMP= (0..31)
100 100 100 100 100 100 100 100 100 100 100 100 100 100 100 100 100 100 
100 100 100 100 100 100 100 100 100 100 100 100 100 100 
##$AQSEQ= 0
##$AQ_mod= 1
##$AUNM= <au_zg>
##$AUTOPOS= <>
##$BF1= 200.13
##$BF2= 200.13
##$BF3= 200.13
##$BF4= 200.13
##$BF5= 200.13
##$BF6= 200.13
##$BF7= 200.13
##$BF8= 200.13
##$BYTORDA= 1
##$CFDGTYP= 0
##$CFRGTYP= 5
##$CHEMSTR= <none>
##$CNST= (0..31)
1 1 145 1 1 1 1 1 1 1 1 1 1 1 1 1 1 1 1 1 1 1 1 1 1 1 1 1 1 1 1 1 
##$CPDPRG= <>
##$CPDPRG1= <>
##$CPDPRG2= <>
##$CPDPRG3= <>
##$CPDPRG4= <mlev>
##$CPDPRG5= <mlev>
##$CPDPRG6= <mlev>
##$CPDPRG7= <mlev>
##$CPDPRG8= <mlev>
##$CPDPRGB= <>
##$CPDPRGT= <>
##$D= (0..31)
0 1.2 0 0 0 0 0 0 0 0.06 0 0.03 0 0 0 0 0.0002 0 0 0 0 0 0 0 0 0 0 0 0 
0 0 0 
##$DATE= 1708077118
##$DBL= (0..7)
120 120 120 120 120 120 120 120 
##$DBP= (0..7)
150 150 150 150 150 150 150 150 
##$DBP07= 0
##$DBPNAM0= <>
##$DBPNAM1= <>
##$DBPNAM2= <>
##$DBPNAM3= <>
##$DBPNAM4= <>
##$DBPNAM5= <>
##$DBPNAM6= <>
##$DBPNAM7= <>
##$DBPOAL= (0..7)
0.5 0.5 0.5 0.5 0.5 0.5 0.5 0.5 
##$DBPOFFS= (0..7)
0 0 0 0 0 0 0 0 
##$DE= 6
##$DECBNUC= <off>
##$DECIM= 32
##$DECNUC= <off>
##$DECSTAT= 4
##$DIGMOD= 1
##$DIGTYP= 9
##$DL= (0..7)
0 120 120 120 120 120 120 120 
##$DP= (0..7)
150 150 150 150 150 150 150 150 
##$DP07= 0
##$DPNAME0= <>
##$DPNAME1= <>
##$DPNAME2= <>
##$DPNAME3= <>
##$DPNAME4= <>
##$DPNAME5= <>
##$DPNAME6= <>
##$DPNAME7= <>
##$DPOAL= (0..7)
0.5 0.5 0.5 0.5 0.5 0.5 0.5 0.5 
##$DPOFFS= (0..7)
0 0 0 0 0 0 0 0 
##$DQDMODE= 0
##$DR= 18
##$DS= 0
$$ [...]
##$SUBNAM2= <"">
##$SUBNAM3= <"">
##$SUBNAM4= <"">
##$SUBNAM5= <"">
##$SUBNAM6= <"">
##$SUBNAM7= <"">
##$SUBNAM8= <"">
##$SUBNAM9= <"">
##$SW= 18.0517328524113
##$SWIBOX= (0..15)
0 0 2 0 0 0 0 0 0 0 0 0 0 0 0 0 
##$SW_h= 3612.71676300578
##$TD= 16384
##$TD0= 1
##$TE= 0
##$TE2= 300
##$TE3= 300
##$TEG= 300
##$TL= (0..7)
0 120 120 120 120 120 120 120 
##$TP= (0..7)
150 150 150 150 150 150 150 150 
##$TP07= 0
##$TPNAME0= <>
##$TPNAME1= <>
##$TPNAME2= <>
##$TPNAME3= <>
##$TPNAME4= <>
##$TPNAME5= <>
##$TPNAME6= <>
##$TPNAME7= <>
##$TPOAL= (0..7)
0.5 0.5 0.5 0.5 0.5 0.5 0.5 0.5 
##$TPOFFS= (0..7)
0 0 0 0 0 0 0 0 
##$TUNHIN= 0
##$TUNHOUT= 0
##$TUNXOUT= 0
##$USERA1= <user>
##$USERA2= <user>
##$USERA3= <user>
##$USERA4= <user>
##$USERA5= <user>
##$V9= 5
##$VALIST= <valist>
##$VCLIST= <CCCCCCCCCCCCCCC>
##$VD= 0
##$VDLIST= <DDDDDDDDDDDDDDD>
##$VPLIST= <PPPPPPPPPPPPPPP>
##$VTLIST= <TTTTTTTTTTTTTTT>
##$WBST= 1024
##$WBSW= 4
##$XGAIN= (0..3)
0 0 0 0 
##$XL= 0
##$YL= 0
##$YMAX_a= 157206
##$YMIN_a= -179992
##$ZGOPTNS= <>
##$ZL1= 120
##$ZL2= 120
##$ZL3= 120
##$ZL4= 120
##$ABSF1= 10
##$ABSF2= 0
##$ABSG= 5
##$ABSL= 3
##$ALPHA= 0
##$AQORDER= 0
##$ASSFAC= 0
##$ASSFACI= 0
##$ASSFACX= 0
##$ASSWID= 0
##$AUNMP= <proc_1d>
##$AZFE= 0.1
##$AZFW= 0.1
##$BCFW= 1
##$BC_mod= 2
##$BYTORDP= 1
##$COROFFS= 0
##$CY= 11.3945322036743
##$DATMOD= 1
##$DC= 2
##$DFILT= <>
##$DTYPP= 0
##$F1P= 15.7292609196834
##$F2P= 12.9074282941183
##$FCOR= 0.5
##$FTSIZE= 0
##$FT_mod= 4
##$GAMMA= 1
##$GB= 0.15
##$INTBC= 1
##$INTSCL= 1
##$ISEN= 128
##$LB= 0.24
##$LEV0= 0
##$LPBIN= 0
##$MAXI= 10000
##$MC2= 0
##$MEAN= 0
##$ME_mod= 0
##$MI= 1.114404
##$NCOEF= 0
##$NC_proc= 0
##$NLEV= 6
##$NOISF1= 3.799351
##$NOISF2= 2.8
##$NSP= 1
##$NTH_PI= 0
##$NZP= 0
##$OFFSET= 15.70392
##$PC= 1
##$PHC0= -25039.09
##$PHC1= 10.25264
##$PH_mod= 1
##$PKNL= yes
##$PPARMOD= 0
##$PSCAL= 0
##$PSIGN= 0
##$REVERSE= no
##$SF= 200.130013532006
##$SI= 16384
##$SIGF1= 3
##$SIGF2= 2
##$SINO= 400
##$SIOLD= 16384
##$SREGLST= <1H.CDCl3>
##$SSB= 0
##$STSI= 0
##$STSR= 0
##$SW_p= 3612.71676300578
##$SYMM= 0
##$S_DEV= 0
##$TDeff= 0
##$TDoff= 0
##$TI= <>
##$TILT= no
##$TM1= 0
##$TM2= 0
##$TOPLEV= 0
##$USERP1= <user>
##$USERP2= <user>
##$USERP3= <user>
##$USERP4= <user>
##$USERP5= <user>
##$WDW= 1
##$XDIM= 8192
##$YMAX_p= 0
##$YMIN_p= 0
$$ End of Bruker specific parameters
$$ ---------------------------------
##NTUPLES= NMR FID
##VAR_NAME=  TIME,          FID/REAL,        FID/IMAG
##SYMBOL=    X,             R,               I
##VAR_TYPE=  INDEPENDENT,   DEPENDENT,       DEPENDENT
##VAR_FORM=  AFFN,          ASDF,            ASDF
##VAR_DIM=   8192,          8192,            8192
##UNITS=     SECONDS,       ARBITRARY UNITS, ARBITRARY UNITS
##FACTOR=    0.0002768,     1,               1
##FIRST=     0,             0,               0
##LAST=      2.2672688,     0,               0
##MIN=       0,             -179992,         0
##MAX=       2.2672688,     157206,          0
$$ Real data points
##PAGE= N=1
##DATA TABLE= (X++(R..R)), XYDATA
$$ [...]
1024A363k526K30N70p02J167J478j275m97J479j236k090J644J080j661Q76K047
$$ 1363 -1163 -933 -363 -1065 102 1580 305 -192 1287 51 -2039 -395 685 -976 -100 1947
1040A947j503j186J219j448j931K593K666p41l75p89l222l42L641J474q34L47
$$ 1947 444 -742 477 -971 -2902 -309 2357 1616 1241 452 -2770 -3112 529 2003 1169 1516
1056A516q20k520K83J924o27n44K180P02j966q08J08j398M4L065J236j558j16
$$ 1516 696 -1824 -1541 383 -244 -788 1392 2094 128 -680 -572 -1970 -1926 1139 2375 817 701
1073G01k83k810n39K867J189L69J808j726m681pK695K76J688K386l097l487J936
$$ 701 418 -2392 -2931 -64 1125 1494 3302 1576 -3105 -3112 -417 -141 1547 3933 836 -2651 -715
1090g15O14k113J984K510j825j39J751k907l029K402K146j03J889M45l827j960
$$ -715 -101 -2214 -230 2280 455 316 2067 -840 -3869 -1467 679 576 2465 2910 -917 -2877
1106b877J487K79P22L085O51k900j706k77q17J165L457P38k560j160K45r35J92
$$ -2877 -1390 -1111 -389 2696 3347 447 -1259 -1536 -2353 -1188 2269 3007 447 -713 -468 -1403 -1211
1123a211K053k45j535J616J414k161j274O98j067L14L691N16k920q5M6k529R55
$$ -1211 842 597 -938 678 2092 -69 -1343 -645 -1712 -1398 2293 2809 -111 -196 -150 -2679 -1724
1140a724L460o04p79K031j651l785J176K070q75J560K325k366k245J190q40j608
$$ -1724 1736 1132 353 2384 733 -3052 -1876 194 -681 879 3204 838 -1407 -217 -1057 -2665
1156b665K427K414m91K79m70l858j995K812K792J126J002j390m080j638J872J627
$$ -2665 -238 2176 1685 1964 1494 -2364 -4359 -1547 1245 2371 3373 1983 -2097 -3735 -1863 -236
1172b36J057J804J29k599j920j21k00Q27K954J336j633j203p41j851J3K414R96
$$ -236 821 2625 2754 155 -1765 -1886 -2086 -1259 1695 3031 1398 195 -546 -2397 -2384 30 1026
1189A026K05J531p50l827j396J199P73K447L202j500m088j179K7k8K624K793q88
$$ 1026 1231 2762 2012 -1815 -3211 -2012 -1239 1208 4410 2910 -1178 -2357 -2330 -2358 266 3059 2171
1206B171j470k75j885j653J631K189P42R71j75k862j989Q15P99Q29J986O98j596
$$ 2171 701 426 -1459 -3112 -1481 708 1450 2421 2246 -616 -2605 -1790 -991 -162 1824 2522 926
1223I26j347p53j301K54K759K034l67j128j537j912L2K145J262J17L24l61j518
$$ 926 -421 -1174 -2475 -2221 538 2572 2205 1077 -460 -2372 -2340 -195 1067 1184 1508 1147 -371
1240c71q03o2k00J011K196N73j313j162j095r58P93J882P76P1K55r84k052q83
$$ -371 -1174 -1236 -1436 -425 1771 2344 1031 -131 -1226 -2184 -1391 491 1267 1338 1593 609 -1443 -2326
1258b326N66J242J972J432r18k316j561m15N82J818J912L29p01j172k003j502
$$ -2326 -1760 -518 1454 2886 1968 -348 -1909 -2324 -1742 76 1988 2317 1616 444 -1559 -3061
1274c061Q27K473K046Q53q72k825k421N6J600J884J879N87j485k088j635r53Q91
$$ -3061 -2234 239 2285 3138 2266 -559 -2980 -2924 -1324 560 2439 3026 1541 -547 -2182 -3135 -2244
1291b244K983K516K19j701k990k533K73K634K655J456k14k183k819j370N07J983
$$ -2244 739 3255 3474 1773 -1217 -3750 -3477 -843 1812 3268 3054 871 -1948 -3318 -2811 -828
1307h28K805J736q84k701k668r22J318K580J995L48j106j841j607o30N03J628
$$ -828 1977 3713 2829 128 -2540 -3462 -2144 436 2431 2779 1673 -168 -1775 -2405 -1902 -274
1323b74K028J111m83k218k552q13J451K386J836L12j477k260j207J35R29J623
$$ -274 1754 2865 2382 164 -2388 -3201 -1750 636 2472 2784 1307 -953 -2160 -2025 -1096 527
1339E27J416Nj040j397j263r3J212J186M68K00k53q38p23n57n43N45J836J532
$$ 527 1943 1948 908 -489 -1752 -1845 -633 553 1021 1221 968 130 -593 -1150 -1693 -1148 688 2220
1357B220K7j426k195j367O67K044J767O31p74j605j318n34K94J091J557J087j32
$$ 2220 2247 821 -1374 -2741 -2074 -30 1737 2368 1594 -11 -1329 -1863 -1569 -478 1079 2166 2034
1374B034j378j832j140J27J372K020J341j53j350k160j988j29K194L034J922n23
$$ 2034 656 -1176 -2316 -2189 -817 1203 2544 2391 1041 -1119 -3107 -3236 -1042 1992 3914 3391
1390C391l049l592j140J862L305K727L29k258k877j668j14J486K546J911J90j336
$$ 3391 342 -3250 -4390 -2528 777 3504 3833 1575 -1302 -2970 -3084 -1598 948 2859 3049 1713
1406A713k375k307m13J855K738J931J80j776k749k017j34J863K978K220q1k531
$$ 1713 -662 -2969 -3382 -1527 1211 3142 3322 1546 -1203 -3220 -3354 -1491 1487 3707 3626 1095
1422A095l415j924R61L206L190P59j944k834j807j01J538K111J136r9n87j230
$$ 1095 -2320 -4244 -3283 -77 3113 3872 1928 -906 -2713 -2814 -1276 835 1971 1872 1285 55
1438E5j580o33P22J368J549Q35o81j697j361n66L60J539J677M64m88j378j878
$$ 55 -1525 -2158 -1436 -68 1481 2316 1635 -62 -1423 -1989 -1629 -90 1587 2051 1563 185 -1693
1455a693p59J199J846J025R8r24j316n53L11K96O6L77P66P05k2j215j650q56O38
$$ -1693 -2452 -1253 593 1618 1716 792 -524 -1077 -766 -470 -404 -27 739 1444 1422 207 -1443 -2299 -1661
1474a661J924J904M28j214k087j755k51J415K168J833L04j766k766j588M60J812
$$ -1661 263 2167 2595 1381 -706 -2461 -2712 -1297 871 2704 3008 1242 -1524 -3112 -2652 -840
1490h40K546J571q08k166j727j128o9J821K396J324J9j662l138k149Q17K717L082
$$ -840 1706 3277 2469 303 -1424 -2552 -2621 -800 1596 2920 2939 1277 -1861 -4010 -3193 -476 2606
1507B606J710j350l539k701m78J437K913K819K80k032k654k160m74K012L194J885
$$ 2606 4316 2966 -573 -3274 -3752 -2315 598 3417 3697 1665 -989 -3149 -3623 -1611 1583 3468
1523C468l87k107k480j468L75J823K113J212j8j321k279j758RJ713K571J945m39
$$ 3468 3081 974 -1506 -2974 -2599 -776 1337 2549 2531 1210 -1069 -2827 -2818 -1105 1466 3411 2972
1540B972k691k408p25O17K170K488K90j473j266j395j101R79K059R79K59k37j766
$$ 2972 281 -2127 -2852 -2235 -65 2423 2713 1240 -26 -1421 -2522 -1543 516 1495 1754 1517 -249
1557b49j598M20Q33L97J064O20p52n53j95j172o27J267J306M17L89n00j829r17
$$ -249 -1847 -1427 -594 -197 867 1487 735 182 -13 -1185 -1812 -545 761 1178 1567 1067 -762 -1679
1575a679N96N09N48J287N82p96j071j062j014L06K036J767K62q23j631j976m08
$$ -1679 -1083 -574 -26 1261 1843 1047 -24 -1086 -2100 -1794 242 2009 2271 1448 -183 -2159 -2567
1592b567J397J642J302R65p71k674j966k5R92K265K775J02k628k361j200k87J912
$$ -2567 -1170 472 1774 2739 1968 -706 -2672 -2697 -1705 560 3335 3437 809 -1552 -2752 -3039 -1127
1609a127L080J206p66j306k477k240O76K660K215J485j24l076l242k65J386J772
$$ -1127 1953 3159 2393 1087 -1390 -3630 -2954 -294 1921 3406 3282 206 -3036 -3301 -1915 -143
1625a43K663J270j908k545j410j020N00L142K669j00j412k223k712l61K619K491
$$ -143 2520 3790 1882 -663 -2073 -3093 -2593 549 3218 3118 1706 -517 -3229 -3590 -971 1520
1641A520J059K71j589k982j245Q29J247J987K059n68k603j760n75K99J995K265
$$ 1520 2579 2850 1261 -1721 -2966 -2137 -890 1097 3156 2588 -15 -1775 -2350 -2051 -56 2209
1657B209o0j402q48q38p72O85J224M80L77L90r05j485l43L76L64J042R48m17q51
$$ 2209 2149 747 -101 -939 -1711 -1026 198 678 1055 1445 540 -945 -1288 -912 -548 494 1442 1025 174
1676A74k10n80q58N53J294M61K88K51j287j593J19P32K45J100J144n64j019p16
$$ 174 -36 -616 -1474 -921 373 834 1122 1373 86 -1507 -1388 -656 -411 689 1833 1269 250 -466
1694d66j307o07J845K279N85k52j421k814j106J795J989J372J049r86k767j647
$$ -466 -1773 -2380 -535 1744 2329 2077 656 -2158 -3264 -1469 520 1892 2941 1955 -812 -2459
1710b459R2P31K031K488J35j920k023j638l52J833K563J136k39j220k236j832
$$ -2459 -2367 -1636 395 2883 3018 1098 -925 -2563 -2915 -1082 1481 2617 2378 1158 -1078 -2910
1726b910J82J710K282J805Q4k298l105j301J003K420K595J117j506k773j799k22
$$ -2910 -2728 -1018 1264 3069 3153 855 -2250 -3551 -2548 -128 2467 3584 2078 -695 -2494 -2716
1742b716R97K276K048M3j436j751j737m17J729K172Q88q0r83j976j119N21Q01
$$ -2716 -1719 557 2605 2648 1212 -539 -2276 -2693 -964 1208 2096 2016 1033 -943 -2062 -1541 -740
1759g40J037J541L08j407j533r34l16J201K130P63p27j110j233o39P11J053M28
$$ -740 297 1838 2146 739 -794 -1728 -2044 -843 1287 2050 1323 213 -1020 -1659 -948 105 533
1776E33K87J40n74p48l11j72R8P89P68J20k15l94p90o41l2O88J087R02L9j077
$$ 533 820 960 386 -362 -673 -845 -747 42 810 930 715 321 -469 -1110 -1142 -454 633 1535 1574 497
1796D97j571p74M88J284J313N40n78j230r38m86O2R54J351Q50q7j042j822j223
$$ 497 -1074 -1848 -1360 -76 1237 1777 1199 -31 -969 -1455 -1393 -439 912 1762 1675 633 -1189 -2412
1814b412N01J705J730R10n32j889j894o25P58J809K067P79j178k255j949m35J561
$$ -2412 -1911 -206 1524 2434 1902 13 -1881 -2506 -1748 61 2128 2907 1729 -526 -2475 -2910 -1349
1831a349K561J584l14j666k059j279L85J611J735J056r4j393k039j230K99J649
$$ -1349 1212 2796 2482 816 -1243 -2522 -2137 -526 1209 2265 2171 778 -1261 -2491 -2192 -543
1847e43K130J114p21j915j839o93P66J856J675M19q12j642j632m75J063J794J365
$$ -543 1587 2701 1980 65 -1774 -2467 -1701 155 1830 2249 1437 -205 -1837 -2312 -1249 545 1910
1864A910J22j183j684r57L27J049J089O37j21o31q40p26j94M71J038Q43J44o41
$$ 1910 2032 849 -835 -1792 -1465 -416 673 1310 1189 558 -282 -1008 -1202 -731 307 1150 1294 653
1882F53r71p24mO33O46M58J72j98o75o11k85O1N92Q99M29l83o10n82m30R0N00
$$ 653 -318 -1042 -1046 -413 233 691 863 665 -10 -621 -906 -845 -253 646 1075 692 82 -500 -930 -840 -340
1903c40N75O38L57m49j161q86j88O94J409J097k13j127j192p95J04J025J369P48
$$ -340 235 873 1230 781 -380 -1266 -1454 -760 649 1746 1533 406 -786 -1581 -1477 -452 917 1665
1921A665o2r94j574j049L00J398J680Q40n74j685j535m25O68J433J457M88p41
$$ 1665 1603 609 -965 -2014 -1714 -316 1364 2204 1630 -55 -1590 -2015 -1347 86 1543 2031 1290
1938A290j442j457o23P87J877J593J41j134j788j369Q7J377J596R33p2j122j571
$$ 1290 -152 -1609 -2232 -1445 432 2025 2166 1032 -756 -2125 -2038 -661 935 1868 1796 674 -897
1955h97r53J30J108J647J090m09j478j483o61N16J486J309K04n80j012j046n10
$$ -897 -1850 -1720 -612 1035 2125 1716 238 -1245 -1906 -1390 96 1405 1609 1029 17 -1029 -1539
1972a539M52J123J036L96m38j175j072j70O77J012P38K4n75o78n20k36K42P02
$$ -1539 -1087 36 1072 1468 1030 -145 -1217 -1387 -710 302 1040 1064 489 -189 -709 -945 -703 -1
1990aP24J86k09o56q15k44N29O84L29J21r1l82m06k73j74K33O93N98J09m20p78
$$ -1 723 909 700 44 -771 -1015 -486 198 527 648 557 175 -231 -504 -678 -445 248 846 955 535 -243
2011b43o90l5N57O71N86K41m56q69p85k44M58J157J043R1r56j255p46J75R33J076
$$ -243 -933 -968 -411 260 846 1087 631 -238 -1023 -1267 -809 348 1391 1482 526 -729 -1475 -1300 -367 709
2031G09O75k10q15j019p08k7R29J379P74k63j158j398o39N98J259J154M14o06
$$ 709 1384 1174 359 -660 -1368 -1395 -466 913 1687 1424 266 -1132 -1771 -1173 86 1240 1654 1048
2049A048j192j039k97L97J099J363L55p96j308j038k73R12J452P71j87p63j054
$$ 1048 -144 -1183 -1480 -1083 16 1379 1734 938 -370 -1408 -1681 -769 683 1454 1267 504 -550
2066e50p80P1O97J025Q10J16q69j227o99J67Q88J218N82m92r70p16k98J74P46
$$ -550 -1330 -1259 -562 463 1273 1389 520 -707 -1406 -1239 -351 867 1449 957 -13 -729 -1027 -853 -107
2085a07Q57L21k79o31q20m78M29R07N60P6l12o22m80O7J90J28M32M05j34l05l41
$$ -107 750 1071 792 161 -659 -1137 -708 199 759 835 523 -99 -579 -512 -322 -194 238 643 509 204 -137
2106a37n41j40O41N51Q0N1j37o26l69J57K0K78P56L82m73o22n54l29M35R77M71
$$ -137 -678 -818 -177 374 454 505 368 -258 -627 -470 -450 -172 584 966 493 -129 -683 -1012 -577 400 871
2127H71q5k56o53p45n3M87N80O78L87n71j126o02Q7N79R29P25k41q90o59l31r6
$$ 871 786 530 -123 -868 -921 -434 146 824 1211 640 -486 -1088 -1001 -422 507 1232 991 101 -558 -889 -985
2148i85O02R36M64p3n39j037p91M16R96P59L89j87j039q76K0L04M60R11N40n46
$$ -985 -383 553 1017 944 405 -632 -1423 -1007 -11 748 1137 950 -89 -965 -945 -641 -181 730 1270 724
2168G24p88o17m99K82J206Q50j68m86p19q06K5P52N45L75L04m15r51m90Q7L27
$$ 724 -64 -681 -1180 -898 308 1158 990 504 -215 -1021 -996 -244 301 676 980 565 -386 -876 -789 -462
2188d62Q27P18k96p96m77j77J1M91O18R1j48q8m43n65N1M51M07L57Q5n17n58K
$$ -462 365 1083 787 -9 -486 -663 -652 -161 457 548 400 312 -131 -696 -645 -194 213 570 655 138 -420 -418
2210d18J09M5L95L95j00j35j45n40l45M02O11J99J08j88o00l52J85J46J46M74
$$ -418 -309 -264 131 526 426 291 146 -394 -739 -337 274 473 581 393 -207 -559 -374 -228 -82 392
2230C92K36k43l86l75m03J58P93N03p4k32m75n81jM79L11L15L12j92p53m62l2
$$ 392 628 385 -1 -376 -779 -621 172 675 601 369 -106 -687 -688 -209 102 417 729 537 -216 -678 -710
2251g10K63O82O46q0o44m74k83n4M71N70J93rj60o14n97M8N27N63N18j5p87p04
$$ -710 -447 235 881 801 157 -317 -600 -654 -183 387 580 571 411 -203 -800 -752 -225 338 856 841 54 -650
2273f50j05K73M07N45K42k58m24m04l67R2O35O03J54k93n50n26n9M46M33K08J16
$$ -650 -755 -482 -75 470 712 454 30 -374 -741 -649 -14 589 743 450 -100 -626 -685 -239 194 402 518
2294E18j44m44l35m9O6M16N23J61l96n08k63l1L11M59J21r8p4k16l23j14J65K73
$$ 518 374 -70 -405 -454 -388 28 551 712 316 -192 -455 -486 -175 284 405 307 233 17 -306 -420 -255 18
2316A8L51J86k82m79j98J8J54L59K19j10j18r2k22k06J11K76L09J86j49m40k72
$$ 18 369 555 273 -206 -404 -386 -232 127 346 236 118 26 -196 -402 -291 -15 294 480 331 -109 -381
2337c81K6J95K53K10L9j05j80k16k39K4L49M44J12k11m21l50k3L25L56J12Mj34
$$ -381 -355 -160 93 303 342 237 57 -159 -398 -374 -25 419 531 320 -101 -451 -474 -149 207 319 323 189
2359A89k59k20q7P5K90M08J04k94l73k49m0L04L68J16o3j04k35l09k9J71L53L47
$$ 189 -70 -290 -377 -302 -12 396 500 206 -167 -416 -456 -152 216 332 269 165 -70 -379 -408 -237 116 463
2381D63P8l64m69j83J50L50L49M8j98k65j27p3j4J60K49J55K0j69m07j85J68L01
$$ 463 541 177 -292 -475 -325 25 374 422 224 -41 -168 -241 -255 -95 154 309 329 160 -247 -432 -264 37
2403C7J70R3r6k30k13k0K0J49L09J63j25k84k94j08K81L91N6j30j34j17p5J01
$$ 37 207 300 204 -26 -239 -259 -239 -90 219 382 257 -27 -321 -429 -148 243 299 169 35 -82 -157 -56
2425e6N8o9R5K31L9k21k17j11K6K96K08l3j34j26j29p8J01J26J19J48m1l09k30
$$ -56 2 -67 28 259 298 77 -140 -251 -225 71 279 246 112 -14 -143 -221 -120 6 125 273 232 -77 -307
2448c07Q7K06J32Q1n5k10n5J40rj35M3J33J23Q6j07l20j68J73K80J32L1j67k65
$$ -307 -220 -14 118 199 144 -66 -121 19 10 -125 -82 51 174 260 153 -167 -335 -162 118 250 281 114 -151
2471a51l2J10QJ13K30n4j92r7j00m5K31K27q8j89j7J9J4K5k7j22J00J97J1j49
$$ -151 -183 -73 -65 48 278 224 32 -65 -165 -210 21 248 160 -29 -46 -27 -13 12 -15 -137 -37 160 171 22
2495B2j99j31R5L69J47j66k07n7k3L6K15M4m6l7j4j07r1J24J18M4k7q0j10P3Q9
$$ 22 -177 -308 -213 156 303 137 -70 -127 -150 -114 101 145 99 62 48 -59 -150 -26 92 136 109 29 -81 -8 81
2520H1o1o4K6Q6K4Q2j55k61J0K55J84m5q8k06j08J65J76Pr2m3j5nM5Qn9Q3M3l3
$$ 81 20 -44 -18 68 92 174 19 -242 -232 23 207 162 74 -132 -240 -75 101 108 16 -27 -42 -47 -2 6 -53 30 73 40
2548D0p8M2k4M0L8n2n0R5J21p6j47j03N6J63J73pk48j91K3K27J38l5j21j44J5
$$ 40 -38 4 -20 20 58 6 -44 51 172 96 -51 -154 -98 65 238 231 -17 -208 -185 42 180 145 24 -120 -105
2573a05N7N6M4j6Kql8r3l8J08J52j0j13o9K1N9L2J2m7rL6R4n6j75%J28J31K1j20
$$ -105 -48 8 52 36 38 30 -8 -101 -139 -31 121 111 -2 -71 -50 9 41 53 6 -3 33 127 71 -104 -104 24 155 176 56
2602E6j29o1J12J43J6j05p5K1M0kl9q7Q2P9L2k1q8o6pJ18K7n5K3O7k4j28m7j4
$$ 56 -73 -134 -22 121 137 32 -43 -22 18 16 -23 -110 -28 51 83 62 -26 -92 -99 19 46 -9 14 81 57 -71 -118 -132
2630a32J14K02O3k09j40l8M2J57J22m1j09J8k9p8k8R5N1J17K3j46k57M2J77P9
$$ -132 -18 184 247 38 -102 -140 -98 59 181 140 31 49 20 -58 -86 9 60 177 200 54 -203 -161 16 95
2654I5K0Jj04q4N9Kr8K8J35N2J2n2j73j01J41J60l1K8L7j08j01Rn8L5K47J85j67
$$ 95 115 116 12 -72 -13 -11 -109 -81 54 106 118 66 -107 -208 -67 93 62 90 127 19 -82 -73 -131 -96 151 336 169
2681A69k21j05p7J41K98O0j66q3m0o3K7P8k6O7J73n8k18j11NN4J28J88n1j75n2
$$ 169 -52 -157 -234 -93 205 265 99 16 -24 -87 -60 18 -8 59 232 174 -44 -155 -150 -96 32 220 169 -6 -58
2706e8m0j31R2J94J12N5n8k61k40J32K46J19N1l1k20p2R4j2q3J25J54L9k4j01
$$ -58 -98 -229 -137 57 169 224 166 -95 -335 -203 43 162 213 182 -38 -110 -16 -28 -111 14 168 207 183 82
2730H2l12j01K60K73Q1Lj86k95j26J30J32J85J85m5l16k03o5J08K64K73q0k41
$$ 82 -230 -331 -71 202 283 286 100 -195 -321 -191 -59 126 311 266 -50 -253 -318 -210 54 327 247 6
2752Fj16J1j9M4Q6J7P3J63r3l00j66Q6J79L04J60j98l24j25j1J11K17K05m3j35
$$ 6 -110 -99 -118 -74 12 29 102 265 172 -128 -294 -208 -29 275 435 237 -87 -212 -223 -112 105 310 267 132
2776A32j30k39m0K13K43J1k7r3j72n5O9K0j5J36J61L0j39k31k34Q3L00L16nj75
$$ 132 2 -237 -277 -64 179 190 163 70 -102 -157 -88 -68 -83 53 214 244 105 -126 -360 -277 23 339 334 159
2800A59k85j79M9K70J21P0J3q6k01r6k8J08J63K02l2j25j01j39m6J5J29J95J24
$$ 159 -126 -305 -256 14 135 205 218 132 -69 -165 -193 -85 78 280 248 123 22 -117 -163 -148 -19 176 300
2823C00M2k57l98j61J94L60L34N5l55l73j54J50J93K57J19q8j66j26k16l4J97
$$ 300 342 85 -313 -474 -280 80 414 469 114 -259 -413 -263 -70 187 306 218 52 -74 -290 -324 -127
2844a27K98J40J8j82k92j57L6J65K39K34M4k27l25k89RL34M25K21k20m03l18l9
$$ -127 171 311 329 147 -145 -302 -266 -101 138 372 416 189 -136 -425 -416 -82 343 564 344 -59 -377 -416
2866d16K55L22J29l5j26j64j65o1M8J52K51J57j21k60k11n7R5K29K32M7r6j49
$$ -416 -161 161 290 255 129 -35 -200 -261 -213 -61 190 347 226 -34 -245 -302 -207 22 254 301 205 56
2888E6k35j44Q8L19K63L5j61l36j93J00J98J48J10o1j05m8r9j44k0J76K24J38
$$ 56 -179 -323 -235 84 347 382 221 -115 -308 -208 -10 138 248 187 82 34 -65 -209 -229 -53 171 309
2910C09l0k10l19j10J42K10J81J21m5k28k37j09RK99L20R7j69k95k31o1J69K73
$$ 309 279 69 -250 -360 -218 -8 173 294 249 21 -216 -325 -316 -17 303 400 231 -64 -295 -356 -187 86
2932H6J76K4j5j89l06j29J08J99L72K25j91m24l42m3K13M12K63j9j89l14l16o1
$$ 86 262 286 271 82 -224 -353 -245 -46 326 551 360 -64 -406 -449 -236 176 439 420 231 -83 -399 -460
2954d60K33L73K66R9k95m63l06J48K97L55K09q1l04k99j59oK18M30K31r3k92m05
$$ -460 -227 146 412 511 216 -247 -553 -405 -108 247 456 375 71 -228 -387 -393 -175 255 486 393 101 -304
2976c04k13J98M07K81L6j29k98k49m9J34J57K64K04j28l32k61p0J22L12K75o3
$$ -304 -517 -319 88 369 405 276 -22 -271 -320 -186 -29 235 439 311 -21 -282 -352 -230 82 357 294
2997B94j96j66j71n2J29J58J27J31j0k65k24m2R9K02J85Q5j56j08p4j67m9J81
$$ 294 98 -68 -239 -291 -162 -4 123 254 244 -21 -245 -287 -188 14 199 284 128 20 -54 -221 -270 -89
3019h9K34J53O1j83l61j75J16K32K35J59r4k75j67j28rJ51L15J78m4j69l52k48
$$ -89 145 298 359 176 -185 -360 -244 -12 223 382 288 13 -154 -282 -291 -140 175 353 309 140 -212 -460
3041d60Q2L09K86J81n2k70l45j75J4K73M70K73j29m44m36k02K22N17M20J9k78
$$ -460 -378 -69 217 398 346 76 -269 -444 -430 -157 313 586 457 13 -423 -625 -403 114 534 553 275
3062B75l72l64j0K89L44K64J13k05m37l82k2K99M45K97l2l34m01k45L2L04M04
$$ 275 -97 -461 -471 -182 162 426 539 334 -103 -485 -507 -208 237 534 502 168 -233 -478 -446 -142 262
3083B62K43p1l18m39k89J94M44L65Q1j91l87k97P2J95J90J40J08q2j82j97j39
$$ 262 505 434 116 -323 -612 -418 26 391 472 281 -106 -403 -331 -136 54 194 302 220 38 -159 -298
3104b98N8K40K50R9o5k18k45q7Q0J48K30J21m3j87k39j25L5K08K65P0j03j89j35
$$ -298 -240 0 250 349 284 66 -179 -266 -186 -38 192 313 270 83 -156 -281 -246 -38 227 297 194 5 -130
3127a30m2qN2J67J35J28o3k55k65r7J34L66K65Pk05l02k29k4K29L23K37K9k20
$$ -130 -172 -180 -128 39 174 302 239 -16 -281 -378 -244 122 387 394 189 -113 -342 -366 -137 186 423 452 232
3150B32m08k73M2L23L97K16j46k83l18j97M1K55L63K48j3k84m84l40J24M19N24
$$ 232 -176 -449 -407 -84 313 529 383 100 -218 -415 -374 -119 244 492 479 195 -289 -629 -505 -86 438
3171D38K22k35n24m39o7L04M47L65J9k55m04l61l1K96M72K88m1l34l90k38J20
$$ 438 660 425 -99 -538 -605 -301 146 511 530 275 -129 -490 -521 -225 247 535 494 160 -230 -468 -348
3192c48L00K90J72j0k08l56k20l2K69M05K50j11l46l52j54J72L28K34L1r7j92
$$ -348 -48 242 414 404 196 -160 -380 -412 -143 262 512 401 55 -297 -451 -279 49 283 314 217 25
3213B5k26j01R2J88J75J37p5k04j83m1K7J42J61Q3K7p3j48k03p7J16K50K15N6
$$ 25 -201 -302 -210 -22 153 290 215 11 -172 -213 -186 -44 117 200 227 154 6 -197 -274 -158 92 307 363
3236C63j80k86j34L3J02J65J73N7j05j36k41j51P1L00K77Q3j03l52k94m7J56K96
$$ 363 183 -103 -237 -204 -102 63 236 293 188 52 -189 -340 -269 31 308 391 288 -64 -358 -405 -249 47
3258D7L15Q2j92l64l13j13K45M81L75k9l48m54k58J05L90L64J76o2l14l70k60
$$ 47 362 444 252 -112 -425 -538 -293 188 563 534 186 -268 -526 -421 -31 333 509 447 133 -237 -497
3279d97R5L42M16K48j33m50m31j75K20M35M07M9k62l55l36r9K21M27L26Q1l02
$$ -497 -402 -60 356 604 471 21 -410 -585 -365 70 477 526 264 -91 -427 -526 -305 122 448 529 227
3300B27m58k59L8L31L39J96o2k80k93j22L6J83L06J92l5k24k93j68N2K70K69N6
$$ 227 -231 -490 -452 -121 218 414 352 72 -221 -343 -307 -124 182 374 339 115 -178 -346 -294 -24 245 301
3322C01n6j83j87j04P4R8J72J19K3j42k03j22l6J50J94Q3j2n7j24j36q0K9J25
$$ 301 245 62 -125 -229 -155 -57 115 234 257 115 -88 -210 -246 -96 98 181 169 112 -12 -148 -228 -199 -74
3345g4K04J44m8k16k36q8P1K62K33M4m8j96k10j71M0K59K98J91q3l72l46j14K36
$$ -74 130 274 226 10 -226 -314 -243 19 252 296 248 52 -158 -329 -289 -30 268 459 376 4 -342 -456 -220
3368b20L22K82Q4k02l51k78p8J84L80L45L0k78m03l34K4L38M29J95l2l24l82j95
$$ -220 102 384 468 266 -85 -363 -441 -257 123 468 498 220 -183 -517 -493 -155 274 469 437 113 -269 -464
3390d64O1K66L99K62o3l77m25j94J48M35M15P4k33l86k91l9K27L12K40O7j78l19
$$ -464 -403 -137 262 524 461 84 -341 -535 -387 48 463 537 304 -82 -373 -412 -185 127 367 434 256 -63
3412f3k71m3K28L12K09lk67k72j23L7J39K15J47K1j44j85k15k5J95K64J16p2j38
$$ -63 -334 -377 -149 163 372 369 102 -170 -293 -256 -117 98 245 266 122 -63 -278 -303 -108 156 272 200 62
3435F2k13o1O0J15J13Q4K9m2r8j20q9J9J81J40P9m6j44j95m7pJ42J48J85rk04
$$ 62 -151 -212 -152 -37 76 160 189 147 49 -71 -160 -141 40 180 259 213 69 -126 -173 -180 -38 110 295 286 82
3460H2k21j95N1K46K59J14j35j69k14j48P3J97K31J75j3k60l44j33Q9K93L52J46
$$ 82 -139 -334 -283 -37 222 336 201 32 -182 -330 -257 -60 171 346 333 73 -271 -404 -315 -22 330 476
3482D76j69l58k70q2J73L40K84O2j77l70l32l8L34L74K34l3l04l74j83J02K55
$$ 476 307 -51 -321 -403 -230 110 394 456 279 -91 -423 -461 -127 247 481 448 144 -230 -413 -311 -56
3503e6K62J95l9k80k98j90L2L12L57J49j72k99k93r2J92K94J86P2j27k82k17j0
$$ -56 206 401 362 82 -216 -406 -374 -62 295 444 272 -27 -320 -412 -220 74 260 332 205 -77 -294 -304
3525c04J77K10K09P3k22k60p9J3J23J61J21n3m2r3j45q5P4J49J25J17j31k03j24
$$ -304 -127 83 292 365 143 -117 -196 -183 -60 101 222 169 127 34 -111 -196 -122 27 152 269 138 -65 -189
3548a89L5N6J13J03K0o0l8q8j35J1J18J46R3J3j29k18l9K6P9J61J44Qj04j68j75
$$ -189 -154 -98 15 118 138 78 40 -48 -183 -172 -54 92 185 198 69 -149 -188 -162 -83 78 222 230 126 -42 -217
3573b17p6K03L01J23k3k02k63j61R7K24J88R2Jk02k74j14K5K13L11J50j30l05
$$ -217 -293 -90 211 334 311 109 -154 -315 -218 6 194 286 287 85 -189 -303 -278 -65 246 396 266 -39
3595c9k45j02J23L26K20M7j17k57k96n2J87L25K12O9k27l53j96Q9K22K97J30p7
$$ -39 -284 -386 -263 63 283 330 213 -44 -340 -392 -205 120 332 401 174 -179 -375 -286 -64 233 363 286
3617B86k15k09j23kK20K65J16n7k11k90j03J27K47J82L1p4k02j60j9N5J18J72
$$ 286 71 -138 -261 -263 -43 222 338 281 70 -220 -323 -196 51 233 264 190 -12 -172 -191 -136 -18 154
3639A54J06j33j59j64l2Q1J84J15j5m8r0r8k8L3P3J06J22k1j46j26m9N4J20R7
$$ 154 260 127 -32 -196 -228 -147 37 152 137 89 -1 -99 -127 -94 -21 85 207 186 40 -86 -135 -81 39 136
3663A36L4pr4q5p3l0P6J20J26L1j51j82j04M1R3J62J16l9j08j18j26l6Q9K19J39
$$ 136 170 163 69 -16 -89 -119 -43 77 203 234 83 -99 -203 -162 -69 93 209 170 62 -56 -182 -218 -129 90 229
3688B29Qj32k40j34O5J83J71J47o8j56j84j15K2J69K76J13o9k42k48q8Q8K77J96
$$ 229 237 105 -135 -269 -204 -21 150 297 229 73 -111 -226 -204 -35 241 354 285 43 -205 -293 -205 72 268
3711B68K8j44j94j66o1J23J81K04L6j63k27j57n2K12K39J14m0j62j86o4LJ42J57
$$ 268 296 152 -42 -208 -269 -146 35 239 275 112 -115 -272 -324 -112 127 241 201 39 -147 -211 -208 -66 91
3734I1J02J4j27j92j24M1J60J92P6p5j52j21l7P8R3R0N6l6o4j43q0L7J12J15K7
$$ 91 193 207 80 -112 -236 -195 -35 157 233 158 6 -115 -152 -74 19 109 165 129 65 -78 -158 -121 -9 106 133
3759A33l4j22o2l5M1J6Q2Q2j0n2j24o9JJ02J07O6n1o3o9l8MK3Q7J08M7m1j37j43
$$ 133 99 -23 -85 -120 -79 -63 19 101 91 39 -85 -154 -153 -51 56 122 71 8 -61 -99 -95 -72 15 123 170 129 -8 -151
3787a51jJ05J23J10j1r2j52p0j0P4J19J43K1j29j89j08K8J36J81O5o4j38j24m9
$$ -151 -152 -47 76 186 175 83 -69 -139 -149 -75 44 187 208 79 -110 -218 -190 -54 127 192 128 -10 -134 -183
3811a83L0R6J09R2jp6j91j14N8J56J83P5r5j79j21j4O9J36J15N1n4j31j58l6J09
$$ -183 -153 -57 52 144 143 67 -124 -238 -180 -24 159 234 139 -40 -161 -175 -106 30 145 196 142 11 -147 -183 -74
3836g4J61J01jj13j34q1K8Q7Q1N1J1p1o8o2n4L4J39J19l3j07j27o7M3J27Q8K3
$$ -74 87 188 187 74 -60 -141 -113 -26 55 106 117 46 -22 -84 -138 -104 35 154 121 14 -113 -180 -137 -10 78 101
3862A01j0n1r1l2pM7J25O5l3q9n3j2K0L8N7jOM1n2j25l9K7J02J03J2r0j21k6j6
$$ 101 91 40 -51 -83 -90 -43 82 147 114 25 -28 -40 -20 18 75 74 80 121 69 -56 -95 -68 34 137 149 59 -62 -88 -104
3891a04N8O7O6mk5n9j07k7Q4N9J02Jj9j16o3j4Q6N7N5O0n5j20q1k6J00J26P8Q
$$ -104 -46 21 87 83 58 -1 -108 -135 -51 8 110 111 92 -24 -87 -101 -15 42 97 157 102 -18 -99 -125 -25 101 179 187
3919A87j30j24n1N1J07P2L2m5o8o6n4MM9J12O6l7j12j06k5M4R1J05Om2k8j06n6
$$ 187 57 -67 -118 -67 40 112 144 99 31 -35 -89 -85 -36 76 142 105 -7 -113 -138 -94 -3 102 108 66 38 -68 -124
3946a24L1J19P9M2l5j50o8L7N8O5O5j5m4q2J0l1J4O3O1J5l5p1p9j3O7M7M8pk1
$$ -124 -93 26 105 147 112 -38 -106 -69 -11 54 119 104 60 -22 -12 -43 -29 34 95 110 75 4 -75 -88 -21 26 74 67 46
3975D6p1m5j0J8L0R2K2o3n5p2mR2Q7mpk6j9m2j3J6L3P5M3m3r3k8pM2P1L7k9l3
$$ 46 -25 -70 -80 -62 -32 60 82 19 -36 -108 -112 -20 67 63 56 30 11 -31 -44 -28 5 80 123 80 -13 -41 -48 -6 65 102 73 40
4007D0jm0o1J7O9M0K9k1j04o8K9O9K8M7j8n1n5j2%j0Q3P8k1k6q2o0KJ17M6oJ0
$$ 40 39 -1 -62 -45 24 64 93 72 -32 -100 -71 -2 26 73 55 4 -51 -63 -63 -73 10 88 67 41 -41 -101 -99 18 64 58 68
4038F8k8o3k1L5l7R9L7M3r6p2k9%J00O1j5m4l1o1J1O0j5J7L0L8j00o4RK3L2P2
$$ 68 40 -23 -44 -9 -46 53 90 133 37 -35 -64 -64 36 97 82 38 7 -54 -43 17 2 19 49 87 -13 -77 -68 -45 -13 59
4068E9J2n8l9rmj5M6M1K1Ol3p0j7J4P6N7oo8m5J4K3J0J6K8J4k4m6j9l5K4M4K4
$$ 59 71 13 -26 -35 -39 -54 -8 33 54 60 27 -43 -60 -46 30 87 81 13 -32 -18 5 15 31 59 73 49 3 -16 -51 -27 17 41
4100D1J0j7m5j6KljK7N1k2m3k7j9L7N2L0m7k6Mk0L6J6J8l7K8J4j7j8j8k2M8M3
$$ 41 51 34 -11 -27 -25 -28 -29 -2 49 27 -16 -43 -62 -25 27 57 10 -16 -12 -32 4 20 38 1 29 43 26 8 -10 -32 16 59
4132E9Pn0kj1l1kM5K9j2J1m2m4k6P3J5J0rm0l4J2M9Ok7oJ8J5ol9MK8M7pj9K4n1
$$ 59 66 16 14 3 -28 -30 15 44 32 43 1 -43 -69 4 19 29 20 -20 -54 -42 7 13 -14 -20 -2 13 7 -32 -28 0 47 40 21 45 -6
4167fj9L6QOJ5K9l2n2K4j9L6L4Pm8l0K6j6L6k3lk9L0L4l8j3k7jM5K0j5o0M1Jj9
$$ -6 -25 11 19 25 40 69 37 -15 9 -10 26 60 67 19 -11 15 -1 35 12 9 -20 10 44 6 -7 -34 -35 10 30 15 -45 -4 -3 -22
4201b2M3LK3o2K4k4j3M9L7k4J3m0j5K7N3pj0m8j1rL4J6k1j4KK0Lk2k9lMK7K0j5
$$ -22 21 24 47 -15 9 -15 -28 21 58 34 47 7 -8 19 72 65 55 7 -4 -13 21 37 16 2 4 24 27 5 -24 -27 -23 4 24 9
4235Ij4j1rL7lMpkj6j0J1K9K5Om2j9LjN1Ml6J4j8L1Lj8mj9M1n%m9kJ1J7J5j6l
$$ 9 -5 -16 -25 12 9 13 6 4 -12 -22 -11 18 43 49 7 -12 -9 -10 41 45 9 23 5 36 39 21 17 -2 39 34 34 -15 -17 -6 11 26 10 7
4273Gj8jmj5JOO1m1jl0rP1j4J6o2J0N3jj7k6RJ8M3%k4k0qML6PRl9OLl0L4j7PJ2
$$ 7 -11 -12 -16 -31 -30 -24 37 -4 -5 -35 -44 27 13 29 -33 -23 30 29 12 -14 -5 13 56 56 32 12 4 8 44 51 60 21 27 30 0 34 17 24 36
4312C6On3l2ML0L3k1lj1j6J6J2l5J1J9L8Nj6o0nJ1P2JNn5PK0Mok6N6K8k5k1l2
$$ 36 42 -11 -43 -39 -9 24 3 0 -11 -27 -11 1 -34 -23 -4 34 39 23 -37 -42 -31 41 42 47 -8 -1 19 23 17 -9 47 75 50 29 -3
4347cj3M7L3Nl3Nl2k0K4rj1J4K3j6l0k5J2J3K5M0l7l5mLQJ5mN2rKm8m9M3L8L6
$$ -3 -16 31 64 69 36 41 9 -11 13 4 -7 7 30 14 -16 -41 -29 -16 9 49 12 -23 -27 -24 -16 -1 -5 47 38 40 -8 -57 -14 24 60
4382F0K8k9k8k3nJ6KK7J2j9J0k9k5l6M7K7J4rn0k1j9M7OrN1qk2m5l2J9O0M2Oo2
$$ 60 88 59 31 8 3 19 21 48 60 41 51 22 -3 -39 8 35 49 40 -10 -31 -50 -3 3 -6 45 37 15 -30 -62 -43 17 59 65 3
4416CQm6RM0L3rJ1lPk0k9JJ9L9J0l9j1l4mJ8L2oK4j3k1n7k3K8M4M1k4k7n1qM7
$$ 3 11 -35 -26 14 47 38 49 46 53 33 4 5 24 63 73 34 23 -11 -15 3 35 29 53 40 19 -38 -61 -33 11 52 28 1 -50 -58 -11
4451a1J4j1L2j3Mqk5rML6M9qj4n3MKL0NL6J5k5n0l8%J4O4M2j2n4m8KJ5l0P0j1
$$ -11 3 -8 24 11 15 7 -18 -27 -23 13 62 54 40 -13 -9 -7 23 28 64 79 54 4 -34 -34 -20 44 86 74 20 -28 -26 -11 -41 29 18
4486A8kK5m4l8l1K5N7M9Qp4m3Jj1P4K3NKk9l3j5mL8L4L7Jl9o7K8K0J9K5Jj9ok8
$$ 18 16 41 -3 -41 -72 -47 10 59 67 -7 -50 -49 -60 14 37 42 44 15 -18 -33 -37 1 35 72 73 34 -33 -5 15 34 59 60 41 35 7
4521Gm0lK4P5K7l9n3o3k0M1N3L8j7j4l5nj9NL1M4Rl1l9j6pM2M8rK6j4l1m5MLL5
$$ 7 -33 -36 -12 63 90 51 -2 -65 -85 -44 9 47 30 16 -19 -24 -43 -38 -7 37 46 15 -24 -40 -47 -5 43 34 60 46 15 -30 -26 -23 12
4556A2M9N3n3n3l7ROO1Lj3j6rpm8J4N5j5L8oo7l4LkL6N6J4j3l7j5m1MO1N8L2m8
$$ 12 61 114 61 8 -29 -20 -14 47 50 37 21 12 5 -43 -29 26 11 49 43 -24 -58 -55 -57 -21 35 49 36 -1 -16 -57 -53 8 66 98 50
4591E0l0m5l8O4L2L0J9oo7l7pRO2M4J7n2m3p1J7OJ06lqk7p8l7J9QQ8N1jk9j16
$$ 50 20 -25 -63 1 33 63 82 76 9 -28 -35 -26 36 80 97 45 2 -69 -52 -46 60 57 49 22 -56 -93 -74 -66 22 73 72 43 -73
4624g3j7N0L2R0K4l7p8n9J9J7L3L8N9nm5r4j7L8O8M5qj0m5n4lJ6M2L4J9m0m2m9
$$ -73 -90 -40 -8 82 106 69 -9 -68 -49 -32 1 39 98 93 48 -46 -63 -25 43 88 80 70 25 -29 -32 -16 26 60 79 39 -3 -52
4656e2j9L9K4O2l3j4m8lQ%L7L6K2ql8k6k2PM6N4j6pm6j0k3L6J7L0L6k7k2o7rJ4
$$ -52 -71 -32 -8 54 21 7 -41 -44 -36 -36 1 37 59 51 13 -13 -35 -28 18 72 56 49 3 -7 -30 6 23 53 89 62 40 -27 -36 -22
4690b2J0P3K8m3j0p6k8RL7L6L8L0q5p6jL9M2N2J0l4n3m2J2K9N2N7LJ0r2p6LM5
$$ -22 -12 61 89 46 36 -40 -68 -59 -22 14 52 82 -3 -79 -80 -41 1 53 63 29 -24 -66 -54 -25 27 84 87 97 5 -71 -68 -23
4722b3R1K2J6k4o9m8k3P9L7N8j0l7o6p9MM1R0L4m3n7m4n4M8N2J8M6pn2l4n8J3
$$ -23 68 90 106 82 13 -35 -58 21 58 116 106 69 3 -76 -72 -31 59 93 50 -7 -51 -105 -57 -5 13 59 52 0 -34 -92 -79
4753g9O5O2M5m1o4l7J1N1J0K3K1l3k0k9m8M2J9O4L0n0k2l6j8L0J6MJ6J4m1m2k5
$$ -79 -14 48 93 52 -12 -49 -38 13 23 46 67 34 14 -15 -63 -21 -2 62 92 42 20 -16 -34 -4 12 16 32 46 5 -37 -62
4784f2qM0Q1k9mj8o8kK0J6N2PROk9m6k4M7P7K6J0m0o3p5ON9N9L4Rm9o5m4k4R9
$$ -62 -70 -30 51 22 18 0 -68 -70 -50 -34 18 25 34 40 11 -35 -59 -12 65 91 101 61 -2 -77 -71 -12 47 81 90 41 -24 -68 -92 7
4818GM6L4k5o9o9NJ3L4P4J8j8m3p2l7J3Q2O1L0o2n2o6%N9P3M0Nm0m0p5K7K7N3
$$ 7 53 87 62 -7 -76 -71 -58 -24 50 68 50 7 -65 -102 -89 -7 54 84 22 -30 -96 -96 -37 36 76 81 41 1 -74 -47 -20 33
4850C3P2j5q4l1m7J9N4N7J1pl1m3j0j5K9M9Olm8n6pJ5N5K8qml5l1j1J6M2JK6K0
$$ 33 105 90 6 -25 -72 -53 1 58 69 62 31 -12 -22 -37 -8 41 47 44 -4 -60 -67 -52 3 31 23 19 -16 -47 -58 -42 0 1 27 47
4884D7k3o3K5kM2L8k4J3pk3k2j6kL8L9J7l1j7r6K9K6J7J5L4n2pm4k2J5M1N3L0
$$ 47 24 -39 -14 -16 26 64 40 53 46 23 1 -15 -17 21 60 77 46 29 -67 -38 -12 5 20 54 2 -5 -49 -71 -56 -15 38 68
4916F8n8m1o6J0N7N5K0Qn3k3n2j4N1R9K7ok6p6j2j1O8N6K5l7l8p9mJ8M4L9M7n6
$$ 68 10 -31 -97 -87 -30 25 45 53 0 -23 -75 -89 -38 61 88 82 56 -20 -32 -43 25 81 106 69 31 -48 -52 -34 10 49 96 40
4948D0k6q1k4N2O2M0qk7n3m6mM4L8M0L6n3o8j9LM5O9J7l1n2k0NJ4K3K9L2k2k7
$$ 40 14 -67 -91 -39 23 63 55 28 -25 -71 -75 -31 7 47 83 30 -38 -57 -54 -9 60 77 46 -6 -26 -21 -7 16 45 77 55 28
4980B8j1m7%N3M8K8n0j7l4k2Qj6J8J7K5ql1m9LM2lL3J0k3k4rP%KM0OoJ1o7mOO0
$$ 28 17 -30 -30 23 71 99 49 32 -2 -24 -16 -32 -14 3 28 20 -11 -60 -57 -15 -18 15 25 2 -22 -31 -24 -24 -22 18 24 18 29 -38 -42 -36 24
5017B4L6Lj6l3k8J8nL2L6K7k5m4o8l3M7M9P6m4k7l4m7j9K8N5M2%l0p2m4KL9R9
$$ 24 60 63 47 14 -14 4 -1 31 67 94 69 25 -43 -76 -29 20 96 52 25 -9 -56 -75 -47 8 50 50 20 -52 -96 -94 -55 44
5049D4K0pn9n4k7M6L9L8L8Qm6q4JNO5N5Qm0k7n0j5QP5J1K4m6m1j9n7N2N3L8k1
$$ 44 64 57 -2 -56 -83 -37 2 40 78 86 40 -44 -43 -38 27 82 90 50 23 -27 -42 -34 41 52 76 30 -11 -30 -87 -35 18 56 35
5082C5m6k4j0k6N4J7K7oPn0m4J6OM0L7K1n4o%j1%L5QJ2J5m8j0j6J1J4L9NOl4k8
$$ 35 -11 -35 -45 -71 -17 0 27 21 28 -22 -66 -50 -44 -4 33 54 0 -6 -6 -17 -17 18 26 38 53 5 -5 -21 -10 4 43 48 54 20 -8
5117hq%k3N6L5j6m0l5l4PL7N1Q%l9l8j1QL3J5M1Qn0o4K2k7R7L4L7k9o1l8JK5L2
$$ -8 -16 -16 -39 17 52 36 -4 -39 -73 -66 -29 22 30 30 -9 -47 -58 -50 -17 -2 39 47 -3 -67 -45 -72 25 59 96 67 6 -32 -31 -6 26
5152B6K3M6l5l3o5k0M5L2J4L3l9q0j2nK6O3Mprj7p5J9N5O3j6J5o5o6K1M1J0L3
$$ 26 49 95 60 27 -38 -58 -13 19 33 66 27 -53 -65 -70 -44 19 23 16 7 -10 -85 -66 -11 52 36 51 -14 -80 -59 -18 -8 25
5184B5L3l4k0k8J0MM2PK8k3l6j1k0L5J5J8j2J6m3Km1J3KM6J2n5Kj6l0J9OM9k8
$$ 25 58 24 4 -24 -14 -10 32 39 67 44 8 -3 -23 12 27 45 33 49 6 8 -33 -20 -18 28 40 -15 -13 -29 -59 -40 -34 15 -13
5217a3J7Ll2k5JL3M1kJ0Kl5k6kJ5K9N9k8j5j5m5kM4L2J6K6o1l5l3K4nN2L2Nm9
$$ -13 4 7 -25 -50 -49 -16 25 23 33 35 0 -26 -28 -13 16 75 47 32 17 -28 -30 14 46 62 88 27 -8 -41 -17 -22 30 62 67 18
5251A8o2k7J0O2K0K0l1k1m7j6K6O2J3J1j1k1k8l7K3N3L6J6l2jq5K1M0L5L1k2l0
$$ 18 -44 -71 -61 1 21 41 10 -11 -58 -74 -48 14 27 38 27 6 -22 -59 -36 17 53 69 37 36 -49 -28 12 47 78 56 26
5282B6j6m7MK2L5J2J5m1m1m0K9L0K9jj5pj7j2rJ8NN7pk7k3j3jM2L9j9%jll0PJ1
$$ 26 10 -37 -33 -11 24 36 51 10 -31 -71 -42 -12 17 16 1 -6 -23 -35 -44 -26 -21 36 29 2 -21 -34 -35 7 46 27 27 26 23 -7 0 11
5318A1J2J3lNk3k3K0j4K1K4Prk2l9nj0J9M3Kj9m4MJJK9MoJ0qm8mQL0O5j2k6k8
$$ 11 23 36 33 38 15 -8 12 -2 19 43 50 41 19 -20 -25 -35 -16 27 29 10 -34 -30 -29 -28 1 5 -1 9 1 -47 -51 -43 -13 52 40 14 -14
5355a4jl3M8M4jJ1k1l4k9%L9J9L2k2k9l6k2lN6J9J9l6k1k7j2QK7L6J7k5l7l2k6
$$ -14 -15 -48 0 44 43 54 33 -1 -30 -30 9 28 60 38 9 -27 -49 -52 4 23 42 6 -15 -42 -54 -46 -19 17 34 9 -28 -60 -86
5388h6M9N0L1m1j4JkrJM9OJ5j5l7j5jJ9M0J2Rl7ol2J9jmJ4Mkl0MJk4M5Nql7Pm
$$ -86 -37 13 44 3 -11 -10 -12 -21 -20 29 35 50 35 -2 -17 -18 1 41 53 62 25 19 -13 6 5 1 15 19 17 -13 -9 -8 -32 13 18 10 -27 -20 -24
5427b4Ql0M3pJ4Kk7j1qM5KJ8jNqj6npJ6J5M3l1rl5J5l0M1Nk0Okk0KmML8Pql4k7
$$ -24 -16 -46 -3 -10 4 6 -21 -32 -40 5 7 25 24 29 21 5 0 -7 9 24 67 36 27 -8 7 -23 18 23 3 9 7 -13 -11 -15 -11 27 34 26 -8 -35
5467c5j0LK0M0MKl8%l6L6K8L2j7j1m6LJ0L3QK8kk2k7JK6j2ML5l4j0k4j5J8rJ8
$$ -35 -45 -42 -22 18 22 24 -14 -14 -50 -14 14 46 29 18 -28 -25 -15 18 26 54 52 30 3 4 30 18 22 57 23 13 -11 -26 -8 -17 1
5502AL1j1m7J1k0QKL4j3J3J1p0J5j6M6JJ6nk1Mo%L8j7%J7rj0k1J4K6K1nj5Kjl8
$$ 1 32 21 -26 -15 -35 -27 -25 9 -4 9 20 -50 -35 -51 -5 -4 12 7 -14 -10 -16 -16 22 5 5 22 13 3 -18 -4 22 43 38 23 25 24 -14
5539a4L2oj6J7pq%qk9M0qK3j0l1oRj1J4ppJ8Ok2K1oJ1K9J8l8J3Ml8K1PJ8KLnj6
$$ -14 18 12 -4 13 6 -2 -2 -10 -39 1 -7 16 6 -25 -31 -22 -33 -19 -26 -33 -15 -9 -31 -10 -16 -5 24 42 4 17 21 -17 4 11 29 31 34 29 13
5578A3l1KK7J1Jk3Mm4K0NJ0K2lJ5l0k5qML9rJ5l3Pk3mL8j8K0jqrjJK1OK8%m1J3
$$ 13 -18 -16 11 22 23 0 4 -40 -20 -15 -5 17 14 29 -1 -26 -34 -30 9 0 15 -18 -11 -34 -38 0 -18 2 1 -7 -16 -17 -16 5 11 39 39 -2 11
5617A1k9K6K1noKlqjj6J6MJ4rl4J7k4j7L9j5OpJ4jj5LJ0j0LL6Km5RJ6J4NKqRj9
$$ 11 -18 8 29 24 18 20 17 9 8 -8 8 12 26 17 -17 0 -24 -41 -2 -17 -11 -18 -4 -5 -20 -17 -7 -17 -14 22 24 -21 -12 4 18 23 25 17 26 7
5657GKNk2K2K7j8J0k3k9N5k0Koo%j3j4j0J0J2M0j9n7K4KJ5k1K2j2QmoK1j1lJ8
$$ 7 9 14 -8 14 41 23 33 10 -19 36 16 18 12 6 6 -7 -21 -31 -21 -9 31 12 -45 -21 -19 -4 -25 -3 -15 -7 -11 -17 4 -7 -10 8
5693HK5j8j5Kj3M1k2K3k9M8nj6l1K8LJ6Lk4Nolj2k6K3kMm3J3j2J1PJK2l0K1Jj9
$$ 8 33 15 0 2 -11 30 8 31 2 50 45 29 -2 26 29 45 48 24 29 23 20 8 -18 5 3 7 -36 -23 -35 -24 -17 -16 6 -24 -3 -2 -21
5730b1K4Jj8Mj4OMj6K6L4rmJ8j7j1K8pj5mk6J1K4j0j0NJ6rqk0J3k0K2J8j2nj7
$$ -21 3 4 -14 -10 -24 -18 -14 -30 -4 30 21 17 35 18 7 35 28 13 9 -17 -6 18 8 -2 3 19 10 2 -18 -5 -25 -3 15 3 -2 -19
5766a9K1j9jkJ2Kj1J0Ok1MK8j7J3J6mj7PK3l9J5PJJ8lkn5L1qJ6%k2M7j8k1lkk
$$ -19 2 -17 -18 -20 -8 -6 -17 -7 -1 -22 -18 10 -7 6 22 18 1 8 31 -8 7 14 15 33 30 28 -27 4 -4 12 12 -10 37 19 -2 -5 -7 -9
5804ij8K3k7kmmL1nrJ7j8K4k4J2J1lPj2K7%k5JJ3J2PN%j0lnj7J5MJ2l0%jK8j3
$$ -9 -27 -4 -31 -33 -37 -41 -10 -15 -24 -7 -25 -1 -25 -13 -2 -5 2 -10 17 17 -8 -7 6 18 25 30 30 20 17 12 -5 10 14 26 -4 -4 -5 23 10
5843A0l0MJ0l2RK9kj2%J4J1ol7K0rM7k5oJ9j9nJ9j8K5qPj7RJ6rRk5K5k9J6j2J4
$$ 10 -20 -16 -6 -38 -29 0 -2 -14 -14 0 11 5 -32 -12 -21 26 1 -5 14 -5 -10 9 -9 16 8 15 -2 7 23 14 23 -2 23 -6 10 -2 12
5880A2Mmrj7J5JJj9J4l0M1k2onJ3rK3oj3K9j9J3RMk4mJ5J4k4JQK8j0k9M1k2kR
$$ 12 16 12 3 -14 1 2 3 -16 -2 -32 9 -13 -19 -24 -11 -20 3 -3 -16 13 -6 7 16 20 -4 -8 7 21 -3 -2 6 34 24 -5 36 14 12 21
5918B1j6mjK6kj8J1Pl2jKJ8j4l6J0J9kOK1k9J4jMnj0J7nnPj6K7%j2K5k5OpK1k4
$$ 21 5 1 0 26 24 6 17 24 -8 -9 -7 11 -3 -39 -29 -10 -12 -6 15 -14 0 -1 3 -2 -12 5 0 -5 2 -14 13 13 1 26 1 7 0 21 -3
5957cK1NKjkk1J5j1Qjk0K1JmJ7j9l4N6l2RNm1J0Kk0J1J5QlJl5L3J8m0L0J9k6p
$$ -3 18 23 25 24 22 1 16 5 13 12 -8 13 14 10 27 8 -26 30 -2 7 12 -29 -19 -17 -37 -26 -11 -3 -6 -5 -40 -7 11 -29 1 20 -6 -13
5995a3MK5Ljmk9K7K7k0m1K8Kk1J2Rok1J3nlL4l3Qj8nLj6M2l8L3k3J7mPJ6LOj8
$$ -13 -9 16 19 18 14 -15 12 39 19 -22 6 8 -13 -1 8 2 -19 -6 -11 -14 20 -13 -5 -23 -28 -25 -41 1 -37 -4 -27 -10 -14 -7 9 12 18 0
6033@J9mj4j4J0k4N8k3Lj9J9j5M6k1k1J0%mMkj4mK7k0j3%J1j4J2j8JJ7jpk7J2
$$ 0 19 15 1 -13 -3 -27 31 8 11 -8 11 -4 42 21 0 10 10 6 10 8 -6 -10 17 -3 -16 -16 -5 -19 -7 -25 -24 -7 -8 -15 -42 -30
6069c0L4JJ9%qj9l5K9J3rJ5k2lJ4LJ3ojnjJ3rnLPMj6Rj1k0K1k3K7lK5k4lj7Nn
$$ -30 4 5 24 24 16 -3 -38 -9 4 -5 10 -12 -15 -1 2 15 9 8 3 2 15 6 1 4 11 15 -1 8 -3 -23 -2 -25 2 -1 24 0 -3 -20 -15 -20
6109b0K4Nk1k2K2jk4L5rK7j5K1k3NJ1j2K3nj8J3j8K1ok3OJ5J0Jl2nJ0kKRj7j4
$$ -20 4 9 -12 -34 -12 -13 -37 -2 -11 16 1 22 -1 4 15 3 26 21 3 16 -2 19 13 -10 -4 11 21 22 -10 -15 -5 -7 -5 4 -13 -27
6145b7kNJ7j4pK6j5Lk8K1MJjJ5lJ8lk6RLkK4JKj8Kj1J7J2kk0kmK5J9l9Pj2J2j2
$$ -27 -29 -24 -7 -21 -28 -2 -17 -14 -42 -21 -17 -16 -17 -2 -5 13 10 -16 -7 -4 -6 18 19 21 3 5 -6 11 23 21 1 -1 -5 20 39 0 7 -5 7 -5
6185epJ0%K1k1MOn0M2k4K8k7K2oK0m8K0L5MpJ8k3J7j8K2k3J6l3M9k5J4Kl9pjN0
$$ -5 -12 -2 -2 19 -2 2 8 -42 0 -24 4 -23 -1 -7 13 -35 -15 20 24 17 35 12 29 11 33 10 26 -7 42 17 31 33 -6 -13 -14 36
6221C6l0K1k3nj4LLLj9J6nj4j3J5%MPJ8J0k3MJJPJ1ROk0k4oL3nPJ8j0j2LkQj3
$$ 36 6 27 4 -1 -15 -12 -9 -6 -25 -9 -14 -28 -41 -26 -26 -22 -15 3 13 -10 -6 -5 -4 3 14 23 29 9 -15 -21 12 7 14 32 22 10 13 11 19 6
6261FJ9l1mJ4k2k1J7K0j0NJ4l4nJ3pL5j9Qnj9lMK1K5Pj2j8PpMJ3NoLol%NqK5J3
$$ 6 25 -6 -10 4 -18 -39 -22 -2 -12 -7 7 -27 -32 -19 -26 9 -10 -2 -7 -26 -29 -25 -4 21 28 16 -2 5 -2 2 15 20 14 17 11 8 8 13 5 30 43
6302D3n1K7j5j5OMJ4lJ3k9J0k2j6J6K1nJ1j7j1k8L1J1jkoNkOLK7j4j4L5j7QrK7
$$ 43 -8 19 4 -11 -5 -1 13 10 23 -6 4 -18 -34 -18 3 -2 9 -8 -19 -47 -16 -5 -6 -8 -14 -9 -11 -5 -2 25 11 -3 32 15 23 14 41
6339D1okJ5j8Pk9J3j7RJ7Rjm6%k0K3J3%rJ3j3j6J0mnmL3KMl8%K1kmQOj3qPrK6
$$ 41 35 33 48 30 37 8 21 4 13 30 39 38 -8 -8 -28 -5 8 8 -1 12 -1 -17 -7 -11 -16 -20 13 15 19 -19 -19 2 0 -4 4 10 -3 -11 -4 -13 13
6380A3J3J8l3KMk1MJ4K1J1Qp2qJ4j4L8QQk1l2KMJ2K9k3J7qk0pKK7jJj7K2l7JJ
$$ 13 26 44 11 13 17 -4 0 14 35 46 54 -18 -26 -12 -26 12 20 28 7 -25 -23 -19 -7 22 -1 16 8 -12 -19 -17 10 9 10 -7 15 -22 -21 -20
6418b0L1M6l9kJ0m1K7k7L7J1mok9J8%OkK4l3J6n5K6j3k2M1Lpk9K8Km4J3K8J9k7
$$ -20 11 57 18 16 26 -15 12 -15 22 33 29 23 -6 12 12 18 16 40 7 23 -32 -6 -19 -41 0 3 -4 -33 -5 -3 -47 -34 -6 13 -14
6453a4lJ4Lj5R%J8K5j7oj1k2MK8oL4j0l0j6J3J1%J3K2kn4J0j8l0N1J2L%l3j4q
$$ -14 -17 -3 0 -15 -6 -6 12 37 20 14 3 -19 -15 13 7 41 31 1 -15 -2 9 9 22 44 42 -12 -2 -20 -50 1 13 16 16 -17 -31 -39
6489c9j0M5L3l3J9n2RnJ5K6J1%nj5j5J9MJ7%J8m0j8R%K2j4M1On6qjJ4K5j0J5p
$$ -39 -49 -4 29 -4 15 -37 -28 -33 -18 8 19 19 14 -1 -16 3 7 24 24 42 2 -16 -7 -7 15 1 42 48 -8 -16 -17 -3 22 12 27 20
6525B0jm4PJ2lLnL0j0k7j2K0j9J8J2Nj0Kj0qJ7K8mK4k4k4L4m3J4K0%nNplk2JL5
$$ 20 19 -25 -18 -6 -9 -6 -11 19 9 -18 -30 -10 -29 -11 1 6 -4 -2 -12 -20 -3 25 21 45 21 -3 31 -12 2 22 22 17 22 15 12 -10 -9 26
6563B6mj1J%j3pJ1j9K3PKk3k1J4J2j4L4j2Qk2mOK4jQK0j0k8k3J7J1J5JK1l6k0
$$ 26 22 11 12 12 -1 -8 3 -16 7 14 16 -7 -28 -14 -2 -16 18 6 14 -8 -12 -6 18 17 25 45 35 7 -16 1 12 27 28 49 13 -7
6599gj0%K8QK5l6ok5oJJ5J1Rj5j7J4qJ2QK5k2Mk0J4k2QJ3PKok3J6OJ6PJ0J0k1
$$ -7 -17 -17 11 19 44 8 2 -23 -29 -28 -13 -2 7 -8 -25 -11 -19 -7 1 26 4 8 -12 2 -20 -12 1 8 10 4 -19 -3 3 19 26 36 46 25
6637B5oj8K3NnK5k9Jj2nj5JJ0NpJ7j0k4KQKlj2L0lj3Nl2M8oPk4j3%K1kNK7lQk3
$$ 25 19 1 24 29 24 49 20 21 9 4 -11 -10 0 5 -2 15 5 -19 -17 -9 -7 -10 -22 8 5 -8 -3 -35 13 7 14 -10 -23 -23 -2 -4 1 28 25 33 10
6678A0RJ0j5K3k1M6k2n0J6k0J6K2J1k9J0l6Nj4LJ5K2j5Lj5j0N%j3M2K2l0j6j3
$$ 10 19 29 14 37 16 62 40 -10 6 -14 2 24 35 6 16 -20 -15 -29 -26 -11 11 -4 -1 -16 -26 -21 -21 -34 8 30 0 -16 -29
6711b9kL1J6Kol5K6mJ6kNK5jl0J0k3K7MMJ7l6jol1L6j0J8j4jk3qO%K0NlMok1j5
$$ -29 -31 0 16 18 12 -23 3 -1 15 13 18 43 42 12 22 -1 26 30 34 51 15 14 8 -23 13 3 21 7 6 -17 -25 -19 -19 1 6 3 7 1 -20 -35
6751c5L7qrK4Lk4K0nL8l8J5K0J6l8JoNk4K7L8k4m3L1Lj9Jl3N7Kj2rj8k7M0lK4
$$ -35 2 -6 -15 9 12 -12 8 3 41 3 18 38 54 16 17 11 16 -8 19 57 33 -10 21 24 5 6 -27 30 32 20 11 -7 -34 6 3 27
6787B7k9J7l9J7j8M1Rk2Lj1j9kJ5RJ4L2k5K2n2%KK6L2Ok6k4j3lK1j5M9j6k3j3
$$ 27 -2 15 -24 -7 -25 16 25 3 6 -5 -24 -26 -11 -2 12 44 19 41 -11 -11 -9 17 49 55 29 5 -8 -11 10 -5 44 28 5 -8
6821hj9LJ4J9Look6qj6K6J6J1J3j8nj6NK0K7rj8k0J1klJ3L9k7K2j7j5njM0j5O
$$ -8 -27 -24 -10 9 12 6 0 -26 -34 -50 -24 -8 3 16 -2 -7 -23 -18 2 29 20 2 -18 -7 -9 -12 1 40 13 35 18 3 -2 -3 37 22 28
6858B8m3J4k0K6pj0K2l1M8l5%mj2J1k1K9pk%k0QK7jPjPk4J5kNOJ3kqmj9K2KJ1
$$ 28 -15 -1 -21 5 -2 -12 10 -21 27 -8 -8 -12 -24 -13 -34 -5 -12 -14 -14 -34 -26 1 0 7 6 13 -11 4 2 7 13 26 24 16 12 -7 15 17 28
6897B8K3m3Lj9J7j2QpK5k5Lj3J9k6oM6o%k5Rmj4J9nM5l2k3KoOL2kRKl0J8j4MP
$$ 28 51 8 11 -8 9 -3 5 -2 23 -2 1 -12 7 -19 -25 21 15 15 -10 -1 -5 -19 0 -5 40 8 -15 -13 -19 -13 19 17 26 28 -2 16 2 6 13
6936A3JPKrooj1L0k3J9Kl4J3jJ0J4k7mK1k9mjK0j1J5Rl0K5k0J5J1LJ2nJj6J5j1
$$ 13 14 21 23 14 8 2 -9 21 -2 17 19 -15 -2 -3 7 21 -6 -10 11 -18 -22 -23 -3 -14 1 10 -20 5 -15 0 11 14 26 21 22 6 21 10
6974A0j4K5nK7k5n%J5j6jK9j1j9NNl5MK1Krj3jmNkqK5k5L1k5PJMQJ1mL7l6lk1
$$ 10 -4 21 16 43 18 13 13 28 12 11 40 29 10 15 20 -15 -11 10 12 3 -10 -11 -15 -10 -12 -20 5 -20 11 -14 -7 -6 -2 6 17 13 50 14 11 -10
7014a0K8J0pJ5mk2NoJ0j4N1pl0j2j8J8lJ4jj5J5l7J5kJ8LJ5l8K7Lm1RJ3J0j3J9
$$ -10 18 28 21 36 32 10 15 9 19 5 56 49 19 7 -11 7 4 18 17 2 17 -20 -5 -7 11 14 29 -9 18 21 -20 -11 2 12 -1 18
7050A8l8J6J1nj2K0L2k3qJK1oj1ORk7J5Nj8%j6J0j4K2Ok7J7K1l1%J3klj3K3j6
$$ 18 -20 -4 7 2 -10 10 42 19 11 12 33 27 16 22 31 4 19 24 6 6 -10 0 -14 8 14 -13 4 25 -6 -6 7 5 2 -11 12 -4
7086dJ4LLj2k6K7j7k0N3NnoJ0j6MJ1MrLLj4J6j2NK0J1l2K7m0j3J8j0%Nlj7K6j5
$$ -4 10 13 16 4 -22 5 -12 -32 21 26 21 15 25 9 13 24 28 19 22 25 11 27 15 20 40 51 19 46 6 -7 11 1 1 6 3 -14 12 -3
7124cqkoL7j1J8m2J5K1j2NnK2l6K1ppK8l2L9Jlk4lJ7mJ0j4J4Nj0k6JQRJ5m7J8
$$ -3 -11 -13 -19 18 7 25 -17 -2 19 7 12 7 29 -7 14 7 0 28 -4 35 36 33 9 6 23 19 29 15 29 34 24 -2 -1 7 16 31 -16 2
7162BJ2k6j8K9J3k3K8k0j4j1L2rJ5J9k9RkRrJK0Nl2K5oplj7pM3Nl1OLK2k3LJJ5
$$ 2 14 -12 -30 -1 12 -11 17 -3 -17 -28 4 -5 10 29 0 9 7 16 7 8 28 33 1 26 20 13 10 -7 -14 29 34 3 9 12 34 11 14 15 30
7201C0j8jroK3j9Lmj9J1Qj7J9KJ2m7K1j7K8j7J9L3k3j6K4nmJ7Pj4RJj9rJ6m%j0
$$ 30 12 11 2 -4 19 0 3 -1 -20 -9 -1 -18 1 3 15 -32 -11 -28 0 -17 2 35 12 -4 20 15 11 28 35 21 30 31 12 3 19 15 15 5
7239EL5m0J4Rl4J1QPkj4Pj1nklJ0K9j7kj7pK6K0ok2RkK0k9J6J5moj6jJ7qJ8J2
$$ 5 40 0 14 23 -11 0 8 15 13 -1 6 -5 -10 -12 -15 -5 24 7 5 -12 -19 7 27 21 -1 8 6 26 -3 13 28 24 18 2 1 18 10 28 40
7278D0Ol5L2rl2J7%nJ2l3K6m6L5l2K1J3Lj6Qk9K4lnK6Mk1lnJ7konM6k1mJ4Jj9
$$ 40 46 11 43 34 2 19 19 14 26 -7 19 -27 8 -24 -3 10 13 -3 5 -24 0 -3 -8 18 22 1 -2 -7 10 8 2 -3 43 22 18 32 33 14
7316A4%K7l8L6j4j8L5l3nK7oj6L2l6j1JrJ5k5J8mjlLOpL2rJ4j2kqPmJ3J9l0Pj0
$$ 14 14 41 3 39 25 7 42 9 4 31 25 9 41 5 -6 -5 -14 1 -24 -6 -10 -11 -14 -11 -5 -12 20 11 25 13 11 3 10 6 19 38 8 15 5
7355EK6j4J4j4J4LLk2kJ0pk1L7k8J7m4J3L3k3PnJ1j4k0jqRJ0J7jj9oL2j4RK%l
$$ 5 31 17 31 17 31 34 37 15 13 23 16 -5 32 4 21 -23 -10 23 0 7 2 13 -1 -21 -22 -30 -21 -11 6 5 -14 -20 12 -2 7 9 9 6
7393FlK1k7J8j1K7J3k1k3K1Jj9L1j8nMj8J2qJ6l1L2k3Pkj6mJ5JkJ3k2J6J3J%k3
$$ 6 3 24 -3 15 4 31 44 23 0 21 22 3 34 16 11 15 -3 9 1 17 -14 18 -5 2 0 -16 -20 -5 -4 -6 7 -15 1 14 15 15 -8
7430hqL2Jl7J9j2PL5m0K6RnPJ7n0J8J0j3pLjQk4J6MkoQj5lJ1k0K2k1J4Mok8K2
$$ -8 -16 16 17 -20 -1 -13 -6 29 -11 15 24 19 26 43 -7 11 21 8 1 4 3 11 -13 3 7 5 -1 7 -8 -11 0 -20 2 -19 -5 -1 -7 -35 -13
7469a3J5ll7K5OJ1plkK0J9m2NRPpJ9jqMNk9J9j3K2l5R%k9N2jk3K0k0PqMmqQPj2
$$ -13 2 -1 -38 -13 -7 4 -3 -6 -8 12 31 -11 -6 3 10 3 22 21 13 17 22 -7 12 -1 21 -14 -5 -5 -34 18 17 -6 14 -6 1 -7 -3 -7 -15 -7 0 -12
7511a2j3J4qK7j2RpOQJ1nj6J6j2%J8mJ1j4PrNj9K2k5RqK2Ql8J7j0K1l2J7pNpo
$$ -12 -25 -11 -19 8 -4 5 -2 4 12 23 18 2 18 6 6 24 20 31 17 24 15 20 1 23 -2 7 -1 21 29 -9 8 -2 19 -13 4 -3 2 -5 -11
7550a1J0j1j9J3K6oj3j2K5lj9J0J1KK4j7oNKnPKnL0Ll9J1j1J3l3J2L3n3J1L0j4
$$ -11 -1 -12 -31 -18 8 2 -11 -23 2 -1 -20 -10 1 3 27 10 4 9 11 6 13 15 10 40 43 4 15 4 17 -16 -4 29 -24 -13 17 3
7586CJ4k4rL6k4LKKj4j3J4K2m6J2PnKJ1jKnJ0N1n0kJ6J1mqj9K0J7l0rJ2J8j5K5
$$ 3 17 -7 -16 20 -4 -1 1 3 -11 -24 -10 12 -34 -22 -15 -20 -18 -7 -8 -6 -11 -1 50 0 -2 14 25 21 13 -6 14 31 1 -8 4 22 7 32
7624C2l2K6j9j3mJ1j0J2j4nM7k9j1JJ3plj2J2Kk0J1PrJ8jK8j6noj2J2J5MkJj8
$$ 32 0 26 7 -6 -10 1 -9 3 -11 -16 31 2 -9 -8 5 -2 -5 -17 -5 -3 -23 -12 -5 -14 4 3 31 15 10 4 -8 4 19 23 21 22 4
7661DK5pmj4Mnmj6J7k8K4J6k3Rk8K2nk9K7jJ4J5j2j3Qk9M8k1lJ9j4J7j5K8l7J8
$$ 4 29 22 18 4 8 3 -1 -17 0 -28 -4 12 -11 -2 -30 -8 -13 -42 -15 -16 -2 13 1 -12 -4 -33 15 -6 -9 10 -4 13 -2 26 -11 7
7697GjK7k0OjK2l0PK0k1Pj8lmOJ4l0J0qk7RL3J1k0NPk5J4J4k7J7Nj7Lj0K0J2j
$$ 7 6 33 13 19 18 40 10 17 37 16 23 5 2 -2 4 18 -12 -2 -10 -37 -28 5 16 -4 1 8 -17 -3 11 -16 1 6 -11 -8 -18 2 14 13
7735A3j4J5JPk6kJ7j7J1jJ9Kqk7RnK7j%l8QJ6Jl0L1j2PLqLpK1j5J0Ok7KJ7l4L1
$$ 13 -1 14 15 22 -4 -6 11 -6 5 4 23 25 17 -10 -1 -6 21 20 20 -18 -10 6 7 -23 8 -4 3 6 -2 1 -6 15 0 10 16 -11 -9 8 -26 5
7775EJ1Nk8K3mpJK1J5mmk4J0mJ2j2kJ4k1J0rjk9K2Nk5j2K9k3K1J5k7J2lKj4K1
$$ 5 16 21 -7 16 12 5 6 27 42 38 34 10 20 16 28 16 14 28 7 17 8 7 -22 0 5 -20 -32 -3 -26 -5 10 -17 -5 -8 -6 -20 1
7812Al0L2nK1Kk1lRJ2kJ6j5j8L7m1OnK5J1j7mJ2rk8NK4k0OPqJkj3OnM5k5j8Km
$$ 1 -29 3 -2 19 21 0 -3 6 18 16 32 17 -1 36 -5 1 -4 21 32 15 11 23 14 -14 -9 15 -5 1 8 0 1 -1 -14 -8 -13 32 7 -11 -9 -13
7852a3Mj7K0J6Rk9K0k0J2J6k5K2mj1nNK6qJ4nj7J3k0K1j2L1k9j4J5j3rj7%L8k5
$$ -13 -9 -26 -6 10 19 -10 10 -10 2 18 -7 15 11 0 -5 0 26 18 32 27 10 23 3 24 12 43 14 0 15 2 -7 -24 -24 14 -11
7887a1LjpJmj4K2%J7j2LK6j4j9rL9k1K4J1k8LJ0j6K9k5oj3J8J2mPk5K2J6k6j1
$$ -11 -8 -9 -16 -15 -19 -33 -11 -11 6 -6 -3 23 9 -10 -19 20 -1 23 34 6 9 19 3 32 7 1 -12 6 18 14 21 -4 18 34 8 -3
7923cNJJQj2oJ6j2j4K0k3jnL2j3J1m3L5QoJ7j2j3NJ7J0k1mOkoQoJ8j0kJ6j1j2
$$ -3 2 3 4 12 0 -6 10 -2 -16 4 -19 -20 -25 7 -6 5 -38 -3 5 -1 16 4 -9 -4 13 23 2 -2 4 2 -4 4 -2 16 6 4 20 9 -3
7962cJ0l0K5NKql4J8K5k7j8K7J0j5J1j0L0l1JRK1j8j4mJJ8l2L1MJ5k1J0mJ4Rj
$$ -3 7 -23 2 7 9 1 -33 -15 10 -17 -35 -8 2 -13 -2 -12 18 -13 -12 -3 18 0 -14 -18 -17 1 -31 0 4 19 -2 8 4 18 27 26
7998B6J6j9j5mK4k5J0mJJ7k3%Oj2J0lj5oJ2J3j4joR%K2m0j2L7j1K5J0k2nJ1k2
$$ 26 42 23 8 4 28 3 13 9 10 27 4 4 10 -2 8 5 -10 -16 -4 9 -5 -6 -12 -3 -3 19 -21 -33 4 -7 18 28 6 1 12 -10
8034a0k0M3R%krk2K3K5nj9L4j9j2j1m2L8J5oJkk1j5K1j1LJ1%Ok1J9j6mL4k2PP
$$ -10 -30 13 22 22 20 11 -11 12 37 32 13 47 28 16 5 -37 1 16 10 11 9 -12 -27 -6 -17 -14 -3 -3 3 -18 1 -15 -19 15 -7 0 7
8071GnjRk6L8jj3k0J8k2MK0K8l0jqk1K3rK8j9qJ8j3Oj9qK2j6K6j4J0k6L3Mj0j8
$$ 7 2 1 10 -16 22 21 8 -12 6 -16 -12 8 36 6 5 -3 -24 -1 -10 18 -1 -9 9 -4 2 -17 -25 -3 -19 7 -7 3 -23 10 14 4 -14
8108a4K3Lj2J0j3rpK4nN%j3M0Kn4MM5m3M6k0j4J9j4mJ8j5K0kk8jJ0k2N2k5J2j2
$$ -14 9 12 0 10 -3 -12 -19 5 0 5 5 -8 32 34 -20 -16 29 -14 32 12 -2 17 3 -1 17 2 22 20 -8 -9 1 -21 31 6 18 6
8144Fj4rJ8Pj1L2l4j7%M4j3lRRj4k0K7Lk2L3l5K3KOl8K2NLj2J4k8J9Pj7J4j9K3
$$ 6 -8 -17 1 8 -3 29 -5 -22 -22 22 9 6 15 24 10 -10 17 20 -2 31 -4 19 21 27 -11 11 16 19 7 21 -7 12 19 2 16 -3 20
8181B0k8k0K1kj7K7k9J9nK4
$$ 20 -8 -28 -7 -9 -26 1 -28 -9 -14 10
8191A0
$$ Imaginary data points
##PAGE= N=2
##DATA TABLE= (X++(I..I)), XYDATA
0@%%%%%%%%%%%%%%%%%%%%%%%%%%%Rl3O7q6Q6q6Q6q6Q6r7J20j52J72j72J92k17
$$ 0 0 0 0 0 0 0 0 0 0 0 0 0 0 0 0 0 0 0 0 0 0 0 0 0 0 0 0 9 -24 43 -43 43 -43 43 -43 43 -54 66 -86 86 -86 106 -111
43a11K40k68K90l22L64l90M32m80N24n83O37p07P91q77R72j086J228j400J614
$$ -111 129 -139 151 -171 193 -197 235 -245 279 -304 333 -374 417 -460 512 -574 654 -746 868
62H68j888K242k737L468m646O869j2369M8908L7970k09528l9031J09010k8983
$$ 868 -1020 1222 -1515 1953 -2693 4176 -8193 40715 78685 -130843 -169874 -60864 -89847
75h9847L2039J73084k8141j28840K9716K5586j9897J07440N6066j23587r4705
$$ -89847 -57808 115276 87135 -41705 -11989 13597 -6300 101140 157206 33619 -61086
86f1086l6363o3032M6916J39519M2803j4867Q867l7355m0337L2818L1217r849
$$ -61086 -97449 -160481 -113565 25954 68757 53890 62757 25402 -14935 17883 49100 39251
98C9251j5716l2342k9737r092k3122m647M2044K7193L6699P3586j0898q9898k2119
$$ 39251 23535 -8807 -38544 -47636 -70758 -75405 -33361 -6168 30531 104117 93219 3321 -18798
111a8798J60l3068M4759O3280n7812n7235K0649j5026P566J00953K9832n5969
$$ -18798 -18638 -51706 -6947 56333 -1479 -58714 -38065 -53091 -45525 55428 85260 29291
123B9291R789J014o7590Q250M4008n5280l6498M9151L432r599O0559J0044o6502
$$ 29291 39080 40094 -27496 -19246 24762 -30518 -67016 -17865 -14433 -24032 36527 46571 -19931
136a9931l246M0098L786K0445K1916n7382o9221j990J7198K1339N2394K9460k6743
$$ -19931 -23177 16921 20707 41152 63068 5686 -63535 -65525 -48327 -26988 25406 54866 28123
149B8123k4743k483q937r37K1869J1602r509q215j3253l1026j8386J8723L1438
$$ 28123 3380 897 -8040 -8977 12892 24494 14985 6770 -6483 -37509 -55895 -37172 -5734
162e734K8469L2112Q948l9522m9011j8541N088K7467M7608J8015m0945n3131k2064
$$ -5734 22735 54847 63795 24273 -24738 -43279 -38191 -10724 36884 54899 13954 -39177 -61241
175f1241Q634L8814N7483K9362k2261m1589l1966j9558M387L1806K6428P40o232
$$ -61241 -52607 -13793 43690 73052 50791 9202 -22764 -42322 -37935 -6129 20299 21039 14807
188A4807j1811k8471j4014K3923K9018J6917J7304q255m3526k8505j806j627K0328
$$ 14807 2996 -25475 -39489 -15566 13452 30369 47673 39418 -4108 -32613 -34419 -36046 -15718
201a5718M3473P531k6102j3598j4954j5741K7294L9966j105j3001p993k8925j8666
$$ -15718 27755 35286 9184 -4414 -19368 -35109 -7815 32151 31046 18045 10052 -18873 -37539
214c7539J9509J4707J112J5777O560j4463k193R80j5220J027J9170J203o316J955
$$ -37539 -18030 -3323 -2211 13566 20126 5663 3470 4450 -10770 -9743 9427 10630 4314 6269
228F269r876j4128K388M828M099J6227J1746l904o932j2244j5710J87J0971P404
$$ 6269 -3607 -17735 -15347 -10519 -6420 9807 21553 17649 10717 -1527 -17237 -17050 -6079 1325
242A325R416M127j2873j2423k902k937Q290K2108J0514l580p774k1446k2122N303
$$ 1325 10741 14868 1995 -10428 -13330 -16267 -7977 14131 24645 21065 13291 -8155 -30277 -24974
256b4974J9043J2817J2506K635j8245j5886k665k835Q792K5885J3124q362j4465
$$ -24974 -5931 6886 19392 22027 3782 -12104 -14769 -17604 -8812 17073 30197 21835 7370
269G370k2895k1865O486K7882K3034J2933m776k8892k6495k039J2764K1301K3945
$$ 7370 -15525 -37390 -30904 -3022 20012 32945 28169 -723 -27218 -29257 -16493 4808 28753
282B8753L582k1363k4878j6110j938K0132K8341J2769m990j5035j9361j0194M228
$$ 28753 32335 10972 -13906 -30016 -31954 -11822 16519 29288 24298 9263 -10098 -20292 -16064
295a6064R815J2695J3178J507j3512j8260j3892j880J6784K5418J4374m497k0962
$$ -16064 -6249 6446 19624 21131 7619 -10641 -24533 -26413 -9629 15789 30163 25666 4704
308D704k5294r493J2437K1116J5777K898j2079j8595r833K699J0932J4066P841
$$ 4704 -20590 -30083 -17646 3470 19247 22145 10066 -8529 -18362 -15663 -4731 9335 17176
321A7176l875r530p440l600k1J943J450L229P202N260l343j0731j0862k878R332
$$ 17176 13301 3771 -3669 -7269 -7290 -5347 -3897 -668 6534 11794 8451 -2280 -13142 -16020 -6688
336f688J5752R441m325j4525j4005l409Q923J3023O687j381m492m298l194j232
$$ -6688 9064 18505 14180 -345 -14350 -17759 -8836 4187 10874 9493 5001 703 -2491 -3723
350c723m6L16K625N156M111M41m982j1140r930J805J3388J6172R466n884k1656
$$ -3723 -3769 -3453 -828 4328 8439 8880 3898 -7242 -17172 -15367 -1979 14193 23659 17775 -3881
365c881k0026j233J5789K1575J3392n493k0668j7707k847R653J5629J0851n02
$$ -3881 -23907 -25140 -9351 12224 25616 20123 -545 -18252 -21099 -11446 4183 15034 14532
378A4532o544o906q233o640J191P931J0330R285J706r447j5018j1058K23J3863
$$ 14532 7988 1082 -7151 -13791 -12600 -4669 5661 14946 16652 7205 -7813 -18871 -18648 -4785
392d785J9545J0579n040j9048k2242p817J3287K3196J6870J71j8168k2266p284
$$ -4785 14760 25339 20299 1251 -20991 -28808 -15521 7675 24545 24716 6548 -15718 -23002
405b3002Q328J4974J3583J958j0238q539k300l401o07O302N236M596P354k386
$$ -23002 -14674 300 13883 15841 5603 -2936 -5236 -8637 -9244 -2942 2294 6890 14244 11858
419A1858j4297q822m85K130J2689J6062j732j4163j0954q885j082J6547J6478
$$ 11858 -2439 -11261 -11746 -9616 3073 19135 17403 3240 -7714 -16599 -17681 -1134 15344
432A5344k10p356j0321j2957Q65J4776O763k197m40l680m473M443L045o663l496
$$ 15344 15134 7778 -2543 -15500 -14635 141 6904 4707 4267 587 -3886 557 3602 -3061 -6557
447f557N039O257N439P74q661j0515l857L518J0380R922J68p196r237q026J191
$$ -6557 -1518 4739 10178 10952 2291 -8224 -12081 -8563 1817 11739 11907 4711 -4526 -12552 -11361
462a1361R205O276L788J558q743q924L097J603k654P499O985l891K008K621j4641
$$ -11361 -2156 4120 7908 9466 723 -8201 -5104 -3501 -6155 1344 8329 4438 6446 9067 -5574
477e574j0503R109P722O479J2851n557k4009p967N835K901J4193J5940q955j6450
$$ -5574 -16077 -6968 754 7233 20084 14527 -9482 -17449 -11614 -8713 5480 21420 12465 -3985
491c985l652n303k487J5967J2813m130k832k893j2703m745J0049O580J812N536
$$ -3985 -7637 -12940 -15427 540 13353 9223 6391 3498 -9205 -13950 -3901 2679 4491 10027
505A0027R07q682q516l507j41N586J2164Q870m913j3820r680l071M224J5319J2091
$$ 10027 10934 2252 -6264 -9771 -9912 -4326 7838 16708 11795 -2025 -11705 -14776 -10552 4767 16858
520A6858n956j0036m185q183k464J4480Q968m694K071N28j4286m941J0217J426
$$ 16858 10902 866 -3319 -11502 -13966 514 9482 4788 6859 7387 -6899 -11840 -1623 -197
534a97j71J0175j187j1986R20K256q299K677J2083p57l253M168o066j1502M340
$$ -197 -368 9807 8620 -3366 -2446 -190 -8489 -5812 6271 5514 2261 6429 363 -11139 -6799
549f799R291p32J277M476n699p295L356K051m708K627Q196p46l550J599m837q892
$$ -6799 2492 1760 3037 7513 1814 -5481 -2125 -74 -4782 -2155 6041 5295 1745 3344 -1493 -10385
565a0385M545R594o77R69M820p999j0122M019K582k032J0623Q375j0943q111J823
$$ -10385 -5840 3754 3077 4046 8866 867 -9255 -5236 -2654 -4686 5937 14312 3369 -4742 -2919
580b919n774o98J5506N642q688p71o84j0501n19R970K015J008O124m180j1657
$$ -2919 -8693 -9391 6115 11757 3069 2298 1614 -8887 -9406 564 2579 3587 9711 5531 -6126
595f126k039L298J537O361P223l731q410j717L95k794K108Q583K485m062n9k171
$$ -6126 -8165 -4867 -3330 3031 10254 6523 -1887 -3604 -3209 -6003 -3895 4688 7173 3111 3052 881
611H81r785o19J0932L262r13N198m491j3242J235O383k963N879J1530p335j0753
$$ 881 -8904 -9523 1409 4671 3758 8956 4465 -8777 -7542 -1159 -4122 1757 13287 5952 -4801
626d801K687l599n156J3762R481r720k638K936r712k350J1917L25n209P364J854
$$ -4801 -2114 -5713 -10869 2893 12374 2654 16 2952 -6760 -9110 2807 3132 -2077 5287 7141
641G141r989j493K847l748L024R703k23n956j826k969l055M093N935R49j106q94
$$ 7141 -2848 -4341 -1494 -5242 -2218 7485 7262 1306 -520 -3489 -6544 -2451 3484 4433 3327 2433
657B433l098m535j18N307K822j221J040k34n428n01M905k240l079O063K851l698
$$ 2433 -665 -5200 -5318 -11 2811 1590 2630 2396 -3032 -3533 1372 -868 -3947 2116 4967 1269
673A269J471r81r101N83R931J248r31L156o523r062N013N627k367L618M115p222
$$ 1269 2740 1759 -7342 -6759 3172 4420 3489 6645 122 -8940 -3927 1700 -667 2951 7066 -156
689a56m292L666j800j653O760K144m678P16J220m535q06L085o39Q52N421O24n382
$$ -156 -4448 -782 -2582 -4235 2525 4669 -9 707 1927 -2608 -3414 -329 -968 -116 5305 5929 547
706E47l932j740L91N477O487j59n924n059j535J207L885M556N30l516k108n43
$$ 547 -3385 -5125 -4734 743 7230 7071 1147 -3912 -5447 -4240 -355 4201 4731 1215 -893 -1436
722a436j801J58L564J761m47Q34r68l623n39J512n25J458M107J58l095j671k782
$$ -1436 -3237 -3079 485 2246 1799 2633 1665 -1958 -2497 -985 -1510 -52 4055 4213 1118 -553 -3335
739c335k508M267O598N79l117l145l903o84M962L828q04j475j171j738J15J596
$$ -3335 -5843 -1576 5022 5601 2484 -661 -4564 -5248 -286 3542 2738 1263 92 -1646 -1531 65
755F5l77o43J780J308p71p58p95j794l77K099J770N25M44j062l163j763J335K530
$$ 65 -312 -955 825 2133 1362 604 -191 -1985 -2362 -263 1507 2032 2476 1414 -1749 -3512 -2177 353
773C53K414J139k114l955j206J864K145J254o6j539r21Q54K72j126p50L07J160
$$ 353 2767 3906 1792 -2163 -3369 -1505 640 1894 1828 289 -632 222 494 -632 -1382 -1075 85
790H5J883O90k016k640o31J128J826J730N64j131k023j462m2J340K016J523k87
$$ 85 1968 2658 642 -1998 -2629 -1501 325 2055 2619 1488 -535 -1997 -2039 -699 1317 2840 2553
807B553k180k148k40J410J798M97j159j096L91N91l67o39o53m2J662K063m83k433
$$ 2553 373 -1775 -2015 -605 1193 1690 531 -565 -174 417 50 -589 -1242 -1284 378 2441 1958 -475
825d75j615J8J422K206R12j080j265q08n48N01J250O47K10j18j150j429J46J106
$$ -475 -2090 -2072 -650 1556 2468 1388 123 -685 -1233 -732 518 1165 1375 1257 107 -1322 -1176 -70
843g0O98J16m48o09K44M18m52r43j74R11J570Q81j043k134j070R55K054J425m47
$$ -70 628 744 296 -313 -69 349 -103 -1046 -1220 -309 1261 2142 1099 -1035 -2105 -1150 904 2329 1882
862A882j670j172J8P67P54J32j16rl49p06j95J52L05P14M08q09q18M24N17j68
$$ 1882 212 -960 -942 -175 579 711 595 586 237 -469 -664 -512 -207 507 915 106 -712 -288 229 61
882F1k33N0K55P25K76r40j097J2Q30J180O13j038j695j44J157O69j17k03l13k83
$$ 61 -172 -122 133 858 1134 194 -903 -891 -61 1119 1732 694 -1001 -1145 12 681 564 361 48 -235
902b35K20J65m43k42O90O71j21o83o73o6Q49O79l32m81J47Q0k42O2j56l46O08
$$ -235 -15 150 -293 -535 155 826 705 22 -651 -717 132 811 479 -2 145 225 -17 45 -111 -457 151
923A51J163l35j460n38M72N48Q27L60r76r23N04M08l91P0M93J17K27J2j155r08
$$ 151 1314 979 -481 -1019 -547 1 828 1188 212 -711 -207 201 -190 -120 373 490 717 729 -426 -1334
943a334Q18J269L26j64o92j097J39J111K7o79M50N35l26j92r7r24k44J449J015
$$ -1334 -516 753 1079 915 223 -874 -735 376 403 -276 174 709 383 191 94 -830 -1074 375 1390
962A390o00o39j85n26j73N93L12K46R29L1j665j223K99O61J410J754q90k867n54
$$ 1390 790 151 -34 -560 -733 -140 172 418 1347 1378 -287 -1510 -1211 -550 860 2614 1724 -1143 -1697
981a697J255J79O02J266q13j378P77K46j555J13J478J21K39O94j477j714R69Q63
$$ -1697 -442 -263 339 1605 792 -586 191 437 -1118 -1005 473 594 833 1527 50 -1664 -695 168
999A68m30R85J069j216j001L32q49o24K124J705j174j242j80p61L9J839M69j650
$$ 168 -262 723 1792 576 -425 -93 -942 -1566 558 2263 1089 -153 -333 -1094 -1055 784 1253 -397
1017c97n2J396k40q79mr77o37K396K144j268j457m25j657p4L284J277j493L81
$$ -397 -449 947 707 -172 -176 -1153 -1790 606 2750 1482 25 -400 -2057 -2131 1153 2430 937 1318
1035A318l11l336m55L150P48r8J571j440l697N03K269m35M86J550j328j099J537
$$ 1318 1007 -2329 -2784 366 1114 1016 2587 1147 -2550 -2047 222 -213 273 1823 495 -604 933
1052I33p24k534R48K306K53O93O84k921l002J471K539L99Q51Q68k343k694O95
$$ 933 209 -2325 -1377 929 1182 1875 2559 -362 -3364 -1893 646 1045 1896 2764 421 -2273 -1578
1069a578R71k28J886K131j946k422L67m31o70K636J472k049J63J596k457j820
$$ -1578 -607 -835 1051 3182 1236 -1186 -819 -1250 -1920 716 2188 139 302 1898 -559 -2379
1085b379J989Km18L779J202m747j935J367p55J288M391o58l970J26L35j945J285
$$ -2379 -390 -388 -806 2973 4175 -572 -2507 -1140 -1895 -607 3784 3126 -844 -718 -383 -2328 -1043
1102a043K857q00o82J367j382k528J037J396p18Q91J844r01j603J81o85j757J408
$$ -1043 1814 1014 332 1699 317 -2211 -1174 222 -496 395 2239 1338 -265 -84 -769 -2526 -1118
1119a118L464O08j450r38k234k217K346L977o3j088M0k215k091K146J496j235
$$ -1118 2346 2954 1504 566 -1668 -3885 -1539 2438 2375 1287 1327 -888 -2979 -833 663 -572
1135e72J573J991k515j785J229j363j007L702J658k439K87O48l314r54K946M43
$$ -572 1001 2992 477 -1308 -79 -1442 -2449 1253 2911 472 759 1407 -1907 -2861 85 528
1151E28j4K629o96m198p41J415qJ757K503j564k425O11j16j500Q01J804N8N32
$$ 528 514 3143 2447 -1751 -2492 -1077 -1085 672 3175 1611 -814 -203 -319 -1819 -1018 786 844 1376
1169A376J163j658l289m03J707J294J754J599j553l319j184K61L83K605L156o05
$$ 1376 2539 881 -2408 -2811 -1104 190 1944 3543 1990 -1329 -2513 -2252 -1869 736 3892 3287
1185C287k668j804j900n45L603L468n99j266q38k705j273K427J412q3J857P62
$$ 3287 619 -1185 -3085 -3630 -27 3441 2842 1576 738 -1967 -3240 -813 599 516 2373 3135
1201C135k958k265L6k86J388L792R42k533j710j211j342J272L025R47k39k4j943
$$ 3135 177 -2088 -2052 -2338 -950 2842 3784 1251 -459 -1670 -3012 -1740 1285 2232 1993 1969 26
1218B6k683J44J904J329J368P70j908k411j71O72Q4J069J547j15p55m29j427j460
$$ 26 -2657 -2513 -609 720 2088 2858 950 -1461 -1632 -960 -876 193 1740 1625 870 441 -986 -2446
1236b446R56K149J125L05n17k031j492N64R23M59J251R44q27j309q52j072p7K070
$$ -2446 -1490 659 1784 2089 1572 -459 -1951 -1387 -464 -5 1246 2190 1363 54 -798 -1870 -1947 123
1254A23J946L6p83j150j630o30R25J151J016J229R8j807k107q62K91J868K694
$$ 123 2069 2105 1322 172 -1458 -2088 -1163 -12 1004 2233 2331 524 -1583 -2445 -2154 -286 2408
1271B408R46j523k080j554q64P67K342J839N06m38k042k913r69J653K678K434
$$ 2408 3354 1831 -249 -1803 -2667 -1900 442 2281 2787 2349 307 -2606 -3575 -1922 756 3190
1287C190O94k137l297j594L91J628K544J839m06j726k064j999k85K188K854J571
$$ 3190 3884 1747 -1550 -3144 -2753 -1125 1419 3258 2852 1126 -938 -2937 -3222 -1034 1820 3391
1303C391k64k163k953j375R84K105K190J270m92k048k409j465N21K491K854J202
$$ 3391 3127 964 -1989 -3364 -2380 -275 1915 3185 2693 645 -1764 -3229 -2708 -217 2637 3839
1319C839j293k951k476k35J795K477J490k79j381j413j202l96Q95J490J241O12
$$ 3839 2546 -405 -2881 -3116 -1321 1156 2646 2367 986 -427 -1629 -2025 -1130 360 1601 2213
1335B213n48j820j578j77O98J405J480M16p13j133j421j012N97J819J592N49p50
$$ 2213 1665 -155 -1733 -1910 -1212 193 1673 2089 1376 243 -1178 -2190 -1593 226 1818 2367 1617
1352A617j987j543K29J182J005O59J10l56l45o76j046n84O54J647J656M49j370
$$ 1617 -370 -1913 -1684 -502 503 1162 1272 916 571 -105 -1151 -1735 -1081 566 2222 2671 1301
1369A301k323j553J50J656K257J456k17j907k474j384M87K176K659J304j167k619
$$ 1301 -1022 -2575 -2425 -769 1488 2944 2727 820 -1654 -3038 -2551 -375 2284 3588 2421 -198
1385a98k121n10J054K168J763M70n69j474k183j404M41K091K853J810j050l365
$$ -198 -2319 -2829 -1775 393 2156 2626 2057 583 -1600 -3004 -2563 -472 2381 4191 3141 -224
1401b24l074p93J715L510K866N0k398l097k176K8K454L265J877o08k657k963j279
$$ -224 -3298 -4091 -2376 1134 4000 4050 1652 -1445 -3621 -3593 -1139 2126 4003 3395 738 -2225 -3504
1418c504J121K475K218O97r76j776j683q51J84J296K170J703k22k127k551j484
$$ -3504 -2383 92 2310 3007 2031 255 -1428 -2279 -2095 -799 1371 3074 2852 725 -1826 -3310
1434c310O67K781K739L92j533k196j843k20J524J917J092J70r96j728j012J84
$$ -3310 -2643 138 2877 3269 1736 -460 -2303 -2523 -999 918 2010 2180 1184 -544 -1556 -1372
1450a372O88J083J002j14o11k65n42r46l71O04J202J364O52j120k210j431L27
$$ -1372 -684 399 1401 1287 676 411 -131 -1077 -1448 -844 358 1722 2374 1254 -956 -2387 -2060
1467b060J721J887P79o12j428j303n93K57R06J191J086J51q60j561j390l03J171
$$ -2060 -339 1548 2327 1715 287 -1016 -1609 -1352 -446 745 1831 1982 1122 -439 -1829 -2132 -961
1484i61J745J279M80q72k268j926j96J180K456K592K99k641l117j611M51K747
$$ -961 784 2063 2543 1671 -597 -2523 -2719 -1539 917 3509 3808 1167 -1950 -3561 -3110 -363
1500c63L240R92j468k296k298j130J147K382K030J159n24k752k861p57J207K551
$$ -363 2877 3869 2401 105 -2193 -3323 -2176 206 2236 3395 2871 119 -2742 -3499 -2292 259
1516B59K887Q97j892k948k178n14J511L054K583K47k150l243k289K64K745L349
$$ 259 3146 4043 2151 -797 -2975 -3489 -1978 1076 3659 3906 1756 -1487 -3776 -3512 -767 2582
1532B582J427j227k690k427p43J437K135J382N54m49j888j805k87N21J106K109
$$ 2582 4009 2782 92 -2335 -3078 -1641 494 1876 2430 1981 93 -1712 -1999 -1478 -372 1737
1548A737R89j337j613q36p52L04J840J142k5P5q13j901o48Q61P64J153J155p36
$$ 1737 2726 1389 -224 -1060 -1812 -1508 332 1474 1449 1524 711 -1190 -1838 -977 -213 940 2095 1359
1566A359j653l61o9m15O92J148K87J14L24j131j803k54R74J030J284P65r85j729
$$ 1359 -294 -655 -724 -1139 -447 701 988 1102 1426 295 -1508 -1762 -788 242 1526 2291 1306 -423
1584d23r35l15K52J467J865N20q08j523k047j052J431K598J405K32q82k480k189
$$ -423 -1358 -1673 -1421 46 1911 2431 1623 100 -1947 -2999 -1568 1030 2435 2667 1785 -695 -2884
1601b884L58J588J565K032R60k059l037j454r5J563L518K090j225k423k247j837
$$ -2884 -2526 -938 627 2659 3619 1560 -1477 -2931 -3026 -1463 2055 4145 2920 497 -1750 -3587
1617c587O25L155K373N57k68k158l551j030J938K369K320J443j843l742j732M50
$$ -3587 -2962 193 2566 3123 2855 697 -2854 -3884 -1946 423 2743 4186 2343 -1399 -3131 -2681
1633b681J206K554K363n52k145j613j496n82K043K727P88l77j177k440j466J259
$$ -2681 -1475 1079 3442 2890 745 -868 -2364 -2946 -903 1824 2612 2235 1058 -1382 -2848 -1589
1649a589J716R13R80J35j730j545l04j54O07K148J365q29j380j184j022K88J815
$$ -1589 127 1040 2020 2155 425 -1120 -1424 -1578 -971 1177 2542 1713 333 -851 -1873 -1585 230
1666B30J190j06k22n03j237o20N25L68N19J182L26j186q52k03n58J08J381Q48
$$ 230 1420 1314 1092 589 -648 -1268 -743 -375 144 1326 1652 466 -386 -589 -1147 -1039 342 1190
1684A190j29K43m80j953r62R72J128J216J226o83k277j032J13J17J295J913J19
$$ 1190 1061 1304 824 -1129 -2091 -1119 9 1225 2451 1768 -509 -1541 -1428 -1311 -16 1897 2016
1701B016q35n81j620j614Q52K167J390R03k67k536k486k3J204J777K294P63j773
$$ 2016 1181 600 -1020 -2634 -1782 385 1775 2678 2411 -125 -2611 -2634 -1430 347 2641 3404 1631
1718A631k543j733n64J663L251J959o11k245k613j552Q36K601K205N90p55j765
$$ 1631 -912 -2645 -3209 -1546 1705 3664 3053 808 -1805 -3357 -2521 80 2285 2875 2120 355
1734C55k172r81R13J871J862J245o25k511k300l84J056K087K245L76j683j935
$$ 355 -1817 -2798 -1885 -14 1848 3093 2468 -43 -2343 -2727 -1671 416 2661 3037 1354 -581
1750e81j461n77J336K535J323k63j157k174j649P62K010J227N81k76j510j245
$$ -581 -2042 -2619 -1283 1252 2575 2312 1155 -1019 -2668 -1906 104 1331 1912 1636 126 -1119
1766a119M3K90L07J020Q36j62m57q34j159j82J047J033N39J21n93j099n29L3K97
$$ -1119 -1076 -786 -479 541 1377 1215 758 -76 -1235 -1417 -370 663 1202 1323 730 -369 -898 -865 -568
1785e68P23Q96K88n35q03p29k87L37P22O61L29N7l70r19j017k74P14J447J363
$$ -568 155 1051 1339 804 1 -728 -1015 -678 44 705 1034 1091 721 -198 -1215 -1489 -775 672 2035
1804B035J66j454j924j009L86J618J894P65q21j514j542q73O14J834J741O07p19
$$ 2035 2201 747 -1177 -2186 -1800 -182 1712 2477 1656 142 -1400 -2273 -1659 175 1916 2523 1804
1821A804j928j913l91J185J855J582L65j184j851j441m08R32K096J922J97j449
$$ 1804 -124 -2037 -2428 -1243 612 2194 2559 1375 -476 -1917 -2325 -1393 703 2625 2822 1373
1837A373k337j806R3K058K446J110o84j890k071q04Q39J734J690P87p10j859j680
$$ 1373 -964 -2770 -2677 -619 1827 2937 2253 363 -1708 -2512 -1673 61 1751 2538 1828 -31 -1711
1854a711n00Q20J791J593K29j113j463j090k42Q23J339J054K76n97j366j302k48
$$ -1711 -2211 -1391 400 1993 2222 1109 -354 -1444 -1686 -863 476 1530 1806 1209 -157 -1459 -1707
1871a707R20J514J038q5j105j216n68K68P40P74M35p0l57o14o06k77M17P40N67
$$ -1707 -787 727 1765 1680 575 -641 -1209 -941 -201 573 1008 938 581 -33 -639 -916 -499 241 808
1890H08J39k51n74o15j92J05K61O91P54R3o14r63q16oR34J073N16j12p16j057
$$ 808 947 696 122 -493 -685 -580 -319 372 1126 1219 605 -358 -1174 -1180 -246 827 1343 1231 515 -542
1910e42o14J39N08J021J053J70r80j442r37K3J199J634Q16m32j262j392p73M11
$$ -542 -1156 -1017 -509 512 1565 1735 755 -687 -1624 -1601 -402 1232 2048 1616 354 -1038 -1811 -1400
1928a400J236J388Q64k83j524j790p14P46J717J696M92j112j780j268j32Q69J612
$$ -1400 -164 1224 2088 1805 281 -1509 -2223 -1477 240 1936 2428 1316 -464 -1732 -1864 -995 617
1945F17J364J24j047j572j336j96J281J906J094k46j412j706q06N64J270J302
$$ 617 1981 2105 1058 -514 -1850 -2046 -765 1141 2235 1989 577 -1129 -1935 -1371 -101 1201
1961A201P06l60j270j274o04L02J213J526N10p69j294j045k76O75J183P90N1m83
$$ 1201 1907 1547 277 -997 -1601 -1299 -86 1440 1950 1181 -113 -1158 -1434 -759 424 1214 1265 782
1979G82q05q00k47M22Q45P87L12n51r37n61QL58O02N14K2j81k15m81n78m7N81
$$ 782 -23 -823 -1070 -648 197 984 1296 745 -192 -753 -745 -387 215 729 751 570 355 -126 -704 -751 -170
2000a70P00M72oo30p84l49J33M26O38M90Pl56o72p21k08O15R14O86K4o38r87o17
$$ -170 530 1002 996 366 -418 -767 -634 -208 430 920 927 571 -101 -822 -1030 -415 499 1185 1209 571 -416 -1033
2022a033J52N10P75P15K09n23j110r24j30Q05J338R85j57j199j274n87L09J052
$$ -1033 -881 -371 404 1119 1328 805 -305 -1229 -1359 -554 784 1769 1612 413 -861 -1448 -1139 -87
2040h7J187N44l23r65j240o82L82J217J296N78n44j517j298q5P88J153J041K47
$$ -87 1100 1644 1321 356 -884 -1566 -1184 33 1329 1907 1363 -154 -1452 -1537 -749 404 1445 1692
2058A692q21j206q66j97O11J357J094o5r65j302q14K56J145J021M29k90q01r16
$$ 1692 871 -335 -1201 -1398 -787 570 1664 1599 634 -668 -1482 -1226 -81 940 1369 1079 278 -638
2076f38l93K84O08P84O31j55r00q80k62K71O84P83K01m10m42m12l98l1N89O19
$$ -638 -1031 -747 -139 645 1276 1121 221 -659 -921 -650 34 817 1018 608 166 -246 -644 -675 -86 533
2096E33L33K8n21q72l51L94M52M91L85k38n51k10k15k97L49P29L09Oj62o81p11
$$ 533 866 894 373 -499 -850 -456 -4 487 872 634 83 -127 -342 -639 -290 439 748 754 592 -89 -800
2117h00J93N96L20L55J78m08n46k80k62Q6P92P49L2l94o49p91j11P18P34L22J39
$$ -800 -607 -11 309 664 842 434 -112 -392 -654 -568 224 973 1005 611 -38 -829 -940 -222 512 834 973
2138I73k93q60o85J4L93P65Q92K01q68j124n11J20P37J145M29m52o03p02o46J46
$$ 973 680 -180 -865 -851 -458 307 1199 1400 532 -592 -1103 -983 -246 899 1328 876 273 -429 -1075 -929
2158i29R68Q32L39o4q68j267k59P60P66O90L89o61j053l56K7J09Q00Q57k6m84
$$ -929 39 871 1210 1146 278 -989 -1248 -488 278 968 1357 696 -357 -713 -686 -577 223 1080 1054 570
2178E70n99p78k57P99R03K57o5l76p92m22L10L27K65N97K49o04o60l13r0L78Q51
$$ 570 -29 -807 -1064 -265 638 895 830 454 -338 -760 -450 -123 142 739 988 384 -276 -589 -679 -301 550
2199E50L92l72l96l04l49K1M83L04J29K30j69o95l39J45K29M01N09j35n36j73
$$ 550 942 570 174 -130 -479 -458 25 329 458 688 519 -176 -515 -370 -141 260 769 634 98 -75
2219g5q5k10J04M80K36P2O1m60o58q0M29L97L81J88l78n61j19p6m0M40N88J00
$$ -75 -160 -370 -266 214 450 522 583 123 -535 -615 -186 211 592 780 402 -159 -278 -354 -394 46 634 734
2241G34k25l51o59l28N06P33L08L0k37o36m77J28K60L62O20K39n22o84m69o3M86
$$ 734 509 158 -501 -829 -323 410 718 748 511 -125 -602 -474 -214 148 768 1007 485 -199 -668 -731 -245
2262b45Q89L78l74m63m84l73J87N56L99J89Q2l90p52k98K05N13N75L14l16o54
$$ -245 644 1022 648 185 -299 -672 -485 71 470 659 741 351 -401 -699 -494 19 594 908 592 -62
2282f2m02k8J75M38M56J01j83l24n12k91K62O13M25M2k93n26l75J34L51K05K26
$$ -62 -464 -492 -317 121 577 678 495 171 -341 -632 -370 243 668 710 417 -109 -484 -350 1 206 432
2303D32J53j80l76k56j90J22N17M20o5l42k92k78K3L11K09L6J54pl38k49j08O8
$$ 432 585 405 29 -227 -417 -295 222 642 577 235 -57 -335 -312 -1 208 244 398 391 53 -196 -304 -236
2325b36L13M84Nk77l16j68m7J99K30J14Q6J9k35l63j62J09L31M13J19k94m02j70
$$ -236 77 561 566 289 -27 -195 -242 -43 187 301 387 406 171 -192 -354 -245 86 499 618 324 -78 -248
2347b48L0J40J98K21J19j19j92l21k28J08M66L48N8k36m32l15J31K43K24K33P9
$$ -248 -218 -78 120 341 460 341 149 -172 -400 -292 174 522 580 344 -88 -403 -272 -29 195 428 507
2368E07k24l06k30j02J76M80L18j05l29l48j54J15L32J78O2oj02k46k24p3J71
$$ 507 283 -23 -253 -355 -179 301 619 514 185 -163 -317 -202 130 308 370 364 262 16 -208 -281 -110
2389a10L93L44q1m23l51j34J64L66K71rj82j45j78j76Q8K82K16P6p7l13k22L6
$$ -110 283 627 546 123 -228 -362 -198 168 439 430 248 103 -75 -251 -163 119 335 411 334 21 -201 -165
2411a65J61J53J00N4j18m7l5k29j09K23L76J05n9k86l53r2L51K88J5n0j21j58
$$ -165 -4 149 249 303 185 138 103 -126 -235 -12 364 469 410 124 -229 -321 30 318 333 283 162 4
2433Do0K4K3P2K08L8j07j41j50k6J43J65j6K1K9m5j81j15K2J08K61J91j30l86
$$ 4 -56 -32 -9 63 271 309 202 61 -89 -115 28 193 177 198 227 182 1 -114 -92 16 277 468 338 -48
2457d8k05Q1K35K48N1j79j84M3J3k4M6L2J6J18N0j95j65P1O2K4J39N3j45l4l4
$$ -48 -253 -172 63 311 362 183 -1 42 55 31 77 109 125 243 293 98 -67 4 66 90 229 282 137 103 69
2482F9j57p3K33K60N3j56k75k19J17L30J63q9j67q2k7J22O4j01l4J61L8q9j9j05
$$ 69 -88 -161 72 332 385 229 -46 -265 -148 182 345 256 89 7 -20 102 166 65 31 192 230 141 122 17
2506A7q4P6J86M1p6j5o0j07j9P8R8J69Kj89k38MJ62J44J27j15k25o0J72M6n8l1
$$ 17 -67 9 195 236 160 145 85 -22 -41 37 135 304 306 117 -121 -117 45 189 316 201 -24 -84 88 134 76 45
2532D5j4K4J30M1j64j72Q0J50Q9L1j25j26l5J11K6O6O3k8q9o5o6qJ78J94r5k15
$$ 45 31 55 185 226 62 -110 -30 120 209 240 115 -11 -46 65 91 157 220 192 103 38 -28 -36 142 336 241 26
2558B6j13P1J24J55qk07j01Q0J61Jq2q4QR5N9k3j02m6J6N9O8k8o5M1j1l5n9L3
$$ 26 -87 -16 108 263 255 48 -53 27 188 189 107 23 31 126 185 162 60 14 30 89 157 129 64 105 94 59 0 33
2586C3J13P2k2j25j00N8R9J27m2j30o4P2O4m1l3j3N8N1M7j51j61RJ75J62%j27
$$ 33 146 218 196 71 -29 29 128 255 213 83 19 91 155 114 81 68 126 177 224 73 -88 -79 96 258 258 131
2612A31j68j8R7N4M1M4m3m4j3m2r7J11J50N0j44q4o9L4J15N1n1k6L8N5n3o0r1
$$ 131 -37 -55 42 96 137 181 138 94 81 39 -58 53 203 253 109 25 -44 -10 105 156 105 79 117 172 119 59 -32
2639c2K0J69J42j12j00p2m2O0R1K8o7N2P9r9j93PQ1J49J41k4k50j41M8Q9J07Q4
$$ -32 -12 157 299 187 87 15 -27 33 124 152 85 137 216 117 -76 -69 12 161 302 278 28 -113 -65 24 131 215
2665B15oj16K1o7j14L6J75J23j9l1j64j84J14J86jqK1po1Lj06j09J38K45N5j09
$$ 215 209 93 114 47 -67 -31 144 267 248 217 53 -131 -17 169 168 160 181 174 113 116 10 -99 39 284 339 230
2691B30j55j93l8K17J65kjl6j60j04M5J3P8K25P6k12k11J2J7R9J62N2q8lk5k10
$$ 230 75 -118 -156 61 226 224 223 187 27 -77 -32 -19 59 284 360 148 -63 -51 -34 65 227 279 191 188 163 -47
2717d7r3R5J66J87J68k16l66j51J63J91K01J05j79k38k5J6n1J08K00K0j5o8j88
$$ -47 -140 -45 121 308 476 260 -106 -257 -94 97 298 403 224 -14 -39 -23 -74 34 234 254 239 171 -17
2740a7j53J17J45P4O6M5j07k00n7q4Q2L02K75p2k92k74j33J36M11K09j27j82j55
$$ -17 -170 -53 92 166 232 277 170 -30 -87 -171 -89 213 488 416 124 -150 -283 -147 264 473 346 164 9
2763Iq7J3J41Q0J8R8K6k01j66k5L8J34K47Oj36r5j09j57N1K24J94J03n0l05k98
$$ 9 -78 -65 76 156 174 272 298 97 -69 -94 -56 78 325 331 195 100 -9 -166 -115 109 303 406 356 51 -247
2788b47NK45K96J02j10k11j54O5M7j7O2R7P9L3j02k19j67R2K32J96R0o4k36k53
$$ -247 -242 3 299 401 291 80 -74 -9 38 21 83 180 259 292 190 -29 -196 -104 128 324 414 350 114 -139
2812a39n3J24J80K61J23j93l57k09J8K26L43Q5j37j70j28o0RO9J09J05K01j2k87
$$ -139 -192 -68 112 373 496 303 -54 -263 -245 -19 324 409 272 102 -26 -86 -77 -8 101 206 407 395 108
2835A08l04j02J82L24L34J1l28l19j86K3K39L31J81m8k48l55j82J41L29K82P1
$$ 108 -196 -298 -116 208 542 553 225 -94 -280 -257 -18 313 494 446 198 -157 -339 -198 131 413 484
2856D84j63k77k03J5R4Q6J79J56Mj43k89k50nL32L92J51j96l69k90j3K32K99J69
$$ 484 321 44 -159 -144 -50 36 215 371 375 232 -57 -307 -312 20 412 563 367 -2 -292 -305 -73 226 395
2879C95N8j52k63j90k1J48K16K20mk22k17n1lJ03J08J02P8M9j52k60j63M8K63
$$ 395 453 301 38 -152 -173 -25 191 411 407 185 -32 -83 -86 17 125 227 305 354 202 -58 -221 -173 90
2902I0K93J32j96l18j66K1J12J81J58Pp6j10k08j40P9K26K09J00p2k07k21p3P4
$$ 90 383 515 319 1 -165 -144 -32 149 307 314 238 128 -80 -220 -141 85 294 394 322 115 -106 -179 -105
2925a05J36K45K19o3k24l13k33N4M03L84P4k18l30l09m2K60K54K14R5j62k87k89
$$ -105 31 276 495 432 208 -105 -338 -284 119 503 577 359 29 -280 -322 -62 192 406 501 339 52 -237
2947b37j00J28L83M17K6l04l95k46j7L01L50J92m9j46l35l44J6L19L83K40j0m14
$$ -237 -337 -209 174 591 617 313 -82 -328 -345 -44 306 498 449 303 -32 -376 -360 -41 342 582 572 158
2969A58m13j00J73K75K99J45j44k56k51j81M9L16L70J09j12l23l78p0K65K78J62
$$ 158 -255 -355 -182 93 392 537 393 137 -114 -295 -246 70 440 549 437 114 -264 -334 -69 209 371
2990C71Q1j58k89j39m9O8J56L28J31j71k49k38r9J65K76J36J8m1j76k26l6L9J24
$$ 371 452 294 5 -134 -183 -115 41 369 500 329 80 -158 -257 -92 184 320 338 297 121 -105 -141 -102 22
3013B2K42K01j31k75j40q7Q5J86J95NJp5j72k23j5J23K48K79M7k91l58j52J9K40
$$ 22 264 465 334 59 -81 -168 -83 103 298 303 304 229 57 -166 -181 -58 190 469 516 225 -133 -285 -266 -26
3037b6L57K31j51k40k55l09O1L65M02J51r9l75m43p8K26L50K92R4j38l43k54j34
$$ -26 331 562 411 171 -84 -393 -332 33 435 586 487 112 -331 -409 -183 167 459 553 415 72 -182 -316
3059c16M2L52M38J71k21m33m19j14L33N31K77p0k45m58k67N9K94L60K91k9l58
$$ -316 -274 78 516 687 466 33 -386 -500 -167 364 641 571 326 -132 -399 -340 -46 314 605 576 218
3080B18m18k10J10L36L69J37j49k52k35j94K2K53L11K00K0k79m61j98J87L54L54
$$ 218 -200 -410 -300 36 405 542 393 141 -94 -288 -266 -13 298 498 518 239 -222 -420 -233 121 475
3101D75R6k24l27k36j3J66K24J96L4j39j64j78j15J62K01P6M8j5j18j35o1o0K5
$$ 475 571 347 20 -216 -229 -63 161 357 391 252 88 -90 -205 -43 158 234 282 267 149 14 -47 -107 -82
3124h2J93K74M3j10l19k65J2K52K70J52n9j77k29j18lQ8K47K71N8j84l08k44m7
$$ -82 111 385 428 318 -1 -266 -254 -2 268 420 361 184 -45 -163 -166 -78 169 440 498 314 6 -238 -285
3147b85J88L74K43pk12l62k80k2K39M39L43k1m15m75k78J58M45M82J12k39l89
$$ -285 -97 277 520 513 301 -61 -341 -363 -124 315 658 637 222 -253 -531 -373 72 554 666 427 38
3168C8l38q7J62L69K84J49j05m04l73j73K06M36M16Q6k86m41l04n3K40M58L35
$$ 38 -300 -387 -225 144 428 577 472 68 -305 -478 -272 164 580 666 380 -61 -365 -418 -178 280 615
3189F15%k75m69k97J0M08M60J86j19m01l50r6J58K55K40J02o8k22k27j62L8K46
$$ 615 615 340 -129 -426 -416 -8 452 638 519 118 -232 -328 -170 85 325 427 359 137 -90 -252 -214 32
3211C2K97J23r3k25k57r3J08K08J41P9j4j30j92j31K4J59K22J09r3j28j11r5N
$$ 32 329 452 359 134 -123 -216 -108 100 241 320 306 176 -16 -147 -123 36 258 367 274 146 35 -60 -55
3234e5Q5O0J49J18Rj97l05r7R6K27L28R6j88l10k36m8J17L30K41O7j36l28l54
$$ -55 30 90 239 357 366 169 -136 -233 -137 90 418 514 326 16 -220 -268 -151 179 420 487 351 23 -331
3257c31m7K67L50K81M0k64m00k15M6J87L59L19j0k51m15l15j5L54N25K63j44m21
$$ -331 -378 -111 239 520 560 296 -104 -319 -273 -86 273 592 582 331 -84 -399 -414 -60 465 728 584 163
3279A63m65j77K09L92L45J43j23m05l91j32J97L79M22J18l08m29l17LK59L98K37
$$ 163 -302 -479 -270 122 467 610 487 82 -309 -441 -244 135 557 675 367 -62 -379 -376 -117 281 518
3300E18Jk51l30k65k1K66L74K43Ql27l82j53J28K80K54J55j39k15j62j21j0K08
$$ 518 519 268 -62 -327 -348 -82 292 535 543 216 -166 -319 -191 89 343 498 359 144 -18 -139 -149 59
3322E9K18J24n2j84k28j17Q1J70J31N4Kj17p7r9q6K7J84K11L2p2k04j53n4R9J42
$$ 59 277 401 349 165 -63 -180 -99 71 202 256 258 141 64 -35 -121 -94 90 301 333 261 57 -96 -150 -51 91
3347I1J35J24m3j64k15j51K0K35L34J36j13k83k77r6J21K96K45Q8j11k47l14j73
$$ 91 226 350 307 143 -72 -223 -203 32 366 502 389 106 -171 -267 -146 150 395 483 372 125 -189 -362
3369c62J68L63L08J25k15m36l20k3K71L71L02Mk85l25l05j4K73M44K95p0l67m50
$$ -362 -194 169 477 602 387 -49 -369 -392 -121 250 552 556 271 -54 -359 -373 -100 344 639 569 202 -248
3391b48k36K16L85L13J61j36l64l22q7J16L02L41J56j62l69l34p7K06M03K39K
$$ -248 -484 -268 117 430 591 455 91 -231 -318 -202 100 441 597 435 66 -268 -345 -139 264 503 505
3412E05k12l19k49J5K21K72J76L1j98l20k21P6K50K51Q3p5j90j36l0lP6J64Q1
$$ 505 293 -26 -275 -260 -39 233 409 440 242 -78 -299 -223 27 278 361 286 96 -40 -70 -73 3 167 248
3435B48M9m6j94j61k8J38J57J22K6j05j53o5l1K5Q1J79M9k1j65j49j06O1J69J28
$$ 248 297 251 57 -104 -132 6 163 285 311 206 53 -12 -43 -18 63 242 291 270 105 -44 -150 -89 80 208
3459B08J20J0j73j99j13k9J29L20K00p0k38l24j77J10L55K89N7j22k68k83q9J44
$$ 208 328 338 165 -34 -147 -176 -47 273 473 403 165 -159 -336 -226 129 418 475 353 85 -198 -287 -143
3481a43K77K93J28j38l54l27o7K09L60K85j5k29l02k45n3K52L57K11J0k30m48
$$ -143 134 427 555 417 63 -264 -331 -122 238 523 508 279 -23 -268 -321 -69 288 499 509 279 -169
3502a69k49Q7L72L68J61j37l34l22n1J32K36K82R2j55k35k14j41J19L51K14J9
$$ -169 -418 -331 41 409 570 433 99 -223 -274 -142 94 376 468 313 78 -136 -277 -158 193 407 426
3523D26j34k48k44NK05J72J56P2j19k38j67l1J13K54J77n2j88j60q7L0J02J42
$$ 426 292 44 -200 -195 10 182 338 410 291 53 -114 -145 -32 222 399 347 159 -1 -88 -58 44 186
3545A86j5K0J6r8j33m5M6P6J71P8p2j20n0j16NR5J56O3L9p1k04j68L7J24K13J53
$$ 186 171 191 207 109 -24 -69 -23 53 224 302 230 110 60 -56 -51 44 200 263 302 231 27 -141 -104 20 233 386
3571C86j1k34j43q8n3J48K51J58l8j45k83k11M6K73K81J17r0k69k78j04J72K09
$$ 386 375 141 -2 -90 -143 5 256 414 376 231 -52 -263 -217 56 337 454 364 95 -183 -287 -115 94
3593I4K39J10j11k95k24j19J57L09K81J4k38k27j91k6K07K70J53oj35k67k34K9
$$ 94 333 443 332 37 -187 -306 -149 160 441 455 217 -10 -201 -227 -20 250 403 397 262 -5 -239 -210
3615b10J86K91K10m6k90k73r8Q8K25K41O4r2j80j72j23O3K37J90M8p8k11j92m2
$$ -210 -24 267 477 431 141 -132 -230 -142 83 324 388 296 116 -56 -179 -116 121 311 359 281 70 -122 -164
3638a64J46J56J26J9q8j09j36k0L4J68J52J8o9j40j26l2J06J06M6M1j5n5r0p2
$$ -164 -18 138 264 283 195 86 -50 -70 -36 132 284 302 233 93 -33 -65 41 147 193 234 219 164 74 2
3662Bm4O7J46J11j3r1j66j09K8J06J47O5L9q7j60j32l8J11K00J84l9j92j89q3
$$ 2 -42 25 171 282 269 178 12 -97 -69 37 184 249 288 201 41 -91 -129 -18 182 366 327 135 -54 -137
3686a37J7J67J68R2kj02k13j51NJ86K62J20l6k44k29o7J15J88J92P9j17j99j70
$$ -137 -120 47 215 307 305 203 -10 -161 -156 30 292 412 376 132 -97 -164 -49 139 331 410 293 94 -76
3709g6p9O9K17K23O3j51k29k19lJ71K11J72j3j48j88j40nJ13K26J45Pj64k48j12
$$ -76 -155 -86 131 354 417 266 37 -182 -185 -14 197 369 356 208 20 -120 -125 -12 214 359 366 202 -46 -158
3733a58N2K10J64N3p0j21j60k6K1J29J13J03k2j59j16q6N9J46J20N1r5r5j10j6
$$ -158 -106 104 268 321 251 130 -30 -56 -35 94 207 310 288 129 13 -73 -14 132 252 303 208 113 3 -13
3757a3J5Q5R0K9J2j04j18l3K9J07P9L5j5m9l2o6n7J1J30J00N6q2j46j31NJ25J27
$$ -13 2 87 177 206 218 114 -4 -37 -8 99 178 213 198 149 117 51 -6 5 135 235 291 209 63 -68 -63 62 189
3784A89J00k5j05q6q2k4O9J25J18Mn8j54j25RJ19J41P5j6q9j56r8rQ2J67J41R
$$ 189 289 264 159 73 -9 -33 36 161 279 283 225 71 -54 -45 74 215 290 274 185 29 -69 -78 4 171 312 321
3810C21j51j87j29O4K02J50O7r5j28j16m3O0J21J28N6m5j61j49n0Q0J69J20L7
$$ 321 170 -17 -146 -82 120 270 337 242 114 -2 -45 15 136 264 320 275 114 -35 -85 -5 164 284 321
3833C21j46j16j00jN6J34J08M9q9j58j38J5J26J32R6k1j51j17j6K6P2O3O2j4l7
$$ 321 175 59 -41 -42 14 148 256 305 216 58 -80 -65 61 193 289 268 117 0 -16 10 82 145 207 193 156
3858A56r8o5LP2J23M4mq3o4l0jK8N0P8L6o7q9p7k8Q5J13N1n9m7o0m1L1KN4K5M2
$$ 156 58 -7 -4 68 191 235 231 148 84 54 53 81 131 209 245 178 89 12 -16 69 182 233 174 127 67 26 57 59 113 138 180
3889A80J6q8q2n4L3J26Q5L9j07r1m8j5K5J09O2M3l4j05j19NJ01J23M7k7q1j13
$$ 180 196 108 26 -28 5 131 216 255 148 57 9 -6 19 128 190 233 199 94 -25 -20 81 204 251 224 143 30
3915C0Oj1N6P4P3J1p4p9j30QQ9J39R0o8j05j18m5N6J05N8M6rq1j40kM8Q5J02L6
$$ 30 36 25 81 155 228 239 165 86 -44 -36 53 192 282 214 109 -9 -54 2 107 165 211 202 121 -19 -21 27 112 214 250
3944B50o8j12o1QM8Q7L2%Jp1p1n5N7O9Q3M8m9j33o2K1P0N1L7Ol2m2o8l3K5R4M1
$$ 250 182 70 9 17 65 152 184 184 185 114 43 -12 45 114 197 245 196 63 1 22 92 143 180 186 154 112 44 11 36 130 171
3975A71J3n0q5m7L7M0K8M3mk1l6j4l5mR8P3j3n4l8l7k5P3J4PJ5Nm3o1rJ1L5R3
$$ 171 184 134 49 2 39 79 107 150 146 125 89 75 40 36 134 207 194 140 102 65 40 113 127 134 149 154 111 50 41 52 87 180
4007A80K4n8n8n8pN3O6K3m1L4n0q7nN6L9Q3Kq5o6oj8N8O1L0o3%Ro5mM0R5kJ9l7
$$ 180 204 146 88 30 23 76 142 165 124 158 108 21 16 72 111 194 196 111 45 39 21 79 140 170 107 107 116 51 47 87 182 180 199 162
4041A62r5l9P1L2J2K6j6n1l8j4jJ8O7L6k9k8m8m6K6Q6K8j9Ql7o9ML3RM5Q2n3o7
$$ 162 67 28 99 131 143 169 153 102 64 50 49 67 134 170 141 113 65 19 45 131 159 140 148 111 42 46 79 88 133 215 162 95
4073I5n8J4L6N9L3j7q3J7jj0K6K8NM9J0r5n5J4M1PM0On0j4j0k5j6P0J1Qj1l3o0
$$ 95 37 51 87 146 179 162 79 96 95 85 111 139 144 193 203 108 53 67 108 115 155 161 111 97 87 62 46 116 127 135 124 91 31
4106C1J9M5M2Jj7j7l4M0k6ONL7L1jo0l9J1L5L3J4j7k9k4J4%kL0Rpk1o3L7J4J9
$$ 31 50 95 137 138 121 104 70 110 84 90 95 132 163 162 102 63 74 109 142 156 139 110 86 100 100 98 128 137 130 109 46 83 97 116
4140A16K3l8l3RO7m7l5J4J0JM9Rn7l7K7J5L3K5Pl7n1L7Qj5N6j2k0J4k9k6j5N1
$$ 116 139 101 68 77 144 97 62 76 86 87 136 145 88 51 78 93 126 151 158 121 70 107 115 100 156 144 124 138 109 83 68 119
4172A19J1j5k2J2k2mJ6j7K2L2kPl9l5MN8L9m6n1j6K9J1L6J6o3KK5rnKJ7j1K9j2
$$ 119 130 115 93 105 83 79 95 78 100 132 130 137 98 63 67 125 164 118 67 51 80 91 127 143 80 82 107 98 93 95 112 101 130 118
4206A18j7L1JKk3lJ3JM2l5l1j2JO4k4Ml7l5M4M4Qj1m9j7J6K3rK1k6J0mj7j2L4
$$ 118 101 132 133 135 112 109 122 123 165 130 99 87 88 152 128 132 95 60 104 148 156 145 96 79 95 118 109 130 104 114 110 93 81 115
4240A15qK3k2j7OJ4j1oj3L7mK4J3k2l1RK5K6Nn8Jk2L4Qlll0J8Jj2oJ2J2jPj4k6
$$ 115 107 130 108 91 97 111 100 94 81 118 114 138 151 129 98 107 132 158 163 105 106 84 118 126 123 120 90 108 109 97 91 103 115 114 121 107 81
4277H1qK6J4JMlRLl5NpL5RJ4k1k3k3K5N2nl8pJ3jJ5j5k1K1jJ0ol1J2k7M0j8J5
$$ 81 73 99 113 114 118 115 124 127 92 97 90 125 134 148 127 104 81 106 158 153 115 108 121 120 135 120 99 120 119 129 123 92 104 77 117 99 114
4314A14l0J9j9k5Pk7O5L1l3Om3oM6K3qj3j2K8l7jj6M1PK1k2l9j6K4K9J8j2LNk6
$$ 114 84 103 84 59 66 39 104 135 102 108 65 59 105 128 120 107 95 123 86 85 69 110 117 138 116 77 61 85 114 132 120 123 128 102
4348A02Ml6K3JL5Rj3m5j7qM6KK6k5l2NJ3j0nK3M4J0k9l4l7L6M2J4J1k6k0Nj7L
$$ 102 106 70 93 94 129 138 125 80 63 55 101 103 129 104 72 77 90 80 75 98 142 152 123 89 52 88 130 144 155 129 109 114 97 100
4382A00l2M7M1rl3m1j3J8K9K1Pj5l2jrJ0J8J9J2Km0j8l4%L7M6J3m0l0L6k0k9K9
$$ 100 68 115 156 147 114 73 60 78 107 128 135 120 88 87 78 88 106 125 137 139 99 81 47 47 84 130 143 103 73 109 89 60 89
4415H9N9k3K7j4n0l6L1P2J8J3m3l3ok0K1L0K3pk7l4k1l6L1N9J4j2j7l0oqJL7K0
$$ 89 148 125 152 138 88 52 83 155 173 186 143 110 104 84 105 135 158 151 124 90 69 33 64 123 137 125 108 78 72 64 65 102 122
4448A22J4Mn8k8j9J2N9P3m2l2n8%L0J5M5Qrk7K1n7KK8M2J4nk9l7kj3LJ8K3L4j1
$$ 122 136 140 82 54 35 47 106 179 137 105 47 47 77 92 137 145 136 109 130 73 75 103 145 159 154 125 88 86 73 76 94 117 151 140
4482A40p2l7J0L4O8L7l3k7q0JM6K1kM0J4m1k3l9LL9K6N1j2l3o2l8L4L9K8K5Mo0
$$ 140 68 31 41 75 143 180 147 120 40 41 87 108 106 146 160 119 96 57 60 99 125 176 164 131 69 31 65 104 132 157 161 101
4514A01j3o8L5L2N7M5l2r4n2O1j6M2M1k7pj0l3m6K0K8N0L2j6n3k1j5N4LO5Qj5
$$ 101 88 20 55 87 144 189 157 63 11 72 56 98 139 112 105 95 62 16 36 64 114 146 130 77 56 41 95 98 163 171 156
4545A56o1k8qPM2M6J5n0k4k2jN1MJ6kkm6k8Jj3J9O3J6m0j5n7j5L9L1J4kK4k6n3
$$ 156 95 67 59 66 108 154 169 119 95 73 72 123 127 143 141 139 93 65 66 53 72 135 151 111 96 39 24 63 94 108 106 130 104 51
4579E1k5K3M4N4J0k9l9lqkM9K5Lkk5n9k6J5L7N0K3l6m5n1LK8M7L5K4m4o7j3k0
$$ 51 26 49 93 147 157 128 89 86 78 76 125 150 153 151 126 67 41 56 93 143 166 130 85 34 37 65 112 147 171 127 60 47 27
4612B7J4J06K6j0l3p1m9M0P1OM2qn3k1m1j3N1P1N3l3n3o8oJ9O8M6J8m3Kq5j5L4
$$ 27 41 147 173 163 130 59 10 50 121 127 169 161 108 87 46 33 84 155 208 175 122 54 48 67 135 181 199 156 158 73 58 92
4644I2L7L1K9j1q7l3k4K2N0N1pp2J2j9j3lM4K4K2J3n5o1J4J5N1K1jj4j8m6jK9
$$ 92 129 160 189 178 91 58 34 56 106 157 150 78 90 71 58 55 99 123 145 158 103 42 56 71 122 143 142 128 110 64 63 92
4676I2oL9L9om7l5k7J7K6Q0Kk9qp2j9J3QL5P2k2m2n0k7MO3M8j0%k2o0l0KP5M0
$$ 92 86 125 164 158 111 76 49 66 92 172 174 145 137 65 46 59 67 102 174 152 110 60 33 37 100 148 138 138 116 56 26 28 103 143
4710A43N1J5q5n8l3N2O4M2pl3o6l1k7M7N1O1ll4p5n4OM6P4L1M0j23j5n1PN1N6
$$ 143 194 209 124 66 33 85 149 191 184 151 85 54 27 74 125 186 183 149 74 20 26 72 146 177 217 94 79 28 35 86 142
4741A42M4l2l9r1j4j0O5J01K5m3m8l5m4O6J5N4%K8p3j8m8L7M2M4kk4k7n9jJ7M
$$ 142 186 154 115 24 10 0 65 166 191 148 100 65 21 87 102 156 156 184 111 93 45 82 124 168 166 142 115 56 55 72 76
4772G6M8K6rm5k9l0K4M4O2Kl6k9Nl0J8pK4K1J2j6n9l8%M9N1L6pl8n6j2J9L1M0
$$ 76 124 150 141 96 67 37 61 105 167 169 133 104 109 79 97 90 114 135 147 131 72 34 34 83 134 170 163 125 69 57 76 107 147
4805A47K4K0k7q8n3KO0O9J4oo4n3j7OO3M1J5lk9r4l5mJ12P3K6o5n3n9jL8R8J0
$$ 147 171 191 164 76 23 25 85 154 168 162 98 45 28 34 97 138 153 150 121 27 -8 -12 100 173 199 134 81 22 21 59 157 167
4837A67J9n5l2p1k9N3R4P8l5p9n6l1J3N3O3L7j2l2n9m2j9N4O1M5op8l1m5NN3N4
$$ 167 186 131 99 28 -1 52 146 224 189 110 54 23 36 89 152 189 177 145 86 44 25 79 140 185 179 101 70 25 30 83 137
4868A37mJ1m6m2k1J9L2K2N2l1rk8j6K4K1K2KMlk7l3OJ5L0J6Jl0m5j1mK8OJ0M3
$$ 137 133 144 98 56 35 54 86 108 160 129 120 92 76 100 121 143 145 149 146 119 86 92 107 137 153 154 124 79 68 64 92 98 108 151
4902A51j4j7l9m5K9M4L3K0m3l6m0k6L5M2N6J1l0m5n0MK6Q9J9J5l2j02k3K5P0L2
$$ 151 137 120 81 36 65 109 142 162 119 83 43 17 52 94 150 161 131 86 36 40 66 155 174 189 157 55 32 57 127 159
4932A59M9j5k7j04l0J5K9J02K3m4l5p8l5L8P3L4J7jq2k5m5K4P1O8Ql6q1l2j3L0
$$ 159 208 193 166 62 32 47 76 178 201 157 122 44 9 47 120 154 171 170 88 63 18 42 113 181 189 153 72 40 27 57
4962E7J03j3rk3m1l7K7j6Q1PM3m3m9k4pM7O2K0l3l6j5k9nJ7L3NJ9j9l8m6K4L8
$$ 57 160 147 138 115 74 37 64 48 129 136 179 136 87 63 56 103 165 185 152 116 101 72 67 84 117 122 141 122 84 38 62 100
4994A00NJ5J2l3Mj5j6pL1M6MOj8o3j8L9K3K6Rnm0l2j3k1Q0N9Kk0m5m2k9M3L3L4
$$ 100 105 120 132 99 103 88 72 65 96 142 146 152 134 71 53 92 115 141 150 145 105 73 60 39 119 178 180 160 115 73 44 87 120 154
5028A54J1l4Jo6l5oQ0O6L1m1j09m0K2M5M1M0J7j7n6l3l0O2M4O5Kq5o4k3K3L9P5
$$ 154 165 131 132 66 31 25 105 171 202 161 52 12 34 79 120 160 177 160 104 71 41 103 147 212 214 129 65 42 65 104 179
5059A79K1j7q1j9Jk3O0J9M4j1o9l0j5lR4L3%m1n3k2l1M3M6J0Ok9l2m1J8J7O8J0
$$ 179 200 183 102 83 84 61 121 140 184 173 104 74 59 56 150 183 183 142 89 67 36 79 125 135 141 112 80 39 57 74 142 152
5091A52k6k3Ok8J5kL1J7J9k1ql1k0mK6M9j1k7Nqj4pj4K7N9Jm0k9j7NK6J6L6n3
$$ 152 126 103 109 81 96 94 125 142 161 140 132 101 81 77 103 152 141 114 119 111 97 90 76 103 162 163 123 94 77 82 108 124 160 107
5125A07l3K7m8j8N5M0J6mj9o0k6QN7L9J7j7k1m3j3K1J5P1j3J1l1o7m3M1O7K0O
$$ 107 74 101 53 35 90 130 146 142 123 63 37 45 102 141 158 141 120 77 64 85 100 171 158 169 138 71 28 69 136 156 162
5156A62j2p5m5PJ8R6PJ3l7p1m4L2L0N4L7j5n0m6j5J2L9L8J0Kk5n7k3L2RM4L0j1
$$ 162 150 75 30 37 55 151 158 171 134 63 19 51 81 135 172 157 107 61 46 58 97 135 145 147 122 65 42 74 83 127 157 146
5188A46o2LJ3k0M1J8J0k1j3k0k2jK2K2rJ3m9JoPjL2%mOj8j4NMM4J0j9J5rj6m0
$$ 146 84 87 100 80 121 139 149 128 115 95 73 72 94 116 107 120 71 72 66 73 72 104 104 100 106 88 74 79 83 127 137 118 133 124 108 68
5224F8L4KK9K1j3l1l0m4N0M9QQm5j3oj8L2J0M0Mj3m2m7RJ3M3K5j7n1l4kJ8lO0
$$ 68 102 104 133 154 141 110 80 36 86 135 143 151 106 93 87 69 101 111 151 155 142 100 53 62 75 118 143 126 75 41 39 57 54 114
5258A14J6Rl1l1k1J5N8K0K3l8m0l8K9jK5M5k6Ll8k0j4J4L6M9j8l2j2l2k5O1J7
$$ 114 130 139 108 77 56 71 129 149 172 134 94 56 85 84 109 154 128 131 93 73 59 73 109 158 140 108 96 64 39 100 117
5289A17J0Nj4m9J8KJ0J7MK1m5k3j3J0L7J6qLLj2mlqL8L4k5j2k8j5lJ1L4Pk4J7
$$ 117 127 132 118 69 87 89 99 116 120 141 96 73 60 70 107 123 115 118 121 109 105 102 94 132 166 141 129 101 86 83 94 128 135 111 128
5324A28l4k3PJ7%L1j5nj3j5qK0J0PK8j3j8j5j0OK3L7lm0J7l5j9N3J5K1Pl4k3k
$$ 128 94 71 78 95 95 126 111 106 93 78 70 90 100 107 135 122 104 89 79 85 108 145 142 102 119 84 65 118 133 154 161 127 104 102
5358A02k7L5O0J7m0j6n0oK2K3JM0k5ln9j3j3M3K8L5j7n5k0jJ1L9K3Jjm5nNJK1
$$ 102 75 110 170 187 147 131 81 75 97 120 121 161 136 133 74 61 48 91 119 154 137 82 62 61 72 111 134 135 134 89 84 89 90 111
5392A11L4j2j2j9l7QK1J4K8ok0J0l0qK0K4OK6k9m4j6LL0K8j7Prk1j0Rj5L6Rk3
$$ 111 145 133 121 102 65 73 94 108 136 130 110 120 90 82 102 126 132 158 129 85 69 72 102 130 113 120 111 90 80 89 74 110 119 96
5426I6J8k2j6K8Jk1M9jNj9j0j2MRPL8m5J0j6k0KLJ2nJ3JKl3JL1J4K5l1j2k2l2
$$ 96 114 92 76 104 105 84 133 132 137 118 108 96 100 109 116 154 109 119 103 83 85 88 100 95 108 109 111 78 79 110 124 149 118 106 84 52
5462E2K1J7K8nMk0j6pJ3k6P3k0k2rj9J3M1NNNj3j7Qk6NK9RM1n6k2j8j7L6J7K1
$$ 52 73 90 118 113 117 97 81 74 87 61 134 114 92 83 64 77 118 123 128 133 120 103 111 85 90 119 128 169 113 91 73 56 92 109 130
5497A30pm3J0k1LK8%K2nNm8JJ6RNlqkk2qRLL1MklpJRJ3J%Qmj8qJ0K0j4Nj7Kj5
$$ 130 123 80 90 69 72 100 100 122 117 122 74 75 91 100 105 102 94 92 70 62 71 74 105 109 107 104 97 98 107 120 121 121 129 125 107 99 109 129 115 120 103 105 90
5540I0qLQJ4%k2mKOK6pj8J5kJ2j9K4l9K4J6J0j2Jpk0J1QrJ3J0k2jqPQJ3mjJ3j6
$$ 90 82 85 93 107 107 85 81 83 89 115 108 90 105 103 115 96 120 81 105 121 131 119 120 113 93 104 112 103 116 126 104 103 95 102 110 123 119 118 131 115
5580A15pj1K4j8J7Nl4J0k3kkL3rjJ2l1K1J2MJ7oNj4j9LK3J9ol4L3l8K7j0onL2
$$ 115 108 97 121 103 120 125 91 101 78 76 74 107 98 97 109 78 99 111 115 132 126 131 117 98 101 124 143 137 103 136 98 125 115 109 104 136
5616A36j3nlk7J5j1N6j4ml1k7M0orNlK4J7l6j1oJ2J9Jk0Rj5lJ6jLJL1k1PoJ6p
$$ 136 123 118 115 88 103 92 148 134 130 99 72 112 106 97 102 99 123 140 104 93 87 99 118 119 99 108 93 90 106 105 108 109 140 119 126 120 136 129
5654A29J5PJl2j4j2J3pOK2m2K3oj6lK0J3jNk6Qk4joJ5POjJj7J5J3mJ1k2k2J2j6
$$ 129 144 151 152 120 106 94 107 100 106 128 86 109 103 87 84 104 117 116 121 95 103 79 78 72 87 94 100 99 100 83 98 111 107 118 96 74 86 70
5692G0K6JJ2K6mll7L6j6J8Kj9J1l2K9k9L5j9J3LOl2jRpj9L6J1%k2KJ0k3K0PoJ5
$$ 70 96 97 109 135 131 128 91 127 111 129 131 112 123 91 120 91 126 107 120 123 129 97 96 105 98 79 115 126 126 104 106 116 93 113 120 114 129
5729A29Lj9j4j4RL2Nk1J0k5K2Jk1K7k2kqJ1J6%QJ7k8k0Mj7J7j1LJ5j4Qr%Pl5M1
$$ 129 132 113 99 85 94 126 131 110 120 95 117 118 97 124 102 100 92 103 119 119 127 144 116 96 100 83 100 89 92 107 93 101 92 92 99 64 105
5766A05l3L6Rj7J6j6J2J3Ok4oJ9k2L2k8L1j8jJJ0l9J9J6j2J5rkJ0nk6KK0l3M6
$$ 105 72 108 117 100 116 100 112 125 131 107 101 120 98 130 102 133 115 114 115 125 86 105 121 109 124 115 113 123 118 92 94 114 81 127
5800A27k2k2Ok0L4kk1J2kj1j4NK1L5j2j2qJ8k4K2J7k3PrlK6Lj8kQjJ0j6KJ2j1
$$ 127 105 83 89 69 103 101 80 92 90 79 65 70 91 126 114 102 94 112 88 110 127 104 111 102 99 125 128 110 108 116 115 125 109 111 123 112
5836A12k6K4oJ7rj0nK3l1J2J7j6k0pL5j7J5j7k0K7Oj3NQ%Qj0OmLK5j8K3pk9KJ7
$$ 112 86 110 104 121 112 102 97 120 89 101 118 102 82 75 110 93 108 91 71 98 104 91 96 104 104 112 102 108 104 107 132 114 137 130 101 103 120
5873A20j2%k0qM4l0lJ4k3J5KJj6J1Mj1J8k1J0KJ4loJ9l3K8kJ2l2MK3jk8K5mrp
$$ 120 108 108 88 80 124 94 91 105 82 97 99 100 84 95 99 88 106 85 95 97 111 108 102 121 88 116 114 126 94 98 121 120 92 117 113 104 97
5910I7J1kJ5plKj5M1n5L1J3q%j3ok2K7Jkj7jJ2j2K0k6J0L7l5J1j2J5oJK1l7PJ8
$$ 97 108 106 121 114 111 113 98 139 84 115 128 120 120 107 101 79 106 107 105 88 87 99 87 107 81 91 128 93 104 92 107 101 102 123 86 93 111
5947A11mLk6K6J%k8J9JLrJ5NmJ8j8J6rk2KNK6rj6j5%j9j5L4kJ4KJ3k6J3J3k2J6
$$ 111 107 110 84 110 111 111 83 102 103 106 97 112 117 113 131 113 129 120 98 100 105 131 122 106 91 91 72 57 91 89 103 105 118 92 105 118 96 112
5985A12OJ4j0mKj7K0NJ2k8J5j1j5J7j0Q%K2n8KK5K1j4KJ1j0k1jj4J6joJ4k1K2
$$ 112 118 132 122 118 120 103 123 128 140 112 127 116 101 118 108 116 116 138 80 82 107 128 114 116 127 117 96 95 81 97 96 90 104 83 105
6020A05k7R%OjPMJJ4k0rK8J3J0k8jOlJ5Lj0JKj9kJ6k8K8nk7L4k9mJ1mRmJJ8ro
$$ 105 78 87 87 93 92 99 103 104 118 98 89 117 130 140 112 111 117 114 129 132 122 123 125 106 104 120 92 120 115 88 122 93 89 100 96 105 101 102 120 111 105
6061A05j5mQL3%l1J1j4k1J2L4QK4l9j0%oRnL5j6KlknJ1mQmPk4%Lk8QRRk7J9j9
$$ 105 90 86 94 127 127 96 107 93 72 84 118 126 150 111 101 101 95 104 99 134 118 120 117 115 110 121 117 125 121 128 104 104 107 79 87 96 105 78 97 78
6101G8jJ8mK8k%kj2j8J2J6QLj3Oj3K%PK2k4qK6j9JoK1L2l4PqmoJ6Pk2J2j9j7K8
$$ 78 77 95 91 119 117 117 115 103 85 97 113 121 124 111 117 104 106 106 113 135 111 103 129 110 111 105 126 158 124 131 123 119 113 129 136 114 126 107 90 118
6141A18k3j8L0oQj8j1J1kK8Kk6K3j0qJ0j9L7Nrjj2j5JKj5M4j4rmnR%PJ5j8onP
$$ 118 95 77 107 101 109 91 80 91 89 117 119 93 116 106 98 108 89 126 131 122 121 109 94 95 97 82 126 112 103 99 94 103 103 110 125 107 101 96 103
$$ [...]
8191I5
##END NTUPLES=NMR FID
##END=
