##TITLE=1H_E362612
 aceton d6
 8 sc, 
 27.12.2023
##JCAMPDX= 6.0         $$ Bruker NMR JCAMP-DX V2.0
##DATA TYPE= NMR FID
##DATA CLASS= NTUPLES
##ORIGIN= UXNMR, Bruker Analytische Messtechnik GmbH
##OWNER= root
$$ XWIN-NMR		Version 3.5
$$ Wed Dec 27 13:49:04 2023 Russian Standard Time (UT+4h)  she@DPX200
##.OBSERVE FREQUENCY= 200.1313
##.OBSERVE NUCLEUS= ^1H
##.DELAY= (6, 6)
##.ACQUISITION MODE= SIMULTANEOUS
##.ACQUISITION SCHEME= undefined
##.AVERAGES= 8
##.DIGITISER RES= 18
##SPECTROMETER/DATA SYSTEM= spect
##.PULSE SEQUENCE= zg30
##.SOLVENT NAME= Acetone
##.SHIFT REFERENCE= (INTERNAL, Acetone, 0, 15.7039)
##AUDIT TRAIL= $$ (NUMBER, WHEN, WHO, WHERE, WHAT)
$$ ##TITLE= Audit trail, XWIN-NMR		Version 3.5
$$ ##JCAMPDX= 5.01
$$ ##ORIGIN= Bruker BioSpin GmbH
$$ ##OWNER= she
$$ F:/spectra/data/she/nmr/H-F/1/audita.txt
$$ ##AUDIT TRAIL=  $$ (NUMBER, WHEN, WHO, WHERE, WHAT)
(   1,<2023-12-27 13:47:04.73 +0400>,<she>,<DPX200>,
      <created by zg, POWCHK disabled, PULCHK disabled
       configuration hash MD5:
       00 E9 B6 7A A2 85 ED C7 34 08 36 98 17 FE 4E 26
       data hash MD5: 16K
       66 EC B5 A4 5B 7C C5 90 FB 9C 67 A2 09 BD 76 27>)
$$ ##END=
$$ 
$$ hash MD5
$$ DD 2A 9A 99 11 5E 4E 71 B8 69 15 03 76 B5 90 66
##$RELAX= 
##$RELAX= 
##$RELAX= 
##$RELAX= 
##$RELAX= 
##$RELAX= 
$$ Bruker specific parameters
$$ --------------------------
##$DU= <F:/spectra>
##$EXPNO= 1
##$NAME= <H-F>
##$PROCNO= 1
##$TYPE= <nmr>
##$USER= <she>
##$AMP= (0..31)
100 100 100 100 100 100 100 100 100 100 100 100 100 100 100 100 100 100 
100 100 100 100 100 100 100 100 100 100 100 100 100 100 
##$AQSEQ= 0
##$AQ_mod= 1
##$AUNM= <au_zg>
##$AUTOPOS= <>
##$BF1= 200.13
##$BF2= 200.13
##$BF3= 200.13
##$BF4= 200.13
##$BF5= 200.13
##$BF6= 200.13
##$BF7= 200.13
##$BF8= 200.13
##$BYTORDA= 1
##$CFDGTYP= 0
##$CFRGTYP= 5
##$CHEMSTR= <none>
##$CNST= (0..31)
1 1 145 1 1 1 1 1 1 1 1 1 1 1 1 1 1 1 1 1 1 1 1 1 1 1 1 1 1 1 1 1 
##$CPDPRG= <>
##$CPDPRG1= <>
##$CPDPRG2= <>
##$CPDPRG3= <>
##$CPDPRG4= <mlev>
##$CPDPRG5= <mlev>
##$CPDPRG6= <mlev>
##$CPDPRG7= <mlev>
##$CPDPRG8= <mlev>
##$CPDPRGB= <>
##$CPDPRGT= <>
##$D= (0..31)
0 1.2 0 0 0 0 0 0 0 0.06 0 0.03 0 0 0 0 0.0002 0 0 0 0 0 0 0 0 0 0 0 0 
0 0 0 
##$DATE= 1703670424
##$DBL= (0..7)
120 120 120 120 120 120 120 120 
##$DBP= (0..7)
150 150 150 150 150 150 150 150 
##$DBP07= 0
##$DBPNAM0= <>
##$DBPNAM1= <>
##$DBPNAM2= <>
##$DBPNAM3= <>
##$DBPNAM4= <>
##$DBPNAM5= <>
##$DBPNAM6= <>
##$DBPNAM7= <>
##$DBPOAL= (0..7)
0.5 0.5 0.5 0.5 0.5 0.5 0.5 0.5 
##$DBPOFFS= (0..7)
0 0 0 0 0 0 0 0 
##$DE= 6
##$DECBNUC= <off>
##$DECIM= 32
##$DECNUC= <off>
##$DECSTAT= 4
##$DIGMOD= 1
##$DIGTYP= 9
##$DL= (0..7)
0 120 120 120 120 120 120 120 
##$DP= (0..7)
150 150 150 150 150 150 150 150 
##$DP07= 0
##$DPNAME0= <>
##$DPNAME1= <>
##$DPNAME2= <>
##$DPNAME3= <>
##$DPNAME4= <>
##$DPNAME5= <>
##$DPNAME6= <>
##$DPNAME7= <>
##$DPOAL= (0..7)
0.5 0.5 0.5 0.5 0.5 0.5 0.5 0.5 
##$DPOFFS= (0..7)
0 0 0 0 0 0 0 0 
##$DQDMODE= 0
##$DR= 18
##$DS= 0
##$DSLIST= <SSSSSSSSSSSSSSS>
$$ [...]
##$SUBNAM2= <"">
##$SUBNAM3= <"">
##$SUBNAM4= <"">
##$SUBNAM5= <"">
##$SUBNAM6= <"">
##$SUBNAM7= <"">
##$SUBNAM8= <"">
##$SUBNAM9= <"">
##$SW= 18.0517328524113
##$SWIBOX= (0..15)
0 0 2 0 0 0 0 0 0 0 0 0 0 0 0 0 
##$SW_h= 3612.71676300578
##$TD= 16384
##$TD0= 1
##$TE= 0
##$TE2= 300
##$TE3= 300
##$TEG= 300
##$TL= (0..7)
0 120 120 120 120 120 120 120 
##$TP= (0..7)
150 150 150 150 150 150 150 150 
##$TP07= 0
##$TPNAME0= <>
##$TPNAME1= <>
##$TPNAME2= <>
##$TPNAME3= <>
##$TPNAME4= <>
##$TPNAME5= <>
##$TPNAME6= <>
##$TPNAME7= <>
##$TPOAL= (0..7)
0.5 0.5 0.5 0.5 0.5 0.5 0.5 0.5 
##$TPOFFS= (0..7)
0 0 0 0 0 0 0 0 
##$TUNHIN= 0
##$TUNHOUT= 0
##$TUNXOUT= 0
##$USERA1= <user>
##$USERA2= <user>
##$USERA3= <user>
##$USERA4= <user>
##$USERA5= <user>
##$V9= 5
##$VALIST= <valist>
##$VCLIST= <CCCCCCCCCCCCCCC>
##$VD= 0
##$VDLIST= <DDDDDDDDDDDDDDD>
##$VPLIST= <PPPPPPPPPPPPPPP>
##$VTLIST= <TTTTTTTTTTTTTTT>
##$WBST= 1024
##$WBSW= 4
##$XGAIN= (0..3)
0 0 0 0 
##$XL= 0
##$YL= 0
##$YMAX_a= 834938
##$YMIN_a= -1124734
##$ZGOPTNS= <>
##$ZL1= 120
##$ZL2= 120
##$ZL3= 120
##$ZL4= 120
##$ABSF1= 10
##$ABSF2= 0
##$ABSG= 5
##$ABSL= 3
##$ALPHA= 0
##$AQORDER= 0
##$ASSFAC= 0
##$ASSFACI= 0
##$ASSFACX= 0
##$ASSWID= 0
##$AUNMP= <proc_1d>
##$AZFE= 0.1
##$AZFW= 0.1
##$BCFW= 1
##$BC_mod= 2
##$BYTORDP= 1
##$COROFFS= 0
##$CY= 11.3945322036743
##$DATMOD= 1
##$DC= 2
##$DFILT= <>
##$DTYPP= 0
##$F1P= 15.7292609196834
##$F2P= 12.9074282941183
##$FCOR= 0.5
##$FTSIZE= 0
##$FT_mod= 4
##$GAMMA= 1
##$GB= 0.15
##$INTBC= 1
##$INTSCL= 1
##$ISEN= 128
##$LB= 0.24
##$LEV0= 0
##$LPBIN= 0
##$MAXI= 10000
##$MC2= 0
##$MEAN= 0
##$ME_mod= 0
##$MI= 1.114404
##$NCOEF= 0
##$NC_proc= 0
##$NLEV= 6
##$NOISF1= 3.799351
##$NOISF2= 2.8
##$NSP= 1
##$NTH_PI= 0
##$NZP= 0
##$OFFSET= 15.70392
##$PC= 1
##$PHC0= -24750.14
##$PHC1= 10.65273
##$PH_mod= 1
##$PKNL= yes
##$PPARMOD= 0
##$PSCAL= 0
##$PSIGN= 0
##$REVERSE= no
##$SF= 200.130013532006
##$SI= 16384
##$SIGF1= 3
##$SIGF2= 2
##$SINO= 400
##$SIOLD= 16384
##$SREGLST= <1H.CDCl3>
##$SSB= 0
##$STSI= 0
##$STSR= 0
##$SW_p= 3612.71676300578
##$SYMM= 0
##$S_DEV= 0
##$TDeff= 0
##$TDoff= 0
##$TI= <>
##$TILT= no
##$TM1= 0
##$TM2= 0
##$TOPLEV= 0
##$USERP1= <user>
##$USERP2= <user>
##$USERP3= <user>
##$USERP4= <user>
##$USERP5= <user>
##$WDW= 1
##$XDIM= 8192
##$YMAX_p= 0
##$YMIN_p= 0
$$ End of Bruker specific parameters
$$ ---------------------------------
##NTUPLES= NMR FID
##VAR_NAME=  TIME,          FID/REAL,        FID/IMAG
##SYMBOL=    X,             R,               I
##VAR_TYPE=  INDEPENDENT,   DEPENDENT,       DEPENDENT
##VAR_FORM=  AFFN,          ASDF,            ASDF
##VAR_DIM=   8192,          8192,            8192
##UNITS=     SECONDS,       ARBITRARY UNITS, ARBITRARY UNITS
##FACTOR=    0.0002768,     1,               1
##FIRST=     0,             0,               0
##LAST=      2.2672688,     0,               0
##MIN=       0,             -1124734,        0
##MAX=       2.2672688,     834938,          0
$$ Real data points
##PAGE= N=1
##DATA TABLE= (X++(R..R)), XYDATA
0 0 0 0 0 0 0 0 0 0 0 0 0 0 4 -7 1 -7 8 -9 10 -15 20 -24 28 -30 38 -47 55 -63 71 -86 99 -113 129 -146 168
35 168 -189 214 -240 271 -302 338 -378 423 -469 516 -573 635 -702 773 -850 938 -1035 1137
53 1137 -1251 1378 -1519 1674 -1850 2044 -2268 2522 -2812 3150 -3536 3975 -4437 4793 -4427
68 -4427 -267 59307 804533 93483 -682526 212616 480772 -381604 -354158 517232 352728
79 352728 -455092 -311803 427782 222500 -442848 -73736 562778 -73589 -644684 215143
89 215143 616247 -367763 -456294 509185 266010 -577489 -102291 549682 -5399 -471497
99 -471497 86645 409448 -159514 -409228 204492 405704 -248741 -363359 305237 249095
109 249095 -401479 -120882 480336 16865 -469938 58671 363568 -116371 -219820 176023
119 176023 142763 -203529 -131904 201066 146459 -165744 -110860 142463 35503 -135851 48418
130 48418 141458 -90478 -114183 93727 47623 -66318 37576 25768 -96121 14986 98616
141 98616 -51964 -65498 74556 22907 -98828 -4656 121377 -3755 -148345 15252 165795
152 165795 -49219 -174139 101199 169693 -162681 -145996 224755 99333 -271443 -32610
162 -32610 291391 -34643 -277261 93811 247818 -141412 -216181 192340 192608 -244044 -164444
173 -164444 285815 117194 -308384 -45912 316245 -41252 -318201 124408 302954 -195762
183 -195762 -264620 242085 197257 -269828 -121422 285116 50529 -299356 9158 305981
193 305981 -67231 -294199 126641 256387 -183670 -199890 232848 139633 -268209 -79426
203 -79426 286495 17559 -281045 49655 256928 -111846 -221958 162027 186321 -197374
213 -197374 -145550 224622 92573 -245291 -30536 251125 -30984 -239011 81831 211678
223 211678 -124205 -177819 160586 138103 -190476 -94001 204768 46421 -202284 -20
233 -20 191650 -41297 -178019 78501 157338 -111361 -124712 135370 84318 -144504 -44855
244 -44855 141485 12337 -132416 16089 120284 -43004 -102785 64693 79675 -75322
254 -75322 -54718 76287 32011 -74218 -11085 71086 -9683 -62159 27345 44544 -35554 -22268
266 -22268 33761 3635 -26935 9913 20443 -20172 -11734 27647 -3638 -29022 24425 24223 -42073
279 -42073 -16135 52170 6623 -58200 6641 63279 -28045 -65737 54397 60930 -76944 -48540
291 -48540 89794 30328 -97635 -8899 104652 -17135 -109205 47062 106437 -74409 -93697
302 -93697 94025 74070 -107446 -49363 121733 21088 -134811 11693 140654 -42702
312 -42702 -132348 69088 113345 -91710 -89559 115395 64240 -138248 -36039 151962 4440
323 4440 -151839 26881 139586 -58119 -124036 88842 106128 -118972 -84186 141147 55251
334 55251 -150285 -22104 147166 -12788 -140056 47670 132772 -80310 -119890 107632
344 107632 97701 -123965 -66168 131783 32145 -135375 1616 138576 -32239 -134243 60436
355 60436 118829 -82210 -93259 97143 64811 -108480 -38656 118347 14145 -123423 9571
366 9571 116462 -33082 -99737 52558 78687 -69687 -60898 83115 44337 -91165 -26024
377 -26024 88992 5037 -78681 14436 66746 -29613 -57738 41784 50419 -49779 -37348 52644
389 52644 19480 -48098 -556 41068 -12530 -34455 19938 28564 -22297 -18045 21154 3293
401 3293 -17164 9381 11639 -15421 -7889 15317 3483 -15158 4639 15251 -19114 -14565 32654
414 32654 8263 -40281 1568 39750 -13894 -35545 28118 30620 -43703 -24626 55885 16077
426 16077 -59149 -3771 56592 -9423 -53784 24839 56129 -40877 -57586 56959 51096 -68654
438 -68654 -33168 76329 9992 -81893 11654 85612 -29932 -84282 45680 73523 -60193
449 -60193 -56684 72442 39122 -83787 -24542 94005 8171 -101452 12995 100622 -38140
460 -38140 -90234 60971 73448 -77940 -54675 90018 36122 -98274 -16827 101502 -2882
471 -2882 -97840 22865 90943 -41970 -83165 61651 74266 -80162 -58896 93294 35538
482 35538 -97370 -8196 94625 -15261 -89780 31337 83533 -43105 -73627 54037 58434
493 58434 -65720 -41761 76032 26447 -83698 -11965 85684 -6437 -80154 27940 67361
504 67361 -45625 -51060 54134 36474 -54285 -24456 52851 13991 -52474 -2561 52019 -8387
516 -8387 -48294 18285 42135 -26740 -33668 34289 22200 -38540 -7748 36192 -6024 -27483
528 -27483 14046 17272 -14782 -10554 11701 6637 -10139 -2926 10166 -2274 -9756 7259 7432
541 7432 -10915 -3621 13276 -2280 -14784 11301 13522 -21287 -6593 27957 -3998 -27435 14046
554 14046 22178 -20759 -16766 25384 13679 -29550 -10064 33366 3092 -35858 6818 37383
566 37383 -16878 -38643 26514 37186 -36582 -29436 46264 15451 -52835 -182 54099 -11401
578 -11401 -51307 19639 46818 -28889 -41565 40967 35074 -51902 -26380 57863 14792 -59767
590 -59767 -43 60838 -16744 -60708 32850 55997 -44433 -44907 50899 30488 -55360 -17338
602 -17338 60922 6564 -65449 4978 65149 -19238 -59178 34000 50463 -46267 -41487 54766
614 54766 30825 -59688 -16182 61490 -420 -60205 13943 56160 -22399 -50248 29438 42492
626 42492 -38711 -32854 48458 21964 -53438 -10848 51588 -168 -46181 11609 41283 -22516
638 -22516 -36785 30129 29986 -32627 -20514 31863 10627 -31745 -2665 33400 -3635 -33050
650 -33050 9821 27648 -15869 -18924 20215 11273 -21984 -6799 21628 3212 -19338 2106
662 2106 15396 -7903 -10860 11082 7118 -10915 -4327 10081 1083 -9687 3434 7942 -7699
675 -7699 -3284 9271 -2603 -7906 6763 5617 -8395 -3650 9527 525 -11492 4407 13013
688 13013 -9860 -12334 13539 9525 -15843 -5654 18878 964 -23009 5154 25396 -12162
700 -12162 -23085 18525 17300 -23035 -11165 26873 6429 -30752 -1544 33341 -5088 -32922
712 -32922 13121 29840 -20759 -25888 27701 21698 -34643 -15962 40200 7040 -42330 3586
724 3586 40652 -13219 -37314 20806 33862 -27809 -29760 34862 23006 -40454 -13621 43188
736 43188 3644 -43817 5419 43254 -14323 -41059 23594 35580 -31544 -26735 36686 17302
748 17302 -38972 -9179 40320 1874 -40967 6375 39157 -15180 -34115 22814 27185 -28192
760 -28192 -20671 31857 14227 -34611 -6701 35092 -2115 -32601 10101 28288 -15665 -24183
772 -24183 19364 20158 -22802 -14658 25812 7356 -26471 191 24979 -5754 -22423 9150 19542
785 19542 -12310 -15546 15576 9870 -17466 -4054 16992 75 -15258 2039 13475 -4063
797 -4063 -11270 6954 7731 -9235 -3402 9145 217 -7324 1138 5274 -2086 -3579 3794 1151 -5161
812 -5161 1968 4466 -4475 -1763 5527 -955 -5744 2854 6505 -4861 -7180 7875 6006 -11025
826 -11025 -2601 12829 -1382 -13399 4425 13740 -7128 -13936 10837 12788 -15081 -9343 18430
839 18430 4679 -20004 -621 20981 -2918 -21786 7422 21540 -13235 -19024 18309 14763
851 14763 -21515 -10292 23544 6210 -25394 -1236 26542 -5154 -25770 11453 22927 -16060
863 -16060 -19351 19242 15851 -22391 -11506 25568 5440 -27284 1495 26588 -7088 -24283
875 -24283 11413 21653 -15424 -18521 19811 13782 -23232 -7903 24413 2435 -23870 1939
887 1939 23053 -6277 -22029 11358 19454 -16357 -15063 19315 10000 -20247 -5663 20458 1588
900 1588 -20486 2947 19626 -7787 -17138 11169 13733 -12725 -10670 13682 7861 -15088 -4306
913 -4306 16120 -233 -15349 3965 13074 -5874 -10584 6842 8607 -8075 -6449 9451 3536
926 3536 -9555 -816 8312 -740 -6919 1490 6159 -2627 -5284 4202 3425 -4696 -869 3613 -703
941 -703 -1898 1026 1015 -1008 -679 1455 -336 -1617 2060 664 -3325 865 3340 -1959 -3069 2621
957 2621 3295 -3953 -3514 6109 2486 -7738 18 8003 -2524 -7375 4057 7047 -5238 -6979 6999
972 6999 6140 -8953 -3919 10137 1383 -10587 305 10870 -1995 -11201 4836 10810 -8383
985 -8383 -8947 10748 6322 -11413 -4044 11446 1968 -12154 726 13060 -3936 -12849 6671
998 6671 11162 -8530 -8944 10290 7056 -12577 -4810 14406 1651 -14494 2071 13017 -4981
1011 -4981 -11485 7073 10803 -8826 -9856 10773 7362 -12400 -3673 13083 655 -13117 1273
1024 1273 12784 -3357 -11865 6305 9942 -9008 -7482 10266 5462 -10112 -4002 10009 2117
1037 2117 -10607 815 10911 -3617 -9960 5321 7957 -6067 -6036 6850 4633 -8088 -2980
1050 -2980 8487 916 -7553 859 6156 -1979 -5683 2875 5839 -3905 -5052 4835 2736 -4883 -358
1065 -358 4257 -664 -3569 711 3165 -944 -2313 1757 1036 -2169 6 1572 -178 -661 50 421
1081 421 -669 -241 1865 -448 -2286 1861 1215 -2914 419 3116 -1279 -2770 1644 2816 -2393 -2635
1097 -2635 3701 1867 -4660 -756 4740 -141 -4542 749 4979 -1972 -5571 4035 5268 -5931 -3615
1112 -3615 6773 1765 -6915 -491 7195 -753 -7716 2460 7632 -4424 -6564 5991 5322 -7051
1126 -7051 -4339 8208 3358 -9530 -1246 10373 -1644 -9739 4283 8388 -5682 -7308 6844
1139 6844 6497 -8032 -5144 9501 2924 -10241 -508 10299 -1323 -10112 2965 9798 -5271
1152 -5271 -8728 7785 6657 -9483 -4303 9659 2522 -9349 -1146 9464 -780 -9635 3123
1165 3123 9087 -5180 -7785 6486 6236 -7386 -4719 8493 2945 -9261 -524 8809 -1747 -7417
1179 -7417 3260 6118 -3989 -5554 4654 4948 -5574 -3525 6168 1447 -6064 208 5611 -1096
1193 -1096 -5185 1872 4444 -3026 -3141 3932 1476 -3735 -454 2912 113 -2385 143 2249 -898
1208 -898 -2035 1852 1185 -2023 -88 1519 -583 -945 976 764 -1403 -193 1879 -1018 -1862 2375
1224 2375 972 -2860 -15 2642 -654 -2650 1073 3043 -2076 -3229 3461 2569 -4535 -1362 5032
1239 5032 304 -5421 552 5933 -1960 -6031 3793 5268 -5580 -3930 6574 2684 -7033 -1636
1253 -1636 7662 391 -8281 1647 8324 -3996 -7546 5716 6453 -6973 -5318 8284 3897 -9602
1267 -9602 -1702 10297 -840 -10072 3021 9279 -4595 -8552 6216 7655 -8157 -6063 9876
1280 9876 3677 -10700 -1335 10710 -673 -10541 2505 10106 -4894 -9100 7077 7225 -8573
1293 -8573 -5066 9322 3366 -9663 -1702 10049 -455 -9838 2929 8835 -4944 -7353 6144
1306 6144 5933 -6900 -4610 7778 2909 -8295 -703 8122 -1294 -7263 2589 6307 -3535 -5574
1320 -5574 4617 4417 -5687 -2802 6112 1056 -5816 148 5197 -948 -4676 1854 4042 -2920 -2953
1335 -2953 3611 1593 -3513 -552 3011 39 -2543 447 2316 -1266 -1581 1854 463 -1752 510
1350 510 1118 -927 -488 1151 106 -1543 493 1826 -1519 -1563 2580 614 -3135 240 3290 -840
1366 -840 -3382 1562 3547 -2818 -3227 4200 2225 -5106 -1091 5586 106 -5822 968 6148 -2462
1381 -2462 -6018 4267 5301 -5808 -3989 6733 2813 -7414 -1683 8193 4 -8642 2175 8537
1395 8537 -4288 -7697 5837 6611 -7010 -5441 8285 3874 -9452 -1705 10112 -520 -9956
1408 -9956 2390 9363 -4037 -8588 5797 7491 -7648 -5741 9086 3630 -9650 -1592 9673
1421 9673 -176 -9584 2005 9333 -4090 -8287 6005 6763 -7267 -5051 8074 3369 -8688 -1716
1435 -1716 9133 -304 -8862 2415 8065 -4088 -6816 5183 5630 -6063 -4340 6987 2765 -7546
1449 -7546 -872 7468 -743 -6769 1972 5957 -3030 -5032 4119 4004 -4935 -2595 5093 1225 -4665
1464 -4665 -184 4218 -642 -4017 1445 3560 -2294 -2560 2702 1389 -2593 -418 2217 -133 -2025
1479 -2025 527 1648 -947 -939 1159 25 -927 519 426 -725 -172 956 -147 -1219 686 1519 -1631
1496 -1631 -1244 2567 461 -3104 417 3289 -1202 -3425 2130 3355 -3197 -2866 4127 1891 -4726
1511 -4726 -980 5098 238 -5492 712 5973 -2107 -5980 3846 5341 -5242 -4231 6193 2970
1525 2970 -6840 -1464 7383 -234 -7615 1895 7336 -3314 -6554 4407 5703 -5677 -4864 7156
1539 7156 3585 -8378 -1776 8778 -435 -8453 2616 7978 -4320 -7259 5684 6155 -6785 -4477
1553 -4477 7616 2490 -8192 -898 8700 -408 -8808 2055 8433 -4060 -7256 6156 5632 -7410
1567 -7410 -3942 7841 2323 -7766 -551 7735 -1232 -7440 2730 6796 -3759 -5760 4585 4650
1581 4650 -5778 -3341 6814 1873 -7089 -117 6391 -1515 -5307 2662 4448 -3451 -3984 3750 3188
1596 3188 -3910 -1956 3976 792 -4165 38 4188 -613 -3878 1439 2925 -2227 -1633 2654 634
1611 634 -2253 -124 1432 -100 -735 424 398 -791 -243 709 -151 -339 658 -19 -1182 209 1690
1628 1690 -513 -1970 1410 1775 -2634 -1093 3518 133 -3647 863 3380 -1782 -3093 2557 2903
1643 2903 -3273 -2432 3906 1698 -4375 -681 4986 -290 -5568 1503 5750 -3000 -5182 4526 3926
1658 3926 -5738 -2576 6394 1456 -6702 -275 6742 -1152 -6686 2779 6415 -4327 -5825 5599
1672 5599 5041 -6690 -3647 7828 1772 -8334 496 8396 -2388 -7718 3862 6790 -4973 -5761
1686 -5761 6165 4570 -7343 -3029 8108 1319 -8376 439 8257 -2259 -7854 4078 6885 -5686
1700 -5686 -5539 6756 3839 -7299 -2271 7395 828 -7473 626 7341 -2170 -6826 3624 5866
1714 5866 -4716 -4576 5626 3386 -6097 -1926 6253 342 -6003 1069 5341 -2029 -4518 2676 3718
1729 3718 -3167 -2823 3787 1854 -4096 -741 3948 -219 -3417 938 2674 -1569 -2070 2062 1345 -2255
1745 -2255 -616 1936 -23 -1345 487 918 -747 -637 967 323 -1065 267 824 -987 -239 1291
1761 1291 -324 -1446 848 1355 -1368 -1137 2015 729 -2614 23 2990 -879 -2988 1614 2815
1776 2815 -2307 -2562 3169 2071 -4036 -1228 4673 170 -4928 866 4937 -1906 -4736 3119 4345
1791 4345 -4355 -3582 5470 2430 -6120 -1222 6472 -112 -6560 1613 6596 -3125 -6174 4701 5246
1806 5246 -5833 -3989 6658 2642 -7325 -1176 7895 -446 -7972 2201 7489 -3820 -6546 5093
1820 5093 5529 -6282 -4377 7301 2861 -7983 -1237 8148 -580 -7749 2189 7190 -3699 -6467
1834 -6467 5085 5392 -6192 -3947 6831 2348 -7121 -724 6967 -727 -6752 2168 6296 -3473
1848 -3473 -5290 4464 4002 -5089 -2612 5482 1435 -5643 -299 5511 -946 -5045 1998 4179 -2777
1863 -2777 -3309 3307 2409 -3725 -1593 3916 668 -3767 281 3270 -1036 -2544 1494 2109 -1759 -1584
1879 -1584 1981 922 -1924 -181 1632 -356 -1122 679 693 -800 -378 787 -232 -690 799 374
1895 374 -1177 238 1238 -874 -1158 1330 889 -1834 -649 2417 209 -2890 606 3067 -1472 -2859
1911 -2859 2307 2566 -3051 -2184 3864 1550 -4492 -490 4947 -647 -4967 1797 4787 -2817 -4505
1926 -4505 3792 3952 -4835 -3058 5801 1834 -6390 -482 6699 -824 -6756 2232 6456 -3675 -5752
1941 -5752 5021 4632 -6014 -3425 6746 2128 -7326 -737 7676 -780 -7606 2497 7019 -4121
1955 -4121 -6084 5474 4981 -6478 -3647 7200 2131 -7502 -392 7408 -1200 -7073 2571 6608
1969 6608 -3717 -5911 4913 4809 -5998 -3263 6793 1678 -7002 -216 6710 -1145 -6230 2423
1983 2423 5453 -3643 -4577 4342 3636 -4715 -2572 5001 1414 -5377 -259 5445 -1016 -5049 2083
1998 2083 4097 -2810 -3061 3373 2103 -3507 -1259 3481 511 -3208 291 2848 -719 -2449 1060
2013 1060 2110 -1436 -1537 1766 729 -1895 146 1649 -628 -890 689 16 -707 560 617 -870
2029 -870 -253 1007 -334 -1070 895 1094 -1302 -1101 1579 1095 -1984 -817 2699 115 -3375 853
2045 853 3645 -1887 -3356 2724 2752 -3483 -1964 4155 1178 -4612 -221 4914 -619 -4955 1539 4862
2061 4862 -2624 -4772 3900 4214 -5189 -3206 6258 1746 -6742 -184 6714 -1270 -6473 2562 6018
2076 6018 -3742 -5340 4901 4530 -5802 -3434 6630 2168 -7327 -680 7699 -1172 -7567 3068
2090 3068 6824 -4562 -5606 5551 4342 -6262 -2959 6862 1618 -7288 -186 7435 -1175 -7045
2104 -7045 2675 6358 -4149 -5449 5657 4320 -6634 -2845 6861 1159 -6538 418 6155 -1764
2118 -1764 -5874 2821 5473 -3631 -4564 4293 3243 -4943 -1991 5422 859 -5507 343 5192 -1420
2133 -1420 -4337 2411 3382 -2883 -2510 2973 1906 -3054 -1114 3112 321 -3087 337 2670 -819
2148 -819 -2037 1137 1359 -1467 -719 1629 222 -1325 156 686 -483 41 612 -365 -647 587 271
2165 271 -790 204 1295 -614 -1697 1138 1745 -1656 -1296 2228 755 -3031 -170 3599 -507 -3785
2181 -3785 1433 3581 -2444 -2991 3418 2506 -4151 -1968 4797 1077 -5288 165 5593 -1528 -5470
2196 -5470 2825 5037 -4007 -4355 5124 3285 -6172 -2094 6738 614 -6943 876 6744 -2424 -6403
2211 -6403 3978 5848 -5358 -4949 6453 3461 -7163 -1650 7672 24 -7890 1601 7753 -3273
2225 -3273 -7020 4816 5814 -6088 -4423 7140 3062 -7764 -1540 8131 -210 -8016 2046 7463
2239 7463 -3713 -6485 4998 5382 -6031 -4083 6739 2679 -7185 -1026 7181 -590 -6855 1935
2253 1935 6218 -3166 -5489 4259 4464 -5077 -3081 5518 1745 -5534 -430 5359 -625 -4925 1678
2268 1678 4428 -2516 -3619 3123 2602 -3467 -1668 3461 786 -3322 -28 3040 -788 -2596 1296
2283 1296 1840 -1529 -1073 1452 506 -1278 -24 1065 -411 -651 771 27 -848 520 560 -1032 -251
2300 -251 1377 -160 -1656 699 1770 -1400 -1645 2237 1183 -2787 -470 3175 -136 -3336 906
2315 906 3430 -1803 -3309 2848 2841 -3734 -2133 4393 1233 -4872 -254 5217 -895 -5385 2309 5024
2331 5024 -3601 -4367 4614 3435 -5468 -2464 6190 1164 -6765 320 6945 -1876 -6670 3315 5979
2346 5979 -4679 -5123 5842 3998 -6964 -2547 7725 885 -7751 763 7595 -2397 -7149 3870
2360 3870 6420 -5319 -5390 6525 3970 -7221 -2381 7525 680 -7670 861 7563 -2516 -6958
2374 -6958 3947 5927 -5042 -4563 5818 3349 -6436 -1867 6803 480 -6800 933 6373 -2249
2388 -2249 -5503 3317 4544 -4164 -3501 4821 2416 -5215 -1228 5119 15 -4573 928 4111 -1796
2403 -1796 -3583 2546 2881 -3014 -1966 3206 1035 -2994 -237 2698 -486 -2364 964 2009 -1304
2418 -1304 -1376 1444 765 -1244 -142 1005 -181 -915 467 699 -625 -242 695 -345 -509 836 167
2435 167 -1118 237 1184 -720 -1118 1284 935 -1873 -561 2351 79 -2494 508 2453 -1123 -2435
2451 -2435 1826 2455 -2631 -2155 3456 1487 -3980 -547 4251 -476 -4380 1555 4300 -2569 -4045
2466 -4045 3545 3364 -4273 -2439 4843 1543 -5263 -482 5705 -708 -5945 1944 5580 -3221 -4727
2481 -4727 4357 3744 -5227 -2735 5912 1625 -6232 -340 6187 -1021 -5893 2216 5459 -3389 -4989
2496 -4989 4506 4118 -5361 -2822 6082 1479 -6217 13 6016 -1249 -5623 2378 5112 -3411 -4359
2511 -4359 4214 3321 -4736 -2209 4991 1098 -5213 101 5384 -1179 -5012 2180 4138 -2954 -3026 3523
2527 3523 2161 -3887 -1353 4010 662 -3915 246 3595 -1057 -3130 1757 2774 -2151 -2303 2504
2542 2504 1487 -2684 -550 2706 -235 -2360 546 1922 -721 -1497 900 1096 -1170 -774 1269 409
2558 409 -985 -67 748 -182 -516 385 343 -440 112 252 -588 168 961 -581 -814 899 556 -1109 -275
2577 -275 1480 89 -1874 215 2044 -634 -1884 1344 1742 -1880 -1635 2364 1395 -2831 -780 3179
2593 3179 -111 -3281 982 3229 -1552 -2991 2080 2732 -2722 -2257 3465 1508 -3978 -692 4105
2608 4105 -111 -4088 949 4022 -1974 -3744 2840 3172 -3490 -2381 3918 1533 -4212 -686 4470
2623 4470 -156 -4582 1260 4361 -2198 -3773 2992 3013 -3626 -2310 4126 1468 -4436 -437 4375
2638 4375 -568 -4115 1428 3737 -2112 -3322 2718 2809 -3426 -2015 3862 1002 -3982 -108 3749
2653 3749 -632 -3484 1323 3189 -1967 -2667 2559 2028 -2774 -1381 2937 766 -2938 -112 2973
2668 2973 -693 -2738 1339 2238 -1682 -1691 1780 1128 -1783 -713 1863 294 -1908 62 1644 -288
2684 -288 -1276 553 998 -696 -797 852 506 -887 -160 665 -112 -319 164 9 14 42 -33 -69 60 204
2704 204 -185 -359 384 330 -605 -213 743 57 -972 25 1181 -265 -1274 682 1228 -1178 -940 1499
2722 1499 738 -1549 -354 1734 127 -1943 330 2127 -781 -1977 1183 1709 -1581 -1418 2055 1132
2738 1132 -2536 -615 2759 -12 -2671 618 2477 -1128 -2198 1608 2079 -2112 -1756 2573 1149
2753 1149 -2764 -491 2847 -82 -2866 645 2867 -1294 -2569 1852 2085 -2304 -1485 2574 943
2768 943 -2655 -461 2882 -43 -2905 679 2773 -1303 -2360 1736 1904 -2055 -1496 2423 1024 -2646
2784 -2646 -385 2643 -271 -2436 698 2199 -1005 -1938 1390 1709 -1828 -1233 1968 688 -1942 -200
2800 -200 1873 -65 -1782 388 1671 -784 -1404 1024 1033 -1118 -604 1076 443 -1169 -277 1164 -64
2817 -64 -1043 303 853 -427 -560 453 422 -479 -387 469 154 -467 48 261 -150 -118 90 -8 23 -18 -23 -80
2839 -80 53 179 -146 -218 416 155 -482 70 539 -128 -528 249 644 -372 -731 631 559 -804 -318 912
2859 912 154 -905 27 1040 -193 -1095 522 1119 -822 -799 981 646 -1103 -500 1266 249 -1372
2876 -1372 103 1441 -465 -1303 720 1122 -866 -954 1047 774 -1300 -515 1541 114 -1457 222
2892 222 1358 -393 -1276 640 1241 -916 -1121 1248 719 -1338 -386 1284 152 -1272 42 1388
2908 1388 -352 -1318 701 1112 -907 -825 935 607 -968 -417 1091 197 -1185 126 1080 -326 -921
2925 -921 468 740 -456 -691 616 627 -820 -330 818 104 -738 -6 646 -52 -645 200 683 -332
2943 -332 -482 440 286 -396 -186 331 221 -379 -152 453 -29 -387 147 205 -165 -121 -1 188 -110 -137 186
2964 186 79 -217 63 86 -57 -34 -48 86 31 -146 39 76 -110 59 9 -65 70 -6 -77 73 -34 48 18 -132
2988 -132 27 77 -158 -1 65 -85 -26 -76 143 27 -324 66 223 -190 -118 171 75 -28 -161 192 176 -325
3010 -325 -120 384 -27 -374 81 306 -9 -352 39 459 -215 -410 376 205 -390 -181 335 207 -483 -168
3030 -168 629 -35 -664 259 538 -352 -424 342 488 -361 -489 646 326 -742 -80 667 -91 -689 64 674
3050 674 -218 -713 456 601 -685 -467 772 271 -698 -198 716 137 -859 82 876 -344 -629 521
3068 521 415 -517 -364 524 401 -655 -239 720 -17 -663 237 487 -299 -420 304 451 -422 -274 512 40
3088 40 -469 103 344 -121 -256 84 281 -153 -253 372 103 -335 64 161 -121 -10 88 73 -153 13 200
3109 200 -171 -198 330 -42 -475 232 362 -266 -229 300 310 -447 -315 704 215 -931 60 868 -323 -834
3129 -834 427 817 -684 -801 1011 641 -1221 -278 1356 -57 -1233 234 1253 -400 -1419 732
3145 732 1283 -1246 -935 1524 582 -1617 -321 1660 9 -1796 414 1828 -983 -1610 1298 1202 -1493
3162 -1493 -967 1667 792 -1981 -388 2183 -170 -2173 689 1859 -1089 -1664 1362 1498 -1714 -1109
3178 -1109 1969 625 -2092 -122 2066 -326 -1924 578 1844 -949 -1683 1392 1347 -1813 -818 1891
3194 1891 333 -1856 -96 1786 -336 -1737 707 1471 -1127 -1140 1276 831 -1345 -661 1474 377
3210 377 -1594 19 1562 -510 -1352 677 981 -793 -695 826 589 -1012 -297 986 16 -802 121
3227 121 533 -162 -447 188 408 -320 -260 387 -38 -217 291 45 -322 214 132 -318 -84 344 31 -523 170
3248 170 693 -386 -641 688 453 -814 -328 847 256 -1107 -22 1370 -319 -1404 899 1198 -1108
3265 -1108 -921 1297 776 -1601 -510 1931 69 -2035 486 2001 -887 -1839 1255 1720 -1612 -1541
3281 -1541 2125 1171 -2460 -546 2572 -76 -2542 551 2495 -1042 -2424 1625 2165 -2158 -1567 2533
3297 2533 1025 -2671 -480 2816 -37 -2873 714 2882 -1396 -2406 2057 1906 -2368 -1433 2620
3312 2620 967 -2862 -386 3041 -326 -2926 993 2539 -1471 -2244 1898 1982 -2321 -1478 2673 791
3328 791 -2744 -139 2619 -388 -2423 804 2287 -1170 -2015 1603 1595 -1949 -999 1980 500 -1920
3344 -1920 -147 1890 -193 -1786 657 1502 -1001 -1083 1113 770 -1091 -523 1122 318 -1131 46
3360 46 1025 -327 -729 496 430 -478 -304 328 270 -375 -133 267 -147 -85 238 -218 -62 383 -52 -400 145
3381 145 531 -306 -607 542 627 -907 -436 1155 218 -1238 65 1282 -264 -1439 617 1457 -1139
3398 -1139 -1252 1530 993 -1751 -654 1917 313 -2100 112 2260 -646 -2170 1260 1920 -1690 -1470
3414 -1470 2066 1217 -2375 -757 2689 99 -2837 580 2683 -1146 -2432 1637 2166 -2181 -1849 2670
3430 2670 1304 -3021 -575 3158 -114 -3033 675 2944 -1221 -2789 1882 2369 -2437 -1813 2778
3445 2778 1099 -2924 -603 3025 70 -3138 602 2894 -1360 -2515 1857 1981 -2214 -1501 2413
3460 2413 1061 -2646 -486 2800 -167 -2609 832 2278 -1125 -1908 1519 1576 -1846 -1231 2152 657
3476 657 -2183 -115 1956 -294 -1727 496 1609 -843 -1405 1090 1072 -1209 -540 1239 264 -1083
3492 -1083 -65 1062 -135 -939 376 692 -580 -292 460 76 -305 -83 160 26 -167 172 89 -228
3510 -228 137 104 -370 87 524 -233 -451 369 462 -485 -478 901 261 -1177 121 1180 -417 -1054 661
3529 661 938 -838 -924 1175 907 -1496 -508 1727 84 -1772 386 1887 -681 -1931 1149 1796 -1666
3546 -1666 -1421 2057 877 -2186 -447 2320 116 -2333 298 2451 -888 -2352 1525 2069 -1933
3561 -1933 -1612 2297 1168 -2570 -694 2882 -103 -2858 715 2594 -1206 -2245 1550 1955 -1985
3576 -1985 -1755 2459 1228 -2795 -547 2812 -96 -2723 687 2569 -1221 -2371 1704 1911 -2065
3591 -2065 -1343 2263 769 -2262 -402 2314 -3 -2370 459 2287 -1042 -1925 1513 1466 -1667 -1036
3607 -1036 1821 563 -1913 -228 1897 -274 -1574 656 1306 -813 -1135 870 986 -1090 -783 1306
3623 1306 329 -1338 62 1029 -313 -855 366 668 -450 -505 548 250 -468 -135 217 17 -132 -55
3641 -55 156 66 -180 77 4 -102 258 -103 -362 343 347 -521 -186 632 82 -771 55 948 -222 -949 581
3662 581 782 -866 -642 925 609 -1147 -609 1364 286 -1667 137 1706 -709 -1586 1033 1425 -1330
3679 -1330 -1201 1640 922 -2031 -461 2217 -24 -2070 430 2022 -800 -2064 1350 1993 -1865 -1542
3695 -1542 2281 960 -2410 -405 2491 -89 -2572 516 2446 -1074 -2258 1589 1727 -1976 -1403
3710 -1403 2182 1059 -2436 -634 2633 -48 -2586 760 2337 -1262 -2025 1531 1735 -1846 -1369 2151
3726 2151 862 -2351 -266 2328 -249 -2185 592 2003 -1023 -1864 1463 1500 -1768 -955 1839 531
3742 531 -1783 -130 1727 -149 -1723 459 1597 -945 -1236 1048 846 -1099 -637 1207 420 -1205
3758 -1205 -127 1188 -200 -971 429 746 -470 -600 435 466 -516 -342 563 79 -467 77 262 -37
3776 -37 -57 22 96 43 -73 -63 -122 113 190 -395 -163 609 -10 -587 189 642 -243 -697 379 795 -752 -677
3798 -677 1063 509 -1255 -124 1210 16 -1376 252 1472 -616 -1485 1045 1232 -1367 -915 1527
3814 1527 698 -1677 -461 2012 68 -2024 494 1988 -913 -1700 1270 1533 -1553 -1296 1934 924
3830 924 -2231 -350 2353 -196 -2221 618 2131 -975 -1990 1402 1738 -1875 -1341 2181 770 -2321
3846 -2321 -303 2284 -83 -2297 568 2240 -1139 -1965 1551 1531 -1814 -1125 1979 756 -2128 -290
3862 -290 2269 -223 -2180 681 1917 -1042 -1549 1255 1290 -1531 -986 1770 560 -1837 -63 1766
3878 1766 -277 -1516 567 1418 -722 -1297 1015 982 -1229 -606 1240 324 -1117 -52 1113 -50
3894 -50 -1062 349 951 -501 -661 531 429 -516 -291 434 198 -459 -39 384 -22 -219 94 5 8 -1 -111
3915 -111 37 168 -20 -212 -62 354 4 -481 136 542 -322 -519 382 499 -493 -464 685 506 -938 -301
3935 -301 1120 -41 -1087 261 1022 -435 -988 662 1003 -959 -861 1234 587 -1358 -263 1399 -3
3952 -3 -1552 232 1573 -661 -1535 1121 1276 -1418 -892 1491 614 -1668 -365 1827 -26 -1831 489
3969 489 1788 -890 -1540 1119 1281 -1423 -1049 1682 753 -1853 -287 1892 -241 -1728 555 1633
3985 1633 -812 -1501 1141 1352 -1453 -973 1675 512 -1690 -236 1664 -146 -1643 490 1624 -871
4001 -871 -1399 1100 965 -1216 -697 1202 565 -1343 -257 1444 -54 -1398 403 1174 -658 -956 717
4018 717 757 -875 -616 1012 378 -971 19 811 -141 -683 146 647 -146 -593 384 425 -500 -199 481 59
4038 59 -308 -106 267 -7 -283 108 173 -113 -23 4 -23 136 -10 -156 92 124 -93 -77 22 273 -53 -378 217
4061 217 387 -346 -238 486 196 -526 -107 691 117 -795 208 752 -371 -622 564 519 -583 -526 717
4080 717 498 -898 -251 1068 -35 -1021 294 992 -421 -1004 650 868 -950 -575 1092 358 -1169
4097 -1169 -147 1146 -71 -1164 184 1208 -571 -1216 839 921 -1040 -592 1150 421 -1220 -243
4113 -243 1373 -24 -1270 409 1137 -617 -1005 761 860 -888 -798 1094 510 -1190 -140 1227 -143
4130 -143 -1088 259 956 -391 -923 657 791 -877 -532 928 318 -879 -134 802 18 -826 200 860
4148 860 -415 -695 605 429 -565 -321 545 203 -602 -153 725 -22 -605 250 397 -191 -331 186 283 -269
4168 -269 -294 407 96 -358 23 261 -3 -80 -38 127 29 -130 87 136 -120 -19 1 -44 131 -69 -150 113 72
4191 72 2 -124 62 207 -196 -299 299 130 -399 -19 328 -29 -281 25 396 -80 -453 291 367 -422 -277
4212 -277 454 223 -452 -229 524 107 -681 73 710 -262 -577 317 506 -391 -481 535 472 -634 -276 822
4232 822 42 -732 64 756 -126 -688 308 747 -490 -621 746 364 -683 -246 651 144 -770 -20 840
4251 840 -175 -763 390 662 -481 -464 557 454 -571 -350 727 238 -809 66 692 -180 -546 274
4269 274 623 -290 -559 453 421 -599 -240 610 88 -517 -19 502 -37 -513 159 515 -294 -438 376 236
4289 236 -303 -210 293 193 -387 -115 445 -95 -371 101 232 -111 -163 87 243 -126 -135 245 74 -190 16
4310 16 103 14 -84 -59 148 4 -145 95 48 -67 69 -20 -10 175 -28 -28 123 47 -18 -29 20 239 -109 -143 233
4335 233 59 -239 -10 162 22 -206 -58 348 -25 -383 176 266 -269 -189 276 187 -291 -197 347 163 -452
4356 -452 16 394 -134 -370 155 328 -153 -417 361 376 -511 -273 524 99 -438 -37 414 -16 -501 153
4376 153 505 -293 -411 386 287 -373 -280 383 228 -484 -163 575 -10 -560 234 422 -243 -395 301 413 -315
4397 -315 -351 526 179 -495 18 497 -3 -398 32 451 -130 -487 262 411 -436 -233 392 178 -282 -176
4417 -176 385 88 -394 32 376 -143 -296 184 237 -151 -246 255 248 -286 -115 352 -48 -266 81 120 -55 -164
4439 -164 34 225 -85 -139 187 28 -149 -3 84 2 -73 -108 105 -21 -107 57 46 -4 124 -74 -23 89 -80
4462 -80 -73 53 37 66 -33 21 228 -102 -109 162 63 -142 -29 100 113 -177 -76 305 -26 -281 111 194 -166 -164 93
4487 93 189 -197 -251 286 147 -342 -54 343 20 -309 18 389 -55 -365 290 407 -343 -170 362 163 -376
4508 -376 -166 409 126 -425 16 527 -211 -361 264 265 -229 -333 293 303 -424 -191 559 11 -466 83 363
4529 363 -87 -343 135 451 -266 -371 359 253 -422 -125 412 132 -415 -92 412 -18 -411 216 337 -273
4549 -273 -253 249 245 -285 -239 334 127 -402 41 392 -85 -296 112 218 -55 -297 169 219 -266 -61 256 5
4571 5 -147 -50 129 15 -193 34 270 -102 -133 104 74 -77 -22 15 124 2 -49 7 -55 -37 50 -78 43 124
4595 124 -107 -39 114 15 -68 -32 60 166 -188 -58 248 -79 -206 94 158 -98 -215 115 233 -217 -175 288
4617 288 53 -373 -14 325 14 -310 10 438 -211 -407 326 334 -410 -234 405 149 -406 -137 550 16 -508
4638 -508 159 497 -236 -409 282 394 -384 -434 476 319 -630 -150 662 -8 -538 113 506 -236 -591 313
4658 313 502 -451 -377 639 271 -596 -112 570 110 -670 27 647 -174 -599 379 447 -449 -381 446 255 -464
4679 -464 -236 621 105 -636 110 467 -92 -482 208 418 -306 -403 380 232 -424 -119 352 0 -332 13
4699 13 324 -69 -384 194 253 -270 -126 239 65 -213 -82 159 69 -262 -10 185 -120 -137 138 19 -13 -44
4721 -44 -10 86 23 -25 43 -65 111 89 -139 39 142 -109 -164 91 158 -117 -209 192 156 -351 -78 343 -45 -355
4745 -355 140 341 -106 -303 176 342 -352 -305 482 206 -453 -92 563 32 -553 105 608 -266 -515 401
4765 401 442 -511 -327 583 269 -675 -149 817 8 -703 250 710 -411 -602 491 553 -648 -435 784
4784 784 319 -836 -37 851 -117 -759 176 739 -337 -707 452 637 -689 -452 744 209 -773 -70
4802 -70 817 -47 -806 257 724 -423 -590 546 427 -571 -338 640 248 -714 -76 711 -133 -692 275
4821 275 572 -286 -481 336 420 -516 -320 559 104 -545 21 509 -95 -382 98 382 -207 -401 317 280 -300
4842 -300 -137 289 43 -202 60 234 -47 -152 114 142 -124 -59 108 -27 30 -16 -3 30 25 7 -55 -54 116 -27
4866 -27 -220 113 209 -156 -96 164 87 -284 -125 312 26 -362 102 380 -257 -344 292 333 -341 -328 484 248
4888 248 -636 -78 703 -46 -708 107 629 -263 -678 445 600 -606 -471 773 295 -804 -150 811 -5
4907 -5 -895 169 864 -404 -820 614 573 -667 -405 787 357 -921 -175 971 -41 -1013 347 828
4925 828 -456 -711 563 662 -661 -541 865 325 -927 -69 943 -130 -901 317 810 -422 -807
4942 -807 665 637 -775 -410 837 240 -809 -28 813 -88 -805 235 753 -457 -599 538 375 -484
4960 -484 -323 612 185 -687 -20 636 -173 -589 248 444 -299 -367 347 250 -399 -181 423 87 -332 40 304
4981 304 -81 -270 86 241 -143 -157 165 69 -76 -16 76 29 24 -37 -67 36 72 -39 -87 75 159 -177 -183 294 53
5006 53 -292 -59 341 20 -383 59 423 -120 -436 318 394 -428 -312 438 240 -528 -107 621 48 -676 155
5027 155 722 -353 -587 457 547 -573 -466 640 378 -846 -145 898 -43 -892 177 841 -317 -792
5045 -792 560 717 -767 -547 815 387 -931 -189 1019 52 -1002 210 1026 -443 -852 598 693
5062 693 -727 -500 845 440 -914 -183 980 -12 -922 289 854 -463 -761 538 636 -717 -524 842
5080 842 337 -910 -71 905 -81 -741 224 722 -345 -637 470 540 -613 -334 624 192 -575 -141 617
5099 617 -25 -610 155 528 -292 -389 358 290 -356 -183 357 184 -381 -138 327 13 -304 77 211 -83 -76
5120 -76 127 122 -142 -3 104 14 -78 112 -52 -55 24 -28 -114 37 112 -111 -131 152 88 -191 -53 256 54 -297
5144 -297 4 321 -78 -397 196 436 -258 -296 443 154 -484 -93 526 -6 -589 105 576 -212 -570 387
5164 387 515 -499 -395 594 295 -690 -179 790 -40 -734 175 710 -368 -593 469 561 -542 -522 645
5183 645 371 -781 -162 799 -71 -819 260 835 -378 -745 526 618 -656 -410 817 253 -805 -87
5201 -87 804 -29 -749 177 820 -398 -741 551 525 -647 -342 670 263 -762 -96 794 -43 -700 277
5220 277 620 -377 -509 395 472 -535 -337 600 199 -621 -7 598 -108 -536 144 473 -297 -390 333 302 -393
5241 -393 -174 366 29 -343 -31 336 27 -362 102 275 -183 -89 184 65 -99 -68 65 28 -135 -51 43 -38
5263 -38 22 48 -36 38 38 -87 -29 138 100 -155 -91 250 48 -233 29 279 -78 -271 183 251 -202 -256 340 237
5287 237 -392 -86 518 8 -514 117 521 -183 -464 354 524 -458 -414 579 292 -631 -118 683 82 -684
5307 -684 123 725 -241 -646 487 557 -607 -448 672 323 -731 -206 815 -4 -867 163 794 -378
5325 -378 -732 471 654 -635 -486 758 324 -797 -172 834 -65 -799 210 802 -386 -699 510
5342 510 652 -624 -455 713 272 -781 -126 754 22 -784 192 710 -371 -614 500 438 -479 -401 554
5361 554 249 -626 -126 582 -31 -540 93 540 -183 -405 283 306 -336 -273 386 181 -396 -14 398 -19 -283
5382 -283 77 257 -148 -233 170 147 -162 -129 128 34 -82 7 58 -34 -23 31 7 14 49 -31 -6 108 35 -108 -59 116
5408 116 -7 -240 -37 218 -133 -263 134 282 -301 -242 257 204 -339 -166 506 43 -465 114 504 -217 -500
5429 -500 330 451 -431 -379 514 292 -592 -167 681 16 -724 168 661 -276 -717 490 593 -556 -499 711
5449 711 381 -772 -187 761 -7 -815 139 843 -318 -815 522 641 -648 -499 717 357 -751 -205
5467 -205 854 -17 -889 197 803 -324 -644 475 632 -623 -540 666 320 -757 -200 773 23 -697
5485 -697 150 681 -205 -686 406 548 -547 -342 617 239 -620 -122 628 19 -621 167 540 -227 -436
5504 -436 342 344 -339 -258 369 188 -447 -82 445 -22 -380 83 285 -132 -219 85 223 -174 -144 114 85 -136
5526 -136 -13 131 -54 -99 -38 9 -46 6 -14 -65 14 82 -143 -42 189 27 -185 38 215 -58 -195 187 254
5549 254 -223 -235 323 165 -390 -139 439 50 -447 58 543 -176 -506 310 430 -451 -288 594 271 -625
5569 -625 -109 668 -8 -618 178 698 -259 -582 447 592 -585 -488 704 337 -787 -153 863 8 -877
5588 -877 180 724 -362 -703 524 625 -648 -464 690 344 -822 -163 869 -57 -874 276 831
5605 831 -413 -746 598 625 -699 -426 761 209 -760 -115 835 -79 -837 238 682 -312 -686 492
5623 492 520 -593 -390 725 275 -703 -70 687 -40 -555 203 537 -267 -485 403 416 -459 -282 523 90
5643 90 -563 -91 421 -67 -391 159 377 -166 -224 209 179 -163 -140 226 69 -144 -21 158 8 -122 5
5664 5 81 11 -14 -7 -16 11 19 -93 -31 78 -17 -186 83 228 -133 -202 218 158 -169 -165 298 140 -332 -28 407 -8
5690 -8 -424 135 431 -184 -368 300 343 -429 -339 506 152 -603 -97 623 -73 -628 179 608 -328 -653 446
5711 446 572 -606 -364 678 276 -689 -128 806 -31 -791 285 775 -428 -660 537 584 -651 -534
5729 -534 745 316 -862 -115 859 -57 -915 273 830 -418 -665 581 634 -715 -409 797 286 -822
5747 -822 -86 779 -48 -826 252 705 -414 -641 526 544 -624 -326 653 235 -668 -117 699 -48 -661
5766 -661 180 570 -240 -472 355 408 -386 -238 484 185 -444 -3 420 -32 -377 108 436 -160 -307 241
5786 241 204 -230 -139 259 107 -167 -38 158 21 -140 4 94 -1 -10 34 10 67 5 -56 -3 90 -46 -101 67 102
5811 102 -69 -168 121 210 -114 -130 287 138 -275 -76 297 55 -359 102 391 -167 -347 321 328 -355 -290 435
5833 435 249 -552 -76 595 -9 -552 137 543 -223 -614 396 523 -498 -379 592 266 -708 -157 717
5852 717 -43 -701 149 689 -299 -683 403 601 -523 -450 661 365 -755 -130 844 19 -757 172 750
5871 750 -334 -687 523 575 -556 -443 681 359 -777 -159 787 -28 -801 137 723 -278 -631 449
5889 449 479 -569 -452 661 287 -636 -159 631 -7 -655 93 646 -318 -538 389 464 -422 -315 465 178
5909 178 -418 -69 466 -7 -456 89 376 -157 -275 211 262 -239 -229 269 99 -236 -11 255 -4 -155 60
5930 60 135 -21 -123 81 77 -52 29 -17 -5 88 -27 -113 29 74 -102 -130 86 159 -123 -113 231 127 -263 -64
5954 -64 255 -7 -360 20 388 -97 -405 263 333 -303 -330 390 280 -472 -163 616 89 -622 67 676 -198
5975 -198 -613 348 619 -470 -492 540 386 -659 -240 738 123 -800 -9 771 -275 -772 429 713 -569
5994 -569 -638 686 499 -845 -267 875 113 -871 115 898 -278 -865 462 702 -600 -628 706 469
6012 469 -849 -268 894 100 -905 140 867 -272 -757 485 711 -609 -596 679 441 -815 -221
6029 -221 796 20 -776 69 762 -231 -652 365 563 -574 -439 511 333 -603 -223 592 31 -546 70
6048 70 544 -126 -432 247 384 -337 -248 327 218 -366 -85 324 -30 -250 -3 260 -44 -153 81 90 -76
6069 -76 -18 80 19 -20 -68 -30 -46 103 -41 -112 115 126 -119 -221 188 151 -255 -88 307 55 -370 -7 462 -130
6093 -130 -435 242 517 -330 -416 453 391 -503 -253 653 154 -699 60 771 -248 -769 398 751 -468 -635
6113 -635 685 478 -808 -326 920 141 -974 -38 960 -160 -1016 480 859 -667 -803 861 605
6130 605 -926 -458 1014 253 -1106 79 1069 -276 -1076 478 940 -657 -775 877 610 -1006 -383
6147 -383 967 123 -1095 55 1091 -324 -986 475 839 -604 -702 791 521 -805 -399 1014 127
6164 127 -1005 51 939 -287 -841 407 737 -549 -586 629 445 -712 -295 720 122 -740 -5 690
6182 690 -167 -592 256 538 -298 -366 402 285 -381 -210 340 45 -336 -28 312 -41 -254 33 184 -25
6202 -25 -116 63 82 -17 -38 35 44 69 -19 -97 60 130 -151 -135 188 185 -299 -97 310 64 -386 62 431 -45 -417
6227 -417 141 449 -268 -460 470 422 -543 -275 608 149 -697 -76 775 -112 -782 306 751 -494 -663 634
6247 634 548 -773 -439 962 268 -982 -51 1032 -210 -991 401 1005 -534 -818 778 652 -909
6264 -909 -447 968 217 -1093 -73 1111 -142 -1070 385 998 -577 -862 865 694 -934 -465 1033
6281 1033 209 -1054 -45 1067 -265 -1040 416 950 -641 -811 745 626 -872 -437 956 262 -996
6298 -996 -26 916 -227 -874 376 814 -467 -570 626 539 -679 -321 684 179 -664 9 740 -113
6316 -113 -657 219 516 -318 -483 370 319 -355 -271 407 92 -383 -15 350 -51 -351 93 248 -76 -152 115
6337 115 101 -64 -69 42 64 20 -68 14 80 30 -74 -47 118 99 -231 -104 278 81 -314 23 443 -74 -455 236
6361 236 402 -227 -399 331 365 -467 -267 593 136 -633 -18 722 -60 -746 250 665 -413 -579 533 504
6381 504 -725 -387 820 210 -895 -97 922 -102 -901 344 874 -511 -814 717 663 -857 -528
6398 -528 1021 336 -1066 -67 1102 -186 -1018 373 1016 -610 -902 765 644 -862 -464 1025 293
6415 293 -1037 -31 1024 -147 -1027 357 899 -567 -795 709 675 -841 -466 884 235 -968 -90
6432 -90 942 -122 -882 293 768 -468 -689 566 541 -636 -416 745 250 -766 -55 705 -65 -615
6450 -615 126 565 -330 -469 366 329 -416 -234 386 158 -348 -83 334 -52 -325 72 223 -86 -160 86 126
6471 126 -100 -135 107 32 -53 -48 47 39 32 -91 -81 92 43 -195 -54 241 74 -270 -37 341 -4 -366 190 350
6495 350 -269 -343 301 372 -425 -254 526 184 -623 -50 660 -52 -639 206 595 -376 -659 541 565 -697
6515 -697 -395 789 253 -848 -140 909 -85 -857 252 899 -496 -859 678 670 -796 -469 937 283
6533 283 -979 -91 1066 -110 -1029 311 945 -494 -826 628 755 -867 -498 940 318 -1018 -108
6550 -108 1003 -84 -981 324 954 -536 -812 682 707 -834 -450 874 292 -979 -121 881 -81
6567 -81 -899 259 794 -420 -697 493 548 -613 -392 701 232 -700 -92 778 -33 -672 210 570 -277
6586 -277 -493 332 319 -420 -295 435 150 -428 -47 439 15 -342 58 294 -91 -271 175 179 -143 -81 89
6607 89 90 -94 -68 60 51 -33 -23 3 25 39 -135 -51 158 69 -223 -13 219 4 -329 118 366 -198 -305 289
6631 289 298 -308 -220 428 199 -519 -112 609 4 -673 122 665 -273 -611 506 511 -555 -498 712 385 -763
6652 -763 -156 904 -10 -827 155 812 -368 -871 533 749 -645 -540 824 395 -903 -230 1014 69
6670 69 -1009 207 951 -385 -857 537 781 -699 -662 842 482 -937 -289 966 47 -1031 214
6687 214 961 -399 -806 568 768 -683 -607 801 389 -819 -182 899 55 -853 116 838 -286 -751
6705 -751 439 676 -616 -489 648 288 -694 -150 690 23 -734 58 628 -235 -541 350 472 -371 -336
6724 -336 381 252 -450 -182 459 3 -384 61 306 -108 -282 96 208 -134 -153 111 92 -96 -41 62 26
6745 26 -78 -15 8 114 -11 -64 -73 118 103 -155 -54 239 -21 -263 71 287 -110 -332 239 350 -307 -265 394
6768 394 185 -373 -110 556 60 -588 51 608 -143 -596 384 540 -462 -424 630 397 -658 -196 761
6787 761 118 -825 58 816 -258 -786 395 695 -557 -615 753 536 -869 -257 948 76 -947 56
6805 56 897 -345 -916 463 793 -681 -656 740 501 -825 -314 898 140 -1014 36 965 -294 -891
6823 -891 463 774 -594 -584 736 548 -845 -319 857 86 -901 72 796 -215 -717 447 660 -537
6841 -537 -603 595 424 -652 -213 686 130 -587 14 656 -147 -562 247 486 -306 -424 440 288 -399 -152
6861 -152 400 95 -404 35 388 -116 -316 121 248 -146 -186 136 170 -181 -76 169 34 -94 3 25 74 -37
6883 -37 -35 41 55 -2 -116 -1 161 9 -117 70 248 -56 -256 123 217 -203 -244 195 242 -350 -183 454 52
6906 52 -482 56 459 -132 -517 181 444 -396 -423 508 349 -576 -243 674 184 -702 13 705 -165 -729 374
6927 374 651 -446 -544 577 469 -717 -360 852 163 -891 22 765 -169 -767 333 762 -501 -671
6945 -671 617 551 -761 -331 802 202 -780 19 801 -150 -803 325 776 -505 -620 614 464 -680
6963 -680 -299 852 155 -819 -51 866 -103 -737 314 666 -439 -495 482 415 -588 -304 679 147 -612
6982 -612 1 583 -155 -571 169 570 -299 -362 317 268 -403 -143 389 85 -365 -26 364 -66 -360 155 252
7003 252 -180 -214 160 93 -141 -149 106 71 -164 -58 83 18 -67 -15 2 9 24 -83 0 182 9 -126 12 147
7027 147 -15 -255 72 166 -124 -225 175 213 -286 -146 273 163 -367 10 447 -93 -360 168 363 -277 -377
7048 -377 363 397 -436 -314 574 204 -557 -22 635 -8 -627 184 660 -379 -548 449 482 -556 -356 667
7068 667 322 -778 -98 835 -58 -707 203 719 -330 -616 461 512 -533 -457 715 359 -754 -132 797
7087 797 -36 -780 137 722 -261 -633 450 569 -564 -431 679 342 -634 -169 694 55 -725 165 676
7106 676 -299 -558 427 468 -447 -411 519 321 -576 -150 620 0 -605 65 495 -202 -433 291 358 -258 -228
7127 -228 333 166 -331 -56 352 -27 -382 72 253 -54 -294 98 198 -161 -68 158 89 -133 -67 85 31
7148 31 -117 -18 47 67 2 -94 -9 61 27 -139 17 138 1 -153 45 241 -70 -200 118 219 -252 -161 252
7171 252 178 -324 -135 373 34 -451 74 432 -142 -409 208 429 -270 -416 489 365 -463 -218 610 114
7191 114 -615 1 636 -65 -585 215 655 -380 -525 482 401 -569 -375 631 233 -739 -63 819 -98
7210 -98 -784 295 726 -425 -574 578 580 -636 -341 778 215 -774 -49 762 -120 -736 237 747 -398
7229 -398 -629 546 510 -634 -363 660 207 -662 -55 626 -48 -700 228 661 -353 -530 394 439 -478
7248 -478 -308 508 243 -550 -78 560 -35 -533 140 432 -167 -371 226 358 -317 -255 353 156 -374 -104
7268 -104 306 9 -253 28 316 -32 -211 133 127 -114 -83 81 55 -41 -90 116 48 -65 -53 65 89 20 -151
7291 -151 -66 162 -17 -156 6 113 -38 -224 71 271 -105 -292 154 250 -243 -147 315 156 -415 -94 469
7312 469 13 -490 148 468 -162 -487 288 488 -386 -392 497 268 -567 -199 681 81 -651 47 657 -163 -655
7333 -655 365 609 -513 -423 596 338 -684 -221 709 100 -790 92 812 -211 -709 401 585 -570
7351 -570 -506 624 466 -745 -236 801 158 -795 91 759 -202 -713 334 594 -485 -517 630 426 -703
7370 -703 -290 671 187 -672 15 688 -100 -664 308 510 -405 -480 471 354 -527 -239 529 157 -598 -7
7390 -7 516 -167 -494 198 379 -213 -312 250 273 -274 -179 348 49 -269 -43 222 -18 -276 52 201 -75 -142
7412 -142 58 98 -55 -92 29 168 43 -122 -25 29 -2 -38 2 139 45 -152 -54 257 -89 -169 75 211 -67
7435 -67 -214 142 267 -230 -224 260 181 -294 -141 406 101 -391 -13 476 -189 -472 260 455 -387 -415 405 328
7457 328 -458 -241 579 114 -600 49 621 -72 -584 208 617 -332 -558 524 527 -566 -333 614 252 -674
7477 -674 -72 691 -54 -737 247 681 -366 -570 471 548 -529 -376 615 274 -764 -112 759 -27 -672
7496 -672 184 630 -331 -558 382 498 -574 -380 589 221 -629 -74 603 0 -630 153 583 -301 -522 383
7516 383 441 -428 -304 482 201 -459 -150 495 19 -449 97 490 -177 -363 224 329 -227 -293 240 217 -330
7537 -330 -98 310 14 -238 39 159 -59 -182 61 226 -75 -120 47 105 -57 -75 23 77 -7 -47 64 97 -35
7560 -35 -100 -13 155 29 -200 37 218 -25 -171 93 239 -130 -226 207 197 -239 -105 337 62 -282 2 349
7582 349 -12 -467 92 397 -199 -367 323 357 -287 -277 406 257 -463 -152 590 38 -550 106 536 -220 -466
7603 -466 272 465 -454 -414 524 251 -504 -124 558 35 -600 88 615 -137 -594 303 475 -428 -438 503 323
7624 323 -563 -196 543 123 -685 93 584 -159 -541 253 476 -338 -416 493 312 -513 -231 605 63 -569
7644 -569 47 500 -105 -472 188 369 -307 -375 405 242 -403 -162 352 68 -424 -53 437 -64 -370 132
7664 132 295 -176 -247 184 124 -211 -169 239 104 -264 31 241 -41 -68 53 184 -21 -179 41 71 -52 -81
7686 -81 60 81 -27 -56 7 109 -62 -64 67 121 -5 -163 3 150 -40 -124 95 119 -83 -164 120 155 -172 -130
7710 -130 236 35 -288 -31 286 -48 -249 67 317 -107 -326 147 326 -276 -298 306 193 -364 -151 381
7730 381 68 -421 6 483 -121 -442 219 406 -264 -342 351 315 -450 -193 490 102 -504 28 506 -80 -514
7751 -514 165 447 -249 -429 395 310 -469 -204 472 137 -508 -2 514 -74 -506 156 433 -267 -358 351 322
7772 322 -417 -235 452 161 -472 -20 474 -19 -430 119 377 -175 -363 268 319 -336 -212 365 93 -340
7792 -340 -43 320 0 -343 53 311 -144 -237 168 133 -175 -159 190 147 -213 -72 226 18 -193 90 149 -49
7814 -49 -80 13 130 -43 -119 -5 89 -70 -47 94 58 4 -50 73 69 -73 -26 65 122 -2 -90 60 115 -29 -101 133
7840 133 62 -113 -95 107 111 -167 -106 237 34 -232 37 265 -64 -220 148 227 -106 -234 235 211 -290 -153
7862 -153 342 166 -313 7 346 12 -331 125 334 -206 -314 274 213 -286 -212 331 151 -389 -102 386 -68
7883 -68 -408 175 381 -184 -394 299 332 -346 -225 415 126 -400 -21 378 15 -372 64 360 -160 -352 243
7904 243 267 -329 -219 347 163 -338 -63 390 -49 -320 73 355 -164 -243 202 220 -154 -216 324 116 -276
7925 -276 -74 248 -64 -218 28 252 -88 -234 151 228 -200 -209 215 88 -169 -52 134 61 -180 38 221
7946 221 -13 -146 77 118 -50 -126 44 140 -51 -57 80 81 -72 -22 36 129 -4 -60 81 43 -18 -25 43 63 -94 -60
7972 -60 48 149 -83 -78 145 31 -127 -37 179 60 -150 44 176 -125 -165 177 167 -152 -84 171 150 -168 -135
7995 -135 261 52 -238 62 287 3 -239 59 281 -86 -223 227 194 -237 -116 279 73 -254 -5 287
8015 287 -19 -309 88 296 -177 -150 230 182 -242 -187 254 111 -341 -44 341 -32 -278 92 269 -137 -291
8036 -291 192 214 -189 -124 258 110 -287 -12 254 11 -258 63 274 -98 -234 183 190 -191 -150 211 141 -167
8058 -167 -65 168 37 -257 64 232 -36 -170 50 129 -53 -124 121 104 -130 -12 109 40 -160 9 176
8079 176 6 -101 8 86 -59 -93 82 60 -86 -106 55 93 -7 -22 44 -14 -68 -63 15 51 -35 -73 73 2 -59 -18
8105 -18 32 65 -72 -5 136 64 -78 -2 70 58 -66 -35 88 9 -118 72 98 -82 -113 112 157 -107 -79 213 105
8130 105 -215 -21 202 15 -195 69 155 -87 -217 145 158 -107 -128 222 108 -200 -37 235 -50 -197 18
8151 18 224 -54 -199 147 184 -201 -174 164 86 -184 -63 230 56 -189 24 278 -31 -165 56 190 -101
8172 -101 -138 150 128 -229 -90 220 44 -171 64 178 0 -190 71 219 -97 -161 144 69 -114
8191a14
$$ Imaginary data points
##PAGE= N=2
##DATA TABLE= (X++(I..I)), XYDATA
0 0 0 0 0 0 0 0 -8 8 -8 8 -16 24 -24 32 -40 56 -64 72 -96 113 -136 160 -192 231 -272 312 -360 419 -483
29 -483 555 -633 721 -819 929 -1046 1179 -1324 1484 -1658 1845 -2057 2286 -2534 2805 -3101
45 -3101 3426 -3782 4169 -4592 5060 -5574 6141 -6769 7470 -8256 9142 -10150 11310
58 11310 -12659 14253 -16166 18517 -21483 25361 -30666 38382 -50680 73320 -128355 524257
70 524257 275261 -1124734 176192 834938 -339605 -692748 594062 601486 -586835 -609281
80 -609281 560895 493811 -541855 -370762 651487 186536 -768284 -52798 810477 -126894
90 -126894 -701748 295809 533046 -434224 -355950 451220 221632 -410506 -123203 345343
100 345343 46315 -340999 9351 354872 -46912 -344040 106009 276863 -188554 -164979
110 -164979 291529 62791 -325106 25452 274895 -79960 -145673 128971 37074 -160692
120 -160692 3179 167787 12133 -144044 -16822 105298 -30427 -80563 108917 73537
130 73537 -175575 -69168 186986 19554 -162502 64512 114785 -151654 -72134 181735
140 181735 25830 -161733 11128 117357 -44996 -89364 75199 82290 -101715 -71024 130367
151 130367 44716 -152210 434 163743 -54693 -151800 120513 119637 -181624 -66518 220995
162 220995 5123 -223361 54485 198894 -106386 -170628 152809 149341 -200356 -129673 242200
173 242200 91890 -275151 -35778 288572 -40581 -292014 121832 282083 -199198 -254681
183 -254681 257412 201519 -290117 -128209 304844 51906 -314496 16731 326750 -73141
193 -73141 -323526 130122 294551 -188321 -240544 244690 179840 -287221 -118580 313094
203 313094 56261 -317457 12740 301427 -82270 -271763 139328 234851 -181903 -194678
213 -194678 215096 146196 -243393 -88723 258054 24748 -254775 34211 235008 -82852
223 -82852 -206101 123232 171425 -156803 -129286 180866 82243 -189025 -35637 183892 -5782
234 -5782 -171383 44840 155619 -81062 -131202 110622 96286 -126178 -56265 127833 20350
245 20350 -121352 9002 112185 -34506 -97909 57390 76119 -73744 -51357 79119 29034
256 29034 -76289 -8418 71921 -12834 -65879 32964 52599 -45713 -31335 47283 9071 -41165
268 -41165 8428 34681 -20386 -27854 28740 14506 -34144 5743 33629 -26012 -27298 39533
280 39533 17949 -47932 -7155 54550 -9464 -59834 33405 59166 -58731 -50148 77489 35679
292 35679 -87057 -17188 93472 -5971 -99321 34945 101760 -63709 -94274 86386 77580
303 77580 -101357 -54846 114672 28375 -129163 1523 139041 -33597 -136857 62784
313 62784 121988 -87268 -100616 109005 75536 -132436 -48293 151597 17591 -158927 13959
324 13959 151450 -45221 -136238 76155 118852 -107759 -99314 135479 74434 -150630 -42031
335 -42031 152956 7141 -147323 28304 140867 -61851 -130986 93050 113804 -115514
345 -115514 -86141 127783 52986 -132925 -19170 136175 -13691 -136998 43556 127952
355 127952 -68905 -107298 86392 78706 -99734 -51758 110467 26842 -119073 -3359 118371
366 118371 -20501 -105913 42308 86343 -60376 -67055 75424 50583 -86097 -32896 90027
377 90027 13599 -82923 6910 70682 -23921 -59630 37831 52410 -47740 -42697 53498 27117
389 27117 -51903 -7677 45223 -9213 -38657 18853 32456 -23418 -24451 23813 10738 -21821
401 -21821 3297 16263 -13315 -11516 15678 7552 -15455 -1867 15671 -9409 -15653 24700 12425
414 12425 -36004 -4229 39581 -6424 -36063 20134 31782 -35156 -26636 49906 19783 -57602
426 -57602 -9104 57171 -3699 -53555 17935 53584 -33392 -56495 49529 54259 -64178 -42126
438 -42126 73475 20628 -79588 2225 84061 -22561 -86141 39076 80029 -54278 -65688
449 -65688 67421 47547 -78992 -31212 90186 16678 -99405 1729 103089 -25591 -97103
460 -97103 50814 83309 -70498 -64795 84822 46220 -94920 -27113 101222 7618 -100966
471 -100966 12264 95125 -31754 -87411 51333 79582 -71080 -68420 87197 48631 -96033
482 -96033 -22376 96132 -3889 -92165 23522 86757 -36795 -79073 47774 66205 -59391
493 -59391 -49879 70667 33966 -79601 -19406 84833 3270 -83418 17100 74060 -37463
504 -37463 -58707 51035 42912 -54553 -29670 53321 18826 -52304 -8064 52123 -3439 -50210
516 -50210 13915 45248 -22910 -37955 30765 27845 -37423 -14851 38489 57 -32604 11273
528 11273 22359 -15482 -13443 13717 8467 -11105 -5102 10359 547 -10409 5070 9232 -9285
541 -9285 -6094 12201 1302 -14145 6214 14808 -16164 -10802 25111 1675 -28169 9350 24856
554 24856 -17821 -19083 22911 14759 -27220 -11863 31472 6857 -34624 1760 36401 -12085
566 -12085 -37959 21853 38207 -31657 -34022 41770 22874 -50112 -7318 54097 -6500 -53129
578 -53129 15794 49226 -23933 -44179 35004 38608 -47054 -31068 55628 20977 -59197 -7772
590 -7772 60402 -8263 -61186 25198 59312 -39331 -51312 48119 37757 -53210 -23683 58082
602 58082 11967 -63549 -1138 66109 -11733 -62760 26628 54911 -40556 -46080 50868 36648
614 36648 -57525 -24005 60925 7910 -61117 7716 58256 -18650 -53380 25778 46536 -33702
626 -33702 -37796 43803 27469 -51740 -16376 53106 5277 -48905 5845 43523 -17191 -38982
638 -38982 26923 33643 -32023 -25453 32266 15272 -31450 -6272 32517 -659 -33708 6760
650 6760 31001 -13048 -23376 18357 14624 -21456 -8655 22126 5110 -20716 -684 17578
662 17578 -5284 -13146 9942 8855 -11355 -5745 10521 2888 -9914 1068 9081 -5792 -5975
675 -5975 8867 247 -8836 4994 6779 -7678 -4602 8866 2294 -10330 1662 12353 -7235
688 -7235 -12961 11981 11159 -14666 -7627 17170 3391 -20894 1896 24605 -8661 -24819 15589
701 15589 20485 -20952 -14086 25004 8600 -28954 -4168 32330 -1595 -33574 9067 31571
713 31571 -17066 -27830 24271 23841 -31289 -19236 37652 11825 -41778 -1756 41867 -8654
725 -8654 -39035 17212 35512 -24316 -32046 31400 26697 -37898 -18453 42176 8611 -43619 969
738 969 43604 -9904 -42562 18962 38760 -27923 -31430 34548 21951 -37970 -13038 39653 5463
751 5463 -40870 2077 40377 -10796 -36974 19310 30711 -25785 -23873 30098 17426 -33396
763 -33396 -10705 35185 2354 -34148 6344 30521 -13215 -26070 17625 22171 -21151 -17712
775 -17712 24499 11263 -26425 -3400 25951 -3261 -23733 7594 21093 -10799 -17849 14034
787 14034 12885 -16773 -6862 17478 1756 -16161 1113 14347 -2903 -12611 5376 9577 -8269
800 -8269 -5467 9558 1603 -8375 640 6177 -1553 -4412 2866 2547 -4603 327 5189 -3341 -3302 5140
816 5140 325 -5627 2000 6063 -3715 -6931 6284 6939 -9451 -4499 12062 540 -13161 3075
830 3075 13476 -5783 -13946 8827 13713 -12954 -11317 16938 7012 -19384 -2545 20469 -1130
843 -1130 -21390 5024 21926 -10298 -20575 15884 16994 -20121 -12439 22591 8232 -24453 -3892
856 -3892 26076 -1778 -26531 8458 24510 -14020 -21150 17778 17613 -20788 -13830 24089 8670
869 8670 -26729 -1921 27170 -4514 -25556 9346 23039 -13363 -20284 17650 16335 -21750 -10960
882 -10960 23981 5033 -24246 -201 23431 -4018 -22624 8769 20976 -14026 -17495 18072
894 18072 12490 -20024 -7770 20359 3654 -20415 593 20163 -5517 -18533 9738 15360
906 15360 -12109 -12072 13208 9331 -14329 -6163 15783 2080 -15979 2252 14327 -5182 -11738
919 -11738 6440 9540 -7443 -7677 8788 5111 -9710 -2145 8995 -139 -7551 1160 6447 -2009
933 -2009 -5869 3411 4444 -4596 -2163 4338 -89 -2720 958 1341 -976 -887 1246 310 -1648 1121
949 1121 1262 -2807 139 3481 -1561 -3199 2285 3131 -3155 -3516 4991 3162 -7044 -1338 8114 -1302
965 -1302 -7680 3444 7097 -4714 -7039 6041 6747 -7999 -5165 9724 2572 -10486 -524 10725
979 10725 -1067 -11105 3248 11176 -6623 -9957 9808 7602 -11283 -5129 11436 2996 -11633
992 -11633 -783 12651 -2298 -13152 5437 12187 -7680 -10040 9313 8006 -11347 -6064 13629
1005 13629 3393 -14740 297 13914 -3672 -12173 6010 11074 -7895 -10475 9815 8788 -11702
1018 -11702 -5560 12855 2047 -13181 336 12977 -2223 -12470 4754 10960 -7836 -8685 9955
1031 9955 6436 -10231 -4703 9985 3174 -10292 -725 10946 -2267 -10570 4683 8938 -5732
1044 -5732 -6921 6329 5258 -7494 -3838 8434 1938 -8202 47 6808 -1554 -5792 2349 5718
1058 5718 -3397 -5626 4401 3969 -4960 -1401 4593 -348 -3957 700 3349 -714 -2809 1374 1727
1073 1727 -2104 -401 1982 -219 -1067 47 414 -197 -372 1287 38 -2246 1116 1868 -2478 -316
1089 -316 3096 -986 -2972 1477 2796 -1935 -2874 2977 2350 -4332 -1345 4793 230 -4586 431 4640
1105 4640 -1250 -5378 2908 5601 -5015 -4505 6502 2641 -6887 -1028 7056 -76 -7450 1516 7838
1120 7838 -3434 -7241 5297 5856 -6543 -4809 7536 3944 -8894 -2442 10104 -153 -10214
1133 -10214 2988 9072 -5107 -7767 6277 6921 -7404 -5959 8804 4081 -10014 -1680 10351
1146 10351 -437 -10250 2061 9971 -4057 -9381 6578 7781 -8777 -5426 9694 3355 -9480
1159 -9480 -1813 9376 272 -9577 1938 9515 -4265 -8520 5986 6913 -6987 -5479 7945 3885
1173 3885 -8979 -1852 9208 -695 -8193 2583 6671 -3698 -5766 4317 5261 -5084 -4352 5873
1187 5873 2476 -6161 -536 5852 -689 -5385 1473 4866 -2440 -3874 3543 2241 -3944 -846 3406
1202 3406 283 -2509 -13 2265 -468 -2219 1408 1668 -2119 -664 1886 -320 -1202 752 824 -1138
1218 -1138 -630 1644 -317 -1989 1713 1487 -2727 -527 2810 -416 -2583 846 2803 -1593 -3250
1233 -3250 2805 2949 -4025 -1997 4861 784 -5211 147 5699 -1221 -6095 2892 5745 -4828 -4560
1248 -4560 6163 3184 -6819 -2174 7338 1127 -8066 625 8378 -2847 -8061 4853 6987 -6453
1262 -6453 -5889 7599 4649 -8974 -2925 10056 435 -10269 1989 9704 -3785 -8924 5348
1275 5348 8149 -7227 -6901 9060 4880 -10369 -2424 10698 303 -10633 1530 10414 -3635
1288 -3635 -9696 6010 8183 -7937 -6096 9035 4202 -9516 -2599 9874 722 -10058 1703
1301 1703 9417 -4044 -8088 5624 6582 -6538 -5219 7302 3817 -8087 -1876 8316 -395 -7718
1315 -7718 2002 6762 -3114 -5944 3978 4996 -5129 -3646 5966 1883 -5987 -340 5404 -618 -4837
1330 -4837 1413 4406 -2370 -3585 3389 2222 -3678 -1068 3199 339 -2782 143 2512 -847 -1991
1345 -1991 1714 1012 -1895 109 1406 -776 -743 1011 352 -1373 122 1756 -981 -1766 2113 1061
1361 1061 -2981 -151 3224 -565 -3296 1169 3472 -2144 -3462 3486 2762 -4748 -1641 5417 581
1376 581 -5742 403 5989 -1637 -6168 3350 5703 -5130 -4615 6268 3394 -7183 -2247 7781
1390 7781 965 -8567 1057 8655 -3271 -8157 5066 7166 -6451 -6101 7563 4713 -8963 -2837
1404 -2837 9882 599 -10142 1525 9682 -3265 -8977 4840 8086 -6709 -6677 8467 4712 -9427
1418 -9427 -2583 9710 727 -9622 1061 9508 -3036 -8897 5050 7590 -6670 -5819 7775
1431 7775 4189 -8437 -2580 8988 746 -9136 1330 8514 -3350 -7450 4710 6183 -5670
1444 -5670 -5040 6482 3565 -7288 -1829 7629 -38 -7091 1419 6374 -2430 -5563 3552 4620 -4566
1459 -4566 -3320 5156 1860 -4873 -659 4431 -232 -4176 1051 3861 -1834 -3155 2550 1949 -2704
1474 -2704 -868 2405 148 -2193 300 1882 -810 -1308 1126 476 -1012 300 707 -722 -329 826
1490 826 22 -1029 332 1483 -1171 -1467 2145 924 -2931 13 3139 -827 -3381 1653 3440 -2627
1506 -2627 -3096 3663 2384 -4520 -1399 4928 571 -5292 188 5758 -1367 -5988 3059 5666 -4613
1521 -4613 -4846 5812 3627 -6544 -2202 7158 604 -7576 1094 7561 -2596 -6950 3891 6104
1535 6104 -4999 -5275 6347 4300 -7793 -2734 8708 693 -8721 1592 8247 -3487 -7625 5049
1549 5049 6788 -6286 -5420 7217 3473 -7956 -1695 8468 238 -8847 1162 8715 -3086 -7861
1563 -7861 5199 6421 -6947 -4784 7706 3095 -7838 -1477 7780 -382 -7601 2028 7157 -3218
1577 -3218 -6336 4161 5149 -5151 -4001 6331 2616 -7085 -942 6851 -711 -5865 2115 4822
1591 4822 -3082 -4193 3599 3632 -3856 -2631 3894 1381 -4071 -417 4191 -301 -4164 965 3496
1606 3496 -1855 -2262 2551 989 -2558 -351 1873 81 -1017 236 508 -629 -292 800 67 -557
1622 -557 365 145 -880 179 1415 -317 -1849 916 1974 -2045 -1456 3149 599 -3671 428 3572
1638 3572 -1341 -3205 2147 3019 -2970 -2714 3619 2078 -4166 -1232 4636 214 -5247 826 5741
1653 5741 -2189 -5547 3781 4627 -5249 -3187 6184 1971 -6620 -904 6744 -434 -6729 1974 6660
1668 6660 -3560 -6187 4949 5505 -6204 -4400 7289 2761 -8106 -650 8453 -1471 -8099 3163
1682 3163 7227 -4463 -6295 5555 5245 -6720 -3848 7765 2143 -8317 -423 8353 -1294 -8140
1696 -8140 3136 7415 -4871 -6271 6308 4696 -7067 -3000 7333 1515 -7421 -132 7431 -1377
1710 -1377 -7174 2928 6447 -4232 -5242 5217 4009 -5842 -2702 6261 1145 -6208 394 5748
1724 5748 -1607 -4898 2406 4093 -2979 -3309 3495 2399 -3971 -1365 4104 194 -3711 538 2986
1739 2986 -1281 -2386 1846 1722 -2174 -960 2132 233 -1618 292 1090 -626 -743 900 481 -1006
1755 -1006 23 942 -656 -521 1173 -92 -1442 576 1365 -1083 -1264 1646 990 -2344 -390 2818
1771 2818 -487 -3010 1236 2864 -1916 -2669 2721 2317 -3553 -1688 4366 692 -4897 320 4934
1786 4934 -1377 -4836 2534 4555 -3716 -3954 5005 3027 -5900 -1809 6305 522 -6557 829 6696
1801 6696 -2342 -6475 3927 5731 -5268 -4633 6300 3294 -7076 -1964 7685 414 -8030 1311
1815 1311 7759 -3058 -7074 4476 6075 -5735 -4982 6788 3658 -7656 -2059 8094 287 -7984
1829 -7984 1458 7484 -3024 -6892 4411 5980 -5708 -4720 6541 3199 -7012 -1501 7057 15
1843 15 -6862 1461 6645 -2844 -5809 3988 4646 -4806 -3328 5334 1999 -5608 -859 5658 -312 -5348
1859 -5348 1460 4645 -2529 -3690 3053 2864 -3524 -2051 3832 1129 -3824 -218 3486 -715 -2888
1874 -2888 1258 2336 -1625 -1841 1872 1222 -1918 -551 1858 -165 -1405 562 959 -786 -478 837
1890 837 106 -775 470 532 -1039 -126 1276 -475 -1291 1070 1035 -1581 -880 2140 476 -2725 133
1907 133 2989 -1028 -2982 1853 2787 -2697 -2385 3466 1897 -4223 -1107 4789 -77 -4969 1254 4879
1923 4879 -2313 -4684 3299 4334 -4384 -3587 5379 2412 -6147 -1148 6601 -197 -6737 1543 6625
1938 6625 -2968 -6165 4362 5176 -5575 -4015 6407 2776 -7016 -1514 7594 -30 -7727 1665
1952 1665 7385 -3339 -6597 4849 5531 -6037 -4350 6836 2904 -7382 -1246 7530 -437 -7240
1966 -7240 1916 6920 -3175 -6297 4335 5343 -5503 -4019 6482 2416 -6953 -960 6869 -439
1980 -439 -6490 1766 5858 -3049 -5073 3985 4082 -4525 -3104 4837 1999 -5171 -817 5416 -338 -5352
1996 -5352 1557 4674 -2537 -3558 3085 2550 -3463 -1630 3574 968 -3362 -189 3033 -524 -2643
2011 -2643 946 2267 -1250 -1874 1591 1130 -1922 -291 1802 -437 -1284 710 387 -723 263 640
2027 640 -717 -471 918 0 -1036 587 1094 -1185 -1125 1457 1199 -1742 -1016 2255 509 -3019 379
2044 379 3584 -1316 -3564 2333 3063 -3147 -2289 3849 1553 -4472 -771 4805 -213 -4915 1050 4847
2060 4847 -2027 -4824 3214 4612 -4571 -3727 5743 2487 -6563 -1026 6776 -586 -6624 1873 6303
2075 6303 -3148 -5729 4387 4937 -5444 -3983 6288 2840 -6998 -1455 7552 -241 -7695 2184
2089 2184 7273 -3894 -6236 5152 4965 -5907 -3660 6561 2293 -7163 -901 7391 -475 -7319
2103 -7319 1864 6729 -3413 -5986 4952 4972 -6231 -3647 6797 2006 -6699 -369 6347 -1105
2117 -1105 -5994 2321 5687 -3262 -5083 3996 4027 -4687 -2618 5199 1408 -5516 -255 5407 -862
2132 -862 -4799 1901 3892 -2715 -2920 2944 2179 -3051 -1455 3069 719 -3128 83 2988 -603 -2479
2148 -2479 936 1689 -1314 -1016 1576 472 -1565 -64 1024 -408 -329 649 -246 -674 448 468 -626
2165 -626 -129 994 -409 -1503 875 1823 -1338 -1569 1952 1074 -2598 -432 3306 -120 -3751 931
2181 931 3700 -1949 -3283 2980 2754 -3823 -2291 4474 1504 -5123 -479 5466 -936 -5539 2190
2196 2190 5287 -3439 -4743 4595 3843 -5699 -2721 6554 1351 -6861 90 6862 -1654 -6556 3162
2211 3162 6188 -4624 -5459 5932 4209 -6909 -2598 7532 920 -7767 776 7863 -2398 -7429
2225 -7429 4032 6489 -5453 -5096 6610 3698 -7452 -2267 8017 689 -8123 1097 7801 -2962
2239 -2962 -7022 4430 5891 -5587 -4769 6408 3352 -7033 -1844 7225 229 -7035 1342 6570
2253 6570 -2594 -5901 3757 5040 -4755 -3803 5381 2426 -5618 -1049 5427 -100 -5221 1099 4733
2268 4733 -2094 -4050 2811 3194 -3273 -2191 3406 1159 -3448 -447 3267 -371 -2899 1118 2174
2283 2174 -1485 -1428 1475 780 -1377 -219 1205 -151 -883 582 401 -806 238 721 -828 -425 1220
2300 1220 57 -1530 367 1734 -1026 -1732 1845 1479 -2557 -825 3022 227 -3282 452 3410
2315 3410 -1368 -3523 2367 3117 -3345 -2488 4107 1630 -4694 -832 5045 -301 -5351 1651 5244
2330 5244 -2957 -4706 4086 3945 -5085 -2977 5879 1873 -6575 -439 6975 -1109 -6822 2631 6424
2345 6424 -3956 -5531 5257 4569 -6488 -3334 7385 1694 -7853 -74 7670 -1621 -7386 3047
2359 3047 6787 -4601 -5973 5903 4663 -6906 -3175 7405 1517 -7595 77 7606 -1690 -7255
2373 -7255 3279 6533 -4535 -5289 5469 3999 -6106 -2592 6653 1164 -6843 277 6649 -1650
2387 -1650 -5961 2780 5046 -3753 -3973 4557 2955 -5124 -1798 5210 606 -4915 422 4365 -1399
2402 -1399 -3837 2202 3219 -2857 -2513 3159 1495 -3143 -571 2834 -183 -2592 747 2205 -1124
2417 -1124 -1667 1377 1049 -1354 -395 1183 -16 -941 251 789 -530 -513 651 -36 -607 632 377
2434 377 -1091 -23 1178 -478 -1184 855 1018 -1533 -800 2130 317 -2436 194 2474 -843 -2486
2450 -2486 1433 2467 -2216 -2381 3063 1869 -3724 -1029 4146 40 -4333 1012 4351 -2057 -4207
2465 -4207 3040 3729 -3888 -2909 4574 1976 -5037 -914 5578 -108 -5872 1233 5848 -2594 -5211
2480 -5211 3838 4160 -4821 -3221 5565 2118 -6170 -1051 6319 -340 -6134 1649 5689 -2862 -5222
2495 -5222 3927 4554 -4924 -3553 5795 2142 -6183 -674 6187 -644 -5838 1867 5371 -2914 -4750
2510 -4750 3826 3882 -4550 -2792 4912 1672 -5134 -540 5304 -658 -5259 1701 4625 -2677 -3626 3266
2526 3266 2515 -3790 -1708 3939 1089 -4002 -273 3744 -686 -3341 1476 2944 -1976 -2602 2304
2541 2304 1928 -2640 -1036 2737 225 -2565 370 2204 -644 -1761 806 1346 -1111 -931 1287 524
2557 524 -1198 -253 876 -41 -616 314 435 -466 -168 344 -390 -130 761 -420 -918 735 664 -969 -344
2576 -344 1315 191 -1653 -10 1950 -391 -1881 977 1732 -1642 -1716 2121 1565 -2624 -1206 3022
2592 3022 364 -3256 539 3292 -1280 -3101 1782 2904 -2392 -2514 3085 1844 -3745 -1159 4076
2607 4076 347 -4149 487 4055 -1495 -3955 2459 3452 -3262 -2776 3727 1977 -4066 -1141 4332
2622 4332 280 -4603 665 4549 -1708 -4041 2642 3392 -3301 -2718 3896 1904 -4319 -1007 4450
2637 4450 12 -4281 980 3930 -1774 -3617 2422 3129 -3150 -2444 3654 1482 -3969 -523 3861
2652 3861 -315 -3617 1031 3316 -1681 -2970 2310 2338 -2732 -1653 2900 1086 -2967 -420 3011
2667 3011 -212 -2913 1029 2531 -1478 -1930 1739 1399 -1824 -879 1850 541 -1894 -116 1807 -205
2683 -205 -1465 440 1150 -608 -876 832 665 -953 -341 783 -43 -470 187 133 -164 -39 2 -16 81
2702 81 129 -106 -296 249 374 -482 -274 673 125 -840 -2 1072 -138 -1214 441 1336 -998 -1121 1350
2721 1350 835 -1543 -528 1614 243 -1843 157 2069 -536 -2076 984 1865 -1348 -1597 1806 1265
2737 1265 -2258 -897 2663 314 -2772 341 2577 -924 -2360 1366 2177 -1828 -1891 2345 1491 -2684
2753 -2684 -862 2820 235 -2869 327 2871 -904 -2717 1578 2376 -2161 -1807 2445 1257 -2607
2768 -2607 -780 2764 236 -2917 402 2818 -1051 -2522 1501 2112 -1867 -1665 2180 1271 -2552 -708
2784 -708 2687 90 -2527 444 2269 -849 -2015 1203 1831 -1585 -1466 1921 978 -1985 -374 1931
2800 1931 108 -1791 288 1727 -632 -1574 916 1215 -1118 -866 1099 564 -1117 -361 1196 113
2816 113 -1166 256 967 -435 -676 474 415 -465 -411 427 281 -492 -75 436 -94 -184 154 60 16 -6 -54
2837 -54 -12 2 116 -52 -294 325 226 -462 -29 556 -97 -515 142 562 -329 -698 517 662 -737 -479 931
2858 931 155 -952 -35 1002 -83 -1079 316 1085 -700 -988 919 734 -1023 -562 1109 418 -1279
2875 -1279 -160 1435 -296 -1398 619 1154 -789 -978 954 931 -1196 -716 1425 382 -1542 41
2891 41 1384 -318 -1374 549 1247 -835 -1194 1104 911 -1289 -545 1242 209 -1287 -60 1308
2907 1308 -152 -1373 530 1254 -796 -929 931 695 -909 -564 1036 388 -1163 -90 1202 -228
2923 -228 -991 388 825 -423 -734 553 690 -727 -511 868 177 -743 11 661 -45 -637 100 680
2941 680 -255 -550 420 357 -442 -199 309 201 -304 -228 403 46 -473 109 281 -245 -171 83 163 -19 -184
2962 -184 111 121 -170 15 192 -144 -54 21 60 86 -39 8 79 -116 -54 56 -84 10 10 -126 34 -10 -66 73
2986 73 -82 9 90 -136 -41 99 -83 -80 -21 77 97 -209 -5 199 -133 -157 167 72 -135 -64 121 208 -248 -164 374
3011 374 74 -401 51 285 -4 -228 -7 417 -126 -467 321 286 -444 -220 377 136 -446 -217 506 49
3031 49 -649 133 595 -300 -440 242 455 -377 -469 553 458 -692 -209 789 -17 -672 75 634 -177 -722
3051 -722 327 722 -569 -529 693 292 -720 -190 656 152 -818 7 871 -243 -741 459 489 -535
3069 -535 -411 519 311 -671 -328 706 95 -721 128 551 -318 -478 293 427 -330 -401 550 194 -566 115
3089 115 390 -152 -282 94 229 -98 -321 271 185 -429 -26 301 -145 -66 112 5 -129 1 201 -103 -247
3110 -247 230 68 -461 136 428 -306 -335 316 261 -349 -291 543 294 -826 -76 945 -191 -850 469 797
3130 797 -625 -777 906 733 -1124 -392 1264 84 -1356 154 1304 -296 -1381 521 1300 -1013
3146 -1013 -1072 1390 741 -1544 -491 1592 193 -1736 134 1781 -711 -1698 1146 1440 -1430 -1111
3162 -1111 1593 819 -1766 -604 2073 129 -2265 407 2054 -878 -1771 1227 1529 -1559 -1308 1865
3178 1865 866 -2107 -358 2028 -115 -1956 438 1853 -782 -1835 1169 1506 -1629 -1033 1861 514
3194 514 -1863 -249 1753 -116 -1806 509 1640 -931 -1361 1197 964 -1270 -744 1379 487 -1572
3210 -1572 -146 1615 -336 -1451 696 1118 -774 -843 842 691 -956 -488 992 169 -919 106
3226 106 703 -148 -524 134 428 -233 -305 362 69 -355 158 147 -252 88 229 -273 -64 269 61 -432 81
3247 81 655 -254 -686 583 610 -775 -355 811 247 -1026 -97 1268 -118 -1390 591 1300 -979 -1080
3265 -1080 1261 878 -1472 -682 1785 385 -1993 209 2009 -690 -1927 1008 1839 -1393 -1652 1800
3281 1800 1389 -2306 -859 2560 220 -2595 319 2488 -758 -2457 1293 2266 -1895 -1838 2352 1292
3297 1292 -2621 -728 2740 227 -2865 374 2882 -1030 -2718 1710 2221 -2202 -1658 2447 1168
3312 1168 -2722 -747 2929 -14 -3038 614 2707 -1281 -2488 1701 2132 -2088 -1753 2489 1170
3327 1170 -2748 -503 2698 -115 -2467 562 2365 -934 -2215 1464 1848 -1845 -1298 1963 820
3342 820 -1908 -307 1929 -7 -1919 403 1697 -863 -1338 1035 892 -1127 -665 1028 417 -1155
3358 -1155 -153 1036 -223 -923 455 596 -438 -355 346 246 -361 -208 321 -78 -253 193 -122 -196 358
3377 358 49 -387 123 384 -158 -528 383 699 -720 -559 1063 307 -1170 -96 1255 -188 -1376 399
3395 399 1481 -885 -1427 1329 1147 -1615 -791 1824 455 -1971 -159 2202 -348 -2263 1035 2021
3411 2021 -1553 -1675 1897 1343 -2138 -990 2620 475 -2834 258 2753 -897 -2536 1441 2326 -1854
3427 -1854 -2015 2404 1556 -2870 -960 3154 165 -3105 401 2975 -954 -2893 1527 2656 -2110
3442 -2110 -2158 2597 1418 -2870 -867 2987 357 -3114 224 3076 -1022 -2766 1632 2224 -2057 -1733
3458 -1733 2326 1293 -2528 -803 2769 109 -2738 551 2523 -1004 -2090 1353 1803 -1678 -1413
3473 -1413 2005 949 -2221 -373 2030 -147 -1809 404 1615 -687 -1486 929 1185 -1173 -768 1260
3489 1260 376 -1137 -208 1104 -31 -999 218 825 -487 -529 623 197 -405 -54 258 41 -218 42
3507 42 165 -217 26 299 -320 -47 446 -166 -454 304 500 -452 -504 695 356 -1016 -72 1194 -306
3526 -306 -1141 565 915 -725 -1028 1025 869 -1412 -756 1650 327 -1810 173 1829 -486 -1912
3542 -1912 933 1871 -1369 -1613 1896 1088 -2127 -667 2243 307 -2369 70 2435 -584 -2478 1170
3558 1170 2211 -1759 -1913 2147 1443 -2458 -971 2747 310 -2872 356 2799 -999 -2477 1414
3573 1414 2182 -1767 -1910 2138 1508 -2634 -933 2765 177 -2828 419 2726 -921 -2514 1446 2173
3589 2173 -1965 -1628 2252 1024 -2207 -540 2282 210 -2354 202 2315 -778 -2228 1330 1703
3604 1703 -1617 -1218 1802 802 -1939 -404 1947 -64 -1763 458 1410 -748 -1236 822 1071 -958
3620 -958 -953 1233 599 -1306 -147 1197 -144 -959 394 738 -380 -596 528 389 -560 -106 394 64
3638 64 -148 -81 174 100 -184 3 183 -58 76 10 -365 231 378 -459 -307 567 149 -671 -9 891 -194
3659 -194 -997 448 861 -713 -734 946 578 -1041 -614 1238 464 -1495 -84 1700 -465 -1640 846
3676 846 1475 -1183 -1353 1507 1073 -1907 -745 2166 191 -2163 202 2054 -551 -2108 1025 2024
3692 2024 -1641 -1831 2074 1272 -2352 -650 2375 155 -2436 280 2502 -831 -2389 1353 2020 -1801
3708 -1801 -1586 2085 1209 -2327 -874 2593 303 -2658 404 2458 -1032 -2138 1421 1885 -1735 -1586
3724 -1586 1995 1088 -2342 -579 2399 -23 -2339 440 2073 -795 -1974 1193 1744 -1649 -1262 1834
3740 1834 686 -1829 -317 1802 -46 -1730 291 1693 -686 -1392 998 1042 -1173 -722 1147 462
3756 462 -1189 -283 1255 -86 -1105 362 855 -453 -620 444 569 -511 -431 586 184 -543 47
3773 47 343 -99 -122 34 73 -18 -62 -34 -68 77 123 -233 -241 494 23 -595 129 610 -238 -654 361 771 -552
3796 -552 -824 908 633 -1124 -293 1257 116 -1279 137 1422 -384 -1506 829 1341 -1213 -1111
3812 -1111 1439 820 -1588 -593 1839 223 -2020 263 2024 -751 -1869 1107 1614 -1394 -1429 1691
3828 1691 1096 -2092 -670 2328 68 -2264 381 2255 -769 -2089 1228 1878 -1678 -1561 2118 1039
3844 1039 -2272 -585 2317 101 -2289 309 2300 -830 -2145 1361 1728 -1767 -1303 1885 903 -1993
3860 -1993 -536 2172 31 -2245 502 2015 -915 -1745 1204 1388 -1466 -1172 1644 758 -1866 -365
3876 -365 1796 -118 -1672 399 1487 -593 -1314 854 1138 -1188 -788 1278 424 -1213 -149 1133
3892 1133 7 -1109 138 933 -412 -778 533 486 -574 -334 472 247 -463 -141 426 -41 -407 86
3910 86 106 -68 7 -126 -46 162 -1 -187 -21 234 133 -398 77 507 -223 -558 339 447 -424 -465 561
3931 561 492 -841 -375 1052 154 -1109 137 1105 -354 -1051 546 1009 -834 -953 1069 725 -1323
3948 -1323 -454 1370 113 -1434 59 1485 -488 -1575 929 1403 -1273 -1065 1473 766 -1570 -477
3964 -477 1745 243 -1866 239 1846 -694 -1593 1025 1368 -1280 -1266 1603 900 -1823 -483 1906
3980 1906 1 -1853 397 1630 -687 -1634 897 1386 -1305 -1162 1552 735 -1672 -362 1696 17
3996 17 -1667 250 1697 -683 -1558 1010 1182 -1195 -815 1265 573 -1291 -400 1429 113 -1447 281
4013 281 1301 -515 -1064 661 872 -821 -734 981 507 -965 -172 818 -51 -731 156 614 -174 -665
4031 -665 282 519 -477 -359 508 130 -444 29 299 29 -207 72 196 -131 -47 153 -39 45 13 -164 36
4052 36 90 -92 -149 38 166 49 -339 89 394 -279 -313 342 208 -484 -164 561 199 -724 5 804 -347
4073 -347 -721 498 560 -582 -511 625 488 -808 -340 1008 103 -1118 222 969 -398 -902 489 876
4091 876 -771 -775 1072 488 -1118 -243 1133 64 -1139 111 1189 -425 -1166 685 1008 -983 -736
4108 -736 1091 427 -1141 -360 1218 141 -1304 161 1240 -560 -1046 672 905 -738 -924 964
4124 964 637 -1147 -339 1262 -12 -1174 266 1048 -324 -914 454 858 -800 -655 865 385 -863
4141 -863 -244 832 113 -847 4 889 -291 -811 511 559 -559 -366 522 252 -537 -241 584 55 -664
4160 -664 115 483 -221 -374 229 332 -234 -313 337 183 -389 -53 286 -10 -174 -28 97 -46 -93 2 140
4181 140 -78 -7 56 -62 67 9 -119 40 29 -102 -88 32 155 -55 -241 192 134 -413 -76 344 -42 -312
4203 -312 47 337 -7 -437 175 421 -427 -325 437 229 -410 -163 533 173 -623 -35 687 -223 -605 358
4223 358 567 -394 -466 424 531 -609 -407 716 202 -757 1 697 -147 -690 194 713 -443 -702 613
4242 613 563 -708 -304 673 188 -701 -133 763 -101 -799 268 711 -498 -593 484 446 -502 -415 640 338
4262 338 -738 -55 765 -157 -616 278 557 -253 -591 403 522 -538 -323 580 156 -561 -35 499 16
4281 16 -589 100 505 -272 -411 316 208 -371 -235 317 179 -326 -97 437 21 -361 152 324 -162 -151 175
4302 175 215 -55 -180 210 152 -232 43 135 51 -63 -46 92 42 -105 -24 104 -90 4 -16 -115 127 -4 -105
4325 -105 87 42 -105 -75 13 92 -63 -168 201 105 -224 -56 259 31 -193 -59 237 78 -373 163 317 -282
4347 -282 -238 219 198 -255 -171 321 178 -373 -77 520 -81 -377 186 335 -141 -391 280 410 -438 -328 436
4368 436 110 -429 -75 451 36 -490 54 555 -214 -521 402 371 -332 -239 352 300 -454 -178 590 35 -592
4389 -592 195 557 -207 -418 227 337 -284 -395 447 284 -560 -120 508 -26 -433 3 367 -70 -451 181
4409 181 384 -406 -273 355 95 -348 -183 358 114 -396 -12 457 -128 -245 221 206 -189 -199 133 259 -244
4430 -244 -215 258 14 -236 59 141 -63 -192 -15 212 -74 -214 155 95 -145 -15 22 9 -36 -140 131 17
4452 17 -105 41 -39 -20 41 -39 -19 119 -55 -117 -12 46 14 10 1 191 -92 -142 201 106 -191 -64 191 81 -135
4477 -135 -171 272 31 -309 -1 269 -121 -207 112 191 -222 -235 239 205 -403 -90 356 -8 -377 14 310 -56
4499 -56 -374 142 404 -335 -275 340 174 -367 -158 402 123 -427 -55 491 -131 -417 253 345 -217 -347 292
4520 292 297 -391 -261 488 148 -491 19 398 -114 -393 51 413 -187 -421 303 324 -460 -211 335 111 -347
4541 -347 -124 348 40 -463 104 385 -273 -259 208 190 -167 -286 290 188 -408 -66 395 -95 -343 99 219
4562 219 -68 -301 143 256 -235 -181 259 43 -234 -39 163 12 -114 -51 197 -85 -215 119 79 -111 7
4583 7 -13 40 -64 -44 52 16 -47 104 -33 41 80 -59 -72 66 12 -55 -6 42 141 -92 -56 189 8 -231 120 97
4609 97 -92 -159 111 245 -169 -262 281 113 -386 -27 335 -8 -347 -15 443 -108 -470 266 350 -403 -251
4630 -251 425 179 -363 -201 442 75 -516 92 529 -214 -458 273 365 -277 -429 398 321 -545 -186 651 53
4651 53 -590 59 495 -136 -538 240 552 -417 -518 648 374 -560 -223 633 109 -621 -20 603 -165 -648
4671 -648 288 526 -336 -405 404 403 -362 -290 594 142 -606 57 613 -99 -430 186 454 -245 -405 374 268
4692 268 -430 -209 425 45 -381 -42 374 2 -387 89 328 -188 -228 180 109 -281 -52 196 -27 -268 -16
4713 -16 165 -75 -118 57 35 -25 -54 63 17 -51 -13 76 -13 -7 120 -97 -21 145 -47 -138 91 79 -116 -161 126
4738 126 162 -260 -114 342 -49 -373 72 324 -71 -343 169 331 -300 -351 422 259 -465 -118 484 56 -540
4759 -540 84 599 -217 -600 296 521 -490 -337 545 212 -660 -217 711 103 -764 142 725 -296 -696
4778 -696 424 612 -545 -560 739 418 -821 -200 843 -21 -793 124 787 -227 -800 368 720 -619
4796 -619 -498 731 276 -749 -156 806 55 -801 159 809 -332 -630 496 509 -530 -434 581 332 -640
4815 -640 -135 712 13 -693 202 608 -282 -510 337 407 -423 -364 550 165 -633 -31 512 -88 -427 93 411
4836 411 -186 -376 315 289 -337 -161 302 93 -233 0 213 -31 -223 24 179 -91 -93 123 28 -25 27 -21
4858 -21 41 5 -1 18 -13 107 25 -175 49 117 -127 -151 215 109 -172 -52 304 26 -399 19 463 -200 -371
4881 -371 265 337 -298 -371 402 316 -581 -188 688 33 -674 129 691 -210 -614 335 640 -532 -507 712 343
4902 343 -726 -244 734 38 -878 45 837 -254 -826 504 704 -710 -544 734 377 -904 -253 941
4920 941 43 -966 248 936 -451 -863 506 721 -676 -603 788 425 -969 -124 1039 -54 -885
4937 -885 209 819 -394 -810 554 693 -702 -547 787 311 -848 -206 840 -10 -806 155 743 -366
4955 -366 -645 514 509 -564 -368 580 232 -580 -154 650 -83 -626 227 461 -287 -351 326 310 -338 -294 418
4976 418 142 -412 67 397 -3 -233 17 221 -107 -227 89 115 -132 -62 114 30 -4 -18 -117 65 54 -66
4998 -66 -85 39 129 -89 -192 179 164 -281 -85 301 71 -353 19 395 -36 -425 244 478 -335 -336 432 237
5020 237 -504 -238 632 83 -657 66 701 -231 -655 374 556 -494 -502 600 421 -818 -296 890 60
5039 60 -866 129 796 -294 -810 443 795 -627 -598 826 470 -890 -245 936 119 -981 51 984
5057 984 -329 -896 519 825 -682 -553 799 380 -819 -393 917 46 -945 122 901 -393 -799
5074 -799 542 703 -636 -571 792 443 -897 -169 900 -23 -772 121 734 -263 -676 432 590 -532
5092 -532 -465 634 273 -618 -168 606 31 -604 133 575 -222 -475 298 351 -319 -238 314 139 -388 -26 344
5113 344 14 -290 0 193 -106 -145 93 150 -155 -68 153 -50 -129 72 45 -13 29 -26 -128 74 27 -50 -45 120
5137 120 155 -180 -81 271 62 -250 22 315 -73 -377 192 380 -239 -354 385 238 -453 -139 494 79 -502
5158 -502 -33 559 -171 -571 290 589 -472 -526 532 347 -632 -213 749 104 -787 121 728 -329 -692
5177 -692 426 638 -520 -545 627 442 -743 -247 839 -2 -856 147 843 -281 -796 472 706 -646
5195 -646 -592 771 311 -802 -161 769 53 -825 79 782 -341 -775 492 599 -601 -506 662 321 -738
5214 -738 -143 784 2 -741 206 661 -285 -513 419 486 -421 -427 585 271 -569 -76 556 -40 -531 152 494
5235 494 -164 -396 316 278 -357 -209 371 153 -298 -83 281 -16 -353 73 275 -126 -209 178 122 -124 -42
5256 -42 66 71 -49 -12 101 -24 18 33 13 0 4 -52 -72 102 42 -134 -77 143 100 -287 17 250 -105 -298 183
5281 183 233 -214 -242 290 248 -363 -215 475 13 -530 125 543 -145 -452 304 483 -356 -429 521 360 -577
5302 -577 -197 668 49 -661 27 695 -225 -670 387 642 -486 -482 625 399 -695 -273 786 70 -843
5321 -843 111 820 -287 -789 455 679 -496 -565 645 398 -795 -221 893 97 -837 98 782 -249
5339 -249 -786 422 662 -531 -589 684 410 -723 -158 744 56 -756 94 768 -231 -665 380 512 -473
5358 -473 -411 500 297 -628 -147 600 -35 -580 88 524 -224 -432 279 383 -323 -290 395 214 -387 -105 356
5379 356 -39 -318 131 279 -142 -262 161 200 -191 -92 103 124 -71 -19 89 31 -20 8 38 -37 20 10 -73 61
5403 61 71 -147 -19 150 -23 -148 -63 230 -53 -287 74 241 -289 -268 281 216 -356 -157 416 152 -452 52
5425 52 531 -115 -490 251 477 -371 -361 466 387 -558 -225 685 121 -714 84 749 -179 -653 295 668 -463
5446 -463 -560 602 394 -723 -321 796 126 -809 50 805 -162 -806 409 701 -562 -575 646 487 -760
5465 -760 -300 869 140 -844 120 837 -262 -718 399 700 -513 -522 667 420 -679 -263 790 81
5483 81 -742 39 777 -211 -673 316 627 -459 -489 545 331 -592 -217 569 33 -577 58 540 -169 -497
5503 -497 199 429 -394 -316 363 235 -419 -163 428 53 -379 75 306 -117 -283 109 160 -147 -143 138 129 -136
5525 -136 -7 138 34 -90 -39 69 11 -17 -37 42 -41 50 -97 -120 106 3 -214 60 238 -68 -207 151 294
5548 294 -180 -253 281 196 -368 -119 418 83 -454 43 482 -101 -511 288 495 -389 -409 562 297 -560 -184
5569 -184 617 116 -675 52 667 -201 -702 372 625 -471 -587 543 345 -754 -212 813 66 -803
5587 -803 136 824 -263 -691 461 681 -577 -582 714 410 -807 -209 868 53 -824 129 821 -311
5605 -311 -776 518 624 -649 -479 742 359 -719 -188 755 63 -821 157 780 -336 -708 453 541
5623 541 -612 -433 682 303 -753 -59 701 -19 -630 123 551 -208 -485 417 409 -400 -301 464 199 -445
5643 -445 -76 461 44 -421 115 394 -196 -313 189 179 -213 -175 122 122 -175 -64 154 40 -148 33 93 -42
5665 -42 -28 27 49 42 46 -9 8 132 -10 -117 44 191 -102 -189 177 182 -136 -130 270 209 -270 -89 357 65 -423
5690 -423 57 461 -149 -447 310 407 -401 -363 491 258 -559 -139 587 83 -626 99 635 -231 -620 380
5710 380 515 -504 -459 682 328 -720 -175 777 31 -802 118 753 -336 -724 451 661 -627 -483
5728 -483 747 360 -785 -230 928 29 -874 123 805 -340 -752 518 662 -629 -528 752 334 -816
5746 -816 -197 824 -13 -852 187 739 -291 -744 451 530 -512 -483 639 323 -655 -221 642 11 -668
5765 -668 135 591 -212 -542 325 438 -403 -315 475 262 -501 -107 471 -19 -423 72 407 -160 -322 212
5785 212 283 -212 -228 200 93 -203 -38 159 55 -122 31 131 6 -102 84 90 4 -33 29 21 64 -48 -7 43
5809 43 88 -44 -141 79 211 -111 -153 237 111 -271 -109 275 59 -317 -22 369 -154 -399 230 367 -328
5830 -328 -293 353 288 -462 -151 519 26 -581 90 567 -212 -556 313 531 -443 -395 530 289 -650 -202 666
5851 666 43 -719 76 790 -234 -748 435 645 -510 -521 643 356 -716 -260 808 97 -757 93
5869 93 784 -244 -686 404 667 -568 -511 612 371 -672 -236 795 106 -821 165 756 -289 -672
5887 -672 357 628 -513 -491 576 355 -649 -179 652 57 -677 91 613 -219 -562 303 482 -416 -386
5906 -386 457 222 -461 -193 450 3 -500 32 422 -113 -336 173 289 -211 -225 253 137 -256 -46 187
5926 187 14 -200 24 172 -19 -116 35 99 -66 -3 49 67 43 -8 -52 17 96 -50 -160 78 109 -142 -171 103
5950 103 115 -227 -92 277 84 -337 14 425 -141 -392 150 333 -289 -317 343 287 -474 -211 527 110 -598
5971 -598 -15 625 -149 -672 309 583 -378 -496 479 455 -650 -284 703 168 -793 -52 792 -184 -802 309
5991 309 748 -462 -666 623 536 -790 -305 833 174 -928 4 886 -174 -904 347 764 -574 -643
6009 -643 690 517 -779 -363 843 234 -914 -3 959 -156 -840 400 758 -542 -635 625 498 -631
6027 -631 -319 757 169 -792 -26 748 -134 -731 286 640 -507 -542 480 339 -559 -257 556 93 -556
6046 -556 31 564 -90 -522 236 440 -286 -375 322 241 -301 -126 326 49 -269 7 278 -73 -157 59 124
6067 124 -76 -101 4 47 -39 -47 -45 43 61 -46 -116 25 105 -152 -142 126 108 -270 -163 330 33 -426 -57 445
6091 445 -83 -412 177 482 -310 -381 419 433 -463 -285 536 211 -708 -44 737 -73 -757 262 720 -467
6111 -467 -705 596 549 -718 -425 847 283 -1002 -91 966 -88 -989 311 966 -490 -871 770
6128 770 692 -884 -463 975 343 -1049 -66 1075 -146 -1110 397 1007 -603 -868 774 703 -935 -524
6146 -524 993 340 -1081 -50 1101 -194 -1016 376 979 -528 -817 715 624 -838 -426 915 283
6163 283 -913 -61 947 -178 -866 357 752 -495 -655 588 535 -703 -419 682 182 -695 -36 659
6181 659 -125 -619 236 516 -256 -409 327 319 -403 -231 393 105 -370 -36 279 1 -323 75 290 -68 -190
6202 -190 24 85 -63 -76 25 -10 28 -41 -120 44 113 -108 -159 153 124 -229 -101 323 120 -280 -5 412 -24
6225 -24 -452 169 485 -233 -447 349 447 -445 -332 609 210 -686 -65 749 -115 -799 189 750 -409 -670
6245 -670 554 630 -698 -458 854 331 -954 -170 1050 -1 -1017 276 911 -466 -866 672 763
6262 763 -815 -609 942 405 -1082 -186 1096 -44 -1126 295 1052 -509 -905 728 764 -936 -574
6279 -574 965 343 -1050 -178 1115 -120 -1110 317 972 -520 -909 625 741 -854 -538 956 353
6296 353 -1027 -163 913 -110 -911 297 834 -436 -713 498 572 -633 -352 719 258 -694 -80 674
6314 674 -49 -704 181 553 -302 -502 334 393 -391 -257 332 167 -417 -83 325 19 -318 43 285 -79
6334 -79 -201 117 98 -154 -68 56 68 16 9 -15 62 73 -94 -71 118 110 -194 -112 219 103 -316 4 358 -34 -364
6359 -364 86 400 -178 -441 283 475 -460 -369 458 224 -600 -134 638 -21 -759 192 709 -344 -698 500
6379 500 515 -625 -472 761 337 -886 -154 873 -5 -959 306 941 -446 -869 613 701 -771 -589
6397 -589 875 414 -996 -205 993 38 -1102 175 1053 -494 -913 612 814 -849 -614 978 398
6414 398 -1053 -178 1050 -76 -1069 256 983 -487 -871 637 702 -695 -597 844 391 -932 -149 953
6432 953 -14 -916 214 796 -416 -721 489 568 -593 -508 647 329 -777 -132 754 -84 -645 109 575
6451 575 -267 -494 337 334 -419 -333 451 198 -412 -93 347 67 -346 56 298 -98 -220 100 158 -97 -35 86
6473 86 84 -20 -44 57 -4 25 -33 -67 63 42 -163 -53 144 86 -242 -21 252 -57 -373 39 347 -208 -349
6496 -349 237 300 -367 -350 436 160 -571 -111 643 -58 -596 153 596 -300 -625 400 548 -595 -483 732
6516 732 379 -817 -172 824 32 -887 141 908 -382 -801 604 704 -704 -575 853 413 -892 -176
6534 -176 976 6 -1055 218 1004 -423 -931 577 776 -828 -662 917 398 -1047 -273 1065 -1
6551 -1 -1011 170 932 -401 -824 617 758 -667 -587 845 394 -913 -199 909 51 -894 156 830
6569 830 -381 -760 475 639 -630 -489 695 356 -713 -239 698 -19 -680 99 597 -264 -556 306
6587 306 475 -410 -410 414 263 -471 -110 350 49 -418 26 373 -92 -319 98 206 -112 -52 128 53 -129
6608 -129 -101 96 56 -66 -61 46 62 21 -94 -22 115 40 -213 -28 251 -43 -212 18 362 -148 -346 252 322
6631 322 -339 -273 360 218 -480 -124 519 103 -639 100 665 -267 -641 312 530 -486 -471 565 399 -742
6651 -742 -234 810 90 -838 89 853 -270 -827 456 818 -639 -707 785 545 -910 -356 939 112
6669 112 -1008 70 980 -317 -927 491 808 -694 -711 833 542 -957 -336 1001 136 -949 56
6686 56 976 -267 -868 537 789 -618 -664 750 520 -827 -317 869 135 -844 35 815 -223 -804
6704 -804 356 709 -558 -561 628 366 -709 -292 720 145 -680 65 721 -193 -588 251 524 -306 -429
6723 -429 413 376 -449 -167 438 74 -486 52 394 -90 -296 96 222 -132 -184 136 151 -88 -58 46 40 -17
6745 -17 -99 17 28 -56 -29 -32 141 46 -165 -34 215 41 -270 51 286 -97 -250 143 328 -266 -255 354 202
6768 202 -375 -189 440 69 -564 -2 614 -143 -613 303 639 -445 -545 552 403 -637 -385 719 205
6787 205 -800 -25 837 -203 -858 322 766 -498 -690 671 524 -748 -435 904 211 -948 -15
6804 -15 945 -151 -890 367 882 -527 -758 756 582 -832 -364 926 160 -931 18 954 -226 -930
6822 -930 368 825 -530 -648 703 534 -780 -419 810 187 -893 -65 858 -179 -823 269 694
6839 694 -441 -667 546 501 -651 -346 673 155 -649 -35 687 -67 -646 241 572 -350 -434 449 359 -467
6859 -467 -264 415 106 -448 -55 423 -84 -358 137 213 -122 -195 64 154 -150 -98 120 84 -110 -45 61 67 -26
6882 -26 -25 -5 83 5 -47 -33 111 2 -212 30 258 -66 -197 155 256 -146 -232 193 174 -311 -164 441 66
6905 66 -477 -69 476 -94 -505 184 559 -298 -501 476 385 -534 -293 579 183 -651 -85 726 -78 -765 234
6926 234 742 -436 -591 528 515 -630 -391 783 298 -850 -45 836 -154 -832 250 747 -483 -695
6944 -695 577 586 -718 -379 795 229 -836 -83 850 -103 -811 239 768 -440 -704 558 581 -707
6962 -707 -385 721 265 -757 -108 822 -41 -794 233 651 -375 -514 456 440 -515 -393 620 265 -608
6981 -608 -101 634 -116 -506 150 506 -262 -432 376 304 -421 -228 420 122 -370 -55 322 -40 -359 70
7001 70 297 -151 -281 122 137 -133 -125 162 60 -157 -104 122 -5 -86 -24 57 69 20 -23 13 137 -11 -110 35
7025 35 88 25 -189 43 242 -193 -187 215 186 -240 -148 269 143 -320 -65 430 1 -447 120 453 -193 -458
7047 -458 259 427 -416 -361 503 240 -524 -205 570 47 -623 71 667 -231 -626 412 501 -535 -447 615
7067 615 361 -683 -199 720 63 -736 151 732 -265 -747 407 643 -521 -587 670 420 -748 -227 798
7086 798 58 -782 42 746 -178 -717 374 606 -538 -495 612 374 -678 -240 662 113 -710 77 690
7105 690 -222 -714 385 489 -431 -467 487 313 -542 -182 602 95 -642 44 507 -205 -471 227 386 -286
7125 -286 -338 381 200 -395 -129 322 38 -318 -56 354 -24 -320 56 239 -189 -118 142 105 -94 -77 79
7146 79 58 -129 -36 -2 7 16 -32 -29 125 7 -131 1 85 6 -94 -16 170 -62 -233 38 254 -199 -209 249 227
7171 227 -240 -198 362 67 -411 -12 448 -103 -485 169 449 -255 -413 337 385 -470 -324 636 167 -571 -74
7192 -74 598 -17 -633 212 657 -345 -524 498 446 -562 -386 662 269 -737 -174 756 -88 -754 174
7211 174 745 -330 -673 505 552 -570 -428 705 295 -773 -144 804 46 -758 133 724 -310 -696
7229 -696 437 597 -564 -450 627 318 -680 -154 685 24 -717 74 675 -204 -611 273 481 -420 -399
7248 -399 501 312 -572 -186 562 21 -547 17 453 -191 -419 208 348 -281 -357 301 233 -319 -125 331 66
7269 66 -278 28 299 -54 -240 150 213 -126 -179 86 114 -14 -52 74 62 -82 -41 48 34 32 -75 -8 163 18
7293 18 -177 15 202 -12 -266 9 222 -110 -323 132 269 -227 -197 243 215 -389 -189 456 70 -515 18
7314 18 478 -169 -489 203 425 -332 -406 417 333 -591 -258 628 86 -654 43 660 -115 -609 270 636 -448
7335 -448 -579 516 463 -605 -290 673 172 -740 -10 781 -189 -705 318 682 -423 -607 578 500 -707
7354 -707 -387 746 199 -794 1 725 -124 -727 272 648 -422 -582 535 445 -639 -294 662 164 -655
7373 -655 -55 640 -65 -642 179 621 -338 -550 440 395 -445 -344 554 228 -551 -91 551 -62 -497 120
7393 120 422 -180 -370 270 307 -296 -239 310 151 -317 -83 287 -17 -180 28 189 24 -187 109 182 -87
7414 -87 -91 30 34 -26 -101 -43 84 -28 -43 -33 69 27 -154 4 158 -45 -165 93 221 -38 -248 89 211 -174
7438 -174 -247 275 214 -305 -158 296 135 -352 -113 409 -50 -467 179 449 -280 -384 316 395 -449 -364 532
7459 532 182 -628 -132 662 -60 -622 138 590 -264 -591 378 504 -504 -403 606 267 -682 -103 676
7478 676 51 -723 113 708 -307 -661 456 580 -526 -519 631 322 -732 -222 793 73 -774 150 630
7497 630 -290 -591 390 549 -523 -519 529 260 -631 -188 673 20 -604 67 575 -178 -564 324 463 -464
7517 -464 -348 476 260 -451 -163 446 102 -457 21 503 -124 -370 207 311 -220 -274 292 214 -283 -130 277
7538 277 92 -282 -24 216 -40 -222 11 187 -128 -101 30 152 -109 -79 9 16 -2 -76 33 49 -71 -24 -82
7561 -82 98 26 -117 6 178 -95 -182 78 178 -138 -175 172 158 -232 -192 259 115 -360 -125 344 14 -378
7583 -378 -7 429 -167 -370 272 354 -284 -285 378 270 -480 -197 453 78 -562 8 503 -170 -515 241 467
7604 467 -332 -398 495 309 -606 -165 619 63 -547 20 558 -188 -606 239 569 -417 -442 458 348 -524 -243
7625 -243 583 151 -608 4 646 -125 -595 266 492 -343 -432 375 409 -520 -240 515 93 -574 31 502 -60
7646 -60 -480 137 472 -232 -402 365 307 -400 -188 390 95 -423 -96 421 -32 -429 140 304 -212 -252 169
7667 169 212 -184 -169 242 110 -285 -59 201 -60 -209 -5 154 -42 -136 -11 137 -95 -97 130 78 -58 -76
7689 -76 -5 121 -30 -107 52 80 -24 -90 -27 91 0 -167 37 155 -79 -120 110 102 -150 -127 158 147 -193 -101
7713 -101 345 39 -305 26 282 -66 -324 78 365 -262 -283 272 191 -345 -177 353 95 -397 -63 476 -44
7734 -44 -430 190 382 -228 -355 340 364 -352 -246 480 165 -551 -55 561 -35 -531 123 512 -276 -473 345
7755 345 393 -453 -240 463 150 -501 -121 468 -21 -537 97 559 -226 -432 320 345 -347 -268 420 181 -438
7776 -438 -33 506 -17 -418 80 358 -192 -309 234 310 -282 -315 321 114 -399 -92 340 20 -347 43 338
7797 338 -112 -277 103 203 -189 -139 188 148 -153 -127 208 -2 -220 20 153 -35 -163 39 148 -43 -104
7818 -104 10 79 -64 -112 63 45 -62 -102 10 85 -69 -97 82 36 -85 -75 8 35 -63 -131 98 83 -154 -86 84
7843 84 90 -137 -74 228 64 -286 57 209 -99 -245 127 232 -115 -291 179 229 -283 -148 283 142 -336 -53
7865 -53 311 -12 -376 82 366 -192 -380 237 288 -328 -235 293 182 -390 -103 369 -40 -429 82 359 -242
7886 -242 -371 227 367 -312 -253 337 170 -384 -80 356 51 -411 94 386 -101 -377 228 353 -312 -198
7906 -198 283 166 -335 -78 343 57 -407 26 306 -148 -313 154 236 -227 -229 261 189 -287 -117 297 40
7927 40 -284 25 229 -48 -219 92 212 -131 -161 103 152 -201 -59 151 58 -170 -9 126 9 -123 28
7948 28 125 -72 -61 50 52 -45 -65 22 44 -86 -62 60 36 -92 -83 52 59 -44 -6 64 59 -4 -55 42 84 -119 -93 135
7976 135 0 -137 -50 100 106 -148 -35 121 -48 -191 71 134 -156 -128 136 131 -205 -172 212 86 -292 -13 283
7999 283 -26 -212 35 225 -130 -230 148 188 -223 -133 266 77 -277 -57 253 34 -327 53 311 -119 -283
8020 -283 197 197 -235 -176 205 135 -260 -59 303 -34 -284 58 268 -104 -296 166 214 -230 -231 287 88 -299
8042 -299 -37 308 0 -312 71 258 -145 -269 115 210 -203 -178 183 100 -227 -30 241 90 -251 24 212
8063 212 -61 -179 96 190 -106 -153 127 129 -129 -45 155 15 -123 4 137 0 -127 -2 70 -110 -132 49
8085 49 28 -66 -81 19 68 -98 -47 73 50 -1 -20 43 -16 -22 -43 29 54 -64 14 66 -2 -106 -22 103 64 -116 -45
8112 -45 176 20 -109 -32 109 2 -103 -7 110 -57 -127 95 95 -71 -56 149 108 -229 -63 197 7 -238 3
8135 3 189 -88 -191 93 170 -168 -68 141 32 -200 -34 208 8 -180 -11 197 -12 -223 81 134 -125
8156 -125 -175 140 97 -165 -150 178 69 -184 22 195 -34 -188 53 137 -90 -170 131 168 -173 -103 182 91 -190
8179 -190 -4 173 34 -193 14 160 -101 -157 104 121 -116 -87
8191h7
##END NTUPLES=NMR FID
##END=
