##TITLE=1H_E1a
 CDCl3
 8 sc, 
 12.4.2024
##JCAMPDX= 6.0         $$ Bruker NMR JCAMP-DX V2.0
##DATA TYPE= NMR FID
##DATA CLASS= NTUPLES
##ORIGIN= UXNMR, Bruker Analytische Messtechnik GmbH
##OWNER= root
$$ XWIN-NMR		Version 3.5
$$ Fri Apr 12 13:45:33 2024 Russian Standard Time (UT+4h)  she@DPX200
##.OBSERVE FREQUENCY= 200.1309
##.OBSERVE NUCLEUS= ^1H
##.DELAY= (6, 6)
##.ACQUISITION MODE= SIMULTANEOUS
##.ACQUISITION SCHEME= undefined
##.AVERAGES= 8
##.DIGITISER RES= 18
##SPECTROMETER/DATA SYSTEM= spect
##.PULSE SEQUENCE= zg30
##.SOLVENT NAME= CDCl3
##.SHIFT REFERENCE= (INTERNAL, CDCl3, 0, 15.7039)
##AUDIT TRAIL= $$ (NUMBER, WHEN, WHO, WHERE, WHAT)
$$ ##TITLE= Audit trail, XWIN-NMR		Version 3.5
$$ ##JCAMPDX= 5.01
$$ ##ORIGIN= Bruker BioSpin GmbH
$$ ##OWNER= she
$$ F:/spectra/data/she/nmr/H-F/1/audita.txt
$$ ##AUDIT TRAIL=  $$ (NUMBER, WHEN, WHO, WHERE, WHAT)
(   1,<2024-04-12 13:44:11.10 +0400>,<she>,<DPX200>,
      <created by zg, POWCHK disabled, PULCHK disabled
       configuration hash MD5:
       00 E9 B6 7A A2 85 ED C7 34 08 36 98 17 FE 4E 26
       data hash MD5: 16K
       44 B2 25 C8 1D 33 BD B9 AE F4 20 D3 C8 67 57 48>)
$$ ##END=
$$ 
$$ hash MD5
$$ BB 11 90 A8 3D FE D1 84 6F 50 52 D2 7A A8 B1 FC
##$RELAX= 
##$RELAX= 
##$RELAX= 
##$RELAX= 
##$RELAX= 
##$RELAX= 
$$ Bruker specific parameters
$$ --------------------------
##$DU= <F:/spectra>
##$EXPNO= 1
##$NAME= <H-F>
##$PROCNO= 1
##$TYPE= <nmr>
##$USER= <she>
##$AMP= (0..31)
100 100 100 100 100 100 100 100 100 100 100 100 100 100 100 100 100 100 
100 100 100 100 100 100 100 100 100 100 100 100 100 100 
##$AQSEQ= 0
##$AQ_mod= 1
##$AUNM= <au_zg>
##$AUTOPOS= <>
##$BF1= 200.13
##$BF2= 200.13
##$BF3= 200.13
##$BF4= 200.13
##$BF5= 200.13
##$BF6= 200.13
##$BF7= 200.13
##$BF8= 200.13
##$BYTORDA= 1
##$CFDGTYP= 0
##$CFRGTYP= 5
##$CHEMSTR= <none>
##$CNST= (0..31)
1 1 145 1 1 1 1 1 1 1 1 1 1 1 1 1 1 1 1 1 1 1 1 1 1 1 1 1 1 1 1 1 
##$CPDPRG= <>
##$CPDPRG1= <>
##$CPDPRG2= <>
##$CPDPRG3= <>
##$CPDPRG4= <mlev>
##$CPDPRG5= <mlev>
##$CPDPRG6= <mlev>
##$CPDPRG7= <mlev>
##$CPDPRG8= <mlev>
##$CPDPRGB= <>
##$CPDPRGT= <>
##$D= (0..31)
0 1.2 0 0 0 0 0 0 0 0.06 0 0.03 0 0 0 0 0.0002 0 0 0 0 0 0 0 0 0 0 0 0 
0 0 0 
##$DATE= 1712915050
##$DBL= (0..7)
120 120 120 120 120 120 120 120 
##$DBP= (0..7)
150 150 150 150 150 150 150 150 
##$DBP07= 0
##$DBPNAM0= <>
##$DBPNAM1= <>
##$DBPNAM2= <>
##$DBPNAM3= <>
##$DBPNAM4= <>
##$DBPNAM5= <>
##$DBPNAM6= <>
##$DBPNAM7= <>
##$DBPOAL= (0..7)
0.5 0.5 0.5 0.5 0.5 0.5 0.5 0.5 
##$DBPOFFS= (0..7)
0 0 0 0 0 0 0 0 
##$DE= 6
##$DECBNUC= <off>
##$DECIM= 32
##$DECNUC= <off>
##$DECSTAT= 4
##$DIGMOD= 1
##$DIGTYP= 9
##$DL= (0..7)
0 120 120 120 120 120 120 120 
##$DP= (0..7)
150 150 150 150 150 150 150 150 
##$DP07= 0
##$DPNAME0= <>
##$DPNAME1= <>
##$DPNAME2= <>
##$DPNAME3= <>
##$DPNAME4= <>
##$DPNAME5= <>
##$DPNAME6= <>
##$DPNAME7= <>
##$DPOAL= (0..7)
0.5 0.5 0.5 0.5 0.5 0.5 0.5 0.5 
##$DPOFFS= (0..7)
0 0 0 0 0 0 0 0 
##$DQDMODE= 0
##$DR= 18
##$DS= 0
##$DSLIST= <SSSSSSSSSSSSSSS>
##$DSPFIRM= 0
$$ [...]
##$SUBNAM2= <"">
##$SUBNAM3= <"">
##$SUBNAM4= <"">
##$SUBNAM5= <"">
##$SUBNAM6= <"">
##$SUBNAM7= <"">
##$SUBNAM8= <"">
##$SUBNAM9= <"">
##$SW= 18.0517689322627
##$SWIBOX= (0..15)
0 0 2 0 0 0 0 0 0 0 0 0 0 0 0 0 
##$SW_h= 3612.71676300578
##$TD= 16384
##$TD0= 1
##$TE= 0
##$TE2= 300
##$TE3= 300
##$TEG= 300
##$TL= (0..7)
0 120 120 120 120 120 120 120 
##$TP= (0..7)
150 150 150 150 150 150 150 150 
##$TP07= 0
##$TPNAME0= <>
##$TPNAME1= <>
##$TPNAME2= <>
##$TPNAME3= <>
##$TPNAME4= <>
##$TPNAME5= <>
##$TPNAME6= <>
##$TPNAME7= <>
##$TPOAL= (0..7)
0.5 0.5 0.5 0.5 0.5 0.5 0.5 0.5 
##$TPOFFS= (0..7)
0 0 0 0 0 0 0 0 
##$TUNHIN= 0
##$TUNHOUT= 0
##$TUNXOUT= 0
##$USERA1= <user>
##$USERA2= <user>
##$USERA3= <user>
##$USERA4= <user>
##$USERA5= <user>
##$V9= 5
##$VALIST= <valist>
##$VCLIST= <CCCCCCCCCCCCCCC>
##$VD= 0
##$VDLIST= <DDDDDDDDDDDDDDD>
##$VPLIST= <PPPPPPPPPPPPPPP>
##$VTLIST= <TTTTTTTTTTTTTTT>
##$WBST= 1024
##$WBSW= 4
##$XGAIN= (0..3)
0 0 0 0 
##$XL= 0
##$YL= 0
##$YMAX_a= 228133
##$YMIN_a= -178512
##$ZGOPTNS= <>
##$ZL1= 120
##$ZL2= 120
##$ZL3= 120
##$ZL4= 120
##$ABSF1= 10
##$ABSF2= 0
##$ABSG= 5
##$ABSL= 3
##$ALPHA= 0
##$AQORDER= 0
##$ASSFAC= 0
##$ASSFACI= 0
##$ASSFACX= 0
##$ASSWID= 0
##$AUNMP= <proc_1d>
##$AZFE= 0.1
##$AZFW= 0.1
##$BCFW= 1
##$BC_mod= 2
##$BYTORDP= 1
##$COROFFS= 0
##$CY= 11.3945322036743
##$DATMOD= 1
##$DC= 2
##$DFILT= <>
##$DTYPP= 0
##$F1P= 15.6554695791079
##$F2P= 12.8336369535428
##$FCOR= 0.5
##$FTSIZE= 0
##$FT_mod= 4
##$GAMMA= 1
##$GB= 0.15
##$INTBC= 1
##$INTSCL= 1
##$ISEN= 128
##$LB= 0.24
##$LEV0= 0
##$LPBIN= 0
##$MAXI= 10000
##$MC2= 0
##$MEAN= 0
##$ME_mod= 0
##$MI= 1.114404
##$NCOEF= 0
##$NC_proc= 0
##$NLEV= 6
##$NOISF1= 3.799351
##$NOISF2= 2.8
##$NSP= 1
##$NTH_PI= 0
##$NZP= 0
##$OFFSET= 15.70392
##$PC= 1
##$PHC0= -25301.34
##$PHC1= 11.18731
##$PH_mod= 1
##$PKNL= yes
##$PPARMOD= 0
##$PSCAL= 0
##$PSIGN= 0
##$REVERSE= no
##$SF= 200.130013532006
##$SI= 16384
##$SIGF1= 3
##$SIGF2= 2
##$SINO= 400
##$SIOLD= 16384
##$SREGLST= <1H.CDCl3>
##$SSB= 0
##$STSI= 0
##$STSR= 0
##$SW_p= 3612.71676300578
##$SYMM= 0
##$S_DEV= 0
##$TDeff= 0
##$TDoff= 0
##$TI= <>
##$TILT= no
##$TM1= 0
##$TM2= 0
##$TOPLEV= 0
##$USERP1= <user>
##$USERP2= <user>
##$USERP3= <user>
##$USERP4= <user>
##$USERP5= <user>
##$WDW= 1
##$XDIM= 8192
##$YMAX_p= 0
##$YMIN_p= 0
$$ End of Bruker specific parameters
$$ ---------------------------------
##NTUPLES= NMR FID
##VAR_NAME=  TIME,          FID/REAL,        FID/IMAG
##SYMBOL=    X,             R,               I
##VAR_TYPE=  INDEPENDENT,   DEPENDENT,       DEPENDENT
##VAR_FORM=  AFFN,          ASDF,            ASDF
##VAR_DIM=   8192,          8192,            8192
##UNITS=     SECONDS,       ARBITRARY UNITS, ARBITRARY UNITS
##FACTOR=    0.0002768,     1,               1
##FIRST=     0,             0,               0
##LAST=      2.2672688,     0,               0
##MIN=       0,             -178512,         0
##MAX=       2.2672688,     228133,          0
$$ Real data points
##PAGE= N=1
##DATA TABLE= (X++(R..R)), XYDATA
$$ [...]
1856c68k6J56l17J83lJ61j65J25M74K5m63N73r2j75M20k41j55k44K69M1m33J56
1878i9K43p07K1O13l93j36L84R8k80L25L58l21l90O55J09q06M85L33p98j65Q79
1899D08m43l80M03N06p57j75Q74n66l44P92J89j042L48Q03q62O6P56l85r50O58
1919a01N39r54j56J566q71p03J153L61j575P26J112j086m40R08j78j235O61Q62
1937E89j047l75J780r97j207J281P62j157K98J316r77j377J624K70j805R28J725
1954A631j926p99J709o65j557J531J217j865l74J788p06j492J901J075k049L28
1970b53K070k013j013J921L12j993R22J580k157j358K832m49k111K325R87k819
1986a217j2K236j346j162K600P62k676K91J994j961j088K955N1k797J296J458
$$ plain form
1856 -368 -394 -238 -555 -372 -375 -214 -379 -254 220 245 -218 355 263 88 508 267 112 -132 137 178 -255 -99
1878 -99 144 -563 -542 71 -322 -458 -74 24 -256 69 427 106 -284 371 480 -326 159 492 -306 -471 408
1899 408 -35 -415 -12 494 -263 -438 436 -130 -474 318 507 -535 -187 616 -246 -180 576 191 -759 -101
1919 -101 438 -516 -672 894 23 -680 473 834 -741 -15 1097 11 -429 479 301 -934 -273 589
1937 589 -458 -833 947 -50 -1257 24 786 -371 -73 1243 266 -1111 513 783 -1022 -94 1631
1954 1631 -295 -1094 615 -50 -1607 -76 1141 -724 -1098 690 -16 -1508 393 1468 -581 -253
1970 -253 1817 -196 -1209 712 1024 -969 -47 1533 -624 -1982 850 401 -1710 615 1602 -1217
1986 -1217 -1229 1007 -339 -1501 1099 1861 -815 -524 1470 -491 -1579 1376 1427 -1370 -74 1384
2002A384l048j94K979l90k275K105R33l059m0L656j778j638L346l22l545Q82K695
2019A691k311n93L148p11l405J480K007k880K28L557j247k764K318N25l038J002
2035i93L396j613k231K687k13l745J948L183k802n57L126j653l190K518J873k506
2051g72J65L270k302l195K888J196l065J673L060l029j972K666r4k676K520K540
2067B873l291j310L494j896k880L756J763l331J77K686k662k119L354J326l193
2082a253J218K379l404j851L998N1k682K571J704l920q82L371r51k151L238J376
2098B812m139j33K944k405j425L996M00l676J093J900k744j062M276m1l161K120
2114G55J165l744l1L740j481j359K461j43l752Q36K967j771j135L324l08l920
$$ plain form
2002 1384 -1664 -1858 1121 731 -1544 561 1494 -1565 -1605 2051 273 -1365 1981 1659 -1886 -1004 1691
2019 1691 -620 -1213 1935 1224 -2181 -701 1306 -1574 -1346 2211 964 -1800 518 1043 -1995 -993
2035 -993 2403 790 -1441 1246 1033 -2712 -764 2419 -383 -940 2186 533 -2657 -139 1734 -772
2051 -772 -607 2663 361 -2834 54 1250 -1815 -142 2918 -111 -2083 583 489 -2187 333 2873
2067 2873 -418 -1728 1766 -130 -3010 746 2509 -822 -645 2041 -621 -2740 614 1940 -1253
2082 -1253 -35 2344 -1060 -2911 1087 1138 -1544 1027 2731 -1189 -2071 1300 349 -1802 1436 2812
2098 2812 -1327 -1460 1484 -921 -2346 1650 2050 -1626 -533 1367 -1377 -2439 1837 1796 -1365 755
2114 755 1920 -1824 -1855 1885 404 -955 1506 1363 -2389 -1553 1414 -357 -1492 1832 1524 -2396
2130b396J436K431k524N6L399j056l152J813J180k819M97L503j486k651K494P3
2146G98l201J599K834k115j092K515p82k842J904K407k374l11K583j355k820K520
2162B68Q50k327J055K331k162j852J986O94k319J340K403k491j089K075r54j389
2178a581J834J494j969o17K042j327j704K152J010k034L55J748j913j183K457
2193G64J50j657R29J182j857p89K050l46j661J695J054k714J83K138j318r89K063
2210H77L98k084L70J158j087p01K174k69j845R56P69j379j2J428l77j156J026
2227B46M40j781J56J686p63p47J575k75j436P11Q46p93j39J204n11j182N17P07
2245D61j137L44J031p65p65J034k3q56L76J036n83n70Q38K23j199O24N98q60P0
$$ plain form
2130 -2396 -960 1471 -1053 -997 2402 1346 -1806 7 1187 -1632 -1135 2368 882 -1769 725 798
2146 798 -2403 -804 2030 -85 -1177 1338 556 -2286 -382 2025 -349 -660 1923 568 -2252 268
2162 268 1118 -1209 -154 2177 15 -1837 149 843 -1476 -136 2267 -224 -1313 762 -192 -1581
2178 -1581 253 1747 -222 -839 1203 -124 -1828 324 1334 -700 -345 1403 -510 -1693 764
2193 764 914 -743 186 1368 -489 -1278 772 426 -1235 460 1514 -1200 -1017 1121 -197 -1186 877
2210 877 1275 -809 -439 719 -368 -1069 1105 836 -1009 -53 716 -663 -675 753 376 -780 246
2227 246 686 -1095 -939 747 -16 -763 812 537 -899 -188 658 -135 -274 930 419 -763 -246 461
2245 461 -676 -332 699 -66 -831 203 180 -676 -300 736 153 -417 421 644 -555 69 667 -193 -123
2264a23O38l42j003P58M47p01k23J013n69n64Q36K6n85N27L26l72m01M92J24l85
2284h1J29L81p69j08N92k09m61R02j31p22K65K33j18RJ77L8j19j64N44l77j83
2305a72O35l90k18M3L83l81m8J00K1n6Q7K03j83j10L05l97J47l4R4j43o9L48l01
2328a36K82k56K99n54L12K72m52N4L20k46n3L05q0p2K27r6K3l05L4J57l11J98
2350g8k7J6N2O3OJ51j37j3L9j35K43j15j12L1q9q1K51k5j79qq0NJ79k02K88j43
2376a00k50N74j71j71K74N0m15J95J13j69J0J23o0l34J70L39n51P4K96k31j22
2397c56L70M4j94R3J94L7j68K45R7m16l0N16o42j32M76l48j82K20K26k05n5L23
2419A13j06m10N75K06o66M32M26n36n5M70k30n51LO32n02k91O35Qr29P09M23n81
$$ plain form
2264 -123 515 173 -830 -72 375 -326 -549 464 -105 -669 167 193 -392 135 461 89 -312 180 304 -81
2284 -81 48 429 -340 -448 144 -65 -526 376 245 -477 -212 21 -97 -88 89 127 8 -156 388 11 -172
2305 -172 463 73 -145 -102 281 -100 -148 -48 -27 -83 4 207 24 -86 219 -178 -31 -65 29 -114 -183 165 -136
2328 -136 146 -110 189 -365 -53 219 -233 -179 141 -105 -158 147 67 -5 222 126 149 -156 -122 35 -276 -78
2350 -78 -105 -89 -37 26 32 183 46 33 72 -63 180 65 -47 -16 -105 -186 65 40 -139 -147 -227 -222 -43 -245 43 -100
2376 -100 -350 224 53 -118 156 206 -209 -14 99 -70 -60 63 3 -331 -161 178 -373 -299 -3 -234 -356
2397 -356 14 58 -136 -43 151 188 20 265 362 -54 -84 432 -210 -342 134 -214 -396 -176 50 -155 -210 113
2419 113 7 -403 172 378 -288 144 570 34 -21 449 219 -332 -329 303 -199 -490 145 153 -776 -67 356 -225
2441b25P6M70l43j39M73J88p81K60O71p44l39P27j66o05K90N14p07M6O43m23o68
2462g82Q45M48j066M86Q78o59o54Q42K03r68M06Q55j074m97R79J98j307Q11N96
2481E40j258K4J190m52o09J073J73r45J62Q67n62q19J032L58j334N17P39j087
2499c91l00J035q3j113R76N62j110m27J592m82p54J043N40j639K30Q73q25m06
2517f79J420j79j593Q18R46j263j92J748o40j140R01N08j248L76J140o68j163
2534i08J421J94j580N44J331j286n50J642m95j500J153P93j274R4J252l51j498
2551a018J220N74j355M47J248j214q19J226J83j496P48J391j428n74J253l35j269
2568a218J370J018j664J66J426r45j266J542O48j580L98J293j435q37J595n8j571
$$ plain form
2441 -225 -149 321 -22 -161 312 500 -281 -21 650 -94 -433 294 128 -477 -187 327 -380 -334 309 -114 -782
2462 -782 63 511 -555 -69 809 150 -504 338 541 -427 -21 834 -240 -737 242 440 -867 -56 540
2481 540 -718 -694 496 44 -565 508 681 -264 -102 765 203 -616 416 774 -560 -43 696 -391
2499 -391 -691 344 261 -852 124 686 -424 -851 741 259 -495 548 1088 -551 -321 552 -273 -679
2517 -679 741 562 -1031 -213 733 -530 -722 1026 386 -754 147 655 -593 -217 923 255 -908
2534 -908 513 707 -873 -329 1002 -284 -834 808 313 -1187 -34 759 -515 -421 831 480 -1018
2551 -1018 202 776 -579 -132 1116 -98 -917 309 492 -1004 -256 1135 -293 -867 386 51 -1218
2568 -1218 152 1170 -494 -328 1098 153 -1113 429 1077 -503 -105 1188 -247 -1084 511 453 -1118
2585a118J093J103j861o1J531o13q55J005Q83j731L26J277q38j055J488M21j818
2602h23O22J006j245o22J724l12j353R31R14j604j36J735n56j000J197N84j650
2619e88J66J521q30j071J566k04j527O27R03j254k35J758m83j410J009O56j210
2636f06P0J611p98j102J402j09j380N38J554j118p42J316j97j399N81R24q34k93
2654e82J453r34r78J129M47j063M01R37q15p49J069K15j045N07J066j146p85J361
2672D88l33j233J069O72j098k3J136p06r54J177M68j121N11Q25r06n11J111k2
2690E50j029N71N46r15l43R20k04q46R66N28j330KJ148o23l56P23L42j040K34
2709a56P38o95l70J022q4j037P21M05r50J55O67j40n92M57J48o81j0P82n27j00
$$ plain form
2585 -1118 -25 1078 -783 -844 687 74 -781 224 1107 -624 -298 979 141 -914 574 995 -823
2602 -823 -201 805 -440 -1062 662 350 -1003 -72 842 -762 -898 837 281 -719 478 1062 -588
2619 -588 -422 1099 269 -802 764 560 -967 -340 563 -691 -926 832 349 -1061 -52 604 -606
2636 -606 -536 1075 277 -825 577 468 -912 -374 1180 62 -680 636 439 -960 -379 545 -289 -582
2654 -582 871 -63 -1041 88 535 -528 -127 810 -5 -754 315 530 -515 -8 1058 -88 -873 488
2672 488 155 -1078 -9 663 -435 -458 678 -28 -982 195 663 -458 53 878 -28 -539 572 550
2690 550 -479 92 638 -277 -620 300 96 -750 216 744 -586 -584 564 -59 -415 308 650 -390 -156
2709 -156 582 -113 -483 539 455 -582 139 544 -406 -251 416 276 -316 141 289 -392 -402 380 -147 -247
2729b47M80J48j054O03N68p13Q8M58o3o73M51L72o38m4N37k55l07K12M43o82L24
2750HJ84l7m84N40n7n19K08L75j20j05K02j89k92L95K26n30K9O17m96k14L26J71
2772B38n22J22M13m05k26N87l08k0J6M71j45k66J44M0l42K01K62n60J76L16l77
2793a85J2J64k09J00r3L00m73R8K12O1j25m9J46l3L9K06o7J1p8J63j83o1K27k94
2817a11j69L42rj28J48L6m8j66J55n9l3r7J97rj32J50j65J16l8R9qm8O0j38J31
2842G6o3M4k07K51m7r2j10J60N8k50J14L8j29O0j4K36l53K44J73j82l2pK7K29
2866B24L1l43J97l08L44J3k53n6J48j68L59j70j93J82j30J59j15J63L0N7l44L58
2888A85l23J58l8L9m9m1m1o8J44j86J39Q8M7j20J7K9K54j31k6J14j49N7L4j33
$$ plain form
2729 -247 233 381 -673 -70 498 -215 -127 331 268 -405 46 418 -220 -264 273 18 -289 -77 366 -316 8
2750 8 192 155 -329 211 154 -365 -157 218 98 -7 195 6 -286 109 335 -195 -166 451 -45 -259 67 238
2772 238 -284 -162 251 -154 -380 207 -101 -121 -105 366 221 -45 99 139 -203 -2 260 -300 -124 192 -185
2793 -185 -173 -9 -218 -118 -211 89 -384 -286 -74 -13 -138 -187 -41 -74 -35 171 104 115 37 200 17 -44 183 -111
2817 -111 -280 62 53 -75 73 109 61 -105 50 -9 -42 -139 58 49 -83 67 -98 18 -20 79 71 23 83 -55 76
2842 76 13 57 -150 101 54 -38 -148 12 70 -180 -66 -28 -157 -97 -111 125 -228 16 189 7 -25 -32 -5 224
2866 224 255 -88 109 -199 145 158 -95 -151 -3 -171 188 18 -175 7 -123 36 -79 84 114 171 -173 185
2888 185 -138 20 -18 21 -28 -69 -110 -178 -34 -220 -81 7 54 -66 -49 -20 234 103 77 191 42 99 133 0
2912@J47k76J84J6j62O7L1k68K94N0Q5k23L3N8p4n2J00q3L2K34j19k92L31m9l55
2937b91J73L64j19k00Q8K0k84JL48j05j76K11Jj08m0L17k87o3M33k76j88J39L46
2960C04n14J59K99n07J1K96N3j42J14K59n50OK89j59k15M43J34o18J17O37n05
2981h9k4L34O2l76q8L60l72p0L92J26o15J90M46o82M1M91ml74J68L58m34m6O16
3004D10L3o28N05M3o81J19P26o85l84Q68l07n52R3P74q45K58O60o8p42O75j93
3025G9l59K28P37n54m74O21q0n18K93M88r17qO34l40m80N50L46o42K27O76n01
3046Fm89Q91K06r36L76P08p03m71O83k66m68M12M40p73k19R42l08q11Q69L61p09
3067b59K09N04l95l15P46J58n90j72O32q66l05R80m4p78J96O54j097K89Q87m21
$$ plain form
2912 0 147 -129 55 71 -91 -24 7 -261 33 83 168 -55 -22 36 -38 -90 10 -73 -41 193 74 -218 113 64 -291
2937 -291 -118 246 127 -73 15 35 -249 -248 100 -5 -181 30 31 -77 -117 200 -87 -150 283 7 -181 -42 304
2960 304 -210 -51 248 -259 -248 48 101 -41 73 332 -218 -212 77 -82 -297 146 280 -338 -221 416 -89
2981 -89 -113 221 283 -93 -181 179 -193 -263 129 255 -360 -170 276 -406 -365 126 122 -252 -84 274 -160 -206 410
3004 410 443 -185 320 363 -318 -199 527 -158 -542 326 19 -533 -440 334 -511 -253 407 339 -403 272 79
3025 79 -280 -52 685 131 -343 278 198 -320 -27 461 -456 -464 170 -170 -650 -100 246 -396 -169 507 6
3046 6 -483 408 614 -322 54 762 59 -412 271 5 -463 -51 389 -384 -603 339 31 -780 89 450 -259
3067 -259 -50 454 59 -256 490 648 58 -114 518 -348 -653 327 283 -495 -299 355 -742 -453 434 13
3087A3m25O81K14j047M69P45o06l66P42K00j194M84K85o58l7Q75m2j032P91J90
3107B82o00J44P24m64m36P97j15o98L22P43o43m21P39k15q73O46N81r73J50P91
3127D81n55n29Q31K19p40K44P15l50q42R95j97q41P34M93q28l19N59j29o24N65
3147a18L40n11j5O46l51l15O71J11n82Q3N45o65j49O21j41o49L81O23r77j54Q36
3168B30l18n35P58M02p08j03O61j44m68N59K76q60K44M24n62k49O15l73m20M20
3188a51K18m18j14P63k32l11N60l6l65J71M51n14k01M69l6o41M34K85m84j98O12
3209B62k67o61N82K26m05K55M48l16m00N73N6l95O6M76m35n56O56J0l58L46J09
3230B72p16P1N24j88n34N63K15k71k1N39k47m88O64p2l60K98Q2m43j78K46O7l16
$$ plain form
3087 13 -412 269 483 -564 -95 650 44 -322 420 620 -574 -90 195 -463 -500 375 333 -699 92 282
3107 282 -318 -174 550 86 -350 447 332 -366 -44 699 56 -365 374 159 -714 -68 513 -460 -310 481
3127 481 -74 -603 228 447 -293 -49 666 316 -526 469 272 -569 165 658 -170 -489 70 -59 -683 -118
3147 -118 222 -289 -304 342 -9 -324 347 458 -124 -41 504 -161 -310 311 170 -479 -98 525 -452 -606 230
3168 230 -88 -623 135 537 -171 -274 387 243 -225 334 610 -250 -6 418 -144 -393 222 -151 -571 -151
3188 -151 67 -351 -465 298 66 -245 315 279 -86 85 536 22 -179 290 254 -387 47 332 -152 -350 262
3209 262 -5 -666 -84 142 -263 -8 440 124 -276 297 353 -42 24 500 65 -491 165 175 -183 163 272
3230 272 -444 -373 151 -37 -571 -8 207 -64 -85 454 207 -281 383 311 -49 249 331 -112 -290 -44 23 -293
3252b93K36Q1k93o7N77n4n11N03J24l35KL79k42l81M85j28k68N6K08m39J63J04
3274i3oM4K6n8L1J33k78P0Q6K59k8l37R4L41m79J51K32k43k3m1K14l34m7M26L2
3299A72l36K83O6l58jK63rqJ47Kl04j24K33L6l11L26k37n4L78j63o6j22K53l2
3323C4N5j2O3m7M9J42l19P9M7j65q6J79O2j62k8J3J72j41NJ49k84L25j08J3J59
3348A94k30q9O7k6M1l9q3J71J18l37J75M0j48J13j77K62r3J5J88p6j21O9l05M1
3372b30M03j21j07J28n7k4j97J27p6On2L39k12P4K18j95Q7L1j50R7j43m5L71n45
3396b73K77p2o3K04j69L4L5J49J71m52j8K80n6k19J12o8J59L7m4k6r9O3l7m0K04
3421H9k34j49K41k02L00j67N6J36l50L49Nj28K69j17K6N4r7j28R5j33J3M6r4J12
$$ plain form
3252 -293 -57 24 -269 -336 241 187 -324 179 303 -32 -30 349 107 -274 211 83 -185 -129 79 -360 -197 -93
3274 -93 -99 -55 -29 -87 -56 77 -201 -131 -45 214 186 -151 -57 284 -195 -44 188 -55 -78 -119 95 -239 -286 140 172
3299 172 -164 119 185 -173 -174 89 80 72 219 221 -83 -207 26 62 -249 77 -160 -214 164 1 -65 -187 66 34
3323 34 89 77 140 93 142 284 -35 44 91 -74 -160 19 81 -81 -109 -96 76 -65 -60 89 -195 130 22 35 194
3348 194 -36 -125 -58 -84 -43 -82 -165 6 124 -213 -38 2 -146 -33 -210 52 -41 -26 162 86 -35 34 -271 -230
3372 -230 173 52 -55 73 16 -8 -205 -78 -154 -148 -200 139 -73 1 219 24 111 142 -8 89 -54 -99 272 -273
3396 -273 4 -68 -131 73 -96 -62 -27 122 293 -159 -177 103 47 -172 -60 -128 31 68 24 -2 -101 -38 -75 -115 89
3421 89 -145 -294 -53 -255 45 -122 -66 70 -280 69 74 -54 215 98 124 178 81 -47 48 -85 -72 -26 -120 -8
3445hj93j32K55J0R6lJ77j39k20L95j19k8j11R1k42p0L90l24K30Mj36m6j75L51
3469E3j24l05L55K13l49LL42k16oK96j91j60Q1N2p3P0K09k51m65O25k9l41J1J78
3493b2J0j97M21jj54p8O97q81K1M60l49m23M36K53q5l75M08j68l11L30K40k88
3515e6j8L07l29j07K93p4p1Q7J69l45p3P37l96m47K88L04n25J41L14j05n19N49
3537A24J93o48K78M02k17m85N60p0k26K0N62o14q2M93k58m89N94J10l68J35L89
3558D03j20n12L29L7n42M07K14l18n2M45k9n36L24J31m34m5Q66m13n81M12L71
3579C57p27L21L82l47j12R3M31n94L68J40l99M0L96j14p08L37L43m40NK97k72
3600b03k64M74K02m66k21Q61l31k85O02j06o48J98L40m56J73L65k7o03N30J47
$$ plain form
3445 -8 -201 -333 -78 -68 28 25 202 63 -157 238 119 91 -20 71 -171 -241 149 -175 55 59 -77 -123 -298 53
3469 53 -71 -376 -21 192 -157 -154 188 -28 -34 262 71 -89 -8 44 -29 41 250 -1 -466 159 130 -211 -200 -22
3493 -22 -12 -209 212 211 57 -21 676 -205 -184 276 -73 -496 -60 193 108 -267 141 -27 -338 -8 232 -56
3515 -56 -74 233 -96 -203 90 16 -55 32 201 -144 -217 520 124 -323 -35 269 -256 -115 199 94 -425 124
3537 124 317 -331 -53 349 132 -353 207 137 -89 -69 493 -121 -203 290 32 -457 137 247 -121 14 403
3558 403 283 -229 100 137 -405 2 216 -102 -154 291 262 -274 50 181 -253 -298 568 155 -426 -14 357
3579 357 -370 -49 333 -14 -126 -33 398 -196 172 312 -87 -47 349 235 -473 -136 207 -233 -228 69 -203
3600 -203 -467 7 209 -257 -478 383 52 -233 369 263 -385 -187 153 -303 -130 235 208 -395 135 282
3620B82m98n1N27o71j20P96j18j92j74P07m47j79L53L3n22L16l7k68k7K49k5j92
3642b58L94K12n77M4O50m49l20N53J1k70J47L34n30k48M55J08n14K28M11r68l1
3663f18O62j3l44L08L34l47K7L32k04j64L95J7m15j31M57m92n8L05L1l31K31k8
3685d6k65J27N04m48K30K54K4o08J07N41k66k06M60l32k81K53M1m69j1M23N1l13
3707b30L8K01l23K38M59l20k18K63ml25K33K08r2j15K43k53r2O8J06k39l0J49
3729c5J02l64L92N1j87J04J45j41l94L54K83m27J35K16l75r3M5N02n33J27M26
3750C33n42K31K73l12k42J94K41j16m0K37l69o2P1K05j88Q9J25l91K6K87O9j48
3772b9J9J06j63%K56j19l1l3L21o15J64J74j00o0K00L0j36R8K1k94J03J51m7j5
$$ plain form
3620 282 -216 -267 260 -411 -531 265 147 -45 -219 488 41 -138 215 248 -274 42 5 -263 -290 -41 -66 -258
3642 -258 136 348 -229 -185 465 16 -304 249 260 -10 137 471 -59 -307 148 256 -258 -30 381 -587 -618
3663 -618 44 31 -313 -5 329 -18 9 341 137 -27 368 385 -30 -161 296 -196 -254 51 82 -249 -18 -46
3685 -46 -311 -184 320 -128 102 356 380 -228 -121 420 154 -52 408 76 -205 48 89 -380 -391 32 83 -230
3707 -230 -192 9 -314 -76 383 63 -155 108 104 -221 12 220 128 13 256 3 -89 -21 85 -154 -184 -35
3729 -35 67 -297 95 146 -41 63 208 67 -327 27 310 -117 18 234 -141 -234 -189 313 -220 -93 333
3750 333 -209 22 295 -17 -259 -65 176 60 20 257 -112 -174 -103 102 -86 3 128 -263 -237 50 119 -29
3772 -29 -10 96 -67 -67 189 70 39 6 327 -288 -124 50 -50 -110 90 120 -16 82 103 -191 -88 63 16 1
3796AR1p0q5%J05j32P6n3R1l8l1J3j9j24J73p9j56L83M1o0j24O9P6j89K6J68j76
3823b3o1K3J96m0r4k9j77NJ08l9J10J2j0N2M6l9Nq8P2k59K81J28m1n8k21J31j0
3850b0J22k39J24J9O2K5k06k1J01J00P0Q9j33P4k50K66m1pj14r3K34q3j78M3Q4
3875B8j49L8k78K42J90P3k05R0NR5m8J50k14j84K50O3j6k80K74k98LN1q9k1L37
3900A07k40N1j7k7J9J49q5J02j34K69k65J33L5l8q5mJ4k2m0J52r8l10K95q7J79
3925E3k31P9N9k3q4K78k46K73n7J17l62J61o7P4J81j92l80K91K87o3l32j41M79
3948A54j22P3j09j7J23j95J85J29k18J14n4p4J96j72j50q3M65q6j23P5Lm5j52
3971h3K28l05%L11m4j79J88n6j9l42L78L7j68J08L4j04r0K89k74m1Q6J92j06q2
$$ plain form
3796 1 92 22 -63 -63 42 -90 -14 -67 24 -14 -45 -32 -51 -175 -2 -81 -237 146 187 127 3 72 148 -41 -15 153 -23
3823 -23 -84 -61 135 95 1 -28 -205 -200 -92 -131 -21 -9 -19 33 79 40 45 -43 29 -230 51 179 138 80 -141 -10 -20
3850 -20 102 -137 -13 6 68 93 -113 -134 -33 67 137 226 93 167 -83 183 142 135 21 -72 162 79 -99 -56 28
3875 28 -121 -83 -361 -119 71 144 -61 29 34 129 81 231 17 -167 83 146 130 -150 124 -174 -171 -120 -209 -230 107
3900 107 -133 -82 -99 -126 -107 42 -43 59 -75 194 -71 62 97 59 -26 -30 -16 -38 -78 74 -24 -334 -39 -126 53
3925 53 -178 -99 -40 -63 -147 131 -115 158 101 218 -144 17 -50 24 205 13 -367 -76 211 148 -184 -325 154
3948 154 32 105 -4 -21 102 -93 92 221 3 117 63 -11 185 13 -137 -220 245 159 36 111 114 69 -83
3971 -83 145 -160 -160 151 107 -72 116 60 41 -301 77 114 -54 54 88 -16 -106 183 -91 -132 -46 146 40 -42
3995d2J66l5l84K87K81n81K12J98j48l0M0om5J26L4k9k19L51Q5l83K23R4l53K23
4019F5L6p2p4J05Q1j31j12J98k43J9K32j61J0N8M6k40L8K47pk09K4K5l1J40K16
4044B60j91k40L6J51l36L72R9m63J08M58o7l29J19L74l11N9K81j54k83K55k09
4065a1j11J98N8j70l01L44l7m37M67K54k51j16L43o2m43L72J42j81j83M08m11
4086a28j80N09j95k93N13N0k78j76J31l3j45M11k1l36K0M73k40m28L94J71l69
4107a50K07L36m31lM5J54m09M00nk78l2L17j31k49L65J14l29k9K22j76j76N03
4129B65j69k21RM62n29J24J99J83m02L1L56l89J34J52k64j39M50pn14J47K66l03
4151a59K21p2K99m02nL77k56l72M94m9m46M27J20m48J28K28jj98L01j4k66P7L11
$$ plain form
3995 -42 124 89 -295 -8 273 -308 -96 102 -46 -76 -36 -42 -87 39 73 44 -175 176 261 -122 101 195 -158 65
4019 65 101 29 -45 60 141 10 -102 96 -147 -128 104 -57 -47 11 57 -183 -145 102 95 -114 -90 -65 -96 44 260
4044 260 69 -171 -135 16 -320 52 151 -312 -204 254 187 -142 -23 351 40 99 380 226 -57 198 -11
4065 -11 -122 76 134 -36 -337 7 -30 -467 0 254 3 -113 230 168 -275 97 239 58 -125 283 -128
4086 -128 -308 201 6 -287 226 276 -2 -178 -47 -80 -225 186 165 -171 -151 322 82 -346 48 219 -150
4107 -150 57 393 -38 -41 4 158 -251 149 144 -134 -166 151 20 -229 136 250 -79 -108 114 -62 -238 265
4129 265 96 -125 -116 346 -183 -59 140 323 -79 -48 308 -81 53 205 -59 -198 252 245 -269 -122 144 -159
4151 -159 62 -10 289 -113 -118 259 3 -369 125 76 -370 57 177 -271 -143 85 84 -114 187 173 -93 -16 295
4174B95l70N7J88j9k78J85K6j54p6L29j57k49J64J39k70o2N76k83j78M7M0o7Q
4197a09J72q9r0J65m3k22L32J48m28K16N4k50kJ68Q8k87J50K29j05k90J90J20
4219A17l16J99O1m4j26K05r3l5J19M8k42R6L49k94j65K06J1j26Q4j09j65P8K07
4242F5o9l9K3J93l08k2L13r7%Q6P1j72q6K43k00k45J5L52k66q0K24p1j40J40Q2
4267A2j23n6J07J91j80J63or5l8J00n9j16L6j6j28J30J27n7J50o8p2J87k78K10
4291A21j09j34J66j8O1p2jj75K30L1Pj34l2J32n6Qj69qK33j32N2j29K80O4j51
4316F5N5k30J94r9l2J05p4k3Q0J2k76J06J48p9O2J50j35L7k35N9L1Q1r5O7K66
4341B40k06j00K55p0l4Kj47J95k47JK46j64j96J06J51j05J1J17k08K49m9k83J60
$$ plain form
4174 295 -75 -18 170 151 -127 58 84 -70 -146 183 26 -223 -59 80 -190 -252 324 41 -137 -90 -50 -117 -109
4197 -109 63 -26 -116 49 6 -216 116 264 -164 52 106 -144 -146 22 110 -177 -27 202 97 -193 -3 117
4219 117 -199 0 61 17 -109 96 3 -32 87 135 -107 -11 338 44 -121 85 96 -30 54 -55 -220 -142 65
4242 65 -4 -43 -20 173 -135 -157 156 59 59 145 216 44 -42 201 1 -244 -229 123 -143 -223 1 -70 -210 -70 12
4267 12 -111 -167 -60 131 -49 114 108 13 -25 75 16 -100 -64 -80 -208 -78 49 -8 142 74 2 189 -89 121
4291 121 12 -122 44 26 87 15 14 -161 69 100 107 -27 -59 73 17 25 -144 -152 81 -51 1 -128 152 216 65
4316 65 120 -110 84 -15 -47 58 -16 -39 41 53 -223 -117 31 -48 14 164 29 66 -169 -110 -79 2 -93 -26 240
4341 240 34 -66 189 119 85 87 -60 135 -112 -111 135 -29 -225 -119 32 -73 -62 55 -153 96 47 -236 -76
4364g6J50r6k6j18L10r6k67L56j20o2j12M2J74k22J45J03p7k9J55j30k6j96K92
4387G4j73P7J67j02j68K75o9o9K8k12K67P3j90n6K35m4j19k22J9K16l2O0k3j38
4411a26J17J45k97j31J76P9j17q0K21J44mj01p0L8k04K82r9L0q1R8m4P9nk18J
4436a67L29k64O5L9J40j6j21km3J06p8K05k09l1PM6j33J16O8j97J27Q8q4k0j8
4461d7J36o6j59K30j85K11J05j90m8J78j04o3K14k84j4Q4p2Q4m2R0J22j54J86
4484B12j39m7q1p0K60j21l0j5j13R8O7J9j87K19o6J8j08L3K5Q9Jn9J12K3K5j47
4510A8J97n8j90r9P9L1N8N9nL6o2j62K31k58K14lo8L5j55K40r4m9jj5K4m0M54
4537D17m12Q3O8k63J09R9K01l80M1k6L8j06K59N8j85J86j8l51j09N06j38O2j84
$$ plain form
4364 -76 74 -22 -48 -166 144 48 -219 137 17 -45 -157 -115 59 -163 -18 85 8 -21 134 4 -22 -218 74
4387 74 -99 -22 145 43 -125 150 81 12 40 -172 95 168 -22 -78 157 113 -6 -228 -209 7 -25 35 12 -126
4411 -126 -9 136 -161 -292 -116 -37 -154 -234 -13 131 127 26 -44 -6 -210 72 -27 3 -78 20 -24 55 50 -168 -167
4436 -167 162 -102 -37 2 142 126 5 3 -40 66 -12 193 -16 -47 -40 6 -127 -11 57 -140 -13 75 -9 -29 -47
4461 -47 89 23 -136 94 -91 120 225 35 -13 165 61 -2 212 -72 -86 -2 -74 10 -32 58 180 26 212
4484 212 73 26 -55 -125 135 14 -16 -31 -144 -46 21 40 -147 72 6 24 -84 -51 -26 63 64 5 117 140 165 18
4510 18 215 157 -33 -132 -53 -22 36 95 90 126 64 -98 133 -125 89 86 18 53 -102 138 44 -5 -6 -21 3 -37 417
4537 417 5 88 156 -107 2 101 302 -78 -37 -63 -25 -131 128 186 1 187 169 -182 -291 215 77 139 -45
4560d5J49k46j39L53J2j99L8J0j69J68J88o4j54K89j40j21K34%l48K00q7R8k16
4583a89O6J66j90M7K25M6j87N7K0k6j49J18j01J48J74k65N3k0J30k42o5K57r1
4606a8l6r8K63l31K95J29k35J1J99j68q8p3J81k4j37J13L00k25J5J43m79J90K1
4629e2l0j34L15j21l4J27l6o8R8L0N1j39j01K08l15K14K19k18J5j00J26j54J2
4652h7K50j04o7l6K57j07K50l48q5JK78k11l0J70k43J22k0J46k27L8j2O7J9R6
4676A17m5k16J25J62q0n2qK64j85q9L0K0r0M1J02l80O1J15q3M1L66l20m8J40O7
4701E5o8J52m0j14j18K47J02k10M4O4k99j4K04k3j07J66j1k86K71ml8J2K1L4k42
4726b02N7K84j98l7J18J93k19p7J69k13Q8J69N5l82K22j53k6K7L3J38m3J05N5
$$ plain form
4560 -45 104 -142 -281 72 84 -115 -77 -67 -236 -68 120 56 -98 191 51 -70 164 164 -184 16 -71 27 -189
4583 -189 -123 43 -147 -100 125 171 -16 41 61 35 -114 4 -97 51 225 -40 13 -7 123 -119 -184 73 -18
4606 -18 -54 -152 111 -220 75 204 -31 -20 179 11 -77 -150 31 7 -130 -17 283 58 73 216 -263 -73 -52
4629 -52 -82 -216 99 -22 -56 71 35 -33 65 95 146 7 -94 114 -201 13 232 14 29 -71 55 -99 -87
4652 -87 163 59 -8 -44 213 106 356 8 -77 -76 202 -9 -39 131 -112 10 -10 136 -91 -53 -65 2 21 117
4676 117 72 -144 -19 143 63 11 3 267 82 -7 23 43 -47 -6 96 -284 -223 -108 -191 -150 216 -104 -152 -12 55
4701 55 -13 139 99 -15 -133 114 216 6 50 114 -185 -199 5 -18 -125 41 30 -256 15 11 -27 -15 6 40 -202
4726 -202 -145 139 -59 -96 22 215 -4 -81 88 -125 -37 132 187 -195 27 -126 -152 -125 -92 46 3 108 163
4749A63r7j28K74j67j86J10J57k11m1J79k73Q2J38n1lR2j36j05K51Q0l0j88K2
4772f8O3p8L7L19l56J4Q0M0j11J23k8k29K04N2N8j20qm3K24k26N2Q5n9j38L09
4797A96p5l91K14J49j86j00J80K19k94m4J48K00j48J15j61l1K90k84n8J89j72
4818d4J20j40N4J00m6J7r5K6Q6r9P6j59K01k3l88J90m9J93O5q9J19q9j21L68m34
4843a61J00J03j3j77J51J64l1k91L15j92%kJ01l3j54J19j52J14M8m8m6J59r3p
4867b6O2J44k33J90o0J25l24J41j2O3n0K3j39J44q6J35k8j78J07lr2L21l04KR6
4892A8J76k20l6K01l48K26j20P8O3%Q6p9q8l1n1K05j4K43n15J63J71o2p4%J94
4917A86m8j49J16j72j7J97Q7j56O9j70O6j55J05n5J6J69r7Nj97K67p0N2m9J80
$$ plain form
4749 163 66 -62 212 45 -141 -31 126 -85 -126 53 -220 -138 0 -51 -54 38 -98 -203 48 128 98 -90 -68
4772 -68 -5 -83 -46 273 -83 -69 11 51 -60 63 35 -194 10 62 120 0 -8 -51 173 -53 -1 84 25 -113 196
4797 196 121 -270 -56 93 -93 -193 -13 206 -88 -132 16 216 68 183 22 -9 281 -3 -61 128 -44
4818 -44 76 -64 -10 90 44 61 -34 -8 78 -21 55 -104 97 74 -314 -124 -173 20 85 -4 115 26 -95 273 -161
4843 -161 -61 42 29 -148 3 167 136 -155 160 -32 -32 -34 67 34 -120 -1 -153 -39 9 -39 -85 74 -19 -26
4867 -26 36 180 -53 137 77 202 -122 19 7 70 20 43 -96 48 -38 97 69 -109 -2 -5 -97 224 -80 -78 18
4892 18 194 -26 -62 139 -209 17 -103 -25 38 38 124 45 -43 -74 -125 80 66 309 -206 -43 128 66 -8 -8 186
4917 186 138 -11 105 -67 -84 113 200 44 113 -57 9 -146 -41 -96 -80 89 -8 -3 -200 67 -3 49 0 180
4941A80j38n3r2o7M6L91k66k32K71J8r7j75J82j30L36j89j60J16J22m5Q1O1j18
4964D2J65j72k6%J12l1n4J06l31J63P3J7Q9j47m6kR1J58l86K64m1j11r7J33J8
4989a3M1N0L0k54J83M6N5j82O8o3J43k58J57Nj06J67j59m5J94j09o1J55m2j97
5013a95K20n3J38k09P0k3j07J31J57j66J3Mk6j7Q3K88k89j80M22k39L1k77J60
5036f4QP1k33N14j46j11K4j13P2j7P0k71J6K23j30j80L01r6L1q6JQ6J75p3J27
5061A99k68R9k3P2Q5k80K60k34J57j70rm5n7M19k03l6M1q8J90L6l47L09j62M6
5085ik3j4L8J9J92l61K01p9Q6k0j55j61K96q6J45q3J97j49J46j56j04K06j04j42
5109a20RO6j11q8M27j32r0j32K90K1k96l5N5K39j23J41L9k70R0J32n4J3P1k77
$$ plain form
4941 180 42 -11 -103 -170 -124 267 1 -231 40 58 -39 -214 -32 -162 174 -15 -175 -59 63 18 99 160 42
4964 42 207 35 9 9 121 90 36 142 -189 -26 47 64 153 6 -40 -42 49 207 -179 85 44 -67 -164 -31 -13
4989 -13 28 78 108 -146 37 83 138 -44 24 -39 104 -154 3 8 -98 69 -90 -135 59 -50 -111 44 2 -195
5013 -195 25 -28 110 -99 -29 -52 -159 -28 129 -37 -24 -20 -46 -63 20 308 19 -161 261 22 53 -224 -64
5036 -64 -56 15 -218 296 150 39 63 -50 22 5 75 -196 -180 43 -87 -267 34 -62 -31 -117 -116 -30 145 72 199
5061 199 -69 30 7 79 164 -116 144 -90 67 -103 -112 -157 -214 205 2 -34 7 -81 109 145 -202 107 -55 -9
5085 -9 -32 -46 -8 11 203 -158 43 -36 50 30 -125 -286 10 -76 69 -14 183 34 180 24 -80 126 22 -120
5109 -120 -111 -45 -156 -244 183 51 -39 -171 119 140 -156 -191 -136 103 -20 121 160 -110 -20 112 58 71 142 -135
5133a35J33j69J72j24L52k6k17O5j04K0o4p6J66M9j90J05P1l9J2J31l23L23P8
5156B10k20j78K35p8Rk4K12k52J68p2k78K6J85K36l41J07R8j09J10Q6k16J48n2
5179A0R0j21j49L53j69j33M5K40l08J09J93J6l09m5K25nJ11J87k75k09n9J28Q3
5202HNk0J21k57J29J23k71J74j75K74j62k7J24J80k88o0J01k7ol0j23L28k19J10
5226A2N1l8q5P8m6n4k02L41j1L9j67P1PK5o7P3k83L07J23j89rk8N2O4q3K16k03
5253fJ67k78J10q1L3J35q5J06k14M7p8K13j15k12J65J35M4o9M7m3k49J28K07j78
5277g1MR4O5k96K36k25L08o4NJ21q7N7l11J88p0J58j14k9k2K90k26Mj05J52o7
5302eN3J68j8j0j42J75Pj74K1j78J30L8k85J62R6j43j70K81j46N4K27j12J00o2
$$ plain form
5133 -135 -2 -171 1 -123 229 203 -14 51 -53 -33 -97 -173 -7 42 -148 -43 28 -11 1 132 -191 132 210
5156 210 -10 -188 47 -31 -22 -46 166 -86 82 10 -268 -242 -57 179 -162 -55 43 -66 44 130 -86 62 10
5179 10 100 -21 -170 183 14 -119 -74 166 -142 -33 160 176 -133 -178 47 42 153 340 65 -144 -203 -75 8
5202 8 13 -7 114 -143 -14 109 -162 12 -163 111 -51 -78 46 226 -62 -122 -21 -48 -54 -84 -207 121 -98 12
5226 12 63 25 -60 18 -28 -82 -284 57 46 85 -82 -11 -4 21 -46 27 -256 51 174 -15 -24 -52 0 64 -19 197 -6
5253 -6 161 -117 -7 -88 -55 80 -5 101 -113 -66 -144 69 -46 -258 -93 42 86 17 64 21 -228 -100 107 -71
5277 -71 -67 27 92 -204 32 -193 115 51 56 177 90 147 -164 24 -46 112 -2 -31 -53 237 11 15 -90 62 -5
5302 -5 48 216 198 188 46 221 228 54 75 -103 27 65 -220 -58 38 -105 -275 6 -140 -86 141 29 129 67
5326F7j07J37j4p9j70o8L83j55Q1r7q5J80M9n5J07j10j64J96o4j1Op7J62j25m9
5351f2R4J28j58k6J0Q5k78J23N5l3l2j01K27p1l6o2O5M4M3J28j41J46k61J60J8
5376F5J19j60m7J6o3L6q4J33q1K00j28j30J39j43J1K53k4p5j36oJ78Nk0k4j57
5401a23J40p7J04J48j85J31l08O6J87j79N4N6j14J19l3J24j13Mr0L8n5K7K31j53
5425aN0J28j29m2m4r4J72k8K5j4N6O6k24J09q8J48j69M6K41l59Q0O6M6k07L3o5
5451a98J20J56j07J54j71K05j73j75M27l70J17J48j73J48j96N7R6J54k25l9j18
5472a63J07J98j23l08K61J24k0j75J75j06k3K91l77J21q5K64k00J19j18n4k3J17
5494Bk36K47J07m1j9k50K69k51P5J04Jj55J97k1J45j61k7Jl3o9J37J50m00P3L26
$$ plain form
5326 67 -40 97 83 4 -166 -234 149 -6 75 -22 -107 73 122 67 174 64 -100 96 32 21 27 -50 112 -13 -62
5351 -62 32 160 2 -24 -14 71 -207 -84 -29 -62 -94 -195 32 -39 -75 -137 -72 -28 15 143 2 148 -113 47 65
5376 65 184 24 -23 -7 -70 -34 -118 15 -66 134 6 -124 15 -128 -117 136 112 37 -99 -105 73 78 58 34 -123
5401 -123 17 -60 44 192 7 138 -170 -104 83 -96 -42 14 -100 19 -14 110 -3 1 -89 -51 -106 -79 152 -1
5425 -1 49 177 48 6 -38 -132 40 12 37 23 79 145 -79 30 -58 90 -79 -33 208 -151 -71 -5 41 -166 -133 -198
5451 -198 -78 78 -29 125 -46 159 -14 -189 238 -132 -15 133 -40 108 -88 -31 65 219 -6 -45 -163
5472 -163 -56 142 19 -289 -28 96 76 -99 76 -30 -53 238 -139 -18 -103 161 -39 80 -38 -92 -115 2
5494 2 -234 13 120 79 60 -190 79 -172 -97 7 8 -147 50 29 174 13 -14 -13 -46 -115 22 172 -228 -155 171
5519A71j39q1OJ40j86Q6m9O4M0K5L8k42K08k07L9K14p6k9j67J44J56j27k2Q7j63
5544g0J60j54J90j02J64j53j79J46o7K62l39M1J10LJ1k0m6j5J9J26L9j45r7J06
5568a0q1K70nj01N3j00j40R4J33j09J5j22L2k19L38o1n4J01l6O5j68N0m6J74j80
5593a07p2N8J10j1K0L1M9J3k25K26j21K2l3MQ8J65m21K45M3q5P5Q5j48O1J72l00
5619e6ML6L0n9k73K43J36k25K92n3p4j16J02j09j01K04j08qK12j18K8O5m6p8r4
5644a66K06l5k7L5J57j26l7J57j93k14N1K30k7p8K85j78M5l6j20N2J42J00l17
5667i4J82k83J75n7j8J19j78j7L37j28q8J31O7k06J58j27LN5j05l5O7p2J83j67
5691i8k2J0j2K57r8M7j93K16j95J70j01N4o5o6K16o8N3k7poL9O8j64O5k9l9J63
$$ plain form
5519 171 32 -49 -43 97 -89 -3 -52 12 52 77 115 -127 81 -126 -87 127 51 22 -145 -1 155 28 6 93 -70
5544 -70 90 -64 126 24 188 35 -144 2 -65 197 -142 -101 9 12 23 3 -43 -58 -39 87 126 -19 -116 -10
5568 -10 -91 179 174 73 126 26 -114 -20 113 4 19 -103 -71 -290 48 -13 -67 34 -2 63 -105 -55 -101 73 -107
5593 -107 -179 -121 -11 -22 -2 29 78 91 -134 92 -29 -7 -40 -36 52 217 -204 41 84 -1 74 159 11 72 244 -56
5619 -56 -52 -16 14 -45 -318 -75 61 -164 128 75 1 -115 -13 -122 -223 -19 -127 -135 77 -41 -13 52 6 -72 -166
5644 -166 40 5 -22 13 170 44 7 164 -29 -243 -192 38 11 -67 218 40 85 49 -71 -19 123 223 -94
5667 -94 88 -195 -20 -77 -95 24 -154 -171 166 38 -50 81 148 -58 100 -27 -24 31 -74 -109 -42 -114 69 -98
5691 -98 -120 -110 -122 135 37 84 -109 107 -88 82 -19 35 -30 -96 120 52 105 78 71 65 104 172 8 73 44 5 168
5718A68l02M16j43k83j05K40J3N7R7qk27L2J03L0m3O5j15j24L44j39j75J01J20
5741A22n8n8j19j60J40K15j97j12R6K28m7k71K17l8J8N9K45j90j63N0R1l6k57
5764b25M92l03j3o3P2o8K56k94MJ56k00L13k06L0N7M8j32L87k81j48K0K22m4M
5788H4j55J22j11j12J88p3n2J52o9r8R9RR8pj46J16l48N28j23j05j29L54j87j16
5812h1J08l1p2R8m1q0K14P1J91l17j1m1k4o1J6M5J10p5M4p8K96l84k8J38%P3r9
5839a9L8R5r1Q4k0j30O2j51L3j41J62K3P3J08L8j47o5P7l5N3k1j99J54R6knn8
5866A2k1j46R6J43j29p3J15j23K56k84J98J57k27j6N7j97K74J33l83K20O5l67
5888b40K19j76M09n3k71K60k79O8m1K02j23J04J6J0j84Q0L6j63L8O7O8q5n3J05
$$ plain form
5718 168 -134 282 139 -144 -249 -9 4 61 158 150 -77 -45 58 88 45 110 -5 -129 215 76 -99 2 122
5741 122 64 6 -113 -273 -133 82 -115 -227 -131 97 50 -221 -4 -42 -24 35 280 90 -73 -23 68 32 -225
5764 -225 267 -36 -49 -112 -40 -108 148 -146 -142 14 -186 127 -79 -49 8 56 -76 311 30 -118 -98 124 80 84
5788 84 -71 51 -60 -172 16 -57 -109 43 -26 -124 -25 -16 82 75 -71 45 -303 225 102 -3 -132 222 35 -81
5812 -81 27 -4 -76 22 -19 -99 115 186 377 60 49 8 -16 -77 -61 -16 94 19 63 -15 281 -103 -131 7 7 80 -19
5839 -19 19 114 23 107 87 -43 19 -132 -99 -240 -78 -55 18 126 164 17 -48 29 -6 47 26 -173 -19 77 75 70 12
5866 12 -9 -155 -59 84 -45 -118 -3 -126 130 -154 44 201 -26 -42 15 -182 92 225 -158 62 127 -240
5888 -240 -21 -197 212 159 -112 148 -131 -63 -104 98 -25 79 95 105 -79 1 37 -126 -88 -21 47 -38 -91 14
5912A4j4M2r7n3N5O9M9p2j2j63K58L0m5J18l66K13QKj21K23j13p6Q2j5q3P8p7
5939f6J30j44K09j62j3K3J91j53J4J55m2j45n4K0J15l3j76P4qj02J17N9n4K01
5963A56k30K46k36n7J5J90O5j54n9J23L3l1o8l2P7j55O6rJ63l88K63p2N3J49j01
5988GJ68j90mJ12l3Rk17J06J37k4j40J0r0J91rJ64m47J08Q9k16J44q3J95K84l83
6013a12R7Jo2K10mk01p6L87j72L5j28k35L24j72J24r5J14r0R3j1nJ3j97L81q9
6038A30Q1j23m0j11N0J3j4j11R6oj3J46l8j00J58Kj45Q6l26K91j98L05n1k10J39
6063A1LJ3j78L31j69M8Mn9R6j41Q9O5r7M9j98q7O8L59k88J40J31k39j6K47j19
6088F3N6j66mR1j42j16J44R9L2j13J96J2j56k22J09K32J3r6J04j66L1J18j84j04
$$ plain form
5912 14 0 42 -55 -108 -53 16 65 -7 -19 -182 76 106 61 179 -187 26 34 36 -85 138 25 -51 31 16 -67 11 -66
5939 -66 64 -80 129 -33 -46 -23 168 15 29 184 142 -3 -57 -37 78 45 -131 -57 -65 -167 -50 9 -45 156
5963 156 -74 172 -64 -121 -106 84 149 -5 -64 59 92 61 -7 -39 38 -117 -51 -60 103 -285 -22 -94 -41 108 7
5988 7 175 -15 -19 93 60 69 -148 -42 95 71 -69 -59 -149 42 33 197 -250 -142 -53 -269 -125 -208 -13 271 -112
6013 -112 -15 -14 -76 134 130 -71 -147 240 68 103 -25 -260 64 -108 16 -79 35 -55 38 27 22 35 -162 219 130
6038 130 211 88 48 -63 -13 0 -14 -125 -29 -35 -48 98 60 -40 118 120 -25 61 -265 26 -172 133 82 -128 11
6063 11 14 27 -151 180 11 59 63 4 100 -41 48 113 16 65 -133 -220 -152 207 -81 59 190 -49 -65 182 63
6088 63 119 -47 -51 40 -102 -218 -74 25 57 -56 140 152 -4 -226 -117 115 128 32 136 -30 1 119 -65 -169
6112a69J23R6K4K9j13l0K3p8nQ4n8J17N6j38J45k27J25r8j04K16j26K18l6j88
6136a14K47pm4mj40J30K64l27J10k54K33M2j33j8pj60K05j22J27n4o5J2K27q6
6160F2j02p7J93j52J09j3o3m3Q4R8j66o0K40r0j4R3k90J63K2K14j40J4j24o6R0
6185a8N3k39K49L8Rk78J07J41q9J53j34K9J05j77j2j4J52m8r3m4L07q6j48J49
6209A12q1j37J29j74l9K15pJ27j34J92l22K4M6K78k51p0J78J43j43k32J87K4j10
6232d5k1L34k85o5N5L0j36L7j1L3k11L00J34q9q3Q8O9l39K99j27J04j33J7R0j78
6257a33J58J22j75m3P1l6J5qq5K52m1j90J48j16J05Oj00Nk0L6j17J48n1j6J53
6282H8j27n7K52J2l04K32Mj97J75n0r4K7J18r2j51qJ37Q2p1k04K57Q0j13l5QK0
$$ plain form
6112 -169 -46 50 74 103 -10 -40 -17 -95 -100 -16 -74 43 99 -39 106 -121 4 -94 -198 18 -108 110 74 -114
6136 -114 133 126 82 78 -62 68 332 5 115 -139 94 136 3 -15 -22 -182 23 -99 28 -26 -91 -79 148 62
6160 62 -40 -117 76 -76 33 20 -43 -86 -2 96 -70 -130 110 20 6 99 -191 -28 -6 208 68 82 -42 -108 -18
6185 -18 35 -204 45 83 92 -186 -79 62 -27 126 -8 21 126 -51 -63 -77 75 27 -66 -110 197 111 -37 112
6209 112 31 -106 23 -151 -190 25 18 145 11 203 -119 -95 -49 229 -22 -92 86 229 86 -146 41 65 -45
6232 -45 -66 268 -17 -82 -27 3 -133 -96 -107 -74 -285 15 149 60 -23 65 134 -205 94 -33 71 -62 -45 45 -133
6257 -133 25 147 -28 -71 0 -36 -21 -29 -114 138 97 -93 55 -61 44 50 -50 -45 -65 -29 -146 2 -49 -65 88
6282 88 -39 -96 156 168 -136 96 100 -97 78 28 -66 -39 79 -13 -164 -172 -35 47 -24 -228 29 109 -4 -39 -31 -11
6308a1J19j72m1L0J99k10P8J29j72l5K9Q0n3j1R9j06J91j25m3M9N8J08k10J18
6332I8K7KMj74K27j50J95k29qR8l4k4n5O2j86P2J18%l4O5r3l7L5m7J21q3q7J73
6360E6Km5O5k37L42p7k90L14r8q7P0Q6r8J38j42k3J46j48l8M9r2j29L42r4J49
6385A61j94p6J8J48j04R2M3N6j31k43L08J82j98MJ8k34K82r8j66K9J79k23K6J47
6409B6k24K77j96K9m1L29Mk74j32J60J42k53J71J3qk55L32O4k54K7J21K0k0j86
6433a28J05rR8ko4PJ47o5j89J40M7j50j7j15L14Q6l26Q5J77j50J32m6p9J7r6R8
6459A7J87j80p8K1K56l6k07J14k4j76K07j46n9J60j65J61j67M5K27k23N2J22o
6482A02k59M7J69Kj45J34n2J64k78J75R5Q6l99N9J45j71N9O1J98k53J01k78L22
$$ plain form
6308 -11 108 -64 -105 -75 124 -86 -8 121 -51 -86 -57 23 -30 -41 58 -48 143 18 -25 24 82 190 -20 98
6332 98 125 127 131 -43 184 34 229 0 -8 90 56 32 -23 39 -147 -75 43 43 9 74 -19 -56 -21 -68 53 -30 -117 56
6360 56 58 13 78 -159 183 106 -184 130 32 -55 15 101 3 141 -1 -24 122 -26 -64 -15 -107 -236 106 12 161
6385 161 -33 -109 -91 57 -47 45 88 144 13 -230 78 260 62 66 84 -150 132 34 -132 -103 76 -147 -121 26
6409 26 -198 79 -117 -88 -129 200 204 -70 -202 -42 100 -153 18 31 23 -232 100 164 -90 -63 58 78 58 -128
6433 -128 -23 -32 66 64 0 7 154 89 -100 40 87 -63 -80 -195 119 205 -121 -36 141 -9 123 77 -2 15 -81 17
6459 17 204 24 -54 -33 223 187 -20 94 70 -106 101 -45 -104 56 -109 52 -115 -70 157 -66 -14 108 102
6482 102 -157 -110 59 61 -84 50 -2 162 -116 59 154 240 -159 -100 45 -126 -67 -6 192 -61 40 -238 84
6505H4rj24N0M6J06j30m2k7O4Np1j85J22J34N5j14j3K0J32j46j09J81RJ3O8r4
6531B5M3o1r4K20k72K13r0K1j82L0M3J82J1q9r5K16j36K5K2o5N6p9P3m0N9n2J36
6558A20k46jR4q0O8J03j79LK35k28J14l1lJ90j7j57M6oJ13k24n5J17nO3N9j82
6584h9j34N6J52k1L2j05jJ11M1J14j62J27j87J32M8O0l56K87L6j00P2r5n3O8J29
6609A62k20m5J4K85K5J0r7k03J00M2k28N5J64m6R6j01l13L40k24K07k17JK09O
6633B2k0Q5j80J76K8K7l07P8L37l95J08Q3R5l31J34P4kj5J64p8k1j03J05k72L29
6658A21L1j93j7l3J25J50L1k87J00J09k04J06OM3q3J00m23N22j14k13k3N3p5K39
6682G1j0K8j74j9N1p8L34l20N2K33j71l0k3L0j69Q9K84k29K82j82m2j05K93k35
$$ plain form
6505 84 75 -49 1 47 153 23 -19 -46 18 23 -48 -233 -111 23 78 -36 -49 -29 103 -43 -152 29 38 51 119 25
6531 25 68 7 -87 133 -139 74 -16 5 -177 -147 -104 78 89 0 -95 121 -15 10 32 -33 23 -56 17 -23 36 -16 120
6558 120 -126 -127 -33 -113 -45 58 -121 -118 117 -111 3 -28 -31 159 142 -15 31 25 138 -86 -141 -24 -29 34 93 -89
6584 -89 -223 -167 -15 -36 -4 -109 -110 1 42 156 -6 121 -66 66 114 174 -182 105 141 41 113 18 -35 33 162
6609 162 -58 -103 -89 196 221 231 134 -69 31 73 -155 -100 64 18 114 13 -300 40 -184 23 -194 -193 16 22
6633 22 2 87 -93 83 111 138 -169 -91 246 -149 -41 42 137 -194 -60 14 12 -3 161 83 62 -41 64 -208 121
6658 121 152 -41 -58 -91 34 184 215 -72 28 137 -67 39 45 88 5 105 -318 204 90 -123 -146 -93 -168 71
6682 71 61 89 -85 -104 -53 -131 203 -117 -65 168 -3 -33 -56 -26 -195 -106 178 -51 231 49 7 -98 195 -40
6706d0J00P7q0l02K28K12k03J74k93n9m4K73N3r6Q4J09k14M7k8K2L0j60l1J40
6730aNk5J17j13J33M7k44J21j95K20k7M8j9Kl5o0K54k00j43J03p0j5J10j12r4
6755a93K19P0p3k35J76M1j15J00L1P5O4l62K14J00j26o3P8J04j58P9K2k04J36
6778b0J36k76J44JM7l2j2J90j71Q4p5J06m0p7k6PK8J35q6J7J15j96j79J33N4k7
6804b0rK2NK5j50J30j95L0J98%l8K81m91K83p4k88J24K54k34L04o7j07K4L0Nl08
6830b66L11l8J30j73n3K26j01J13q7M3L5l41J57J13j77J34n0J93q9j01O1k39Q8
6853a11J75k64K56J32p3l95L32p7K25k44R6k12L51k09J91q0k24K13J59k41J0o3
6875e3k6L4l2K1P9j00j61L50nk68K78j1j9j93P1l20L46K21k01K14l61L1Q7p1r3
$$ plain form
6706 -40 60 137 57 -245 -17 195 -8 166 -127 -186 -230 43 96 0 84 193 -21 26 -2 20 50 -110 -141 -1
6730 -1 4 -21 96 -17 116 163 -81 40 -155 65 38 86 67 69 34 -26 228 28 -115 -12 -82 -97 13 -99 -193
6755 -193 26 96 23 -212 -36 5 -110 -10 21 96 160 -202 12 112 -14 -77 1 105 -53 26 48 -156 -20
6778 -20 116 -160 -16 -15 32 0 -12 178 7 91 16 122 82 5 -21 -14 14 149 63 80 195 -1 -180 -47 7 -20
6804 -20 -29 -7 -2 23 -127 3 -192 -162 36 36 -2 279 -212 71 -3 -291 -167 87 -147 157 90 -17 7 37 42 -266
6830 -266 45 7 137 -36 -89 137 36 149 62 105 140 -201 -44 69 -108 26 -24 169 80 -21 40 -199 -111
6853 -111 64 -200 56 188 115 -280 52 -25 200 -44 52 -160 191 -18 173 93 -131 82 241 0 10 -53
6875 -53 -79 -45 -77 -56 23 -77 -238 112 107 -161 117 106 87 -106 -35 -355 -9 212 11 225 -136 -105 -18 -89 -182
6900a82K38m4J78k15l0M7j16K98j66ON5n8Q9o2J63k87K26r0p8J00j73J53j62J30
6924B0O9L2l28J65pM1K79k97Q3m1m7J31p1j4j3J55k31M8K95l04J46j59Q7O9k02
6949i4Kp7K60k7P8k99mK19Q2n9k41Q0N0J32j29O5j47m6J87p1j99J01rR2J18kk1
6976D1l1j10r3L49Ml07K53j88P3M3J5j37J47k9kr6o9L61l71J42OP5r4K10k69m7
7002a24J50K3l5l3j16J99K0N7k42R9r9J45k06K52n1Rj09k0Q8O7Qj66J52K08j97
7027G9Q7p4j66K47j46k8n3J82k28jJ51k9j75J04N0o5P2J16j80O3J23J52k79O7
7051F9M4j72J91J4j73J30j15p3J6O3N1N3j12J86k63J42j13o6O3j29K92R8k19J40
7075A17j30p9lK6K4j38J94K7K25k47J80j76L9n3q2J89N5j03M3l33K91k08J21K84
$$ plain form
6900 -182 56 12 190 -25 -55 -8 -124 174 8 14 69 11 100 38 201 -86 140 50 -28 72 -101 52 -110 20
6924 20 89 121 -207 -42 -49 -8 271 -26 57 16 -31 100 29 15 2 157 -74 -26 269 -35 111 -48 39 108 -94
6949 -94 -92 -169 91 64 142 -157 -161 58 140 81 -160 -80 -30 102 -27 38 -109 -155 32 -39 -238 -137 -146 -54 64 62 41
6976 41 10 -100 -193 156 160 -147 106 -82 -9 34 49 -88 59 30 28 -68 -137 224 -147 -5 1 76 -18 192 -77 -124
7002 -124 26 49 14 -19 -135 64 84 141 -101 -2 -101 44 -162 90 39 48 -61 -81 7 74 82 -84 68 276 79
7027 79 166 92 -74 173 27 -1 -54 128 -100 -101 50 21 -154 -50 0 -65 7 123 -57 6 129 281 2 69
7051 69 113 -59 132 146 -27 103 -12 -85 -69 -6 45 98 -14 172 -91 51 -62 -128 -65 -194 98 196 -23 117
7075 117 -13 -92 -95 -69 -45 -183 11 38 263 16 196 20 59 6 -76 113 168 65 108 -225 66 -142 -21 263
7099B63l97m7j6J29q8O3J12k0Q4J01j34j37O8K4Jm1r3J49L9j67P1J1k84K67K25
7124A83j33m3P5j05K14j66q2J17r8R2n9n3j60L69k65Q4o8R5R1k48K70p3R8j39
7148dR4P0o6r7o9N7JJ5P0j31K58j91J81j63J2j75n3M06j61k28J43j0J33j74J86
7173A04lK7k36J23j7Nn6O7j01lpJ29J03q0P8l0j2j32K5L9Q3o4m0K64k67j53J68
7200A4n2l4k64K55J44k15K14j1k67J52l8N5K9j23rM51l17j0N3j71J83J56k10O5
7224E0j01k2Q5K28m38K67k38J06P3P1j49P8K4p0L3j12K28O5o5q8J44j83j71P5
7248a10M0n2J62j37m6R0J90J34l70L4J35j45NJ46j13J96q9k20K08k69L25j02n1
7271c9J40k1Mj22K1j4K3J05j4m2o0Q3p0j28J35L0j71K42K6k91p9K33J31j65NK1
$$ plain form
7099 263 -134 -181 -197 -68 -156 -93 19 -1 83 184 50 -87 -19 5 6 -35 -128 21 60 -107 -36 -25 -309 -42 183
7124 183 50 7 82 -23 191 25 -57 60 -38 54 -5 -58 -218 151 -114 -30 -98 -3 88 -160 110 37 135 -4
7148 -4 90 160 94 -3 -72 -15 -14 1 71 -60 198 7 188 25 37 -138 -191 215 54 -174 -31 -41 92 -82 104
7173 104 101 128 -108 15 -2 3 -53 14 -87 -90 -97 32 135 55 133 103 91 -41 -16 23 106 42 2 266 -1 -154 14
7200 14 -38 -72 -336 -81 63 -152 62 51 -216 -64 -102 -47 -18 -141 -150 301 -16 -26 27 -144 39 195 -15 50
7224 50 -51 -73 12 240 -198 69 -169 -63 10 81 -68 10 34 -36 -3 -115 113 178 113 25 169 -14 -185 -110
7248 -110 -70 -122 40 -97 -143 -53 137 271 -99 -65 70 -75 -70 76 -37 159 70 -150 58 -211 114 12 -39
7271 -39 101 80 84 -38 -17 -31 -8 97 83 41 -19 64 -6 -134 1 31 -140 102 128 -163 -242 -9 122 -43 -38 -17
7297a7p5M5l7K85j76j01K98k46o8j6K43j31P7O4r4p1K2J23p6%j04J34j14K12n7
7322A20j54N4k2O3l02K95m2o7n5J48O3l0o1L3O6rK6J22k61n5J09j29j7m6J62P6
7348H7Ll9j23J15L0nj53J3J35k28K08j00J60q7j43L57k84L4Q3j01J30k41J30J47
7372A28J30l77Q3N3r1K54k07K1J21r4k15J38n2pM8n7J34M8j01p6K6NQ6ql9j8K27
7399A60m26L30l0k70L14r9lJ38r0KL3j50J8J82j27J61j35J6j26R0R0q8Oj3M9J11
7425A43j76R4l66K11p1K01j35L8J98J01j51O2l0k23J71o6N7o7k1R1k7k33J39j42
7449b02J27O3M0n0L5k5q6LO8O6pJ57k44KJ56R4l11J57k39K46l7k5Q3p7K75l94
7475a25L35j99j97L09k61K70k01O6J96r5Q6j28K9K7l06K35K4m5J61k89O9J45r5
$$ plain form
7297 -17 -92 -47 -84 201 25 -76 222 -24 -92 -108 135 4 81 145 51 -20 2 125 49 49 -55 79 -35 177 120
7322 120 -34 20 -2 61 -241 54 12 -55 -110 38 101 71 10 43 109 100 126 248 -13 -68 41 -88 -105 -151 11 87
7348 87 90 51 -72 43 73 68 -85 -72 63 -165 43 -57 103 16 -127 230 -54 -20 63 -38 92 -149 -19 128
7372 128 258 -119 -36 17 -74 180 -27 -6 115 21 -194 -56 -108 -115 -67 -124 10 58 -43 -119 -93 -88 -2 -10 -49 -67 160
7399 160 -266 64 34 -236 78 -21 -24 114 24 26 59 -91 -73 109 -18 143 8 24 -102 -12 78 -10 -4 -17 32 143
7425 143 -33 61 -305 -94 -165 36 -99 -61 137 238 87 149 119 -104 67 1 58 -9 -30 61 34 -199 -60 -202
7449 -202 -75 -12 28 -22 13 -12 -98 -95 -27 39 32 189 -55 -53 103 197 -114 43 -196 50 13 -12 71 -6 269 -125
7475 -125 210 11 -186 123 -138 132 -69 -3 193 98 184 56 85 112 -194 41 65 20 181 -108 -39 106 11
7498A1P5j7j96J02m0K1R2k1j20n4oK65k6k7j51P9R9j84J33K9q2J69j28P2k00P3
7524c2J82l41J23%M1M1J75l58K01p0J89J28l93J65j21L6J43j93J4J27p2MJ25r7
7548A7k9q3P7J57j73o5J93j16Jq4P9L7j41K44j43O9L5l7O3j21j47K18p8o5K35
7573A43k18L10k38m4J23j68n6J16M1o2K8J18k26L57k42j07J34p5K3J7p0L4rP5
7597DlK03k45L8o1J93k15J43J6m4R6j28J50j58J71j44Q6j22M0j06P2K0r6K55k33
7622f8J23n1J9ol6Q2j9lj73J16MKK65k21J2J14j62j4P5r4K9j13J51k2j44J9J75
7649F0q3M9k6L0l9k0Q9j32L1J88k00O9J78q5r2m5k8J9R5j58Q2r4j7K24j45K8j14
7676a36J38p2P6l5P4O7mk31O5J40o4N6M7k98K33kQ2l43J15K3o0K41k20J56j30
$$ plain form
7498 11 86 69 -127 -25 -65 -44 48 27 -93 -147 -153 112 86 59 -92 -13 86 -98 35 64 -18 151 23 95 -105 -32
7524 -32 150 -191 -68 -68 -27 14 189 -169 32 -38 151 279 -114 51 -70 -34 109 -84 -70 57 -15 -11 114 17
7548 17 -12 -95 -18 139 -34 -99 94 -22 -21 -105 -26 11 -130 114 -29 40 75 38 101 -20 -167 51 -27 -92 143
7573 143 -75 235 -3 -47 76 -92 -148 -32 9 -53 -25 93 -133 224 -18 -125 9 -66 -43 -26 -96 -62 -71 4
7597 4 1 204 -41 -3 -64 129 -86 57 73 29 125 -3 147 -11 160 16 102 -20 20 -86 -14 6 -90 165 -68
7622 -68 55 4 23 17 -19 63 44 41 -132 -16 -12 -10 255 34 46 160 -2 -16 59 -35 -6 -119 32 10 -134 -115 60
7649 60 -23 26 0 30 -9 -29 60 -72 -41 147 -53 16 194 109 17 -28 -56 -37 58 -100 -18 -112 -129 95 -50 -22 -136
7676 -136 2 -70 6 -29 45 112 108 -123 -58 82 18 74 121 -177 56 54 136 -207 -92 -69 -129 112 -108 48 -82
7701h2J59p5j34O4M5Qk44L39n3j39J27o7k22K83J82k52o7L6J63j65R1N3j34K08
7725A24k65l7N8K9m8J93o0Km5J3O8J8j70K11o0j7N5n%n4J93j86R0j82J98J3j63
7752b7j48K83r3Jmj59K8J82N5j15j80K02kJ44p4k12K82j73K54k68R2k9k7kK7J89
7778B26M8l48R4j38rn3L07l06k8J79k12K73J29j22n0J42j45M1j27K07k10J64l14
7801b52L68j4j00J20p7J12k64mQ9N6r3l0oJ06j50J25J1m1R7j35J10J24k03N5j37
7826a33J38m1K27k38Q2K5l7k2N1nko2R7J57k46j40J87J00j35m0K53o7j5j49k6
7851d1o0j10L38k7oq5o2QjJ7k1J40J07k04Q5M6m1Q2j23Q3j1r8r2O3J36j03M4k36
7879a72O0K54k06J08q5K6q9j1L58m44K07M8kj17l1J92n9j09P7j94J79r5J02j00
$$ plain form
7701 -82 77 2 -132 -68 -23 -15 -259 80 27 -112 15 -52 -274 9 191 -61 -128 -92 71 -94 -3 50 -84 124
7725 124 -141 -178 -120 -91 -139 54 -6 -4 -49 -36 32 50 -120 91 31 14 69 64 64 10 203 17 107 -75 123 136 -27
7752 -27 -175 108 15 16 12 -147 -119 63 118 3 -177 25 23 167 93 -119 163 -10 244 -24 68 39 12 10 37 226
7778 226 274 -74 20 -118 -127 -180 127 -179 -207 -28 -240 33 162 40 -10 132 -13 28 -99 108 -102 62 -252
7801 -252 116 102 2 122 45 157 -107 -111 -22 34 -59 -89 -95 11 -139 -14 -3 -44 53 -82 28 152 -51 4 -133
7826 -133 5 -36 191 -47 35 60 23 1 52 47 45 -17 80 237 -9 -149 38 138 3 -37 216 149 134 -15 -41
7851 -41 -101 -211 127 100 94 9 -53 -45 -46 -29 -50 90 197 -7 78 124 83 165 42 125 114 16 -76 -13 123 20 64 -172
7879 -172 -112 142 -64 44 -41 -15 -104 -115 243 -201 6 54 52 -65 -96 96 37 -72 5 -189 -10 -105 -3 -103
7903a03J20ln0MJ56k49J31k18K42r8J67%r2j49m6K59j40p1K15L6o1k8j74K38o
7928H0j31M4L1p5J78q5K0l1q0j63K84j24K0Lp0M0J8K5lj00j60K98l24K91Q9k42
7954a67J58J27k1o5J64k77K2K26k31j6K38j86J0j90J87K54k91Q9O2j49M1r8J42
7977B9r0J66j85j02O9K24j87q4K45p4l5J11j57M1m0J03j02K07k7j41K71k48Q9
8000H3K8q4J17m1J14j94l6J76j59N3J0j19J97Pj28l2j71L5K80j51m3r3J82l14
8024b83K46J16J41j85Mn9m7%J0j00K83n3l02M12k53k5K47q0q9P9L6j33l7J13m4
8049cr2J65r9o0Ko5O6J01R3j19N5MK72m38K18l1j1nK3m4k11K73m3j74J26m2J56
8076A17J40l57R9K47J7l51J44r2L5k4N8m9Q5l01K52L1k27O2M4J04J18Rq7p5O3
$$ plain form
7903 -103 17 14 -36 -32 124 -125 6 -212 30 -68 99 99 7 -142 -188 71 -69 -140 75 111 50 22 -152 86 80
7928 80 -51 -7 24 -51 127 42 62 31 -49 -212 72 -52 -32 -29 -99 -59 -41 -16 -19 -119 -279 19 -305 -14 75 -167
7954 -167 -9 118 97 32 196 -81 -59 167 -64 -80 158 -28 -18 -208 -21 233 -58 31 93 -56 -15 -113 29
7977 29 -61 105 -80 -182 -113 111 -76 -160 85 11 -24 87 -70 -29 -69 34 -68 139 112 -29 242 -6 83
8000 83 111 27 144 103 217 23 -13 163 4 57 67 -52 145 152 24 -8 -179 -144 136 -15 -58 -151 31 -283
8024 -283 -37 79 220 35 39 -20 -67 -67 -57 -157 126 73 -229 183 -70 -95 152 72 -17 62 98 -35 -72 41 -3
8049 -3 -95 70 -29 -89 -87 -152 -86 15 108 -11 44 48 320 -118 100 69 58 53 76 32 -179 94 51 -123 3 -39 117
8076 117 257 -100 -1 246 263 -88 56 -36 -1 -25 33 -16 69 -232 20 51 -176 -114 -70 34 152 161 74 -1 62
8101F2k40N2J76j53J7J60l1J16l29Q4J09n2L1k20R0o1K40j92K97o3j38J07n3j13
8125a04J46m6J8j92J16rQ7n0J71l1k03J79j94J51j38O2k6K4Q3p2N7P4j52N3r8
8150i4K05k10J12L1j81m8K21P8k52J54K19l12J54K7J4o7o2jJ60o6qM1o5j81K20
8175H9pj07j72J60j44J34J13O4K0j00Om2njk5J64
$$ plain form
8101 62 -178 -126 50 -103 -86 74 43 159 -170 -86 23 -29 2 -218 -128 -189 51 -141 156 93 -45 62 9 -104
8125 -104 42 -4 14 -178 -62 -71 16 -34 137 106 -97 82 -112 39 -99 -37 -63 -39 44 -28 29 103 -49 4 -94
8150 -94 111 -99 13 44 -137 -185 36 114 -138 16 235 -77 77 104 118 51 -11 -12 148 82 74 115 50 -131 89
8175 89 82 -25 -197 -37 -181 -47 66 130 150 50 56 14 9 8 -17 147
8191A47
$$ Imaginary data points
##PAGE= N=2
##DATA TABLE= (X++(I..I)), XYDATA
0@%%%%%%%%%%%pJ4j4J4k1K8l5M2m9N6o3P7r1J06j27J53j75J98k30K65l03L45l90
34b07M39m96N60o27P01p84Q74r70J076j190J316j457J610j776J958k157K376k617
52a371K883l179L509l885M311m792N350o007O786p734Q918j0441J2484j5383J9856
67A1305k7734M5706j65391l7683J72410j11607P5512J22118r5765j10352J62981
78D1500O5445p6382Q3514J14056j64865j11614R5437k5152j11335J12787P3876
89I7267j59559o5569R4182n7451o3607J60788R6888j12813Q894R0349r5639n4890
101f1160J62103M7064j05964L0037L8275j51579o4709J22401J719q4808P8703
112A2082L8617j47039k3125J22721j7239l2539J27117L0007j31549p30Q2329o1174
$$ plain form
0 0 0 0 0 0 0 0 0 0 0 0 0 -7 7 -7 7 -14 14 -21 21 -28 28 -35 42 -49 57 -70 83 -92 106 -124 141 -162 183 -207
34 -207 232 -264 296 -331 370 -414 460 -510 566 -624 692 -765 845 -931 1027 -1130 1246 -1371
52 -1371 1512 -1667 1842 -2043 2268 -2524 2826 -3181 3605 -4129 4789 -5652 6832 -8551 11305
67 11305 -16429 29277 -136114 -173797 -1387 -112994 -37482 84636 -11129 -121481 41500
78 41500 106945 30563 114077 228133 63268 -48346 47091 21939 -89396 23391 97267
89 97267 -62292 -127861 -33679 -91130 -154737 6051 102939 -9874 -980 89369 -6270 -61160
101 -61160 100943 148007 42043 72080 110355 -41224 -105933 16468 18187 -66621 12082
112 12082 50699 -96340 -119465 3256 -13983 -46522 80595 110602 -20947 -21677 60652 -522
124e22k8053J22043l417j32244J0432L4775j02787p890J25283j0397q1134N1238
136b2673K4836r2807K3825J25024j3875m3212P5422m264j09604K1798P7425m8237
148A3658k4657P0092l3637j04321K5613N2160n1421R397Q9909l0104p1191M9441
160e061K9229n3374L6170Q3107l7148n2923L9903q414o9630L2463O0712n1365
172C669l2179M4709k9290o1170M7129M8145l7394N037N1335l3249m7458M7716
184G000K9045m1190J7678M1680m9530l9648L8219j606l8906K9336L3216m3335
196a8041k1592L6678q978k7942M4000L0298l7106p69L1082k3957k1971L6944J1604
209C0250l3523M119J8322l3883j9817L4643L312k5021K0032J6218l0410l017L0810
$$ plain form
124 -522 -28575 93468 90051 -42193 -31761 3014 -99773 -107663 17620 7223 -73911 -22673
136 -22673 2163 -90644 -66819 58205 44330 1118 76540 72276 -37328 -15530 61895 13658
148 13658 -10999 59093 25456 -78865 -53252 -1092 -52513 -43116 46793 16689 -54502 -5061
160 -5061 24168 -29206 6964 90071 52923 0 39903 31489 -38141 -5678 55034 3669
172 3669 -28510 16199 -13091 -74261 -27132 21013 -16381 -11344 39991 6742 -40716 7000
184 7000 36045 -5145 12533 54213 4683 -34965 3254 1648 -37258 -7922 25294 -18041
196 -18041 -39633 -2955 -11933 -39875 4125 34423 -2683 -3452 27630 3673 -18298 18646 30250
209 30250 -3273 846 19168 -14715 -34532 111 3423 -21598 -1566 14652 -15758 -18775 12035
222A2035l146j4252K3446J0992k8932l111K0733j5400j2871K3510m35k7173M294
235a0310J1684j6643l839K2240J41j5073J1552J1293j6566J108K1272n539j1208
248A12J1422l97j7325J328R986q917q179J0289jj3212N445J0323p758J497J3476
263H089k598o666O744M315n958l0O239m548p903L957k68r613J522M892n027j372
279h225M977j78j748M209N309j106o42N437k91m131K428n29m707j17j54l801k481
296e750j82L81j034J56L013J66M06M646P97p1K872O87J68M48j912r70j570k010
314B41n38k818k394O39j437K78J168l40J730K542J012K433J121Q17K097l94m38
331E719j65k557r28r63l205j663p90j675p1O9M63J276K61L259K076o75L026K728
$$ plain form
222 12035 8889 -5363 18083 29075 143 -2968 17765 2365 -10506 13004 12569 -14604 -10310
235 -10310 1374 -15269 -19108 3132 3273 -11800 -248 11045 -5521 -4413 16859 11320 112
248 112 11534 11137 -6188 -4860 5126 -3791 -11970 -1681 -1682 -14894 -9449 874 -6884 -5387 8089
263 8089 5491 -1175 5569 9884 3926 3896 10135 5587 -2316 1641 1373 -8240 -6718 -1826 -6853 -8225
279 -8225 -3248 -3426 -5174 -965 4344 3238 2596 8033 7742 3611 6039 5510 803 686 532 -3269 -5750
296 -5750 -5932 -5551 -6585 -6429 -3416 -3250 -2844 1802 2599 2528 5400 6087 6255 6703 4791 3821 2251 241
314 241 -297 -3115 -5509 -4870 -6307 -6029 -4861 -5201 -3471 -929 83 2516 3637 4454 6551 6157 5719
331 5719 5554 2997 2069 1106 -2099 -3762 -4552 -6227 -6298 -6229 -5766 -4490 -4229 -970 1106 431 3457 6185
349F185j075J267J017k555j478J52q66l137k288J228k618l233L243K78l029M548
365b361L762k321Q13M602N90j559L309K752n762j978M578n456n721M927p7p211
381g113J449L153n218k428Q457K167o258N121O615p971r45J0674k729o550Q248
396F672J555j1907j404P937n811o380J0444J410j4147L948J0813r594j428J6808
410H916j029j1311P186O130j3143l64J7190m615j3552J0617J828j9109M363J6684
424I791r697o924J5191k410j9542P217J6156j1090l005K0389p321k1425J2353
437c17R663j7521L944K0392j1913j8329J3351L285j9867J0575K4500j5998j3873
450a2108J8693n484k2496J7842K0054j8940n112J9518j3454k3701K0753J7371
$$ plain form
349 6185 5110 6377 7394 4839 3361 3513 2647 -490 -2778 -1550 -4168 -7401 -4158 -3880 -6909 -2361
365 -2361 1401 -920 -107 4495 5085 3526 6835 9587 3825 1847 6425 969 -4752 175 98 -7113
381 -7113 -5664 -2511 -7729 -10157 -1700 467 -5791 -670 5945 -2026 -2971 7703 4974 -1576 6672
396 6672 8227 -3680 -5084 2853 -2958 -9338 1106 2516 -11631 -7683 3130 -6464 -7892 8916
410 8916 7887 -3424 3762 9892 -3251 -3615 13575 8960 -4592 6025 7853 -11256 -6893 9791
424 9791 94 -6830 8361 5951 -13591 -6374 9782 -1308 -4313 16076 8755 -12670 -317
437 -317 9346 -8175 -4231 16161 4248 -14081 -730 2555 -17312 -6737 17763 1765 -12108
450 -12108 6585 1101 -21395 -3553 16501 -2439 -7551 11967 -1487 -25188 -4435 12936
462A2936k0295M760K3097k2837k1270K5763P674k0556J5699K1686k6965j7618
474a7926K4217k728k1741K4946K0671l2071r665K3591j5404j7663L3174J6478
486B5879k8818J143K0826k4826j7676L6689R816k8135J2378J5059l7285j2790
498b7740L5550m16k1339K3428J1801m0564o881L3185j0042j4546L7366P848m2267
511a4617J806K4877k2241p571M2073P48l9894Q219J5281l4723k427M6203m982
524A2752k9839K1710O076m0777P538M4024r599j7632K9817k750m5642J0086L4758
537B0522k0466p364L6945j3733m5187J4239K1460k5176O579M1894j5892l6780
549b2959K1086J1220l1004J8241M3387k1437k6191K2642q009l6964K1746L6038
$$ plain form
462 12936 -7359 -2599 20498 -2339 -23609 2154 9828 -10728 4971 26657 -308 -17926
474 -17926 6291 3563 -18178 6768 27439 -4632 -14297 9294 -6110 -23773 9401 25879
486 25879 -2939 -1796 19030 -5796 -23472 13217 23033 -5102 7276 22335 -14950 -27740
498 -27740 7810 7394 -13945 9483 21284 -19280 -26161 7024 -3018 -17564 19802 27650 -14617
511 -14617 -12811 12066 -10175 -17746 24327 25075 -14819 -6600 8681 -26042 -28469 17734 12752
524 12752 -17087 4623 10699 -30078 -22540 21484 11885 -5747 24070 21320 -24322 -14236 20522
537 20522 56 -7308 29637 15904 -29283 -15044 6416 -18760 -12181 29713 13821 -22959
549 -22959 -1873 9347 -21657 -3416 39971 18534 -7657 14985 6976 -29988 -8242 27796
561B7796k4504j4848K6172j8824l7933K9039K9637k4324N058L1592k7185l2821
573c1145K9840J6433k4214J7213L0122l4767k9503K7777p61k6895K8425K6651
585B9176l5762j6423K5448j3296k2134L7335K5716l0736l317K3521k5645k0303
597b6420L9512J4320k8777Q974J5645l5904j8200L3996N142k1884K0775J4215
609B1394l9356j0370L2732m584j3003L2542J0476l6714k753K2852j6562r518L5256
622B2392M147l5997K958J3264k7970m071L7097j007k4696J4169P693k9787K306
635a9502L5457l973j5293K1755m8l5051N581K5998j3089p437K3531p538l2416
648b2025P035J7186j6236J453K9281q390k5216J3271R193j8396J0398K7549j1436
$$ plain form
561 27796 3292 -11556 14616 -4208 -42141 -13102 16535 -7789 -2731 28861 1676 -31145
573 -31145 -1305 15128 -9086 8127 38249 3482 -26021 1756 995 -25900 2525 29176
585 29176 -6586 -23009 2439 -10857 -32991 4344 30060 -676 -3993 19528 -6117 -26420
597 -26420 13092 27412 -1365 7609 23254 -12650 -30850 3146 8288 -13596 7179 21394
609 21394 -17962 -28332 4400 -184 -13187 19355 29831 -6883 -9636 13216 -3346 -12864 22392
622 22392 26539 -9458 -6500 6764 -21206 -25277 11820 10813 -13883 286 7979 -21808 -19502
635 -19502 15955 11982 -3311 18444 18396 -16655 -11074 14924 1835 -5602 17929 10391 -22025
648 -22025 -14990 2196 -14040 -12587 16694 8304 -16912 -3641 5552 -12844 -2446 25103 13667
661A3667j7730J2683j142k2843J0449K2219j4492j0717J5152r669k1891J4818
673i496J7215j2294N62J6747j0798j7601J5480J1449j3286O524J6444j6048j5012
686a0114J3153R3j3564J0850J2482j6322r829J2410l797j1328J5400J2100j3873
699b339r04J1911r219q571J5539O566j1885J644P426j2785q263J2872J780j0885
713g113O512O152j3377l448J1471r89m924R761N003j0971j106R484m380n024J0545
728G596R83j1329J339M523p954k480Q987N8p499L087M117o981R3R926j420m674
744a628O204J003p135J224N262l065l042M196o70p206J090M311l932q85N766j541
760d8l799L491K316k772Q96M537j123l206K146N91m501J362K725l375j788J925
$$ plain form
661 13667 -4063 8620 7478 -15365 -4916 17303 2811 -7906 7246 -2423 -24314 -9496
673 -9496 7719 -4575 -4013 12734 1936 -15665 -185 11264 -2022 4502 20946 4898 -10114
686 -10114 3039 3132 -10432 418 12900 -3422 -13251 -841 -4638 -15966 -566 11534 -2339
699 -2339 -3243 8668 -551 -9122 6417 12983 1098 2742 10168 -2617 -10880 1992 3772 -7113
713 -7113 -601 5551 -7826 -11274 197 -792 -5716 4045 9048 -1923 -3029 6455 2075 -2949 7596
728 7596 8579 -2750 -1411 3112 -4842 -7322 1665 1723 -5776 -2689 1428 -5553 -5460 4466 3046 -1628
744 -1628 4576 5579 -1556 -332 4930 1865 -1177 3019 2349 -4857 -3767 544 -3388 -4273 1493 -48
760 -48 -3847 -356 1960 -812 84 4621 3498 292 2438 3029 -1472 -110 2615 -760 -2548 -623
776f23p76k404J202K294j182k95L150m8k279K688J513j694N53Q98j493j434M09
793D79j18j792q90J105j158j051J604K85q62K003J091k03P68R64M67k62j10N28
811B848j082r92M43j417j736L11n64p37M77k72L25R21N88R80M77L98J531j20L91
830B770M86j005m52mj069q77r75q83k08o62j72J47o08J172J271l36J290J340N30
849A755N26Q46j99N1l57L55j162j855N7m93j882R5L73j531K29J263K17k63J414
868e61K004k44L79K198p69j084K002Q7k674M2L7k320j595J150m61k318R70J932
886a225k263l44L803L5r76L212J214k561M36K602j614k294K676J72m794M8K322
903D49l778j173M416r81l560K359K300l054O45N739o48l387M094J260n829J120
$$ plain form
776 -623 -1399 -3803 -2601 -307 -1489 -1784 1366 1318 -961 1727 3240 1546 2099 2997 1504 70 479
793 479 361 -1431 -2321 -1216 -2374 -3425 -1821 -1536 -2398 -395 696 493 1261 2225 2692 2430 2320 2848
811 2848 1766 774 1217 -200 -1936 -1625 -2189 -2926 -2449 -2721 -2396 -1475 -887 93 570 968 2499 2379 2770
830 2770 3256 2251 1799 1795 726 -151 -1126 -2009 -2217 -2879 -3051 -2904 -3512 -2340 -1069 -1405 -115 1225 1755
849 1755 2281 3127 2928 2979 2622 2977 1815 -40 17 -476 -2358 -2263 -1890 -3421 -3192 -1929 -1712 -1975 -561
868 -561 1443 1199 1578 3776 3007 1923 3925 4012 1338 1380 1417 -903 -2498 -1348 -1809 -4127 -3157 -1225
886 -1225 -3488 -3832 -29 6 -970 2242 3456 895 1331 3933 2319 25 2701 2873 -1921 -1873 449
903 449 -3329 -4502 -86 -1067 -4627 -2268 32 -3022 -2377 3362 2714 -673 3421 4681 -1148 -28
919b8N036l359k608L833j504o342J828M286l736j232O500j872o090M567L657n037
935b101K051P333l777n559M258J183o523K599P020n909n085O014k133p602N688
950b543O806n965j055O648l961o923P265N823o885J233P414p645p331Q373J475
965B729p340N155O292r299n601Q085k20o814Q341P451j0674k486Q836n404n822
980f771J1176N018j0413r3O467q884n989J2538K898j0172M762N640j2494k984
994i301J3243l00o982Q662L841j4050j949J1486l597n691J2120J217j5355J070
1008e586Q462q082k033J4624l15j2829L461O145j1295K34J6613k395j0712P556
1022C848J279j4651L113J4394n177o730J0026j876j6190M686J2682p397j911J4397
$$ plain form
919 -28 5008 1649 -959 2874 1370 -4972 -3144 1142 -2594 -3826 2674 802 -5288 -721 2936 -2101
935 -2101 -50 7283 3506 -2053 2205 3388 -3135 -536 6484 575 -4510 1504 -629 -8231 -2543
950 -2543 4263 -1702 -2757 3891 -70 -6993 272 6095 -790 443 7857 212 -7119 1254 2729
965 2729 -4611 544 6836 -2463 -8064 21 -199 -7013 1328 8779 -1895 -4381 4455 -949 -6771
980 -6771 4405 9423 -990 -1083 5384 -3500 -9489 3049 5947 -4225 537 6177 -6317 -9301
994 -9301 3942 3642 -3340 5322 9163 -4887 -6836 4650 1053 -4638 7482 8699 -6656 -5586
1008 -5586 2876 -5206 -7239 7385 7070 -5759 -2298 3847 -7448 -7214 9399 7004 -3708 3848
1022 3848 5127 -9524 -6411 7983 2806 -3924 6102 4226 -11964 -7278 5404 -1993 -3904 10493
1036A0493n890j5580P629Q074r293L131J4584p361j3753Q050L078j2269O844J5129
1050A2866j0147r679R579l119j2359J0104J3463r614m355J0608o949j3208J2012
1063g98J0190j0515J969J0347j1808j1650J1923M831r616O287J0623j3449r680
1076a1346J2154m19r169J2032R681j4525m885J0188n809p986J4512P362j3546
1089a756r27Q736j0742p382J6278L958j1410M826N934j4174m739J4958J094q986
1103d332Q911M548j5732k301J3205m085n623J2933J929j5322O69Q894p129k683
1117f118J4375L61j3972L382O024j1192j35J5093k269r966O420K044j2811J882
1131f882J3837l543o967R200p62j3750M298J0841o638k179J0518l520j2448M802
$$ plain form
1036 10493 4603 -10977 -3348 4726 -4567 -1436 13148 5787 -7966 84 3162 -9107 -2263 12866
1050 12866 2719 -6960 2619 -500 -12859 -2755 10708 1094 -3261 7347 398 -12810 -798
1063 -798 9392 -1123 846 11193 -615 -12265 -342 4489 -5127 1160 11783 -1666 -11346
1076 -11346 808 389 -8780 3252 12933 -1592 -6477 3711 -2098 -10084 4428 11790 -1756
1089 -1756 -2683 6053 -4689 -12071 4207 8165 -3245 1581 7515 -6659 -11398 3560 4654 -4332
1103 -4332 4579 9127 -6605 -8906 4299 214 -5409 7524 9453 -5869 -5200 3694 -3435 -6118
1117 -6118 8257 8618 -5354 -1972 4052 -7140 -7275 7818 5549 -4417 2003 4047 -8764 -6882
1131 -6882 6955 3412 -3555 5645 4883 -8867 -4569 6272 -366 -2545 7973 4453 -7995 -3193
1145c193O633p497J029J1769n630j0743O904K955r139M873J0763o470o476O963
1159B741p46q950N777R234p166l620P563m423q814P256O049p047O24P050n844
1174c16p312P407L578o390L503P152p606n240P164j59n829N599M921p280l197
1189d005N942k661n261O937M143p162m57N343m740l227P399J883n379J459L878
1204D092n467k794O449L27n089L811K649o980r68N541j719k683M729J459n914
1219b557M03M592k803k177N517M52n312J585K453l947m07M507q58l707K111J574
1235A426l889lM715j516k425L304K57l927J228K743j679j205K608l41l499J373
1251h30K244k456m52L242j276k479K198O23j932O20K667j376j808J637O11k398
$$ plain form
1145 -3193 3440 -4057 -3028 8741 3111 -7632 -728 2227 -6912 -2039 8724 2254 -4222 2741
1159 2741 1995 -6955 -1178 8056 890 -2730 4833 410 -8404 -1148 4901 -2146 -1522 5528 -316
1174 -316 -7628 -221 3357 -3033 470 7622 16 -5224 1940 1781 -4048 1551 6472 -808 -4005
1189 -4005 1937 -724 -5985 952 5095 -2067 -2524 2819 -1921 -5148 2251 4134 -1245 214 4092
1204 4092 -1375 -4169 2280 2607 -2482 1329 3978 -3002 -3970 1571 -148 -2831 1898 3357 -2557
1219 -2557 -2154 2438 -365 -2542 2975 3427 -1885 -300 2153 -1794 -2201 2306 1448 -2259 -148 1426
1235 1426 -2463 -2466 2249 733 -1692 1612 1869 -2058 -830 1913 234 -971 1637 1296 -2203 -830
1251 -830 1414 -1042 -1494 1748 472 -2007 191 814 -1118 -498 2169 793 -1015 622 1233 -1165
1267a165J119J638j859o80J622p13j572R76J209j071l06J348m65p92J389N06j638
1284d54P50Q32q10o52O87n3p98J56Q71j062p38J218p2r39J030M31q75P26M30l41
1304C37J0L18J55k57l34N68p67n43P94l84o91K00Q2n7K1J76L63p7J88O95n32j06
1326A59M95j56J9J48l30j66j70k1l7o12j7K20n34L48L27l36L41O32j28Q7K87j24
1348D32L02NJ49k17m93K09k53r76K46J96n76p6M69k27M17J73M17j46K7Q27k81
1369F24n8O75k55q03L12K14j105q7K20j25n82M34M59r25j88J612k97o48J265M53
1389A195j071L41O67n81o16J008R9j936L02J065j676k68J584n20j299J240N42
1406G6j088L67J998n68r96J740J8k006N89J753j748j034J948r39k340R52J429
$$ plain form
1267 -1165 -46 1592 -267 -947 675 -38 -1610 -634 575 -496 -802 546 81 -711 678 1184 -454
1284 -454 296 1128 318 -334 353 300 -498 -342 529 -533 -1271 -53 -125 -1064 -34 397 -478 248 678 337
1304 337 347 665 820 563 229 797 30 -513 281 -103 -794 -594 -512 -569 -548 -372 -9 -86 102 797 265 159
1326 159 654 498 517 665 335 169 -1 -22 -59 -671 -688 -468 -1002 -654 -327 -663 -322 310 182 269 556 432
1348 432 734 739 888 671 178 387 134 -842 -596 -400 -976 -1052 -583 -810 -393 -220 197 51 78 905 624
1369 624 566 1241 986 183 495 709 -396 -483 -263 -388 -970 -536 -77 -1002 -1190 422 125 -523 742 1195
1389 1195 124 465 1132 551 -65 943 1042 -894 -592 473 -1203 -1471 113 -407 -1706 -466 76
1406 76 -1012 -645 1353 785 -211 1529 1547 -459 130 1883 135 -899 1049 110 -2230 -1278 151
1423A51j823m8K718o11k518K220J348k171J020K938j821j723K010l00k732J183
1439a59K560k895j640K793j546l013K944K427k723l5L057j713k379L371J952k861
1455A40R23L190l693l024L531N6l583K276K475m488j711L635p71k722M167K742
1471C143m119j51L875k815k096N292J346m730N13K726m352k712N199K91m411K518
1487d83K400n974q05O090n93k901M953J527n980J77N275k689k412O123j71p432
1503b895J218L479m941o53O738r79o064K697K609n464Q89P469j506m478M665Q40
1519C624p124K302O347l452l014N032j752p609K338N500m551p54O810l054o594
1534e951M629L346m745K422O979m113n712M893Q41o261L872O449n977m162N137
$$ plain form
1423 151 -1672 -1720 998 387 -2131 89 1437 -734 286 3224 1403 -320 1690 1390 -1342 -159
1439 -159 2401 -494 -2134 659 -887 -3900 -956 1471 -1252 -1287 1770 57 -2322 1049 3001 140
1455 140 1063 4253 560 -2464 1067 1123 -2460 -184 2291 -2197 -3908 -273 -1044 -3766 401 3143
1471 3143 -976 -1127 2748 -67 -2163 3129 4475 -255 258 2984 -1368 -4080 1119 1410 -3001 -483
1487 -483 1917 -4057 -4862 1228 635 -2266 2687 4214 -1766 -1589 3686 997 -1415 4708 4537 -2895
1503 -2895 -1677 1802 -3139 -3792 2946 1967 -4097 -1400 1209 -4255 -3366 4103 2597 -1881 2784 3624
1519 3624 -3500 -1198 5149 1697 -1317 3715 1963 -5646 -3308 2192 -2359 -3113 3697 643 -5951
1534 -5951 -1322 2024 -2721 -299 6680 2567 -3145 1748 2589 -3672 200 6649 672 -3490 1647
1549A647k334o148N274N433n390j193N821l796n727O855M498n761J649N609o266
1564A71m851O269J138n273L582M450p309m011N957n32m722O316M233p126j737
1579c445N792l193l659P733K911o982K85M484n676l497Q206J076o577K639K917
1594C014p536j567Q045m95m482N180K365q015m45P235k546l105P142K05q425J251
1610b179M751m559j492P461n81p413K234L644o106M08Q360j753n149L951J124
1625B701o571J585P243k918l859M853r85p135K486N728m261r63N539k294o304
1640e155L523M147m425Q34O087l249n410M351J279m990K602N523m424l612M113
1655A194p87m893L645M602m346j958M644k233m429M794L384m324M15M295l836
$$ plain form
1549 1647 -687 -6835 -1561 3872 -1518 -2711 3110 -686 -6413 442 4940 -821 828 6437 171
1564 171 -4680 1589 2727 -2546 1036 5486 -1823 -5834 123 -409 -5131 1185 5418 -1708 -3445
1579 -3445 2347 -846 -4505 3228 6139 -843 -558 3926 -1750 -5247 2959 4035 -2542 97 3014
1594 3014 -4522 -6089 1956 1461 -3021 2159 4524 -3491 -3936 3299 753 -2352 4790 4995 -3430 -2179
1610 -2179 2572 -1987 -3479 3982 3401 -4012 -1778 1866 -4240 -3832 4528 2775 -2374 1577 2701
1625 2701 -3870 -2285 4958 2040 -1819 3034 2049 -5086 -2600 3128 -1133 -2096 3443 1149 -5155
1640 -5155 -1632 2515 -1910 -1076 5011 1762 -3648 703 1982 -3008 -406 5117 693 -2919 1194
1655 1194 407 -4486 -841 3761 -585 -2543 2101 -132 -4561 233 3617 -707 -292 4003 167
1670A67l809M473J837m469K092L439m905k676M556l00l395L537K781m546j382
1685b600L972j255k868M228K291m632n6L118k830k090M448M61l696J232J964l307
1701a620j485M256P0l200K621J561m018k06L642r92j850K656P77l389n6L010k023
1718b46j446L464j65l447J341J652k495j02L123o04k560J573J166k691L04K923
1734A790q26k054J868K09k457Q45J891j384p33J762n03j805P83J657j632r6J998
1751A313j105j496J335M93j207L85J274p99j221J378J36r73N09J287j200n80J203
1768G32n18r19P63P16j001l32J036o51r79J280J76j079L69J014p26k61O74L67
1786F61o07K70O45q29m82P03N6q94L73N77j073J3M26k60l30P80K6l62K09N05l40
$$ plain form
1670 167 -3642 831 2668 -1801 291 3730 -1175 -3851 705 405 -2990 547 3328 -1218 -2600
1685 -2600 1372 117 -2751 1477 3768 -864 -920 2198 -632 -2722 1726 2187 -1509 -277 1687 -1620
1701 -1620 -3105 1151 1221 -1979 642 2203 -1815 -2021 1621 629 -1221 1435 2212 -1177 -1233 1777 -246
1718 -246 -1692 1772 1607 -1840 -499 1153 -1342 -1444 1679 1075 -1485 88 1254 -1437 -1133 1790
1734 1790 964 -1090 778 987 -1470 -625 1266 -118 -851 911 408 -1397 -614 1043 -589 -685 1313
1751 1313 208 -1288 47 540 -667 -282 992 193 -1028 350 486 -487 22 1309 109 -471 732
1768 732 214 -705 58 774 -227 -559 477 -174 -1153 127 303 -776 -407 607 -119 -380 294 661
1786 661 54 324 969 140 -342 361 417 -477 -104 473 -600 -587 -161 -421 -751 29 55 -307 -98 407 67
1807F7n7N61p9l50L52R0n83N6M8k0m40k16L63n87J1P08l83J88K87L8l4L93O2M5
1831E20j38j2L72o27m7J16k26j72J32k22l03M68j19j80Q8Q2L12j77K43K18j34
1852A94L03K14m09p8k3r8K7j50k9k73j57L59J58m04J81M5l3J69L90m73Q9M24K9
1875D55n56L16N52n91j30L65m04l86M15J51n89M8L51j98j88N52O3m68K54O50o42
1896B0m11R28k17n48M41J85o81k9N47j54n29K22O67j011O7R10m47l03J047j63
1916E41r25K22P12q66j23J107m14j159Q09N42j224K73J270m60j082J198J02j094
1934e71N29J108q18r40J447k47j701R62J012j488K3J517p33j426J246R39j432
1951e73L93J838j476j272J745K74j935J008J452j690j010J686k78j679J469J524
$$ plain form
1807 67 10 571 492 142 494 584 1 57 105 85 -355 -571 -208 -795 -784 -76 -459 -271 16 54 20 413 475 520
1831 520 382 370 742 115 68 184 -42 -214 -82 -304 -607 -139 -258 -438 -350 -268 44 -133 110 328 194
1852 194 497 711 302 224 201 103 130 -20 -49 -322 -479 -120 38 -366 -185 -140 -173 -4 386 -87 2 426 455
1875 455 -101 215 767 176 46 411 7 -379 36 187 -402 -354 -3 -201 -389 163 226 -242 12 662 20
1896 20 -391 537 320 -228 213 398 -283 -312 235 81 -448 -226 441 -570 -503 407 -40 -343 704 541
1916 541 -384 -162 550 -316 -439 668 254 -905 -96 446 -778 -505 765 305 -777 421 523 -571
1934 -571 -42 1066 248 -692 755 508 -1193 -231 781 -707 -684 833 100 -1326 -80 859 -573
1951 -573 -180 1658 182 -1090 655 929 -1006 2 1454 -236 -1246 440 162 -1517 -48 1476
1967A476k218n05K090q67j377J933J015j881K83J667j882j329K403L11k242J155
1983C2J451k838o03K938p77k014K351P76k494l47K628p88j831L069L49k929N81
2000d46K105k475p22L268m15k878J431J285k643m20L395o64k394K448N63l480
2016b042O97L288j562j291K550k38l508J240K456k199o96L359r97l496J786J789
2032A136k665N27L427j649k912K345R59l111R41L828k403k102K927o11l401K249
2048e15L012k581r29L024j711l538L137K170l124N15L036k494k813L067J059k922
2064a607J580K914k951k361L230j71k836K620K534l591j038K964j483k430L381
2079G55J905l465J0K454k390k325L869J153l400J163K374l402j372L936J2k545
$$ plain form
1967 1476 -742 -1247 843 -24 -1401 532 1547 -334 -51 1616 -266 -1595 808 1119 -1123 32
1983 32 1483 -1355 -1958 980 203 -1811 540 1316 -1178 -1525 1103 315 -1516 1553 1902 -1027 -446
2000 -446 1659 -816 -1538 1730 1315 -1563 -132 1153 -1490 -1910 1485 821 -1573 875 1438 -2042
2016 -2042 -1345 1943 381 -910 1640 1402 -2106 -866 1590 -609 -1305 2054 1057 -2439 -653 1136
2032 1136 -1529 -1002 2425 776 -2136 209 1168 -1943 -1002 2826 423 -1679 1248 637 -2764 -515
2048 -515 2497 -84 -1013 2011 300 -3238 -101 2069 -1055 -540 2496 2 -2811 256 1315 -1607
2064 -1607 -27 2887 -64 -2425 805 634 -2202 418 2952 -639 -1677 1287 -196 -2626 755
2079 755 2660 -805 -795 1659 -731 -3056 813 1966 -1434 -271 2103 -1299 -2671 1265 1277 -1268
2095a268K040J752l861r15L806j191k217L564O55m019K30K812k031j513L846M51
2111B141l885R28K291l053k15M006o62k883J767J183l561M01L650j189k260K556
2127A215J72l892J049L176j951r32L050o92l483J402K127k100j7L098j110l020
2143a908J809J336k768P67L296j828k351K293k46k406J169K989k062j263K327
2158A154o05k853K179K146k546J7K373j664k487K270J375k190P97J896k018j825
2174a981K557l7j757J590J684k145j355K017r2j891J782J512k737J86J728j429
2190c68j500K306R76j972J92J693j847r53K206L26j832R69J189k084o30J958k23
2207D06j299J428N10j891k59J773o19j042J764K94j945L47J354j219m89J885j72
$$ plain form
2095 -1268 772 2524 -1337 -2252 1554 363 -1854 1710 2365 -1654 -1424 1388 -643 -2156 1690 2141
2111 2141 -1744 -816 1475 -1578 -1793 2213 1551 -1332 435 1618 -1943 -1542 2108 919 -1341 1215
2127 1215 1387 -2505 -1456 1720 -231 -1163 1887 1195 -2288 -886 1241 -859 -876 2222 1112 -1908
2143 -1908 -99 1237 -1531 -764 2532 704 -1647 646 400 -2006 -837 2152 90 -1173 1154
2158 1154 549 -2304 -125 2021 -525 -508 1865 201 -2286 -16 1359 -831 -34 1862 -156 -1981
2174 -1981 576 539 -1218 372 2056 -89 -1444 573 481 -1410 372 1884 -853 -667 1061 -368
2190 -368 -1868 438 1414 -558 -366 1327 -520 -1473 733 1059 -773 196 1385 -699 -1329 629 406
2207 406 -893 535 1045 -846 -1105 668 49 -993 771 1065 -880 -533 821 -398 -887 998 826
2224H26j492N67O01j059m35J942o12j049Q52M48j631N51J303p09l81Q94M1j205
2242e48K61J213q81m33J163n03j315J055M00r24J98P21j97q50L59P68j026M33
2260a06R77p67l65P51l2r67O40L27l11n84N66k1p97O16M35q57K11O30n98j98N66
2281A16K58n67R1L67q0n02L40L04n29M14J47m85P5L59k98k05M11Q1m67m0L14j66
2303f2k77M50J06l85L35J73m22m2J20J62k66O7M32n04KK64j23j91L41j35n19M03
2325g1J29N0p6j44K18j96J46J11l15q3L92l74L9K10p7n9K76m6M7j69j13L29l04
2348h0R8J18l76K29N9p8rj3p3O5j10K70r5j97K68L8k44J12J40J50j76n3k9p2L7
2373b1m9q9k76K11J80q9K87j88k42L05K8J60k57K02J56k56J39P3k52j77L75j63
$$ plain form
2224 826 -666 -99 502 -557 -992 950 338 -711 141 589 -1042 -491 812 103 -278 616 657 -548
2242 -548 -287 926 45 -388 775 272 -1043 12 412 -512 -314 407 210 -640 -281 487 -539 -106
2260 -106 871 104 -261 490 458 -509 131 458 147 -437 129 108 -689 -73 362 -495 -284 346 -252 -450 116
2281 116 374 -193 -102 265 185 -317 23 327 -202 212 359 -126 -51 308 10 -195 216 297 -170 -210 104 -62
2303 -62 -339 111 217 -168 167 340 -82 -124 -4 158 -108 -41 391 -113 -111 153 30 -161 180 45 -474 -71
2325 -71 58 108 32 -112 106 -90 56 167 -148 -231 161 -213 -174 36 -41 -100 176 130 177 8 -105 224 -80
2348 -80 18 136 -240 -11 48 -30 -39 -52 -125 -60 -170 100 5 -192 76 114 -130 -18 122 272 96 43 14 -58 -21
2373 -21 -70 -159 -435 -224 -44 -133 154 -34 -276 29 57 217 -40 162 318 62 201 274 22 -155 220 57
2395E7l21L37j45j55P7J8J03k92M84J23l40n2N63k16l28N83l01j58r5J84k46k11
2417c31K48K8l23L12L12n89N5M15Q0m15M36J53l47j46O22n6o71N20O4p29L68L28
2439C34n85k04O29l63l79M01M68n54M5R18o49o19R75J6n17K74M11m40p44O09J24
2460A50q23N79M12p71k14R47k97p35P33M60o45K24O68o62m18P41K87q97K13P55
2480G07r00o91J005q0n19N70L84r98l38J438l66j003J144O61j156L9R47r15l97
2499d68J180j07j229M78O93j032k86J307k02j195J129M02j272o4J729q71o02R09
2517D99K59j567M16J377j196o03J578j71j601Q76Q04j234J28J243n23j303J119
2534A01O74j604M92J398r00j003J431r9j417O07J116j074m37J246k70j284Q54
$$ plain form
2395 57 -264 73 -72 -227 -150 -132 -29 -321 163 286 -54 -106 457 241 -87 496 195 37 -58 126 -120 -331
2417 -331 -83 -55 -378 -66 246 -343 -288 127 207 -208 228 381 34 -112 510 454 -217 303 367 -362 6 334
2439 334 -251 -455 174 -189 -568 -167 301 -253 -208 710 61 -558 417 433 -84 190 601 161 -583 26 150
2460 150 -673 -94 318 -453 -667 280 -17 -752 -19 441 -204 20 688 26 -392 349 636 -261 -48 707
2480 707 -193 -884 121 41 -478 92 476 -522 -860 578 212 -791 353 1014 -142 -103 844 -71 -468
2499 -468 712 605 -624 -146 547 -485 -771 536 334 -861 268 670 -602 -666 1063 192 -410 499
2517 499 758 -809 -393 984 -212 -815 763 592 -1009 -133 671 -563 -435 808 285 -1018 101
2534 101 775 -829 -337 1061 161 -842 589 490 -927 -320 796 -278 -715 531 261 -1023 -169
2551a69J188j244l29J573r26j010J310M99j453M61J277j149r69J203M03j760Q18
2568b77J202j395n19J584l94j229J154Q07j277j74J502p98j232J718L59j876P12
2585a33J065j480n77J555M6j422P09J126j385m85J694m26j208J445M51j601L20
2602c06J150o93j005J565K82j801L82J307j463n17J820k64j494J064N83j417P8
2619g29J489k64j318J209O93j763K06J376j109l88J408k71j651N23J046j082k03
2636h28J430l46j255R34Q96j420J42J628p95j161J168J65j134M21J223j146n46
2653f24J142k66j139P40R02r59n19J478p49j006Q51Q91j160K17J035o42r24J107
2671C75J93j135L95J145j213l69J046j45q73N83P43r98j62R92o76p55J267K45
$$ plain form
2551 -169 1019 -225 -554 1019 93 -917 393 892 -561 -100 1177 28 -941 262 665 -1095 -277
2568 -277 925 -470 -989 595 201 -1028 126 933 -344 -518 984 186 -1046 672 1031 -845 -133
2585 -133 932 -548 -1125 430 476 -946 -237 889 -496 -981 713 287 -921 524 975 -626 -306
2602 -306 844 151 -854 711 993 -808 -426 881 -582 -1099 721 457 -1037 27 610 -807 -729
2619 -729 760 496 -822 387 1080 -683 -477 899 -210 -598 810 539 -1112 -589 457 -625 -828
2636 -828 602 256 -999 -65 831 -589 -447 1181 386 -775 393 558 -576 -155 1068 -78 -624
2653 -624 518 252 -887 -147 755 -204 -723 755 6 -1000 -149 742 -418 -201 834 192 -732 375
2671 375 568 -567 -172 973 -240 -609 437 292 -581 2 745 -253 -415 577 -99 -854 413 658
2689F58j038L43Q01j092m28J257J14j022K30R11j288j1R58l06o52P86J83q11K
2708d05O87l98n26J019J71j071N10O02p23k56R80k74o02J52N72q53J25R74l46
2727C38q46L93M27p77J39O72k61l65L55K36p08K50O04m88k68N76J3o42L41M64
2747D53o01n2R00p10m54L41L37o14L81K17k12l89N99j88m62N41J19j83j94K95
2767A24R6l78K44M38p15m2N01m27j29J94Q3j81O5L67l19l47N02j05j31K63K9l39
2789b07J13L92k7l21q2K13l6k15J45r3j74M04J06k66j5J37j56j4J91j71P5O5J26
2812A90j91k36L74j33j23J88j22R7m8J26j25j76J94k13R7O3M5j42J55J52j08j79
2834a15J89R0q7J24n3o8j97K46%k46N6J97k26J7q0J30%m7L12l12n4m4K71j38n
$$ plain form
2689 658 -380 -37 764 -328 -756 501 615 -407 -177 734 -554 -565 393 87 -565 221 404 -407 -405
2708 -405 282 -116 -642 377 548 -523 -13 589 -134 -390 590 316 -286 -134 438 -415 -290 684 338
2727 338 -508 -115 312 -465 -326 346 85 -280 75 311 -397 -147 457 -31 -299 277 290 -352 -11 453
2747 453 -148 -200 700 -10 -464 -123 214 -400 -19 198 -14 -403 196 8 -454 87 206 23 -171 124
2767 124 220 -158 86 524 -191 -233 268 -159 -288 -94 -11 -192 -127 240 -79 -426 76 -29 -160 103 132 -207
2789 -207 -94 298 271 -50 -132 81 45 -170 -25 -118 -292 112 218 -48 -63 74 -82 -96 95 -76 -1 64 190
2812 190 -1 -237 137 4 -119 69 -53 44 -4 122 -3 -179 15 -198 -101 -38 7 -135 20 172 64 -115
2834 -115 74 164 77 201 148 80 -117 129 129 -117 -61 136 -90 -73 -153 -23 -23 -70 242 -70 -124 -168 103 -35 -40
2859d0J74j53n9K36l4j87J30P1l16K70j22J07k14N2L7m1R8q1j65j00L49j06J35
2882D1n1p6L1J02o7K40o9j14Q0j20K1K86j80K0n7q0l8m7o1P4j32J44J02k02K52
2907I9j12r0J06J88k78R8K23k6m56J22K09j43k96N66l33k36K87J79n00M53J70
2928B30j67j44K31m2l35J31L05k52o1M06k65j77J55K27k25JL7J00l41L73j72p2
2950e7P9R4k82K3K59r9k29J68K48l71o2N05j72l57K78N0k49K19L30l20l89O00
2972B66M2m41Q1K93l51m11O70r5l46L76K2l57J57L72n6j49J45K26m74k4K97k76
2994c3l55P26n2p13L68J94m28l1M38K31p32N80M5o76L75O54n34l25P84j57p77
3015d18J44Q50q98j29O87k10n09L55M70o67n0Q93l82m31N83K18o78L58L67m23
$$ plain form
2859 -40 134 -19 -78 158 124 -63 67 138 -178 92 -30 77 -137 -85 -48 -89 9 -72 -237 -337 12 -94 41
2882 41 -10 -86 -55 47 -20 220 151 37 117 -3 18 304 124 144 87 7 -31 -78 -139 -65 -197 -53 49 -153 99
2907 99 -13 -103 3 191 -87 11 234 208 -248 -126 83 -60 -356 210 -123 -359 -72 107 -393 60 230
2928 230 63 -81 150 108 -227 -96 209 -43 -104 302 37 -140 15 242 17 18 55 155 -186 187 15 -57
2950 -57 22 116 -166 -143 116 17 -212 -44 204 -167 -229 276 104 -253 25 75 -174 45 375 55 -334 266
2972 266 308 -133 -52 241 -110 -521 149 54 -292 84 106 -251 -94 278 222 73 218 444 -30 -54 243 -33
2994 -33 -388 338 286 -427 -59 135 -293 -324 114 345 -387 193 238 -438 -63 591 57 -268 516 359 -418
3015 -418 -274 576 -322 -451 236 26 -483 -128 342 -325 -375 518 136 -295 288 506 -172 186 553 130
3035A30j66L71k43o05N26K66p78J70M52j99q79R03L54n82p9R32o88j46O49J62
3055E50p42L32M42m14n03P76l39p72O80K66p59r4Q28m74r7L82L88o75J68M20l49
3076A4k99J133j04j024L71L39o13l04P60k86m94K75M73q83l2J217l58o38O31K38
3096D16p51L58M57l27k42M52j49o53M90L56p77j56R37l53p15O16L70o54j8R90
3116F47n82l97N93J15o71J07J035r32k64O84m76m89N36J55l39R9N11k29n80P09
3136B32L67q83L65P43p60l89O15j73n06L77N25o73l52O33j53p23Q82J96n26J55
3156d8L67j29n56P22J38n72j09P02n56m82R37k34m68R8N85q43N0O16k34m66M53
3177b9N30o71J10P29o01m03Q69j67p52K49P08r05Q0N12j67m76K80K65m77n8P01
$$ plain form
3035 130 -36 335 92 -513 13 279 -499 -329 123 -76 -955 -52 302 -280 -359 573 -115 -261 388 550
3055 550 -192 140 582 168 -335 441 102 -670 10 276 -483 -577 251 -223 -320 62 450 -225 -57 363 14
3076 14 -285 848 744 -280 91 430 -183 -487 273 -13 -507 -232 241 -642 -674 543 185 -453 178 416
3096 416 -335 23 480 153 -89 363 214 -439 51 407 -370 -526 411 58 -657 -41 329 -325 -343 647
3116 647 65 -332 261 376 -295 -188 847 -85 -349 335 -141 -630 -94 61 -278 -179 332 103 -477 232
3136 232 599 -284 81 824 64 -325 290 117 -389 -12 513 -160 -512 121 -32 -755 127 323 -203 -48
3156 -48 319 190 -366 356 494 -78 -187 515 -41 -523 414 180 -288 -190 395 -448 -398 218 -16 -482 -29
3177 -29 501 -170 -60 669 68 -335 534 367 -385 -136 572 -333 -253 259 92 -384 -104 161 -316 -374 327
3198C27j53l66L37J87n52J32N51j67n40N44p2o43J48M06l25j24L84k09k99N49
3218A15J08k95J2L92j25m60O87L1n20L59K7o57N5N01q9m48j14L85j83J87L05l19
3240d6k35M90p2l31L36J68k83j45L68M9j89r0K41l31j64M57m09j84M50j87l52
3261d59N07J87l98j07K60L46m32L66l5l20m3M53j04l98J33P5K4j25J14m4j56j
3283a57O1nL2M50l40j52L70j69oO7m9m0J26q9j41PR8j57O8j44K28rrm4k4r1n8
3310a77K67j14m4J10M7j15oJ60j93Q4j18Q0J03j89K13R0n68N33J7j14J5L0j67
3333e6J72j61j3J87j27o0K4m0om4O0J42o4P2j33J49k68J08J55j90R0n1P2o0J85
3358A43k6k51P7j70J44n4K81K7j97M6l0Q8j21K35l3m76L60M5L6l3j54J5J43k62
$$ plain form
3198 327 174 -192 145 332 -220 -88 463 296 -244 300 228 -415 -267 139 -186 -310 74 -135 -434 115
3218 115 223 -72 -60 332 207 -253 434 465 -55 304 331 -326 -271 230 141 -307 -421 -36 -219 -32 273 -46
3240 -46 -281 209 137 -194 142 310 27 -118 250 299 110 20 261 -70 -234 223 -186 -370 80 -107 -459
3261 -459 48 235 -163 -270 -10 336 -96 270 235 -85 -128 325 221 -177 -44 31 55 -70 44 0 -156 -157
3283 -157 -96 -101 -69 381 41 -111 259 90 84 151 102 62 188 99 -42 -35 63 -94 -26 -170 58 49 40 -4 -28 -119 -177
3310 -177 90 -24 -68 42 89 -26 -32 128 -65 19 -99 -19 84 -105 108 198 -370 163 180 66 81 111 -56
3333 -56 116 -45 -58 129 2 -58 -34 -74 -80 -124 -64 78 14 86 -47 102 -166 -58 97 -93 -3 -54 18 -42 143
3358 143 117 -134 -57 -227 -83 -137 144 171 -26 20 -10 78 -43 192 159 -317 43 88 124 91 -63 -48 95 -167
3382a67j6Q2j22K60l3j62J02k4J10o6J21Qq5R8K67k24n1J12l15rJ41M8l64l1J72
3407a48m3K49Oj14n7K79N8k78J84R6J15m04J86j4j39j73K06p5j70J90q6l14M93
3430D7L5l02R9Q2o8J15J50O6k04q2L49J7m03OK95o39L87L7l51L99k2L1k42J95
3454cM5K7j26K11j35j48K51n0j90O4L92k08j52J7L77o80K75K22k16k41L98l64
3476b34J14K09k15l8J65L49k30k63J67l2L0L5N59m73l44N52j46l34J44K17l28
3497i6n1j5K51k44K38J32m03P9J62j79j27L50R9p18N41K05k86k44N35j14m12N51
3519B54j15n44J22N40m56j9M82Q4o19L09K01k86j11L09l9l24J28M15l64n7K65
3540A75k80k88N78K27o95J29N68l71k79L53J38m96K92J94k94k71P71l29l48R8
$$ plain form
3382 -167 -183 -101 -223 37 4 -158 -56 -80 30 -36 85 93 8 106 373 149 98 210 -105 -114 27 75 -289 -320 -148
3407 -148 -191 58 64 -50 -107 172 230 -48 136 232 347 -57 129 115 -24 -197 9 -66 -236 -46 -132 -446 47
3430 47 82 -220 -121 -39 -107 8 158 224 20 -62 287 304 -99 -93 202 -437 -50 -13 -364 35 13 44 -198 -3
3454 -3 42 69 -57 154 19 -129 122 72 -118 -54 338 130 -22 -5 372 -308 -33 189 -27 -268 130 -234
3476 -234 -120 89 -126 -164 1 350 120 -143 24 -8 22 57 616 143 -201 351 205 -129 15 232 -96
3497 -96 -147 -162 89 -155 83 215 -188 -109 53 -126 -253 97 196 -522 19 224 -62 -306 229 115 -297 254
3519 254 139 -405 -283 257 -199 -218 264 348 -271 38 239 -47 -158 151 112 -212 -84 331 -33 -90 175
3540 175 -105 -393 185 412 -283 -154 414 43 -236 117 255 -241 51 245 -49 -320 451 122 -226 -128
3560a28K31l22J5O28k29l82N68J00p70J73K35k3l36N52J87r44M03K88l45j80O57
3581C78l09o06N19L92n80M9O07l62m51N57J15p56M76M58o21j12K97J31n60L75
3601cM02q13l7P89l90l94Q35r2o45L06N53m01l78N09o8n62M59M78o93k89Q49l75
3623D0k91Q9N29n85p9P95m11m65N00L4l30J72M72n58k28N63j58l31R1M78o36j95
3645e04O48j56m03L64K20o51M86K73l62j13N19O0m56J26L54m40o5M85m42l36L37
3666e6K73o19J9N12k76K3J79K69n30J36M71l79k16N04J69n10K6J72l64l6N08o3
3688B12n80K10M93m84j02M64l43j37M43j03l36K34M91m22p4J83J57n20J64J87
3708A37l65O0J20M6k63L63Q4l59J76K65j40k81K26J75n15K26L47j48k67M32k22
$$ plain form
3560 -128 103 -219 -204 424 195 -187 381 481 -289 -116 119 96 -240 312 499 -445 -42 246 -99 -279 378
3581 378 69 -537 -18 374 -206 -157 450 88 -363 194 309 -447 29 487 -134 -246 51 182 -378 -3
3601 -3 399 -414 -451 338 -52 -446 389 297 -348 -42 511 110 -268 241 173 -389 70 548 -145 -434 415 40
3623 40 -251 -162 367 -218 -297 498 87 -378 122 156 -174 -2 470 -88 -316 247 89 -242 -151 327 -309 -504
3645 -504 144 -12 -415 -51 169 -482 4 277 -85 -198 321 381 -75 51 405 -35 -100 385 -57 -393 -56
3666 -56 217 -402 -383 129 -147 -124 55 324 -206 -70 401 22 -194 310 479 -31 -5 167 -197 -233 275 212
3688 212 -368 -158 335 -149 -251 213 -130 -267 176 73 -263 -29 462 40 -34 149 306 -214 -50 137
3708 137 -228 -168 -48 -2 -265 98 182 -177 -1 264 124 -157 69 244 -271 -45 302 154 -113 319 97
3729I7l17m1L10l15O7K51m5j55J43K79n76L13L20m81J86R4Jj50j55N29k99m5J87
3752A98l10rK15Kj01j54P7q9J84R2M4j91J35M8j44k5J53l5k36L06k34J74k42M06
3776B64k25n8o4J86l71K25L39k71k5J84l2j72k00L26j84j69K94K8k11P4J16l83
3798c29K38QJ65L8L9j90PJ21L8r0J0O4j77p1r7J74j96J23J77j82N8J50K2j65J4
3823e1N7K03j58j0P2j16j9O3n9O1KK12o40K63L97l35j00K03N5l85J75J52l0P8
3847I0r7M6%J17k89J92J0%j26L8L7k99L00j24L4J35l15J65lJ84K12j99j41K06
3871A73j32j17J40q9l8M4J17K6M9k43J12J06j78N0j20J56M5q5l2m2Q2R9j98j22
3895a97L59R6l62L72q0n0j12n0J4J12p1p4L9j39J25k5p2J74PJO5j36n8R8j04m5
$$ plain form
3729 97 -220 -261 49 -266 -199 52 7 -148 -5 274 -302 11 331 -150 36 130 131 -19 -174 355 56 11 198
3752 198 -112 -121 94 96 -5 -159 -82 -171 13 105 149 -42 93 141 -3 -28 125 90 -146 160 -74 100 -142 264
3776 264 39 -19 -83 103 -268 -43 296 25 0 184 152 -20 -220 106 -78 -247 47 75 -136 -62 54 -329
3798 -329 -91 -83 82 120 159 -31 -24 97 135 45 55 119 -58 -129 -226 -52 -248 -125 52 -130 -72 78 100 -65 -51
3823 -51 6 209 51 41 113 -3 -22 41 -18 43 45 257 -383 -120 277 -58 -158 45 100 -285 -110 42 12 90
3847 90 -7 39 39 156 -133 59 69 69 -57 -19 18 -281 19 -105 -71 64 -251 -86 -89 95 307 108 -33 173
3871 173 41 -76 64 -25 -63 -19 98 124 173 -70 42 148 -30 20 -100 56 101 16 -16 -58 24 123 -75 -197
3895 -197 162 258 -104 268 188 138 26 -24 -10 102 31 -43 -4 -143 -18 -43 -115 59 66 67 132 -4 -62 36 -68 -113
3921a13J09P3o8l60J83K00p0m0J77n1J4P7m2pl9q3K67k83q8J37l5J90J62m33j05
3946b28K22N5n8K5J47k59m4J87jr1J45J3j81J47J9j08k12J25J90k57J37P2j55
3969a10J58Q0k11k4Q6J22j84Ol4L11l46J25J35k35JQ4o2j56L49l7o9r0K01j63
3993f3p0L28j76NJ45r2j42L3N8j32k61M35J90m26N5K79k36k38N60k04j61R0J78
4016A55k75LM53k28j4L7p9k02k84N09k25j41M43j15j24J46j15J90k35J11rq7J11
4039B5J35l64K70K12J8n36J47K02m93K90J11m5j93K64j54j76K74J36k64J08J61
4060A28J48n21N58N2n31J84M22m38m54O96m1m72K24L79k43l96M15k4m55L71J28
4081A30j35p1K95j38k34M47j20k54J09J67k16l28M60k19k14K21K47j51k63M35
$$ plain form
3921 -113 -4 69 1 -359 -176 24 -46 -86 91 40 54 131 89 82 43 -40 227 -56 -144 -7 -42 148 310 -123 -228
3946 -228 -6 49 -9 16 163 -96 -140 47 46 -45 100 113 -68 79 98 -10 -222 -97 93 -164 -27 45 -110
3969 -110 48 128 -83 -107 -21 101 -83 -77 -111 200 -146 -21 114 -121 -120 -36 -98 -254 95 58 -11 -101 100 -63
3993 -63 -133 195 19 24 169 77 -65 -32 26 -106 -367 68 258 -168 -113 166 -70 -308 252 48 -113 -23 155
4016 155 -120 -117 336 108 94 131 52 -150 -434 75 -150 -291 152 37 -87 59 -56 134 -101 10 1 -86 25
4039 25 160 -204 66 278 296 -240 -93 109 -384 -94 17 -28 -221 43 -111 -287 -13 123 -141 -33 128
4060 128 276 -245 313 365 -166 18 440 2 -452 244 203 -269 -45 334 91 -305 110 86 -369 2 130
4081 130 -5 -76 219 81 -153 294 174 -80 29 196 -20 -348 112 -107 -321 -100 147 -4 -267 168
4101A68Ok13l3J61k00O6J36m1NJ82Pk80j0L79k33l09M79l23J27P2M5l31N8J23
4125D1K05n13M56k08R4j23K16j7k15K24j5k33p5M09m39j4K91k0k58K26N8k33J83
4148D0M1l33J00J40L7n1J32N3j11j94K57J15l65J72J96m09J87L02l13j33P9J36
4170G8n6R4P8j54j32L51k38l92M03J01j70q0L4q1r1K22L10k38k53N23j45k86R5
4193b7J6o2L5J02L3j83J14N2j77J43k6r6j56M16j98j8R9J19k03j26J73J0k86M96
4217B50r4n4j56K84l21K1k8J11r5O3J52j56j58M49j35l52L76Pk33J12J77l15j41
4240b36M3M23m10M03j57l02J2M34j34k67R9K25O2l69J94k1J18j44K52k60J17q6
4262dO1j83K96Nj70Q9r7j90l1K39K8p4J3k3J07j08J69k05J99O8K7j40k23J54J13
$$ plain form
4101 168 174 -39 -72 89 -111 -45 91 50 55 237 244 -36 -46 333 100 -209 270 -53 74 146 191 -140 -82 41
4125 41 246 -267 189 -19 75 -48 168 151 -64 160 145 -88 -163 246 -193 -207 84 64 -194 32 90 -143 40
4148 40 81 -252 -152 -12 25 -26 106 159 48 -146 111 226 -139 33 229 -180 7 309 -4 -137 -58 78
4170 78 22 116 194 40 -92 259 21 -371 32 133 -37 -117 -83 -164 -255 -33 277 39 -214 309 164 -122 -27
4193 -27 -11 -73 -38 64 97 -86 28 80 -97 46 20 -76 -232 184 -14 -32 67 186 -17 -143 30 40 -246 250
4217 250 156 102 -54 230 -91 -70 -98 13 -82 -19 133 -23 -181 268 133 -219 157 164 -69 43 220 -95 -236
4240 -236 -193 230 -180 223 66 -236 -224 210 76 -191 -92 133 195 -174 20 -1 117 -27 225 -35 82 -4
4262 -4 57 -126 170 175 5 94 -3 -193 -224 15 43 -31 -18 -41 66 -42 127 -78 121 189 216 76 -147 7 120
4287A20j85q2K28k68J69q0N8o8J6Q2K18k26mJ87r5j63L11k60p6J28n4L4P0l6p4
4312e0P5j93L15k25K15k73K19J08l62J94pJ45j34j83O0J64m6J1l4M4l4j53J59
4335A5r8N5J3K3Q8j38J18R6l09J55N9m2j06nJ30j28J53M3j56L03j76l2q4J22k07
4360a08j29L68k00L14l56K39j13R6m9k18J22j3N3n3L1LJ67k70K18j04j20J44Q
4383C0P6K2o6p6L9L9J46k39J6R2k56K74j39R0r2Ln8K53j04J07k37K17k57J4J32
4408B6r6K14j19R3k13J99q4J45o3j31J17j74Q3m8N5L4m2J54L1j35L6N8m12K77
4432Ek22L05j00j16J31OR1r8J60k15O0n5p7k5J87j71K72j04M4q9K54l71O4O3K40
4457B39Nm23J1j3K30k90L19k50rJ46K77j62l8J19l75K12q2R2k2j26N4Q3J25o2
$$ plain form
4287 120 -65 -147 81 -187 -18 -98 -40 -108 -92 -10 208 -18 -22 165 70 -93 218 -42 -118 10 -44 -10 60 24 -50
4312 -50 25 -168 147 -78 137 -136 83 191 -171 23 16 161 27 -156 -96 68 22 33 -1 43 9 -144 15
4335 15 -83 -28 -15 8 96 -42 76 172 -137 18 77 35 -71 -76 54 -74 79 122 -34 269 93 61 -23 99 -108
4360 -108 -237 131 -69 245 -111 128 15 111 62 -156 -34 -47 6 -47 -16 -13 154 -116 102 -2 -122 22 30
4383 30 106 128 62 -14 25 64 210 -29 -13 79 -177 97 -42 48 -44 -41 -99 154 50 157 -80 137 -120 -106 26
4408 26 -70 144 25 118 -95 104 20 165 102 -29 88 -86 -3 -51 4 38 -4 150 181 46 82 140 -272 5
4432 5 -217 88 -12 -128 3 9 100 2 162 -53 7 -48 -125 -150 37 -134 138 34 78 -11 243 -128 -64 -1 239
4457 239 244 -179 -168 -181 49 -241 78 -172 -181 -35 242 80 42 161 -214 -2 -84 8 -14 -140 -86 -3 122 60
4481F0j44J3J44k5k10M7J63k10J88J7O8Q0OJ6k03kJ21k29P5n1Nm8j22K86k74L10
4507H1j39J55r5o1K33j28o1j0k04K90J5j15J14k02J39r4K3J26J8j96R9P4p3nL7
4532B1r9L06j90J30q9n0J03J50m45L79jl90l6M00l26o7J37K8K22k92J41m12M06
4555B6R5J75m24L11o4j12J19p4j25K8J70p8l77K41J41j41N9Q5J97m40R4K61k18
4578e1j52J56K03j82k5L5j03K88j38K12k30j62J01o7K18J46j06k75J36J20j31
4599gK01j9j19m3K4M7k96J79O0R0o9J45l39O0J76M5p4j84Q7m3j86L09q4j18L26
4624A68k39O7M0J57k68P9j31K05j09N2J90l73o4J69J10n0l7M29m82L2K40J6k2
4647A79m4q4j79q9K45L1j46J79j1j39r6K83J21k15J05n2j50J4Q9p0N9L1j47m2
$$ plain form
4481 60 -84 -71 73 48 -162 -115 48 -162 26 43 111 191 197 213 10 8 129 -100 -25 -76 -71 -119 -241 45 -229 81
4507 81 -58 97 2 -59 174 46 -15 -25 -229 61 76 -39 75 -127 12 -82 -59 67 85 -111 -12 62 -11 -16 21
4532 21 -78 228 38 168 79 29 132 282 -163 216 215 -175 -211 189 -137 -204 -67 -39 183 -109 32 -380 26
4555 26 121 296 -128 183 119 7 126 52 -73 -45 125 47 -330 -89 52 -89 -30 55 252 -188 -94 167 -51
4578 -51 -203 -47 156 -26 -51 -16 -119 169 31 243 13 -149 -48 -115 103 249 143 -132 4 124 -7
4599 -7 194 175 56 13 37 84 -212 -33 27 117 48 193 -146 -86 90 135 61 -123 -36 -79 -265 44 -40 -158 168
4624 168 -71 -4 36 193 -75 4 -127 78 -31 21 211 -162 -226 -57 53 3 -34 395 -87 -55 185 201 179
4647 179 135 51 -128 -217 28 59 -87 92 81 -58 -154 129 250 35 140 88 -62 -48 41 -29 30 61 -86 -128
4671a28J0L15l46K67q6r9r9J51j1q6J19K6JJ04N1j9j69J5O9r2j02J78m4j11N4
4696c2n8L3L1M7k6K0J00q2l7K27k83J18j97J35j28J96p5K20l36N4J00m2j77J48
4720d4J8L7o8p3K06j53N7m1j0K00O1j75J16q8j99jK98j27n1n5j1M2j11J33J85
4745A46k42p4K56j09K9o6j6l2R2K65m50J62l3J04jJ49o7l96L82O0j98J10j86J14
4769aN2l42L02jr0J16j55J88L3k4j31n6M8q1k9J80Q9j75p1K15N5j66r5K1N5p8
4795a41M4M26l94P4K60k97lr9QJ67J41j86J27j71J26K0j80J08Jo3l4l1K81n4j16
4820A4M4n5k6J35j35j9j48K3O8K33j30p5K40k09n2m8J80P1k12N1P9K9j60M1Q4
4845B3j03J77j97J17Q0k2j07J61r4P9j65M6J34j73J68m1k14M0R4rn2m8o1Q5k9
$$ plain form
4671 -128 -118 197 -149 118 32 -67 -166 -15 -26 -112 7 33 34 138 189 170 1 16 85 -7 -109 69 25 -86 -32
4696 -32 -90 -57 -26 21 -5 15 115 33 -4 223 -60 58 -139 -4 -132 64 -11 209 -127 -73 27 -15 -192 -44
4720 -44 -26 11 -57 -130 76 -77 -20 -61 -71 129 190 15 131 43 -156 -157 141 14 -37 -92 -103 -61 -172 -39 146
4745 146 -96 -170 86 -23 6 -60 -76 -108 -16 249 -201 -39 -72 32 31 180 113 -283 99 159 -39 71 -115 -1
4769 -1 51 -291 11 10 -80 36 -119 69 102 78 -53 -109 -61 -142 -171 9 98 -77 -148 67 122 -44 -139 -118 -63 -141
4795 -141 -97 329 -65 9 269 -28 -31 -130 -122 45 186 0 127 -44 82 102 -78 30 31 -32 -66 -97 184 130 14
4820 14 58 3 -23 112 -23 -42 -190 -167 -99 134 4 -71 169 -40 -92 -140 40 111 -101 -50 29 58 -102 -61 23
4845 23 -80 97 -100 17 97 75 -32 129 35 114 -51 -5 129 -44 124 83 -131 -91 3 -6 -58 -106 -167 -82 -111
4870a11J78P1j52O5j14P0J79J9M7k60K4O4r7P4j00N5J07j68J42j8j72M8Q9Q9p8
4895E1l5R5k8k6O1N2N9k78Q5m8J43j67j71J11j20L31k03J07l8Rr5k2J04M0%j08
4921i1J25K18j88N6j68J05r1K35l36J00j36K77L1n9j5k88K91l3o0J64j9j38J76
4944A56p7l8J29k21J5K97j33kk00O3p1j16J16J6k7K06p3O3k01K23j8j07lk17J47
4969g3P5K72k63J06k72L80k62K9J21m8n8J34k48J24l5k5Q6j21J0m1J50j76l5L
4993a67N3Q1q0K09P9j31n9k3K37k59J64n3mq8R9k14O6PM9k71L98n5Pm9M7r0J27
5020H0j04j5r1O7K36k75J29O2O0k22L2l6Q2k36K41Q1j98N9J13l04K50P5j32m8
5044i4J14j07L9l2K68k58o7M53j66j61J1O0jo0o8J9%J13ko8p2K22J23l03K65j23
$$ plain form
4870 -111 67 138 -14 51 -63 7 186 205 252 -8 16 80 -17 57 -43 12 119 -49 93 75 -97 -49 40 129 51
4895 51 16 111 83 57 118 170 229 -49 36 -12 131 -36 -207 -96 -216 115 -88 19 -19 -10 -105 -127 -23 17 17 -91
4921 -91 34 252 64 120 -48 57 -34 201 -135 -35 -171 106 137 78 63 -225 66 33 -27 137 118 -20 156
4944 156 79 41 170 -51 -36 261 128 126 -74 -11 -82 -198 -82 -66 -93 113 40 103 -98 125 107 0 -3 -220 -73
4969 -73 2 274 11 117 -155 225 -37 -8 113 65 7 141 -107 17 -18 -43 43 -78 -68 -109 41 -135 -170 -167
4993 -167 -114 -33 -113 96 175 44 -15 -38 199 -60 104 51 47 -41 58 -156 -90 -83 -34 -305 93 38 45 -4 43 -47 80
5020 80 -24 -39 -130 -63 173 -102 27 89 149 -73 -41 -77 5 -231 10 91 -107 -48 65 -239 11 86 -46 -94
5044 -94 20 -87 -48 -80 188 -70 -137 316 150 -11 0 60 59 -1 -69 -50 -50 63 61 -7 -79 143 266 -37 228 105
5070A05r9n4J67q3j64j7M2j48J28J92k04J8O2J39k16O8J73l5j03L7r6J39Q6j06
5094C1k56K37rj06J40j15N7p7J62k2J27k41K32r7q9J26j32m0J32R9j06o0J68R1
5118B52l33J84j51J88k97L14l1l18J13J11j14O1K7J7n5l7J23J90j20j26Lj08K72
5141A65k8m3j82J26L4kq5j29J84k8j39j15K80J70k05k15K36J70k26j89L08q4K9
5164C2j28kM8O1Q7q8j30Q1J06q4K00j57R2j71J9J48o2j0J6k45J53J11m6j13K19
5189A37j6j73P3j42J14l8J83q3n6R8j35j68J89J08mj27O7N4j59J14J57r7j83K90
5213B03l19J28k8K65m19l3K64pn8Q2J3k65J06Q1J6n1q5j51L45k39O4J88j36J52
5237A16j36L3j2j28K24j44J33Nk52K53k42j58J85J87j31l5K46q6j61K2k0J07K5
$$ plain form
5070 105 6 -48 119 36 -128 -145 -103 -251 -123 69 -135 -117 -55 84 -132 -64 109 74 -29 8 -88 51 137 31
5094 31 -225 12 3 -103 37 -78 -21 -98 64 42 169 -72 160 63 -26 100 -32 -72 60 159 53 -7 161 252
5118 252 -81 103 -48 140 -157 157 126 -192 -79 32 -82 -21 6 23 -32 -69 54 244 124 -2 1 -107 165
5141 165 137 94 -88 38 72 70 -15 -144 40 12 -127 -242 38 208 3 -212 24 194 -32 -221 87 3 32
5164 32 -96 -98 -50 11 98 10 -120 -39 67 -17 183 26 118 -53 -34 114 52 42 58 -187 -34 77 31 -82 137
5189 137 121 -52 21 -121 -7 -45 138 55 -1 97 -38 -206 -17 91 87 -40 27 81 -78 36 193 96 -87 203
5213 203 -116 12 -16 249 -170 -203 61 54 -4 78 91 -174 -68 13 29 -22 -107 -258 87 -152 -88 100 -36 116
5237 116 -20 13 1 -127 97 -47 86 91 -161 92 -150 -308 -123 64 -67 -102 144 58 -103 -81 -101 6 31
5260C1m0j36K2K33jk20J68l6j32%L9r4K20k7m8J63k42Q6L0rk19L01pq9m2K3J07
5287H1r8lj35J34j22K76j97J31Mj58P3j6n9Q1N9j27n6J54Q9j3j53p2m3K04p5m7
5313h8O4o1K8O1j4R8j79n2N9K18k11k6J0M2O4r2M8n0K01p1n4o3J32P7k20J38J28
5340A87j25O5m5j3j2k17K51n6K59j37k11j10n8L19o4m0N9j12J10p8L3j15j15O0
5364a65L70k43J12m9k06n3J07N7J17P2j58J53m4%j89J99J08j39j36j0N7J49L2
5387A41j86k6J43n9J2L6Qj16j1n2J68k20M00j99Rr0L36j83j43J75l37K47j86J10
5411b3k6m5Q0J63j62k2p2j9l1M3J87k67m1R7J76N9n0j24R2j15J46KJ98k35j9J52
5437A44J04l05K88l45P2J4JR0q2J64r8p6P2k14J52O7J49k73K20l99K92j17J27
$$ plain form
5260 31 -9 -145 -123 110 109 -111 57 21 -111 -111 -72 -166 54 27 -21 142 -100 -14 16 7 -212 89 82 -7 -49 -26 81
5287 81 -17 -20 -155 -21 -143 133 -64 67 71 -87 -14 -30 -89 -8 51 -76 -132 22 111 98 -55 -127 -170 34 -41 -88
5313 -88 -24 -85 -57 4 -10 88 -91 -143 -84 134 -77 -103 -93 -51 13 -79 -31 -81 120 49 -5 -68 64 141 -79 59 187
5340 187 62 127 82 69 57 -160 91 35 294 157 -54 -164 -222 97 33 -7 52 -60 50 -28 5 -110 -225 -165
5364 -165 205 -38 74 25 -181 -234 -127 -70 47 119 -39 114 70 70 -119 80 188 49 -87 -97 -40 109 141
5387 141 -45 -71 72 13 25 61 69 -47 -58 -110 58 -162 238 39 48 -42 294 111 -32 143 -194 53 -133 -23
5411 -23 -49 -94 -14 149 -13 -35 -107 -126 -157 -114 73 -194 -235 -138 38 97 47 -77 15 -100 46 48 246 11 -8 144
5437 144 248 -57 231 -114 -42 -28 -27 63 -19 145 47 -29 43 -171 -19 48 197 -76 144 -255 37 -80 47
5460D7Om6O1j05J07j0j07r9L2J02J51j32mJ87l31L08O3k91j2k3k6J34j5j22l2
5485a57K4K72m5j82J13r6n2L5J31N1n1j4P1n2j75L39j59j83J30r1l0N3K1j36J75
5510hr5qL07j14l11K64j24J38r9o7M9Q1J58l9k64J41q8lK1j40K77p2j67K37n9
5535A5l2Q9j0J7Jjr0J15p3o9m8k2J25L0m6M6K7Pk0K2K5j78j03K21r3l7Q2j55J72
$$ plain form
5460 47 53 7 68 -37 70 60 -47 -146 -114 -12 139 7 3 190 -141 167 230 -61 -73 -96 -122 12 -3 -125 -157
5485 -157 -133 139 94 -88 25 -71 -123 -88 43 94 43 29 100 48 -127 212 53 -130 0 -91 -121 -68 -47 -183 -8
5510 -8 -103 -111 196 82 -229 35 -89 49 -50 -117 -68 13 171 132 -132 9 -79 -82 -61 -201 76 4 -163 74 15
5535 15 -17 72 62 79 80 79 -11 104 31 -38 -86 -108 17 47 1 47 74 81 61 83 108 -70 -173 48 -45 -82 0 -155 17
$$ [...]
8191A88
##END NTUPLES=NMR FID
##END=
