##TITLE=1H_DPP0306
 CDCl3
 8 sc, 
 4.6.2024
##JCAMPDX= 6.0         $$ Bruker NMR JCAMP-DX V2.0
##DATA TYPE= NMR FID
##DATA CLASS= NTUPLES
##ORIGIN= UXNMR, Bruker Analytische Messtechnik GmbH
##OWNER= root
$$ XWIN-NMR		Version 3.5
$$ Tue Jun  4 14:05:19 2024 Russian Standard Time (UT+4h)  she@DPX200
##.OBSERVE FREQUENCY= 200.1309
##.OBSERVE NUCLEUS= ^1H
##.DELAY= (6, 6)
##.ACQUISITION MODE= SIMULTANEOUS
##.ACQUISITION SCHEME= undefined
##.AVERAGES= 8
##.DIGITISER RES= 18
##SPECTROMETER/DATA SYSTEM= spect
##.PULSE SEQUENCE= zg30
##.SOLVENT NAME= CDCl3
##.SHIFT REFERENCE= (INTERNAL, CDCl3, 0, 15.7039)
##AUDIT TRAIL= $$ (NUMBER, WHEN, WHO, WHERE, WHAT)
$$ ##TITLE= Audit trail, XWIN-NMR		Version 3.5
$$ ##JCAMPDX= 5.01
$$ ##ORIGIN= Bruker BioSpin GmbH
$$ ##OWNER= she
$$ F:/spectra/data/she/nmr/H-F/1/audita.txt
$$ ##AUDIT TRAIL=  $$ (NUMBER, WHEN, WHO, WHERE, WHAT)
(   1,<2024-06-04 14:04:18.67 +0400>,<she>,<DPX200>,
      <created by zg, POWCHK disabled, PULCHK disabled
       configuration hash MD5:
       00 E9 B6 7A A2 85 ED C7 34 08 36 98 17 FE 4E 26
       data hash MD5: 16K
       88 F6 1B 80 AD F2 34 B1 28 A4 D3 22 00 7B B9 9E>)
$$ ##END=
$$ 
$$ hash MD5
$$ 5D 48 38 9C 9E 5B 0D 00 85 AE CB 71 50 DD 58 44
##$RELAX= 
##$RELAX= 
##$RELAX= 
##$RELAX= 
##$RELAX= 
##$RELAX= 
$$ Bruker specific parameters
$$ --------------------------
##$DU= <F:/spectra>
##$EXPNO= 1
##$NAME= <H-F>
##$PROCNO= 1
##$TYPE= <nmr>
##$USER= <she>
##$AMP= (0..31)
100 100 100 100 100 100 100 100 100 100 100 100 100 100 100 100 100 100 
100 100 100 100 100 100 100 100 100 100 100 100 100 100 
##$AQSEQ= 0
##$AQ_mod= 1
##$AUNM= <au_zg>
##$AUTOPOS= <>
##$BF1= 200.13
##$BF2= 200.13
##$BF3= 200.13
##$BF4= 200.13
##$BF5= 200.13
##$BF6= 200.13
##$BF7= 200.13
##$BF8= 200.13
##$BYTORDA= 1
##$CFDGTYP= 0
##$CFRGTYP= 5
##$CHEMSTR= <none>
##$CNST= (0..31)
1 1 145 1 1 1 1 1 1 1 1 1 1 1 1 1 1 1 1 1 1 1 1 1 1 1 1 1 1 1 1 1 
##$CPDPRG= <>
##$CPDPRG1= <>
##$CPDPRG2= <>
##$CPDPRG3= <>
##$CPDPRG4= <mlev>
##$CPDPRG5= <mlev>
##$CPDPRG6= <mlev>
##$CPDPRG7= <mlev>
##$CPDPRG8= <mlev>
##$CPDPRGB= <>
##$CPDPRGT= <>
##$D= (0..31)
0 1.2 0 0 0 0 0 0 0 0.06 0 0.03 0 0 0 0 0.0002 0 0 0 0 0 0 0 0 0 0 0 0 
0 0 0 
##$DATE= 1717495458
##$DBL= (0..7)
120 120 120 120 120 120 120 120 
##$DBP= (0..7)
150 150 150 150 150 150 150 150 
##$DBP07= 0
##$DBPNAM0= <>
##$DBPNAM1= <>
##$DBPNAM2= <>
##$DBPNAM3= <>
##$DBPNAM4= <>
##$DBPNAM5= <>
##$DBPNAM6= <>
##$DBPNAM7= <>
##$DBPOAL= (0..7)
0.5 0.5 0.5 0.5 0.5 0.5 0.5 0.5 
##$DBPOFFS= (0..7)
0 0 0 0 0 0 0 0 
##$DE= 6
##$DECBNUC= <off>
##$DECIM= 32
##$DECNUC= <off>
##$DECSTAT= 4
##$DIGMOD= 1
##$DIGTYP= 9
##$DL= (0..7)
0 120 120 120 120 120 120 120 
##$DP= (0..7)
150 150 150 150 150 150 150 150 
##$DP07= 0
##$DPNAME0= <>
##$DPNAME1= <>
##$DPNAME2= <>
##$DPNAME3= <>
##$DPNAME4= <>
##$DPNAME5= <>
##$DPNAME6= <>
##$DPNAME7= <>
##$DPOAL= (0..7)
0.5 0.5 0.5 0.5 0.5 0.5 0.5 0.5 
##$DPOFFS= (0..7)
0 0 0 0 0 0 0 0 
##$DQDMODE= 0
##$DR= 18
##$DS= 0
##$DSLIST= <SSSSSSSSSSSSSSS>
$$ [...]
##$SUBNAM2= <"">
##$SUBNAM3= <"">
##$SUBNAM4= <"">
##$SUBNAM5= <"">
##$SUBNAM6= <"">
##$SUBNAM7= <"">
##$SUBNAM8= <"">
##$SUBNAM9= <"">
##$SW= 18.0517689322627
##$SWIBOX= (0..15)
0 0 2 0 0 0 0 0 0 0 0 0 0 0 0 0 
##$SW_h= 3612.71676300578
##$TD= 16384
##$TD0= 1
##$TE= 0
##$TE2= 300
##$TE3= 300
##$TEG= 300
##$TL= (0..7)
0 120 120 120 120 120 120 120 
##$TP= (0..7)
150 150 150 150 150 150 150 150 
##$TP07= 0
##$TPNAME0= <>
##$TPNAME1= <>
##$TPNAME2= <>
##$TPNAME3= <>
##$TPNAME4= <>
##$TPNAME5= <>
##$TPNAME6= <>
##$TPNAME7= <>
##$TPOAL= (0..7)
0.5 0.5 0.5 0.5 0.5 0.5 0.5 0.5 
##$TPOFFS= (0..7)
0 0 0 0 0 0 0 0 
##$TUNHIN= 0
##$TUNHOUT= 0
##$TUNXOUT= 0
##$USERA1= <user>
##$USERA2= <user>
##$USERA3= <user>
##$USERA4= <user>
##$USERA5= <user>
##$V9= 5
##$VALIST= <valist>
##$VCLIST= <CCCCCCCCCCCCCCC>
##$VD= 0
##$VDLIST= <DDDDDDDDDDDDDDD>
##$VPLIST= <PPPPPPPPPPPPPPP>
##$VTLIST= <TTTTTTTTTTTTTTT>
##$WBST= 1024
##$WBSW= 4
##$XGAIN= (0..3)
0 0 0 0 
##$XL= 0
##$YL= 0
##$YMAX_a= 146252
##$YMIN_a= -226994
##$ZGOPTNS= <>
##$ZL1= 120
##$ZL2= 120
##$ZL3= 120
##$ZL4= 120
##$ABSF1= 10
##$ABSF2= 0
##$ABSG= 5
##$ABSL= 3
##$ALPHA= 0
##$AQORDER= 0
##$ASSFAC= 0
##$ASSFACI= 0
##$ASSFACX= 0
##$ASSWID= 0
##$AUNMP= <proc_1d>
##$AZFE= 0.1
##$AZFW= 0.1
##$BCFW= 1
##$BC_mod= 2
##$BYTORDP= 1
##$COROFFS= 0
##$CY= 11.3945322036743
##$DATMOD= 1
##$DC= 2
##$DFILT= <>
##$DTYPP= 0
##$F1P= 15.6554695791079
##$F2P= 12.8336369535428
##$FCOR= 0.5
##$FTSIZE= 0
##$FT_mod= 4
##$GAMMA= 1
##$GB= 0.15
##$INTBC= 1
##$INTSCL= 1
##$ISEN= 128
##$LB= 0.24
##$LEV0= 0
##$LPBIN= 0
##$MAXI= 10000
##$MC2= 0
##$MEAN= 0
##$ME_mod= 0
##$MI= 1.114404
##$NCOEF= 0
##$NC_proc= 0
##$NLEV= 6
##$NOISF1= 3.799351
##$NOISF2= 2.8
##$NSP= 1
##$NTH_PI= 0
##$NZP= 0
##$OFFSET= 15.70392
##$PC= 1
##$PHC0= -25307.75
##$PHC1= 0.7874804
##$PH_mod= 1
##$PKNL= yes
##$PPARMOD= 0
##$PSCAL= 0
##$PSIGN= 0
##$REVERSE= no
##$SF= 200.130013532006
##$SI= 16384
##$SIGF1= 3
##$SIGF2= 2
##$SINO= 400
##$SIOLD= 16384
##$SREGLST= <1H.CDCl3>
##$SSB= 0
##$STSI= 0
##$STSR= 0
##$SW_p= 3612.71676300578
##$SYMM= 0
##$S_DEV= 0
##$TDeff= 0
##$TDoff= 0
##$TI= <>
##$TILT= no
##$TM1= 0
##$TM2= 0
##$TOPLEV= 0
##$USERP1= <user>
##$USERP2= <user>
##$USERP3= <user>
##$USERP4= <user>
##$USERP5= <user>
##$WDW= 1
##$XDIM= 8192
##$YMAX_p= 0
##$YMIN_p= 0
$$ End of Bruker specific parameters
$$ ---------------------------------
##NTUPLES= NMR FID
##VAR_NAME=  TIME,          FID/REAL,        FID/IMAG
##SYMBOL=    X,             R,               I
##VAR_TYPE=  INDEPENDENT,   DEPENDENT,       DEPENDENT
##VAR_FORM=  AFFN,          ASDF,            ASDF
##VAR_DIM=   8192,          8192,            8192
##UNITS=     SECONDS,       ARBITRARY UNITS, ARBITRARY UNITS
##FACTOR=    0.0002768,     1,               1
##FIRST=     0,             0,               0
##LAST=      2.2672688,     0,               0
##MIN=       0,             -226994,         0
##MAX=       2.2672688,     146252,          0
$$ Real data points
##PAGE= N=1
##DATA TABLE= (X++(R..R)), XYDATA
$$ plain form
0 0 0 0 0 0 0 0 0 0 0 0 0 0 0 0 0 0 0 0 0 -8 8 -8 8 -8 8 -14 16 -16 17 -23 24 -29 32 -37 40 -47 53 -57 64 -72
40 -72 80 -88 99 -110 123 -134 149 -164 181 -198 218 -241 265 -294 324 -358 397 -444 496 -560 632
61 632 -726 842 -994 1200 -1505 1990 -2900 5174 -23268 -21212 40731 72204 107217 126104
75 126104 139745 146252 144931 139713 130935 111974 99648 79985 65889 54486 39476 29896 16244
88 16244 -2375 -16574 -36896 -48917 -57377 -62610 -57076 -53823 -44974 -31812 -22660 -6819 3385
101 3385 11369 16263 9871 2696 -10896 -28239 -37652 -50010 -53801 -53653 -54600 -46339 -41340 -32816 -19583
116 -19583 -11203 989 8228 11761 16399 14466 17854 22284 25397 34664 37725 40937 42541 36501 33786
131 33786 25167 15258 8060 -5416 -14961 -24009 -32188 -30667 -29135 -19993 -7877 -241 11907 16925
$$ packed form
0@%%%%%%%%%%%%%%%%%%%qJ6j6J6j6J6k2L0l2L3m0M7n3O1o9P7q7J00j10J21j36
40g2J52j68J87k09K33k57K83l13L45l79M16m59N06n59O18o82P55q41R40j056J192
61F32j358J568j836K194k705L495m890Q074k8442K056O1943L1473L5013J8887
75A26104J3641O507j321n218q778j8961j2326j9663j4096j1403j5010r580j3652
88A6244j8619j4199k0322j2021q460n233N534L253Q849J3162R152J5841J0204
101C385P984M894o392p175j3592j7343r413j2358l791J48r47Q261M999Q524J3233
116a9583Q380J2192P239L533M638j933L388M430L113R267L061L212J604o040k715
131C3786q619r909p198j3476r545r048q179J521J532R142J2116P636J2148N018
$$ plain form
145 16925 20530 24579 21799 22038 18285 11307 7488 -1252 -5798 -8546 -11717 -8643 -11018 -12634 -13686
160 -13686 -20957 -23825 -27644 -30092 -27247 -27082 -21637 -16349 -11527 -789 6638 16620 26433 29935 33536
175 33536 30553 25211 21655 13961 10833 7611 4143 4959 1640 1920 3485 2795 6978 6801 5579 3986
191 3986 -1982 -4619 -8394 -10534 -7365 -7451 -3414 -687 -764 3179 2604 4103 5704 2907 2336 -2017 -6505
208 -6505 -7650 -10707 -7196 -4363 -1832 3853 4242 5649 6900 4078 5277 2606 -116 -1290 -6959
223 -6959 -8381 -9907 -9813 -5146 -2850 2234 5869 5660 7879 6416 5857 6772 4791 5838 4006 1807
239 1807 2652 795 2901 5134 4898 7088 3951 831 -2583 -8118 -9554 -12385 -13906 -12687 -14305 -12225
255 -12225 -10403 -8767 -3214 -650 2767 5208 3405 3355 69 -1811 -1401 -3216 -1361 -818 -1912 250
$$ packed form
145A6925L605M049k780K39l753o978l819q740m546k748l171L074k375j616j052
160a3686p271k868l819k448K845J65N445N288M822J0738P427R982R813L502L601
175C3536k983n342l556p694l128l222l468Q16l319K80J565o90M183j77j222j593
191C986n968k637l775k140L169q6M037K727p7L943n75J499J601k797n71m353m488
208f505j145l057L511K833K531N685L89J407J251k822J199k671k722j174n669
223f959j422j526R4M667K296N084L635k09K219j463n59R15j981J047j832k199
239A807Q45j857K106K233k36K190l137l120l414n535j436k831j521J219j618K080
255a2225J822J636N553K564L417K441j803n0l286j880M10j815J855N43j094K162
$$ plain form
271 250 -1275 258 2277 1389 3231 1307 -646 -2264 -5329 -4083 -3745 -2010 1974 2326 4982 5239
287 5239 4929 6865 5343 5222 4898 847 -610 -4172 -6083 -5633 -6371 -3099 -1713 -1435 337 -1653 -1627
304 -1627 -1485 -2528 -1198 -2747 -3748 -3542 -5727 -3651 -2621 -299 3504 3649 4881 4658 2055 2368
320 2368 738 306 785 -1237 -617 -2078 -2702 129 -115 2365 4136 3606 4215 1617 569 428 -1146
337 -1146 929 1042 1765 3006 2394 4650 5470 5654 8817 7275 6817 4941 956 152 -2609 -2980 -2474
354 -2474 -3909 -2400 -3535 -3906 -2420 -2872 -687 646 -115 974 -607 -633 85 38 3125 3908 4815 6442
372 6442 4159 4483 3307 1275 1243 -1166 -2656 -4647 -8247 -7954 -9208 -8410 -5179 -4200 -920 209 88
389 88 2624 2713 4294 5818 5379 6824 5067 4706 4738 2752 4332 3741 2859 2695 -748 -2177 -4409 -6452
$$ packed form
271B50j525J533K019q88J842j924j953j618l065J246L38J735L984L52K656K57
287E239l10J936j522j21l24m051j457l562j911M50p38L272J386K78J772j990K6
304a627J42j043J330j549j001K06k185K076J030K322L803J45J232k23k603L13
320B368j630m32M79k022O20j461o24K831k44K480J771n30O09k598j048j41j574
337a146K075J13P23J241o12K256Q20J84L163j542m58j876l985q04k761l71N06
354b474j435J509j135l71J486m52K185J333p61J089j581k6P18m7L087P83R07J627
372F442k283L24j176k032l2k409j490j991l600K93j254P98L231R79L280J129j21
389H8K536Q9J581J524m39J445j757l61L2j986J580n91q82j64l443j429k232k043
$$ plain form
407 -6452 -6126 -7429 -6787 -6223 -6811 -4709 -4409 -2567 991 1725 3718 3799 2609 2595 570 362 561 -364
425 -364 256 -1216 -1972 -1815 -2966 -1503 -879 -906 -51 -1384 -1506 -2021 -3093 -1022 -698 1115 2166 1100
443 1100 1999 827 452 1389 -479 -449 -1804 -4087 -4414 -6444 -5868 -4999 -4536 -1880 -1305 -594 765 563
461 563 2481 3311 3975 5466 4146 4090 3053 1594 2512 1843 2190 2970 597 -161 -2323 -3519 -3291 -4759
479 -4759 -4171 -3720 -4324 -3527 -3919 -2677 -201 908 3605 4411 4434 4858 3611 4072 4007 3664 5019 3742
497 3742 3778 3077 1453 2794 2242 2551 3499 1687 1662 -95 -1977 -1174 -2358 -1501 -1276 -2310 -1851 -3243
515 -3243 -3285 -2956 -3299 -2071 -2164 -2904 -2448 -4093 -3566 -2772 -2152 382 614 1942 2965 2161 4021 4143 4628
534 4628 5621 4851 5122 3824 2531 2711 2013 2794 3372 2771 3475 1467 877 1353 127 1275 431 -364
$$ packed form
407f452L26j303O42N64n88K102L00J842L558P34J993Q1j190j4k025k08J99r25
425c64O20j472p56J57j151J463O24k7Q55j333j22n15j072K071L24J813J051j066
443A100Q99j172l75R37j868L0j355k283l27k030N76Q69M63K656N75P11J359k02
461E63J918Q30O64J491j320n6j037j459R18o69L47P80k373p58k162j196K28j468
479d759N88M51o04P97l92J242K476J109K697Q06K3M24j247M61o5l43J355j277
497C742L6p01j624J341n52L09R48j812k5j757j882Q03j184Q57K25j034M59j392
515c243m2L29l43J228r3p40M56j645N27P94O20K534K32J328J023q04J860J22M85
534D628R93p70K71j298j293J80o98P81N78o01P04k008n90M76j226J148q44p95
$$ plain form
552 -364 -58 -1726 -1602 -2261 -2285 -981 -1969 -1891 -2310 -4225 -3999 -5136 -5458 -4188 -5188 -4055 -4311 -4536 -3229
571 -3229 -2932 -695 1187 1482 3232 2517 2539 2836 1942 2843 2666 2477 2538 728 519 -351 -988 -203 -916
590 -916 -829 -807 -2784 -2360 -2655 -2656 -1240 -1070 245 380 -319 923 -76 393 1058 600 784 -810 -1697 -1751
610 -1751 -3194 -2022 -1855 -1659 -195 -961 -137 10 -141 1572 1859 2748 3255 1951 2066 1169 938 1950
628 1950 901 1141 302 -1291 -1751 -3290 -3723 -3439 -4508 -3407 -3951 -4325 -3705 -3792 -2049 -1092 147 2217
646 2217 2181 2544 2996 2283 4102 3573 4041 4406 2857 2988 1983 1032 1634 931 1391 1231 208 934 -679
665 -679 -249 583 839 2233 2029 1989 2943 1502 2584 2922 2483 3119 1491 947 -145 -2097 -2047 -2719 -2896
684 -2896 -2634 -3431 -3199 -3748 -4013 -2781 -2719 -1329 -650 -581 600 -78 609 1893 1984 3518 3386 3180 3006
$$ packed form
552c64L06j668J24o59k4J304r88P8m19j915K26j137l22J270j000J133k56k25J307
571c229K97K237J882K95J750p15K2K97q94R01j77j89O1j810k09q70o37P85p13
590i16Q7K2j977M24k95jJ416J70J315J35o99J242r99M69O65m58J84j594q87n4
610a751j443J172J67J96J464p66Q24J47j51J713K87Q89N07j304J15q97k31J012
628A950j049K40q39j593m60j539m33K84j069J101n44l74O20q7J743R57J239K070
646B217l6L63M52p13J819n29M68L65j549J31j005r51O02p03M60j60j023P26j613
665f79M30Q32K56J394k04m0R54j441J082L38m39O36j628n44j092j952N0o72j77
684b896K62p97K32n49k65J232O2J390O79O9J181o78O87J284R1J534j32k06j74
$$ plain form
703 3006 1785 2297 1678 834 1586 583 328 -541 -1383 -1073 -1329 -919 119 -509 -167 -512 -917 -412 -575
722 -575 -11 589 17 267 -500 -709 -130 -686 290 124 -32 53 -1347 -1020 -1050 -1404 -170 -702 -126 2
742 2 -1282 -411 -733 -162 1074 323 1053 -36 -981 -282 -1190 -672 -273 -887 -284 -1376 -1588 -1090 -2124
761 -2124 -962 -680 -940 -857 -1806 -1299 -1628 -1929 -951 -781 -484 -213 -635 -212 -661 -147 735 304 1018 770
781 770 -7 484 122 654 1130 902 1473 818 552 809 228 782 735 474 1312 257 128 179 -441 599
801 599 321 586 946 192 181 -595 -523 151 -408 693 539 -250 -216 -619 -321 326 135 933 238 -256 74
822 74 -1025 -184 -230 -249 678 -197 -199 -401 -652 16 117 729 1138 219 504 -15 125 867 739 1374 1834 1230
844 1230 1362 754 785 1332 992 1818 1168 407 301 -810 -481 -268 -585 285 -423 -236 -264 -813 -72 -214
$$ packed form
703C006j221N12o19q44P52j003k55q69q42L10k56M10J038o28L42l45m05N05j63
722e75N64O00n72K50p67k09N79n56R76j66j56Q5j400L27l0l54J234n32N76J28
742Bj284Q71l22N71J236p51P30j089r45O99r08N18L99o14O03j092k12M98j034
761b124J162K82k60Q3r49N07l29l01R78J70K97K71m22M23m49N14Q82m31P14k48
781G70p77M91l62N32M76k28N71o55k66K57n81N54m7k61Q38j055j29N1o20J040
801E99k78K65L60p54j1p76P2O74n59J101j54p89L4m03K98O47j91P98o95m94L30
822G4j099Q41m6j9R27q75kk02k51O68J01O12M09r19K85n19J40P42j28O35M60o04
844A230J32o08L1N47l40Q26o50p61j06j111L29K13l17Q70p08J87k8n49P41j42
$$ plain form
864 -214 444 939 513 826 396 86 956 818 1223 1056 182 788 -524 -798 -561 -981 -730 -839 -1414 -1229
884 -1229 -2045 -1359 -1212 -1663 -132 -587 243 -158 -1069 -225 -297 -283 194 -388 -168 -1098 -1636 -947 -1757 -1277
904 -1277 -935 -1692 -1447 -1836 -1618 -1190 -1245 -132 432 489 1381 855 1610 2065 1873 3123 2688 2295 2277 1195
924 1195 850 226 110 290 -641 -601 -944 -1928 -1509 -2013 -1506 -877 -1192 -204 -806 -1237 -246 -645 182 258 117
945 117 463 -303 -646 -657 -1341 -723 -1273 -1351 -1190 -2440 -1886 -1933 -1728 -624 -813 16 183 14 997 936 1834
966 1834 2921 3142 3420 3014 2964 3227 2171 2845 2723 1993 2274 980 681 112 -672 -142 -469 -616 -479
985 -479 -1288 -1154 -1519 -1442 -736 -1264 -389 -279 -1021 -283 -1280 -693 -391 -481 72 -405 -467 -381 -791 82 360 477
1007 477 1166 333 839 860 488 1419 1198 1673 1837 1443 1540 768 442 926 603 687 453 -14 -216 -918 -1147
$$ packed form
864b14O58M95m26L13m30l10Q70j38M05j67q74O06j312k74K37m20K51j09n75J85
884a229q16O86J47m51J531m55Q30m01r11Q44p2J4M77n82K20r30n38O89q10M80
904a277L42p57K45l89K18M28n5J113N64N7Q92n26P55M55j92J250m35l93j8j082
924A195l45o24j16J80r31M0l43r84M19n04N07O29l15R88o02m31R91l99Q27P6j41
945A17L46p66l43j1o84O18n50p8J61j250N54m7K05J104j89Q29J67j69R83o1Q98
966A834J087K21K78m06n0K63j056O74j22p30K81j294k99n69p84N30l27j47J37
985d79q09J34l65P7P06n28Q75J10p42P38r97N87L02r0N53m77o2Q6m10Q73K78J17
1007D77O89q33N06K1l72R31k21M75J64l94R7p72l26M84l23Q4k34m67k02p02k29
$$ plain form
1028 -1147 -745 -947 -651 -941 -1022 -876 -1570 -1090 -978 -700 -217 -441 -238 -453 -719 -341 -170 -26 434 -334
1048 -334 200 -508 -474 -86 -623 171 29 -471 -144 -301 -557 174 -190 665 455 324 733 -356 358 377
1068 377 525 1232 674 527 956 -142 200 -78 2 515 -188 103 -681 -1062 -747 -1603 -1006 -1038 -2006 -1646
1088 -1646 -2156 -2211 -1576 -2121 -1321 -1206 -1253 -745 -1368 -839 -488 -188 732 510 833 1425 733 1175 1404 1779
1108 1779 2178 2147 2258 1822 1141 1512 974 1121 1650 1034 1440 247 31 504 -276 267 -68 57 -44 -1004
1128 -1004 -576 -1009 -1229 -453 -691 -633 -1 -1122 -1056 -868 -814 -171 -318 -85 133 -227 -13 -301 101 479
1148 479 109 582 233 -52 -21 -519 375 559 414 603 -65 345 506 564 951 1031 976 1488 555 1265 1142
1169 1142 885 1510 954 1313 918 545 445 -201 224 142 -301 289 -604 -930 -925 -1317 -609 -655 -290 -546 -626
$$ packed form
1028a147M02k02K96k90q1J46o94M80J12K78M83k24K03k15k66L78J71J44M60p68
1048c34N34p08L4L88n37P94j42n00L27j57k56P31l64Q55k10j31M09j089P14J9
1068C77J48P07n58j47M29j098L42k78Q0N13p03K91p84l81L15q56N97l2r68L60
1088a646n10n5O35n45Q00J15m7N08o23N29L51L00R20k22L23N92o92M42K29L75
1108A779L99l1J11m36o81L71n38J47N29o16M06j193k16M73p80N43l35J25j01r60
1128a004M28m33k20P76k38N8O32j121O6J88N4O43j47K33K18l60K14k88M02L78
1148D79l70M73l49k85L1m98Q94J84j45J89o68M10J61N8L87Q0n5N12r33P10j23
1169A142k57O25n56L59l95l73j00o46M25q2m43N90q93l26Nl92P08m6L65k56q0
$$ plain form
1190 -626 -528 -745 -830 14 -345 -90 344 -544 19 -659 -499 -204 -408 82 -11 -514 -234 -753 -507 -431 -281
1211 -281 90 105 -439 87 -557 -278 -93 300 505 -128 270 -173 -320 -113 -440 -328 229 -531 -174 -504
1231 -504 -600 -61 -312 -54 62 -243 295 83 -158 480 -38 636 395 133 639 -207 69 69 77 499 -137 -333
1253 -333 -275 -467 -85 -509 -464 320 -551 -299 -551 -692 -236 -706 -236 -43 -129 -161 -679 -482 -269 -417 209
1274 209 178 -214 98 -624 -346 -151 -236 630 240 313 674 13 650 935 807 1205 712 1154 921 490 731
1295 731 477 695 942 213 567 -127 -353 -244 -286 172 147 -229 -88 -739 -206 -185 -471 288 276 162 68 -179
1317 -179 183 -245 -45 489 63 368 266 -376 448 167 598 435 358 905 280 382 502 245 290 913 576
1338 576 653 17 61 -251 -509 -75 -407 -630 -281 -1050 -742 -955 -1171 -632 -1126 -544 -387 -782 -247 -157 -348
$$ packed form
1190f26R8k17q5Q44l59K55M34q88N63o78J60K95k04M90r3n03K80n19K46P6J50
1211b81L71J5n44N26o44K79J85L93K05o33L98m43j47K07l27J12N57p60L57l30
1231e04r6N39k51K58J16l05N38k12k41O38n18O74k41k62N06q46K76%QM22o36j96
1253c33N8j92L82m24M5P84q71K52k52j41M56m70M70J93q6l2n18J97K13j48O26
1274B09l1l92L12p22K78J95q5Q66l90P3L61o61O37K85j28L98m93M42k33m31K41
1295G31k54K18K47p29L54o94k26J09m2M58k5l76J41o51N33K1k86P59j2j14r4k47
1317a79L62m28K00N34m26L05j02o42Q24k81M31j63p7N47o25J02J20k57M5O23l37
1338E76P7o36M4l12k58M34l32k23L49p69L08k13k16N39m94N82J57l95N35R0j91
$$ plain form
1359 -348 237 143 642 373 258 479 162 739 981 816 568 372 386 2 -477 -138 289 -166 311 -396 -306
1380 -306 -728 -617 17 -384 122 178 -239 145 -164 -119 62 -138 265 -186 -399 -441 -828 -857 -705 -963 -102
1401 -102 -981 -761 -967 -1233 -652 -336 -528 63 -402 -340 -422 -62 5 35 500 559 -230 409 -200 -169 501 125
1423 125 254 565 13 436 455 305 728 762 1414 1214 1199 1222 864 1138 919 1095 1242 460 101 -157 -350
1444 -350 -283 -1192 -647 -856 -906 -1152 -1346 -1261 -728 -1173 -248 -239 -242 154 49 185 809 533 1074 708 914 537
1466 537 104 185 179 15 163 -50 -149 -182 -448 -368 -645 -91 -104 -265 389 289 102 993 312 925 1021 1121 994
1489 994 628 857 641 139 455 87 166 -18 -432 -371 -397 -406 -151 -380 -86 -363 -570 -421 -363 -42 -38 -261 -28
1512 -28 -281 -265 -349 -671 44 -261 -289 -177 -572 -587 -474 -498 339 275 546 348 271 396 367 328 934 534 485 367
$$ packed form
1359c48N85r4M99k69j15K21l17N77K42j65k48j96J4l84m79L39M27m55M77p07R0
1380c06m22J11O34m01N06N6m17L84l09M5J81k00M03m51k13m2l87k9J52k58Q61
1401a02q79K20k06k66N81L16j92N91m65O2q2L60O7L0M65N9p89O39o09L1O70l76
1423A25J29L11n52M23J9j50M23L4O52k00j5K3l58K74k19J76J47p82l59k58j93
1444c50O7r09N45k09n0k46j94Q5N33m45R25RlL96j05J36O24k76N41l66K06l77
1466E37m33Q1oj64J48k13r9l3k66Q0k77N54j3j61O54j00j87Q91o81O13R6J00j27
1489I94l66K29k16n02L16l68P9j84m14O1k6rK55k29K94k77k07J49N8L21Mk23K33
1512b8k53J6q4l22P15l05k8J12l95j5J13k4Q37o4K71j98p7J25k9l9O06m00m9j18
$$ plain form
1536 367 16 -165 -474 -407 -572 -1011 -797 -1075 -1012 -883 -1517 -1097 -814 -679 -165 -193 59 367 243 1033 841
1557 841 1282 1423 1030 1169 712 712 769 614 760 72 -450 -448 -857 -540 -521 -530 -750 -465 -751 -413 -443 -76 -20
1580 -20 -201 345 -201 153 282 -123 185 239 -119 0 -561 -575 -353 -805 -489 -762 -331 -349 -425 -194 -545 -138
1602 -138 337 506 643 671 703 962 823 772 920 693 1095 454 403 408 -65 220 -237 -364 -22 -268 -402 -304
1624 -304 -480 11 -281 30 343 100 250 102 107 562 -209 319 478 43 360 86 13 285 132 349 204
1645 204 -31 202 -289 224 -59 -152 123 87 366 -45 -130 89 52 -179 -99 -360 -126 -445 -506 -313 -459 -223
1667 -223 -478 -155 -147 -428 -162 88 -195 329 267 496 228 105 301 278 460 688 91 193 220 -165 286 -187
1689 -187 243 9 -245 -160 -239 -146 -74 -97 283 70 -247 58 94 149 398 -195 -167 64 -349 -42 -384 -281 -354
$$ packed form
1536C67l51j81l09O7j65m39K14k78O3J29o34M20K83J35N14k8K52L08j24P90j92
1557H41M41J41l93J39m57%N7j55J46o88n22Km09L17J9rk20K85k86L38l0L67N6
1580b0j81N46n46L54J29m05L08N4l58J19n61j4K22m52L16k73M31j8p6K31l51M07
1602a38M75J69J37K8L2K59j39n1J48k27M02o41n1Nm73K85m57j27L42k46j34R8
1624c04j76M91k92L11L13k43J50j48NM55p71N28J59m35L17k74p3K72j53K17j45
1645B04k35K33m91N13k83r3K75l6K79m11q5K19l7k31Q0k61K34l19o1J93j46K36
1667b23k55L23Qk81K66K50k83N24o2K29k68j23J96k3J82K28n97J02K7l85M51m73
1689a87M30k34k54Q5p9R3P2k3L80k13l17L05L6N5K49n93K8K31m13L07l42J03p3
$$ plain form
1712 -354 -510 -198 -372 -402 -442 -877 -492 -346 -239 109 -170 34 -204 -156 -64 -208 48 -258 -248 160 -482 -145
1734 -145 -382 -525 -211 -245 -162 217 37 488 478 417 1067 695 1057 1041 659 866 391 514 476 272 43 -153
1756 -153 -146 -423 -834 -949 -491 -748 -193 -271 93 -132 49 554 666 786 1346 755 899 1026 1021 622 333 377
1778 377 325 -474 -364 -1038 -1013 -1135 -1725 -1441 -1733 -1711 -1571 -1845 -1173 -586 -467 255 115 463 837 969 1188
1799 1188 1338 1591 1619 1164 1475 814 624 739 204 461 248 -450 -297 -368 -748 -343 -379 133 335 223 541
1820 541 438 813 995 843 869 705 697 399 -85 135 -399 -658 -772 -1317 -1367 -1587 -2038 -1468 -1523 -1250 -1195 -932
1842 -932 -525 -502 -345 365 149 789 591 919 1183 1060 538 635 502 749 183 115 -204 -438 85 -125 -599
1863 -599 28 -146 -114 -133 -152 546 387 622 854 577 655 677 517 494 246 231 -180 -543 -469 -868 -1000 -1244 -1488
$$ packed form
1712c54j56L12j74l0m0m35L85J46J07L48k79K04k38M8R2j44K56l06J0M08o42L37
1734a45k37j43L14l4Q3L79j80M51j0o1O50l72L62j6l82K07m75J23l8k04k29j96
1756a53Pk77m11j15M58k57N55p8L64k25J81N05J12J20N60n91J44J27nl99k89M4
1778C77n2p99J10o74K5j22n90K84k92K2J40k74O72N87J19P22j40L48L74J32K19
1799A188J50K53K8m55L11o61j90J15n35K57k13o98J53p1l80M05l6N12K02j12L18
1820E41j03L75J82j52K6j64qk98m84K20n34k59j14n45n0k20m51N70n5K73N5K63
1842i32M07K3J57P10k16O40j98L28K64j23n22R7j33K47n66o8l19k34N23k10m74
1863e99O27j74L2j9j9O98j59K35K32k77P8K2j60k3k48j5m11l63P4l99j32k44k44
$$ plain form
1886 -1488 -1323 -1197 -983 -1062 -1068 -704 -426 -5 238 245 553 785 657 779 921 1075 1435 883 974 548 201 569
1908 569 -91 224 -369 -451 -431 -614 -1021 -483 -834 -364 -611 -495 -177 -231 -482 110 -71 531 162 342 597
1929 597 205 369 105 277 190 78 -4 62 -390 -188 -308 -53 -115 108 200 -87 -108 362 118 193 803 656
1951 656 1013 579 628 596 541 508 591 617 655 -150 135 -82 -348 -389 -483 -652 -663 -1053 -842 -814 -933 -779 -783 -558
1975 -558 -893 -759 -113 -338 -18 -223 -189 329 220 285 364 368 588 248 314 457 213 344 152 282 586 190
1997 190 464 379 332 553 191 522 433 71 444 5 226 204 -267 -217 -17 -272 -471 -476 -611 -548 -1119 -610 -651
2020 -651 -612 -568 -756 -350 -536 -382 -98 -117 -35 213 326 69 -128 198 443 243 360 96 96 239 -150 -132
2042 -132 -410 -30 -343 -644 -190 -502 -661 -395 -369 -374 -273 -43 414 205 188 526 324 912 854 549 728 476
$$ packed form
1886a488J65J26K14p9oL64K78M21K43PL08K32j28J22J42J54L60n52R1m26l47L68
1908E69o60L15n93q2K0j83m07N38l51M70k47J16L18n4k51N92j81O02l69J80K55
1929E97l92J64k64J72q7j12q2O6m52K02j20K55o2K23R2k87k1M70k44P5O10j47
1951F56L57m34M9l2n5l3Q3K6L8q05K85k17k66m1r4j69j1l90K11K8j19J54mK25
1975e58l35J34O46k25L20k05L4N18j09O5P9MK20l40O6J43k44J31j92J30L04l96
1997A90K74q5m7K21l62L31q9l62L73m39K21k2m71N0K00k55j99nj35O3n71N09m1
2020f51L9M4j88M06j86J54K84j9Q2K48J13k57j97L26K45k00J17k64%J43l89J8
2042a32k78L80l13l01M54l12j59K66K6nJ01K30M57k09j7L38k02N88n8l05J79k52
$$ plain form
2064 476 813 661 552 619 344 3 62 -369 -394 -367 -871 -719 -895 -914 -777 -727 -904 -800 -683 -328 -487 -263
2086 -263 -14 254 214 186 384 400 401 908 340 389 706 -121 415 147 -143 271 -43 -3 37 -210 391 326 407
2109 407 801 333 676 371 352 821 273 719 304 265 394 -192 -191 -325 -974 -749 -962 -1253 -1087 -1243 -1040
2130 -1040 -1077 -982 -665 -833 -327 -323 -391 247 679 654 1015 525 905 1009 1186 859 771 1262 757 997 781 519
2152 519 530 428 31 186 -42 -50 136 -196 60 -152 -223 -220 -720 -528 -316 -688 -616 -597 -532 -766 -641 -692 -626 -761
2176 -761 -662 -564 -149 -443 -520 65 -270 -65 -28 54 156 390 157 474 280 269 279 425 473 111 293 158 79
2199 79 264 -52 334 294 221 136 22 167 431 217 134 -26 145 118 -309 -6 -131 -146 -394 -211 -40 -421
2221 -421 -445 -193 -279 -284 74 -227 -59 -15 -91 196 -248 15 147 -335 13 -28 -279 -101 -61 -221 -57 -337 127
$$ packed form
2064D76L37j52j09O7k75l41N9m31k5K7n04J52j76j9J37N0j77J04J17L55j59K24
2086b63K49K68m0k8J98J6JN07n68M9L17q27N36k68k90M14l14M0M0k47O01o5Q1
2109D07L94m68L43l05j9M69n48M46m15l9J29n86Jj34o49K25k13k91J66j56K03
2130a040l7R5L17j68N06Mo8O38M32k5L61m90L80J04J77l27q8M91n05K40k16k62
2152E19J1j02l97J55k28qJ86l32K56k12p1Ln00J92K12l72P2J9O5k34J25n1O6j35
2176g61R9R8M15k94p7N85l35K05L7Q2J02K34k33L17j94j1J0J46M8l62J82j35p9
2199G9J85l16L86m0p3q5j14J45K64k14q3j60J71k7m27L03j25j5k48J83J71l81
2221d21k4K52q6nL58l01J68M4p6K87m44K63J32m82L48m1k51J78M0j60J64k80M64
$$ plain form
2244 127 -369 91 204 196 505 385 510 669 386 292 313 307 272 -9 201 51 -298 -94 -270 -284 -168 -336 -22
2267 -22 -80 -87 76 20 354 868 864 850 703 687 883 513 524 482 -138 26 -566 -330 -804 -1150 -997 -1031 -781 -1284
2291 -1284 -1134 -926 -895 -838 -349 -81 -307 -62 161 516 167 360 504 361 438 263 169 174 18 516 239 128
2313 128 136 143 314 7 283 612 443 864 431 804 813 856 815 426 455 305 82 -235 -335 -337 -563 -674 -1253 -995
2337 -995 -984 -1084 -847 -903 -745 -382 -224 -280 19 171 123 224 365 45 481 438 315 162 -164 -279 -14 -505
2359 -505 -10 -127 -332 -206 -44 -5 116 225 614 541 508 980 724 760 687 363 694 174 156 72 -241 -447
2381 -447 -483 -585 -634 -767 -569 -765 -565 -328 -270 173 120 222 64 364 737 347 311 765 778 328 425 150
2403 150 -56 230 -31 -48 16 -177 -224 -354 -393 -387 -474 -60 -201 43 80 28 460 67 144 234 -30 87 -64 -158
$$ packed form
2244A27m96M60J13qL09j20J25J59k83r4K1ol5k81K10j50l49K04j76j4J16j68L14
2267b2n8pJ63n6L34N14mj4j47j6J96l70J1m2o20J64n92K36m74l46J53l4K50n03
2291a284J50K08L1N7M89K68k26K45K23L55l49J93J44j43P7j75r4Nj56M98k77j11
2313A28QPJ71l07K76L29j69M21m33L73RM3m1l89K9j50k23l17j00kk26j11n79K58
2337i95J1j00K37n6J58L63J58n6K99J52m8J01J41l20M36m3j23j53l26j15K65m91
2359e05M95j17k05J26J62L9J21J09L89p3l3M72k56L6p3l24L31n20j8q4l13k06
2381d47l6j02m9j33J98j96K00K37N8M43n3J02j58L00L73l90l6M54J3m50R7k75
2403A50k06K86k61j7O4j93m7j30l9Oq7M14j41K44L7n2M32l93P7R0k64J17j51r4
$$ plain form
2427 -158 -345 3 -120 -584 -119 -183 -446 -289 -70 -400 165 57 -12 80 365 173 287 388 528 533 331 632
2449 632 286 605 79 360 148 150 -56 -85 -121 -190 -368 253 -87 -68 -18 -116 337 170 -147 -279 -188 -162 -87 -299
2473 -299 -81 -527 -597 -460 -209 -242 -264 -188 -203 -495 86 -130 100 262 -90 165 349 259 366 429 65 471
2495 471 -103 90 40 -219 321 -160 -69 -122 -497 11 -169 -147 -156 -216 -188 -126 -130 -20 -396 -29 38 -101 268 -12
2519 -12 183 208 -10 261 232 228 501 200 305 159 79 125 162 246 312 70 392 240 -143 113 -294 -145 -42
2542 -42 -214 -225 -277 -402 -365 -389 -454 -530 -549 -396 -662 -233 -297 -254 257 -198 -27 44 -7 405 16 562 646 468
2566 468 777 324 519 517 238 180 278 168 29 98 -60 -15 -236 -20 -124 -284 -329 -591 -488 -337 -455 -242
2588 -242 -443 -319 -120 -403 278 158 317 243 -63 154 133 125 86 -96 217 32 30 87 -445 -103 -96 -184 -87 -68
$$ packed form
2427a58j87L48j23m64M65o4k63J57K19l30N65j08o9R2K85j92J14J01J40Nk02L01
2449F32l46L19n26K81k12Kk06k9l6o9j78O21l40J9N0r8M53j67l17j32R1K6P5k12
2473b99K18m46p0J37K51l3k2P6j5k92N81k16K30J62l52K55J84r0J07O3l64M06
2495D71n74J93n0k59N40m81R1n3l75N08j80K2ro0K8O2mJ10l76L67O7j39L69k80
2519a2J95K5k18K71k9mK73l01J05j46q0M6L7Q4O6k42L22j52l83K56m07J49J03
2542d2j72j1n2j25L7k4o5p6j9J53k66M29o4M3N11m55J71P1n1M12l89N46Q4j78
2566D68L09m53J95kk79n8R8j10j39O9j58M5k21K16j04j60m5k62J03J51j18K13
2588b42k01J24J99k83O81j20J59p4l06K17k1ql9j82L13j85kN7n32L42Pq8R7J9
$$ plain form
2612 -68 167 -30 43 191 203 189 77 56 297 44 30 -41 -129 -261 -97 -158 -259 -437 -332 -242 -319 -229 -320 -320 -61
2637 -61 5 175 542 147 757 395 231 397 358 422 544 233 404 -380 -51 101 -354 -414 -695 -224 -514 -540
2659 -540 -331 -201 -91 -41 59 356 255 456 422 366 209 496 -18 407 -46 -202 193 -396 -410 -477 -786 -311
2681 -311 -379 -136 -376 -275 -139 -162 289 274 397 545 724 731 522 522 521 412 155 118 0 -191 139 -362 -354 -443
2705 -443 -670 -404 -754 -506 -166 5 257 208 110 591 162 418 283 313 324 162 378 41 -18 -195 -295 -193
2727 -193 -80 -275 -195 -409 -139 8 -175 -157 -7 240 372 335 453 93 148 305 -26 122 161 -34 -105 -252
2749 -252 -196 -206 -482 -362 -241 -603 -199 -250 -468 -58 -499 175 -69 163 288 -67 269 256 621 541 186 423
2771 423 187 467 226 220 282 102 -290 -135 58 -195 -203 1 -126 42 213 3 67 -26 11 -380 -143 -248 -205
$$ packed form
2612f8K35j97P3J48J2j4j12k1K41k53j4p1q8j32J64o1j01j78J05R0p7R0r1%K59
2637f1O6J70L67l95O10l62j64J66l9O4J22l11J71p84L29J52m55o0k81M71k90k6
2659e40K09J30J10N0J00K97j01K01l4n6j57K87n14M25m53j56L95n89j4o7l09M75
2681c11o8K43k40J01J36k3M51j5J23J48J79Pk09%jj09k57l7j18j91L30n01Qq9
2705d43k27K66l50K48L40J71K52m9r8M81m29K56j35L0J1j62K16l37n9j77j00J02
2727a93J13j95Q0k14K70J47j83J8J50K47J32l7J18l60N5J57l31J48L9j95p1j47
2749b52N6j0k76J20J21l62M04n1k18M10m41O74k44K32J25l55L36j3L65q0l55K37
2771D23k36K80k41oO2j80l92J55J93k53qK04j27J68J71k10O4r3L7l91K37j05M3
$$ plain form
2794 -205 -202 -40 103 -25 31 72 -279 -178 -164 -41 34 92 -353 -83 -336 166 -23 138 -126 101 -167 -32
2816 -32 -357 78 115 202 192 94 112 126 44 407 420 63 64 264 243 167 56 131 10 -216 -136 -183 -35 -155 2
2841 2 2 -40 -147 -150 -93 -165 -6 -97 85 78 222 71 7 -168 58 258 102 262 29 -82 -249 -379 30 114 -247
2866 -247 -79 -319 68 29 -6 -150 61 122 24 73 -112 165 168 73 -105 45 77 294 56 -103 -228 -24 -299
2889 -299 23 -18 -18 -45 -114 108 320 62 70 114 122 539 128 158 366 347 530 231 101 193 -63 21 213 -110 -353
2914 -353 -239 38 -138 -264 -245 -53 -137 -127 -65 100 46 -54 210 -2 -231 -19 -171 -256 -5 -124 -221 -209 -105
2937 -105 -410 -111 -126 -283 -29 -403 -166 -86 -127 -20 -184 -53 404 211 -137 279 -92 537 278 269 339 119
2959 119 326 148 147 346 270 3 126 -105 -31 -293 13 -21 -92 -113 -189 -166 220 -5 -184 -122 -149 16 -331 -27
$$ packed form
2794b05LJ62J43j28N6M1l51J01J4J23P5N8m45K70k53N02j89J61k64K27k68J35
2816c2l25M35L7Q7j0r8J8J4q2L63J3l57JK00k1p6j11P5j21k26Q0m7J48j20J57
2841B%m2j07lN7p2J59r1J82pJ44j51o4j75K26K00j56J60k33j11j67j30M09Q4l61
2866b47J68k40L87l9l5j44K11O1r8M9j85K77Lr5j78J50L2K17k38j59j25K04k75
2889b99L22m1%k7o9K22K12k58QM4QM17m11L0K08j9J83k99j30R2k56Q4J92l23k43
2914c53J14K77j76j26J9J92q4J0O2J65n4j00K64k12k29K12j52q5K51j19r7J2J04
2937a05l05K99j5j57K54l74K37Q0m1J07j64J31M57j93l48M16l71O29k59rP0k20
2959A19K07j78jJ99p6k67J23k31P4k62L06l4p1k1p6K3L86k25j79O2k7J65l47L04
$$ plain form
2983 -27 110 -31 26 -147 148 -66 -51 156 -391 32 294 -9 -198 76 45 -77 27 -352 50 -293 57
3004 57 16 -180 201 -218 47 -8 -23 174 89 86 109 54 -384 241 -82 108 -174 19 -76 -332 130 232 151 34
3028 34 -55 -3 269 291 448 32 220 197 257 -15 -93 48 104 -5 134 -54 6 -148 339 3 -60 -262 -243 -227
3052 -227 -250 -398 -579 -356 -80 -188 5 17 -14 15 -238 -69 -5 166 74 100 22 16 -54 81 -298 228 253 268
3076 268 536 10 292 32 119 -10 -53 242 178 254 50 99 200 41 61 147 15 -116 47 -107 -167 -57 -159
3099 -159 -103 -493 32 -33 -102 -211 44 -307 -313 -336 -182 -118 36 45 -298 -185 27 -71 -84 24 97 248 324 -135
3123 -135 62 79 247 -98 94 319 38 -47 -339 111 261 13 -13 117 250 154 339 411 -32 -107 129 208
3145 208 -87 -36 -31 197 -9 19 -63 -260 -60 -64 -330 -34 -276 -209 126 -220 -163 -247 -53 -74 78 37 112 13 368
$$ packed form
2983b7J37j41N7j73K95k14J5K07n47M23K62l03j89K74l1j22J04l79M02l43L50
3004E7m1j96L81m19K65n5j5J97q5lK3n5m38O25l23J90k82J93r5k56M62J02q1j17
3028C4q9N2K72K2J57m16J88k3O0k72p8J41N6j09J39j88O0j54M87l36o3k02J9J6
3052b27k3j48j81K23K76j08J93J2l1K9k53J69O4J71r2K6p8op0J35l79N26K5J5
3076B68K68n26K82k60Q7j29m3K95o4P6k04M9J01j59K0Q6j32j31J63j54o0J10j02
3099a59N6l90N25o5o9j09K55l51ok3J54O4J54Rl43J13K12r8j3J08P3J51P6m59
3123a35J97J7J68l45J92K25k81q5k92M50J50k48k6J30J33r6J85P2m43p5K36P9
3145B08k95N1NK28k06K8q2j97K00mk66K96k42O7L35l46N7q4J94k1J52m1P5r9L55
$$ plain form
3170 368 -34 114 233 136 363 -117 -189 55 -31 169 15 -303 -74 -177 -213 31 -118 -84 -99 -86 2 214 10
3193 10 18 92 -280 -193 -34 -12 -208 13 -440 -190 -336 12 66 -126 -206 -173 -58 453 61 -321 137 148 597
3216 597 194 183 573 216 135 87 -65 407 353 4 24 106 -142 -73 23 142 104 191 89 150 96 -94 113 -23
3240 -23 -145 226 -233 -224 -483 -133 -160 -351 -502 -177 -474 -151 -278 -243 -46 -204 100 -78 -42 -124 -98 2 160
3263 160 187 366 93 93 346 263 320 435 263 481 139 506 288 356 284 160 -91 281 -139 -9 119 108 -82
3286 -82 -201 -50 126 -228 -142 -240 -52 -83 -427 -240 -225 -141 155 -158 -113 -82 -160 -150 43 -192 -58 30 -30 -56
3310 -56 148 333 -154 255 46 98 -97 -6 -12 12 125 223 227 -72 -337 -185 -53 -38 308 -17 -213 103 -35
3333 -35 16 43 183 136 147 -179 -110 287 -221 -45 -371 -68 120 -318 60 -54 101 188 -165 -74 142 4 25
$$ packed form
3170C68m02J48J19r7K27m80p2K44q6K00j54l18K29j03l6K44j49L4j5J3Q8K12k04
3193A0QP4l72Q7J59K2j96K21m53K50j46L48N4j92q0L3J15N11l92l82M58J1M49
3216E97m03j1L90l57q1m8j52M72n4l49K0Q2k48O9R6J19l8Q7j02O1n4j90K07j36
3240b3j22L71m59Rk59L50k7j91j51L25k97L23j27L5J97j58L04j78L6q2K6J00J58
3263A60K7J79k73%K53q3N7J15j72K18l42L67k18O8p2j24k51L72m20J30J28j1j90
3286h2j19J51J76l54Q6r8J88l1l44J87J5Q4K96l13M5L1p8J0J93k35J34Q8o0k6
3310e6K04J85m87M09k09N2j95R1oK4J13R8Mk99k65J52J32J5L46l25j96L16j38
3333c5N1K7J40m7J1l26O9L97n08J76l26L03J88m38L78j14J55Q7l53R1K16j38K1
$$ plain form
3356 25 -54 129 137 -16 -21 6 30 208 -190 58 144 -103 114 -70 47 -22 -14 -4 39 222 -35 -22 238 -167 -173 68
3382 68 -337 -185 -101 -350 64 -181 -222 -184 41 -198 119 -51 72 101 64 -124 102 -2 279 105 283 213
3404 213 130 -44 128 93 205 232 88 90 195 -103 32 402 48 -52 -17 -7 -98 146 39 -30 -131 -389 -37
3427 -37 -120 39 -66 -269 -242 97 -6 -136 -226 -411 -95 71 -22 -92 -36 53 87 -240 -303 -169 94 -119 209
3450 209 -12 167 232 -30 138 -208 -131 378 92 -21 194 134 324 192 111 218 135 -220 -129 -76 143 -111
3472 -111 177 64 167 -138 -230 -357 -165 85 -30 -86 45 -153 64 112 88 211 209 12 -223 166 -36 -208
3494 -208 191 24 -175 -45 155 99 -98 -129 263 -369 -24 103 -17 -95 -305 -26 -130 -92 33 227 -109
3515 -109 -46 -266 -83 100 -211 87 -2 232 46 -144 256 -174 197 -69 203 178 341 114 102 195 146 187
$$ packed form
3356B5p9J83Qj53nK7K4J78l98K48Q6k47K17j84J17o9QJ0M3J83k57J3K60m05oK41
3382F8m05J52Q4k49M14k45m1L8K25k39L17j70J23K9l7j88K26j04K81j74J78p0
3404B13q3j74J72l5J12K7j44KJ05k98J35L70l54j00L5J0r1K44j07o9j01k58L52
3427c7q3J59j05k03K7L39j03j30r0j85L16J66r3p0N6Q9L4l27o3J34K63k13L28
3450B09k21J79O5k62J68l46P7N09k86j13K15o0J90j32q1J07q3l55R1N3K19k54
3472a11K88j13J03l05r2j27J92K50j15n6J31j98K17M8k4J23kj97k35L89k02j72
3494b08L99j67j99J30K00n6j97l1L92o32L45J27j20p8k10K79j04L8J25J94l36
3515a09O3k20J83J83l11K98q9K34j86j90M00m30L71k66K72k5J63k27j2R3m9M1
$$ plain form
3537 187 -158 -140 142 -202 170 -296 70 25 -394 31 -129 76 59 -171 -53 -107 4 267 -228 -136 382 -163
3559 -163 104 85 -93 -113 -275 39 -249 -61 -76 30 -93 77 -99 25 -59 -113 164 -264 -32 -253 -276 44
3581 44 -154 -65 -71 -207 -352 54 -45 95 104 46 105 21 97 -286 75 135 96 -28 265 -143 167 79 -107 -67 -63 23
3607 23 1 24 -315 -140 46 -77 -86 -246 -86 -127 -29 71 -80 -44 -60 250 -192 112 3 21 -260 -134 136
3630 136 -64 -146 49 72 121 -164 -189 -194 194 0 -4 -181 -265 -158 -192 -158 -88 46 -2 54 -95 -173 56 83 -17
3655 -17 38 -101 -181 -87 201 310 57 -170 119 41 -38 -49 -192 -48 58 3 -8 -43 76 147 205 82 -269 247
3679 247 -7 10 237 86 -283 104 35 205 -103 -19 -222 -207 -234 7 -124 -20 -10 -152 -188 -58 -29 -215 14
3702 14 -135 32 234 57 -71 -411 -228 -142 113 105 -125 75 -95 -24 377 -34 -38 -218 4 219 140 269 -146
$$ packed form
3537A87l45J8K82l44L72m66L66m5m19M25j60K05j7k30J18n4J11K63m95R2N18n45
3559a63K67j9j78k0j62L14k88J88j5J06j23J70j76J24q4n4K77m28K32k21k3L20
3581D4j98Q9oj36j45M06r9J40Rn8N9q4P6l83L61O0l9j24K93m08L10q8j86M0MQ6
3607B3k2K3l39J75J86j23rj60J60m1R8J00j51L6j6L10m42L04j09J8k81J26K70
3630A36k00q2J95K3M9k85k5nL88j94mj77q4J07l4L4P0J34m8N6j49p8K29K7j00
3655a7N5j39q0R4K88J09k53k27K89p8p9j1j43J44J06n5j1l5J19P1N8j23l51N16
3679B47k54J7K27j51l69L87o9J70l08Q4k03J5k7K41j31J04J0j42l6J30K9j86K29
3702A4j49J67K02j77j28l40J83Q6K55qk30K00j70P1M01m11mj80K22K15p9J29m15
$$ plain form
3725 -146 324 151 150 -29 186 343 226 154 168 81 -34 -80 286 99 122 -50 206 115 -167 -320 -180 -283 -257
3748 -257 57 -51 -343 -1 33 -127 41 -233 159 147 90 85 262 21 -5 81 -52 -55 30 -163 -304 -211 239 -109
3772 -109 -184 153 -142 193 -152 -24 92 84 269 171 302 124 218 85 166 -198 4 117 -56 -16 -191 251
3794 251 -177 60 -183 59 53 0 80 27 -11 -63 89 221 116 -7 49 118 129 124 72 131 11 -47 -78 -167 67 -102
3820 -102 -237 -288 -181 -200 -35 9 150 411 166 47 385 180 120 12 130 128 10 -25 159 -108 -278 -163
3842 -163 80 122 -146 -363 12 66 -62 200 -112 82 -185 -24 65 -6 -127 180 48 57 107 -104 -6 -256 -25
3865 -25 42 -175 -136 -76 -307 156 13 -222 -24 62 -67 -93 59 32 -100 -232 15 -9 148 -205 28 116 -72
3888 -72 99 -2 23 -174 -91 48 0 37 131 -193 -104 -274 -291 -58 192 -136 124 59 15 95 -99 -31 82 217
$$ packed form
3725a46M70j73jj79K15J57j17p2J4q7j15m6L66j87K3j72K56r1k82j53J40j03K6
3748b57L14j08k92L42L4j60J68k74L92j2n7nJ77k41k6Q6j33lQ5j93j41R3M50l48
3772a09p5L37k95L35l45J28J16qJ85r8J31j78R4j33Q1l64K02J13j73M0j75M42
3794B51m28K37k43K42on3Q0n3l8n2J52J32j05j23N6O9J1nn2N9j20n8l1q9K34j69
3820a02j35n1J07j9J65M4J41K61k45j19L38k05o0j08J18kj18l5J84k67j70J15
3842a63K43M2k68k17L75N4j28K62l12J94k67J61Q9p1j21L07j32RN0k11R8k50K31
3865b5O7k17L9O0k31M63j43k35J98Q6j29k6J52k7j32j32K47k4J57l53K33Q8j88
3888g2J71j01K5j97Q3J39m8L7R4l24Q9j70j7K33K50l28K60o5m4Q0j94O8J13J35
$$ plain form
3912 217 -36 34 197 109 14 16 60 -101 85 -69 86 218 226 42 229 83 64 -33 118 217 40 97 136 10
3936 10 -142 220 93 -121 -148 -116 47 -49 154 25 -44 235 53 -8 98 -90 69 -71 -224 -78 -191 -242
3958 -242 -184 20 -167 -224 246 -16 -87 173 248 45 322 292 106 192 157 -132 -65 423 30 17 38 -64 -86 80
3982 80 -271 -128 -105 -93 91 -134 -285 -344 -140 33 175 -169 67 -15 -207 137 163 185 38 -65 -15 -215 146
4005 146 14 91 -74 -56 -251 -91 -33 231 129 -412 11 -313 -28 -102 224 -290 55 112 298 -152 -172 411
4027 411 91 112 343 212 -63 -75 -95 -70 22 -316 34 103 -59 -258 43 39 160 -72 99 41 46 173 205 -8
4051 -8 160 3 -86 59 90 117 -333 -39 -4 69 11 -123 -266 10 -117 78 -55 -4 -133 102 -82 63 133
4074 133 285 -187 -159 -27 -311 52 -58 -59 -32 -59 -72 -146 89 -153 51 -48 -140 -5 31 39 93 -62 37 130 24
$$ packed form
3912B17k53P0J63q8r5KM4j61J86j54J55J32Qj84J87j46j9r7J51R9j77N7L9j26
3936A0j52L62j27k14k7L2J63r6K03j29o9K79j82o1J06j88J59j40j53J46j13n1
3958b42N8K04j87n7M70k62p1K60P5k03K77l0j86Q6l5k89O7M88l93j3K1j02k2J66
3982H0l51J43K3J2J84k25j51n9K04J73J42l44K36q2j92L44K6K2j47j03N0k00L61
4005A46j32P7j65J8j95J60N8K64j02n41M23l24K85p4L26n14L45N7J86m50k0N83
4027D11l20K1K31j31k75j2k0K5R2l38L50O9j62j99L01mJ21k32J71n8NJ27L2k13
4051hJ68j57q9J45L1K7m50K94L5P3n8j34j43K76j27J95j33N1j29K35j84J45P0
4074A33J52m72K8J32k84L63j10jK7k7j3p4K35k42K04r9r2J35L6QN4j55R9R3j06
$$ plain form
4099 24 -35 -135 108 -99 138 -100 38 129 209 301 -178 125 202 -64 86 -150 -37 -74 -37 -24 -18 246 58 -98
4123 -98 -58 -61 49 95 105 66 -249 77 -87 -366 -142 -69 56 -173 -174 -204 -157 11 -292 -120 30 88 172 46 343
4148 343 -80 1 109 20 -174 140 51 28 166 -63 -65 181 399 -142 411 59 289 -160 -4 348 147 13
4170 13 66 74 -129 23 3 145 -187 11 -138 39 54 -21 99 196 14 -55 -222 233 -192 107 138 98 -46 -162
4194 -162 -4 39 151 -46 6 -331 -101 376 -82 -30 -80 109 88 -173 -2 127 309 -109 125 55 96 15 80
4217 80 24 212 72 -37 -91 50 19 94 158 -178 -87 10 -72 -83 12 25 57 -47 -18 -32 -16 -6 124 65 -143 49
4243 49 -155 -96 -53 -180 94 133 158 92 -167 -305 -116 -116 60 135 -47 -108 -134 199 -207 -48 190 60 205 -151
4267 -151 155 92 46 -3 -180 -84 -34 -128 -52 -111 -43 295 -446 -278 -242 -115 -232 -64 188 -145 3 127 -142
$$ packed form
4099B4n9j00K43k07K37k38J38R1Q0R2m79L03P7k66J50k36J13l7L7J3OK64j88j56
4123i8M0lJ10M6J0l9l15L26j64k79K24P3J25k29jl0M7J68l03J72J50N8Q4j26K97
4148C43m23Q1J08q9j94L14q9k3J38k29kK46K18n41N53l52K30m49J56L52k01j34
4170A3N3Qk03J52k0J42l32J98j49J77J5p5J20R7j82o9j67M55m25K99L1m0j44j16
4194a62J58M3J12j97N2l37K30M77m58N2n0J89k1k61J71J29J82m18K34p0M1q1O5
4217H0n6J88j40j09n4J41l1P5O4l36R1R7q2j1R5J3L2j04K9j4J6J0J30n9k08J92
4243D9k04N9M3j27K74L9K5o6k59j38J89%J76P5j82o1k6L33m06J59K38j30J45l56
4267a51L06o3m6m9j77R6N0r4P6n9O8L38p41J68L6J27j17J68K52l33J48J24k69
$$ plain form
4290 -142 88 -40 103 54 -73 168 284 133 161 293 16 -92 305 -172 131 284 -104 -59 61 94 171 11
4312 11 30 -88 -154 -134 23 14 -231 -84 -324 63 -237 -62 144 -141 62 118 -239 81 -14 134 -24 144 -156
4335 -156 63 -20 255 127 266 -132 99 -19 -244 -82 -184 -268 21 -60 134 47 -131 -43 121 -30 100 -155
4357 -155 39 181 -232 -111 -44 -161 55 126 -101 -449 -161 -32 -91 245 -172 -112 173 10 -38 35 14 -20 240
4380 240 -170 136 96 255 -42 -93 -123 79 144 -91 44 -95 15 16 -51 -78 -176 -150 -89 -290 -68 -32 -114 -62 -5
4405 -5 -285 -105 234 99 -483 300 -67 90 -59 -47 210 -68 -145 109 -100 -53 -2 -152 -194 -137 -84 256 100
4428 100 80 124 191 72 83 -82 9 -12 208 -19 225 149 -69 -122 -10 -255 -191 -198 -4 -132 -85 -179 -288 -167
4452 -167 -106 -132 -8 -30 -128 -73 -122 -73 38 7 16 -110 211 170 128 118 226 263 66 44 17 -31 -92 119 148 -85
$$ packed form
4290a42K30j28J43m9j27K41J16j51K8J32k77j08L97m77L03J53l88M5J20L3P7j60
4312A1J9j18o6K0J57rk45J47k40L87l00J75K06k85K03N6l57L20r5J48j58J68l00
4335a56K19q3K75j28J39l98K31j18k25J62j02q4K89q1J94q7j78Q8J64j51J30k55
4357a55J94J42m13J21O7j17K16P1k27l48K88J29n9L36m17O0K85j63m8P3k1l4K60
4380B40m10L06m0J59k97n1l0K02O5k35J35j39J10Jo7k7r8K6O1k01K22L6q2N2N7
4405ek80J80L39j35n82P83l67J57j49J2K57k78p7K54k09M7N1j50m2N7N3L40j56
4428A00k0M4O7j19J1j65R1k1K20k27K44p6k18n3J12k45O4pJ94j28M7r4j09J21
4452a67O1k6J24k2r8N5m9M9J11l1Rj26L21m1m2j0J08L7j97k2k7m8o1K11K9k33
$$ plain form
4478 -85 -55 -58 -79 -39 -11 -22 -261 213 13 -203 101 38 118 -222 85 -137 -187 17 210 -62 130 44 79 -62
4502 -62 -371 88 -20 -219 143 -21 -204 -114 55 -129 52 5 32 150 82 102 201 115 4 42 -19 85 138 -216
4526 -216 -3 25 -339 81 -55 -103 -382 26 -39 53 -102 124 -26 174 -325 52 380 153 -52 -21 -13 83 28
4549 28 -169 126 -295 116 77 87 201 -39 48 -141 161 78 237 227 151 64 150 98 211 -43 -126 29 184 93
4573 93 -93 -515 -18 164 60 -88 -30 -41 67 -243 -353 -103 224 60 51 -19 143 10 71 21 -72 219 -61
4596 -61 278 61 283 50 43 -203 0 -80 12 -173 -176 -134 -162 -65 123 -18 37 -9 -77 -27 25 -60 84 -69 71
4621 71 2 -81 -5 -29 57 27 23 -107 126 -178 -22 17 47 -217 50 -100 -155 -210 -75 -27 -98 178 163 -36 3 163
4647 163 326 39 265 -107 59 -34 -109 -197 -136 61 61 -35 223 -175 -184 -209 73 118 55 302 -169 12 -224 -18
$$ packed form
4478h5L0lk1M0K8j1k39M74k00k16L04o3Q0l40L07k22n0K04J93k72J92q6L5j41
4502f2l09M59j08j99L62j64j83R0J69j84J81m7K7J18o8K0R9q6j11L8o1J04N3l54
4526b16K13K8l64M20j36m8k79M08o5R2j55K26j50K00m99L77L28k27k05L1QR6n5
4549B8j97K95m21M11l9J0J14k40Q7j89L02q3J59j0p6q7Q6n2J13k54q3J55J55r1
4573I3j86m22M97J82j04j48N8j1J08l10j10K50L27j64rp0J62j33O1n0r3K91k80
4596f1L39k17K22k33pk46K03q0R2j85lM2k8R7J88j41N5m6o8N0N2q5J44j53J40
4621G1o9q3P6k4Q6l0mj30K33l04J56L9L0k64K67j50n5n5J35M8p1K76j5j99L9J60
4647A63J63k87K26l72J66r3p5q8O1J97%r6K58l98rk5K82M5o3K47m71J81k36K06
$$ plain form
4671 -18 -43 146 -40 137 121 216 -50 -70 -23 -145 -54 214 -317 -18 -147 -182 -171 -157 -84 63 12 372 -197 -120
4695 -120 53 -86 4 82 -58 86 -262 -7 -115 -102 -153 -71 50 -235 -91 -155 -246 -178 71 160 -216 -84 103
4718 103 -135 226 -105 115 -32 49 11 -210 -46 -149 134 -146 295 -35 -29 -73 119 245 -144 19 -90 103
4740 103 -111 -11 -79 -180 134 -76 71 -127 114 -129 -7 177 101 320 296 44 -37 196 57 46 -99 201
4762 201 -35 99 -168 -217 -193 136 105 -165 -94 24 -161 78 173 264 154 -48 126 -26 -208 -224 45 -17 71
4785 71 -76 -341 28 35 78 126 -118 51 110 14 111 -35 31 174 -32 -57 -221 -192 213 155 73 244 -271 -21
4809 -21 8 -95 94 107 -3 67 -274 62 -6 -361 135 -11 2 -301 -36 -83 -103 70 -72 -3 -132 -239 125
4832 125 -355 57 243 -139 -145 311 -12 -157 -149 -70 -236 167 76 -200 -170 -38 217 -193 208 -109 34 91 26
$$ packed form
4671a8k5J89j86J77j6R5k66k0M7j22R1K68n31K99j29l5J1J4P3J47n1L60n69P7
4695a20J73j39R0P8j40J44l48K55j08J3n1Q2J21k85J44o4r1O8K49Q9l76J32J87
4718A03k38L61l31K20j47Q1l8k21J64j03K83k80M41l30Om4J92J26l89J63j09J93
4740A03k14J00o8j01L14k10J47j98K41k43J22J84p6K19k4k52q1K33j39j1j45L00
4762B01k36J34k67m9K4L29l1k70P1J18j85K39R5R1j10k02J74j52j82j6K69o2Q8
4785G1j47k65L69PM3M8k44J69N9r6R7j46O6J43k06k5j64K9M05n8q2J71n15K50
4809b1K9j03J89J3j10P0l41L36o8l55M96j46J3l03K65m7k0J73j42O9j29j07L64
4832A25m80M12J86l82oM56l23j45QP9j66M03r1k76L0J32K55m10M01l17J43N7o5
$$ plain form
4855 26 127 208 -97 -129 -175 -152 -120 -222 32 128 31 174 -316 38 -66 -233 -29 -191 87 279 43 120 -154
4878 -154 -72 187 167 -102 -62 276 -121 73 192 -46 49 -115 31 269 200 170 12 63 -121 -206 -189 -120 -93 -62
4902 -62 97 -331 297 -128 31 -95 15 44 320 -82 -47 -24 -101 448 -75 -142 106 -179 -452 -61 -110 -173 199
4925 199 -338 -7 -33 110 122 150 -46 201 35 44 7 219 305 25 4 6 -19 168 -2 33 -14 60 -218 -8 -175
4950 -175 -256 -229 -91 166 -73 -128 94 -177 194 262 84 -93 100 315 70 141 -248 162 -78 19 95 256
4972 256 -150 -102 -335 35 281 34 -34 -126 -88 -69 -19 -305 -53 -171 110 325 -99 -57 207 -69 280 -85
4994 -85 9 302 141 191 -209 82 23 -76 -30 95 25 151 204 1 32 -98 252 222 84 -202 97 198 -106
5017 -106 201 124 -63 -347 299 251 -50 -71 -55 14 -60 -80 -146 -116 33 166 128 -73 -112 -45 286 -182 39 39 -9
$$ packed form
4855B6J01Q1l05l2m6K3L2j02K54R6r7J43m90L54j04j67K04j62K78J92k36P7k74
4878a54Q2K59k0k69M0L38l97J94J19k38R5j64J46K38o9l0j58N1j84q5J7O9K7L1
4902f2J59m28O28m25J59j26J10K9K76m02L5K3p7N49n23o7K48k85k73L91m9o3L72
4925A99n37L31k6J43J2K8j96K47j66Rl7K12Q6k80k1Kk5J87j70L5m7P4k78K10j67
4950a75q1K7J38K57k39n5K22k71L71O8j78j77J93K15k45P1l89M10k40R7P6J61
4972B56m06M8k33L70K46k47o8r2L8J9N0k86K52j18K81K15m24M2K64k76L49l65
4994h5R4K93j61N0m00K91n9r9M6J25p0J26N3k03L1j30L50l0j38k86K99J01l04
5017a06L07p7j87k84O46m8l01k1J6O9p4k0o6L0J49J33l8k01l9O7L31m68K21%m8
$$ plain form
5042 -9 78 -60 -111 28 -202 36 219 48 52 -170 320 4 136 141 -356 128 -96 -145 -201 -141 21 -85 138 -35
5066 -35 7 312 176 -275 59 -21 -125 42 -182 198 -23 289 -128 3 168 192 -87 -18 -265 37 -69 -59
5088 -59 180 252 34 160 -279 -35 -87 100 -68 -190 -48 -172 -44 14 120 54 -118 93 138 -73 58 -159
5110 -159 114 -30 87 142 -1 116 240 112 -122 -162 227 -287 166 -13 178 397 16 -22 -69 -25 91 91
5132 91 1 78 231 -33 69 -69 84 -66 -139 44 -61 -123 -44 96 -339 161 93 113 -136 95 -54 -5 84
5155 84 -49 96 146 -74 -164 -142 -286 -152 -169 114 192 272 32 66 87 160 99 -9 69 57 154 -241 -105 13 -109
5180 -109 -13 -42 88 161 -239 -255 9 165 -12 -24 -106 287 -163 189 -155 -50 -64 132 134 50 117 73 -85 -35
5204 -35 94 -40 165 224 -190 -247 75 -93 168 -137 67 15 -95 34 237 -158 31 -45 53 23 -75 -44 -179
$$ packed form
5042iQ7j38n1J39k30K38J83j71Mk22M90l16J32Nm97M84k24m9n6O0J62j06K23j73
5066c5M2L05j36m51L34q0j04J67k24L80k21L12m17J31J65K4k79O9k47L02j06J0
5088e9K39P2k18J26m39K44n2J87j68j22J42j24J28N8J06o6j72K11M5k11J31k17
5110a59K73j44J17N5j43J17J24j28k34m0L89n14M53j79J91K19l81l8m7M4J16%
5132I1r0P7J53k64J02j38J53j50p3J83j05o2P9J40m35N00o8K0k49K31j49M9Q9
5155H4j33J45N0k20r0K2j44J34j7K83P8Q0k40L4K1P3o1j08P8j2R7l95J36J18j22
5180a09R6k9J30P3m00j6K64J56j77j2q2L93m50L52l44J05j4J96Kq4O7m4j58N0
5204c5J29j34K05N9m14n7L22j68K61l05K04n2j10J29K03l95J89p6R8l0r8L1j35
$$ plain form
5227 -179 348 -140 -95 -57 -60 11 150 -104 263 221 -13 150 64 -77 71 71 292 18 117 -325 -240 -33 -359 -83
5251 -83 16 211 24 -68 -37 14 -2 -29 -243 -12 61 268 -2 96 -24 2 -101 -285 112 60 -78 23 -78 -21
5275 -21 -225 -181 191 -206 100 -209 339 86 348 57 35 -74 392 -30 182 256 -236 19 9 -272 13 152
5297 152 1 -214 -43 -105 -53 -3 72 173 73 -160 240 156 -93 -19 66 26 -96 -56 -186 15 89 246 -147
5320 -147 95 -19 -80 -182 255 259 -92 -139 -18 -4 -51 -16 -109 68 -287 -1 155 107 138 -25 48 213 125 -201
5344 -201 64 217 -69 42 -60 89 -132 -159 130 -122 -46 -29 -71 -117 -168 179 -30 152 339 194 -253 -40
5366 -40 -37 39 -112 -78 -209 155 -73 98 105 -65 164 260 -8 107 171 -184 81 95 -34 31 33 -145 43 231
5390 231 49 -195 -22 -43 -216 -129 -183 116 134 -218 165 154 -43 79 -192 -5 170 -143 46 176 -49 -118
$$ packed form
5227a79N27m88M5L8lP1J39k54L67m2k34J63q6j41J48%K21k74R9m42Q5K07l26K76
5251h3R9J95j87r2L1N1j6k7k14K31P3K07k70R8j20K6j03j84L97n2j38J01j01N7
5275b1k04M4L72l97L06l09N48k53K62k91k2j09M66m22K12P4m92K55j0k81K85J39
5297A52j51k15J71o2N2N0P5J01j00k33M00q4k49P4Q5m0j22M0j30K01P4J57l93
5320a47K42j14o1j02M37Ml51m7J21J4m7L5r3J77l55K86J56m8L1j63P3J65q8l26
5344b01K65J53k86J11j02J49k21k7K89k52P6J7m2m6n1L47k09J82J87j45m47K13
5366d0LP6j51L4j31L64k28J71Pj70K29R6k68J15O4l55K65J4j29O5Kj78J88J88
5390B31j82k44J73k1j73Q7n4K99J8l52L83j1j97J22k71J87J75l13J89J30k25o9
$$ plain form
5412 -118 158 -13 160 53 59 -56 -279 -189 -177 166 -193 -68 -132 156 303 119 158 -45 32 -35 -203 -42 106
5435 106 -199 73 -13 145 15 -38 -148 -353 0 150 104 41 92 -131 106 115 -398 130 103 14 90 -47 -109 -120
5459 -120 61 -60 -80 -12 -20 -90 -194 283 35 -29 65 200 32 29 145 34 236 126 -243 325 135 6 -186
5482 -186 -247 -270 50 146 86 -123 5 -136 132 44 -28 -2 153 -251 -35 66 364 -25 -89 -2 -269 -105 -51
5505 -51 87 11 -75 113 -241 120 -227 -112 25 297 -351 -98 17 -32 -168 -118 130 -381 70 -316 -411 -148
5527 -148 90 160 -113 -214 -55 -10 26 414 -150 -28 -238 -211 5 -240 207 -63 119 -116 -151 112 76 322
5549 322 -172 -165 -93 63 -85 106 317 66 -217 99 -90 -19 131 -197 280 95 -50 -20 -99 -100 -57 112 68
5572 68 318 -248 -169 165 139 5 -303 152 -108 106 21 -139 -42 4 -124 36 132 -32 98 12 146 270 248
$$ packed form
5412a18K76j71J73j07Oj15k23R0J2L43l59J25o4K88J47j84L9k03P7o7j68J61J48
5435A06l05K72q6J58j30n3j10k05L53J50m6o3N1k23K37Rn13N28k7q9P6j37o2j1
5459a20J81j21k0O8qp0j04M77k48o4R4J35j68lJ16j11K02j10l69N68j90j29j92
5482a86o1k3L20R6o0k09J28j41K68q8p2K6J55m04K16J01K98l89o4Q7k67J64N4
5505e1J38p6q6J88l54L61l47J15J37K72o48K53J15m9j36N0K48n11M51l86r5K63
5527a48K38P0k73j01J59M5L6L88n64J22k10K7K16k45M47k70J82k35l5K63l6K46
5549C22m94PP2J56j48J91K11k51k83L16j89P1J50l28M77j85j45L0p9jM3J69m4
5572F8K50n66P9L34k6j34l08M55k60K14q5j60R7M6j28J60R6j64J30q6J34J24k2
$$ plain form
5595 248 -204 158 -34 216 -156 -3 46 23 129 -142 -43 112 -230 -133 -174 -44 173 -190 -187 200 26 -260
5617 -260 208 -106 54 280 62 -26 89 412 -28 -148 -33 -103 56 105 137 6 137 58 105 4 -89 -250
5639 -250 87 -164 -73 -281 79 119 -155 -99 85 -135 -76 115 129 -202 -53 94 13 84 -140 66 -146 -175 89
5662 89 78 40 -41 34 211 109 134 -84 -280 -91 -122 54 90 -6 -35 -46 11 -290 78 -110 -14 49 -132 -1 -22
5687 -22 245 -296 -50 195 303 -138 290 81 366 21 -329 20 -71 -51 -53 -196 67 150 -110 -42 -297 -115
5709 -115 57 -38 -207 30 149 -63 -69 61 100 137 99 58 28 235 -188 170 -110 -240 -206 -17 -27 -84 -12 39
5733 39 71 -190 89 83 -79 20 242 47 -209 212 -169 -46 174 -33 -55 163 98 68 95 62 231 -80 -119 29
5757 29 102 -91 -37 -8 -46 45 131 -38 171 163 -93 33 -151 54 164 -38 52 131 21 217 139 133 209 -79 17
$$ packed form
5595B48m52L62j92K50l72J53M9k3J06k71R9J55l42R7m1J30K17l63LL87j74k86
5617b60M68l14J60K26k18q8J15L23m40j20J15p0J59M9L2j31J31p9M7j01r3j61
5639b50L37k51R1k08L60M0k74N6J84k20N9J91J4l31J49J47q1P1k24K06k12k9K64
5662H9j1l8q1P5J77j02K5k18j96J89l1J76L6r6k9j1N7l01L68j88R6O3j81J31k1
5687b2K67n41K46K45J08m41M28k09K85l45l50L49r1K0kj43K63Q3k60O8k55J82
5709a15J72r5j69K37J19k12oJ30L9L7l8m1l0K07m23L58k80j30L4J89j0n7P2N1
5733C9L2k61K79oj62R9K22j95k56M21l81J23K20k07k2K18o5l0K7l3J69l11l9J48
5757B9P3j93N4K9l8R1Q6j69K09qk56J26j84K05J10k02R0P9j10J96p8oP6k88R6
$$ plain form
5782 17 42 -68 -95 -153 -105 -2 323 10 -72 30 80 -124 -133 56 -155 -265 25 -173 147 -108 43 -254 -50
5805 -50 -151 -74 -134 -163 -146 -120 -154 17 85 -61 173 93 -76 -23 -138 267 97 236 -381 -75 35 96 149 -149
5829 -149 -37 245 -17 -6 95 51 12 -351 103 -31 177 -69 -62 179 -199 -27 -164 -67 222 -149 -52 -258
5851 -258 199 -399 245 -137 27 -3 -80 -67 39 -164 -107 -64 -194 212 189 107 87 -39 -160 31 219 38 172
5874 172 239 -54 211 -99 -84 -8 -115 28 -66 -44 -99 -6 67 44 -49 79 110 228 388 31 387 144 -309 214
5898 214 354 48 -106 76 146 -175 -143 -56 125 20 -180 -18 6 -309 -65 -34 -310 -88 15 -150 223 7
5920 7 -200 -33 -98 -42 10 -182 -104 396 -88 64 60 -248 -51 144 -23 204 -70 -3 71 373 156 172 -83 226
5944 226 235 -201 4 -184 206 -118 10 187 9 -240 -17 -190 198 223 -132 -5 -273 -225 110 46 -84 271
$$ packed form
5782A7K5j10k7n8M8J03L25l13q2J02N0k04rJ89k11j10K90j98L20k55J51k97K04
5805e0j01P7o0k9J7K6l4J71O8j46K34q0j69N3j15M05j70J39o17L06J10O1N3k98
5829a49J12K82k62J1J01m4l9l63M54j34K08k46PK41l78J72j37R7K89l71R7k06
5851b58M57n98O44l82J64l0p7J3J06k03N7M3j30M06k3q2k0j26j21J91J88j81J34
5874A72O7k93K65l10J5P6j07J43r4K2n5R3P3k3r3J28L1J18J60l57L56k43m53N23
5898B14J40l06j54J82P0l21L2Q7J81j05k00J62K4l15K44L1k76K22J03j65L73k16
5920Gk07J67o5N6N2j92P8N00m84J52ml08J97J95j67K27k74O7P4L02k17J6k55L09
5944B26Rm36K05j88L90l24J28J77j78k49K23j73L88K5l55J27k68M8L35o4j30L55
$$ plain form
5966 271 92 55 -110 63 -109 278 74 -113 16 59 -56 -44 -108 103 14 -280 3 -13 -200 -41 118 -80
5988 -80 -76 -77 11 53 31 192 70 9 -176 -22 142 -29 64 -22 -108 137 -46 27 -48 191 -102 -469 -102 -10 -62
6013 -62 290 22 56 -146 217 -47 -133 -16 -73 59 -106 -73 -61 -24 53 82 25 -105 -36 -88 -75 187 237 58 -85
6038 -85 206 38 -30 -54 68 -213 -292 125 38 52 141 -138 -25 -263 37 -91 9 -255 176 132 -93 205 -146
6061 -146 -99 -230 113 -104 -199 -133 -306 18 -398 -143 182 -160 286 220 44 -52 33 15 103 -243 37 187 234
6084 234 37 -169 -152 -41 -129 -91 -127 -35 116 -27 -8 -221 97 -37 -92 -27 -43 -102 -206 -218 120 -123 -157 309
6108 309 19 -76 102 -14 246 16 -207 85 276 -5 -16 -141 314 -113 -57 257 -190 142 -10 13 32 123
6130 123 205 96 348 297 -10 169 25 10 154 -12 340 88 -1 198 159 123 204 -109 57 -1 -72 101 88
$$ packed form
5966B71j79l7j65J73j72L87k04j87J29M3j15J2o4K11q9k94K83j6j87J59J59j98
5988h0MjQ8M2k2J61j22o1j85J54J64j71R3q6q6K45j83P3p5K39k93l67L67R2n2
6013f2L52k68L4k02L63k64q6J17n7J32j65L3J2L7P7K9n7j30O9n2J3K62N0j79j43
6038h5K91j68o8k4J22k81p9M17q7J4Q9k79J13k38L00j28J00k64M31m4k25K98l51
6061a46M7j31L43k17r5O6j73L24m16K55L25l42M46o6j76r6Q5j8Q8l46K80J50M7
6084B34j97k06J7J11q8L8l6R2J51j43J9k13L18j34n5O5j6n9j04j2L38k43l4M66
6108C09k90r5J78j16K60k30k23K92J91k81j1j25M55m27N6L14m47L32j52K3J9R1
6130A23Q2j09K52n1l07J79j44j5J44j66L52k52q9J99l9l6Q1l13J66n8p1J73j3
$$ plain form
6153 88 82 -266 -48 60 33 -82 -132 -53 47 95 -185 198 55 -51 -224 -183 86 205 -54 71 123 -39 -39 132
6177 132 -226 -29 -116 -159 -101 -122 -174 62 290 107 78 -172 222 -38 25 -143 10 -132 98 100 144 -33 42 -27
6201 -27 -248 -90 -36 -177 -82 -42 55 133 -114 -33 -26 228 0 144 -199 -46 -130 -70 144 -11 158 -68 224 -326
6225 -326 -148 -158 -50 -78 -173 158 131 75 -101 -81 182 -10 25 -55 -119 105 130 31 61 -223 -92 26 154 -53
6249 -53 12 267 -279 -93 141 -51 -107 -120 -123 170 89 -128 -98 -340 106 167 -213 274 257 57 -122 56 -87
6272 -87 -165 -183 -127 244 5 75 -67 -81 92 -62 121 -27 277 228 -113 -277 -156 152 111 -114 -101 17 54
6295 54 -98 91 -353 158 155 -113 -180 10 -100 22 80 -141 -17 -131 59 -56 -23 91 -71 139 212 -311
6317 -311 287 -97 -106 -133 -130 -73 42 228 -4 201 93 -27 68 204 234 208 38 64 189 -240 -173 -103 -61 -83 266
$$ packed form
6153H8ol48K18J08k7j15n0P9J00M8k80L83j43j06j73M1K69J19k59J25N2j62%J71
6177A32l58J97q7m3N8k1n2K36K28j83k9k50L94k60O3j68J53j42K30KM4j77P5o9
6201b7k21J58N4j41R5M0R7P8k47Q1PK54k28J44l43J53q4O0K14j55J69k26K92n50
6225c26J78j0J08k8r5L31k7n6j76K0K63j92L5q0o4K24K5r9L0k84J31J18J28k07
6249e3O5K55n46J86K34j92n6j3lK93q1k17L0k42M46O1l80M87j7k00j79J78j43
6272h7p8j8N6L71k39P0j42j4J73j54J83j48L04m9l41j64J21L08m1k25J3J18L7
6295E4j52J89m44N11lk68o7J90j10J22N8k21J24j14J90j15L3J14j62K10P3n23
6317c11N98l84rk7LN7J15J86k32K05j08j20R5J36L0k6j70K6J25m29O7P0M2k2L49
$$ plain form
6342 266 220 -83 78 53 87 23 88 -24 -138 18 89 -5 -175 -145 -84 6 -62 2 112 50 28 284 -203 -59 -22
6367 -22 165 178 227 63 -75 -134 34 -175 151 -183 222 52 118 12 -4 -120 -328 -236 57 233 -171 -19
6389 -19 269 319 289 -67 10 146 198 240 33 -13 58 98 -62 139 22 192 -30 -309 -136 -8 101 20 124
6412 124 -139 -156 -14 346 33 38 379 -294 -95 -68 -100 89 -111 17 -54 -196 43 -279 31 59 -107 -55 -62
6435 -62 -91 84 -79 186 -177 80 -123 23 55 -3 61 52 120 20 -28 -252 68 51 -105 136 -76 66 228
6458 228 -108 104 65 90 -189 -22 -142 -25 -124 -114 51 145 15 -153 -67 230 -378 -99 -257 116 -31 -80
6480 -80 -102 -61 91 37 79 79 -51 16 97 -58 232 80 -159 15 261 -235 -244 198 -15 162 -74 -13 89 23
6504 23 103 374 -184 245 -82 -153 115 -7 154 460 -75 15 72 -36 -242 94 56 65 62 47 128 202 31 -31 189
$$ packed form
6342B66m6l03J61k5L4o4O5j12j14J56P1r4j70L0O1R0o8O4J10o2k2K56m87J44L7
6367b2J87J3M9j64j38n9J68k09L26l34M05j70O6j06j6j16k08R2K93J76m04J52
6389a9K88N0l0l56P7J36N2M2k07m6P1M0j60K01j17J70k22k79J73J28J09q1J04
6412A24k63j7J42L60l13NL41o73J99K7l2J89k00J28p1j42K39l22L10K8j66N2p
6435f2k9J75j63K65l63K57k03J46L2n8O4rO8j00m8k24L20j7j56K41k12J42J62
6458B28l36K12l9K5k79J67j20J17r9J0J65R4j30j68Q6K97o08K79j58L73j47m9
6480h0k2M1J52n4M2%j30O7Q1j55K90j52k39J74K46m96rM42k13J77k36O1J02o6
6504B3Q0K71n58M29l27p1K68j22J61L06n35R0N7j08k06L36l8Rlj5Q1P4j71o2K20
$$ plain form
6529 189 220 -71 -136 32 193 58 -56 281 96 -14 -71 39 -85 -30 292 -83 -26 108 -110 -57 80 -160
6551 -160 -44 -53 167 48 15 95 -269 147 -116 35 -84 -78 -153 -24 -206 -5 -100 13 -62 12 -56 -86 -64 -123 165
6576 165 -83 60 50 -80 68 -78 -231 80 112 -248 -184 -70 475 300 -138 -202 -207 231 144 -178 198 -47
6598 -47 -234 96 -181 -106 224 -27 -154 -53 -368 181 140 159 97 -196 -122 203 162 134 -4 -197 195 42 -114
6621 -114 235 -85 131 235 32 418 65 -90 67 251 -11 -104 -153 51 -160 -158 -62 -301 83 145 85 31 51
6644 51 -114 46 258 -26 -36 166 195 105 416 -146 184 3 -142 -271 37 77 -95 8 -55 -28 135 208 -171
6667 -171 189 -23 -2 50 171 2 -84 -314 85 -318 -53 -74 -19 -362 93 -123 182 -67 -48 -186 -189 63 -50
6690 -50 55 205 35 233 289 -80 129 237 -153 -159 -78 -80 4 252 142 201 199 39 174 -105 22 144 36 -18
$$ packed form
6529A89L1k91o5J68J61j35j14L37j85j10n7J10j24N5L22l75N7J34k18N3J37k40
6551a60J16rK20j19l3Q0l64M16k63J51j19Op5J29j82K01r5J13p5P4o8l0K2n9K88
6576A65k48J43j0j30J48j46j53L11L2l60O4J14N45j75m38o4nM38q7l22L76k45
6598d7j87L30k77P5L30k51j27J01l15N49m1J9o2k93P4L25m1k8j38j93L92j53j56
6621a14L49l20K16J04k03L86l53j55J57J84k62r3m9K04k11KR6k39L84O2o0n4K0
6644E1j65J60K12k84j0K02K9r0L11n62L30j81j45j29L08M0j72J03o3K7J63P3l79
6667a71L60k12K1N2J21j69q6k30L99m03K65k1N5l43M55k16L05k49J9j38lK52j13
6690e0J05J50j70J98N6l69K09J08l90oQ1kQ4K48j10N9kj60J35k79J27J22j08n4
$$ plain form
6714 -18 82 111 -127 -53 -153 -322 -56 367 43 -124 -45 -214 -75 136 -117 147 -223 10 154 91 11 -200
6736 -200 -115 -284 34 206 -11 -139 -220 -274 70 -122 -308 -124 102 155 -24 -31 -104 128 112 -105 -152 157 -36
6759 -36 174 233 146 -17 -133 112 -26 104 44 -123 -107 -448 70 197 -105 -27 -90 -184 -178 -252 195 -401 170 70
6783 70 -156 -31 24 56 -33 109 -353 -34 16 -122 20 -492 -151 106 40 177 136 53 -147 80 -40 47 -63
6806 -63 -46 163 11 -21 95 119 41 -58 173 -52 89 122 -150 -114 -245 296 59 241 230 -165 177 157 131 -125
6830 -125 -31 44 228 -75 159 363 102 250 48 229 6 -84 -165 136 -139 20 -83 -73 -179 -116 -146 227
6852 227 185 -56 240 -195 -137 -151 -150 -117 189 20 136 322 212 254 167 -322 -90 326 35 -136 -80 -333 -1
6875 -1 -137 96 18 114 -123 -48 163 -77 32 -137 135 268 -74 14 -51 37 -98 50 109 163 -260 103 224
$$ packed form
6714a8J00K9k38P4j00j69K66M23l24j67P9j69J39K11k53K64l70K33J44o3q0k11
6736b00Q5j69L18J72k17j28q1n4L44j92j86J84K26N3j79pp3K32j6k17m7L09j93
6759c6K10N9q7j63j16K45j38J30o0j67J6l41N18J27l02P8o3r4Op4M47n96N71j00
6783G0k26J25N5L2q9J42m62L19N0j38J42n12L41K57o6J37m1q3k00K27j20Q7j10
6806f3J7K09j52l2J16K4p8r9K31k25J41L3k72L6j31N41k37J82j1l95L42k0k6k56
6830a25R4P5J84l03K34K04k61J48k02J81k23r0q1L01k75J59j03J0j06O3l0L73
6852B27m2k41K96m35N8j4JL3L06j69J16J86j10M2q7m89K32M16k91j71N6k53L32
6875aj36K33p8R6k37P5K11k40J09j69K72J33l42Q8o5Q8j35J48N9N4m23L63J21
$$ plain form
6898 224 -7 144 -135 347 -96 95 191 -49 258 -7 53 223 -323 66 161 170 42 80 3 313 242 8 -139
6921 -139 -153 -180 10 -95 123 170 -111 173 56 -220 -4 48 -91 134 50 -303 -83 187 244 174 70 87 251
6944 251 -274 15 -231 -58 -73 92 -37 -66 85 -111 -96 142 83 -200 53 2 71 161 -21 -51 99 -299 -99
6967 -99 -45 11 158 -44 66 -24 -197 -109 171 -9 -184 -10 -157 154 82 11 -120 -1 252 53 58 8 -58 235
6991 235 12 65 -275 -219 170 -208 88 -179 -130 12 -77 19 -12 223 -16 165 6 -76 -163 208 85 102 -67
7014 -67 -56 149 8 95 -156 139 100 15 21 105 -137 -63 284 45 -23 157 -72 59 75 14 -44 177 -115 14
7038 14 -128 154 -202 128 147 162 -48 -49 240 -260 -15 -62 52 26 -166 73 -69 120 -98 88 -116 36
7060 36 167 2 -194 -195 20 82 5 -27 94 -37 65 -128 271 49 226 -27 -11 38 -35 143 5 156 -126
$$ packed form
6898B24k31J51k79M82m43J91R6k40L07k65O0J70n46L89R5Rj28L8p7L10p1k34j47
6921a39j4k7J90j05K18M7k81K84j17k76K16N2j39K25q4l53K20K70N7p0j04J7J64
6944B51n25K89k46J73j5J65j29k9J51j96J5K38n9k83K53n1O9R0j82l0J50l98K00
6967i9N4N6J47k02J10r0j73Q8K80j80j75J74j47L11p2p1j31J19K53j99Nn0o6K93
6991B35k23N3l40N6L89l78K96k67M9J42q9R6l1K35k39J81j59q2q7L71j23J7j69
7014f7J1K05j41Q7k51K95l9q5OQ4k42P4L47k39o8J80k29J31J6o1n8K21k92J29
7038A4j42K82l56L30J9J5k10jK89n00K45m7J14k6j92K39j42J89k18J86k04J52
7060C6J31j65j96jK15O2p7l2J21j31J02j93L99k22J77k53J6M9p3J78j38J51k82
$$ plain form
7083 -126 -83 -197 -9 -55 138 -208 -91 -158 186 -45 -154 32 35 141 -129 -19 190 9 -101 -3 15 176
7105 176 -25 -163 201 60 -26 -176 -133 -200 -31 -16 184 37 -27 54 48 108 166 53 -84 -244 -198 326 -188 22
7129 22 11 -68 -106 206 26 37 -73 103 374 51 -38 -214 110 -71 -189 -169 -152 -72 -98 -35 -104 -103 -110 -20 35 -130
7155 -130 86 168 85 143 115 46 202 45 62 45 -126 -147 -2 -88 186 252 111 156 417 54 -216 38 -18 152
7179 152 3 68 71 22 101 96 94 -98 53 -63 121 257 -221 -387 -172 20 63 -101 -67 127 -148 141 -96 191
7203 191 304 32 91 -215 30 74 153 142 335 18 1 -99 -31 299 49 2 -95 -191 -11 87 -114 -55 69 -237
7227 -237 -274 -126 -76 134 115 -206 -43 32 191 22 70 -56 140 -43 -87 -217 -159 -329 -219 -97 -27 -182 -106
7250 -106 45 65 -113 -20 229 223 258 184 -107 147 86 -276 -91 -208 140 -124 205 52 52 -99 -53 -178 58
$$ packed form
7083a26M3j14J88m6J93l46J17o7L44k31j09J86LJ06k70J10K09j81j10R8J8J61
7105A76k01j38L64j41q6j50M3o7J69J5K00j47o4Q1oO0N8j13j37j60M6N24n14K10
7129B2j1p9l8L12j80J1j10J76K71l23q9j76L24j81j18K0J7Q0k6O3o9JpR0N5j65
7155a30K16Q2q3N8k8o9J56j57J7j7j71k1J45q6K74O6j41M5K61l63k70K54n6J70
7179A52j49O5Lm9P9nkj92J51j16J84J36m78j66K15J92M3j64L4J94k75K89k37K87
7203A91J13k72N9l06K45M4P9j1J93l17j7j00O8L30k50m7r7r6J80R8k01N9J24l06
7227b37l7J48N0K10j9l21J63P5J59j69M8j26J96j83m4j30N8j70J10J22P0j55P6
7250a06J51K0j78R3K49oL5p4k91K54o1l62J85j17L48k64L29j53%j51M6j25K36
$$ plain form
7273 58 100 -207 -80 -164 193 62 63 145 -137 133 -207 302 16 -45 -153 128 320 143 47 79 116 -315 96
7296 96 90 54 -113 4 175 -188 162 -58 214 -134 -126 84 115 -92 -16 -65 192 172 -210 -112 -187 174 97 -75
7320 -75 -112 101 7 -59 -72 -233 130 -161 -75 143 -245 178 54 -377 -60 165 -187 -113 212 106 -80 -209
7342 -209 -199 57 166 -28 99 35 -50 88 -237 49 -49 -116 30 46 -82 -96 402 -29 -69 124 10 -114 -58
7365 -58 -38 14 -113 -121 -154 74 -52 14 135 7 188 -275 -116 -151 -23 30 -107 42 119 114 159 -129 -33 0 213
7390 213 -284 -117 143 30 65 87 43 -211 -71 9 223 9 178 -66 315 201 -68 -91 70 -306 51 87
7412 87 -118 182 -138 171 -26 292 175 -88 -59 -58 31 233 -52 205 -156 111 -70 -27 50 11 -165 93 164
7435 164 -90 -114 132 222 38 -230 37 65 -17 -122 -87 -120 188 -55 141 -75 60 174 -146 -102 -179 37 -45
$$ packed form
7273E8M2l07J27q4L57j31JQ2k82K70l40N09k86o1j08K81J92j77r6L2L7m31M11
7296I6ol6j67J17J71l63L50k20K72l48QK10L1k07P6m9K57k0l82R8p5L61p7j72
7320g5l7K13r4o6j3j61L63k91Q6K18l88M23j24m31L17K25l52P4L25j06j86j29
7342b09J0K56J09j94J27o4q5J38l25K86r8o7J46J6j28j4M98m31m0J93j14j24N6
7365e8K0N2j27ql3K28j26O6J21j28J81m63J59l5J28N3j37J49P7nM5k88R6L3K13
7390B13m97J67K60j13L5K2m4k54J40Q0K14k14J69k44L81j14k69k3J61l76L57L6
7412H7k05L00l20L09j97L18j17k63K9JQ9K02k85K57l61K67j81M3P7l9j76K58P1
7435A64k54k4K46R0j84k68K67K8q2j05L5l3L08k43J96k16J35J14l20M4p7K16q2
$$ plain form
7458 -45 105 253 -38 -127 85 -29 36 236 324 91 -49 100 -143 153 -76 -244 -6 189 -63 -133 27 -9
7480 -9 -167 32 -178 2 166 -9 86 189 88 224 24 -19 86 -46 144 -95 -102 -27 -36 102 -78 30 -5
7503 -5 87 -143 -105 -119 -8 -41 -245 -236 78 75 -143 -235 -90 41 136 -21 -117 -68 77 52 -347 21 -85 11 25 -162
7529 -162 -105 23 29 -276 128 112 -34 153 -211 138 152 39 -113 -90 -84 -138 21 185 81 51 304 -100 141
7552 141 192 144 -264 119 -80 101 121 -59 -127 -2 167 176 -47 171 -101 -143 78 -219 222 177 -33 -262 211
7575 211 56 -119 -202 14 11 64 -41 218 111 19 -65 101 194 -175 -220 48 109 -119 35 28 128 -230 122 123
7599 123 93 -219 -230 396 -92 -163 56 -99 120 -93 -117 140 -224 225 47 -71 9 88 -141 95 -355 107
7621 107 224 -45 273 34 37 -66 90 86 14 -76 -114 -11 31 -94 -269 114 -188 70 -28 41 75 221 198 -240
$$ packed form
7458d5J50J48k91q9K12j14O5K00Q8k33j40J49k43K96k29j68K38J95k52p0J60l6
7480ij58J99k10J80J64j75R5J03j01J36k00m3J05j32J90k39pP5rJ38j80J08l5
7503eR2k30L8j4J11l3k04RL14lk18r2J45J31R5j57r6M9J45k5l99L68j06R6J4j87
7529a62N7J28Ol05M04j6j46J87l64L49J4j13j52K3On4J59J64j04l0K53m04K41
7552A41N1m8m08L83j99J81K0j80o8J25J69Rk23K18k72m2K21k97M41m5k10k29M73
7575B11j55j75q3K16lN3j05K59j07r2q4J66R3l69m5K68O1k28J54pJ00l58L52J
7599A23l0l12j1O26m88p1K19j55K19k13k4K57l64M49j78j18Q0P9k29K36m50M62
7621A07J17k69L18k39Lj03J56mp2r0l8J03M2j25j75L83l02K58r8O9L4J46k3m38
$$ plain form
7645 -240 -149 -202 -70 217 90 131 -216 74 -14 120 -9 -71 289 250 39 52 87 357 217 -400 -71 152 -79
7668 -79 29 -218 27 -57 208 -3 -84 44 59 23 90 -45 -261 -141 -103 84 17 -28 138 122 159 93 29 37 102
7693 102 1 209 -79 -247 105 -31 50 160 221 242 35 203 -393 -59 -169 162 314 30 -234 36 161
7714 161 103 67 -87 -164 -210 -138 -79 -194 -141 138 178 29 197 281 278 -57 -63 94 -47 178 218 -168 -187 -92 -165 1
7740 1 -20 -128 -56 214 2 -157 88 225 -246 -84 -60 90 292 37 234 144 65 -183 -48 226 -275 115
7762 115 162 -56 202 64 -77 -280 131 -193 73 45 -83 18 202 82 37 61 -50 23 -149 -69 -3 -4 -130
7785 -130 -1 333 17 -74 250 -135 -134 -5 8 -76 67 -87 15 267 190 4 -81 69 -41 -15 -134 38 -216
7808 -216 -69 -177 16 -144 -135 69 -121 6 85 -44 81 72 171 36 -312 102 100 -149 -124 -122 -117 102 -240 170
$$ packed form
7645b40R1n3J32K87j27M1l47K90q8J34j29o2L60l9k11J3L5K70j40o17L29K23k31
7668g9J08k47K45q4K65k11q1J28J5l6O7j35k16J20L8J87o7m5J66j6L7o6o4QO5
7693A02j01K08k88j68L52j36Q1J10O1K1k07J68n96L34j10L31J52k84k64K70J25
7714A61n8l6j54p7m6P2N9j15N3K79M0j49J68Q4ll35oJ57j41K25M0l86j9R5p3J66
7740Ak1j08P2K70k12j59K45J37m71J62K4J50K02k55J97r0p9k48J35K74n01L90
7762A15M7k18K58j38j41k03M11l24K66k8j28J01J84j20m5K4j11P3j72Q0O6jj26
7785a30J29L34l16r1L24l85JJ29J3q4J43j54J02K52p7j86q5J50j10K6j19J72k54
7808b16J47j08J93j60RK04j90J27P9j29J25rR9j35l48M14kk49K5KNK19l42M10
$$ plain form
7832 170 -275 -88 29 -51 -88 -79 -106 -36 397 116 92 1 5 130 16 -302 -137 -30 -130 -4 -36 81 -99 77
7856 77 -151 -380 251 473 26 -6 -88 -356 -308 33 78 66 29 79 55 113 36 1 102 104 -47 -51 83 20 -193 -328
7882 -328 -7 -372 133 139 -201 -112 204 -205 206 -34 -218 -92 66 -178 -269 -5 -216 39 -17 -146 22 -30
7904 -30 58 -25 51 -232 55 -156 -121 -84 127 -27 100 -79 86 39 98 121 7 37 -12 51 85 144 -292 87 53
7929 53 -59 54 62 97 -124 -123 -9 -74 -149 -92 -41 -89 11 -64 52 -44 202 78 33 -19 147 129 -18 13 -215 -56
7955 -56 -8 385 -128 25 -71 2 193 9 -58 114 164 117 78 15 198 -4 16 72 167 10 193 210 -21 -114 146
7980 146 -44 -136 186 -233 96 -378 -37 92 -156 289 102 -222 334 87 177 -41 320 -166 -117 134 0
8001 0 -22 156 27 -84 88 46 -4 -224 210 -40 -134 -255 -19 -278 116 -28 182 -37 -254 282 -83 -126
$$ packed form
7832A70m45J87J17q0l7Rk7P0M33k81k4r1MJ25j14l18J65J07j00J26l2J17j80J76
7856G7k28k29O31K22m47l2q2k68M8L41M5j2l7N0k4N8p7l5J01Kj51mJ34o3k13j35
7882c28L21l65N05Ol40Q9L16m09M11k40j84J26J58k44r1K64k11K55n6j29J68n2
7904c0Q8q3P6k83K87k11L5L7K11j54J27j79J65m7N9K3j14L0m9O3L4N9m36L79l4
7929E3j12J13QL5k21JJ14o5p5N7N1m8J00p5J16r6K46j24m5n2J66j8j47L1k28J59
7955e6M8L93n13J53r6P3J91j84o7J72N0m7l9o3J83k02K0N6R5j57J83J7k31r3K60
7980A46j90r2L22m19L29m74L41J29k48M45j87l24N56k47R0k18L61m86M9K51j34
8001@k2J78j29j11J72m2n0k20M34k50r4j21K36k59L94j44K10k19k17N36l65m3
$$ plain form
8023 -126 -46 116 -31 61 -127 -99 4 16 -197 114 -249 -241 -156 210 -59 46 -115 -179 165 -58 -183 -140 33
8046 33 138 54 -285 52 -12 47 -1 -127 -137 -131 -290 353 85 208 125 160 78 -198 -75 55 52 58 353 -87 -49
8071 -49 110 89 139 13 -160 -290 55 -23 -3 -232 -143 -158 44 61 10 -177 202 -203 -304 -80 5 108 270
8094 270 211 -104 130 62 99 15 38 -176 -79 152 32 39 190 14 173 363 -17 -121 96 -96 -195 146 -17
8117 -17 47 -20 42 143 -119 -70 -54 -160 -43 228 82 -307 -55 -434 75 -245 11 119 -89 -145 -158 -306 -20
8140 -20 -112 130 53 -149 -149 -64 142 178 38 -273 -105 -31 62 204 19 -104 -170 -138 27 -32 74 161 -62 -159 226
8165 226 286 141 419 -13 -131 232 34 -41 87 -18 159 248 -36 39 -261 -175 62 285 123 -55 -84 159
8187 159 21 180 -177 184
$$ packed form
8023a26Q0J62j47R2j88K8J03J2k13L11l63QQ5L66k69J05j61o4L44k23j25M3J73
8046C3J05q4l39L37o4N9m8j26j0Oj59O43k68J23q3L5q2k76J23J30lOK95m40L8
8071d9J59k1N0j26j73j30L45p8K0k29Q9j5K02J7n1j87L79m05j01K24Q5J03J62
8094B70n9l15K34o8L7q4K3k14R7K31j20PJ51j76J59J90l80j04K17j92r9L41j63
8117a7O4o7O2J01k62M9J6j06J17K71j46l89K52l79N09l20K56J08k08n6j3j48K86
8140b0r2K42p7k02%Q5K06L6j40l11J68P4R3J42j85j23o6L2J65n9J06Q7k23r7L85
8165B26O0j45K78m32j18L63j98p5J28j05J77Q9k84P5l00Q6K37K23j62j78k9K43
8187A59j38J59l57L61
8191A84
$$ Imaginary data points
##PAGE= N=2
##DATA TABLE= (X++(I..I)), XYDATA
$$ plain form
0 0 0 0 0 0 0 0 0 0 0 0 0 0 0 -8 8 -8 8 -8 16 -16 18 -24 26 -32 40 -48 52 -63 72 -80 90 -105 120 -136 153
35 153 -170 194 -216 242 -269 299 -333 368 -408 450 -499 552 -607 669 -737 812 -895 988
53 988 -1088 1203 -1331 1479 -1647 1844 -2077 2356 -2698 3132 -3699 4480 -5628 7483 -11010
68 -11010 20218 -103879 -226994 -185942 -188890 -147385 -129894 -87628 -64423 -28954 -3038 21149
80 21149 38932 57739 61435 72699 71096 77531 82332 83761 86253 83365 72715 62858 42702 29330
94 29330 11390 -3546 -11003 -20474 -24038 -20873 -18470 -4580 6722 20549 33424 36416 37983 31320
108 31320 19295 9890 -5758 -15465 -25328 -36882 -40294 -46403 -48072 -43125 -40719 -32977 -29034 -26918
122 -26918 -23042 -25467 -21842 -17610 -12357 123 7431 18265 27835 31051 38602 40027 38986 37233
$$ packed form
0@%%%%%%%%%%%%%qJ6j6J6j6K4l2L4m2N0n8P2q8J00j15J35j52J70j95K25k56K89
35A53l23L64m10M58n11N68o32P01p76Q58r49J051j159J276j406J549j707J883
53I88k076K291k534K810l126L491l921M433n054N830o831Q179j0108J3111j8493
68a1010L1228j24097j23115M1052k948M1505J7491M2266K3205L5469K5916K4187
80B1149J7783J8807L696J1264j603O435M801J429K492k888j0650r857k0156j3372
94B9330j7940j4936p457r471l564L165K403J3890J1302J3827J2875K992J567o663
108C1320j2025r405j5648r707r863j1554l412o109j669M947K406P742L943K116
122b6918L876k425L625M232N253J2480P308J0834R570L216P551J425j041j753
$$ plain form
136 37233 26998 18116 4566 -9259 -15397 -22797 -22014 -17606 -14238 -4931 371 6698 15101 18610
150 18610 25304 26834 25351 25134 18918 17231 15450 12918 16738 14960 13528 11236 3510 -1608 -10026
165 -10026 -17141 -21021 -28875 -31650 -34585 -37192 -31647 -27626 -18105 -7322 -329 8995 11313 12194 13497
180 13497 10108 10682 8596 5632 6424 2150 2892 4026 4524 9591 10480 11511 11576 5841 3588 -1394 -5477
197 -5477 -4399 -6803 -4938 -3804 -4695 -620 -203 2483 5832 4386 5269 1060 -3530 -5902 -11191 -10192
213 -10192 -9309 -8219 -3880 -3226 -816 2151 2002 5333 4531 2894 1651 -4357 -6761 -11213 -13831 -11258
229 -11258 -11305 -7941 -4892 -4596 -1561 -1870 -205 1712 856 2880 1739 -238 865 -207 3198 6210
245 6210 8193 12663 11833 11205 9621 5057 4203 3 -2746 -4331 -9141 -10007 -10857 -11357 -7571 -5465 -1477
$$ packed form
136C7233j0235q882j3550j3825o138p400P83M408L368R307N302O327Q403L509
150A8610O694J530j483k17o216j687j781k532L820j778j432k292p726n118q418
165a0026p115l880p854k775k935k607N545M021R521J0783O993R324K318Q81J303
180A3497l389N74k086k964P92m274P42J134M98N067Q89J031O5n735k253m982m083
197e477J078k404J865J134q91M075M17K686L349j446Q83m209m590k372n289R99
213a0192Q83J090M339O54K410K967j49L331q02j637j243o008k404m452k618K573
229a1258m7L364L049K96L035l09J665J917q56K024j141j977J103j072L405L012
245F210J983M470q30o28j584m564q54m200k749j585m810q66q50n00L786K106L988
$$ plain form
262 -1477 1219 634 2175 -428 -1013 -450 -2384 -705 -1938 -2518 -1203 -2317 -372 1720 2142 4818
278 4818 3345 1778 -29 -3956 -3402 -4541 -3931 -1421 -1523 1195 2579 3291 6688 7470 9288 10387
294 10387 7760 6732 3123 1108 802 -502 1633 2050 1580 3499 1812 2481 2822 1741 3213 812
310 812 -544 -1929 -5223 -4423 -4553 -3081 588 634 2622 2927 1772 2825 1663 2185 2059 -393 114
327 114 -2479 -3738 -2457 -2906 274 1696 1444 2606 -165 -468 -1285 -2756 -1496 -2424 -2627 -1794 -3263
344 -3263 -792 574 2260 6071 6294 7645 7199 4663 4462 1900 1389 1535 -693 -511 -2346 -3629 -2782
361 -2782 -3864 -1931 -1334 -2003 -1774 -3835 -4171 -4356 -4933 -1777 -734 682 3046 2470 4061 4653 4611 6055
379 6055 4047 3294 486 -3184 -4768 -8122 -8619 -7889 -8709 -6627 -7305 -7132 -5449 -5456 -3165 -999 -678 1458
$$ packed form
262a477K696n85J541k603n85N63j934J679j233n80J315j114J945K092M22K676
278D818j473j567j807l927N54j139O10K510j02K718J384P12L397P82J818J099
294A0387k627j028l609k015l06j304K135M17m70J919j687O69L41j081J472k401
310H12j356j385l294Q00j30J472L669M6J988L05j155J053j162N22j26k452N07
327A14k593j259J281m49L180J422k52J162k771l03q17j471J260r28k03Q33j469
344c263K471J366J686L811K23J351m46k536k01k562n11J46k228J82j835j283Q47
361b782j082J933N97o69K29k061l36j85n77L156J043J416K364n76J591N92m2J444
379F055k008p53k808l670j584l354m97P30q20K082o78J73J683pK291K166L21K136
$$ plain form
397 1458 329 1196 2544 2124 4559 5382 6317 7226 5152 4356 2603 147 -32 -2040 -2801 -4113 -6427
414 -6427 -6128 -6817 -5949 -3086 -2499 662 1094 1059 2045 760 1681 2288 1296 2740 801 135 -82 -1158
432 -1158 503 535 870 1697 -192 -48 -1379 -2359 -476 -996 837 2398 1838 3408 2829 3465 4822 4060
450 4060 5017 3844 1249 188 -2750 -3173 -3567 -4396 -2981 -3724 -3384 -2665 -3111 -1110 -324 1297 3111
467 3111 2437 3052 2956 2175 4256 4481 5223 6046 5202 4840 2807 1411 1463 -384 -412 -1804 -3761 -4169 -6205
486 -6205 -5479 -4429 -4113 -1613 -1355 -577 88 -535 733 1263 1563 3003 2403 2427 2368 1650 2894 2997 3922
505 3922 5153 4028 4607 3203 2118 2587 979 2051 1759 401 808 -913 -1172 -1160 -1709 -646 -1631
522 -1631 -2645 -3411 -5823 -5909 -6287 -6634 -5080 -5642 -4636 -4314 -4810 -3172 -2538 -947 723 225 1421 454
$$ packed form
397A458j129Q67J348m20K435Q23R35R09k074p96j753k456j79k008p61j312k314
414f427K99o89Q68K863N87L161M32l5R86j285R21O07r92J444j939o66k17j076
432a158J661L2L35Q27j889J44j331r80J883n20J833J561n60J570n79O36J357p62
450D060R57j173k595j061k938m23l94q29J415p43L40P19m46K001P86J621J814
467C111o74O15r6p81K081K25P42Q23q44l62k033j396N2j847k8j392j957m08k036
486f205P26J050L16K500K58P78O65o23J268N30L00J440o00K4n9p18J244J03R25
505C922J231j125N79j404j085M69j608J072k92j358M07j721k59J2n49J063r85
522a631j014p66k412q6l78l47J554n62J006L22m96J638O34J591J670m98J196r67
$$ plain form
540 454 -470 323 -157 975 2270 1812 2936 1661 1647 2097 1226 2767 2711 2189 2535 884 1440 1083 778
559 778 2451 1751 2326 1511 -521 -733 -1813 -2475 -2007 -3556 -3678 -5125 -6365 -5788 -6507 -4635 -3481 -2641
577 -2641 -1311 -1673 -976 -541 -414 1411 1980 2106 3088 1235 1802 1334 1168 2459 1763 1737 1555 -462 -783
596 -783 -1626 -1652 -670 -920 476 284 -673 618 558 1402 2480 2402 3245 1733 1003 428 -1162 -183 -437 -726
616 -726 -128 -1421 -1030 -1351 -1539 580 601 1945 2621 1694 2746 2433 2838 4325 4098 5029 4771 3651 3482
635 3482 1461 1209 805 -586 -680 -2277 -3320 -3885 -5321 -4788 -4280 -3427 -2213 -2726 -1777 -1633 -1339 604
653 604 80 1394 2250 1480 1923 1138 824 1625 1006 1912 1319 -12 165 -1231 -1032 -411 -958 622 303
672 303 681 1067 779 1808 2589 3038 4485 3711 3640 3031 1694 1445 411 415 229 -1401 -1484 -2937 -4054
$$ packed form
540D54r24P93m80J132J295m58J124j275j4M50q71J541n6n22L46j651N56l57l05
559G78J673p00N75q15k032k12j080o62M68j549j22j447j240N77p19J872J154Q40
577b641J330l62O97M35J27J825N69J26R82j853N67m68j66J291o96k6j82k017l21
596g83q43k6R82k50J396j92r57J291o0Q44J078p8Q43j512p30n75j590R79k54k89
616g26N98j293L91l21j88K119K1J344O76r27J052l13M05J487k27R31k58j120j69
635C482k021k52m04j391r4j597j043n65j436N33N08Q53J214n13R49J44K94J943
653F04n24J314Q56p70M43p85l14Q01o19R06n93j331J77j396J99O21n47J580l19
672C03L78L86k88J029P81M49J447p74p1o09j337k49j034Mj86j630q3j453j117
$$ plain form
691 -4054 -3385 -4158 -3370 -3370 -3701 -3064 -4576 -3751 -2460 -2497 -459 -155 211 747 -61 714 1072 1211 1961 760
711 760 838 238 -929 -521 -1217 -634 -47 -680 -332 -1111 -1159 -633 -1158 -144 164 -263 336 -874 -719 -286
731 -286 -648 920 696 517 672 -675 -724 -796 -1121 181 -519 -187 -81 -1309 -534 -556 22 1025 925 1524
751 1524 1112 495 858 -3 799 1386 719 1178 466 5 535 90 739 789 681 571 -571 -336 -894 -1178
771 -1178 -179 -765 -367 -226 -1094 -556 -855 -664 289 83 662 252 -342 -111 -697 49 763 873 1388 911
791 911 514 629 273 1200 1686 1121 1896 853 651 664 315 1212 1198 1391 1695 608 826 510 207 869
811 869 390 603 616 -150 255 -696 -95 286 218 1148 279 159 311 -569 -40 -32 -22 460 -731 -758 -721 -1380
833 -1380 -610 -822 -702 -222 -1001 -1103 -1250 -1895 -805 -691 6 31 -571 53 -770 -268 665 272 1325 570
$$ packed form
691d054O69p73P88%l31O37j512Q25J291l7K038L04L66N36q08P75L58J39P50j201
711G60P8o00j167M08o96N83N87o33L48p79m8N26n25J014L08m27N99j210J55M33
731b86l62J568k24j79J55j347m9p2l25J302p00L32J06j228P75k2N78J003j00N99
751A524m12o17L63q61Q02N87o67M59p12m61N30m45O49N0j08j10j142K35n58k84
771a178R99n86L98J41q68N38k99J91R53k06N79m10n94K31n86P46P14J10N15m77
791I11l97J15l56R27M86n65P75j043k02J3l49Q97j4J93L04j087K18l16l03O62
811H69m79K13J3p66M05r51O01L81o8R30q69j20J52q80N29QJ0M82j191k7L7o59
833a380P70k12J20M80p79j02j47o45J090J14O97K5o02O24q23N02R33l93J053p55
$$ plain form
853 570 379 338 -873 -427 -379 -830 83 -681 -669 -941 -1440 -1008 -1240 -258 99 -752 -41 -655 -716 751 169
874 169 1113 1088 760 1406 824 495 873 273 796 102 -198 -405 -1671 -1187 -1279 -1213 -252 -645 -226 -200 -940
895 -940 -174 -267 354 846 385 1022 179 -458 -28 -674 -64 -221 -962 -1038 -2444 -2284 -1978 -2382 -1505 -1602 -1291
916 -1291 -805 -1236 -421 41 479 1598 2071 2121 2760 1902 2626 1962 2361 2931 2006 2121 1591 652 505 -93
936 -93 672 811 18 819 51 -450 -139 -283 847 1215 1239 1647 617 1223 643 353 1138 618 285 -155
956 -155 -1239 -1272 -1982 -2308 -1780 -2285 -1844 -2187 -2667 -1818 -1911 -1350 -626 -140 525 404 721 1423 1086 2359
976 2359 2773 2876 3095 2297 2265 1977 1351 1673 1496 1341 1029 -24 307 -467 -449 127 -403 145 -311 -866
996 -866 -640 -1354 -989 -487 -1103 -480 -1182 -1432 -1356 -2008 -1403 -1360 -1127 -977 -1278 -1205 -1008 -1746 -640 -590 148
$$ packed form
853E70j91m1j211M46M8m51R13p64J2k72m99M32k32R82L57q51P11o14o1J467n82
874A69R44k5l28O46n82l29L78o00N23o94l00k07j266M84r2O6R61l93M19K6p40
895i40P66r3O21M92m61O37q43o37M30o46O10j57p41p6j406J60L06m04Q77r7L11
916a291M86m31Q15M62M38J119M73N0O39q58P24o64L99N70r25J15n30r39j47n98
936i3P65J39p93Q01p68n01L11j44J130L68K4M08j030O06n80k90P85n20l33m40
956a55j084l3p10l26N28n05M41l43m80Q49r3N61P24M86O65j21L17P02l37J273
976B359M14J03K19p98l2k88o26L22j77j55l12j053L31p74J8N76n30N48m56n55
996h66K26p14L65N02o16O23p02k50P6o52O05M3K33J50l01P3J97p38J106N0P38
$$ plain form
1017 148 748 135 552 210 544 998 752 1064 1196 485 789 53 29 279 -305 309 -330 -679 -415 -1434
1037 -1434 -641 -711 -702 -222 -645 -771 -738 -854 -566 -818 -242 359 -554 -28 -511 -862 -182 -540 -215 -184 -613
1058 -613 -255 -845 -783 -332 -838 387 -111 80 104 -486 144 92 218 984 666 912 1238 511 1385 894 1283
1079 1283 2057 1501 1817 1400 934 885 662 952 1088 280 432 -362 -628 -599 -1219 -762 -1252 -1172 -1216 -1972 -1941
1100 -1941 -1686 -1628 -981 -1407 -722 -755 -1135 -232 -374 -15 516 517 999 1317 643 1198 1096 1568 1553 1729 1945
1121 1945 1518 1181 1439 1297 1572 1296 1196 1446 466 642 412 130 523 165 340 196 -754 -274 -648 -507
1141 -507 46 -679 -108 -153 -646 -550 -971 -545 -376 -543 -17 -382 -910 -718 -1095 -654 -482 -577 -420 -1119 -767
1162 -767 -975 -1177 -212 -476 -135 -292 -504 -89 -281 -12 633 460 1109 824 413 815 415 694 617 404
$$ packed form
1017A48O00o13M17l42L34M54k46L12J32p11L04p36k4K50n84O14o39l49K64j019
1037a434P93p0RM80m23j26L3j16K88k52N76O01r13N26m83l51O80l58L25L1m29
1058f13L58n90O2M51n06J225m98J91K4n90O30n2J26P66l18K46L26p27Q74m91L89
1079A283P74n56L16m17m66m9k23K90J36q08J52p94k66K9o20M57m90Q0m4p56L1
1100a941K55N8O47m26O85l3l80R03j42L59N31JM82L18o74N55j02M72j5J76K16
1121A945m27l37K58j42K75k76j00K50r80J76k30k82L93l58J75j44r50M80l74J41
1141e07N53p25N71m5m93R6m21M26J69j67N26l65n28J92l77M41J72r5J57o99L52
1162g67k08k02R65k64L41j57k12M15j92K69O45j73O49k85m11M02m00K79p7k13
$$ plain form
1182 404 729 286 130 121 -851 -45 -291 -423 91 -633 -606 -594 -1027 -472 -205 -66 19 -630 -354 -425 -426 20 -434
1205 -434 130 13 -530 -115 -821 -567 -601 -542 70 -472 -483 -321 -845 31 -349 -200 301 -17 267 123 -252
1226 -252 162 165 269 288 -239 68 -283 -485 -264 -495 317 387 -421 -109 -469 -151 441 -233 797 608 462
1247 462 866 209 652 700 735 1043 680 514 436 261 371 314 427 714 169 364 70 -45 415 -188 560
1268 560 591 180 250 -407 -82 -202 -427 77 -3 -516 -28 -646 -675 -360 -521 -106 -204 -150 -79 -508 -138 -236 103
1291 103 593 543 507 507 204 663 206 707 925 700 768 412 462 340 -233 509 258 170 102 -447 -74 -600 -574
1314 -574 -143 -343 -503 1 -676 -548 -602 -205 9 -499 -85 -242 -725 -345 -499 -375 -125 -243 -81 -204
1334 -204 -69 -265 -346 397 407 389 760 55 281 339 83 590 96 -93 221 -718 -129 -890 -794 -540 -1180 -596
$$ packed form
1182D04L25m43j56rr72Q06k46j32N14p24K7J2m33N55K67J39Q5o49K76p1jM46m54
1205d34N64j17n43M15p06K54l4N9O12n42j1J62n24Q76l80J49N01l18K84j44l75
1226b52M14LJ04J9n27L07l51k02K21k31Q12P0q08L12l60L18N92o74J030j89j46
1247D62M04o57M43M8L5L08l63j66p8j75J10n7J13K87n45J95k94j15M60o03P48
1268E60L1m11P0o57L25j20k25N04q0n13M88o18k9L15j61M15r8N4P1m29L70r8L39
1291A03M90n0l6%l03M59m57N01K18k25O8l56N0j22n73P42k51q8o8n49L73n26K6
1314e74M31k00j60N04o77J28n4L97K14n08M14j57m83L80j54J24K50j18J62j23
1334b04J35j96q1P43J0j8L71p05K26N8k56N07m94j89L14r39N89p61R6K54o40N84
$$ plain form
1356 -596 -1287 -1313 -1129 -1337 -1178 -470 -688 -257 -481 -705 -384 -453 367 277 525 754 103 274 295 158 661
1377 661 -25 168 651 32 427 -327 -429 410 -110 659 414 469 392 250 548 547 609 960 605 600 570 301 395
1400 395 337 371 82 -158 -349 -443 -739 -149 -405 -444 -158 -373 -384 -519 -461 -78 -146 454 -20 54 168 -382 -41
1423 -41 -244 -339 81 45 -228 -284 -634 -237 -224 36 586 107 638 949 620 1367 1147 1373 1722 1453 1404 1269
1445 1269 692 1369 936 541 719 -33 14 -513 -757 -489 -1047 -895 -924 -905 -722 -1063 -686 -319 -277 282 339
1466 339 485 562 39 610 373 276 721 -162 -121 -534 -913 -654 -937 -937 -578 -960 -767 -1081 -796 -482 -886 -124
1488 -124 176 -40 302 139 467 718 132 858 634 510 435 87 195 -8 110 259 -534 -12 -149 -282
1508 -282 37 -263 -111 -41 -13 536 123 -495 4 -146 440 -121 -462 -327 -554 -732 -844 -756 -244 -572 -413
$$ packed form
1356e96o91k6J84k08J59P08k18M31k24k24L21o9Q20r0K48K29o51J71K1j37N03
1377F61o86J93M83o19L95p54j02Q39n20P69k45N5p7j42K98jO2L51l55nl0k69R4
1400C95n8L4k89k40j91r4k96N90k56l9K86k15j1j35N8L83o8O00m74P4J14n50L41
1423d1k03r5M20l6k73n6l50L97J3K60N50m79N31L11l29P47k20K26L49k69m9j35
1445A269n77O77m33l95J78p52M7n27k44K68n58J52k9J9J83l41L77L67M2N59N7
1466C39J46P7n23N71k37r7M45q83M1m13l79K59k83%L59l82J93l14K85L14m04P62
1488a24L00k16L42j63L28K51n86P26k24j24p5l48J08k03J18J49p93N22j37j33
1508b82L19l00J52P0K8N49m13o18M99j50N86n61l41J35k27j78j12Q8N12l28J59
$$ plain form
1529 -413 -286 -298 -108 -76 140 606 432 853 668 333 690 638 563 632 129 473 -407 -443 -623 -1115 -709 -1035
1551 -1035 -964 -1010 -1163 -1230 -807 -812 -161 29 -100 385 569 914 556 757 1452 1193 1607 1351 648 972 397
1572 397 273 599 135 226 -165 -125 -119 -515 184 246 -84 445 176 252 343 335 461 262 241 693 458 76 -122
1595 -122 -307 20 -409 -632 -460 -580 -814 -1127 -991 -543 -508 -294 -94 15 43 -407 152 373 479 828 387
1616 387 506 555 299 576 188 412 510 -18 -60 -120 -343 5 -463 -131 -227 -222 -43 -366 124 -78 7 127 -82
1639 -82 145 133 -127 232 61 -143 176 -296 225 -114 -535 119 -377 150 124 -354 124 378 -31 354 -3
1660 -3 226 496 -69 47 -304 -330 -194 -567 -286 -558 -580 -276 -937 -540 -577 -713 -337 -331 -164 -139 -413 109 -163
1683 -163 27 423 135 572 37 -94 282 2 349 302 24 75 -86 -218 -211 -211 448 178 114 252 393 312 434
$$ packed form
1529d13J27j2J90L2K16M66j74M21j85l35L57n2p5O9n03L44q80l6j80m92M06l26
1551a035P1m6j53o7M23nO51J90j29M85J84L45l58K01O95k59M14k56p03L24n75
1572C97j24L26m64R1l91M0Ol96O99O2l30N29k69P6R1qJ26j99k1M52k35l82j98
1595a22j85L27m29k23J72j20k34l13J36M48L5K14K00J09K8m50N59K21J06L49m41
1616C87J19M9k56K77l88K24R8n28m2o0k23L48m68L32r6NJ79l23M90k02Q5J20k09
1639h2K27j2k60L59j71k04L19m72N21l39m21O54m96N27k6m78M78K54m09L85l57
1660cK29K70n65J16l51k6J36l73K81k72k2L04o61L97l7j36L76OJ67K5k74N22k72
1683a63J90L96k88M37n35j31L76k80L47m7k78N1j61j32P%O59k70o4J38J41q1J22
$$ plain form
1706 434 386 402 346 463 581 -135 353 204 85 225 -24 149 -372 -448 -115 -30 -139 28 110 357 8 -151
1728 -151 232 -274 -194 -17 70 126 -470 -184 -476 -459 -261 -707 -715 -342 -748 -537 -328 -363 93 362 394 769 285
1751 285 816 910 986 1094 884 1116 607 464 333 -234 -24 -129 -407 -400 -645 -712 -625 -849 -331 -194 81 191
1773 191 368 970 886 986 1363 1261 1380 1689 1100 966 643 206 508 -419 -254 -846 -1361 -1127 -1777 -1555
1793 -1555 -1778 -1854 -1419 -1574 -1309 -917 -760 -400 -20 59 809 759 807 768 542 714 474 797 369 189 -49
1814 -49 -396 -438 -434 -499 -226 -362 -564 -8 -327 359 319 605 1189 1227 1224 1291 868 1088 1112 856 599 393 89 -133
1838 -133 -751 -768 -1078 -1002 -946 -1294 -1367 -1429 -1236 -653 -928 -611 -563 -153 135 -26 154 408 451 447 437 275 152
1861 152 -61 27 -333 -91 -114 -220 -335 -521 -384 36 -80 -25 693 573 887 662 1043 807 972 1102 1347
$$ packed form
1706D34m8J6n6J17J18p16M88j49j19J40k49J73n21p6L33Q5j09J67Q2K47l49j59
1728a51L83n06Q0J77Q7N6n96K86k92J7J98m46qL73m06K11K09l5M56K69L2L75m84
1751B85N31R4P6J08k10K32n09j43j31n67K10j05k78Pk45o7Q7k24N18J37K75J10
1773A91J77O02q4J00L77j02J19L09n89j34l23m37L02r27J65n92n15K34o50K22
1793a555k23p6M35j55K65L92J57L60L80P9P50n0M8l9k26J72k40L23m28j80k38
1814d9l47m2Mo5K73j36k02N56l19O86m0K86N84L8lO7m23K20K4k56k57k06l04k22
1838a33o18j7l10P6N6l48p3o2J93N83k75L17M8M10K88j61J80K54M3mj0j62j23
1861A52k13Q8l60K42k3j06j15j86J37M20j16N5P18j20L14k25L81k36J65J30K45
$$ plain form
1882 1347 945 845 295 4 368 -351 -383 -556 -819 -976 -1228 -1030 -1012 -1331 -809 -739 -638 -339 -400 60 148
1903 148 469 965 758 949 970 777 1026 635 892 810 559 586 18 -114 69 -347 -192 -324 -464 -377 -607
1924 -607 -240 -441 -232 116 -466 306 244 125 403 -73 -16 539 -38 96 -78 19 -120 -746 -238 -324 -524
1945 -524 -490 -850 -657 -191 -639 -385 -463 190 222 49 562 18 365 577 419 1252 845 460 740 409 725
1966 725 802 699 795 -173 3 167 -77 -394 -244 -753 -356 -830 -845 -918 -1083 -346 -714 -735 -443 -772 -375 -603
1988 -603 -287 -514 -376 -336 -158 -263 -12 -68 -213 -20 -192 64 304 -67 287 -114 446 254 476 425 378
2009 378 729 508 370 834 440 364 625 226 103 -31 -88 74 -145 -175 -418 -385 -271 -690 -764 -113 -540 -212
2031 -212 -182 106 24 -247 176 184 274 296 409 403 467 387 337 194 329 281 70 -149 -152 -604 -209 -513 -356 -505 -406
$$ packed form
1882A347m02j00n50k91L64p19l2j73k63j57k52J98J8l19N22P0J01K99o1M60Q8
1903A48L21M96k07J91K1j93K49l91K57q2k51K7n68j32J83m16J55j32j40Q7k30
1924f07L67k01K09L48n82P72o2j19K78m76N7N55n77J34j74R7j39o26N08q6k00
1945e24L4l60J93M66m48K54p8O53L2j73N13n44L47K12j58Q33m07l85K80l31L16
1966G25P7j03R6r68J76J64k44l17J50n09L97m74j5p3j65P37l68k1K92l29L97k28
1988f03L16k27J38M0J78j05K51n6j45J93j72K56K40l71L54m01N60j92K22n1m7
2009C78L51k21j38M64l94p6K61l99j23j34n7J62k19l0k43L3J14m19p4O51m27L28
2031b12L0K88q2k71M23QR0K2J13oO4q0n0j43J35m8k11k19lm52L95l04J57j49R9
$$ plain form
2056 -406 -388 -678 -596 -166 -124 448 275 393 627 495 760 964 772 929 988 983 1026 467 695 497 687 470
2078 470 56 378 -429 -438 -702 -683 -619 -428 -697 -536 -736 -726 -406 -630 -348 24 -279 12 -120 65 379 -132
2100 -132 65 83 237 90 -220 -412 -336 -351 -2 -122 94 161 -55 248 279 549 1113 759 1144 676 842 1043
2122 1043 377 1007 640 378 168 5 -229 -94 -606 -684 -846 -968 -1048 -1330 -1418 -1246 -1309 -1044 -975 -571 -554 -442
2144 -442 -311 -175 -138 462 420 714 604 301 746 339 880 594 449 314 290 438 86 396 285 439 264
2165 264 528 113 425 241 411 261 68 5 40 -357 145 -764 -603 -404 -528 -678 -617 -727 -621 -469 -207
2186 -207 -628 -388 -272 -466 -156 51 -254 7 -88 77 506 -304 116 -368 254 324 532 207 217 196 281 15
2208 15 505 411 383 442 363 333 534 391 269 320 18 310 -100 271 -74 -361 272 75 41 133 -137 -103 116
$$ packed form
2056d06J8k90Q2M30M2N72j73J18K34j32K65K04j92J57N9nM3n59K28j98J90k17
2078D70m14L22q07rk64J9O4J91k69J61k00J0L20k24K82L72l03K91j32J85L14n11
2100a32J97J8J54j47l10j92P6j5L49j20K16O7k16L03L1K70N64l54L85m68J66K01
2122A043o66O30l67k62k10j63k34J35n12p8j62j22q0k82q8J72o3K65O9M04J7J12
2144d42J31J36L7O00m2K94j10l03M45m07N41k86j45j35k4J48l52L10j11J54j75
2165B64K64m15L12j84J70j50j93o3L5l97N02r09J61J99j24j50O1j10J06J52K62
2186b07m21K40J16j94L10K07l05K61r5J65M29q10M20m84O22P0K08l25J0k1Q5k66
2208A5M90r4k8N9p9l0K01j43j22N1l02K92m10L71l45k87O33j97l4R2k70L4K19
$$ plain form
2231 116 -134 223 -70 133 271 -89 -149 -119 -284 -171 -482 -387 -263 -593 -344 -627 -643 -97 192 24 -119
2252 -119 -193 97 -233 224 170 356 412 599 266 -108 -93 -159 -245 -269 -191 -603 -346 -270 -622 -199 -612 -30 11
2275 11 166 597 544 722 944 816 1072 1097 892 1431 728 1008 538 167 281 23 -399 -387 -980 -1107 -769
2296 -769 -691 -842 -831 -606 -503 -501 -308 -563 95 -306 -212 132 -146 -156 -228 -324 -310 -291 -441 -396 -235 -266 -333 -275 -112
2321 -112 -68 180 369 172 717 309 954 805 1009 983 1032 853 745 685 558 281 199 1 -232 -329 -591 -809
2343 -809 -536 -560 -843 -302 -640 -324 -311 -105 -128 213 165 167 66 -54 152 12 22 -756 -109 -453 -353 -303 -204
2366 -204 -251 -388 -470 -129 -14 251 164 441 366 315 782 694 870 805 733 368 694 215 -42 -65 -499 -170 -620
2389 -620 -580 -304 -795 -500 -400 -151 -427 -294 -307 124 119 464 239 451 784 363 308 508 31 627 -67 -2
$$ packed form
2231A16k50L57k93K03J38l60o0L0j65J13l11R5J24l30K49k83j6N46K89j68j43
2252a19p4K90l30M57n4J86N6J87l33l74J5o6q6k4P8m12K57P6l52M23m13N82M1
2275A1J55M31n3J78K22j28K56K5k05N39p03K80m70l71J14k58m22J2n93j27L38
2296g69P8j51J1K25J03KJ93k55O58m01R4L44k78j0p2r6J4J9j50M5J61l1o7N8J63
2321a12M4K48J89j97N45m08O45j49K04k6M9j79j08o0j27k77q2j98k33r7k62k18
2343h09K73k4k83N41l38L16J3K06k3L41m8Kj01j20K06j40J0p78O47l44J00N0R9
2366b04m7j37q2L41J15K65q7K77p5n1M67q8J76o5p2l65L26m79k57k3m34L29m50
2389f20M0K76m91K95J00K49k76J33j3M31nL45k25K12L33m21n5K00m77N96o94O5
$$ plain form
2411 -2 258 -341 -144 -217 130 -74 -326 -19 -104 -159 90 -138 197 98 49 7 -43 291 91 -318 78 -143 -463
2434 -463 -317 -533 -726 -349 -461 -195 -333 -452 -243 -348 -174 -43 -25 156 124 224 343 116 110 87 95 44 83
2457 83 194 -47 127 170 86 204 64 -56 89 331 110 -218 137 354 80 65 207 41 304 -36 -364
2478 -364 79 -402 -402 -415 -400 -237 -561 -323 -241 -481 -148 -66 -93 -212 83 274 279 49 322 199 207 185 296 277
2502 277 -129 282 277 32 -95 -368 10 -301 -59 77 -156 -259 -362 -490 44 -69 -295 -272 -216 -162 -272 -52
2524 -52 27 298 -68 38 285 200 174 182 435 187 358 20 353 468 250 203 502 153 159 423 210 14 -25
2547 -25 195 -199 284 -135 -275 -487 -170 -793 -208 -396 -330 -398 -645 -229 -445 -407 -441 -248 174 -17 -188 19
2569 19 82 302 537 375 664 556 559 791 551 569 330 418 420 211 227 -51 -126 164 -339 -241 -98 -456 -178 71
$$ packed form
2411bK60n99J97p3L47k04k52L07q5n5K49k28L35r9m9m2n0L34k00m09L96k21l20
2434d63J46k16j93L77j12K66j38j19K09j05J74J31J8J81l2J00J19k27ok3Qn1L9
2457H3J11k41J74M3q4J18j40j20J45K42k21l28L55K17k74j5J42j66K63l40l28
2478c64M43m81%j3J5J63l24K38Q2k40L33Q2k7j19K95J91Nk30K73j23Qk2J11j9
2502B77m06M11nk45j27k73L78l11K42J36k33j03j03j28N34j13k26K3N6N4j10K20
2524e2P9K71l66J06K47q5k6QK53k48J71l38L33J15k18m7K99l49OK64k13j96l9
2547b5K20l94M83m19j40k12L17o23N85j88O6o8k47M16k16L8l4J93M22j91j71K07
2569A9O3K20K35j62K89j08LK32k40J8k39Q8Kk09J6k78p5K90n03R8J43l58K78K49
$$ plain form
2593 71 -431 -90 -290 -116 -18 -245 -92 49 -238 222 120 273 102 -24 60 -134 284 -493 -273 193 10
2614 10 -41 -10 -375 -142 119 -173 321 133 755 198 193 500 269 190 85 -66 -181 -15 -387 18 -722 -659
2636 -659 -491 -633 -586 -625 -545 -120 -215 -55 494 407 302 225 608 462 608 582 161 450 606 -16 338 -99
2658 -99 30 -210 -220 -111 -272 -298 -257 -447 -202 300 124 -2 178 627 371 195 634 660 357 416 -108 68
2680 68 -286 -265 -331 -512 -318 -464 -670 -639 -542 -587 -205 -358 -327 154 98 258 387 376 415 534 419 273 553
2703 553 328 161 -32 -294 -350 -161 -312 -226 -360 -564 -288 -222 -183 -71 -93 -189 65 236 292 526 448 311 210
2726 210 459 -55 -50 203 36 -48 -226 -195 -83 -482 -130 -336 -36 -356 80 -97 31 86 281 260 150 267
2748 267 297 442 255 0 -8 -113 -268 -384 -396 -323 -495 -389 -247 -374 -346 -418 -263 -392 -351 -108 0 227 88
$$ packed form
2593G1n02L41k00J74R8k27J53J41k87M60j02J53j71j26Q4j94M18p77K20M66j83
2614A0n1L1l65K33K61k92M94j88O22n57nL07k31p9j05j51j15J66l72M05p40O3
2636f59J68j42M7l9Q0M25r5J60N49q7j05p7L83j46J46k6m21K89J56o22L54m37
2658i9J29k40j0J09j61k6M1j90K45N02j76j26J80M49k56j76M39K6l03N9n24J76
2680F8l54K1o6j81J94j46k06L1R7m5L82j53L1M81n6J60J29j1L9J19j15j46K80
2703E53k25j67j93k62n6J89j51Q6j34k04K76O6L9J12k2r6K54J71N6K34p8j37j01
2726B10K49n14NK53j67q4j78L1J12l99L52k06L00l20M36j77J28N5J95k1j10J17
2748B67L0J45j87k55qj05j55j16j2P3j72J06J42j27K8p2J55j29M1K43J08K27j39
$$ plain form
2771 88 59 401 170 287 553 -28 172 197 348 295 120 252 161 3 382 -37 -188 155 21 -154 43 226
2793 226 336 -8 -29 54 -300 -30 -153 -213 -87 -348 28 157 -341 -172 -89 256 -77 -144 5 -119 -77 -112
2815 -112 -119 -173 23 28 -316 -206 -416 -40 -246 -177 -117 71 106 49 165 63 -20 102 -42 226 141 137 256 -135
2839 -135 -168 26 -166 -29 -9 43 -111 -40 -4 -153 132 77 -154 251 37 117 340 239 319 109 229 39 114
2862 114 139 161 161 -14 138 -47 38 -112 -109 -310 -192 142 -61 -317 119 -243 -46 189 -92 98 200 -37
2884 -37 33 -194 40 -152 -103 73 -340 -12 -190 16 -327 -583 -341 -194 -409 -264 -77 -191 -1 -49 371
2905 371 63 231 141 57 226 294 44 477 168 245 46 26 103 31 -231 -79 -14 90 79 -56 111 9 5 48
2929 48 -122 140 221 246 46 -25 199 0 199 -101 -72 -419 -88 -417 -121 7 -310 -65 -334 -231 -58 -354
$$ packed form
2771H8k9L42k31J17K66n81K00K5J51n3j75J32r1j58L79m19j51L43j34j75J97J83
2793B26J10l44k1Q3l54K70j23o0J26k61L76J29m98J69Q3L45l33o7J49j24M2l5
2815a12pn4J96Nl44J10k10L76k06O9O0J88L5n7J16j02q3J22j44K68q5mJ19l91
2839a35l3J94j92J37K0N2j54P1L6j49K85n5k31M05k14Q0K23j01Q0k10J20j90P5
2862A14K5K2%j75J52j85Q5j50Lk01J18L34k03k56M36l62J97K35k81J90J02k37
2884c7P0k27K34j92M9J76m13L28j78K06l43k56K42J47k15J45J87j14J90m8M20
2905C71l08J68r0q4J69O8k50M33l09P7j99k0P7p2k62J52O5J04j1j35J67j02mM3
2929D8j70K62Q1K5k00p1K24j99J99l00K9l47L31l29K96J28l17K45k69J03J73k96
$$ plain form
2951 -354 -223 -65 -252 -187 -168 29 43 -54 197 -57 344 218 306 22 22 122 412 106 274 -25 -231 138
2973 138 -35 155 48 -2 57 172 373 -148 -50 -110 -162 117 -32 -140 12 30 -53 188 -487 -37 48 -292 -38
2996 -38 258 27 -9 -141 214 -148 -48 156 13 -284 -166 -26 -387 -275 -201 -25 -191 186 144 -136 191
3017 191 -89 -102 -237 288 -3 -44 -108 -213 110 -197 53 154 -48 31 126 -50 -116 -66 -81 126 311 -16 240
3040 240 88 321 210 161 185 402 343 532 -40 338 16 219 243 17 84 -3 -361 -130 -225 -116 -171 -241 3
3063 3 -146 -114 -129 -172 255 -263 -155 -73 -335 -104 53 -284 -192 82 62 -219 168 237 193 216 50 123 190 -257
3087 -257 447 -81 38 75 502 109 275 -14 132 138 -226 227 21 250 48 144 -62 40 -64 -249 -6
3108 -6 31 -332 -238 -154 38 -76 -395 -399 -80 -254 -235 101 -95 153 -26 26 164 61 19 82 -415 12 -41 -77
$$ packed form
2951c54J31J58j87O5J9J97J4r7K51k54M01j26Q8k84%J00K90l06J68k99k06L69
2973A38j73J90j07n0N9J15K01n21R8o0n2K79j49j08J52J8q3K41o75M50Q5l40K54
2996c8K96k31l6j32L55l62J00K04j43k97J18J40l61J12P4J76j66L77m2k80L27
3017A91k80j3j35N25k91m1o4j05L23l07K50J01k02P9R5j76o6N0j5K07J85l27K56
3040B40j52K33j11m9K4K17n9J89n72L78l22K03K4k26O7q7l58K31r5J09n5p0K44
3063Cj49L2j5m3M27n18J08Q2k62K31J57l37R2K74k0k81L87O9m4K3j66P3O7m47
3087b57P04n28J19L7M27l93J66k89J46Ol64M53k06K29k02R6k06J02j04j85K43
3108fL7l63R4Q4J92j14l19mL19j74J9L36j96K48j79N2J38j03m2O3m97M27n3l6
$$ plain form
3132 -77 90 1 13 188 -237 -15 -165 -25 -226 -190 -94 154 389 275 49 390 122 -8 400 216 -64 199
3154 199 251 191 178 -14 -189 -251 -6 -302 86 -151 -128 -486 -183 -96 28 -304 -91 109 -56 75 -107 459
3176 459 193 38 176 160 87 176 159 92 113 35 -261 -146 -33 0 -45 131 -40 -180 280 37 -29 202 34
3199 34 -119 204 -73 -19 -276 -285 -222 -96 -258 -75 -490 -305 -190 -255 -332 -375 -204 -140 137 -266 -31 155 -80
3222 -80 288 39 41 145 313 12 -27 50 211 461 127 129 169 224 240 160 319 -122 103 348 -24 93 90 49 -119
3247 -119 -111 -55 36 -197 36 -275 27 -107 -306 101 -489 -238 -275 -571 -229 -646 -398 -338 -175 63 -132 -62
3269 -62 128 -395 123 178 -85 378 -25 279 54 188 195 368 503 505 204 202 178 116 376 348 -132 -64 -119 20
3293 20 -58 -15 -51 -281 125 132 -265 37 -415 -504 -89 16 -310 -72 -154 -250 -85 -220 209 19 27 -78 -218 -178
$$ packed form
3132g7J67q9J2J75m25K22j50J40k01L6R6K48K35j14k26L41k68j30M08j84k80K63
3154A99N2o0j3j92j75o2K45k96L88k37K3l58L03Q7J24l32K13K00j65J31j82N66
3176D59k66j55J38j6p3Q9j7o7K1p8k96J15J13L3m5J76j71j40M60k43o6K31j68
3199C4j53L23k77N4k57rO3J26j62J83m15J85J15o5p7m3J71O4K77m03K35J86k35
3222h0L68k49KJ04J68l01l9P7J61K50l34KM0N5J6q0J59m41K25K45l72J17lm1j68
3247a19QN6R1k33K33l11L02j34j99M07n90K51l7k96L42m17K48O0J63K38j95P0
3269f2J90n23N18N5k63M63m03L04k25J34PJ73J35Kl01kk4o2K60k8m80O8n5J39
3293B0p8M3l6k30M06Pl97L02m52q9M15J05l26K38q2r6J65j35M29j90Qj05j40M0
$$ plain form
3317 -178 -37 130 -24 -124 -102 -124 197 -130 35 201 259 86 2 -142 58 -141 -430 -167 198 -44 165
3338 165 27 -75 -182 235 -50 107 -167 -365 -101 -66 -341 -134 -239 -9 108 -30 -39 -57 29 -87 -126 -154
3360 -154 5 -49 71 -7 -279 260 -253 70 -112 -25 49 126 150 357 -123 34 355 104 156 -83 -161 73 67
3383 67 112 118 170 22 -12 -29 -183 -69 -6 -249 -211 -425 -119 -200 -326 130 -129 -276 -128 33 -99 -268 20
3406 20 35 89 107 -114 192 61 85 179 273 104 219 -275 223 107 148 200 101 189 199 18 48 137 74 154 158 -41
3432 -41 -140 -154 -79 4 -196 11 397 336 254 -3 -23 28 -216 -105 -204 72 60 159 132 201 49 -148 -52 -113 12
3457 12 144 78 -196 -24 -39 -42 -50 -219 -111 23 55 2 152 -106 103 80 68 153 13 48 178 -100 -77 29 5
3482 5 7 -129 -150 6 -63 -26 -16 89 -181 71 133 27 29 -164 96 -144 25 -240 -102 139 202 -81 226 230 -207
$$ packed form
3317a78J41J67j54j00K2k2L21l27J65J66N8j73q4j44K00j99k89K63L65k42K09
3338A65j38j02j07M17k85J57k74j98K64L5k75K07j05K30J17j38rj8Q6j16l9k8
3360a54J59n4J20p8k72N39n13L23j82Q7P4P7K4K07m80J57L21k51N2k39p8K34o
3383F7M5ON2j48l4j7j54J14O3k43L8k14L06q1j26M56k59j47J48J61j32j69K88
3406B0J5N4J8k21L06j31K4R4R4j69J15m94M98j16M1N2r9Q8J0j81L0Q9o3Q0Mj99
3432d1r9j4P5Q3k00K07L86o1q2k57k0N1k44J11r9K76j2R9k7O9j52j97R6o1J25
3457A2J32o6k74J72j5lqj69J08J34L2n3J50k58K09k3j2Q5j40L5J30k78K3J06k4
3482EKj36k1J56o9L7J0J05k70K52O2j06Kj93K60k40J69k65J38K41O3k83L07Mm37
$$ plain form
3507 -207 115 -163 64 112 24 79 -276 45 143 -252 23 80 -142 107 -238 28 -8 -187 -99 84 -136 -180 1
3530 1 114 77 0 251 -178 -4 159 11 -37 -87 209 -195 160 126 -150 46 38 466 108 9 190 -13 94
3553 94 -217 141 -171 399 -125 56 -24 -37 152 -175 67 -235 -18 -158 -65 -205 146 -289 -50 -220 -2
3574 -2 -79 -29 -117 103 11 -149 87 -94 221 -25 -44 -245 63 -57 199 25 -61 -205 303 73 -130 186 55
3597 55 92 117 157 96 397 181 24 -89 -93 -92 27 28 -69 402 -21 -159 75 -24 180 92 -125 -42 -280 -47 -320
3622 -320 -157 275 -66 -94 77 -185 -159 329 -169 150 70 -158 -184 -96 162 289 -231 231 -330 -208 162 -108
3644 -108 252 -140 -90 -255 39 -1 -22 -330 -181 -219 -127 -67 -139 -46 -18 259 305 -83 114 -37 -126 -112 -98 333
3668 333 112 196 160 11 72 177 -34 -169 -95 -20 148 -167 314 -17 -128 -67 51 92 -92 -13 231 109 -44
$$ packed form
3507b07L22k78K27M8q8N5l55L21R8l95K75N7k22K49l45K66l6j79Q8J83k20m4J81
3530AJ13l7p7K51m29J74J63j48m8n0K96m04L55l4k76J96qM28l58r9J81k03J07
3553I4l11L58l12N70n24J81q0j3J89l27K42l02K17j40R3j40L51m35K39j70K18
3574bp7N0q8K20r2j60K36j81L15k46j9k01L08j20K56j74q6j44N08k30k03L16j31
3597E5L7K5M0o1L01k16j57j13mJJ19Jr7M71m23j38K34r9K04q8k17Q3k38K33k73
3622c20J63M32l41k8J71k62K6M88m98L19q0k28k6Q8K58J27n20M62n61J22L70k70
3644a08L60l92N0j65K94m0k1l08J49l8R2O0p2R3K8K77M6l88J97j51q9J4J4M31
3668C33k21Q4l6j49O1J05k11j35P4P5J68l15M81l31j11O1J18M1j84P9K44j22j53
$$ plain form
3691 -44 198 119 137 63 40 155 102 -71 281 -122 110 -322 -32 -437 -249 14 -199 -62 73 -281 -8 -111
3713 -111 -331 191 -151 -151 129 297 -110 172 -74 -66 -294 -102 54 -113 -317 -88 -191 99 -114 249 184 228
3735 228 490 73 173 327 47 52 7 269 -29 167 296 -32 6 121 77 -198 -71 -78 10 -114 -256 168 105
3758 105 54 136 -137 107 45 -78 -2 -2 -422 32 89 100 -150 -117 -60 -107 -124 -245 -125 -74 2 143 193 219 117
3783 117 -137 25 251 295 219 311 140 236 65 232 176 38 62 -264 257 -44 -108 -189 -172 -47 -345 127 -202
$$ packed form
3691d4K42p9J8p4k3J15n3j73L52m03K32m32K90m05J88K63k13J37J35l54K73j03
3713a11k20N22l42%K80J68m07K82k46Qk28J92J56j67k04K29j03K90k13L63o5M4
3735B28K62m17J00J54k80Nm5K62k98J96J29l28L8J15m4k75J27pQ8j24j42M24o3
3758A05n1Q2k73K44o2j23P6%m20M54N7J1k50L3N7m7j7j21J20N1P6J41N0K6j02
3783A17k54J62K26M4p6R2j71R6j71J67n6j38K4l26N21l01o4q1J7J25k98M72l29
$$ [...]
8191C
##END NTUPLES=NMR FID
##END=
