##TITLE=1H_DPB2303S
 CDCl3, 8 sc, 
 24.3.2020
##JCAMPDX= 6.0         $$ Bruker NMR JCAMP-DX V2.0
##DATA TYPE= NMR FID
##DATA CLASS= NTUPLES
##ORIGIN= UXNMR, Bruker Analytische Messtechnik GmbH
##OWNER= root
$$ XWIN-NMR		Version 3.5
$$ Tue Mar 24 14:04:14 2020 Russian Standard Time (UT+4h)  she@DPX200
##.OBSERVE FREQUENCY= 200.1315
##.OBSERVE NUCLEUS= ^1H
##.DELAY= (6, 6)
##.ACQUISITION MODE= SIMULTANEOUS
##.ACQUISITION SCHEME= undefined
##.AVERAGES= 8
##.DIGITISER RES= 18
##SPECTROMETER/DATA SYSTEM= spect
##.PULSE SEQUENCE= zg30
##.SOLVENT NAME= CDCl3
##.SHIFT REFERENCE= (INTERNAL, CDCl3, 0, 15.7039)
##AUDIT TRAIL= $$ (NUMBER, WHEN, WHO, WHERE, WHAT)
$$ ##TITLE= Audit trail, XWIN-NMR		Version 3.5
$$ ##JCAMPDX= 5.01
$$ ##ORIGIN= Bruker BioSpin GmbH
$$ ##OWNER= she
$$ F:/spectra/data/she/nmr/H-F/1/audita.txt
$$ ##AUDIT TRAIL=  $$ (NUMBER, WHEN, WHO, WHERE, WHAT)
(   1,<2020-03-24 14:02:53.42 +0400>,<she>,<DPX200>,
      <created by zg, POWCHK disabled, PULCHK disabled
       configuration hash MD5:
       00 E9 B6 7A A2 85 ED C7 34 08 36 98 17 FE 4E 26
       data hash MD5: 16K
       67 72 40 24 0A B7 11 2D B5 0A E4 90 C6 D6 E7 B1>)
$$ ##END=
$$ 
$$ hash MD5
$$ 1A 40 69 88 5E E9 5A 9A BE FF 56 43 57 90 2D 6C
##$RELAX= 
##$RELAX= 
##$RELAX= 
##$RELAX= 
##$RELAX= 
##$RELAX= 
$$ Bruker specific parameters
$$ --------------------------
##$DU= <F:/spectra>
##$EXPNO= 1
##$NAME= <H-F>
##$PROCNO= 1
##$TYPE= <nmr>
##$USER= <she>
##$AMP= (0..31)
100 100 100 100 100 100 100 100 100 100 100 100 100 100 100 100 100 100 
100 100 100 100 100 100 100 100 100 100 100 100 100 100 
##$AQSEQ= 0
##$AQ_mod= 1
##$AUNM= <au_zg>
##$AUTOPOS= <>
##$BF1= 200.13
##$BF2= 200.13
##$BF3= 200.13
##$BF4= 200.13
##$BF5= 200.13
##$BF6= 200.13
##$BF7= 200.13
##$BF8= 200.13
##$BYTORDA= 1
##$CFDGTYP= 0
##$CFRGTYP= 5
##$CHEMSTR= <none>
##$CNST= (0..31)
1 1 145 1 1 1 1 1 1 1 1 1 1 1 1 1 1 1 1 1 1 1 1 1 1 1 1 1 1 1 1 1 
##$CPDPRG= <>
##$CPDPRG1= <>
##$CPDPRG2= <>
##$CPDPRG3= <>
##$CPDPRG4= <mlev>
##$CPDPRG5= <mlev>
##$CPDPRG6= <mlev>
##$CPDPRG7= <mlev>
##$CPDPRG8= <mlev>
##$CPDPRGB= <>
##$CPDPRGT= <>
##$D= (0..31)
0 1.2 0 0 0 0 0 0 0 0.06 0 0.03 0 0 0 0 0.0002 0 0 0 0 0 0 0 0 0 0 0 0 
0 0 0 
##$DATE= 1585044172
##$DBL= (0..7)
120 120 120 120 120 120 120 120 
##$DBP= (0..7)
150 150 150 150 150 150 150 150 
##$DBP07= 0
##$DBPNAM0= <>
##$DBPNAM1= <>
##$DBPNAM2= <>
##$DBPNAM3= <>
##$DBPNAM4= <>
##$DBPNAM5= <>
##$DBPNAM6= <>
##$DBPNAM7= <>
##$DBPOAL= (0..7)
0.5 0.5 0.5 0.5 0.5 0.5 0.5 0.5 
##$DBPOFFS= (0..7)
0 0 0 0 0 0 0 0 
##$DE= 6
##$DECBNUC= <off>
##$DECIM= 24
##$DECNUC= <off>
##$DECSTAT= 4
##$DIGMOD= 1
##$DIGTYP= 9
##$DL= (0..7)
0 120 120 120 120 120 120 120 
##$DP= (0..7)
150 150 150 150 150 150 150 150 
##$DP07= 0
##$DPNAME0= <>
##$DPNAME1= <>
##$DPNAME2= <>
##$DPNAME3= <>
##$DPNAME4= <>
##$DPNAME5= <>
##$DPNAME6= <>
##$DPNAME7= <>
##$DPOAL= (0..7)
0.5 0.5 0.5 0.5 0.5 0.5 0.5 0.5 
##$DPOFFS= (0..7)
0 0 0 0 0 0 0 0 
##$DQDMODE= 0
##$DR= 18
##$DS= 0
##$DSLIST= <SSSSSSSSSSSSSSS>
$$ [...]
##$SUBNAM2= <"">
##$SUBNAM3= <"">
##$SUBNAM4= <"">
##$SUBNAM5= <"">
##$SUBNAM6= <"">
##$SUBNAM7= <"">
##$SUBNAM8= <"">
##$SUBNAM9= <"">
##$SW= 24.9337058887773
##$SWIBOX= (0..15)
0 0 2 0 0 0 0 0 0 0 0 0 0 0 0 0 
##$SW_h= 4990.01996007984
##$TD= 16384
##$TD0= 1
##$TE= 0
##$TE2= 300
##$TE3= 300
##$TEG= 300
##$TL= (0..7)
0 120 120 120 120 120 120 120 
##$TP= (0..7)
150 150 150 150 150 150 150 150 
##$TP07= 0
##$TPNAME0= <>
##$TPNAME1= <>
##$TPNAME2= <>
##$TPNAME3= <>
##$TPNAME4= <>
##$TPNAME5= <>
##$TPNAME6= <>
##$TPNAME7= <>
##$TPOAL= (0..7)
0.5 0.5 0.5 0.5 0.5 0.5 0.5 0.5 
##$TPOFFS= (0..7)
0 0 0 0 0 0 0 0 
##$TUNHIN= 0
##$TUNHOUT= 0
##$TUNXOUT= 0
##$USERA1= <user>
##$USERA2= <user>
##$USERA3= <user>
##$USERA4= <user>
##$USERA5= <user>
##$V9= 5
##$VALIST= <valist>
##$VCLIST= <CCCCCCCCCCCCCCC>
##$VD= 0
##$VDLIST= <DDDDDDDDDDDDDDD>
##$VPLIST= <PPPPPPPPPPPPPPP>
##$VTLIST= <TTTTTTTTTTTTTTT>
##$WBST= 1024
##$WBSW= 4
##$XGAIN= (0..3)
0 0 0 0 
##$XL= 0
##$YL= 0
##$YMAX_a= 80987
##$YMIN_a= -128974
##$ZGOPTNS= <>
##$ZL1= 120
##$ZL2= 120
##$ZL3= 120
##$ZL4= 120
##$ABSF1= 10
##$ABSF2= 0
##$ABSG= 5
##$ABSL= 3
##$ALPHA= 0
##$AQORDER= 0
##$ASSFAC= 0
##$ASSFACI= 0
##$ASSFACX= 0
##$ASSWID= 0
##$AUNMP= <proc_1d>
##$AZFE= 0.1
##$AZFW= 0.1
##$BCFW= 1
##$BC_mod= 2
##$BYTORDP= 1
##$COROFFS= 0
##$CY= 11.3945322036743
##$DATMOD= 1
##$DC= 2
##$DFILT= <>
##$DTYPP= 0
##$F1P= 16.9975609425685
##$F2P= -3.02152046262296
##$FCOR= 0.5
##$FTSIZE= 0
##$FT_mod= 4
##$GAMMA= 1
##$GB= 0.15
##$INTBC= 1
##$INTSCL= 1
##$ISEN= 128
##$LB= 0.24
##$LEV0= 0
##$LPBIN= 0
##$MAXI= 10000
##$MC2= 0
##$MEAN= 0
##$ME_mod= 0
##$MI= 1.114404
##$NCOEF= 0
##$NC_proc= 0
##$NLEV= 6
##$NOISF1= 3.799351
##$NOISF2= 2.8
##$NSP= 1
##$NTH_PI= 0
##$NZP= 0
##$OFFSET= 15.70392
##$PC= 1
##$PHC0= -9695.569
##$PHC1= 11.80082
##$PH_mod= 1
##$PKNL= yes
##$PPARMOD= 0
##$PSCAL= 0
##$PSIGN= 0
##$REVERSE= no
##$SF= 200.130013532006
##$SI= 16384
##$SIGF1= 3
##$SIGF2= 2
##$SINO= 400
##$SIOLD= 16384
##$SREGLST= <1H.CDCl3>
##$SSB= 0
##$STSI= 0
##$STSR= 0
##$SW_p= 3612.71676300578
##$SYMM= 0
##$S_DEV= 0
##$TDeff= 0
##$TDoff= 0
##$TI= <>
##$TILT= no
##$TM1= 0
##$TM2= 0
##$TOPLEV= 0
##$USERP1= <user>
##$USERP2= <user>
##$USERP3= <user>
##$USERP4= <user>
##$USERP5= <user>
##$WDW= 1
##$XDIM= 8192
##$YMAX_p= 0
##$YMIN_p= 0
$$ End of Bruker specific parameters
$$ ---------------------------------
##NTUPLES= NMR FID
##VAR_NAME=  TIME,          FID/REAL,        FID/IMAG
##SYMBOL=    X,             R,               I
##VAR_TYPE=  INDEPENDENT,   DEPENDENT,       DEPENDENT
##VAR_FORM=  AFFN,          ASDF,            ASDF
##VAR_DIM=   8192,          8192,            8192
##UNITS=     SECONDS,       ARBITRARY UNITS, ARBITRARY UNITS
##FACTOR=    0.0002004,     1,               1
##FIRST=     0,             0,               0
##LAST=      1.6414764,     0,               0
##MIN=       0,             -128974,         0
##MAX=       1.6414764,     80987,           0
$$ Real data points
##PAGE= N=1
##DATA TABLE= (X++(R..R)), XYDATA
0 0 0 0 0 0 0 0 0 0 -1 8 -8 8 -8 8 -16 16 -24 24 -32 32 -40 48 -56 64 -72 80 -93 104 -120 135 -152 169
32 169 -191 212 -237 264 -293 326 -361 401 -445 492 -543 602 -668 742 -822 918 -1026 1152
50 1152 -1301 1483 -1705 1987 -2358 2871 -3628 4865 -7226 13369 -61953 -128974 26572 53825
64 53825 -46077 -106982 -35094 4557 -33381 -56327 -17357 -19637 -64092 -61080 -516 4435 -53923
77 -53923 -77323 -28278 5261 -17919 -49487 -42844 -22597 -16040 -24117 -30234 -26143 -14469 -16576
90 -16576 -32580 -31022 -2415 5428 -26907 -43148 -7523 19280 -9282 -37241 -11872 15016 -5828
103 -5828 -24514 2329 19359 -11986 -28159 10172 32221 -4703 -27679 9084 33394 -185
115 -185 -20916 14426 35105 -15 -19681 16517 38884 6987 -14161 13229 31057 8939
127 8939 -35 23355 24681 -4720 -2593 36626 40627 -3348 -18704 21638 49109 22140 -10338
140 -10338 -1908 25182 33220 20840 5350 4 11622 29044 27936 8627 -296 10798 20889
153 20889 20116 18246 12549 -1138 213 27184 38165 4855 -22411 5738 42943 24154 -15910
166 -15910 -6982 27792 21211 -9216 -1615 26428 15233 -16219 -6919 26193 20538 -12947 -14166
179 -14166 12706 15336 -5111 -6190 8342 2908 -13646 -6625 12815 7774 -14641 -17853 -445
192 -445 8004 -1178 -11835 -13895 -9003 -1286 942 -8064 -16912 -12088 -3150 -5742 -12148 -8850 -5549
207 -5549 -13434 -17842 -6800 730 -10292 -20183 -11886 -3664 -10455 -14070 -4255 -3515 -19347 -21546 66
222 66 9211 -12298 -28505 -12492 7480 1767 -13299 -13906 -8061 -7200 -2965 4242 -2243 -17675 -14614
237 -14614 6352 11981 -6093 -16995 -4937 7457 3158 -4584 -3220 95 -749 35 3253 2436
251 2436 -871 -23 2668 1876 1437 4483 4841 7 -1159 4594 7538 3545 840 2738 3202 2531 6082
268 6082 8262 1296 -4698 3281 13634 7536 -5559 -3058 9956 10654 -366 -2793 4877 6698
282 6698 1526 1562 5314 2647 -1615 2831 8459 3208 -4623 -552 8374 6346 -2546 -2903 4124 5743
298 5743 893 -1165 1374 2709 1642 1019 903 806 1824 2440 261 -1834 754 4386 2532 -2377
314 -2377 -2592 1678 3874 2168 -428 -2499 -2525 1801 6221 2627 -6071 -6406 3427 8387 654 -7160
330 -7160 -3814 3250 3338 -574 -1490 -1176 -2440 -1568 2136 2229 -2658 -4570 -562 1966 -746 -2513 -381
347 -381 -9 -3379 -3864 849 3312 -1149 -5997 -4342 1033 3155 74 -4334 -5457 -1870 2855 2870
363 2870 -2291 -6018 -3552 1660 3116 -35 -3484 -3874 -1115 2276 2443 -1234 -3938 -1684 2156 2007
379 2007 -870 -1219 720 602 -1074 -42 2642 2142 -1104 -1813 1059 3051 2121 487 -324 -541 753
396 753 3280 3609 72 -2632 16 4328 3929 -356 -2163 412 3006 2486 429 -495 173 1284 1503
413 1503 555 -365 144 1213 737 -820 -893 744 1382 -207 -1820 -1332 356 994 -101 -1773 -2232 -854
431 -854 814 264 -2028 -2769 -979 500 -609 -2183 -1713 -447 -739 -1957 -1836 -586 -153 -989 -1906
448 -1906 -1923 -997 301 399 -1407 -2984 -1669 1290 1831 -857 -2945 -1633 1077 1862 371 -1313 -1520
465 -1520 -63 1707 1869 192 -1101 -289 1361 1655 860 565 823 640 436 1171 2103 1740 383 -225
483 -225 699 2142 2683 1646 -273 -885 1077 3398 2886 -93 -1647 240 2891 2927 679 -1164 -768
500 -768 1168 2441 1637 -402 -1136 214 1489 954 -154 -187 223 -131 -455 301 1006 191 -1124 -1178 -82
519 -82 734 575 -348 -1472 -1546 67 1527 409 -1961 -2242 37 1427 104 -1501 -1275 -249 -11 -320
537 -320 -443 -502 -592 -450 -387 -616 -514 138 106 -1112 -1717 -315 1161 454 -1524 -1983 -589 771 704 -621
557 -621 -1943 -1796 -25 1321 135 -2049 -2097 -169 699 -452 -1420 -1056 -655 -817 -655 -283 -672 -1268
575 -1268 -1003 -521 -872 -1115 -251 132 -1289 -2343 -872 1147 479 -1836 -2335 -565 795 483 -592
592 -592 -1411 -1423 -183 1200 804 -1043 -1557 27 1265 656 -233 -29 302 75 244 1073 1342 670 99
611 99 211 705 1504 2123 1289 -543 -473 2192 3804 1689 -1134 -530 2348 3374 1852 249 44 926
629 926 2264 2856 1523 -409 19 2251 2749 860 -159 1160 1997 894 50 989 1717 899 17 272
647 272 721 853 1017 630 -665 -1139 670 2211 695 -1883 -1692 585 1405 14 -1239 -1220 -629 30
665 30 420 -351 -1696 -1544 -13 339 -1086 -1716 -568 3 -1117 -1648 -532 150 -715 -1547 -1239 -748 -421
684 -421 -11 -343 -1847 -2267 -117 1566 -167 -2781 -2060 685 1169 -738 -1672 -914 -225 -75 83 -259
702 -259 -1173 -930 506 607 -1056 -1372 437 1115 -762 -1892 -264 1359 522 -1115 -1233 -312 456 760
720 760 147 -1316 -1636 345 1911 329 -2062 -1591 709 1202 -251 -926 -417 -202 -185 280 296 -625 -840
739 -840 146 406 -475 -487 776 636 -1084 -1273 824 1768 51 -1440 -642 790 1065 684 32 -886 -776
758 -776 1102 2230 484 -1642 -641 1800 1794 -163 -696 478 1015 611 540 646 265 245 834 794 -72
777 -72 118 1465 1390 -486 -952 1009 2164 705 -985 -617 768 1380 1064 97 -1013 -781 1085 2020
795 2020 190 -1795 -884 1286 1279 -447 -1011 -148 167 -138 -21 67 -443 -618 -46 41 -730 -713 306 249
815 249 -1180 -1433 230 1041 -425 -1768 -1027 336 463 -261 -849 -1120 -751 341 793 -466 -1651 -770
833 -770 811 554 -807 -922 135 378 -316 -466 -4 153 -26 -35 -165 -421 85 992 519 -1004 -1062 730
853 730 1623 213 -1246 -698 739 1081 363 -371 -723 -320 747 1138 -24 -1160 -474 934 793 -524
871 -524 -768 203 512 -161 -460 -15 197 -42 -264 -462 -471 71 685 84 -1193 -1148 473 1158 -175 -1492
891 -1492 -966 445 708 -7 -702 -850 -418 362 569 -304 -1084 -478 664 437 -638 -713 215 419 -344
910 -344 -566 120 507 94 -375 -353 -77 342 612 118 -774 -659 611 1265 166 -1085 -696 602 1014
929 1014 287 -476 -537 -39 591 657 -92 -729 -242 615 503 -289 -390 215 327 -235 -362 75 279 -29 -286
950 -286 -268 -155 74 329 -18 -766 -721 300 791 -107 -1058 -615 391 495 -223 -604 -342 -40 96 65 -177
971 -177 -430 -234 146 66 -354 -225 302 198 -435 -548 174 647 203 -539 -542 84 638 544 -122 -682 -290 670
993 670 902 7 -735 -269 636 750 133 -279 -134 208 408 356 66 -131 99 360 226 -105 23 416 290
1014 290 -300 -319 319 654 169 -391 -350 99 419 388 -80 -543 -442 262 683 99 -675 -627 95 471 120
1035 120 -317 -435 -262 -10 156 50 -298 -432 -188 70 37 -63 -117 -259 -381 -180 267 278 -272 -580 -237
1056 -237 292 415 27 -415 -431 -7 450 380 -226 -523 -79 488 388 -127 -261 45 315 184 37 29 129
1077 129 170 140 15 35 185 368 156 -228 -134 380 530 46 -398 -163 337 434 101 -198 -261 -17 322 279
1099 279 -59 -390 -173 239 268 -128 -283 -101 58 -12 -125 -145 -66 -36 -81 -163 -218 -74 55 -8 -261 -335 -54
1122 -54 137 63 -223 -307 -162 42 152 56 -252 -332 -54 254 166 -130 -243 -26 70 87 147 122 -90 -232 -8
1145 -8 364 334 -68 -286 -80 226 383 256 -51 -282 -112 356 523 114 -337 -276 230 471 235 -157 -265
1166 -265 -65 165 267 112 -82 -194 -137 31 172 182 -77 -323 -253 114 358 95 -339 -410 -129 182 274 16
1188 16 -368 -472 -65 433 270 -330 -597 -158 328 298 -95 -282 -201 -66 133 224 46 -291 -274 116 356 132
1210 132 -198 -200 30 164 164 115 25 -47 -18 137 213 120 -34 -55 76 223 174 39 -50 24 136 103 6 90 112 2
1236 2 -73 38 176 85 -64 -69 63 15 -27 71 108 -135 -267 -13 255 14 -363 -272 122 158 -195 -308 -111 8
1260 8 -39 -168 -171 -150 -74 -16 -68 -296 -342 -23 198 -61 -482 -441 61 308 -1 -483 -540 -63 368 193 -357 -599
1284 -599 -200 275 288 -93 -404 -334 -47 228 253 -125 -456 -276 229 368 9 -316 -211 10 92 159 205 -10
1306 -10 -378 -239 324 528 5 -478 -255 250 390 153 -132 -251 -133 197 393 167 -261 -317 86 363 172
1327 172 -161 -193 -27 150 124 19 12 -3 -25 -119 -57 175 276 -17 -353 -179 309 430 -28 -363 -225 145 377
1350 377 280 -103 -443 -253 375 639 37 -616 -319 473 624 19 -392 -149 259 309 159 18 -101 -4 265
1371 265 320 43 -148 58 292 194 -33 8 182 186 34 -29 93 145 104 33 -9 50 139 88 -80 -108 116 197 -51
1396 -51 -257 -50 217 124 -176 -253 -79 76 117 -5 -261 -411 -107 352 189 -451 -621 -33 395 55 -464
1417 -464 -437 -66 91 -8 -122 -262 -311 -150 91 29 -249 -280 -42 -5 -186 -182 40 75 -210 -335 -60 262 202
1440 202 -173 -423 -230 252 473 74 -506 -423 252 594 189 -399 -405 59 406 381 5 -352 -272 256 574 148
1462 148 -359 -232 274 374 16 -82 93 97 -96 -34 270 287 3 -139 -30 141 215 201 0 -265 -163 348
1484 348 525 31 -466 -263 333 491 93 -324 -235 112 379 260 -148 -326 -7 379 239 -140 -192 95 220
1505 220 73 -47 -27 40 121 114 29 -97 5 278 201 -170 -225 222 413 24 -285 -50 320 251 -54 -137 62
1528 62 170 146 84 -82 -113 124 316 92 -276 -185 303 414 -49 -390 -138 323 332 -24 -351 -229 144 375
1550 375 121 -334 -369 101 358 91 -262 -258 15 112 15 -71 -85 -128 -41 6 -60 -70 20 46 -188 -302 2 320 102
1575 102 -447 -453 89 406 117 -330 -406 -118 255 337 -24 -483 -415 231 578 108 -513 -409 144 402 108 -208
1597 -208 -215 -2 150 170 22 -95 -21 92 79 -3 73 162 58 -180 -121 170 327 92 -216 -203 87 340 279 -117
1621 -117 -410 -125 426 467 -100 -507 -159 369 336 -114 -323 -110 122 181 34 -169 -214 -26 159 19 -204
1642 -204 -146 129 103 -184 -262 33 182 -38 -267 -210 49 160 13 -210 -265 -21 210 89 -253 -334 48 321
1664 321 90 -323 -254 148 276 54 -211 -204 67 310 200 -178 -335 35 418 254 -225 -342 56 399 269
1685 269 -110 -249 -50 253 255 48 -199 -141 156 272 31 -179 -73 149 99 -92 -52 108 114 -99 -152 -27 143
1708 143 169 -47 -270 -212 174 336 33 -419 -363 144 405 100 -363 -384 7 342 201 -165 -378 -179 187
1729 187 247 -52 -290 -165 63 111 -68 -78 4 -21 -104 -74 71 145 19 -176 -190 4 254 188 -153 -371 -121
1752 -121 304 325 -130 -425 -214 218 340 22 -323 -315 37 302 120 -228 -344 -31 203 105 -197 -228 -33 46
1774 46 -40 -154 -121 -24 -4 -97 -169 -130 25 62 -138 -276 -153 99 107 -156 -316 -158 84 116 -89 -238 -168 52
1798 52 143 -27 -228 -176 94 177 -37 -232 -111 155 153 -49 -194 -67 141 219 10 -168 -81 152 243 59 -118
1821 -118 -78 173 242 107 -57 -7 143 134 121 72 54 77 107 93 62 128 185 105 -56 1 216 329 109 -135 -74 222
1847 222 352 149 -123 -167 98 321 274 -42 -196 -40 256 304 39 -176 -83 131 204 78 -36 -86 4 102 72
1870 72 -11 -7 13 -14 -73 -8 85 89 -56 -184 -93 126 153 -39 -220 -185 30 172 91 -203 -296 -55 195 159 -132 -276
1896 -276 -113 65 74 -44 -160 -109 -21 39 -14 -69 -87 -46 -37 -62 -18 39 12 -120 -177 -45 84 47 -120 -191 -83 55
1922 55 79 -67 -211 -184 10 100 -4 -190 -167 24 104 -37 -150 -114 -25 5 -24 -67 -75 -25 16 -58 -130 -119 55 86
1948 86 -50 -185 -99 69 123 -31 -128 -114 41 98 58 -51 -101 -3 111 119 -5 -46 42 70 53 34 60 69 38 17 58
1975 58 113 117 74 3 2 97 191 144 -14 -75 71 204 144 23 -48 8 113 126 60 -11 -27 44 106 58 -24 2 47 -5 -61
2004 -61 19 103 57 -82 -118 7 96 78 -82 -137 -84 42 143 28 -168 -197 2 164 75 -118 -180 -73 83 71
2028 71 -33 -114 -123 -18 65 32 -59 -63 -5 7 6 0 40 -22 -58 -19 64 64 7 -37 -50 4 49 52 22 -74 -88 19 109 58 -99
2059 -99 -48 22 54 36 -13 15 -13 -25 -25 22 27 32 -24 -64 -39 62 122 4 -147 -123 53 168 56 -141 -134 -9 127 94
2087 94 -62 -154 -90 104 141 -11 -130 -70 57 65 -35 -46 7 6 -28 -23 37 65 0 -33 -80 -16 62 93 9 -142 -82 53
2115 53 143 22 -121 -100 17 118 70 -53 -100 -71 47 61 11 -84 -70 22 49 -10 -23 -21 -27 -30 -49 22 47 13 -61 -83 -35
2144 -35 61 52 -56 -139 -75 112 123 -31 -160 -81 68 85 -12 -82 -74 -7 68 77 -36 -119 -18 72 65 -39 -27 82 67 -47
2172 -47 -85 31 114 81 -25 -51 8 123 108 7 -102 -37 119 174 48 -70 -23 122 144 46 -21 3 93 126 85 26
2198 26 58 133 106 16 10 104 203 127 -22 -24 139 217 133 -22 -59 66 203 195 31 -105 -26 166 198 74 -104 -38 118
2225 118 132 22 -40 10 23 41 12 -2 22 -1 16 -45 -55 11 67 15 -138 -157 19 134 -1 -157 -203 -49 109 77
2251 77 -134 -236 -119 65 96 -82 -212 -127 6 30 -42 -108 -93 -59 -33 -38 -32 -47 -84 -80 -78 -42 18 43 -81 -206 -94
2278 -94 90 153 -71 -225 -143 123 165 -8 -183 -177 19 171 78 -107 -185 -4 118 96 -93 -108 -71 66 90 -9
2302 -9 -22 15 83 -39 -52 -42 62 152 8 -119 -68 114 163 6 -137 -67 133 203 71 -89 -75 51 196 120 -52
2327 -52 -93 80 214 118 -42 -47 86 182 101 -12 18 117 177 100 -5 6 111 185 63 -56 -21 138 213 92 -53
2352 -53 -27 110 163 57 -7 -11 80 126 66 -41 -30 76 94 -12 -67 9 128 75 -107 -127 -2 140 82 -87 -173 -54
2378 -54 123 137 -56 -239 -133 102 161 -41 -205 -158 1 114 12 -122 -138 -38 44 20 -96 -78 -11 3 -41 -87
2402 -87 -15 48 -17 -140 -127 32 124 7 -183 -174 -16 162 94 -137 -258 -80 171 190 -94 -272 -135 114 181 14
2426 14 -190 -156 38 130 54 -120 -132 1 83 34 -51 -36 28 26 -43 -28 58 92 27 -97 -67 50 144 70 -113 -155 14
2453 14 193 135 -78 -178 -16 149 153 -11 -138 -67 85 116 22 -108 -84 44 84 18 -62 -12 33 24 -59 -33 10 38
2479 38 -10 -74 -24 28 60 -11 -119 -111 30 75 0 -133 -117 23 108 -1 -142 -128 35 126 16 -153 -130 49 140 16
2505 16 -170 -152 45 144 45 -163 -165 29 169 76 -124 -190 -20 152 122 -72 -192 -74 143 117 -55 -142 -38 63
2529 63 58 -36 -80 -28 2 2 -25 -42 28 29 8 -81 -48 72 107 13 -126 -78 86 180 68 -125 -117 59 213 141 -56 -138
2557 -138 8 176 171 33 -67 -26 79 147 72 10 22 11 63 73 115 81 6 -25 14 131 153 79 -65 -73 83 220
2583 220 149 -33 -136 -19 186 206 8 -194 -105 105 231 57 -172 -177 57 167 74 -114 -144 -27 67 29 -70
2606 -70 -93 -56 11 -16 -50 -77 -39 -20 -45 -124 -133 -21 42 -64 -142 -131 -8 54 -50 -176 -133 -18 46 -40 -146 -135 5
2633 5 40 -27 -113 -115 -34 24 -13 -119 -114 -34 41 -9 -96 -123 -35 55 0 -95 -109 2 67 14 -88 -105 -7 44 14 -50 -61 -18
2663 -18 -20 -3 0 22 -5 -15 -42 7 83 71 -7 -67 -14 88 144 74 -60 -82 45 177 163 -11 -120 -14 178 226 40
2690 40 -84 -65 116 233 133 -60 -78 43 162 167 57 -15 2 97 112 73 46 26 28 47 85 116 101 10 -32 2 92
2717 92 154 63 -63 -100 14 188 150 -68 -173 -45 130 174 0 -141 -102 59 144 40 -69 -123 -64 56 44 -46
2741 -46 -113 -78 6 14 -27 -59 -73 -76 -70 -33 -4 -36 -65 -130 -71 -12 -5 -56 -132 -121 -46 7 -42 -118 -147 -50 8 -45 -101 -119 -59 -22
2773 -22 -3 -69 -137 -72 -15 20 -77 -136 -78 14 7 -53 -110 -61 6 41 2 -75 -71 4 80 26 -40 -75 -2 49 39 13 15 -11 -6 55
2805 55 63 68 26 21 4 35 116 141 34 -52 -28 125 164 58 -72 -73 70 151 104 -8 -100 -43 116 171 50 -86 -83 47
2833 47 126 68 -12 -86 -40 25 95 57 -23 -77 -55 46 97 55 -37 -103 -66 48 110 47 -83 -102 -42 85 90 -16 -134 -91
2861 -91 14 142 105 -68 -146 -49 89 112 7 -105 -99 8 71 67 -26 -96 -77 41 98 43 -111 -88 10 42 26 -21 -49
2888 -49 -90 -27 26 47 -39 -82 -57 -1 15 -18 -60 -75 -37 -7 11 -37 -77 -50 -15 15 -19 -60 -72 -22 40 6 -39 -67 -23 27
2918 27 24 -22 -58 10 20 9 -21 -15 -27 -33 26 44 -4 -64 -37 47 81 25 -20 -11 20 52 85 48 -7 -49 -4 105 91 17 -49 -16
2950 -16 53 82 74 -3 -60 -41 51 122 54 -73 -93 -22 76 97 18 -100 -94 26 133 100 -41 -133 -74 74 138 44 -90 -143
2978 -143 -23 148 148 -16 -157 -91 38 125 57 -63 -117 -71 54 127 33 -93 -122 5 109 91 -26 -69 -46 -15 62
3003 62 99 6 -92 -100 36 118 60 -69 -87 -32 76 126 27 -63 -103 21 133 121 -19 -61 -9 67 107 48 -50 -52 33 93
3031 93 83 2 -3 8 50 49 68 50 0 -12 14 93 51 12 -16 17 38 49 32 0 -12 14 59 54 -21 -71 -4 93 47 -28 -59 -5
3063 -5 63 17 -33 -92 -58 21 55 8 -99 -139 -19 91 32 -97 -137 -69 34 52 -26 -113 -116 -32 28 -2 -74 -77 -63 -20 3
3092 3 10 -44 -97 -102 -23 39 43 -67 -117 -76 23 52 53 -65 -169 -58 97 118 -47 -158 -114 60 112 23 -103 -156 -29 77
3120 77 79 -15 -122 -111 13 67 13 -19 -65 -74 -14 40 48 -5 -112 -95 -8 76 81 -32 -124 -89 66 155 49 -108 -132 12
3148 12 181 143 -28 -129 -41 108 202 104 -47 -54 80 186 125 -22 -30 74 135 103 62 50 42 100 95 83 73 59 87 71
3176 71 62 82 94 93 39 27 93 104 72 17 -12 29 68 67 16 -27 10 75 55 -35 -37 -10 60 25 -54 -73 16 52 -2 -80 -109 -50
3208 -50 25 31 -52 -133 -52 34 33 -55 -131 -70 9 -22 -70 -93 -49 -31 -13 -48 -41 -28 -9 -35 -91 -71 26 17 -53 -129 -111 32 97 6
3240 6 -118 -146 -14 135 68 -90 -203 -69 105 107 -52 -182 -112 37 105 25 -100 -110 -51 41 77 -15 -90 -83 2 28
3266 28 27 -1 -49 -49 -38 1 65 41 -43 -101 1 84 93 -19 -103 -79 42 122 43 -102 -107 -7 133 112 -28 -89 -19 57 76
3295 76 -15 -28 -18 34 57 8 -13 1 43 -21 -33 2 82 66 -26 -79 -22 55 102 16 -89 -82 61 119 57 -74 -107 33 134
3324 134 41 -57 -98 31 82 47 -20 -50 -15 32 27 -18 -42 -6 42 15 -52 -60 2 52 27 -51 -73 -9 54 10 -59 -71 -42 42
3354 42 19 -58 -105 -55 -19 -10 -43 -77 -34 -23 -55 -31 -23 -6 -49 -54 -70 -42 6 43 -51 -144 -55 77 85 -52 -134 -59 58 90 -4
3385 -4 -90 -71 21 91 71 -33 -48 -5 56 81 17 -46 55 53 39 23 55 78 57 -7 -1 76 133 76 -31 -37 46 128 105 -22
3415 -22 -65 6 103 112 46 -72 -67 41 122 61 -47 -88 -29 70 45 -43 -51 -8 5 -7 -31 -16 -10 -39 -59 -2 20 0 -43 -67 -83
3446 -83 -24 29 24 -77 -129 -55 41 43 -65 -143 -63 23 52 -11 -45 -58 -14 18 10 -40 -51 -18 20 -22 -34 -20 16 -18 -53 -38 0
3477 0 32 6 -55 -72 -7 62 45 -55 -111 -49 49 41 -37 -85 -40 -9 29 6 -32 -82 -60 -1 -7 -14 -31 -19 -28 -54 -37 5 5 -53 -84
3510 -84 -26 58 19 -22 -56 -36 26 37 44 -38 -49 -10 55 57 0 -35 -5 38 27 53 7 -7 13 36 50 27 34 46 5 -18 20 75
3542 75 49 -25 -41 12 86 78 16 -52 -43 30 75 69 -40 -94 6 98 64 -27 -71 -12 40 13 -6 6 -21 -30 -16 10 -11 -13 -28 -23
3574 -23 -32 -26 18 0 -70 -83 -25 30 2 -56 -57 -57 -18 6 -2 -39 -75 -34 -13 -38 -53 -47 -33 -62 -35 13 -4 -49 -86 -49 5 12 -31 -37
3608 -37 -68 -64 -13 28 2 -84 -102 -3 53 22 -46 -56 -20 28 42 21 -36 -51 -15 40 36 16 -18 9 5 -5 33 43 26 -11 -21 18
3640 18 69 48 10 -29 -40 21 82 30 -45 -62 12 37 39 -3 -34 -33 17 20 38 -40 -73 -45 13 34 7 -37 -31 -35 -39 7 23 -32 -82
3673 -82 -39 29 22 -21 -76 -58 -33 7 25 -15 -54 -60 11 36 12 -47 -13 7 -5 24 29 13 -13 -43 -17 28 16 10 -10 -51 2 36
3705 36 61 -34 -83 -12 58 47 20 -33 -46 -8 30 46 -16 -80 -62 -17 46 -26 -95 -58 -9 -7 -29 -43 -40 -50 -38 -29 -43 -33 -31 -31 -81
3738 -81 -89 -42 24 0 -103 -83 -13 20 15 -57 -65 -26 15 42 11 -30 -16 31 25 10 3 -1 12 18 24 39 47 32 16 25 48 93 74 17 -14
3773 -14 10 100 113 52 -15 6 89 91 36 24 5 17 56 58 31 5 -2 54 35 18 24 15 -6 -36 -8 31 67 14 -48 -37 19 67 17
3806 17 -55 -74 -46 28 80 -35 -112 -83 27 96 23 -100 -93 -20 49 29 -30 -69 -46 27 20 -33 -41 -20 -33 -33 -14 8 -6 -20 -54
3837 -54 -51 6 58 39 -47 -87 -26 69 59 -27 -118 -54 26 60 0 -89 -56 -10 58 11 -25 -33 -18 1 9 -21 -28 -2 -25 -34 -38 18 35
3870 35 -17 -77 -28 31 54 -20 -79 -56 20 68 16 -46 -81 -28 62 45 -40 -79 -22 31 29 -14 -37 -47 39 17 -33 -56 17 73 32
3901 32 -77 -68 41 62 10 -61 -73 12 69 42 -36 -49 -32 68 95 11 -49 -30 53 87 29 -41 1 52 58 5 -17 33 52 29
3931 29 -9 11 91 82 21 -61 -39 44 108 47 -86 -72 21 102 69 -39 -100 -9 70 62 -27 -94 -43 19 50 -31 -49 -48 -8 -3 -29
3962 -29 -23 3 -47 -66 -66 -4 -5 -10 -77 -123 -52 46 72 -69 -125 -82 56 79 1 -113 -107 8 96 36 -78 -82 -10 79 71 -18 -60
3993 -60 -4 63 69 29 -29 22 56 13 -2 21 50 83 4 -23 5 76 108 -2 -81 -21 86 88 13 -73 -31 70 97 37 -36 -64
4023 -64 12 85 41 -60 -63 18 52 24 -59 -67 1 31 -11 -80 -41 36 41 -10 -63 -51 35 44 -28 -60 -69 0 57 13 -51 -51 11 39 32
4056 32 -29 -6 35 51 -10 -53 -3 50 50 -32 -33 13 84 61 -26 -54 -7 89 98 -18 -84 -35 86 122 21 -102 -65 32 102 36
4086 36 -80 -54 10 64 28 -25 -50 -21 4 13 -16 6 -3 -27 -41 -48 9 40 2 -62 -55 32 91 59 -75 -103 -22 112 73 -56
4116 -56 -103 -50 80 99 6 -76 -80 21 86 43 -46 -63 -17 81 22 -12 -18 14 31 -24 -21 14 54 5 -36 -26 44 78 -5 -65 -56
4147 -56 22 85 45 -32 -66 -29 85 84 -7 -75 -36 55 54 -8 -63 -14 49 55 6 -63 2 44 47 -5 -28 4 51 14 1 -10 18 38
4179 38 35 -3 -22 -4 38 57 -35 -60 -13 34 40 -24 -62 0 33 9 -58 -49 5 31 -4 -45 -36 12 24 2 -77 -62 29 57 11 -66
4211 -66 -85 -12 88 56 -21 -104 -22 69 91 13 -64 -9 42 74 25 0 -19 3 26 30 37 42 16 6 1 20 59 55 -2 -49 -1 84
4243 84 103 23 -86 -53 50 96 34 -67 -54 7 69 58 -24 -82 -63 20 46 -13 -84 -56 -24 8 -5 -56 -37 -19 -28 -51 -23
4272 -23 18 -3 -43 -65 -11 26 18 -32 -74 -48 28 41 -21 -89 -61 18 71 20 -42 -71 2 54 9 -27 -56 -13 34 21 -26 -21 37
4303 37 24 5 -32 -1 19 36 -10 -32 -21 18 53 3 -42 -41 21 30 -16 -55 -48 12 9 -16 -21 -23 1 4 -23 -30 -23 0 -9 -28 -45 -27 23
4338 23 5 -30 -43 -13 30 50 2 -70 -27 30 56 0 -53 -31 17 56 20 1 -12 15 34 63 25 -20 9 35 40 48 34 7 17
4369 17 30 33 40 78 28 -4 1 43 82 49 -44 -55 -4 52 62 -3 -72 -23 34 87 4 -52 -67 -4 46 19 -33 -60 -26 8 12 -11
4401 -11 0 -16 -5 -12 -13 -12 -13 -34 -57 -30 9 8 -13 -60 -50 -21 12 -17 -36 -78 -52 -9 6 -53 -62 -39 -7 9 -22 -62 -31 -12 1
4434 1 -19 -27 -37 -26 -34 -41 -27 -15 -6 -8 -53 -38 -14 21 -7 -39 -62 -26 15 -4 -12 -11 -15 -4 16 10 -18 4 7 -4 16 -13 -3 27 -2 -10
4470 -10 9 27 36 -4 -37 -25 30 65 27 -18 -11 12 66 31 -13 -34 0 20 34 10 -37 -39 13 37 1 -1 -8 25 -10 16 10 -5 -33
4503 -33 -17 -2 19 32 16 -35 -53 -13 26 32 -30 -31 -30 44 36 26 -30 -11 5 41 33 -14 -29 -17 33 10 20 3 1 6 24 29 36 29 13
4538 13 -2 38 51 20 -3 -20 -9 16 25 6 -11 -26 -23 27 22 -12 -60 -55 8 4 -20 -44 -34 -7 -3 -4 -42 -45 -43 -35 -26 -18 -12 -48 -25 -38 -34
4575 -34 -10 -29 -13 -34 -24 0 -17 -8 -30 -29 -18 11 34 -9 -27 -8 -2 -3 -3 14 -9 8 -13 -2 22 -2 17 -9 -9 4 22 47 1
4608 1 -16 4 22 44 -6 -26 -23 -2 24 21 -5 -17 -15 6 8 -9 -21 -12 -7 -16 -3 -6 -9 -6 -10 -11 19 37 -25 -36 -40 21 38 -15 -15 -10 -15 21 14
4647 14 6 -38 -7 13 35 37 29 -20 0 49 31 29 4 -12 6 40 48 40 -1 -4 3 4 35 36 9 -22 24 29 33 14 -16 -18 27 50 50 -1 -31
4684 -31 33 24 20 -10 -10 -16 1 -3 -6 -1 -19 2 39 29 11 18 12 -9 -9 15 13 27 -2 -20 -26 4 43 -20 -25 -20 -2 15 21 -18 -29 -2 1 21
4722 21 -7 -37 -31 -4 -10 6 -11 -3 -9 -19 -13 -13 -8 -2 -28 -13 -20 16 13 -26 -58 -36 2 9 -7 -35 -27 -3 15 19 -27 -26 -15 -8 -6 -5 -19 0 -11
4761 -11 9 4 21 -9 1 -10 -6 16 52 22 -18 -18 2 21 28 -18 -14 12 26 43 23 -28 -15 30 22 19 -12 -49 -7 27 9 -4 -8 12
4795 12 -6 1 9 1 8 9 -22 8 16 21 -3 -20 -33 -15 36 19 -17 -5 -31 29 32 16 -8 -23 24 49 18 -1 6 12 22 31 34 19 19 12 16 43
4833 43 21 56 39 22 31 32 52 34 3 6 16 45 56 -8 -11 -18 30 14 -6 1 -13 -2 22 16 -22 -23 0 -1 -13 -10 -5 -11 -31 -4 -28 6
4869 6 -8 -13 -31 -18 -12 5 -6 -23 -44 -8 8 22 -16 -21 -7 -9 22 -11 -10 -6 -11 17 12 -2 -1 16 14 11 12 6 8 18 11 15 8 8 -9 -15 1 21
4909 21 23 2 -12 -18 13 25 5 -13 -24 -5 19 -2 -6 -31 -19 6 0 -4 -29 -21 -14 6 -13 -33 -6 -12 -25 -10 -7 9 4 7 -28 -18 16 22
4945 22 8 -9 -15 19 30 31 -16 -17 0 25 18 13 -4 -22 21 21 44 33 -2 14 35 -11 -20 23 10 -5 -11 17 25 22 16 -14 6 1 21 -9
4981 -9 -22 -17 -13 19 13 -8 -12 4 13 17 -13 -7 8 20 24 15 14 -10 -5 6 -3 19 32 -1 0 -11 1 8 25 16 10 -20 20 31 13 -5 -11 -1 8 -10
5021 -10 -20 -5 6 32 1 18 -10 -10 10 -1 -17 -3 -10 7 -17 -15 -13 -9 11 -19 -15 -17 1 3 -17 -29 -17 8 16 9 -18 -22 -1 0 17 -18
5057 -18 -13 8 -6 -8 15 10 8 7 5 14 20 10 7 2 14 15 47 8 9 3 -1 -9 14 14 -11 4 25 9 -10 -21 -2 -1 -4 12 -19 -15 -21 0 -8 0 -7 -17
5099 -17 -9 -15 -15 -14 -10 -13 -34 -26 -8 -4 1 -17 -34 -6 3 15 -4 -10 6 8 15 9 -7 0 -4 33 20 15 -2 6 30 14 18 26 34 1 0 31 18 18 5 -6
5141 -6 -6 8 22 19 -15 -1 2 21 24 -4 -8 -15 11 18 20 -22 -6 -13 0 8 -21 -17 -10 -3 0 -4 6 -20 -28 -14 2 4 10 -14 8 -13 4 8 12 12 3 -7
5183 -7 -6 20 -9 -4 -1 11 30 3 4 -11 -3 11 41 4 -17 -25 17 18 -20 27 19 5 8 -3 4 7 3 -12 -20 -14 15 -7 -17 -37 -6 13 2 -2
5221 -2 -7 -35 -11 -6 6 -17 -30 -11 -12 -7 -5 -7 -12 -16 -3 -3 4 -1 -17 2 -1 -1 16 7 0 2 18 18 10 -20 8 -10 13 23 -11 -7 -18 3 21 14 31
5262 31 -1 -10 14 4 9 1 -21 -5 18 -1 -2 -5 0 4 7 21 1 6 -14 10 -5 13 -8 -1 -11 1 -2 1 10 7 -6 2 2 18 22 4 25 7 0
5301 0 -4 -6 0 -18 6 -7 -20 12 -8 9 -8 10 -10 -1 -16 -13 -10 1 9 14 -26 -10 -14 -15 -6 -14 -31 -30 -17 -4 8 -30 -29 -28 6 -11 -17 -33 -34
5340 -34 7 3 -16 -34 -41 -41 -18 -23 -26 -28 -17 -8 3 -10 -13 -16 -18 -13 25 20 -7 3 -12 3 13 -11 3 10 -15 13 4 13 19 -9 7 12 25 7 20
5379 20 -2 -4 8 5 27 -1 -29 -21 9 15 5 -2 -36 -13 -15 -4 -10 -3 -18 -22 -23 8 -4 -25 -11 -9 4 -5 -7 -16 -19 5 11 -24 -13 -1 -4 20 33
5418 33 14 4 18 1 0 30 -8 17 8 12 14 9 17 10 2 1 9 9 9 -17 -18 22 7 3 1 -21 7 -5 -8 -1 -19 -31 -11 -19 -26 -18 -11 -22 -9 -33 3
5459 3 -17 -3 -13 -26 -18 0 12 -8 -22 -13 -12 -9 8 -2 9 -17 -3 5 7 -19 -27 -2 7 8 4 -3 -5 -3 -29 11 16 12 -10 -6 1 27 19 16 -4 0 26
5500 26 -6 -2 -4 -21 -19 19 16 3 -51 4 4 5 -7 -23 -8 24 22 -3 -6 -5 -30 9 13 21 -1 -1 15 8 -5 11 29 -21 -6 14 18 38 -1
5537 -1 19 9 20 24 27 1 -11 0 25 23 -2 -8 22 21 14 -5 16 5 9 11 8 5 -5 1 -22 -35 -15 7 -24 -11 -19 -21 -31 17 -8 -13 -5 -16
5575 -16 3 -26 -9 -29 -3 -9 -25 -29 -25 -29 -8 -6 -11 -10 -14 1 -18 -2 -11 6 6 2 -16 -3 18 3 2 -8 -3 14 0 21 -24 -17 10 30 -5
5612 -5 8 -4 6 6 5 -4 10 -7 13 -4 13 15 13 0 -3 -22 2 4 3 -21 -25 -6 15 5 -6 -23 -16 3 15 2 -26 -3 2 23 -26 -11
5648 -11 -18 -2 10 11 -7 -7 -6 3 -2 32 20 31 8 15 15 5 26 7 8 6 25 33 28 9 -4 11 9 31 17 -5 -7 22 15 9 -5 1 -13 -9 7
5687 7 -7 -26 -15 -9 18 -9 3 -10 -9 14 -26 -12 15 -7 -27 -28 2 24 10 -14 -18 2 -8 1 -10 -17 -32 12 18 -1 2 4 2 7 3 -9 6
5724 6 2 3 -2 -6 26 -2 28 26 -7 30 41 24 -6 -27 -5 -2 12 11 -20 -2 0 -3 6 -9 -4 -5 -4 3 -20 1 -1 -12 -16 -7 -6 -14 -20 0 -5 -4 0 -8 -9
5767 -9 8 14 27 17 8 -10 22 56 33 12 10 -7 16 -1 13 -4 13 20 15 17 -21 -1 -2 14 13 -11 4 23 -11 3 14 8 28 -8 -16 -19
5803 -19 26 9 14 -15 -9 -8 7 -1 -21 -33 -10 -22 -8 -10 -4 -28 -3 1 13 -26 -25 -5 -5 -5 10 1 -4 -14 -4 -20 13 20 -9 -30 1 34 17
5840 17 17 1 16 14 32 1 7 8 2 1 -1 20 1 6 6 11 -10 -6 1 -5 -25 -6 18 1 -23 -13 -26 0 6 5 -13 -26 -14 -35 -6 -13 -42 -12
5878 -12 -14 0 -2 -14 -21 -24 -15 -13 -13 -4 6 -7 -7 -7 26 11 16 -9 -3 -11 13 2 -17 10 13 28 -18 2 7 -11 9 4 23 -6 -10 -11 -3 16 5 -25
5918 -25 -7 -8 8 -12 -3 -39 7 -17 -21 16 -15 -15 4 -4 -7 -22 -8 -21 9 -4 -14 0 -17 3 -28 2 -14 3 2 -8 -6 6 -20 -9
5952 -9 -13 1 20 10 9 21 -1 8 2 1 -2 -6 -13 15 1 27 12 0 5 -10 -5 20 7 -15 -7 -8 9 10 -1 1 -8 -4 -5 -8 -10 -14 -12 -16 -13 -1 -8 -20 -24
5995 -24 -32 -1 -13 -15 -6 -2 -13 9 -3 -6 -6 -6 13 18 -3 13 -4 -4 -2 -21 9 2 14 28 20 29 13 1 5 0 25 15 18 -8 -5 15 8 26 15
6034 15 -12 -1 -13 -8 4 1 -2 -4 -4 4 -25 -11 -25 2 10 -2 -10 -7 -22 -10 -1 -3 -4 4 -26 -2 0 2 -14 -22 6 -9 9 20 -3 -4 -1 -14 4
6073 4 15 16 -5 36 10 12 -10 11 -7 -4 -10 -1 16 -10 0 1 -6 4 21 13 -8 -10 -25 2 -12 -11 -17 -11 4 0 -1 -20 -17 -27 -8 -18 -1 -25
6111 -25 -28 2 -13 -18 -16 -3 -6 -23 -2 -4 -6 -6 -15 2 -12 -11 1 -15 -10 10 31 -4 2 0 -5 16 33 8 4 1 5 11 18 -26 14 5 -21 -3 1 -6 3
6152 3 8 -1 6 13 -14 17 -14 -14 11 -17 -12 -6 -15 -19 -12 3 -3 -22 0 1 2 1 -22 -6 -13 -5 2 -6 -12 -17 -20 25 -7 -8 -11 12 10 14 -6 5 4 -5 1 17 12
6197 12 4 9 -4 33 14 19 -13 -1 12 26 28 -4 2 17 1 2 -1 -9 13 9 12 8 -5 -3 2 5 -16 -19 5 6 -6 -9 2 1 -14 3 -16 4 -17
6236 -17 1 7 -5 -21 -22 6 -11 -8 -3 -9 15 -12 13 21 -3 -4 8 12 13 11 16 17 12 3 25 28 2 -5 11 31 11 4 5 -4 1 6 -10 -3 -9 -1 1 8 13 -5
6280 -5 -10 -15 -14 -14 -2 -18 -14 -6 -17 -2 -10 10 -5 3 -3 1 4 -15 -21 -10 7 1 0 -7 -3 6 12 18 -17 1 10 23 7 7 13 12 22 -8 12 11 11 -4 11
6323 11 2 27 -9 -3 8 7 26 25 6 1 -18 1 -6 -8 -11 -14 -17 11 -3 -23 -24 5 -3 -14 -15 -34 -8 -9 -2 -29 -2 12 -33 -31 -22 -1 2 -9 -13 7
6363 7 -1 -10 9 0 -7 3 7 3 12 11 7 -1 4 26 8 1 14 16 -8 16 16 5 5 0 2 3 14 -24 7 27 0 9 -6 -4 -7 -1 -1 -10 13 -3 -8 25 -9
6406 -9 -2 -5 9 -6 -1 -5 -27 4 0 -3 5 6 14 -3 5 20 13 -2 11 -2 -23 12 14 9 4 -1 23 18 16 5 0 21 7 23 28 0 24 -13 20 5
6446 5 -1 15 11 10 -3 1 0 -3 -15 -2 10 -1 23 -9 -7 -16 -8 1 -2 -2 6 -9 -13 2 -7 0 -14 0 -23 5 0 -8 9 -4 -1 -4 -2 6 14 -17 27 2
6488 2 0 15 -2 17 -15 17 6 14 1 25 22 5 -3 18 12 12 -13 -1 21 -6 14 -9 14 -5 11 0 -6 18 -21 13 -1 3 2 7 -6 -11
6524 -11 -14 -11 1 -1 -13 4 13 -6 -18 -7 -3 -11 -4 -3 -25 -6 -13 6 -6 -7 8 -7 -1 -9 4 7 -15 3 14 2 7 5 -6 2 12 -17 3 11 6
6563 6 -4 23 7 -20 -5 1 8 7 10 12 4 12 5 17 6 -3 13 -14 2 -31 -3 -6 -5 -12 2 11 -17 -22 -4 7 -9 -25 -26 0 3 -12 -9 0 -2 10
6603 10 15 -5 -3 15 1 -6 -13 20 12 -9 20 7 0 12 14 19 9 11 17 -6 21 3 -1 0 9 8 -19 22 -2 17 15 -13 -2 -1 0 6 -3 -19 -27 -25 -7
6644 -7 -25 -25 -12 -7 -26 -5 -3 -6 -10 -5 -6 -4 2 -5 6 -2 -15 -4 9 -8 20 13 41 -2 -1 -20 52 -26 -24 8 24 13 -29 -46 4 4 18 24 13
6683 13 13 6 10 1 33 1 -14 16 25 28 -5 5 -7 -10 11 5 -12 -32 1 -20 -10 -3 1 -26 -14 7 -12 -11 -15 15 -32 -2 -8 -9 0 -5 -3 9 -8
6722 -8 12 6 23 7 15 15 13 15 -7 25 16 3 25 10 30 16 -5 7 -5 8 0 -7 13 12 -11 -1 -21 7 -14 5 4 9 -13 -1 -12 -7 -14
6759 -14 -19 -2 -15 -3 -4 -7 -11 -4 2 -21 -2 -1 -12 2 -24 -11 -3 4 -2 6 -13 6 -12 -5 -8 3 5 -3 10 8 4 36 -1 9 -3 0 -20 31 12
6798 12 19 9 -12 -3 14 -13 0 8 2 -3 2 23 2 2 -4 0 -12 -4 -9 -20 6 -10 3 0 -5 -3 -16 0 -7 0 -16 -18 -17 0 -18 -10 5 -7 13 -12
6838 -12 3 -4 5 9 17 11 6 14 -3 -5 22 -2 11 -17 9 -6 -5 21 21 17 9 4 -7 17 18 16 5 -1 9 -10 4 8 -28 -20 13 3 8 -11 -3 0 2
6879 2 -14 0 -3 -16 -11 -28 -15 -14 -3 -12 -1 -1 11 -8 -7 3 5 -4 -4 -8 4 8 6 -16 -10 22 17 0 3 10 -1 16 2 13 28 4 0 16 6
6918 6 24 2 13 -7 13 17 19 15 10 27 -8 8 -16 -19 9 8 8 -20 7 -17 -15 -3 -6 -3 6 -3 12 -17 -5 -4 -28 2 -18 3 -18 -21 -8 7
6956 7 -24 -9 1 7 -1 16 11 12 8 -17 -5 0 -7 4 12 -10 -7 -6 12 1 11 11 18 -8 13 14 14 23 19 -7 4 -17 -12 21 5 -13 -3 1 12 3
6996 3 -14 -2 0 -39 -10 -7 -10 -10 1 -27 -5 -24 -8 -5 -17 -20 -14 24 7 2 -16 18 -4 12 -3 2 3 14 5 4 0 14 30 7 26 19 15 15 6
7035 6 35 13 8 2 4 14 7 0 -10 -3 9 19 -1 7 -8 -4 -1 -25 18 -18 -4 -11 -6 -6 -7 -10 -21 -2 11 14 17 -3 -16 -1 -23 -8 -23 3 1
7074 1 10 2 3 -8 -43 6 7 7 -2 -1 6 10 18 11 3 -1 11 11 18 11 30 -3 23 6 26 17 1 12 -5 3 -1 13 9 0 2 1 -11 -7 -14 2 0 -10 -19 5
7118 5 -1 -24 -2 -17 -32 -3 9 12 -25 -20 -19 -5 3 -6 5 1 4 -7 9 13 10 1 9 -7 7 29 -4 9 -11 5 7 21 7 12 10 8 -4 19 6
7157 6 18 8 9 -1 11 11 1 16 3 -20 -20 12 5 -13 0 6 5 -1 5 -5 5 -10 -7 1 -15 -15 5 -18 -1 -9 -13 -10 -1 -10 -9 -2 -7 -4 1 7 11 0
7199 0 14 -2 -18 5 -2 14 7 5 -5 38 -5 6 12 14 -6 -6 6 5 5 -5 11 -12 1 23 17 4 35 -16 6 2 -6 -28 7 -8 -6 -11 -13 15
7237 15 -4 -3 -22 -23 -11 -3 -14 -11 -11 -6 1 -9 -1 5 20 5 -14 10 -4 5 14 -4 0 8 -4 22 -2 15 -5 23 16 12 16 1 15 16 27 19 14 19
7277 19 25 -6 18 5 3 16 1 -6 -2 3 12 1 13 -2 -6 24 6 -10 6 -21 -4 22 -22 -7 -29 -3 -17 -12 -11 2 -15 -2 4 -9 -13 0
7313 0 -3 16 27 11 21 8 -12 12 -15 4 -9 15 19 9 23 7 24 14 25 15 14 12 3 -7 19 4 9 -4 -12 -12 -6 0 -1 -8 -4 6 -5
7350 -5 1 -6 -7 -3 -7 -19 -17 -2 6 -14 -10 -25 11 -17 -18 -22 -16 -22 -11 -3 -13 14 -8 -9 1 -10 -5 3 -6 5 16 4 -19 13 -1 -6 1 25 7 -7
7390 -7 6 5 32 10 3 18 -17 -2 13 20 9 2 17 -3 -15 8 -9 -9 -6 0 -27 -12 -12 -8 -7 -10 9 -14 -9 6 -2 3 1 -8 -3 4 1 -9 1 -20
7430 -20 8 -17 8 -3 -7 17 3 19 3 -1 -6 -4 19 14 5 8 -3 -2 4 5 17 1 5 10 2 25 8 -3 8 -5 -13 1 6 -10 -8 7 -13 14
7468 14 8 -2 0 -11 11 -12 13 -8 9 -8 1 -9 -10 0 -3 -10 5 -2 -20 -3 -14 -10 1 10 12 1 -2 -1 18 2 -15 -8 15 28 29 38 -5 15
7506 15 13 1 32 19 3 6 -1 8 5 -9 2 2 9 -2 -8 27 -12 -18 -4 25 -2 -5 -4 -2 0 0 8 4 8 0 -18 25 -12 -7 -6 -15 -7 -11 3 25 3 1
7548 1 16 -2 1 9 20 13 -3 11 18 -17 -1 -9 15 27 29 0 20 22 19 18 14 -10 -4 4 12 11 1 19 7 2 -7 1 8 -15 -12 5 15 0 5 13 -14
7589 -14 -2 11 -6 -6 -10 3 -3 -11 3 -4 -1 -19 3 -4 6 -19 -5 -6 15 8 -5 -3 -21 7 3 -6 -6 8 -15 21 3 10 16 14 29 14 14 22 12
7628 12 21 9 8 4 18 12 6 -8 5 31 -7 27 6 -11 0 12 -1 -1 -18 -1 12 -28 -26 -14 3 -9 2 13 -19 -23 -14 -12 -3 -2 -7 -8 -10 -10
7666 -10 4 -26 -14 0 4 -7 6 -11 -8 -8 -15 -11 -20 4 15 15 -9 -4 17 -6 -7 -10 -6 -5 -2 4 -10 -13 16 -2 10 15 3 15 -10 34 -3 5 -26
7705 -26 -16 -7 -31 -23 -4 -6 4 -7 6 3 6 -20 -4 -5 -20 -23 5 -17 13 -17 12 14 -6 21 -5 -2 9 0 -19 7 -12 3 19 11 6 1 28
7742 28 6 0 6 -7 3 9 7 8 33 -2 -10 -11 2 16 2 -8 -15 -1 19 -1 9 -19 -11 -5 19 -23 -18 -6 -6 -22 21 2 -39 -8 -47 1
7778 1 1 -4 -19 -23 -4 -23 -3 -33 -1 13 -13 19 -15 2 4 -5 11 3 14 22 9 10 25 9 17 9 -4 20 -6 4 3 1 12 -12 -3 29 2
7815 2 10 -15 -14 -10 7 -5 -15 -3 -14 2 -8 -2 -7 -6 4 -3 -4 -20 12 -18 -13 9 -16 3 -14 -6 9 6 1 -1 -13 -20 15 8 3 -6 14 1 23
7854 23 -2 19 -1 3 26 13 3 -2 10 4 1 6 23 1 15 -13 9 2 17 4 0 12 -3 -16 9 -14 -7 -3 -2 11 -27 -29 -7 -16 3 13
7890 13 -16 -8 -3 -6 -18 -5 -7 -5 -14 -28 -22 -1 -18 -13 -14 -6 -8 1 7 -10 -3 4 -17 18 8 -5 22 6 5 14 10 33 3 4 17 7 16 -13 -7 21 -6
7931 -6 20 5 0 -8 21 -6 9 -8 -10 -15 3 0 -13 -12 -6 14 -12 11 6 -8 5 3 -7 -4 -10 -4 -8 -15 -17 0 -21 -4 9 0 -5 6 5 2 9 19 -5
7972 -5 -3 5 -1 18 0 13 -6 5 20 3 25 -1 1 4 8 7 7 15 9 6 -7 5 -2 15 8 -1 11 9 -9 -6 -12 0 8 -11 -14 -3 -12 -2 -7 -15 1 -4
8014 -4 -22 -14 -16 -15 -30 -18 -8 -5 -19 -11 -9 14 -26 8 13 4 -18 -2 -8 12 21 -3 2 0 13 8 13 1 -1 6 -5 -3 -7 30 -5 0 -5 10 -4 11 7
8055 7 -9 -21 -4 3 18 -11 -7 6 -2 -7 -8 -8 -16 -28 -17 -5 -3 -9 -10 2 -21 -17 -20 9 -23 0 -3 -8 -7 -9 -2 -13 8 -4 14 20 21 9 4 19 16
8096 16 23 24 25 15 1 4 27 22 11 39 18 7 -5 19 3 7 10 -15 4 14 16 -2 -3 3 -8 0 -21 25 -1 -12 -5 6 -7 8 -7 -51
8132 -51 -21 2 -3 -2 -18 -11 -5 -5 -13 2 -12 -3 5 -5 -8 -11 -5 6 -1 12 35 0 14 16 14 19 28 18 14 2 14 19 29 5 10 11 32 11 -11 19
8172 19 -11 14 3 -17 -14 2 0 3 -20 3 -1 -16 -20 -21 -16 1 -1 -10 2
8191B
$$ Imaginary data points
##PAGE= N=2
##DATA TABLE= (X++(I..I)), XYDATA
0 0 0 0 0 0 0 0 0 0 0 0 0 8 -8 8 -8 8 -16 16 -17 24 -25 32 -37 41 -48 56 -64 72 -83 94 -105 119 -132 148
34 148 -167 187 -206 229 -255 284 -315 347 -384 426 -471 524 -581 646 -723 809 -911 1031 -1177
53 -1177 1360 -1596 1912 -2358 3048 -4252 6946 -25248 43946 80987 -52769 -94693 -11587
66 -11587 46112 -7445 -35469 -116 12042 -28522 -20729 32750 34949 -25808 -37584 18358 50342
79 50342 14352 -17979 -3393 24732 26612 14425 8188 14620 23622 21802 9108 12423 35256
92 35256 38504 7635 -3834 31122 53583 21199 -6700 20223 48530 26135 3268 26403
104 26403 43679 14468 -1684 33458 52285 13850 -9382 27168 50796 15362 -7635 26186
116 26186 46257 10487 -9961 25453 45916 10858 -11899 17234 36785 11796 -2550 18759
128 18759 22945 -3434 -2656 31088 30362 -12782 -22688 20065 41278 5918 -25814 -8533 22077
141 22077 22017 822 -12879 -10159 4011 15871 8545 -11771 -16901 -1386 8832 2495 -5132 -9168
155 -9168 -15193 -10833 9610 13150 -18694 -38496 -7112 25644 1511 -38610 -25633 11933 4677
168 4677 -27959 -21567 6750 -3132 -32838 -22259 10096 2074 -31963 -30028 553 3026 -20614
181 -20614 -23124 -6166 -8313 -23200 -16235 1845 -4805 -26218 -24869 -3895 2632 -10852 -20997
194 -20997 -17292 -8533 -2577 -3603 -12282 -17961 -10391 -430 -3307 -10757 -7904 -2881 -7788 -10663 -364
209 -364 5938 -5062 -13656 -3404 6587 -34 -5502 2651 4831 -7316 -7655 11877 17554 -4412
223 -4412 -16871 2978 22280 11666 -6540 -4392 6645 8671 8594 11465 5316 -6033 -319 18790
237 18790 20062 -255 -8991 6419 18824 10933 399 2691 8086 7224 6174 8087 6885 3269
251 3269 3964 6937 6144 4438 6024 6013 1761 961 6348 8263 2920 -431 2306 3936 2678 3944
267 3944 4808 -850 -4919 2746 10798 3244 -8933 -4749 8485 7569 -4793 -6751 2411 4664 -1745
282 -1745 -2915 1304 -160 -4069 -456 4273 -880 -7730 -2894 5595 2393 -6742 -6008 2038 3164
297 3164 -2890 -4879 -1298 464 -1246 -2223 -1792 -1594 -1096 -780 -2441 -3694 -1182 1712 -707 -5105
313 -5105 -4208 581 1898 -1345 -4034 -4196 -2607 889 3035 -1416 -8233 -6331 3458 6136 -3011 -9758
329 -9758 -4101 3762 2393 -3278 -4137 -2210 -2092 -1452 1191 609 -3901 -4883 -256 2246 -1058 -3323
345 -3323 -1049 61 -2498 -2616 1614 2976 -1829 -5485 -2129 3429 3747 -755 -4232 -3128 1395 4666
361 4666 2730 -2556 -4532 -355 4609 4212 -218 -2992 -1513 2045 4150 2795 -983 -2575 610
376 610 4158 3046 -454 -767 1585 1783 124 770 2856 1907 -1224 -1295 1902 3311 1244 -880 -999
393 -999 -160 1076 2423 1679 -1669 -3273 -32 3597 1911 -2761 -3631 -115 2251 655 -1925 -2313
409 -2313 -979 100 -105 -1227 -1911 -1235 -254 -778 -2085 -1856 -227 71 -1649 -2782 -1644 135 238
426 238 -1253 -2456 -2079 -347 863 -153 -2176 -2238 -20 1241 -142 -1669 -843 645 382 -749 -420
443 -420 904 1109 59 -555 -28 1077 1828 1348 -276 -1013 808 3228 2792 -197 -1539 611 3243
460 3243 3025 766 -637 42 1803 2917 2180 272 -575 719 2297 2062 762 288 684 733 538 1039
478 1039 1527 788 -550 -665 547 1592 1256 -236 -1625 -1367 708 2164 747 -2180 -2785 -206 2008
495 2008 999 -1719 -2821 -1440 595 1143 -380 -2226 -2284 -503 639 -318 -1612 -1449 -711 -776 -1051
512 -1051 -449 0 -860 -1884 -1446 -88 447 -268 -1226 -1708 -1175 353 1139 -308 -2334 -1869 665 1583
530 1583 -263 -1863 -1116 299 430 -206 -402 -326 -303 -193 -64 -223 -213 222 138 -813 -1025 352 1411 234
550 234 -1593 -1437 410 1426 610 -827 -1521 -722 1033 1666 85 -1789 -1219 972 1530 -19 -983
567 -983 -262 499 356 292 546 246 -217 128 767 536 235 841 1150 21 -616 992 2565 1408 -831
586 -831 -645 1556 2595 1560 263 -55 581 1760 2546 1654 -45 -100 1727 2703 1617 480 803 1400
604 1400 1276 1252 1777 1739 870 391 836 1442 1762 1738 732 -546 -26 2287 2988 325 -2056 -652 2308
623 2308 2524 137 -1454 -862 454 1276 1041 -544 -1914 -1051 1052 1098 -1101 -2000 -470 433 -790
640 -790 -1693 -733 -4 -958 -1789 -1286 -581 -637 -875 -1261 -1988 -1915 -264 699 -1060 -3210 -2338 249 648 -1253
660 -1253 -2397 -1649 -607 -151 -251 -1033 -1904 -1427 150 348 -1131 -1611 -278 415 -681 -1185 -6 637
678 637 -349 -1107 -446 350 449 353 -56 -1012 -889 1078 2128 71 -2105 -794 2020 1949 -439 -1262 74
697 74 1023 788 529 205 -352 -40 1180 1111 -449 -684 1065 1522 -328 -1233 575 2005 702 -1037
715 -1037 -662 713 1206 873 83 -858 -643 1221 2142 247 -1837 -777 1699 1786 -100 -771 159 699
733 699 507 632 586 -144 -240 765 1068 148 23 1035 928 -553 -518 1471 2032 41 -1257 87 1617
752 1617 1405 399 -167 -431 68 1529 1982 80 -1681 -269 2088 1600 -662 -1028 554 1127 325
769 325 -49 125 -62 -164 319 353 -422 -284 727 499 -1160 -1310 644 1416 -392 -1955 -989 615 799
788 799 -164 -1120 -1517 -840 737 1043 -924 -2438 -1056 1123 711 -1287 -1639 -361 127 -380 -501 -306
806 -306 -626 -750 -180 -5 -648 -669 234 196 -1014 -1020 602 1128 -478 -1593 -404 1046 780 -286 -705
825 -705 -434 123 879 895 -368 -1180 -31 1446 911 -616 -551 654 846 -6 -222 381 537 216 89
844 89 116 10 347 906 323 -905 -676 1047 1521 -195 -1436 -406 1106 1012 -160 -772 -635 32 775
863 775 721 -462 -1311 -315 1030 607 -837 -912 241 528 -272 -581 -40 233 -126 -400 -346 -156 239 499
883 499 -113 -1071 -684 823 1154 -354 -1436 -412 1027 943 -188 -726 -428 210 740 637 -241 -768 47
902 47 1029 614 -520 -478 555 712 -125 -335 443 699 140 -319 -99 316 532 500 -28 -619 -273 860
922 860 1111 -193 -1170 -414 928 975 -82 -786 -498 222 630 395 -391 -764 -114 650 379 -473 -514 153
942 153 267 -289 -415 92 248 -115 -366 -214 19 172 186 -143 -632 -379 534 763 -219 -960 -278 784
962 784 620 -264 -551 -60 343 337 188 -43 -177 72 408 291 -84 36 479 377 -220 -216 507 775 176 -446
984 -446 -214 520 792 397 -267 -512 59 869 778 -219 -747 -44 829 648 -191 -506 -109 295 316 116 -162
1005 -162 -257 -17 241 64 -309 -149 178 41 -463 -395 221 383 -195 -715 -404 149 324 24 -435 -642 -306
1026 -306 344 495 -212 -866 -517 318 494 -53 -506 -392 -39 197 215 5 -266 -291 53 321 165 -22 -61
1047 -61 -89 -101 118 432 312 -204 -368 84 557 445 -55 -336 -109 365 612 312 -271 -362 169 638 337
1068 337 -216 -252 163 381 154 -75 -13 87 94 33 -29 -17 112 165 -71 -330 -166 274 280 -227 -523 -164 301
1091 301 250 -171 -438 -323 14 196 88 -314 -443 -136 233 124 -269 -349 -70 120 0 -162 -117 -22 10 -28
1113 -28 -64 -85 24 144 43 -173 -136 143 297 101 -191 -172 74 255 244 41 -159 -131 209 408 214 -105
1135 -105 -128 111 241 165 140 77 -98 -117 139 388 243 -165 -304 5 325 287 10 -231 -284 -19 364 325 -138
1158 -138 -495 -241 269 337 -13 -379 -328 -34 188 151 -65 -235 -241 -71 69 114 4 -211 -345 -145 214 311
1180 311 -54 -401 -317 57 320 204 -119 -376 -277 178 498 197 -409 -471 104 526 288 -169 -274 -37 188
1201 188 272 220 -12 -237 -108 267 406 57 -256 -151 137 239 137 9 -28 -60 8 121 144 19 -125 -112
1223 -112 66 153 45 -101 -160 -39 50 -6 -85 -72 -3 -92 -159 -68 68 -57 -231 -157 -52 -53 -126 -66 -59 -236 -292 -26
1249 -26 151 -114 -416 -250 159 109 -232 -342 -79 98 -42 -164 -145 -50 4 27 -57 -199 -148 130 262 -64 -362
1272 -362 -179 304 419 17 -393 -255 281 547 224 -327 -378 186 566 349 -135 -291 -50 299 436 284
1292 284 -94 -293 -1 481 494 8 -275 -39 257 280 181 145 -46 -238 -9 461 495 -115 -465 -71 442 420
1314 420 10 -245 -182 58 300 343 30 -342 -243 179 404 71 -257 -201 92 193 114 2 -43 12 4 -19 41 181
1338 181 197 -78 -285 -21 389 356 -123 -376 -71 330 400 124 -205 -339 -26 509 535 -116 -603 -145 613
1359 613 538 -158 -487 -68 375 306 -5 -134 -106 18 202 167 -96 -228 3 223 81 -175 -121 49 60 -118
1381 -118 -145 -1 21 -55 -119 -137 -68 -7 -60 -196 -187 -15 49 -159 -315 -118 143 -5 -298 -304 -28 91 17 -141 -255
1406 -255 -261 47 321 64 -464 -465 174 511 32 -475 -287 202 257 39 -80 -103 -55 92 273 144 -114 -132 152
1429 152 233 11 11 205 211 -37 -106 188 451 212 -146 -227 90 492 479 21 -403 -144 522 656 78 -446 -210
1452 -210 338 536 285 -137 -293 -69 441 528 25 -401 -150 388 392 -55 -187 89 141 -75 -1 240 195 -100
1474 -100 -199 35 232 176 74 -119 -237 -31 352 390 -170 -521 -146 437 425 -104 -422 -183 246 374 86
1495 86 -272 -293 110 384 160 -237 -221 148 235 30 -120 -47 74 79 62 -4 -97 11 198 76 -235 -202 234 351
1519 351 -84 -364 -66 320 146 -218 -210 43 139 46 -61 -143 -112 71 185 -54 -347 -164 268 268 -229 -472 -90
1542 -90 344 207 -242 -414 -163 212 274 -70 -437 -334 163 337 -35 -380 -238 120 165 -12 -116 -122 -59 1
1564 1 40 -4 -53 19 53 -117 -169 122 368 67 -390 -238 328 510 45 -352 -270 179 434 308 -132 -416 -136
1587 -136 442 571 -15 -514 -215 408 497 34 -239 -105 143 238 163 -8 -94 14 145 110 -20 21 112 14 -179
1610 -179 -43 231 246 -42 -267 -141 178 306 94 -280 -386 -28 423 288 -286 -531 -51 445 246 -270
1630 -270 -384 -57 225 162 -57 -199 -159 74 179 20 -194 -101 164 142 -134 -184 107 212 -20 -235 -81 190
1652 190 233 21 -167 -119 166 307 99 -194 -151 216 381 54 -285 -105 279 348 -7 -219 -94 236 338
1673 338 96 -205 -206 170 421 157 -291 -294 171 421 121 -262 -274 50 287 188 -99 -252 -116 205 213 -73 -239
1696 -239 -93 132 68 -122 -85 71 68 -115 -162 13 161 76 -132 -261 -77 217 262 -101 -444 -258 301 408
1718 408 -35 -401 -268 167 381 94 -287 -338 -19 314 237 -106 -288 -50 202 126 -52 -77 13 4 -36 -25 116
1741 116 106 -33 -166 -110 122 243 84 -219 -314 24 366 217 -256 -413 -70 320 292 -112 -344 -194 187
1762 187 295 44 -311 -282 85 278 54 -213 -193 84 147 41 -100 -40 84 67 -20 -73 10 134 111 -37 -126
1785 -126 35 235 159 -86 -190 39 256 208 -25 -128 33 246 236 40 -126 22 284 285 26 -132 65 295
1807 295 249 -15 -93 90 296 247 35 -87 41 271 264 56 -128 10 245 268 52 -87 26 156 151 22 -18
1830 -18 -8 69 78 41 28 60 84 -20 -102 -45 135 154 -67 -263 -127 170 195 -74 -315 -207 68 213 50 -239
1854 -239 -313 -64 209 118 -183 -332 -121 87 113 -80 -228 -174 -47 26 -20 -129 -110 -43 -68 -93 -68 22 -7 -163
1878 -163 -216 -53 118 80 -171 -277 -143 97 167 -39 -256 -252 31 230 79 -212 -265 -26 142 90 -93 -151 -71
1901 -71 25 49 -3 -84 -95 -31 3 -24 -1 16 -17 -107 -95 16 111 11 -162 -142 11 136 82 -91 -183 -56 112 156
1927 156 -33 -171 -103 126 157 -1 -111 -17 70 83 32 -47 1 71 104 19 -27 29 164 146 -16 -95 23 203 179
1952 179 21 -76 17 135 176 77 -31 -21 87 181 131 -16 -49 57 133 82 32 33 41 13 8 56 79 69 -12 -58 9 79
1980 79 120 29 -133 -132 32 141 17 -134 -136 -29 47 48 -79 -105 -102 4 31 -29 -82 -91 -31 -42 -67 -30 41 -29 -145 -133
2008 -133 21 93 5 -118 -123 -30 94 82 -31 -173 -141 67 155 13 -162 -151 19 133 56 -56 -141 -54 33 89 20
2033 20 -68 -52 -18 47 27 13 13 -22 -52 -11 64 60 -20 -77 -31 33 45 48 -17 -78 -45 49 106 -19 -85 -61 30 44 5 -12 -18 -28
2065 -28 -14 -10 32 23 -3 -47 -71 8 62 78 -46 -152 -74 103 126 -28 -153 -105 19 152 59 -109 -144 -37 118 101
2091 101 -48 -164 -67 92 86 -50 -49 -13 26 -22 -30 22 40 -6 -55 -58 -2 61 67 -27 -136 -56 102 133 -42 -161 -76 93
2119 93 116 23 -78 -92 -10 92 93 -8 -113 -58 51 62 -6 -32 -2 -19 -17 -11 56 50 -28 -58 -30 59 91 61 -66 -103 17
2148 17 158 149 -75 -134 4 145 134 18 -73 -21 52 93 98 -1 -71 51 130 76 -35 -20 108 88 8 -18 85 160 77
2175 77 -31 -33 88 164 100 -19 -76 14 169 150 4 -82 -7 161 139 2 -60 5 74 76 35 -36 20 46 26 -33 -58 64
2203 64 93 -22 -147 -81 93 98 -22 -185 -142 13 101 20 -146 -211 -88 83 77 -122 -223 -109 48 18 -99 -135
2227 -135 -87 -59 -63 -72 -86 -83 -59 -79 -95 -103 -35 5 -78 -165 -140 49 84 -61 -228 -161 24 133 19 -174 -193 -26 147
2254 147 112 -107 -191 -37 75 101 -50 -90 -15 2 48 26 0 6 0 14 1 40 80 90 -33 -99 29 195 148 -75 -161
2281 -161 19 205 185 -18 -138 -76 139 215 75 -80 -96 95 231 105 -45 -59 92 113 100 -39 41 98 40
2304 40 0 -74 78 151 142 71 17 18 176 178 -3 -107 8 170 216 33 -105 -29 125 186 84 -84 -63 126 188 56
2330 56 -109 -54 104 165 36 -47 -19 77 90 -11 -48 -64 82 94 -14 -131 -87 84 114 -55 -163 -68 47 58 -55
2355 -55 -125 -81 0 17 -50 -126 -96 -6 -1 -118 -128 -12 58 -17 -155 -145 26 100 -2 -161 -176 -26 107 63 -152 -251
2381 -251 -101 145 120 -128 -246 -95 103 100 -32 -161 -106 37 103 13 -83 -72 -2 26 -25 -26 29 39 -11 -100 -49 97
2407 97 125 -11 -155 -83 112 218 98 -138 -167 59 261 177 -116 -220 -3 217 186 -20 -153 -62 157 200 21
2430 21 -103 -90 82 137 42 -34 -14 72 37 -1 5 91 83 0 -89 -31 74 134 -3 -123 -114 52 188 54 -117 -146 30
2457 30 165 108 -111 -170 -28 128 114 -56 -137 -74 100 81 -28 -66 -15 55 14 -57 -22 40 38 -23 -70 -17 67 66 -18 -90
2485 -90 -37 76 119 -11 -128 -68 78 127 -21 -142 -68 110 144 -4 -126 -72 106 139 -13 -142 -86 119 168 26
2509 26 -139 -94 104 174 59 -125 -116 68 207 106 -104 -161 22 188 121 -67 -117 14 140 99 -17 -39 15 61
2533 61 68 18 23 72 86 1 -30 32 120 118 -18 -83 -10 127 174 19 -120 -65 145 225 67 -111 -133 64 173 120 -34
2560 -34 -119 -6 82 108 12 -63 -36 -6 29 27 20 6 -57 -54 5 57 64 -44 -181 -108 36 110 8 -211 -205 -19 133 75 -153
2589 -153 -274 -139 72 120 -77 -268 -184 39 117 -19 -193 -161 -32 51 -7 -122 -120 -58 11 -17 -92 -90 -23 20 -37 -117
2615 -117 -76 7 22 -64 -133 -49 60 66 -46 -138 -72 88 98 -27 -108 -39 70 88 10 -91 -27 67 107 16 -25 -18 56 100
2643 100 39 -37 -30 61 124 49 -57 -38 99 130 47 -43 1 81 101 65 -16 27 57 51 46 67 60 56 12 26 70 121 78 27 -26
2674 -26 -5 116 133 13 -63 -55 97 193 94 -91 -143 2 175 119 -55 -151 -68 158 159 27 -132 -126 37 114 55 -43
2700 -43 -97 -36 36 45 -25 -64 -55 -40 -15 -2 4 -25 -87 -131 -52 28 23 -57 -174 -160 -28 76 -26 -192 -237 -63 80 42 -150
2729 -150 -220 -135 37 47 -62 -190 -188 -47 29 -37 -130 -135 -99 -20 -15 -52 -110 -104 -84 -65 -49 -27 -77 -73 -94 -42 2 -13 -54 -103
2759 -103 -71 30 50 -13 -74 -55 39 31 19 -52 -29 43 67 49 13 -18 32 101 97 14 -42 18 124 80 3 -41 38 124 97 33
2789 33 -16 -12 97 143 63 11 5 55 94 89 37 14 22 58 43 59 26 -11 -25 11 46 85 48 -43 -98 -17 129 111 -48 -149
2819 -149 -70 61 119 34 -107 -127 -26 99 82 -45 -152 -91 65 90 12 -120 -126 -44 45 51 -18 -108 -120 -41 54 48 -33
2846 -33 -92 -106 -34 65 43 -35 -140 -142 6 94 26 -97 -141 -65 48 117 -10 -143 -159 -16 106 60 -82 -126 -81 25
2872 25 74 7 -89 -129 -57 68 57 -30 -132 -82 12 32 -13 -21 -72 -61 17 57 47 -68 -89 -8 48 21 -7 -37 -51 6 32
2901 32 31 -19 -30 -10 39 50 3 -29 -10 22 47 52 -4 -34 17 88 33 -26 -33 20 61 26 2 0 -1 18 45 61 -5 -49 8 87 89
2934 89 -9 -73 -6 36 51 43 15 -31 -40 22 95 46 -44 -69 -15 54 56 7 -50 -73 -25 37 79 17 -110 -103 18 91 57 -31 -123
2965 -123 -75 56 106 47 -94 -143 -13 130 100 -6 -136 -118 34 136 57 -87 -159 -58 102 93 9 -97 -106 -8 76
2990 76 105 1 -119 -80 59 134 54 -39 -82 -9 60 82 80 -25 -79 -36 100 135 42 -93 -69 45 121 80 -15 -97 -37
3017 -37 53 104 60 -57 -97 -34 92 60 1 -83 -57 2 82 21 -44 -54 -29 12 8 -3 -21 -77 -34 -13 10 -4 -71 -83 -25 0
3047 0 -26 -52 -81 -69 -45 -13 -17 -96 -127 -31 63 -4 -108 -120 -26 36 -3 -93 -107 -33 12 55 -22 -109 -90 33 102 34 -108 -104
3077 -104 -1 62 31 -59 -97 -70 51 58 19 -76 -55 15 34 39 30 3 -45 -46 54 83 50 -45 -68 20 73 91 34 -87 -78 43
3107 43 153 113 -78 -149 -30 151 156 -3 -110 -68 28 136 103 -35 -88 -13 104 126 51 -7 -7 10 83 122 74 22 -21
3134 -21 -15 105 145 93 2 -45 34 138 193 81 -96 -60 122 231 111 -59 -91 19 178 171 37 -91 -43 102 190
3159 190 58 -64 -72 43 124 65 -18 -37 22 27 29 7 -15 -9 2 -17 -53 -22 -4 3 -57 -79 -12 22 -41 -104 -94 -37 -23 -58 -103
3190 -103 -114 -54 2 -41 -102 -107 -66 -12 -51 -125 -116 -52 9 -63 -119 -89 -27 -6 -8 -101 -128 -36 44 22 -67 -110 -44 49 25 -65 -71 -21
3222 -21 -11 -17 -29 -18 1 11 -21 -28 -10 69 53 -6 -89 -31 91 126 -4 -101 -60 92 171 78 -82 -109 42 176 126 -67
3250 -67 -134 -23 131 154 37 -77 -71 62 141 98 5 -68 -30 92 84 38 9 -3 20 42 67 89 28 -40 -26 62 135 79
3278 79 -29 -76 -2 108 132 29 -95 -69 60 151 66 -50 -86 19 101 65 -2 -44 25 78 79 -3 1 53 53 -10 -29 27
3306 27 101 62 -42 -49 22 90 68 -14 -89 -26 83 95 0 -115 -88 85 118 12 -110 -92 40 69 9 -77 -82 -3 39 6
3334 6 -46 -36 -4 19 -16 -73 -42 2 36 -28 -82 -74 7 57 -10 -63 -110 3 58 23 -26 -45 -10 35 10 -12 -16 8 3 10 31 32 17
3367 17 10 1 10 48 97 76 14 -29 63 153 104 -18 -69 33 133 155 2 -78 6 98 150 50 12 -31 52 137 104 9 -26
3396 -26 57 72 60 20 23 28 23 -24 3 29 74 1 -54 -56 17 92 6 -85 -103 -5 53 60 -60 -135 -64 20 20 -12 -123 -131 -16 46
3428 46 5 -73 -86 -31 -7 -34 -31 -8 -13 -78 -53 -21 34 7 -38 -56 -28 10 32 8 -59 -83 6 88 35 -55 -81 2 79 29 -20
3459 -20 -59 -14 36 62 21 -42 0 45 46 -3 -15 38 51 9 -44 3 57 62 15 -29 -46 33 85 52 -66 -81 27 99 77 -29
3489 -29 -61 12 51 44 25 10 -20 15 44 67 15 -5 32 34 9 15 51 40 -29 -29 20 94 56 -6 -31 4 60 74 31 -48 -45 30 64
3522 64 56 -8 -41 22 31 47 38 -9 -25 12 27 43 5 33 28 -10 -7 19 67 41 -56 -51 26 63 43 -33 -71 -29 18 71 15 -84 -110
3555 -110 -8 78 8 -80 -89 -27 16 -15 -45 -44 -50 -39 -33 -5 -26 -59 -46 -4 -27 -16 -18 -28 -77 -41 -22 15 -23 -65 -44 -23 -3 11
3587 11 -5 -57 -53 -18 41 33 -4 -7 -27 3 -6 37 47 -14 -47 19 57 70 9 -12 5 10 64 59 44 -49 -30 69 90 30 -16 -19 24 64
3621 64 57 12 5 -26 15 90 42 -30 -23 3 25 16 -5 5 -6 -48 -38 40 35 -15 -45 -77 -33 25 11 0 -72 -86 5 57 16 -37 -75
3654 -75 -45 0 -1 7 -47 -70 -38 31 12 -35 -41 -47 -11 -4 32 26 -37 -69 -14 65 48 -4 -47 -16 14 31 49 -15 -43 -17 26 47 2
3687 2 -48 -44 12 20 9 4 12 -12 -13 13 16 13 -7 -41 -35 -14 28 12 -44 -88 -25 62 34 -8 -87 -63 -9 28 16 -41 -55 -33 22 29 -49
3722 -49 -81 -35 26 7 -19 -8 -27 -2 -1 16 10 -5 6 14 -10 -3 35 45 14 -53 -2 81 94 23 -10 -15 50 65 78 20 -25 4 67
3755 67 61 22 1 13 37 19 32 51 39 21 -9 13 32 43 31 -14 -44 33 64 79 -47 -66 -12 52 42 -24 -85 -58 -7 -21
3785 -21 -14 -58 -67 -50 -21 -12 -51 -38 -47 -49 -72 -41 4 1 -86 -106 -61 16 40 -30 -98 -119 -23 55 31 -94 -146 -64 51 72 -31 -137
3817 -137 -86 10 57 15 -76 -91 -31 32 40 -43 -46 -16 5 1 -33 12 16 -21 -43 -37 29 31 14 -47 -73 11 82 47 -68 -98 -37 82
3849 82 59 -15 -61 -54 33 42 -8 -54 -37 -5 13 15 -40 -25 5 -18 -17 -32 13 25 -21 -59 -32 54 31 -23 -70 -45 18 54 -4 -53
3881 -53 -53 8 64 11 -64 -39 -20 31 41 -19 -38 14 57 30 -39 -22 14 53 39 -47 -23 47 95 5 -58 -28 42 93 48 -47 -62
3912 -62 7 65 63 -27 -78 -21 65 59 -34 -65 -15 36 31 -12 -58 -20 8 -36 -60 -12 14 29 -39 -100 -40 25 38 -57 -123 -86 5 71
3944 71 -31 -133 -122 -18 63 12 -92 -134 -54 43 21 -63 -100 -43 -15 -15 -7 -5 -18 -20 -19 -6 11 30 16 -51 -29 19 90 62 -58
3975 -58 -73 -18 119 112 -30 -86 -35 89 111 30 -61 -48 50 110 63 -36 -54 30 64 48 3 -28 10 55 16 -28 -15 24 33 -19
4005 -19 -31 12 75 32 -47 -76 -7 60 46 -41 -88 -31 44 53 -19 -77 -49 14 48 -6 -70 -84 25 51 -10 -64 -45 45 48 -32 -75
4036 -75 -28 31 41 -30 -81 -32 39 57 -25 -81 -40 42 71 -4 -44 -15 45 57 -15 -66 -31 35 46 5 -50 11 43 17 -36 -41 37
4067 37 66 11 -79 -48 18 83 26 -60 -99 -26 86 93 -18 -96 -69 36 84 -13 -96 -44 40 48 27 -50 -31 -8 15 10 -38 -20
4097 -20 12 -26 -16 12 15 50 -17 -86 -45 53 85 -13 -107 -84 36 136 70 -101 -117 -11 103 73 -39 -92 -63 67 90
4124 90 27 -59 -50 39 59 16 -25 -6 21 30 9 8 36 52 -4 -31 -22 49 76 -20 -64 -22 91 80 24 -65 -65 28 74 48 -53 -74
4156 -74 0 67 53 -37 -87 -20 41 32 -30 -67 -17 23 18 -27 -37 -2 25 -2 -43 -62 -5 39 15 -37 -54 5 36 -2 -49 -42 -18 36
4188 36 29 -36 -41 18 49 28 -19 -9 41 37 21 -22 2 70 71 14 -42 -14 65 95 56 -33 -29 68 93 63 -29 -71 49 103 73 -35
4220 -35 -65 -5 54 68 -5 -37 -29 51 28 36 -3 1 2 -5 -1 37 36 17 -76 -69 -27 61 29 -71 -115 -38 65 58 -38 -108 -53 22 45 6
4254 6 -73 -103 -29 61 26 -43 -72 -33 32 20 -5 -26 4 31 4 -16 20 1 21 -26 -31 51 31 35 -19 -43 29 74 48 -9 -64 -21
4286 -21 46 85 3 -42 -30 52 73 37 -26 -14 37 64 9 -13 -14 24 28 22 7 14 19 18 -4 -31 -16 48 39 3 -37 -18 49 45 -18 -39
4320 -39 -11 9 32 -13 -30 6 24 23 36 3 8 44 22 5 -17 35 33 33 -21 -9 32 72 36 -4 -37 -8 77 54 0 -31 -10 66
4352 66 63 15 -44 -28 33 31 16 -6 -7 -13 18 41 5 3 4 11 6 -10 21 37 -13 -63 -37 40 49 -9 -62 -64 -15 29 21 -79 -81 -25 31 29
4388 29 -60 -106 -49 -5 36 -7 -61 -84 -16 18 -8 -38 -48 -50 -24 -36 -1 2 -23 -43 -62 -13 5 -2 -17 -72 -26 -15 30 7 -57 -65
4420 -65 -21 48 11 -29 -40 8 24 13 -37 -7 -18 1 32 30 19 13 18 25 -2 -11 31 21 10 -8 7 48 50 14 -15 16 39 49 40 7
4454 7 -20 21 38 30 -1 29 5 12 27 6 4 8 25 4 4 2 11 20 -14 -43 -7 28 39 -26 -42 -46 32 41 9 -38 -57 10 30 11 -19 -29
4490 -29 -12 22 27 7 -10 -36 -5 4 13 15 10 -13 19 17 8 22 -13 -9 -24 22 45 17 -49 -53 6 47 30 -15 -57 -30 16 15 15 -51 -41 -25
4526 -25 15 6 -35 -38 -38 -13 -11 -10 -29 -23 -60 -14 -21 -15 -22 -64 -45 -25 3 -12 -43 -50 -44 -34 18 -6 -52 -74 -50 4 -6 -31 -32 -63 -4 25
4562 25 -13 -44 -5 -18 -4 21 9 -12 -6 -3 -3 -1 4 3 -3 6 -10 11 40 -5 -13 -21 1 45 6 23 -20 10 5 10 -24 12 13 2 14 8 10 -8
4600 -8 -5 -16 -24 6 24 6 -26 -7 -14 27 3 -23 -22 -27 0 13 -9 -31 -42 -20 1 1 -14 -25 -30 17 -7 3 2 -20 -12 -9 14 15 13 -14 -49
4637 -49 -2 12 12 -15 -23 -21 -13 26 18 -17 -28 -29 8 26 2 -43 -39 -8 24 -5 3 -34 -29 -5 18 10 -6 -22 -12 -4 7 14 13 -6 -41 -1 24
4674 24 8 -29 -40 -10 -6 5 12 -31 -33 0 3 0 -16 -60 -11 2 13 2 -26 -29 -28 0 -14 -27 -16 -25 -24 -23 -24 -7 -27 -32 -51 -24 -5 4 -38
4711 -38 -41 -48 -6 -5 -26 -51 -36 -15 2 -7 -28 -35 -13 -2 -7 -2 -12 -5 -1 -12 -6 -14 -7 -1 -34 -35 10 49 34 -8 -32 -26 34 3 1 -15 -3 33
4749 33 48 23 1 -20 4 -4 9 25 -13 -3 -9 1 20 4 -5 4 -15 -2 -7 19 -7 -27 -17 -18 12 24 -29 -40 -15 29 -1 -11 -45
4782 -45 -13 10 34 -15 -32 -20 8 22 20 22 -26 8 -1 22 3 17 -12 -5 24 -16 33 43 -22 10 -15 20 44 8 -4 -24 23 17 40
4815 40 -4 -12 -2 -6 7 -7 -30 -2 -1 12 8 1 -3 -20 7 5 -12 -3 13 -22 -33 -32 -11 -21 -12 -40 -30 -27 4 -11 -50 -51 -23 14 -4 -25
4851 -25 -29 -40 -18 -15 -22 -42 -35 -19 -12 -24 -13 17 -1 -31 -38 1 1 -16 -21 -7 -1 4 25 -5 -41 -27 -2 19 -17 -37 -33 -12 19 1 -9 -15
4887 -15 -21 -4 5 10 -22 -23 2 8 -14 -10 0 -8 -13 -18 3 11 -4 -10 0 -4 24 -3 -17 -22 -21 24 6 4 -16 -37 -16 20 7 -22 -30 -11 13 19 4
4926 4 3 -26 1 -11 17 0 5 6 -10 10 10 16 28 -10 -34 9 -15 3 8 -13 -41 11 24 30 -12 -27 13 28 29 -6 -15 9 4 5 16 -12
4962 -12 -5 -7 2 20 11 16 20 -13 -7 27 7 25 16 -15 -19 17 7 -4 5 -20 10 33 0 -34 -22 2 5 14 17 -7 -12 4 -4 -11 13 -17 0 -10
5000 -10 17 8 -18 -26 -4 -21 12 15 -5 -37 -1 -13 -12 6 -20 -21 -24 4 12 -10 -21 -9 18 2 6 -13 -12 16 -9 -1 43 -8 -6 9 5 -3 16
5037 16 4 0 -24 -17 -3 11 3 0 3 3 11 17 10 -11 -4 20 -13 14 -18 -10 25 6 3 4 -2 -16 5 15 12 -14 11 1 -2 -1 17 2 2 -11 -22
5076 -22 21 15 -11 2 -29 -7 0 28 -1 -38 -24 -17 15 10 -25 -31 19 32 -3 5 22 -6 12 -4 13 0 4 2 10 19 10 15 -14 8 8 10 37
5113 37 -2 -1 -21 5 28 15 7 -7 -10 1 25 24 7 -8 -9 -11 1 -4 -2 3 -6 5 22 -18 4 -15 -10 23 0 17 -5 -27 -28 4 13 5 -2 -22
5151 -22 -6 5 20 -39 13 -28 -16 15 -8 0 4 -3 -2 11 0 -7 14 -21 9 20 17 1 -14 -20 1 -9 1 -16 -27 -17 10 6 5 -15 -12
5186 -12 8 7 9 3 -22 -8 -17 0 24 -7 -5 -1 -5 4 -1 -22 -1 -4 -5 -2 0 -7 -11 -15 2 9 20 8 1 -20 5 8 -5 -9 -15 4 2 24 -6 -13 -11 13
5228 13 13 7 -4 -9 -18 -9 8 4 8 2 -5 -5 9 8 2 -10 -22 -29 14 3 -19 -6 -14 -13 0 -4 -15 -30 -26 -11 -3 -5 -11 -5 -14 0 7 -9 -8 0 13 28 8
5271 8 22 4 -12 -1 -7 16 -21 10 18 6 -18 1 -1 -14 4 11 2 -12 0 -11 -4 3 14 -22 3 -4 -9 -10 -6 -1 -1 -13 -7 -7 2 -8 -16 -4 6
5310 6 4 -12 -19 1 -6 -11 -6 -3 0 -18 -9 -1 -3 9 -22 1 -42 8 -11 15 28 -4 -15 15 11 19 14 -6 -17 12 15 -2 -8 -10 12 1 3 -5 8 -20
5350 -20 -4 -10 15 -3 -7 -16 3 2 30 -8 -10 -25 1 4 42 -10 -30 -9 2 17 25 22 -24 -16 24 -13 2 -2 -31 -14 2 12 -10 -10 -13 -2
5386 -2 14 12 -16 22 0 14 11 21 -5 1 -13 4 10 -6 13 -21 6 9 17 9 -3 -1 0 -24 12 -22 -7 -21 -17 4 -7 -13 -15 -27 3 -16 -5
5423 -5 -8 -1 -11 -17 -14 7 -15 -22 -14 -23 0 -8 1 -15 -24 -31 0 -4 -28 -23 6 -13 -8 -9 -11 -34 -18 0 21 -11 -22 -7 -27 -2 -9 12 -13 1 -2 -13
5463 -13 -2 3 1 -7 -19 -3 -3 2 -16 -16 -3 -4 -11 1 -3 -10 5 11 -18 -12 -11 -4 6 4 16 -1 -7 0 -22 -5 9 10 3 0 -6 -1 17 -6 -13 0 6 -6
5505 -6 8 -11 0 9 12 15 -8 -30 -21 -9 7 8 -6 0 -4 -6 8 25 1 -11 -19 3 11 8 -6 -9 -23 -14 19 -2 -26 -25 -4 4 -10 -27 -29 -25 -18 -8
5545 -8 -12 -27 -36 -19 -2 -13 -15 -37 -34 -29 -1 -12 -13 -15 -14 -5 -23 -8 -12 -14 -13 -6 -19 9 2 -14 -6 -6 -6 -6 -3 -5 -29 -3 -6 8 -5 -17 -7 8 -1 6
5587 6 0 -11 1 19 -8 -8 22 11 31 -19 -10 2 -1 -33 -1 13 -5 9 -3 -8 9 -1 6 26 10 -3 -5 -12 5 -18 -40 1 -27 -5 10
5622 10 19 -6 -9 -9 10 25 17 10 -4 12 5 23 -10 -30 -4 17 10 27 -8 -11 -15 12 12 -2 -27 -24 8 2 10 2 -7 6 7 4 -6 -5 -4 16 -13 -8
5662 -8 16 7 3 -4 -11 5 -3 -19 -12 -7 -12 1 -5 -12 -32 -28 1 -11 -24 -19 -8 -8 19 -23 -20 -4 3 9 -11 -15 -13 3 8 9 -29 1 4 -18 -19 -16 -4 21
5704 21 13 11 -24 7 20 11 -2 -24 -1 -1 -13 10 -1 -1 1 5 -24 -18 -7 -6 -3 -31 -1 -5 -8 9 -17 -10 0 -1 -17 -26 -33 -8 15 -18 -6 -6 3
5743 3 6 -13 -10 -25 -1 12 1 4 1 -17 9 8 12 4 1 -3 1 18 9 29 5 0 -1 12 13 3 -23 -17 -7 -15 15 -5 -19 -23 -26 4 -7 -24 -6 -2
5783 -2 7 -10 -5 -5 -5 4 11 8 -8 -2 -6 -2 -13 2 -9 -20 -18 -3 3 5 0 4 -13 -12 19 15 11 -29 -12 -13 6 19 -20 -19 -16 13 -11 -19 1 -10 -14 8
5825 8 5 14 14 -12 8 3 -4 2 -16 -22 -3 9 -4 -12 -26 -23 -1 -14 22 7 -7 -28 -9 -10 -1 -21 -9 -10 -14 -9 -16 2 -19 5 0 -14 2 1 -6 -17
5865 -17 -18 3 29 -9 -18 -7 1 -4 -13 2 -7 -34 6 6 11 -14 -16 0 18 -4 -12 7 -11 10 13 -7 9 -6 -11 10 -7 -5 -4 -33 7 5 -18 18
5903 18 8 -23 -6 -3 3 -16 -19 -14 -5 -6 -3 -8 -19 -35 -17 -8 -17 -3 5 -8 -6 -19 0 2 7 9 1 11 2 21 -2 -7 -5 11 4 -2 -37 -14 8 9 -13
5944 -13 17 -10 -10 3 -7 -13 -2 -9 -15 -2 5 -14 -25 13 6 -2 -5 1 -7 -5 -7 16 -3 18 -2 -5 -3 -3 -2 -15 -26 -7 0 8 -9 -8 1 -1 13 -7 -15
5985 -15 15 1 7 -6 -1 21 8 20 -4 -11 2 12 11 1 -7 14 -10 11 -20 -18 15 9 -6 -18 -10 8 -1 17 -6 -2 -7 -6 -7 -16 12 4 9 -21
6023 -21 -32 -12 15 -11 0 -10 2 2 -3 -9 -18 -13 -3 -15 -15 2 -4 -17 11 13 -12 -53 -9 -22 22 -3 -29 -5 6 -4 -22 13 -12 3
6057 3 -16 10 -15 -9 1 -6 -13 14 9 -5 -18 -7 -18 -2 -18 -12 2 -24 -15 -26 -9 -5 -3 -32 -4 12 -11 -10 -16 -10 -11 -6 -18 3 -5 3 -5 -20 14
6096 14 -16 -2 -3 -26 1 24 -24 -17 -1 -9 7 -5 -6 -6 -4 9 -5 9 7 4 9 15 4 21 -21 -5 1 10 20 12 4 -4 3 5 3 -2 2 -4 2 1 1 -6 5
6139 5 1 8 5 -14 -14 -20 -23 -1 -36 -13 -18 -37 -13 -3 1 14 -17 2 -6 -1 16 2 -6 -2 -15 -10 -9 17 -3 -27 -15 25 -4 -34 3 -17 -3 26
6177 26 6 -16 -16 -9 -4 5 1 0 -22 8 5 10 8 7 8 10 2 -26 -15 -24 -9 -27 9 20 -17 4 -8 -17 -3 -2 -13 22 -2 -5 -2 4 -6 1 -11 -9 -11
6218 -11 -18 -18 -10 -6 12 -3 4 -2 -27 9 -1 16 12 6 1 -9 22 17 13 6 -9 -28 -1 -3 -14 -5 -21 -3 -2 20 -1 -18 -19 -12 -8 7 -6 -4 -18 -18
6258 -18 -1 23 -19 -12 7 8 13 7 -3 -19 -24 6 1 1 -12 4 2 -6 6 -10 -3 -12 -30 1 5 9 15 -34 4 6 7 9 7 4 22 -14 -1 -2 -10 -7 -1 0
6300 0 -13 -1 -5 18 -7 10 13 -18 -4 -13 14 8 -1 -10 1 -15 11 6 -24 -8 -25 -11 -10 -34 -3 -6 -5 -5 13 -7 -19 0 5 18 5 -13 -3
6337 -3 2 9 -2 30 -32 -8 -13 -4 -1 -10 -9 -8 9 5 1 -3 12 5 -6 3 1 -8 -1 -1 -2 8 -3 14 35 -13 8 12 12 2 -4 1 -7 -6 -21 -12 -6 -7 -22 -16 -18
6382 -18 7 -17 -11 4 -11 2 11 14 -6 9 2 16 10 -9 -16 1 -3 12 5 5 -13 17 11 3 0 -31 -4 -10 -7 13 6 9 3 -1 -5 -8 -3 2 6 -1 22 23 -27
6425 -27 -4 -4 6 -3 -7 -21 6 -6 1 -30 -1 -26 -6 0 -7 -29 -33 -16 0 -13 -8 3 -3 -18 -21 8 -2 4 9 -8 -21 -3 -6 13 -3 -8 -4 -15
6463 -15 12 -15 -9 15 -15 -2 -14 1 2 -8 -7 8 -7 -10 -10 -16 -14 -5 8 -11 -3 -4 -9 -3 2 -12 -6 -6 -9 6 -9 -10 -15 -22 1 -8 5 -30 5 -4 -13
6504 -13 9 9 -4 -18 -2 -1 -4 6 -19 -23 -4 -5 2 -9 -2 -3 15 -4 7 14 1 -4 2 11 2 -1 -4 19 23 22 11 10 6 12 -15 8 -8 -13 8 0 3 25
6546 25 8 0 12 16 -9 4 8 -21 -13 -20 22 -3 -35 13 -6 12 -29 3 -7 -13 -8 -6 9 -2 -30 -13 -6 -4 -9 0 15 2 -6 -14 -7 -23 -5 3
6584 3 -9 15 10 9 1 8 29 6 3 9 -20 16 0 -16 0 11 25 4 18 6 -7 1 -14 4 -7 -10 -21 29 -16 -17 -20 -25 -22 -18 -12 -8 -3 -9 -20
6623 -20 -1 -27 -6 -7 -10 8 -19 13 -2 -10 11 2 -22 -20 4 -24 -2 -6 0 -6 -4 -8 2 -4 4 2 10 9 -3 -8 -29 -12 -19 -1 9 11 12 9 12 12 -8
6664 -8 -1 21 1 35 -1 30 10 -33 24 -38 35 -38 -38 -44 4 -3 7 -2 -16 -9 -7 4 -15 -10 -9 -11 3 -19 -14 -6 4 8 -5 -1 -5 -4 -4 -8 16 24
6704 24 33 -6 6 10 7 5 -14 -16 -12 -1 -2 0 -13 -9 -24 11 2 -3 0 5 1 -6 -6 -9 -22 -17 1 -4 -11 -26 -24 -14 -23 -3 -18 -14 3 -14 -17 -11 -3 -5 -22 -10
6748 -10 -5 -7 -18 -9 9 -1 -12 -7 -5 -17 -12 0 12 20 -9 0 22 -8 11 -1 1 1 28 2 -3 20 4 1 -22 11 -3 8 -25 -2 -3 10 -1
6785 -1 18 -9 -14 12 14 -17 15 6 1 -3 13 2 -12 -14 -5 -15 12 26 -2 -5 6 -11 -9 -6 8 -3 -4 -1 -12 -4 10 -7 -8 -14 6 -8 5 6 20
6824 20 14 11 24 -7 6 2 10 16 5 -1 -5 9 -8 -13 2 3 -17 -5 -13 -8 -3 -14 -16 6 -3 -15 -14 -17 -1 0 -13 7 -17 -1 2 -13 3 9 7 -4
6864 -4 -1 5 -2 -16 -14 -28 8 3 -3 10 -11 5 12 4 -3 9 7 -1 -9 23 3 -11 -10 6 19 8 -8 13 -1 -2 -25 8 9 2 4 7 -6 -17 7 -3
6904 -3 5 1 -12 -6 -10 -6 1 -9 9 2 8 -20 -21 2 -4 18 -5 1 10 12 15 6 17 4 18 3 7 -3 3 1 25 6 -3 -18 8 -2 -7 5 4 15 3
6945 3 -5 35 5 -10 4 3 4 8 -6 -7 3 4 16 9 0 -14 13 -3 6 -4 20 1 5 13 -22 5 -37 -4 -13 -17 -7 -10 -23 -20 -7 -17 -16 -22 1
6984 1 -6 -6 -20 -7 -1 8 -2 -4 -16 4 0 5 -16 10 -6 -7 13 -2 -2 5 8 -6 11 19 -4 -2 7 11 -1 8 -7 -1 -2 -16 -7 -13 -18 -17 7 8 -15 -7 -14
7027 -14 10 0 -22 1 -21 5 -2 -11 4 -19 -14 -6 -17 -6 5 -9 -5 7 11 -25 -10 -14 -1 -6 -4 8 -5 1 -3 17 -6 3 9 5 -18 12 18 -1
7065 -1 21 14 13 27 -14 19 3 8 16 -4 -9 1 12 11 0 -6 -1 -6 1 0 18 2 -17 -10 -4 8 3 -16 8 5 -2 -23 0 -16 1 9 0 -1 -21 1
7105 1 -6 -1 6 -18 -22 4 -20 4 6 -7 -7 -5 6 -6 0 -12 -7 10 12 -11 -5 -17 -17 15 2 -4 5 -15 -13 6 6 -10 -2 -6 -20 -2 -14 -10 -10 -6 10
7146 10 4 4 20 -20 -23 -15 -7 -11 -23 -11 -21 -9 5 -7 22 7 7 0 21 15 2 3 -5 -16 -31 -3 5 13 -26 -12 -1 -18 4 16 28 -4 0
7183 0 3 5 15 -2 0 7 -2 7 -6 7 10 5 -14 1 4 2 -1 -12 18 6 -11 3 1 -6 6 7 -24 -8 14 -21 -10 -20 0 -11 -16 -11 -20 -12 18 -3
7223 -3 -23 1 2 -8 0 -20 -8 -2 7 7 -7 5 -4 10 -12 26 -9 -16 -5 6 4 -17 -2 7 15 6 1 -20 4 4 -1 5 -6 -9 26 11 -13 3 11
7262 11 19 8 -2 -4 -1 -9 -2 -18 -6 -2 -2 -13 -18 -4 -15 -10 -24 -19 -9 6 -3 -14 -18 4 4 0 6 1 23 7 -1 4 -12 -16 1 7 10 9 -7 25 14
7303 14 26 6 -26 -20 -10 2 8 8 -28 0 -13 4 -11 -13 -30 0 -19 -12 -4 -16 -26 -9 -3 -12 -12 -15 -1 -12 -2 4 -14 -26 -8 -9 2 -6 -14
7340 -14 -11 -9 -3 -1 -13 -17 -21 -2 -21 -18 10 19 10 6 -15 12 14 13 2 20 17 10 5 11 11 -14 20 8 14 1 -10 23 -5 0 3 0 13 -8 -3 5 -18 -16
7382 -16 -6 9 -7 6 -2 -4 -3 -18 -12 20 -19 -11 2 -5 -26 -3 -3 -2 -2 -18 7 -6 3 -7 -4 5 4 -21 -5 -2 -3 -11 -4 11 19 -17 -4 16 12 10
7422 10 5 13 -6 -8 24 1 -17 -6 13 5 -19 10 6 -10 7 -6 -20 -15 -14 -5 -6 12 -12 -21 -19 -11 -4 2 -12 -38 -20 26 13 -4 -15 7 -1 -4
7460 -4 -1 0 18 -6 -14 7 -10 -2 -8 5 -2 -4 9 -8 -18 -13 1 10 -5 20 -4 19 0 -12 -2 -8 6 5 -8 0 15 9 -20 -27 -10 2 11 -4
7498 -4 10 -2 -7 -8 2 5 2 -11 8 -23 -14 0 -21 -34 -22 -25 -9 -18 -9 -21 -22 -10 14 8 -6 17 9 1 -1 -15 -10 11 -10 20 -9 15 -5 8
7536 8 3 17 12 -8 22 19 -3 9 -20 -8 21 9 9 -2 6 -1 -15 -3 16 11 -12 -13 -4 -8 -6 -3 -19 -32 -3 7 13 8 -1 -3 -16 6 7 -12 -19 -2
7576 -2 17 -19 -9 11 -23 -11 12 15 16 1 24 6 2 15 0 10 -3 1 -15 14 -11 7 -5 11 27 2 8 7 -8 -6 0 -16 15 -4 1
7611 1 -1 -3 1 3 -10 -8 23 -11 -24 -7 3 -17 -9 -6 -3 7 -3 -7 -6 2 -1 -7 -23 -27 -17 -6 -17 -9 -12 1 -1 -5 -8 -8 -8 2 2 -6 -21 -13 -1 -8 -8 -4
7655 -4 16 13 -11 4 -7 -22 -1 -6 -18 -22 20 -1 4 7 -2 -13 -7 0 -27 24 6 -19 7 -11 15 -19 -8 -12 25 8 -4 -11 12 7 13 -8 9
7692 9 1 -18 -8 9 6 -13 -9 -15 -1 6 10 -16 -16 -20 13 -17 -3 -17 7 -17 9 1 -9 14 -5 3 5 -5 -1 4 1 0 6 -11 -5 8 -3 1 -5 1 4
7733 4 -4 -25 -8 -25 -12 -14 -19 -15 -2 -7 -2 -16 -15 -13 -10 15 -20 -10 -1 1 9 -6 -22 -8 3 -11 4 -20 -5 -10 8 10 4 -3 -14 -1 -15 4 2
7772 2 3 -8 -2 3 3 -4 -5 5 2 -9 -4 -4 25 -2 9 26 11 0 -5 4 -1 -8 0 20 14 1 -21 23 5 -9 -4 -4 -17 -1 -13 -17 -6 -11 -25 -23 -21
7813 -21 0 4 -22 -13 -16 -4 -17 23 -11 -5 0 -24 -6 -6 -13 11 -28 -6 -10 2 -9 -6 6 10 -1 -8 -16 -8 -18 -13 7 9 -5 6 -2 -4 9 -26 -3
7852 -3 18 -6 -18 -19 -29 5 5 -7 -16 -7 -6 5 2 -22 -12 -6 15 -4 -3 -16 -11 -16 8 -27 -22 0 -14 12 -2 10 -7 -3 0 -8 4 0 8 -9 18
7891 18 -15 -3 8 15 -5 14 17 31 9 -2 11 -13 17 -2 -8 -2 2 3 -2 10 -17 9 9 -17 -20 -18 5 -16 -4 4 -1 15 6 8 -7 -8 -11 -4 11
7930 11 -13 -2 -2 21 -8 12 -13 -14 7 -5 -17 3 0 3 12 -12 -15 7 -4 -3 2 11 11 0 -9 0 -10 10 -2 17 2 0 19 14 12 -2 1 6 17
7969 17 16 -15 -5 9 -16 7 -6 -18 -3 -10 -41 -5 0 -5 -5 -2 -6 -31 -1 -5 -24 2 -28 -11 15 -19 -4 1 8 14 -7 -15 2 -20 -3 -12 -13
8006 -13 -7 13 -9 -23 -30 -3 -18 26 -7 -3 11 -10 2 -13 -8 0 16 11 5 -32 21 16 -4 5 -4 17 -6 -4 -4 -11 -25 9 6 -17 -12 -4 -3 -7 3
8045 3 0 8 -3 0 -18 1 -16 -18 -3 -5 -5 -26 12 20 -11 9 -8 5 21 -6 -6 4 22 -11 3 -21 0 -14 7 5 -18 -11 -21 -4 0 -4 15
8082 15 7 22 14 -11 -3 -7 -4 9 -17 7 9 -10 1 -1 -8 0 -15 -19 -24 4 -21 -12 -8 -10 -19 -2 -10 -21 -27 -26 3 -36 4 -22 4 -11 -1 -26 -12
8121 -12 -4 12 -4 -15 -12 -8 0 -6 -13 1 -1 5 17 0 -2 5 -13 -20 -14 -15 -9 17 -10 -7 10 -1 -26 2 -12 -4 -11 -10 -4 -35 4 -12 -2 8 2 -6 -7
8162 -7 -2 -21 -3 -20 -18 -13 -16 -21 5 -2 -10 3 -17 -26 -35 -7 -12 -12 -6 -9 -11 -9 10 9 10 -4 -10 10 5
8191E
##END NTUPLES=NMR FID
##END=
