##TITLE=1H_DPB2303K-1
 CDCl3, 8 sc, 
 24.3.2020
##JCAMPDX= 6.0         $$ Bruker NMR JCAMP-DX V2.0
##DATA TYPE= NMR FID
##DATA CLASS= NTUPLES
##ORIGIN= UXNMR, Bruker Analytische Messtechnik GmbH
##OWNER= root
$$ XWIN-NMR		Version 3.5
$$ Tue Mar 24 13:56:47 2020 Russian Standard Time (UT+4h)  she@DPX200
##.OBSERVE FREQUENCY= 200.1315
##.OBSERVE NUCLEUS= ^1H
##.DELAY= (6, 6)
##.ACQUISITION MODE= SIMULTANEOUS
##.ACQUISITION SCHEME= undefined
##.AVERAGES= 8
##.DIGITISER RES= 18
##SPECTROMETER/DATA SYSTEM= spect
##.PULSE SEQUENCE= zg30
##.SOLVENT NAME= CDCl3
##.SHIFT REFERENCE= (INTERNAL, CDCl3, 0, 15.7039)
##AUDIT TRAIL= $$ (NUMBER, WHEN, WHO, WHERE, WHAT)
$$ ##TITLE= Audit trail, XWIN-NMR		Version 3.5
$$ ##JCAMPDX= 5.01
$$ ##ORIGIN= Bruker BioSpin GmbH
$$ ##OWNER= she
$$ F:/spectra/data/she/nmr/H-F/1/audita.txt
$$ ##AUDIT TRAIL=  $$ (NUMBER, WHEN, WHO, WHERE, WHAT)
(   1,<2020-03-24 13:55:22.73 +0400>,<she>,<DPX200>,
      <created by zg, POWCHK disabled, PULCHK disabled
       configuration hash MD5:
       00 E9 B6 7A A2 85 ED C7 34 08 36 98 17 FE 4E 26
       data hash MD5: 16K
       07 E7 2B 97 3A CA 4E 43 3B F1 7E 5E 33 80 91 6C>)
$$ ##END=
$$ 
$$ hash MD5
$$ 15 4D BF BC 0B F9 7D 0A C7 62 6F BD F4 FD 97 2B
##$RELAX= 
##$RELAX= 
##$RELAX= 
##$RELAX= 
##$RELAX= 
##$RELAX= 
$$ Bruker specific parameters
$$ --------------------------
##$DU= <F:/spectra>
##$EXPNO= 1
##$NAME= <H-F>
##$PROCNO= 1
##$TYPE= <nmr>
##$USER= <she>
##$AMP= (0..31)
100 100 100 100 100 100 100 100 100 100 100 100 100 100 100 100 100 100 
100 100 100 100 100 100 100 100 100 100 100 100 100 100 
##$AQSEQ= 0
##$AQ_mod= 1
##$AUNM= <au_zg>
##$AUTOPOS= <>
##$BF1= 200.13
##$BF2= 200.13
##$BF3= 200.13
##$BF4= 200.13
##$BF5= 200.13
##$BF6= 200.13
##$BF7= 200.13
##$BF8= 200.13
##$BYTORDA= 1
##$CFDGTYP= 0
##$CFRGTYP= 5
##$CHEMSTR= <none>
##$CNST= (0..31)
1 1 145 1 1 1 1 1 1 1 1 1 1 1 1 1 1 1 1 1 1 1 1 1 1 1 1 1 1 1 1 1 
##$CPDPRG= <>
##$CPDPRG1= <>
##$CPDPRG2= <>
##$CPDPRG3= <>
##$CPDPRG4= <mlev>
##$CPDPRG5= <mlev>
##$CPDPRG6= <mlev>
##$CPDPRG7= <mlev>
##$CPDPRG8= <mlev>
##$CPDPRGB= <>
##$CPDPRGT= <>
##$D= (0..31)
0 1.2 0 0 0 0 0 0 0 0.06 0 0.03 0 0 0 0 0.0002 0 0 0 0 0 0 0 0 0 0 0 0 
0 0 0 
##$DATE= 1585043722
##$DBL= (0..7)
120 120 120 120 120 120 120 120 
##$DBP= (0..7)
150 150 150 150 150 150 150 150 
##$DBP07= 0
##$DBPNAM0= <>
##$DBPNAM1= <>
##$DBPNAM2= <>
##$DBPNAM3= <>
##$DBPNAM4= <>
##$DBPNAM5= <>
##$DBPNAM6= <>
##$DBPNAM7= <>
##$DBPOAL= (0..7)
0.5 0.5 0.5 0.5 0.5 0.5 0.5 0.5 
##$DBPOFFS= (0..7)
0 0 0 0 0 0 0 0 
##$DE= 6
##$DECBNUC= <off>
##$DECIM= 24
##$DECNUC= <off>
##$DECSTAT= 4
##$DIGMOD= 1
##$DIGTYP= 9
##$DL= (0..7)
0 120 120 120 120 120 120 120 
##$DP= (0..7)
150 150 150 150 150 150 150 150 
##$DP07= 0
##$DPNAME0= <>
##$DPNAME1= <>
##$DPNAME2= <>
##$DPNAME3= <>
##$DPNAME4= <>
##$DPNAME5= <>
##$DPNAME6= <>
##$DPNAME7= <>
##$DPOAL= (0..7)
0.5 0.5 0.5 0.5 0.5 0.5 0.5 0.5 
##$DPOFFS= (0..7)
0 0 0 0 0 0 0 0 
##$DQDMODE= 0
##$DR= 18
##$DS= 0
##$DSLIST= <SSSSSSSSSSSSSSS>
$$ [...]
##$SUBNAM2= <"">
##$SUBNAM3= <"">
##$SUBNAM4= <"">
##$SUBNAM5= <"">
##$SUBNAM6= <"">
##$SUBNAM7= <"">
##$SUBNAM8= <"">
##$SUBNAM9= <"">
##$SW= 24.9337058887773
##$SWIBOX= (0..15)
0 0 2 0 0 0 0 0 0 0 0 0 0 0 0 0 
##$SW_h= 4990.01996007984
##$TD= 16384
##$TD0= 1
##$TE= 0
##$TE2= 300
##$TE3= 300
##$TEG= 300
##$TL= (0..7)
0 120 120 120 120 120 120 120 
##$TP= (0..7)
150 150 150 150 150 150 150 150 
##$TP07= 0
##$TPNAME0= <>
##$TPNAME1= <>
##$TPNAME2= <>
##$TPNAME3= <>
##$TPNAME4= <>
##$TPNAME5= <>
##$TPNAME6= <>
##$TPNAME7= <>
##$TPOAL= (0..7)
0.5 0.5 0.5 0.5 0.5 0.5 0.5 0.5 
##$TPOFFS= (0..7)
0 0 0 0 0 0 0 0 
##$TUNHIN= 0
##$TUNHOUT= 0
##$TUNXOUT= 0
##$USERA1= <user>
##$USERA2= <user>
##$USERA3= <user>
##$USERA4= <user>
##$USERA5= <user>
##$V9= 5
##$VALIST= <valist>
##$VCLIST= <CCCCCCCCCCCCCCC>
##$VD= 0
##$VDLIST= <DDDDDDDDDDDDDDD>
##$VPLIST= <PPPPPPPPPPPPPPP>
##$VTLIST= <TTTTTTTTTTTTTTT>
##$WBST= 1024
##$WBSW= 4
##$XGAIN= (0..3)
0 0 0 0 
##$XL= 0
##$YL= 0
##$YMAX_a= 37064
##$YMIN_a= -65911
##$ZGOPTNS= <>
##$ZL1= 120
##$ZL2= 120
##$ZL3= 120
##$ZL4= 120
##$ABSF1= 10
##$ABSF2= 0
##$ABSG= 5
##$ABSL= 3
##$ALPHA= 0
##$AQORDER= 0
##$ASSFAC= 0
##$ASSFACI= 0
##$ASSFACX= 0
##$ASSWID= 0
##$AUNMP= <proc_1d>
##$AZFE= 0.1
##$AZFW= 0.1
##$BCFW= 1
##$BC_mod= 2
##$BYTORDP= 1
##$COROFFS= 0
##$CY= 11.3945322036743
##$DATMOD= 1
##$DC= 2
##$DFILT= <>
##$DTYPP= 0
##$F1P= 16.9975609425685
##$F2P= -3.02152046262296
##$FCOR= 0.5
##$FTSIZE= 0
##$FT_mod= 4
##$GAMMA= 1
##$GB= 0.15
##$INTBC= 1
##$INTSCL= 1
##$ISEN= 128
##$LB= 0.24
##$LEV0= 0
##$LPBIN= 0
##$MAXI= 10000
##$MC2= 0
##$MEAN= 0
##$ME_mod= 0
##$MI= 1.114404
##$NCOEF= 0
##$NC_proc= 0
##$NLEV= 6
##$NOISF1= 3.799351
##$NOISF2= 2.8
##$NSP= 1
##$NTH_PI= 0
##$NZP= 0
##$OFFSET= 15.70392
##$PC= 1
##$PHC0= -9699.174
##$PHC1= 16.40082
##$PH_mod= 1
##$PKNL= yes
##$PPARMOD= 0
##$PSCAL= 0
##$PSIGN= 0
##$REVERSE= no
##$SF= 200.130013532006
##$SI= 16384
##$SIGF1= 3
##$SIGF2= 2
##$SINO= 400
##$SIOLD= 16384
##$SREGLST= <1H.CDCl3>
##$SSB= 0
##$STSI= 0
##$STSR= 0
##$SW_p= 3612.71676300578
##$SYMM= 0
##$S_DEV= 0
##$TDeff= 0
##$TDoff= 0
##$TI= <>
##$TILT= no
##$TM1= 0
##$TM2= 0
##$TOPLEV= 0
##$USERP1= <user>
##$USERP2= <user>
##$USERP3= <user>
##$USERP4= <user>
##$USERP5= <user>
##$WDW= 1
##$XDIM= 8192
##$YMAX_p= 0
##$YMIN_p= 0
$$ End of Bruker specific parameters
$$ ---------------------------------
##NTUPLES= NMR FID
##VAR_NAME=  TIME,          FID/REAL,        FID/IMAG
##SYMBOL=    X,             R,               I
##VAR_TYPE=  INDEPENDENT,   DEPENDENT,       DEPENDENT
##VAR_FORM=  AFFN,          ASDF,            ASDF
##VAR_DIM=   8192,          8192,            8192
##UNITS=     SECONDS,       ARBITRARY UNITS, ARBITRARY UNITS
##FACTOR=    0.0002004,     1,               1
##FIRST=     0,             0,               0
##LAST=      1.6414764,     0,               0
##MIN=       0,             -65911,          0
##MAX=       1.6414764,     37064,           0
$$ Real data points
##PAGE= N=1
##DATA TABLE= (X++(R..R)), XYDATA
0@%%%%%%%%%%%%qJ6j6J6j6K4l2L2l9M7m8N6o4P2q8J04j15J26j43J64j84K00k24
35a20K55k82L11l48L84m24M72n23N79o40P11p90Q78r80J097j238J404j604J860
54A002k192K636l274M276o086J0363l7880l4756P4206J3022m4925k8365K9908
67b2065J4652j3248k971J6597j0866k2427J0482L3315l245l1923q503K5636J4884
80C18r653j1949J025M028L835L770J294l151k043q59J324P359Q061o721j4649
95a8011L350K0632M746j7579p845J3678Q026p307q51Q191m729j1485Q771J8853
109A8440n484k0594K010J9410J060j3673J981J0960o241j0620J1099J4643j1247
122A1744j7636Q340J8299l509j3620K007P093n367k758J2256M154j7647j0613
$$ y = [0, 0, 0, 0, 0, 0, 0, 0, 0, 0, 0, 0, 0, -8, 8, -8, 8, -8, 16, -16, 16, -23, 24, -24, 32, -32, 40, -48, 56, -59, 67, -76, 88, -96, 104, -120, 135, -147, 164, -184, 200, -224, 248, -275, 304, -336, 375, -415, 463, -517, 580, -658, 746, -858, 1002, -1190, 1446, -1828, 2448, -3638, 6725, -31155, -65911, 8295, 21317, -23608, -51973, -22065, -7413, -20661, -23632, -7035, -17901, -40328, -29846, 3469, 224, -31699, -40202, -14566, 318, -9335, -21284, -20259, -16231, -12396, -8626, -7332, -10483, -12526, -13385, -12061, -4702, 3359, -3362, -18011, -14661, 5971, 10717, -6862, -14707, -1029, 6997, -310, -1161, 7030, 2301, -9184, -413, 18440, 12956, -7638, -5628, 13782, 14842, 1169, 3150, 14110, 7869, -2751, 8348, 22991, 11744, -5892, 2448, 20747, 17238, 3618, 5625, 12718, 7351, 4593, 16849, 21003, 3356, -7257]
135g257J6893J7193j0460j9497O15J4547N956n916p432l626K038P483M350o224
149H663r184m18O688M836o21n713p724l58J0842O933j0227j2834M952J2684j816
164F703j0556M71O481l947o266O993P987r203j2558O588J4078k799j3011j033
178a0072Q007L39m092K611K561o740n058P666Q129n548r737J220P673J909l270
193d402k078r39o10K571L951q70m815j570L044K542N68j74k098l163J329N904
209h10K130m916m179K077M017J686j2j956m117m84O916N603n083q466J213Q413
225B032L123l998l481l19P97K937M125j254o876k024P071N450m027n832J001L877
241B602N53m82Q96j184l333N57M885J722m005l239J594K731O14m36j013k041o00
$$ y = [-7257, 9636, 26829, 16369, -3128, -2513, 12034, 17990, 12074, 4642, 1016, 3054, 10537, 14887, 8663, -521, -939, 5749, 10585, 9964, 4251, -3473, -3831, 7011, 13944, 3717, -9117, -4165, 8519, 6703, -3853, -3382, 3099, -848, -7114, -121, 7866, -1337, -13895, -7307, 6771, 3972, -9039, -10072, -2065, -1726, -5818, -3207, -646, -7386, -12444, -4778, 3351, -2197, -11934, -10714, -3041, -1132, -4402, -6480, -7419, -8029, -5458, -1507, -2377, -7192, -8762, -5718, -3176, -2608, -2782, -4880, -8043, -6714, -810, 1320, -3596, -7775, -5698, -1681, 5, -7, -1963, -6080, -6564, 352, 5955, 872, -7594, -6381, 2032, 5155, 1157, -2324, -2643, -1846, 1091, 5216, 3962, -2914, -4938, 2133, 7583, 3556, -2276, -1275, 2602, 3155, 2673, 3569, 2385, -948, -391, 4494, 6216, 2211, -1028, 566, 3297, 3911, 3475, 2462, 421, -179]
258a79K771K622j602l635p55K423K153K2j925k542k83L097K462j993l782j25K899
275A628J165j229r59l80p13L92K046L58k706j695J936K049r75j605J43J94o55
292a006O33J706o58k814m72K680J513j715j913J35R97P56M95n97j917n66K208
309e35J915j456k547O1K007J016o51j014o96M5J227J241o48j778l63J463J033
326C20m22p57l30j04N21J087K38j343j035Q12J451K60p76p51l30L41J278Q93j094
345B59j855J18K030J093j083j458j63Q44R87M76o84j473l79J558J460o12j691
362e73n00R26R73K52l83r31p00N82J400L89j164j157J92J049P02j42q78r13J27
381g49J308R09p64j522l24J093J070k2r24q81q2R83R72k58j212o36O08R47K33
$$ y = [-179, 2592, 5214, 3612, -23, -778, 1645, 3798, 3820, 1895, -647, -930, 2167, 4629, 2636, -1146, -1271, 1628, 2793, 1564, 605, 225, -488, -96, 1950, 2308, -398, -2093, -157, 1892, 917, -688, -545, -351, -1006, -373, 1333, 675, -2139, -2611, 69, 1582, -133, -2046, -1911, -914, -158, 337, -260, -2177, -2743, -535, 1380, -76, -2623, -2562, -555, 461, -190, -1204, -1900, -1855, -628, 613, -35, -1813, -2176, -713, 320, -102, -859, -1189, -1293, -772, 315, 553, -790, -1825, -1013, 438, 698, -78, -829, -1159, -818, 460, 1353, 259, -1596, -1478, 552, 1645, 562, -896, -1059, -215, 772, 1248, 564, -909, -1288, 270, 1730, 1118, -573, -1073, -147, 826, 1078, 695, -236, -936, -354, 1046, 1435, 271, -886, -694, 355, 1057, 915, 37, -876, -749, 559, 1468, 704, -818, -1142, -49, 1021, 999, 75, -806, -888, 95, 1067, 809, -403, -1039, -431, 516, 749]
400G49n18o68l78L97R29L79p90r89qR64O62k58p21m95O6P24O53k09r62n29N59
421d43R02J85o65o89k0N88O12m7p01n30K62P17L14l40n68k38K95N62K53l96n83
442e30l4M89L49j45k96j51J9J80K77Q0l31l57J53M46J58k50k46m5J22K05K08p3
464B28l30j57K62L47j2k65j34J15J70J42o5j96n1J74J88l3j67l4J31R2J2p0n6
487B91O0J38rj69oK58J33k31k60J62K78rj48o1L1k4N2J36qk36m3K08O8j75o9R4
513D61K8j63nJ96j6k60j08J52J15k1q2j51j51O2K80O2l36k79J57K17kj59o7r5
537a65j17J00K32n2l41j68J36J50Q6m9k43l26L3N02K69m30n92k1M87M07j00m81
559f83m53J12O87L72n17p39P6P20L16l40l77r7J01K95K94k5m79k30L57L55n7j23
$$ y = [749, 231, -437, -815, -418, 511, 890, 100, -889, -897, 67, 729, 471, -250, -745, -679, 45, 698, 489, -473, -1002, -443, 459, 644, -21, -710, -730, -142, 470, 423, -278, -808, -546, 171, 485, 145, -423, -661, -366, 196, 449, 53, -530, -564, -75, 274, 129, -167, -318, -299, -119, 158, 238, -93, -450, -297, 149, 307, 57, -189, -234, -112, 93, 301, 228, -102, -259, 3, 350, 338, 73, -61, 54, 224, 366, 301, 105, 54, 228, 416, 383, 216, 182, 313, 405, 417, 347, 291, 351, 489, 480, 311, 305, 563, 696, 465, 205, 367, 645, 636, 488, 427, 458, 434, 486, 622, 614, 378, 335, 543, 611, 436, 367, 461, 489, 326, 321, 517, 501, 241, 133, 285, 400, 379, 297, 146, -5, 57, 337, 399, 63, -216, -59, 158, 156, -3, -70, -165, -282, -182, 50, -2, -343, -511, -375, -225, -139, -188, -431, -757, -724, -222, 47, -383, -975, -996, -509, -102, -202, -683, -1136, -1024, -337, 35, -482, -1221, -1145, -425, -109, -449, -826, -923, -822, -527, -233, -258, -737, -967, -610, -255, -312, -435]
581d35J1j02j88K90N56l6o83k57N46N39l7l27k66q2K92O15J45o98n54M77Q51J0
603F67n48k89J56K04J92J95r8m47r7L69L86n2k57k03j28K46N53J41o62o19L92
624A01P60J96n03n00j21L62O58J75p93p85M70J068L0r58m18N45L85j98j20N8k47
645A65j95L55L11l29m06K26K77l12k04L90K52n60m76M35N76j90n36j59J69K36
665B5K17j48n17k44M95N19l12o46K9M80Q2k56j04O4l2N2J11j50j78K43K41l56
687c85l69L84N70l09o42J32O45M8m24j22J42J2J89K89k78n98K35Q89J8j024k54
708h52J006N50p42o52M11N93m2l04r2q1J17M64J44n98n12N08P33j94o58j04M33
729A28K19o1j66j59m9L18K01k79k53L02K23m33k40N32M11n90o07M31O50j46m66
$$ y = [-435, -424, -526, -714, -424, 132, 96, -587, -844, -298, 241, 204, -123, -389, -471, -179, 436, 581, -117, -671, -194, 657, 667, 119, -170, -14, 190, 382, 577, 479, 32, -65, 304, 690, 638, 381, 178, 50, 296, 849, 990, 328, -291, 101, 861, 1057, 554, 54, -67, 295, 953, 1128, 335, -450, 20, 1088, 1118, 160, -258, 287, 672, 474, 354, 412, 165, -30, 325, 636, 307, -99, 127, 404, 92, -112, 278, 530, -30, -506, -71, 505, 315, -221, -380, -211, 25, 242, 94, -423, -667, -172, 347, 35, -611, -582, -102, -20, -276, -380, -316, -348, -296, -185, -335, -513, -270, -29, -385, -754, -370, 200, -109, -751, -619, 26, 74, -350, -472, -330, -318, -129, 160, -118, -716, -481, 408, 426, -598, -852, 154, 704, -38, -690, -279, 314, 272, -32, -124, -205, -88, 376, 520, -78, -590, -82, 651, 457, -201, -305, 128, 347, 286, 120, -39, -88, 230, 431, 152, -101, 201, 424, -9, -249, 283, 694, 104, -503, -72, 578, 432, -34]
750c4p0P1m2L68M16n29r11K89J167Q9j086m51P77M67m16k94J76k4k00K21K93k87
772a0k98K80J53l99j00O58J59q48n20P90Q10l53q61k20M16N69L03l89r13k09J053
793G1Q45o81j120J03R12K94l34k91j60j10L77N72j90p69p2O95J34m43N7M36l25
814Ao12L99R33j71r91j67P32L68k22j29k04l60K24R11J27j105o01R19R22m43q38
835c07M7M27J31RN6k72l29K94N10k29n09K04M14k74l93L68M89l69o24J97N49P8
857D67k89j77j80jN15L94n99q56L56J075L3r94l70O07M36j92k16r9j92J26N41
878C85N7p99k32O66M75n22n93L87M49k58l32L37J48l22j13K67R7l14J24K07k28
899a14k61L64L77m19o05L32O80j8o78j82K83M06M5j76l61l53M77P21j17r74k98
$$ y = [-34, -104, -33, -75, 293, 709, 180, -731, -442, 725, 814, -272, -723, 54, 521, 105, -189, -13, -37, -237, -16, 277, -10, -308, -28, 125, -274, -374, 284, 443, -405, -925, -135, 675, 322, -539, -759, -343, 226, 529, 140, -773, -982, 71, 916, 235, -885, -782, 130, 424, 90, -201, -361, -471, -94, 478, 288, -481, -553, 142, 276, -167, -110, 326, 1, -611, -212, 721, 550, -441, -608, 124, 492, 270, 141, -63, -423, -199, 712, 839, -266, -867, 52, 974, 531, -307, -260, 167, 298, 307, 363, 91, -238, 56, 566, 337, -172, 32, 446, 172, -221, 147, 636, 267, -357, -160, 389, 467, 178, 1, -179, -180, 335, 729, 130, -726, -370, 705, 738, -256, -626, -19, 417, 225, 9, -90, -282, -156, 385, 442, -357, -589, 77, 552, 30, -563, -176, 273, 15, -317, 20, 168, -154, -267, 0, 97, -217, -93, 114, -114, -375, -11, 366, -53, -658, -326, 354, 336, -342, -524, -241, 165, 210, 34, -327, -680, -203, 518, 401, -573, -871]
920h71P04O44k83n45j52J50K73L15q9n55k65M94M90k31l77J7R8j10J24M18n1o57
942d59k34O04N12k26m93j61J13L08M69n4p27n11O46R14j11r01l65N22N25Q1k80
963A72l27k19K88N56Q5n08l53K52L44M3m6%k17k48K66N16P6n31l73J97M77K83
985G33j20n21m13L31Q38K27p82p20K94Q71L09m97o35j20M95O21J4o66n54L15P66
1006G86R0n41l59J52K61J33lj49k95p3K95K92j28l01j08K2J21J91N0l09m04J79
1028i8N45R7n29m01J83M34J15k39l45j65K54L52k4m46k78K51L92m5l71j63J40
1049c41J49Np5j02o6K9Q7K6p2m3k8q7M7K18J04k98k98J27M10J46l00l53j0L77
1073c48L91j02n57k83L91O81K6o54m58L43O69J90m55m84J5N22M46j20n45k73L49
$$ y = [-871, -167, 477, 194, -351, -503, -353, -80, 235, 146, -409, -674, -180, 310, 79, -298, -281, -183, -293, -169, 249, 198, -459, -693, -89, 423, 197, -296, -457, -344, -36, 433, 379, -348, -859, -213, 701, 590, -311, -676, -154, 371, 452, 172, -155, -374, -86, 470, 555, 47, -306, -54, 290, 333, 287, 287, 70, -178, 88, 604, 680, 149, -224, -27, 450, 733, 613, 92, -321, 10, 848, 1075, 293, -427, -133, 738, 1047, 550, -85, -205, 290, 911, 925, 259, -295, 20, 786, 876, 335, -24, 128, 389, 522, 519, 370, 75, 2, 297, 589, 461, 160, 52, 74, 195, 386, 436, 127, -277, -98, 447, 544, 15, -386, -203, 231, 346, 107, -238, -403, -149, 203, 179, -267, -545, -294, 98, 53, -318, -481, -341, -192, -187, -262, -364, -430, -401, -314, -288, -360, -403, -431, -518, -471, -253, -149, -447, -745, -618, -208, -62, -362, -715, -725, -348, 43, -59, -616, -899, -508, 173, 199, -455, -913, -570, 99, 289, -166, -650, -635, -113, 333, 213, -332, -605, -256]
1094b56N18O6l33k58L4K31K60J08k07l03k4L20L31ql16k66L3M28L69j34n31k89
1116b27L77O11P6n00m72J35N23L46k09n44k08L38N23N6m45l83J04L86J98r7k97
1137B91k17N0K85K02r1l04k51Q7L24K53j57m70k71L13N15N6n30m78J37N31K95
1158E70k92n79k19M19N45l4o26m02L05N27N0m10l06Q4K54J14p5j82j31K9J62R8
1180i9p8j32o4LO2J14N9j21k43J9K69K11j61l46p5L15L27p2m06j86L02L69j5l26
1204b74k25J79L05J28j85k77l1L07K85j09l36o0K98K04j20j68K4J08k5N3J19j4
1226A86k01o6K07K47m3k34j17J03K07J66q9l15j74K81M51j1n04l47L18N56Q1m94
1248B08m09J66M97J82l36l97J6L08K33r5k65j68J21K07O4j92j46N9J08o7r8J14
$$ y = [-256, 262, 328, -5, -263, -229, 2, 262, 370, 163, -140, -164, 156, 487, 479, 163, -103, -70, 358, 727, 593, 62, -227, 150, 761, 837, 337, -135, 0, 523, 869, 660, 116, -92, 246, 769, 825, 380, -3, 101, 487, 685, 588, 291, 74, 124, 409, 611, 520, 216, -35, 52, 376, 629, 472, 2, -269, 44, 559, 615, 85, -393, -256, 275, 570, 278, -301, -520, -101, 444, 410, -216, -618, -313, 214, 264, -146, -452, -368, -114, 0, -75, -257, -388, -359, -197, -99, -177, -309, -373, -370, -308, -194, -135, -256, -499, -480, -211, 0, -161, -507, -582, -267, 60, -12, -418, -604, -302, 67, 52, -274, -499, -320, -15, 113, -72, -349, -380, -73, 212, 103, -233, -293, 5, 209, 89, -79, -55, 53, 28, 81, 200, 186, -15, -81, 126, 373, 330, 96, -21, 82, 289, 455, 366, 51, -123, 158, 609, 598, 94, -253, 65, 621, 702, 208, -201, -35, 462, 644, 308, -89, -73, 235, 468, 373, 108, -60, 61, 268, 332, 140, -6, 53, 161, 94, -4, 110]
1270A10J14k12k76J08M09P7m25l31J64L91J27k34l45j37K48M21M2m89m17K25N75
1291A45J10m33m23J23L89J76j74k63j06J25J89J02q1k06j15J04K35J01j51k45
1311c98l9K21K16l4j64j90%K54L13j15m45j61L91M13j24m58j13L69K56j07k23
1332a38j11J31K11Q5j60k00N1L14P4k88j40K00K48q8k27l2J85J73q9j68o8J62
1354A25J66k7k18p4J63J86q0j96l4J53J04l3j55r7J21K04m9k45p1K21J39j73k00
1377g0N2J84J3q4p1l1j6R3Q4j05j88L4K12K4j81q4R1K6r0PJ25l7j87k8J59J02
1403C4r6j61q2P0K03J12j77l16J0L45J94k14l30J7K55J86o6k53j80J27L28R3k91
1426a92k67J78L03j0k08q5Q7Q9K8Oo4n3O5J00m7j41J07J83p7k07O3K56j9j82n0
$$ y = [110, 224, 12, -264, -156, 253, 330, -95, -426, -262, 129, 256, 22, -323, -460, -212, 209, 251, -238, -655, -430, 145, 255, -178, -601, -478, -89, 87, -87, -350, -456, -331, -142, -40, -121, -327, -442, -338, -103, -2, -153, -398, -437, -216, 0, -34, -198, -388, -388, -134, 179, 64, -381, -542, -151, 262, 138, -320, -433, -64, 192, 85, -138, -249, -118, 93, 178, 18, -182, -131, 183, 257, -31, -171, 29, 277, 189, -38, -70, 115, 288, 199, 31, -37, 125, 291, 264, 46, -28, 135, 321, 241, 45, 11, 164, 268, 235, 80, -17, 104, 308, 259, 14, -57, 164, 303, 130, -70, -18, 166, 179, 95, 24, -7, -23, 70, 154, 49, -139, -105, 107, 131, -50, -134, -43, -17, -107, -100, 25, -12, -199, -227, -68, 34, -62, -223, -305, -235, -32, 80, -97, -413, -403, -58, 136, -78, -408, -391, -136, 50, -16, -269, -449, -322, 6, 99, -192, -459, -281, 22, 12, -196, -281, -194, -105, -77, -71, -135, -188, -123, -23, -70, -211, -104, 79, 2, -205, -142, 114, 95, -87, -137]
1451a37J28Q5mj3n0r5P3K23Mk34j06K35J89j70j56O7J66Nq0qQRN5L5j12o4J39
1478A92J27j12j92J08J86k7j48k2N9L7K7M1q9j24P9J96n4k16K9J82k3j92QJ82
1502B54j4j58k4J06J0m7L3o8j35L8K59L1l27k00K73K54j04k74n3J22Q2L2pj61
1526g8j60J51K46o5k52o4J33P4l1lj4j06m7J42Q0q8j08qMJ3J48P8k19k37J55L63
1552A07J1l29j92J76K04O8q5j46j76J14L50P2l67k51K33L54k1k69o4J00O7N2M4
1575E2r4j48P1K04Qj45j1R2k9n3R1J23p9j93P1J93K6p6q5j8L2J50J14j79k41Q6
1601c8L10Q0k70j71J55J74ro5p9o8N3J91M1k41j25J94J63j13j76Q5J00n1p6O8
1625A32N6r8p8N6Q0l4j0k0r6j7J45J30j85k55P3L03R5k58k25L6K36J53r9l08j38
$$ y = [-137, -9, 76, 72, 59, 9, -86, -13, 210, 214, -20, -126, 109, 298, 128, -28, 39, 205, 210, 130, 122, 130, 139, 194, 229, 117, 53, 192, 319, 207, 15, 123, 309, 282, 134, 112, 171, 208, 235, 276, 187, 63, 142, 338, 284, 68, 97, 279, 256, 64, 72, 254, 240, 82, 58, 164, 174, 127, 160, 92, -43, -5, 254, 285, -42, -242, 31, 285, 181, -93, -146, -24, 58, 90, 83, -78, -238, -87, 159, 94, -158, -222, -89, -15, -46, -49, -63, -169, -216, -74, 6, -82, -190, -198, -194, -181, -33, 45, -174, -411, -256, 107, 118, -211, -403, -227, -23, 45, -40, -186, -362, -248, 102, 174, -193, -444, -211, 143, 122, -147, -211, -111, -44, 8, 52, -42, -190, -119, 85, 93, -52, -63, 29, 0, -53, 38, 161, 82, -111, -40, 153, 179, 103, 18, 0, 32, 182, 296, 117, -124, -38, 272, 352, 82, -89, 66, 240, 231, 166, 87, 19, 72, 263, 304, 63, -62, 132, 295, 182, 6, 91, 191, 140, 64, 132, 188, 90, 12, 68, 148, 114, 104, 84, -12, -29, 116, 246, 61, -194, -121, 182, 277, 19, -206, -170, 66, 219, 120, -188, -326]
1650c26K53L51p0m12j62K59K67m6k14j31M1J36J19k8k08q5J31J83q9r7J4L8q8
1673a64k4J78R8j90k38J23K54J02j56k33o3J83K84M6l31k77J82M38O4l28k75J18
1695b09L10J57j38k50p2J72K47k0k10j12J23J24nm2M3m3r7J4J79J11j21j87k7
1718e3J29K18N3k25k76Q4M07J69l01m10O8M09K09k17l20m2K02K66rk80k14J47
1740A4K65N1k20j46N8J27j2l5Qj7o7l0R8M6k4r6j09J9J85J35j76k76oK96J94j96
1766H6l00l8K53K09p0k69j57J44K89N8l01k21J27K61N4k05j43P2J14N0n4o4l9
1789a44M3M6J4k9J2Qq6k9J23J20j01k26J7K38J44j33k09q9J77K59J1k73k15J41
1813a81L54P3l08k38J30K92P7j72j92%J60J39j3j64r2Q5J29Kn4kj9m8OJ28Q2j04
$$ y = [-326, -73, 278, 208, -204, -366, -107, 160, 114, -100, -231, -190, -54, 65, 37, -171, -256, -125, 58, -31, -128, -114, -76, -164, -188, -10, 88, -102, -340, -217, 37, 139, -17, -250, -313, -130, 154, 200, -131, -408, -226, 212, 276, -52, -327, -209, 101, 258, 120, -130, -202, -30, 217, 197, -13, -125, -2, 122, 117, 75, 118, 75, -22, -8, 171, 282, 161, -26, -53, 76, 294, 347, 122, -154, -70, 337, 506, 205, -205, -137, 272, 481, 264, -56, -98, 104, 370, 361, 81, -133, 14, 279, 330, 110, -36, 22, 149, 137, 102, 110, 93, 26, -4, 94, 140, 116, 20, -89, -70, 115, 250, 74, -202, -208, 88, 282, 86, -214, -252, 1, 210, 140, -129, -286, -142, 147, 205, -96, -317, -190, 71, 125, -80, -223, -151, -37, 13, -41, -105, -144, -101, -55, -41, -70, -58, -50, -136, -165, -42, 78, -23, -249, -232, 6, 150, 17, -192, -281, -104, 155, 166, -107, -322, -181, 173, 246, -62, -300, -170, 122, 199, 27, -165, -165, -5, 134, 121, -43, -135, -50, 79, 81, 27, 25, 6, -42, -36, 92, 174, 70]
1839G0j92lJ86J84o1k49j56J51K99R7l05k79Q4L53J37k14k98k0K01K57k8k74j80
1862b40J15K83K8k05j60P6J28J2k2ro2n8NJ28Q2q6j58l1P9J58N5j57k23L9K93
1887G0J52j89l03l8L08K23j30k69j02J73K29%k16j28Q5J70N0j12r0L8N2L4k1R
1911ek7j0qK5O3N3n2j36k8J70J73j19k48kK09J76j06k01m3J03J95K8j84j68N1
1936i1K42R6j81j69J8K06Q3j38j27L7R5K9k3n5pJ2J0LNJ6k1o3mQ3P2q6j13k0J15
1965B4J02l2j79r0J04K10%j88j70J01K38J4k04j39R3J70K9j28j03MJ21P4o5j08
1989a22l1J06M9n9l6M3L1n7m9O0O9K4j12p5O6J39M4j42j48M4J99R9j30j89j2J95
2015FJ51p4j92p2J48J43J6j63p9P1J42Lr8j6K0%K2L9L7m8q5J6O5N3j3m5j02KJ33
$$ y = [70, -122, -125, 61, 245, 184, -65, -221, -70, 229, 326, 21, -258, -174, 179, 316, 102, -196, -216, -15, 242, 214, -60, -240, -125, 158, 186, -19, -179, -103, 25, 37, 15, 6, -56, -114, -109, 19, 101, 15, -143, -174, -95, 63, 118, -39, -262, -223, 70, 222, 33, -270, -308, 0, 223, 93, -176, -278, -105, 124, 124, -92, -220, -135, 35, 85, -27, -117, -79, -27, 7, -14, -5, -32, -42, -50, -25, 38, 91, 39, -97, -125, 45, 218, 99, -149, -151, 58, 234, 128, -73, -116, -13, 182, 210, 26, -142, -91, 151, 247, 66, -103, -85, 121, 204, 66, -61, -24, 71, 100, 77, 22, 15, 27, 37, 40, 45, 61, 40, -23, -27, 56, 128, 42, -71, -91, 24, 126, 94, -85, -175, -71, 139, 139, -49, -219, -118, 120, 134, -70, -209, -116, 54, 83, -45, -148, -144, -23, 51, -14, -122, -153, -47, 2, -57, -93, -50, -19, -76, -125, -65, 4, 28, -84, -159, -93, 46, 90, -52, -200, -156, 43, 142, 12, -177, -189, 6, 157, 83, -109, -181, -33, 110, 126, -37, -116, -45, 97, 100, 2, -14, 6, 6, 28, 67, 104, 56, -29, -13, 52, 105, 92, 47, -55, -53, 80]
2044H0J25r7k01k2K05J40q1k08n3J74J21l1j42r8P7J49nj02r2O8P7jo0k5J9M2
2070E9l6m9K4L1L0o0r5L7J28J8j18j25P5J33J8j23p4M2R3N2o3j13l0R5R1l8j28
2097a26rR2L0p1k7K1M8l7OOonKJl4K2N4Lo6l4P4O8o2q8M1P6L2m7n1OM9L6J3q4
2131f7j7O6O7k0q1mN6L6l2qJL3J1Kl0k5O1M2l0p2K3P0Qp1k4P8K0l5l3PK5K8ok6
2165E3m0K1P7K3r2m5N5P4k2o9j5K1RL6nm8rL7NJ2m5nK2Pk6MK8j3l3NPJ9j3m4j5
2200b4QM4M4p6o9L5Q8Nm9o2kK9L7K0l0p2k0R2N4n8r3J2N6K0k7lj3l9K9Q2qo6n1
2233a07K3N2N1m1n5j5K3N6L5m7p6PM4P8J2q3m4OP8N8n4p8k2O6P1mn3k1k0N2M6
2264C8J1o7m9M5N7J0l0k7k1L1J0N8l5l6l1M2M7J7m0m2lL2N9Rp1p0L8R1N1o4r1
$$ y = [80, 205, 108, -93, -115, 90, 230, 149, -59, -112, 62, 183, 152, 10, -88, -11, 138, 133, 31, -61, 7, 84, 83, 23, -2, 17, 59, 23, -26, -2, 29, 59, -1, -96, -59, 69, 87, -31, -156, -81, 52, 70, -53, -127, -85, 8, 60, -3, -116, -146, -51, 40, 2, -126, -135, -43, -13, -84, -111, -90, -42, -79, -73, -67, -73, -78, -76, -75, -109, -87, -33, -30, -96, -130, -56, 12, -50, -138, -97, -21, 11, -36, -87, -81, -32, 4, 17, -67, -84, -18, 49, 29, -52, -56, 0, 36, 4, -4, -3, 30, 41, 43, 13, -12, 49, 91, 61, -11, 12, 82, 90, 19, -5, 73, 93, 58, 25, 32, 57, 85, 79, 53, 13, 34, 111, 134, 42, -3, 52, 126, 104, 35, 20, 41, 50, 86, 81, 33, 24, 61, 66, 78, 33, 28, 50, 57, 31, 35, 63, 50, 17, 22, 29, 48, 35, -9, -24, -16, 28, 72, -4, -73, -38, 50, 55, 6, -56, -58, -29, 8, 28, -2, -74, -94, -2, 52, -6, -99, -87, -31, -11, -38, -41, -54, -93, -64, 18, 10, -56, -107, -84, -32, 19, -22, -77, -92, -69, -13, 22, -25, -101, -94, -50, 28, 40, -43, -87, -81, -3, 55, 1, -77, -99, -33, 38, 34, -19, -40, -60, -8, 38, 49, -18, -67, -22, 35, 45, 15, -12, -33, -2, 8, 66, 31, -5, -36, 6, 53, 70, 30, -12, -15, 17, 76, 85, 14, -56, -18, 73, 124, 60, -31]
2295c1%Q3O1lj07n1O9O9K4p3n8LO5N3l2n0j7J4N9J1n1k9L8L6k4poQl8j7Q3Om2
2328D6m5OM0K0ql1o3L7P2J6p7p4K8Q4M3p9o5lO7K9k7o5j6L7N0J6o6l0L5K4Lk2
2360a8jk1j0K1J2jj0k4rRN2J1o3n2J6R3K7p5q5L9P1M1n7p2k0N7R4rq9q2P4J00
2392A9j3n7n7K5N3K2j2l3j8j7L7K4mjpl4J0N8L1n7p1J2R0Q0n6j01k4O0J20Rj08
2423b0r4M3J48N1j14q4K3R3O6m8o2l8L1P2N5p3l6j3L3L0QPl5m1J1Q6M1n1r0%Q3
2454H2O6k0p9n7K3J18L9j12r2K3R8N1o3q1NN1L0K8n6n1NN0J0k7j0pj1oJ2M1j6
2485D4o0pL7N4%p4p0K3Q1N7o9j17%J10R2r3q8k8Q2N9lr0n2K0Q0L5p5p3L3O6L6
2516A0n8l5kPJ8L2k2l5rON3j4j6l1LJ6M6J8o0o1L0P2N6p0p1PQ6M2k8o8k8O5L2
$$ y = [-31, -31, 52, 113, 110, 3, -48, 21, 90, 114, 41, -17, -14, 51, 104, 72, 22, 5, 19, 78, 89, 38, 9, 47, 83, 59, 52, 46, 54, 16, -1, 82, 88, 46, 1, 7, 47, 67, 59, 28, -35, 2, 74, 90, 13, -61, -33, 51, 94, 15, -50, -53, 14, 43, 16, -49, -65, -28, 22, 38, -28, -58, -23, 1, 4, -18, -19, -40, -50, -29, -17, -18, -28, -52, -61, -52, 0, 11, -52, -104, -88, 5, 32, -43, -128, -89, -18, 23, -34, -106, -126, -69, 25, 16, -73, -155, -81, 19, 6, -51, -108, -83, -30, -8, -20, -53, -71, -88, -51, -27, -31, -32, -39, -73, -63, -5, 26, -31, -102, -90, 0, 80, 24, -77, -101, -41, 79, 88, -20, -114, -71, 77, 128, 14, -70, -47, 46, 112, 64, 2, -36, -5, 67, 122, 49, 13, 0, 33, 63, 71, 78, 43, 2, 13, 99, 140, 89, -1, -1, 82, 148, 128, 49, -8, 15, 133, 172, 60, -32, -9, 89, 140, 77, -4, 1, 52, 82, 110, 54, 3, 8, 58, 68, 41, 31, 24, 13, 7, 19, 60, 44, -16, -23, 14, 68, 68, -6, -76, -53, 28, 85, 16, -101, -101, 9, 101, 8, -80, -108, -26, 33, 30, -60, -112, -92, -12, 23, -52, -125, -92, -26, 10, -48, -83, -85, -78, -60, -28, -50, -85, -94, -88, -35, -49, -65, -96, -93, -77, -31, -13, -73, -134, -104, -32, 24, -46, -117, -110, -24, 18, -10, -78, -106, -41, -9]
2549ikl2l1J0O2N3Mj6k0j16J03M8j1pm8o8M1O0L2rq7J4J26M0j56p7LR0M1R9j11
2580B6l2k6J48j9j1j62L1O9J33j02p2N0j5J17j21j1Rl5J31pm9j0k1k0PR8j2o1
2608C3l4J1L4O1o4p5PK9P6lj02j00Q0J25K2j30q8P6P7Jo5k8RJ1L6jl6l1J4M1k7
2639d1k2K1J8j6p7J8Q1J7q6k7M8L1L4m5o1l0J14N1l5q9m4R8P9m6p9j9N5Q8j7n2
2669c3o5K9P6K2n6m3K9L1ojJ0Pl8K9K4J0m3%K4J6mL3%p5m1J07R2p4j13J9J33L0
2701A29r7o1K2P8K5lo6l7L0O9L6q9n8O4O1po9kL1J8nj5k7J5M1k5m1J4O0pp4k9
2733a9P0M9l3o6J8L3lK5l9q3jR2J01r4j06j3J19J8n9k9PjML8L3j16k5P9L9p5n
2764d2L4j3rk3N6J2n8n3N2N2km3o5J3N0P6p1p7j3Q2J30j08j10M5Q8P2J5j90l1
$$ y = [-9, -11, -43, -74, -64, -2, 51, 55, 39, 19, -97, 6, 54, 43, 36, -12, -80, -39, 21, 53, 44, -43, -29, 97, 137, -19, -96, -93, -3, 38, 137, 26, -6, -32, 116, 97, 86, -76, -45, 24, 157, 55, -17, 33, 18, 135, 14, 3, 12, -23, 108, 101, 52, 42, 21, 1, 8, 106, 94, 33, -1, 10, 44, 105, 41, -34, -27, 2, 78, 75, -27, -127, -47, 78, 100, -30, -118, -42, 35, 36, -29, -57, -48, -37, -1, -2, -38, -69, -55, -14, -41, -63, -42, -24, -40, -117, -99, -18, -1, -87, -114, -66, -35, -1, -46, -107, -137, -23, 28, -7, -96, -140, -42, 37, -9, -88, -107, -52, 36, 19, -33, -98, -69, 7, 29, -27, -70, -41, -10, -16, -17, -7, 0, -38, -9, 15, 25, -18, -18, 6, 22, 18, 51, 51, -24, -65, 42, 134, 60, -53, -34, 99, 129, 32, -29, -7, 71, 96, 93, 27, -10, 20, 89, 125, 36, -22, 42, 103, 96, 27, 25, 56, 74, 69, 54, 27, 42, 83, 58, 17, 31, 91, 84, 10, -19, 51, 100, 67, 1, 19, 52, 49, 74, 35, -48, -49, 43, 144, 50, -56, -69, 50, 68, 9, -20, -13, -14, -10, 28, 61, -55, -80, -1, 38, -37, -42, -8, -21, -30, -53, 3, 15, -43, -96, -44, 8, 6, -37, -102, -89, -39, 37, -34, -111, -124, -42, 88, -20, -130, -85, 3, 75, 90, -100, -131]
2793a31J45L3m5o8o2M3K18j46k4M9O4Mk00J62N1j02L3L2o1RJ7M6n7o7N1J10p1
2820C3k5mK3R5q3k7k0O0qO7r3mJP0Kn6j8J7M6j0k5j0J4K0K3m5l0K7M3Np3l3O6
2853D8M1n6p1L7O3K4p8l1K8K6K3k2l9m2M3O5j9r6k9R5N0o2o1LM4L3l5k0m2L7K4
2884a9Nl4j7K3K2j0m3L8K2k2k3mL4J4j4n0j1M3M2j2p3k2P7N0l0q0j6P0O0j5n4
2915d9l7K9N0N0n5p0J7P5K3o3l2N3j4l1P0j1Mk1L3J7n1k1J11m6m4k3Q0L6o6r5
2945h1N9P3J9K3r1L3L6K0l0p9K6L8P4m0o3NL3J5njpk8L2L1k0k9NK5lk7K1K3j8
2978F9n9J5N8Ol7l7PL1K9k5m1l0M2N9j4o6n7N9N2j3p1j3L5J5J7l4j6qK4K6n1k2
3010e0L4K6k3j9nK1j8k3K8Morj0KmL3K6o1m6N0N8qp0j3K2N0j6l0k7j6N8K6j7m6
$$ y = [-131, 14, 47, 2, -66, -128, -85, 133, -13, -37, 12, 76, 80, -120, 42, 93, -9, 24, 56, -5, 4, 21, 67, 10, -57, -6, 104, 33, 8, 4, 27, 122, 39, 12, -8, 52, 44, 111, 18, 14, 15, 85, 87, 31, 13, 30, 76, 66, 41, 31, 45, 65, 88, 43, 13, 40, 83, 88, 15, -18, 48, 89, 33, -38, -1, 62, 86, 8, -23, 5, 31, 54, 32, -7, -49, -6, 59, 40, -56, -85, 10, 60, -2, -63, -60, -16, 17, -18, -38, -80, -43, -19, -14, -48, -65, -42, -20, -30, -73, -35, -13, -35, -58, -62, -28, -14, -28, -78, -89, -46, -4, -16, -89, -111, -34, 16, -14, -94, -110, -40, 20, 5, -49, -86, -57, -7, 43, -12, -82, -65, 10, 33, -30, -62, -9, -23, -54, 16, 5, 9, -12, 21, 38, -13, -34, 77, 31, -13, -36, 44, 80, 14, -81, -22, 51, 70, 93, 2, 35, 71, 91, 61, -18, 8, 46, 120, 80, 17, 22, 55, 70, 65, 64, 57, 29, 61, 92, 72, 43, 48, 73, 70, 43, 64, 87, 69, 10, 25, 83, 89, 52, 15, 22, 53, 82, 57, 16, -14, 28, 87, 73, 7, -50, 9, 61, 48, -23, -36, -1, 14, 31, -3, -19, -27, -3, 23, -28, -50, -16, 10, -13, -32, -37, -16, -34, -57, -29, -25, -31, -40, -50, -48, -52, -19, 7, -54, -100, -50, 8, 0, -70, -83, -61, -11, -27, -57, -84, -100, -42, -16, -33, -79]
3044g9k5O0L9k9k7j6L8K6k9mKoLK6Rl8kLJ2pL9L0n3l6M9M5j0m6oJ4L5L4k3o3K
3079c3L7P4j0r5RK8O2kl7k5J6K9K4j5l8j9L8K4j9J1k0K4k9K6K0k0k8j6L8L1Mm1
3111D8lj1J8L8kn5m4L3P2k5l7l7J8L6J7k5l2j6J9N1pn9j7K0L1mj8kl1PK3L4m2
3144bk6j2J6K5J0k4j3l1L0L1om3l0N1KJ0j8l3qL0M6po0l9N5K7pk7qpnL5J9k6k8
3179g3RL0Qk1j2J5J9KJ6k1k9J9RL9k2l2K2J4J8J3j8l9J2L3M3l6l2%K5J9Oj2k5
3212aj6L8L8k2n2j1M0M7Nl5%j2RJ3J2l8n%N4J5m1m3J2K7J2Kl1k0k2L5N9l9k5R
3246A4lK9j2Oj1m9M0K5j1k9j8J2J5RLl4kjM7Rm3k7QO4k2kn0K2k0M6Rl4j8k3N2
3281AK1k3j1j8LL1JMm8%L7J7J1m2l4J8J6MJ0j9k3K2L7J4m4k4K6K1K0k4l2NL4K0
$$ y = [-79, -104, -44, -5, -34, -61, -77, -39, -13, -42, -46, -44, -50, -47, -21, -12, -50, -52, -49, -37, -44, -5, 25, -28, -64, -15, 30, 20, -26, -32, -18, 17, 51, 28, -35, -33, 4, 78, 68, -27, -18, 10, 72, 70, 33, 8, 24, 53, 77, 62, 24, 5, 43, 67, 48, 59, 39, 63, 34, 60, 80, 60, 32, 16, 54, 85, 89, 48, 45, 34, 52, 90, 88, 33, -11, 22, 94, 69, 32, -5, 13, 49, 66, 41, 9, -7, 12, 63, 56, -3, -20, 0, 31, 27, 9, 7, -24, -17, 6, 40, -2, -28, -40, -24, 1, 11, -13, -26, -57, -27, 4, -2, -45, -75, -24, -22, -12, -30, -63, -71, -41, 5, -2, -62, -101, -46, -19, -26, -53, -61, -68, -73, -38, -19, -45, -73, -64, -34, -26, -47, -59, -44, -25, -23, -7, -28, -57, -38, -29, 10, -12, -44, -22, -8, 10, 23, 5, -34, -22, 11, 54, 18, -14, -14, 11, 30, 36, 24, -1, -17, 21, 59, 37, -15, -26, 14, 61, 66, 31, 31, 19, 28, 41, 53, 15, 10, 10, 64, 79, 38, -5, 7, 34, 46, 48, 17, -3, -25, 10, 69, 30, 5, 14, 11, 40, 28, 34, 23, -26, 14, 39, 28, -1, -19, -7, 8, 17, 20, -14, -16, -17, 30, 39, -4, -31, -23, 41, 19, 17, -33, -11, -31, 15, 24, -10, -28, -51, 1, 22, -1, -12, -30, -27, 4, 5, 9, -39, -39, -2, 15, 26, -16, -50, -32, -16, -12, -2, -21, -44, -22, 15, 29, -15, -39, -13, 8, 28, 4, -28, -23, 11, 31]
3315C1lk2j0QL2j0j8kMQNK5j6k2RJ2KJk4Qj0LK2J9m2jLK8rj9j6LK5j0Pk2qK7K8
3354D6j4n7PML7k0j9J3j4J3J0Lj6%KMj1J7k2nk6M1ORl0j9J7K4jk0j3lJ8K3Nm3
3390c4l0M3L2j9l1OJ2j1J5K2l9j1K7J5Mk2j1K4j0OJ1J5l9qK8J3oj8j8L2J0Orj9
3424a4j0K0L9rl5mM0K0k3j7QrJ9K1l2pjJ9J6k7pK5mk0RJ2Noj4J7Pj2j2J5lj4J2
3461B4j0%rLL7k6k4J1K3j9prMj3L2jpm2L1J3Om5LK3Rj0j5K4rj2K2k2pJ3J6qj1
3498a2%K7k5rj9L8K0rl8J0J0J3j1J5n7K6LM0n0oM7jk4mJ7l6M1J7Nk9k3MO1l7r
3533el8M1lpK0K0Jm9o3N8L5K2k8j1KJ5MJ0l5JN9nk6l2K9J6j1j3mJ0JOOl5J0L0
3569C1J8n2j5K0L4k8rmK5j1Kj9NpL0Ol5k2K9M6m0l8J6L9ok4mLoL1j8Rm1J9M9j9
$$ y = [31, 28, 6, -4, 4, 36, 26, 8, 6, 10, 18, 23, 48, 32, 10, 19, 31, 33, 34, 10, 18, 8, 11, 33, 52, 10, 9, 12, 40, 31, 12, -4, -1, 24, 14, 21, -1, -9, 18, 46, 32, -25, -18, -14, 23, 3, -16, -3, -17, -4, 6, 9, -7, -7, -5, -1, -12, 5, -17, -22, -48, -7, -1, 8, -22, -41, -24, 0, -1, -21, -34, -37, -19, 4, 9, -34, -64, -21, 11, -8, -39, -33, -21, -32, -17, 5, -34, -45, -18, -3, 1, -21, -32, -8, -18, -12, -1, 14, -25, -33, -5, 8, 2, -16, -34, -2, 8, 14, 5, -14, -24, -4, 35, 26, -9, -13, 27, 47, 24, 7, 15, 6, 25, 46, 14, 7, 6, 25, 41, 14, 7, 32, 28, 8, 17, 29, 34, 28, 14, 31, 38, 26, 14, 29, 26, 12, 24, 14, 14, 5, 8, 45, 19, -5, 6, 29, 10, 3, -6, -2, -15, 17, 16, 9, -33, -2, 11, 17, -28, -25, -2, 7, -3, -18, 6, -3, -15, 7, -15, -22, -9, 7, -1, -12, -12, 15, -10, -19, -38, 0, 20, 11, -27, -17, -7, 6, -5, 10, -47, -21, -18, 22, -28, -34, 13, 12, -12, -16, 1, -35, 6, 23, 28, -1, -24, -20, 41, 4, -5, -43, -2, -5, -12, 8, 28, 29, -20, -83, -25, 10, 32, 4, -7, -5, 10, 14, 24, -11, -10, 49, 44, 18, -14, 15, 31, 20, 7, 3, 13, 14, 20, 26, -9, 1, 31, 49, -3, -18, 2, 36, 8, -1, -5, 20, 9, 11, -8, -3, -10, 20, 26, -9, -31, -2, 44, 4, -34, -18, 21, 15, -9, -13, -10, -16, 15, -3, 6, -35, -16, 33, 14]
3605A4l3jJ4K9m5kJ2K1j4%koJ0mK3l6j8N0Ok6k5K5L3k2k8K5K1qpj7%PLJ6l8j3
3641c6L7K7k6m3PL9J3j8k1MPJ2L1m2l5L2M2j4n1J7K1Mk6MK3LJ7l1k2K2ML0k1m2
3675c2J1N8J3p1j5M8J7j3j4j9J3jK3rk0k4M8J4j9k4J1J0Rk9ONJ9j0nk0PK1rjj5
3710a7J7jJ0l0pL9Rj8j6J1mJ6rj1oK2K7Jn5j5N9j3j4JJ8mJj1J3k3RnJ7j2LL0m
3747B8k2k8J8N0l5qj0K7j7lLk1J1J3mrqL0Mll2nK3J7k3qKkL1okl9K7K5j1l0pM6
3785B2Ok2QPk0J1j0rlK4rPk4lRNlmJ5Nk6j9L4K1nj6rj4P%L5l5jMJ9k2%mJ1Rk1
3826b0oJK7jlj1j8J1L4l5r%L9Rrl0J7Ljkj1kRJ8j0l3J9J6Qk4j6M2k5J1kONj3K5
3865A9k2pnJ3J2j1k1K8K5l2k7J6J2kj6lK5jjrJ1Pk1J2kLoJ3nk4K1Kkoj7K0Njn
$$ y = [14, -19, -20, -6, 23, -22, -24, -12, 9, -5, -5, -7, -13, -3, -7, 16, -20, -38, 12, 18, -8, -33, -8, 25, 3, -25, 0, 21, 13, 6, -11, -11, -4, -1, 15, -23, -36, 1, 28, 2, -41, -34, 5, 18, 0, -21, -17, -10, 2, 33, -9, -44, -12, 30, 16, -35, -18, 3, 7, -19, -15, 8, 11, 28, -3, -25, -3, 1, 31, 10, -32, -21, 37, 50, -21, -36, 12, 29, 16, 2, -17, -4, -5, 18, 9, -11, -35, 13, 27, 8, -16, -5, 5, 14, -15, -9, -4, 15, 5, 0, -20, -13, 8, -1, -2, -17, 0, -1, 9, -21, -28, 11, 20, 2, -14, -3, -7, 9, 0, -11, -17, 5, 32, 33, -22, -37, 22, 9, -5, -4, 14, 10, 11, 0, 13, -10, -1, -6, 11, -1, 2, 32, 28, 6, -22, -4, 46, 11, 3, -7, 20, 3, 0, 3, -18, -7, 6, 2, -7, -15, 15, 19, 16, -16, -21, 2, 19, -4, -12, -10, -12, 19, 13, 11, -28, -1, 24, 13, -17, -24, 22, 28, 6, 14, 21, 1, 12, 2, -7, -10, 14, 5, 12, -12, -15, -6, -1, -4, -8, 7, 12, -14, -33, 1, 22, 17, 1, -8, -22, -15, -15, 20, -15, -16, -12, 7, -15, -15, -19, -8, 1, -20, -26, -25, 2, 1, -2, -13, -31, -20, 14, -21, -30, -30, 9, 18, 9, -21, -4, -1, -2, -4, -15, -17, -8, 10, 0, -33, -14, 2, 10, -14, -30, 12, -13, -2, -4, 2, 7, -6, 19, -3, -10, -15, -2, 10, -1, -22, 6, 31, -1, -28, -12, 0, -2, -18, -21, 4, 3, 2, -7, 4, 11, -10, 2, 0, 3, -3, 10, 5, -19, 2, 4, 2, -4, -21, -1, 4, 3, -2]
3904bk3j1L1K4j1l6J9K6oMl6J7kkK1Oj5klJ5j4rL1pj2MLNj2k2J3K0Jj7lnrQK0
3943Ink4K4Poj6j5K2Mj6K0ljnRj5mJ0J5nl4M1J0orj4RMJ4nj1j1J1j5J7p0L9O4
3981C9J2K1j34N8M3n2J4%J5J0nj5k1%J4PK5k0J3j1pj4mj8J9K8l6J2OOj4KjRJ4
4016A5k1k1K1J1j3NjNKKlj2j9M6j1Mk2KJ1K1j0k5PJ5pj0KjqPOjJmJ1k5J9MmJj8
4057a8J1J0jpk%PJ8j1j0k7L8J4rk5jK8k1rKj%j2M7k2lOmJ4k8J2jJ9mj6K0%qj5
4096iJ7j8J0mJ4%MJ0k4J1j7QJ3j0kqPj4K3j7j2RPNrlJ6mmlnJ3pjJ9k1pj4L3k1
4136a5pMJ7nj4K1Qj2j8J3J2Lk2J5Ojj0L4j4j0lJ1pnRj5MLKj0J2rK7j5Jj2J0j3
4174eLKrKjNK4l1lj1J9J3j8PMLj0K0k%j0kK5m1K0mpj3J1NPLk0K8Kjj5K1k2J2n
$$ y = [-2, -25, -36, -5, 19, 8, -28, -9, 17, 11, 15, -21, -4, -6, -8, 13, 19, 4, 2, -1, 14, 0, -9, 22, 15, 3, 7, 10, 15, 3, -19, -6, 14, 15, -2, -5, -10, -19, -11, 9, 4, -20, 4, 11, 5, -11, -26, -4, 0, -16, 4, 1, 0, -5, 4, -11, -15, -5, 10, 5, -29, 12, 22, 16, 7, -7, 2, 6, 20, 15, 4, -7, 4, -11, 6, -64, -25, 39, 51, 72, -62, -4, 39, -13, 1, 1, 16, 26, 21, 6, -15, -15, -1, 6, 31, 11, 24, 13, 6, -8, -12, -30, -11, 17, -19, -7, -1, 5, -9, -7, -8, 1, 15, -6, -27, -6, 5, -8, -3, -4, 1, 3, 5, 2, -10, -29, 17, 6, 10, -12, -10, 1, 22, 12, -13, -6, 9, 2, -8, -6, -7, -15, -8, -2, -3, -2, -6, 5, -20, -1, 3, -1, 0, -18, -7, 3, 2, -5, -7, -7, 0, 18, 7, -3, -30, 8, 22, 13, -12, -13, 15, -6, -15, -13, -14, -14, -26, 21, -1, -4, 2, -2, 12, -16, -4, -5, 14, 10, -6, 14, 14, 6, -9, 8, -10, 0, -4, 10, 10, 14, 24, 0, 11, -6, 2, 15, 5, 3, -5, 2, -12, 11, -6, -18, -9, -2, 3, -6, -9, 7, 3, -1, -4, -9, 4, -3, -4, 15, -6, -13, -27, 6, -15, -22, -18, -1, -6, -20, 1, 9, -3, -21, -8, 4, 7, -15, 0, 6, 5, -5, 29, 15, 5, 2, 13, 6, 1, 10, -5, -1, 2, 4, -6, 6, -3, 24, 9, 10, -2, 8, -5, -2, 0, -9, -7, -8, -3, 21, -10, -13, -24, -5, 8, -10, -3, 1, 4, -6, 14, 12, 12, 2, 0, 25, -16, 4, 0, -7, -20, -9, -4, 3, 6, -14, 14, 16, 15, 0, 21, -1, 11, 6]
4215Fn%j6K3Onj7J0R%J1k7pL4nrm%jJ0l0jj1M1j3j8J7pL0k2Kn%nJ1Ql2K1nK4k2
4256dmkkNj0K7rrj5K2j0K0j1Pj9PJ2%nn%J6kj1O%%oJ2j9K0J2j4Jj5rJ6%oj2J0
4297fQJ3j5l3L3P%j7Mj3K4L0m3oJ5J5k6Ll%J1%mj2jJ2NqKJ4J0j5rNJ0rRnrJJ6
4338A3lj6j5L3%rnJJ3lj6jMJ2jj3J6j4j3K2j5kK0j6J1mqkJ8k0oJ2qlL7l4%j1M3
4377A7k%j9O3m7k5L3j2J4k0N9p9N9n3J3Mj3oL1J4j7j4j4L0oj3KrJ1j2L1k3k0J5
4411hkJ3k6qK3J4k3qK3pK3k1j2O%K4j6rPJ8rj5j2mL5kjqj1J1mLnqJ8j0j2NJ8J0
4451A0qrJ0Lnj2LJ5j3KK1rrQMLk4j0K4Klj0rJ5nOj9J1KLNk2LPJ9Kk3J4pJ5j1R
4493Hk0J1J%loRQJk1J0K0rj1j4K0Rmj0j1KJ9j1Qj0oL0j5j1j5J8JJ4Jnj3j6M3j5
$$ y = [6, 1, 1, -15, 8, 14, 9, -8, 2, 11, 11, 22, -5, -12, 22, 17, 8, 4, 4, 3, 13, -17, -18, -29, 12, -1, -19, -2, -9, 21, -1, 1, -4, -4, -9, 2, 10, -22, -1, -6, 18, -4, -8, -10, -12, -7, -17, 10, 1, -8, -23, -1, -11, 9, -2, 5, -14, -7, 5, 5, 0, -5, -5, 11, 9, -2, 4, 4, 4, -2, 10, -9, 11, 23, 9, 10, -5, -14, 2, 2, -4, -16, -6, 2, 15, 0, -33, 0, 7, 7, -10, -6, -19, 5, 35, -8, -14, 1, 16, -10, -7, -10, -10, 1, 1, -3, -15, -16, -4, 1, -7, -5, 9, 19, 4, -5, 0, 10, 1, 10, 5, -4, -3, 13, 10, -6, -21, 12, 12, 3, -2, -1, 12, 9, -7, -8, -4, 8, 7, -6, 10, -4, -17, 5, -10, -12, 8, -8, 3, -1, -9, -11, 7, -13, -19, -7, -15, -18, 19, -15, -15, -26, 17, 15, 15, -4, 59, 12, -13, 20, 8, 22, 2, 61, -18, 41, -12, 1, 5, -8, -14, 17, 31, 14, 0, -14, 16, 10, -3, -1, -10, 1, -11, 20, -3, -23, -8, -10, 3, -23, -31, -8, 6, -17, -25, -2, -9, 14, -7, -19, -13, -13, 11, -5, -14, -7, 11, 2, -13, -25, -29, 6, 4, 3, -5, -16, -5, -9, -6, -11, -19, -1, -11, -23, -18, 0, 10, 2, -7, 3, 6, 1, -11, -8, 7, -6, -4, 17, 8, -1, 7, 11, 14, -10, -20, 4, 6, 3, -7, -16, -1, -6, 0, -19, -8, -6, -3, 2, -20, -17, -10, 9, 11, -12, 2, -5, 10, -1, 8, -12, -1, 0, 0, -3, -9, 0, 8, 9, -12, -2, 18, 9, -2, -16, 4, 13, 9, -1, -12, -10, 9, -2, 6, -4, -10, 20, 5, -6, -21, -3, -2, 12, 13, 8, -5, -21, 22, 7]
4532Gj0pNkRj8RjKj1RjJKj3J0RqJNlj4K4kk5jJ7QJ4j6j7OJ1LjqnJ4Kpj2J7Poj
4577CmN%mj3J5qjJ2PmOk8j2K7%Kk5LmJ8j3J8j2R%lQLj8NJ3j5J3j0Kj0J4j7K1j3
4618a0KJ3nLj6L0k7J7mNKj1jJ0nK%j2J1J4j7%rJ2qOQj9jNQNjqqJ6Pj8JLpLJKJ
4663@j1pK6jj5k%JqkJ9Jj3J6nj2jRJ1Pj1kj1L4l1K2j1nJK2j9nRnRjnnoqK3pjj1
4707a1MpK4j1qOj3kJ4QJj1KJ5mj6j3J9rK3j9J1npK0oLj6%MJ4j6j2J0OmlRoKOp
4749eJ0j2K1j5lJ6%l1K7qjqPjmNK2ol1RJ1Mj5Pk5LMNnllJ1K0qQonjRolJlNkJ9
4795A4mj6J7k1J0llj4K4Oj5Rj5J9lj2J1qLKJ0JknNpJ8k0MOooJ0qJkqKj3J7Rj6
4837iNKNk7J4%Q%KJ3%j8JNj1j3L0mmk1LK0j6jMJ0LoK0k5OjJ0Kj5OQ%k7L1j1kj2
$$ y = [7, -3, -10, -5, -7, 2, -16, -7, -8, -6, -17, -8, -9, -8, -6, -19, -9, 0, -8, -7, -2, -5, -19, 5, 3, -22, -23, -6, 2, 16, 0, -17, -11, 0, 3, 2, -6, -11, 3, 5, -2, -14, 3, 10, 4, 3, -1, 4, 4, 0, -13, 2, -6, -7, 5, 12, 8, 14, -14, -26, 1, 1, 3, -22, -19, -23, -5, -18, 0, -12, -3, -3, -6, 2, 5, -13, -8, 5, -10, 3, -7, -5, -15, -1, -18, 3, -10, -8, 5, 0, 3, -13, 17, -10, 7, 3, 8, 10, -1, -2, 8, 3, 5, 5, -7, 4, 18, 1, 1, -8, 4, -4, 2, 10, -9, -10, -5, 3, 8, 7, -1, -9, 7, 14, -4, -3, 0, -7, -4, -3, -1, 0, -11, -18, 8, 7, -8, -10, -10, -9, -17, -19, 0, 1, -12, 4, -1, -13, -14, -5, 6, 13, 2, 0, -11, 23, -8, 14, 3, -2, -1, 21, 2, -3, 6, 1, 10, 9, 4, -1, -7, -15, 8, 1, 0, -11, -7, -14, 10, -1, -9, -3, -16, -18, -4, 4, 5, -6, -4, 11, 7, -9, -22, -3, -12, 11, -8, 3, -2, -9, 11, 5, 8, -8, -8, -4, 10, -6, -18, -8, -2, -6, -9, 0, -6, -4, 2, -5, 5, -7, 14, -1, -4, 12, 12, -19, 8, 0, -1, -9, -2, -3, -7, -2, 20, 14, -17, -8, 3, 7, -8, -1, -26, -23, -19, -14, -19, -22, -25, -14, 6, -2, 6, 0, -5, -6, 3, -3, -6, -5, -8, -3, -5, 14, 10, -6, 11, -10, 0, -3, -6, -20, 4, 10, -5, 4, -11, 8, 5, -7, 4, -4, -1, 1, 11, 12, 10, 5, 10, 3, 21, 1, 5, 11, 5, -1, 9, 1, 2, 0, -8, -6, -19, -2, 7, -9, -4, -2, 3, -24, -10, -10, -2, -2, 0, 13, 13, -5, -4, 1, -10, -23, 7, 3, -1, -22, -19, 1, -15, -16, -12, -2, 1, -5, 15, -10, -4, -5, 5, 7, -8, -2, 6, 6, -21, 10, -1, -3, -15]
4880a5J7krJ6pjjkJ1pj6K6J2j1j1j2K0moJ3j1orJ5K1j7j8K2rNj0%J2j0nK8kl1
4918a4RNK2k7J7J1l7J3K0Qpj8OqJ2Lj4KKk%oJj3J8Prjj0J3%J5j8jNk2J7J3j1k9
4958b8K3ljQKj7RJ0NJj1j6RJ2Kj6QJlPj1rPJ4kj4J3lkJ9mk6KRJ0%lOqkJ7rJ0j2
5002D%Rqmk0K5qj3K0j9K5j5LJ3j0J5k3nJ4jrJ9j1MnJ1lk1K5klJ0qj7K4j9NKrJ4
5042INRj1JOnrOJ4j4qLK0mk5PpqRK3l2jJ9rmJ8k8J5mPj6J7j8J3kJk0QL%kRJnM
5087ek7K9Jj2RqLjJ5j5J0j4K0k0J2MlkJ0oJ0l1K0PpJ6k5PQmpjKJMJ9j2qoNJ1m
5129Ej3m%J3kMmq%oL4k2JoK3j5oKJ7rj0J4lMj4J5k3K8lnPj9KRj7K3noJ4j5MRj4
5172anL1j1n%lj2J0jJ0j1%NMj1nJ2km%mPRk0J8j4JpJ1oJ4j3lJNjJnKmMNjO%j8
$$ y = [-15, 2, 0, -9, 7, 0, -1, -2, -4, 7, 0, -16, 10, 22, 11, 0, -12, 8, 4, -2, 11, 0, -6, -15, 0, 21, 4, -14, 8, -1, 4, -6, -6, 6, -4, -9, 19, 17, -14, -5, 0, 22, -5, 12, 23, -14, -1, 19, 27, 20, 2, 8, 0, 12, 15, 1, 3, 5, 3, 3, -3, -2, -15, 3, 10, 1, 0, -10, 3, 3, 18, 0, -1, 4, -18, -1, 12, 1, -28, -5, -8, -9, -1, 1, -16, -7, 3, 8, 9, -2, -18, -9, 3, 5, -11, -3, -2, -5, 2, -9, -18, -11, 3, 1, -13, 0, -3, -5, 14, 10, -16, -14, -5, 5, 5, 2, 8, 0, -2, 15, 6, 16, 4, 4, 13, 5, 1, -19, 6, -2, -15, 5, -14, 11, -4, -1, 12, 2, 17, -6, -11, 3, 2, -7, 12, 1, 5, 0, 11, 8, -13, 12, 10, 7, 17, 9, -8, 16, -3, 2, 4, -5, 9, 14, 23, 12, 13, 19, 14, 5, 11, 25, 11, 3, 6, 26, 22, -3, 4, -3, -11, -2, 21, -11, -12, 7, -2, -6, 12, -16, -1, -5, 2, -14, 3, -15, -2, -4, -3, -23, -15, -12, -12, -14, -5, -4, -9, -5, -32, -3, -2, -14, -5, -13, -10, -11, 4, -11, -1, -15, 5, -15, -3, 1, -2, -4, 6, 0, 10, -21, -1, 6, -1, 15, -10, -3, 5, 1, -6, -7, -5, -4, 0, 19, 7, -1, -7, -2, 9, 5, -8, -12, -12, 1, -1, 3, -1, -9, -9, -15, 19, -3, -2, -8, 15, 0, -6, -4, 13, 4, -6, 8, 5, 9, -5, 10, -13, 15, 12, 7, 14, -5, -3, 6, -11, 12, 7, 1, 15, 0, 4, 13, -1, -6, 25, 14, 9, 9, 6, -6, 4, 3, 13, 2, 2, 7, 11, 0, -5, 7, 5, 1, 1, -3, 4, 13, -7, 11, -3, -2, -9, 2, -4, 10, -3, -6, -5, 0, -1, 0, -5, -3, -7, -3, 2, 1, 7, 7, -11]
5218a1K6qk4K7mjpOKPlkPj1KJ0rmrLpK2jk9L7k3klOPnpJJ4mnLQk3NkJ2j2QJ9j1
5264ER%j4NJp%KJ%J2j7JJ5k4J0LQqqK1lJ2l9J4J5kRmk6RJ5mj4%J3Nj0L%j1J8n
5307A0j0RnOk1J3Pmjj8K1oNPl1J6K0m5J9%PKJ3j7J1qQnjj1QJ0Jk1K5Mj1%oQk0
5348a1J6mjOj2J0j6kK0j6J4mnRPrOj1j1NRMNnj3j1L0j2NjlJ0j6J2oKlOj4QKMN
5391IpJ2k9J4MO%kNl8L4mNj1K2j9Ok1K5j1MJ3j5lMj2J8j9J2J9k2NkQmMpJ1k3j1
5431b0L3%k7J1Qj2rJj0K0OOorrK2%qnNkmmQNlkokK0J6j8pKKLMpNqPj5OOmJ2l7
5478b6J1J4RJ7j6%Pk0jLjmkj2J1%J0J2k0j2kL4l0kJ7jNJ3j1OjOj4KOlJMQpPjM
5521B1k8j0K1Pj8JJ5j5J1Qj3Qj0J0k9NK4pRj8J1j9J5QKlJj1NmPj1pJ7Rk2j1J9
$$ y = [-11, 15, 7, -17, 10, 6, 5, -2, 4, 6, 13, 10, 8, 15, 4, 6, 16, 7, 3, -6, -3, -10, 12, 11, -18, 19, -4, -6, -9, -3, 4, -1, -8, -7, 7, 3, -2, 1, 9, -14, -9, -11, 1, -11, -3, 16, 5, 14, 14, 0, 5, 6, -1, -1, 1, 2, 2, 14, -3, -2, 13, -11, -1, 2, 10, 2, -6, 15, 12, 24, -15, -1, 14, 12, 21, 17, -9, 0, 15, 11, -3, -3, 10, 15, 5, 8, 8, -3, 15, 10, 0, 9, 4, 10, -11, 2, 9, 5, 4, -14, 7, 1, 6, 13, -18, -2, 18, -27, -8, -8, -1, 1, 14, -3, 8, 0, 8, 3, 2, -9, -1, 9, 10, -11, 14, 18, 7, 7, 1, 9, -11, 5, 1, 0, 6, -6, 4, -12, -14, 6, -10, 4, 0, -5, 4, 11, 2, 8, -3, -14, -9, 0, 4, 9, 4, -9, -20, 10, -2, 3, 2, -1, 9, -7, 5, -1, 1, -2, 4, -10, -2, 0, 4, 9, 2, 14, -15, -1, 3, 9, 9, 7, 12, -26, 8, 4, 9, -2, 20, 1, 7, -14, 11, 0, 4, 17, 2, -1, 3, -9, 9, -10, 2, 21, -1, 4, 2, 10, 6, 10, 3, 14, -9, -20, 13, 13, -14, -3, 5, -7, -16, -15, -25, -5, 1, 7, 1, -8, -17, 5, 5, -3, -8, -3, -5, -9, -13, -5, 0, -3, -5, -11, -13, 7, 23, 5, -2, 0, 2, 5, 9, 2, 7, -1, 6, -9, -3, 3, -1, 11, -26, -15, -1, 8, 25, 9, 9, 16, -4, -5, -2, -3, -7, -9, -21, -10, -10, 0, 12, -8, -20, -22, 12, -18, -20, -3, -4, 1, 14, 3, 9, 8, 14, 0, 2, 8, 5, 6, 10, 18, 11, 18, 17, 21, -7, -17, 4, 11, -7, -6, 9, -6, 5, 13, 0, 8, -2, 8, -21, -16, 8, 1, 10, -8, 3, -16, -1, 7, 9, 6, 7, -4, 1, -3, 4, -7, -14, 3, 12, -10, -21, -2]
5559bJ8mk1J4N%j3JMoOmO%pj6QJ5QKjk8J5LKmJKJ3j0JJj7K7k4rK7j3NKJ0k1oL
5603gJ2j2Oj0J2rMj1KRLmkJ7j8QqPj8L3Lj6MlO%pkmlJ5pOj5lL4k1OPMlqJQj4k
5649@mLJ0mQNj5kkQk3K8%l%%j5RLJj6J1j6J1KOnlJ2j1Lm%K4l3J8MrJ6j9J2j7L
5692dJ4j0Rj4J7Mj6oJ2KJ5k3k2J8JJ5j0nJ8j3rJ2oOj3RqJ6K0j4j2rNQmmKJ1j2
5731@Mmlj4J0j2KPJ%rPJRJ%oJ2j6JJ8j2kj%mQrRPlLrKMLPj7KqL0j3j7P%J2loJ0
5780Ik0J4j1%PMOj8LJOoQklj3J2J5qj4kNkmK4j2MJNj0Nj2J6j5J8k2K0J7k2kQo
5822DN%qRMj0j2J2njJ0j1JoJ2lMj5j1J7j0J7jrJ8j3j9P%J7j5nJ3rlJ2kJ0k1J0
5862gj0nJ6KNKj3mL2k3J3j6Ol1J1J9o%Pj2K6mj4RoNj1J2Orj2K1%k6K7l0J6j8J9
$$ y = [-2, 16, 12, -9, 5, 10, 10, -3, -2, 2, -4, 2, -2, 4, 4, -3, -19, -11, 4, 12, 14, 13, -15, 0, 3, 5, 1, 2, 4, 17, 7, 8, 9, -8, 19, -5, -14, 13, 0, 5, 7, 17, -4, -10, -7, 5, -7, -1, -11, 1, -8, -4, -15, -13, -4, -1, -5, -7, 10, -8, 0, -8, -1, -19, 14, 17, 1, 5, 2, 8, 8, 1, -1, -5, -8, 7, 0, 6, -9, -12, 22, 1, 7, 14, 18, 15, 7, 8, 16, 2, 0, -4, -1, 9, 5, 13, 18, 3, 1, -1, 7, -16, 12, 12, 9, 9, 9, -6, 3, 6, 7, -9, 2, -14, -3, -1, 5, 0, -3, 9, -2, 1, -3, -3, 21, -12, 6, 10, 1, 17, -2, 10, -7, -4, 10, 0, 9, -5, 12, 16, 0, -6, 6, 8, 23, 0, -22, -4, -3, 12, 2, -3, 15, 2, -7, 5, -1, 5, -8, 1, -7, 9, 29, 15, 3, -6, -1, 7, 3, -1, 1, 12, 0, 4, 0, -3, -17, -7, -19, -17, -10, -9, -9, -18, -11, -10, -1, 0, 0, -6, 6, -10, -9, 9, -3, -5, -6, -6, -10, -2, -11, -2, 5, 2, 5, -4, -2, 2, 5, 12, -5, -3, -11, 19, 6, -11, -4, -4, 8, 5, -1, 9, -11, 3, -8, -8, -1, 3, 9, -9, -6, -5, 1, -5, 3, 1, -2, -15, -3, 12, 4, -10, -12, -7, -9, -13, 11, -1, 3, 4, 9, -1, 4, -8, 8, -7, 11, -11, 9, 26, 4, 2, 10, 4, 9, 9, 1, 10, 14, 4, -8, 4, -1, -2, 8, -3, -2, -8, 4, 1, 5, -10, -21, -4, -14, 3, 2, -7, 11, -2, -21, -14, -14, 3, -12, -17, -4, -13, -16, -4, -6, 4, -17, -7, -17, -22, -6, -4, 1, 3, -10, -14, 18, -5, 8, -8, -2, -33, -22, -3, -9, -9, -2, -14, 12, 8, -6, 3, -3, 2, -9, 3, 9, 0, -12, 9, 9, -17, 10, -20, -4, -22, -3]
5901c%j2JJ2Pj6jrJ8%Qj9JPkOLNlMJ1j2jPJlk2J7pOj0J0%j7K8k3KMJRk1NJ5k3
5945a6L4k1QNRrQj0j3J0kKJ3poJj0J0lj3J1Pj3j2J8Mrj1K2jk3jJ5KjqJ2J3l2J7
5985@KrLqMnJ8mkPk0J8KnJj1nJ6J0L%k7K8j5J0Nj7J%Oj8J4k8J2K3j2j2LJ9j7p
6026a7J5nQl0J5J8pj6K7j9J3m%J1l0J7qJ4Jj0J0l%jJ0Oj9L0Oj8Jj5J2qJ0lPj0
6064HPnj4J3kJ2j6kqPmkJ3nNmj9K2Rj7K1plj9J8j4j0J3J7l3K9j4MrJ4olK%Oj5
6105a1J1J0j9K1j5J1j8J0Nj1RK3j9k5J4KjQrLNRkk4J4mJ8j3onj4J9jKJ1j5kJ9
6143A0j2Mj3P%qJ4j1mJnK3k7RJ4klJ2kj1rkJ3mMNNl%J3k6j1K2Nj6K8j3NqjkKj1
6186hRMj1J0j0POj6PQmnk1J7QJ3j2k1K5jqk1K5kJ0kj1MJ8ok6JPRjj5J1J7j2Mk1
$$ y = [-3, -3, -15, -14, -2, 5, -11, -12, -21, -3, -3, 5, -14, -13, -6, -8, -2, 1, 6, 3, 7, 18, 6, 5, 12, 13, 10, -12, 5, -2, 4, -6, 4, 4, -13, 15, -8, -6, -2, -1, 8, -13, -8, 7, -16, 18, -3, 5, 10, 19, 10, 18, 8, -5, 5, 3, 5, 18, 11, 5, 6, -4, 6, 3, -10, 1, 8, -5, -17, 1, 5, -4, -15, 7, 6, -17, -18, -3, -1, -2, -10, 2, 15, -17, 0, 2, -7, -4, -12, -8, -13, 5, 1, -1, 6, -14, 4, 6, 1, 2, -9, -14, 2, 12, 15, 15, -12, 16, 1, 11, 16, -1, 0, 0, 6, -12, 2, -26, -14, 9, -3, -15, -12, 7, -10, -17, -2, -7, 1, -29, -14, 4, -3, -19, 8, -11, 2, -2, -2, 9, -21, -4, -12, 2, 3, -7, 3, 0, 0, -1, 9, 15, -4, 26, 32, 14, 15, 0, 12, 4, 14, 11, 18, 8, 15, 10, -4, 9, 7, 19, 3, 1, -7, 0, -4, -6, 7, 2, 7, 3, -16, 6, 15, -2, 19, 12, 9, -10, 8, -6, -16, -3, 14, -19, 10, -4, 0, -9, 5, -1, -4, -2, -2, 4, -11, 0, 10, -9, 12, -3, 8, -10, 0, 5, -6, 3, 26, 7, -18, -4, -2, -3, 5, -4, -1, 4, 13, 11, -13, 1, -3, 15, 2, -4, -9, -23, -4, -5, -3, 8, -7, -9, 10, -2, 2, -11, -4, -4, -12, 2, -9, -13, -12, -17, 6, -21, -12, 2, 0, -3, 9, 7, -4, -13, -15, -2, -6, -2, 3, 8, 5, 5, 18, -8, -19, 3, 8, -8, 20, 7, 12, 4, 3, 1, 3, -8, 1, 5, -6, 4, -6, 1, 7, -9, -2, 6, 2, -3, -24, -7, 1, 14, 2, -19, 6, 5, -3, -24, 1, -1, 9, 7, -4, 0, 18, 12, -14, -13, -6, 3, 2, -13, -2, 15, 3, 7, -14]
6227a4J9j4J0oRkJ3n%j0Qrk%lJ4Nqj1J0jRj0%%kmJ9k9KnJ0nK9k5OLJ3k2qJ5kp
6270a0MMj3J3k2J0LLOlj1PqK0JooLLJ4Lj9J3Qj7JLnk1K5KMj9RJ7j9mJ8j1nLJ2
6312A0%j0Qj3J2JPj2j5J7k2J0J2qOj3K8j4j7PJ4j3Pj8J7k5K1k0K3J5j3mjOjQp
6349CJJ3Lmj7J0%Nk2KJ9knJ3kk4J6j1KJJ0j8rK2kj6LJ3j6J3j9KJ7j1J4pKj2J0
6388crJ5noJ3%k4J1kqjLJ4JmkKoRpjQrKL%KK1Pk6NnML%MLOj9Qj1jPJ4j7lKQJk0
6438a3J3j6J8j2J4nNj9NK0rjJ5j8jKj6OROKj6J7nMllj3K4j4J2rPj3J1j0KJ4qJ3
6478A5j5j1J3j1lJRJ3j8JqPMk5PJ4OpK7l2LJ8j0J3j2k7LJ3RrMK0k5J1qlJ4j9K2
6517DrjJ5j2KLK0j9J7j2j3J4omlMj1J8j2QJplNNJ0j1kMQrl5L1MKj3K3j1Mlj5J3
$$ y = [-14, 5, -9, 1, -5, 4, 2, 15, 10, 10, 0, 8, -1, -3, -3, -6, 8, 13, 5, -6, 4, 3, 12, 2, 2, 2, 0, -4, 15, -14, -12, -17, -7, -12, 17, -8, -2, 1, 14, -8, -16, -1, -3, -10, -6, -2, -15, -2, -24, -14, -11, -8, -2, -5, -16, -9, -17, 3, 4, -2, -8, -5, -2, 12, 15, -4, 9, 17, 0, 1, 4, -1, -22, 3, 5, 9, -10, -1, 16, -3, -7, 11, 0, -5, -2, 10, 10, 0, 8, -5, 7, 8, 15, 3, -12, 5, -17, -7, 5, -3, 3, -10, 18, 4, -13, -6, 8, -5, 2, -16, 1, -24, -3, -23, 0, 15, 2, -2, -3, 3, 2, 10, 3, 4, 17, 20, 16, -1, 9, 9, 14, -8, -6, 13, 11, 6, 19, 17, -7, 9, -2, 0, 1, 11, -7, -16, 6, 4, -12, -9, 4, -12, 1, -18, -16, 1, -10, 4, -3, -1, -13, -3, -12, 3, -2, -8, 5, 5, -19, -8, -10, -18, -19, -16, -2, -1, -5, -7, -5, -11, -2, -9, -10, -2, -11, -9, -6, -6, -4, 17, 24, -2, 3, -2, 2, 5, 5, 9, 12, 18, -1, 7, -4, -5, 2, 16, -1, -4, -2, 6, 7, -13, 0, -16, 2, -10, 4, -1, 4, -15, -10, 10, 1, 0, 15, -3, -4, -2, -18, -12, -3, 3, 5, -11, 6, 1, 5, 2, -1, -14, 10, -4, 8, -1, 6, -7, 4, -6, -4, 10, 2, 15, 0, -11, 2, -9, -12, -11, -2, 11, -7, -6, -14, -7, -3, -28, -21, -7, -1, -8, 19, -13, -10, 8, -2, 11, -1, -28, -25, -12, -3, -12, -8, 12, -13, -2, -10, -13, 1, -18, 4, -5, -6, 9, -3, -1, 2, 22, 3, 20, 8, -5, 9, 3, -1, -4, 0, -11, 7, -5, 3, 4, -3, -6, -1, 4, 14, 3, 1, 5, 13, 4, -31, 0, 4, 6, -7, 16, 5, 9, 6, -9, 4]
6559Dk7K7j1k4K5pQl%mjnNmL2k4J0lJNqJ5plJ4j3Okj4Q%%J7k9J1Qj2J7j3n%L%
6602cJ2j4%NMrJ1pQnmnjkJ1%qRokJ6j1KRl0J1Pj6NL0k1Ok0J5oOrPkP%NN%j8J8
6648A0j6K2j0J0l6K8j4K3l5P5l9n4M3N2q0k9K1k5L9K8kK0q8J5R3m7j8J2J1NkJ5
6680B7L0p1Qp2P1PMkj1J4%LkqmJJ1%Kj5%%K4ooQoKj2PJ2k1%J8pnj6J3J0QJrNj7
6724dlKNJ5k3qJ0nOqJ5%j8K1j0rJkKJ1j0%NK5rj8mJOj3K6j6j6K7j2NJqlK5j1j1
6766a2Qj6J8K%Ollj1J2Kj7K8pJ0j1j4mlJ6J0k1J0lJoRk0K7oqPj5K0KrJ3jj2PM
6807A0olpqJ2mJ6Kj7J5lJ5j5kppK2j8RJ1Nk2J1Knj1M%kNkK2npkj6J6or%LnmJ5
6851BrmkQKrJ4moLJ6k1pK0j7jRkjj7K1J2k0%oQJ8kJjkknJ5j9rK1mkRqjj4J2%n
$$ y = [4, -23, 4, -7, -31, -6, -13, -5, -8, -8, -12, -13, -18, -13, -17, 15, -9, 1, -2, -1, 4, -4, 11, 4, 1, 15, 2, 8, 6, -8, 0, 0, 0, 17, -12, -1, 7, -5, 12, -1, -6, -6, -3, -3, 9, -5, -5, 0, 4, -5, 6, -1, 7, 2, -2, -7, -8, -10, 1, 1, -7, 2, -4, -6, 10, -1, 1, 10, -20, -9, -2, -18, -13, 17, -4, 2, -18, -3, -9, -3, -12, -5, -7, 0, 0, 5, 10, 10, -8, 10, -6, 16, 6, 16, -20, 8, -6, 17, -18, 57, 18, -36, 7, 59, -21, -50, -29, -54, -15, 13, 11, 31, -57, -42, 51, 4, -14, -2, 9, 14, 12, 27, 57, -14, -6, -78, -7, 0, 4, 2, -9, 5, 5, 8, 6, -2, -6, -5, 6, 6, 8, -7, -7, -7, 17, 11, 5, 13, 7, 9, -3, 4, 16, -5, -5, 13, 6, 1, -15, -2, 8, 16, 17, 8, 13, -4, -7, -5, 0, 15, -8, -16, -6, -11, -5, -13, 2, 2, -16, 5, -5, -14, -13, -15, -13, -2, -12, -12, -7, 18, 9, -9, -13, -12, -6, -19, 7, -9, -25, 2, -10, -5, -4, -12, -15, 10, -1, -12, -4, -20, -2, 0, 0, 6, 3, 0, -11, 1, 3, -14, 14, 7, 17, 6, -8, -12, -15, 1, 11, -10, 0, -3, -2, -8, 1, -19, 8, 2, -6, 1, -14, 6, 8, -1, 12, 11, -1, 6, 10, 4, 1, -6, -14, -2, -6, 10, 12, -5, 10, 7, 22, 7, 5, -2, -9, 13, -5, 4, 15, 20, -2, 9, 11, 6, -5, -1, -1, -3, 2, 0, 22, 17, 10, 8, -8, 8, 2, -7, -7, -4, -9, -13, 2, -7, -11, -13, -5, -3, -12, 2, -2, -8, -5, 11, -10, -17, 3, -14, -15, -6, -8, -9, -26, -5, 7, -13, -13, -19, -11, 7, 5, 6, 5, 3, 1, -4, 11, -8, -17, 4, 0, -2, 7, -1, -2, -16, -4, -4, -9]
6897iQLOqJ0qnMqMRj8J0j0J9rpLmKOLLj3LJ2qjK%oj0K1oJ2l1J8jj3J6jJ0lj6L
6942hK0pJ3j7lJ1j6lM%K9l1J1Rj4J3lj0JLJmj4K7Kj8J3j4oK0l1K8k9J2J1Jj9K
6980a6%MMqJ4N%j4J5k0J7Qj1lMJ1l0K0j3J0JMkkOOOk2KkPllmRkK1k6JJ8j8K%K
7024bMj4pJ1J0Jj2MNk2J6NmLJ1l4J9nPQj2QlJ2j9J4j1PMoj0K0j0J0Jj3J1Nj5O
7064C%JQJj4RKj8J8j2%J4j1J0JqmRlkjJ0pj1J5j1NrK2k3PlJ1j0mPqlRQNj1OjO
7109A3k4J6qj1jJ0LqJ6lJ2j2kjJj4J6qllJ6Jk5J8j%JpQKj1K2k2OnjKL0j2lj1k
7151eMrJ0J0k0K4j4Kj1K%J3Kj6LJj6L1k1lmJ7Lj4J5jmj0J1%J7k1K0lmj1J2J0k9
7190iJ8nK%N%j9RJ0j7J0j3J0lJ2lj5PnJ4k4J3JJnMmOk9J8J0oKRppJ1Nrkj0J3O
$$ y = [-9, -1, 2, 8, 0, 10, 2, -3, 1, -7, -3, 6, -12, -2, -12, 7, -2, -9, -6, -10, -8, -2, 1, 4, -9, -6, 6, -2, -3, -1, -1, -7, -17, 4, -2, 10, -21, -3, -4, -17, -1, -2, 8, 5, -11, -8, 12, 5, 18, 1, -2, 9, -7, -10, -6, -6, 23, -8, 3, 12, -2, 11, 8, -2, -1, 2, 3, -1, -15, 12, 14, -4, 9, -5, -11, 9, -22, 6, -23, -11, 0, 1, -18, -16, -16, -12, -8, -16, -2, 3, 3, -11, 4, -16, 1, 9, -2, -5, -1, 10, -20, 0, -13, -3, -2, 2, 0, -2, 4, 10, 16, -6, -4, -6, 1, -2, -5, -9, 0, -2, 19, -7, -6, 12, -6, -4, -4, -2, 2, -12, -19, -8, 2, 3, -9, -5, 0, -22, -6, -1, -5, -2, 9, -25, -6, -11, -4, 4, -8, 0, -3, 9, -10, 4, -7, 0, 4, -2, -12, 8, -2, 8, 9, -4, 7, 12, -3, 3, 3, 4, 12, 13, -1, 8, 10, -8, 10, -2, -2, 12, 1, 11, 12, 4, 0, 9, 6, 4, 3, 13, 6, -5, 10, -1, 4, -5, 17, -6, 1, -2, 9, -1, -5, 2, -6, -9, 0, 8, 13, 2, 8, 7, 13, -11, 5, -3, -14, -15, -5, -2, -10, 6, 3, 15, 3, 1, 0, 1, -13, 3, -5, -8, -11, 5, 6, -19, -1, -2, -2, -1, -8, 0, 2, -9, 13, -9, -3, -8, -9, -7, 23, 11, 8, -3, -5, -1, -10, 0, 10, -10, 14, 0, 2, -9, -7, -7, 6, 8, -8, -5, -4, -20, 11, -10, -13, -17, 0, 3, -11, 4, 3, -1, -11, 0, 0, 17, -4, 16, 13, 9, -2, 10, 20, -9, 9, 4, 6, 6, 11, 11, -8, 1, 11, -6, 4, -9, 1, -2, 10, 7, -8, -1, -6, 8, -16, -3, -2, -1, -6, -2, -6, 0, -29, -11, -1, -7, -5, 4, -3, -10, 1, 6, -3, -5, -15, -2, 4]
7233Dj2J2r%JJ0p%KrJ3lO%j3J5j2Mj0J0jOrNLj9RJ4Kj7J3mJ4k1MpJ4prJ6k2QQ
7276BPl5K1nJ7j3MLj1jMJ3Nj7MlMQJmrJ8j3Lj7RJ6j4J0%rOjkLMnJklnJ5Oj0QM
7322A7qj1jJ1j5J1kLj3Rnk0K1qj1K3lKpMJ8j6p%J8j8J1qmKQrJJ1j2jK%J7j6LJ6
7364A3k5RJ2Lj6JPp%JrPLJ2Nqj2LLp%lj2J0JJ1j2Oj3J0qMpKLmMMLLoJ3Kj2QkP
7411GjNj%lj3J3jJJ5j1J8m2K3k3K4j5K3j2nM%Oj2oqK1MLk0NmJ2MKkp%lj3K5l1
7453a8K1Rj3j1K3kk3RPmjpJ4j0rRoJ2jNj6J1NkMj9J5Ojk1J4%LrJ1l%MoKO%pJj5
7498a3J0LQoNk4J3J3j8PJ7k1LnmOOjPj2Olj3J5J2j4LJ2j9j%Jj3J4J6Mj6j5K4J
7538HqPJLMOk1J8j9nJ7j8J1LlpKoLNPqQ%k2J8Mk5LJ6Mn%nnJ0LPj5J1j1J8k7J1
$$ y = [4, -8, 4, -5, -5, -4, 6, -1, -1, 1, -8, 5, 2, 8, 8, -5, 10, -2, 2, -8, 2, 1, 7, -2, 3, 6, -13, -4, 10, 12, -5, 8, 4, 18, -3, 1, -6, 8, 1, -8, 8, -14, -6, 2, 9, -26, -5, -10, 7, -6, -2, 1, -10, -11, -7, 6, 11, -6, -2, -5, -1, 7, 8, 4, -5, 13, 0, 3, -14, -5, 11, -3, 7, 7, -2, 4, 3, 1, 4, 8, 3, 4, 2, -1, -6, 9, 15, 5, 13, 17, 9, -2, -3, 8, -7, 4, 2, 5, -8, 1, -4, -24, -3, -11, -22, 1, -2, 0, -7, -3, 15, -1, -8, -8, 10, -8, 3, -5, -9, -7, 1, -8, -7, 4, -8, -9, -7, -7, 10, -6, -3, 13, -12, -3, 9, 12, -4, -3, 4, -3, -3, -2, -11, -4, -1, 11, 16, 8, -4, -1, 2, -5, -5, -8, -20, -10, -9, 2, -10, -4, -17, -7, -15, -11, -18, -16, -13, -17, -13, -9, -6, -3, -9, 4, 6, -6, 2, 0, 7, 6, 11, 10, 10, 7, -6, 7, 6, 7, 22, 11, 29, -13, 10, -13, 11, -4, 19, 7, 2, 6, 6, 12, 0, -6, -14, 7, 11, 14, -6, -1, -5, 7, 11, 13, 11, 4, 4, 1, -12, 13, -18, 3, 12, -1, -12, 11, 9, -14, -5, 2, -2, -3, -10, 4, -6, -15, -6, -12, 0, -1, 4, -12, -1, 4, 2, 6, -13, 2, 8, 7, -14, 0, 0, 3, -6, 5, 2, 2, 6, 0, 2, 8, 8, 1, 2, -13, -3, 0, 8, 2, 7, -17, -4, 9, -9, -2, 15, -6, -3, -8, -12, -6, 0, -1, 6, -6, 0, -3, -16, -1, 11, -3, 0, 12, -7, -8, -8, -7, -20, -6, 10, 14, -2, -17, 7, 8, 0, 7, 8, 11, 15, 21, 0, 18, -1, -6, 11, -7, 4, 7, 4, -3, -1, -7, -4, 1, 8, 0, 8, 8, -14, 4, 8, -17, -14, 2, 6, 1, 1, -4, -9, 1, 4, 11, -4, 7, -4, 14, -13, -2]
7582bJ1j7Oj3K5o%Mj9K5nj6K4rKnkoJ1j1MON%j4J1j0NJ8l0K8k5Pj4J3J1J2j2L
7621A5j8J0ppJ0j5J5pMrQJ0j9J5rKPqJmj2LJ6l1K8RpjKj0JPqK6j2pJ6k0NmK2k0
7663cNK0mj4j4K5ql%j2ROJ6l0J0k1J5J3j3mJ3j5MJ1j4PJpJ%mNJmJqJ6J1j7JJ5
7704A1mkjoMMmoRj1K3k6J7K%mj6K7k2J4oj1J7j4K5j8JMj2qJ3PrQjqNoK3j6k6J2
7746a1J7Joj7J1J6j3oP%J3pqJ5Kk3JJ7rj0K2j2Mj4KRk0J3rL0kmqJ0kqKoJ5qoJ
7788amRJ2j9%J5%k9Q%J0PMk8K0llrNk%J8j2j2RoJONJ9k1%pJ4j%nkkJ0j0oJ1j8
7832a7J3J3Lo%lkoJ0K5j6J6k3j2PKJj0NmJPOj1LK0k5kK2k8J4J2k1MJ2j0ooJ0J
7872aJPorOoJ3mkpJ3rNj0OJlj0K5j4LRoOk%MmkkNJnpPjRj0%PPj0%j3J4JlQk9J5
$$ y = [-2, 9, -8, -2, -15, 10, 4, 4, 8, -11, 14, 9, -7, 17, 8, 10, 5, 3, -3, 8, -3, 1, 7, 12, 12, -2, 9, -1, 4, 22, -8, 20, -5, 2, -12, 1, 12, 24, 12, 15, -3, 7, 0, -7, 3, -12, 3, -4, 0, -9, -1, 9, -10, 5, -4, -2, 5, -3, -2, -6, -18, -15, 1, -30, -2, 7, 0, -1, 1, -9, -8, -1, -9, 17, 5, -2, 14, -6, -1, -5, 17, -3, 2, 22, 18, 4, -10, 15, 7, 4, 4, -8, 1, 7, 23, -7, 3, -18, -3, 10, -3, -7, 6, -9, -5, 6, -8, -1, 0, -7, -6, -6, -10, -5, -4, -8, -7, -15, 1, 12, -5, -4, 11, 7, 5, 4, -2, 2, 6, 2, -4, 5, -6, 17, -9, 8, 10, 10, 6, -10, 17, -5, 9, 3, -8, 9, -5, 20, 2, 3, 7, -5, -13, 0, 7, -2, 6, 5, -3, 2, -4, 19, 3, -23, -11, 6, 7, 1, -16, -5, 11, -2, -8, -1, -1, 12, 5, -3, 12, 14, -9, -8, 9, 0, -10, 12, 0, 4, -10, -8, 1, -19, -6, -15, 15, 13, 9, 1, 11, 9, 1, 3, -3, 12, 4, -2, -1, -5, 4, 16, -3, -3, 12, 12, -17, -9, -9, 1, 8, 12, -16, 4, 1, -2, -11, -6, -8, -8, 10, -2, -14, -5, -11, -10, -4, 1, 20, -1, -1, -8, 6, 5, 5, 0, -2, -4, 6, -4, -10, 1, -17, -4, 9, 12, 6, 6, 3, 1, -5, 5, 30, 14, 30, 7, -5, 2, 4, 5, -5, 0, -4, -3, 4, 10, -1, 2, 22, -3, -5, 17, -11, 3, 15, -6, -2, 10, 0, -6, -12, -2, -1, 0, 7, 1, -8, -2, -8, 5, 1, -1, -8, 5, -4, 1, -9, -3, -2, -5, -15, 10, -4, -1, 8, 2, 8, 6, 6, 10, 6, 4, 2, 7, 8, 3, -4, 3, 2, 11, 1, 1, 8, 15, 5, 5, -8, 6, 7, 4, 12, -17, -2]
7922bJq%lK1J5k9K1j8moK0k4J9Qj7lJ3j6%J5%rJ4Ooj9J5Ok2K2k6RL1k2mPj9J8
7961DJ1j5JorPJ0j6J2rJ7qKjJ4nKj6j6K3jLmJ4mj0pK0k0n%j3J9mJ5J6k2MPk5J5
8002@Lo%J3rrJ3jnkrJ7Mj9QKOKj0PJ7j3k1LJ4Nk1K2k0kNj1J2qK4k6K1j7J1nj1
8043a6J4JQjLk5K0j1pJ8j2mMLRj5JLkjNJ3lmkmK4j8LJlqJ2jOOj4O%%nK2k3Kj1
8088fJ3pJJLJ2j4kJ0j7POqKMpj5J3m%M%Qlkj5ORQj7J8%K1l7J6mj6K2lJqqJ8mj3
8133gJOLMqKJ2lJ1j8j4J9mj1RqnJ8momQj1RQj3LmLrJ7j1Qj1Pj0oJ5Omj4jQOj0
8178a3K8k1lJ8j4J6J1j7rMoJ1n
$$ y = [-2, -1, -9, -9, -12, 9, 24, -5, 16, -2, -6, -12, 8, -16, 3, 11, -6, -9, 4, -12, -12, 3, 3, -6, 8, 14, 8, -11, 4, 10, -12, 10, -16, -7, 24, 2, -2, 5, -14, 4, 15, 0, 1, -5, -14, -7, 3, -13, -1, -10, 7, -1, 1, 0, 14, 9, 11, -5, -21, 2, 1, 4, 0, 14, 10, 0, -7, 13, -7, -12, -12, -25, -6, -10, 5, 21, -1, 3, 10, -15, 0, 3, -3, -3, 10, 1, -8, 5, 4, -1, -3, -12, 5, 9, -10, -2, 0, 6, 8, -2, 5, 22, 9, -12, -9, 5, 10, -11, 11, -9, -11, -6, -17, -5, -13, 11, -15, 6, -11, 0, -5, -16, -2, -1, 7, 6, 9, -16, 4, -7, -14, 4, -8, -12, -8, -5, 4, -11, -10, -7, -9, -10, -5, 8, 5, 1, -1, -5, 19, 1, 4, 5, 2, -6, 6, 5, 11, 17, 3, 9, 9, 9, 4, 26, 3, 5, -6, 7, 0, 1, 2, 5, 17, 3, 1, 11, -6, 1, 7, -1, 1, 5, -2, -17, -4, -8, -8, -4, -4, 4, 1, -1, -16, -10, -1, 7, -10, 8, 8, 29, -8, 8, 4, -12, 10, 7, 8, 0, -8, 10, 6, -7, -6, 0, 3, 7, -1, 1, 13, 10, 21, 3, -11, 8, 4, -7, 2, -6, -11, 7, 3, -3, -7, 1, -10, -1, 7, -6, -3, -7, -4, -13, 4, -7, 1, -10, -3, -13, -19, -4, 2, -2, -16, -17, -9, -3, -13, 15, -6, -9, 9, -5, 11, 22, 5, -4, 0, -6, 5, 0]
8191@
$$ Imaginary data points
##PAGE= N=2
##DATA TABLE= (X++(I..I)), XYDATA
0@%%%%%%%%%%%%%Lj1J6j6J6j6J6k4L2l2M0m8N2o0O8p6Q8j00J12j26J41j59J76
36I2j96K20k44K68k96L28l63M03m48M98n51O12o82P62q57R69j104J271j480J754
56I56k139K712l667N653j6632L1641J8540o2234j9501L6232K5589k0323o793J3282
70C316l121j8663J3791K8830o134l3411j440L0177J3841j7412j3458M949R181
83A0446K870J225j388l813j890K039K742M920L181p455j1542N685J8327P87j9840
98F294o823J5896Q699j0260n009O844k393r669P247J5147p952k0635L399K0210
112B0995l60j7048m78J1521m352j0654Q540J1954j2194j6833R669J8077o304j6883
126d350J761R851l544m813Q127K141j5888p436J7731J3769j4725j9557N097J7386
$$ y = [0, 0, 0, 0, 0, 0, 0, 0, 0, 0, 0, 0, 0, 0, 3, -8, 8, -8, 8, -8, 8, -16, 16, -16, 24, -24, 28, -32, 36, -40, 48, -52, 60, -66, 75, -84, 92, -104, 116, -128, 140, -156, 172, -191, 212, -236, 262, -289, 323, -359, 403, -454, 515, -589, 682, -798, 956, -1183, 1529, -2138, 3515, -13117, 18524, 37064, -25170, -44671, -8439, 17150, -3173, -9966, 3316, 195, -18468, -4677, 24153, 18019, -15392, -16832, 13345, 27186, 9774, -3684, 1265, 10446, 13316, 14541, 13153, 9340, 7450, 9489, 12231, 17151, 20332, 12877, 1335, 7020, 25347, 26134, 6294, -529, 15367, 24066, 13806, 8797, 15641, 13248, 3579, 10826, 25973, 18021, -2614, 785, 20995, 20635, 3587, 3109, 14630, 10278, -376, 8164, 20118, 7924, -8909, 760, 18837, 12533, -4350, -2589, 7262, 3718, -1095, 7032, 9173, -6715, -14151, 3580, 17349, 2624, -16933, -11836, 5550]
140E550K853j0885p869M65M998O042Q58p889p662K879Q525K831m243o182l955
155a3684L046R848L562j1247j0465P710J3324l078j1929O85Q420j835n905N637
169e911O896q409j0201Q519J3902m598j3865P47J0909J389n560J139L128m571
183f486l228P924O885o732r000L705R435R49n367k148J275J251K445K692j774
198A826m546j70M537K629r85j467j531j307K314M993M85n634l290L809M649N0
214F362k244k127k068J200O024L053o487p410L307Q956J247o547l823J725K444
229C612J961J566k582n951l38P362L912n897o186K311M964k4k226k41p32k227
245g16J044M186L58m865k858K799L180m19j840j229j044K18K558J595k529l481
$$ y = [5550, 8403, -2482, -10351, -9886, -4888, 1154, 2012, -5877, -13539, -10660, -2135, 696, -3547, -9729, -13684, -10638, -790, 2772, -8475, -18940, -11230, 2094, -984, -12913, -12228, -3808, -5643, -11548, -5911, 985, -7424, -17625, -9106, 4796, 198, -13667, -12920, -2011, -622, -6182, -5043, -1915, -6486, -9714, -1790, 5095, -1637, -10637, -6932, 2503, 3452, -1915, -4063, -2788, -1537, 908, 3600, 1826, -2720, -2890, 1647, 4276, 3291, 1824, 293, -1014, 1300, 6293, 6778, 1144, -2146, 1663, 6312, 6362, 4118, 1991, -77, 1123, 7147, 10200, 3713, -3697, -390, 8566, 9813, 3266, -557, 1168, 3612, 5573, 7139, 4557, -1394, -1732, 5630, 9542, 3645, -2541, -230, 4734, 4710, 2484, 2243, 1511, -716, 328, 4514, 4872, 7, -2851, -52, 3128, 2709, 869, -360, -1404, -1186, 1372, 2967, 438, -3043]
261c043L82L216J531j380k428j506R01L025J433k809l403Q80L458P69k163j271
277b408L09J79N42J453j58k560j042K411K026j436j902M58R29k42L17J153p75
294g46k250K10K937J123k295j809R21J628M92k03p80j215J56K263J307j914k302
311b477Q17K496O38j357j112m5O54J142O79j005j568J67J776Q12r54r77MM03N79
330F72O57k08j298o54J179J357k80j211n95K41O90R01J88j319j465O76K105N25
348B161j671j412M40J250O43k09r64j100K16J650R46j181j758L0J394Q49l37p88
366A59p57j60Q53J131j36j405q76P22J222K86o81r32m19N63J241M17j176j342
384a290K43J407P85n92j126m97M52J073N71p08j177k22R73R08j77q00n54P6O42
$$ y = [-3043, -2661, 555, 2086, 706, -1722, -3228, -2327, 698, 2131, -678, -4081, -3201, 257, 1026, -1137, -2408, -2099, -1920, -1378, 75, -83, -2643, -3685, -1274, 752, -684, -2586, -2128, -1199, -1441, -1124, 29, -746, -2996, -2786, 151, 1274, -1021, -2830, -1909, -281, 211, 8, -772, -1987, -1831, 432, 1739, -175, -2477, -1660, 836, 1474, 117, -995, -1040, -386, 756, 1435, 430, -1138, -971, 805, 1617, 663, -314, -310, 93, 672, 1329, 1121, -177, -831, 348, 1705, 1425, 214, -381, -140, 550, 1451, 1639, 320, -1145, -469, 1636, 2161, 490, -922, -482, 768, 1411, 1202, 238, -862, -646, 1004, 1950, 769, -989, -959, 435, 1284, 947, 159, -598, -758, 95, 1226, 1090, -315, -1191, -469, 753, 1039, 358, -574, -993, -430, 811, 1228, 52, -1290, -1047, 360, 1145, 553, -573, -1070, -618, 455, 1026, 318, -859, -1081, -108, 800, 623, -177, -731, -655, -13]
403a3O99rr31p58M37J105L37o72p69j55M80P04K98n24q76j88Q64P93k02q52m68
424g00L52P20L57l44p45k60N34P21M3n82m91O5M85M64l8n08m62J94O17K21l45
445B98l70RJ78J95J61o5l23k43K75M31J8l64k23J04K18J71J6j67k78k2L27K74
467F20j52l13j14K04J95L1j53j81K9J75J13j24j73j6J29Q1n4q5o3M2Q4o7j45j6
491D7K09O4l01k13J84K59q7k31r7Q9K7qN1q7k02m7K01N0k00j23J05M1j52l0J61
516b90k2k57p1J86J30j14j54p7k7J20K21k3l29k11K47K87m6k07n5LQJ13J67p6
540d77k78m2K46K25m5j26j69j23K06M68J46m92m40K39O09K55k93m72j54L73O34
561B90J47o18n81L32Q17J91n16l65J12L24K46J17j49l97o0M68L65j87k65K5Nm0
$$ y = [-13, 686, 677, -254, -1012, -575, 530, 867, 195, -574, -729, -249, 455, 753, 229, -647, -835, 29, 822, 620, -232, -700, -348, 372, 729, 385, -360, -620, -86, 635, 678, 96, -395, -330, 155, 619, 581, 73, -389, -195, 422, 643, 298, -72, -63, 115, 310, 471, 406, 83, -160, 115, 546, 564, 200, -23, 81, 299, 470, 486, 319, 41, 19, 346, 620, 468, 155, 41, 245, 440, 471, 318, 137, 166, 341, 454, 330, 157, 141, 270, 351, 297, 212, 149, 191, 275, 208, 63, 47, 256, 320, 19, -194, -10, 249, 162, -69, -166, -77, -50, -58, -7, -94, -296, -343, -142, -92, -292, -415, -310, -269, -421, -451, -290, -312, -569, -640, -454, -324, -438, -592, -669, -696, -576, -355, -378, -707, -918, -671, -384, -430, -637, -692, -689, -681, -568, -401, -477, -755, -797, -551, -326, -371, -497, -666, -789, -583, -115, 31, -461, -901, -662, -53, 202, -91, -563, -717, -344, 290, 437, -181, -762, -430, 387, 578, 62, -303, -191, 133, 379, 496, 347, -50, -110, 358, 723, 536, 271, 296, 301, 261]
583B61K71M03j99o32j12O32M63l01m73j18J68L44L50j36p01l73O34P34k18p32
603B65k16L25K62M0j2k24l47l1M79K36k59l68j42O9K52L41r2p08m03N42P15j14
625F10p40m05J86N00L93j51q02n33O46R80k24j100k69P64M08l34l25N8n8j03K90
646b09K60l62l93K46L63k62k43L51K11n32l57N47N22l07n78mL86K41Jk03l75m5
668g42N42M05m12o00K01N83O7l82o8J55M8K9Q1q2j47K41K26k95k80L98M88l50
690A06n99K36O84k6n08r4K77J19J8J47k43m22K88P84j56r49j22J008M33q83o15
711e17N89O54k27m76o9J22J24K96Ln65l32N78O13l70p64K4N89K03k78k17j03O9
733e4K45J22k89k47K79K27l74k42M48L13n82n08N38O40l08o08J6K84L0J78J76
$$ y = [261, 532, 935, 736, 104, -8, 624, 1087, 786, 313, 195, 363, 707, 1057, 921, 220, -153, 481, 1215, 997, 265, 49, 374, 636, 676, 664, 440, 93, 62, 541, 777, 518, 150, 8, 77, 329, 670, 578, -130, -533, 9, 724, 610, -130, -535, -349, 151, 544, 393, -409, -942, -296, 684, 460, -640, -909, -145, 263, -71, -396, -338, -396, -499, -209, 51, -311, -704, -458, -95, -357, -600, -249, -38, -570, -927, -380, 142, -165, -743, -747, -361, -120, -119, -322, -697, -742, -200, 205, -207, -807, -606, -23, 44, -338, -406, -251, -203, -174, -93, -175, -322, -81, 145, -150, -430, -32, 456, 106, -493, -257, 427, 401, -107, -201, 76, 195, 213, 360, 117, -305, -17, 767, 611, -338, -460, 548, 981, 98, -517, 72, 726, 499, 23, -46, 76, 200, 496, 499, -66, -398, 180, 793, 423, -341, -317, 272, 475, 197, -20, -123, -54, 191, 313, 24, -223, 56, 283, -91, -333, 115, 428, -154, -662, -124, 516, 208, -400, -384, -100, -70, 108, 284]
754B84m63o62M52J045j11j179k93R68N09n86m14K59J34j92J43K65k65l01K94K47
774A34l09j42N26J02p76k94Q82O95o11q93N9P05M44o4n17o41J47J051N45r35j017
795i09L89J086J73o28l55Q2R4L32L61l14p06P8P78J46n86p5M28k07m87M08P78
816H66l08j012JQ95K90m65l13k0q4K53O53j05j068l70J057Q06o89r48J97O71P4
837C81k24o0j81k17L11M29k62n33J83M52k11m23L21M40m23n77L04O21o1m37j74
858c41O2R2L78J82n87o64N28J007j96j057k22P85M50m03l33J6RJ61L95q3o31k20
880f72Q22L37p04m73N01M54l80l11L42K06l15p6L07M4l25J4L01j17k76L04L64
901C47m62m43L20O72j34p65n9O45K28k05j69k88p5M69N45l13q94r6R08M70n13
$$ y = [284, -179, -841, -389, 656, 545, -634, -927, 41, 550, -36, -450, -191, -57, -249, -106, 159, -106, -407, -113, 134, -175, -317, 209, 311, -465, -759, 123, 818, 207, -686, -627, 78, 522, 458, -59, -700, -553, 498, 1043, 108, -909, -520, 566, 739, 111, -244, -162, -68, 264, 625, 311, -395, -317, 461, 607, 21, -54, 374, 167, -320, 88, 866, 558, -454, -453, 442, 732, 267, -46, -66, -150, 103, 756, 651, -417, -787, 270, 1076, 387, -561, -364, 307, 381, 157, 97, -84, -301, 10, 439, 177, -356, -173, 279, 68, -355, -34, 406, -17, -594, -290, 331, 270, -167, -341, -279, -187, 191, 373, -214, -878, -350, 657, 461, -596, -818, -33, 417, 14, -319, -303, -294, -133, 262, 179, -452, -672, 150, 487, -217, -690, -189, 265, -115, -426, -84, 122, -193, -269, 38, 82, -243, -229, 72, -45, -321, -17, 347, -115, -558, -238, 434, 300, -465, -524, 121, 349, 144, -25, -313, -388, 81, 626, 313, -581, -677, 231, 701, 188]
922A88o06N1L77K66J26k41m62r4N86M00l50m75J31K64o0O8K56j28n47o0O81M02
944G73m26n53K5L27L02J82k28o20k18P52P52m09r96j13P55N08j86m58k55J2L65
965B91M31j11n74k67M24L80q6k42n1j22o9K54L94j15n96k63L86M77N3l35m73j45
987c59M55O49q7q90n23N88Q48J1p39n69J71O13L99k60p41l08N27O83j40o90k87
1008f49L15L60Lj50j87j80K9L01K03k72l07k0J95J44O7q7l08k07K63M81m7n66
1030f19k70L60M50k3l71k72R9L21K52j37m42j48L94L68j45l75n2K78J57n1j00
1051c26o0OJ01J17Rp3k3K9MR0J64J7k39j69K56L67K5l64k53J92M24K29k39n13
1075b29p9N53N37j78p14k29N45O17o5n89l75K38N70K69l07n51r5M76M39j43m55
$$ y = [188, -418, -367, 10, 276, 402, 161, -301, -395, 191, 591, 241, -234, -103, 161, 101, 169, 425, 297, -250, -310, 371, 773, 347, -206, -181, 146, 448, 630, 402, -218, -436, 316, 1068, 659, -337, -450, 305, 813, 627, 169, -86, -74, 291, 722, 611, 37, -230, 194, 574, 488, 246, 195, 73, 4, 258, 652, 537, -59, -322, 64, 541, 594, 259, -214, -359, 96, 745, 658, -232, -755, -167, 681, 692, -47, -616, -445, 168, 567, 307, -434, -742, -215, 468, 328, -362, -649, -334, 26, 29, -121, -308, -488, -459, -158, 45, -227, -534, -554, -359, -215, -148, -235, -543, -750, -487, -6, -53, -619, -889, -529, -79, -102, -473, -745, -646, -325, -73, -210, -652, -800, -406, -38, -183, -558, -610, -332, -175, -226, -326, -386, -380, -279, -162, -153, -226, -249, -220, -216, -126, 38, 55, -184, -353, -97, 270, 295, -69, -322, -130, 294, 523, 284, -229, -308, 245, 782, 604, -110, -339, 206, 823, 758, 169, -206, 32, 602, 871, 564, 13, -82, 394, 833, 690, 235]
1096B35j90J94L02J16r0k64k24J03L34J79j88l54j84K07L78J48l34m87q2M61M79
1117G39j86o05l30L39N31J15m65m88j9M60L83j64n28k71K75L96N1k71l01q6J84
1138b41K39R8k19l14j16K21L15Q4k90m06n2M09M14j54n74k87L47N57Q9m65m76
1159h21M7N21M28k23o34k04M94N13j27n00k01K83L21L0j54j69k3J31J75N1j31
1180a93r9K9Q5R1P1j1j29j19J05K93J25k24k92O3L82K18j98l74k5L77L16j53l96
1203e8r5K95K90Jk54k09P6K97J74k11l30K8L50J48k08k28N6J46kj3M5m1j80l0
1227D7K09J64j59k55o3J76J94lj70k79n3L34L13j82n24j84M07M81j60n69k90L58
1249b08N10j6m74l09J70L49J29k39k69m9K09J86pk33j56J10J57k4j26R6M9j56
$$ y = [235, 45, 239, 541, 657, 567, 303, 79, 182, 516, 695, 507, 153, -31, 176, 554, 702, 368, -119, -201, 260, 739, 553, -52, -382, -43, 488, 603, 138, -350, -369, 91, 474, 310, -218, -489, -214, 182, 233, -38, -339, -425, -241, -2, 96, -123, -437, -553, -332, -17, 67, -223, -629, -681, -272, 142, -12, -586, -873, -526, 31, 120, -345, -821, -774, -253, 175, -48, -682, -886, -392, 121, -6, -506, -707, -424, -103, -73, -227, -396, -419, -288, -113, -62, -193, -292, -263, -178, -87, -16, -27, -156, -275, -170, 123, 248, 24, -268, -205, 177, 395, 197, -177, -202, 175, 491, 338, -58, -153, 142, 432, 433, 179, -30, 46, 343, 517, 306, -24, 4, 354, 502, 294, 66, 122, 268, 266, 253, 298, 257, 77, 47, 256, 420, 261, 6, -57, 119, 313, 310, 140, -139, -192, 142, 455, 273, -251, -435, -28, 453, 293, -276, -566, -208, 302, 286, -188, -497, -327, 22, 151, -88, -357, -406, -197, -11, -18, -251, -407, -297, -140, -164, -290, -194, -145, -301]
1271c01j97J70L81l5m45k16L11M06k3l49k52M7L58K82j12m72k48L91N52n7n37
1292c46k80L18M51N3k95k65O9K08J87J0j45j74kJ84K23J3k47j79R1K79J29j09
1314A73k20p9R9K90J47j92l87k3M53L30k92m55mM44K20k26k85qJ81J83j5k08j63
1337c7J19K80J3l16j24K26K06j55k53J1K40J05j81j61mJ53J28j00k25m1K04J23
1359B11j20k04J2J55O5q6j54m1J34J29q8k31j0K18J04j94j94J17J99k5j47o0J1
1382a99M2Q8L2j18j64O1K29Pk14n0J66L3r4RR9m6j45J0K22N3j14j60L2Q9J87K1
1408G6k11k12J10L77Q8l09k67J38L33J16j75k26n8K13K84j4l41j80K82L06p0k80
1430b0l8J54J00%k6n9l2Q1Q3o8j04Q5J39p7j80P6K18j5k36l2J65R9p6o0j1m1N7
$$ y = [-301, -498, -328, 53, 18, -427, -643, -332, 74, 51, -298, -550, -503, -145, 137, 25, -447, -695, -304, 248, 191, -346, -626, -308, 143, 196, -99, -364, -295, -87, 100, 110, -35, -209, -211, -27, 196, 209, -38, -217, -126, 153, 282, 173, -47, -126, -27, 263, 410, 218, -169, -192, 261, 591, 299, -156, -160, 284, 504, 278, -7, -15, 166, 349, 334, 126, -37, 82, 362, 375, 59, -65, 161, 367, 212, -41, -30, 210, 315, 134, -27, -31, 122, 250, 150, -75, -116, 88, 211, 91, -113, -101, 54, 119, 33, -121, -162, -28, 101, 13, -218, -228, -10, 94, -100, -294, -177, 22, -3, -150, -210, -199, -157, -69, -37, -155, -319, -258, -29, -22, -236, -286, -120, -87, -181, -172, -73, -119, -264, -254, -32, 21, -93, -253, -221, -132, 55, 76, -135, -347, -237, 140, 228, -81, -348, -210, 123, 239, 64, -162, -220, -7, 277, 263, -78, -258, 24, 330, 260, -20, -58, 96, 196, 196, 170, 111, 79, 160, 243, 175, 71, 156, 295, 218, 38, 114, 332, 317, 81, 49, 214, 313, 237, 177, 166, 125, 182]
1457A82J44k7k36o1K56J20j82k00J11J59n1j12j2M4nM6j2j12m3J31J09j67j57
1480g5Q9J91o6j75j0Q1K5rJ2r3j03Q4J53q7j88K8J87l3j80LJ90l4j92oJ51J0p4
1507a21j3k2q3M9K09l7k89j23K90K54j76k94J1K10P9l4q0r0p0J73K06r8k65MK02
1532a08Q6r6k3om1JJ49O1j12j12N1Q9K6P8J8j79j71J97L26n1l76q5K95K14o3j49
1558A9j19m6J86K71J1l92j95L30L32j35l11k9J97Q8j5or3j12Q5J91k6j69j9J12
1582A55Qq1O2P3j14j48R4K03m2j38j02M5Q5J04J1j59k06J34K86j9l19j03K02J77
1606B08p2j40p2NP0J30j3k41q7K24J52j52k00Q4J47o0j04O3N8q8p2O1P8n4m7M
1632a18k5lR8Q6j90j80J27K83K4l18j61J40K65N7j73k57j9K82K80j54m04n7L44
$$ y = [182, 326, 299, 63, 2, 258, 378, 196, -4, 107, 266, 215, 103, 91, 135, 130, 176, 164, 52, 9, 140, 249, 82, -75, 14, 205, 139, -36, -46, 35, 60, 51, 63, -30, -133, -49, 104, 17, -171, -143, 44, 11, -169, -166, 24, -10, -202, -208, -57, -47, -121, -134, -156, -239, -190, 19, -18, -307, -430, -140, 114, -62, -356, -345, -135, -56, -90, -170, -260, -330, -157, 49, -49, -314, -310, -108, -22, -118, -141, -147, -188, -187, -38, 23, -89, -201, -150, -61, -35, 43, 61, -118, -289, -92, 234, 183, -193, -278, 17, 231, 168, 19, -100, -146, 40, 311, 322, -70, -265, 65, 397, 262, -49, -78, 119, 207, 192, 186, 93, -19, 66, 257, 231, 62, 43, 155, 163, 82, 144, 217, 103, -45, 49, 252, 210, 72, -30, 15, 100, 204, 215, 56, -150, -16, 270, 251, -68, -171, 31, 208, 136, -4, -76, -71, -1, 129, 116, -125, -212, 12, 164, 12, -188, -104, 43, -17, -121, -58, 0, -88, -160, -99, -21, -75, -122, -118, -143, -146, -48, 38, -152, -332, -205, 78, 102, -216, -377, -237, 28, 85, -88, -345, -364, -82, 198, 44, -360, -417, -73]
1655g3K48j38k70m9J43J42R0j02j84k6K10J36q9j52M4R0n6l3J68P0k18j32J48
1678c3K64lk11j80O1K33K03r2l39j57K83L99p0m08j94K32L41L0k39k31J7K34K20
1701C60j26k52o0J86J12p0o4Oj9q0N7J50K4j84j47N6J70J29p0k42j69J74L49N4
1725C44m05l24J98M51M2l24k91R1K65J84j24l12j20K46K37o4k62j02J53J12l9
1746d4o8j5nl5J5R8K7p1j06m0P9J62N0k00k09R4K95J01k62k58O7L26J18j44k78
1771c03m6K11K80n4l10j41K19K67l2k46r4J23J58j7o9q4QQ3N5j9l8J8j4j4J7R8
1797E6O6j34j66O0K58P4j95j94L1K27J56r1k70j10K21L32p0l49j77K39K86j5k58
1820b3j47Q0J97P4j10j21o0J18J15l3r3l6L0lj0J13L5j31j61O1J88R8j22k35n2
$$ y = [-73, 175, 37, -233, -282, -139, 3, 93, -9, -193, -219, -9, 127, 38, -114, -70, 20, -36, -69, 99, 169, -49, -181, -33, 231, 228, 17, -163, -102, 131, 334, 242, -97, -254, 29, 428, 358, -50, -244, -12, 329, 359, 120, -111, -94, 140, 360, 234, -18, -78, 108, 220, 150, 86, 92, 73, -7, 50, 200, 224, 40, -107, -51, 119, 248, 178, -64, -233, -59, 290, 344, -61, -385, -187, 264, 306, -18, -309, -218, 47, 231, 107, -205, -325, -79, 158, 94, -168, -270, -117, -5, -44, -112, -127, -132, -167, -152, -54, -27, -98, -204, -244, -165, -3, 47, -153, -362, -268, 27, 128, -134, -392, -325, 1, 119, -25, -303, -349, -138, 142, 88, -222, -363, -144, 123, 91, -155, -249, -126, 32, 15, -54, -138, -130, -47, 8, -11, -49, -31, -45, -59, -42, 56, 122, -12, -178, -118, 140, 214, 19, -175, -144, 83, 239, 148, -122, -232, -11, 321, 251, -98, -275, -36, 250, 235, -23, -170, -90, 107, 181, 71, -50, -110, 8, 123, 90, -3, -39, -9, -12, -22, 91, 126, -5, -166, -105, 83, 181, 59, -176, -228]
1845b28K11K53n2l25k11K10L65J9l13k32Q1L07J30j43k64q7K18K37m8k57j03J09
1867a23J77j4p4l5k0oJ6J21L2j38j20L6J56R2k9j78j16R4K69R0k34k60Q3L08J30
1892B57k06k49j2K48J97p2k54r5J70J94l2j41o6M9J02j1l8Kk2k%L2M4Pn6j02J3
1919d3J57R8j38k26M9K25J21j76j98NJ84J42n5k00j14J31K14K9k26j70J23J93
1941A25Pj69r5N7R8K2o6o0RK4K4j1qJ7l6k7J3Q1L8j06r5L5J32N9q3j45k5J36J47
1970I8l5k18j00J98K11p5k32q4J77J59k2j44r2P6J15L3o7j03J4R9N9o6o9M7N2
1995C1m4m9P4O3qj28j7Q4J32k4j64p1Q1J91L8j78j65R3K06Q1j49j81MJ83J16o1
2021A38j89m5J29J12k3r9m4M8L3KJ8Ko4m4L7O5J9n1n8l9M6J05P4j62j42JK09J18
$$ y = [-228, -17, 236, 184, -141, -352, -142, 223, 242, -71, -303, -222, 85, 215, 72, -192, -279, -61, 176, 128, -129, -232, -123, 54, 40, -34, -69, -89, -95, -79, 42, 74, -64, -184, -148, 8, 100, 71, -107, -223, -129, 140, 230, -4, -264, -181, 127, 257, 51, -198, -210, 38, 235, 163, -91, -186, -16, 178, 146, 5, -61, -12, 90, 79, 41, 43, 21, 19, 19, 51, 95, 102, 46, -56, -43, 114, 212, 74, -152, -103, 122, 243, 67, -131, -126, 58, 200, 145, -55, -169, -38, 176, 205, -21, -191, -68, 125, 132, -37, -132, -75, 23, 45, -21, -81, -72, -48, -24, -35, -43, -26, -62, -89, -76, 5, 43, -63, -158, -123, 9, 68, -15, -160, -185, -49, 98, 63, -155, -255, -57, 154, 79, -153, -237, -60, 99, 77, -67, -159, -83, 32, 65, -2, -105, -91, 8, 67, 1, -68, -21, 31, -13, -62, 12, 75, 67, -61, -78, 6, 138, 114, -50, -121, -40, 151, 189, 11, -154, -61, 145, 226, 77, -104, -100, 83, 199, 138, -51, -96, 33, 145, 122, 23, -21, 27, 60, 62, 80, 82, 18, -26, 11, 76, 95, 44, -14, -53, -7, 98, 172, 10, -132, -131, 78, 196]
2049A96j80j88M9J80P7j03j46l7J24J06k3j20o7O7R9l0r1nL7L0k1l8L3J9ll5o7
2076a37M4J18pj33q0J17J27k6j35m4R0R2jo2q1j4J38N9p5r6J1J00N0o4o3M9L4
2103A1j2lJ8oMJJj4J7M9j3o0j8J01M2q0p1M0J04J2p3m7L9M7K4l7n9MO9M9p5l7
2135B7L9M3ko1NLK6K0j2m8kK8L6k4q1M1Q1l6q1j4Q8K4m5m1K2J4PQl9m2K6N4j3
2168E1p4m2P2N2k6o8j7K7L6k3%l9J0J4L8m7m3J8L6Lm0NK5j6k8J7L3k0J0m3OK2
2200e1J8K0o1m6O4O9j5q5l1N1N0Jpm2n2M0Q7ko3o0L3P9J2m5%j2k9O3M5j6m5m6
2232g6M3P6kl1l7j2K0P7K5q8m8J2O8N2k6n4m3M1O5M1o1o8jP1O8m4o0k4L1L9L9
2263I3l2o1j7O4M5nn4j9PK8J3Qqn4l4P9L7l8l8k0K4J6N1k7n8o1O1R2Lp9q2L8R6
$$ y = [196, 16, -172, -123, 57, 134, 31, -115, -152, -28, 78, 55, -65, -132, -65, 34, 4, -87, -92, -55, -25, -46, -84, -51, -32, -35, -70, -137, -93, 25, 18, -115, -195, -78, 49, 23, -112, -156, -66, 26, 25, -37, -118, -132, 6, 65, -10, -106, -95, 5, 55, -9, -72, -23, 11, -1, -4, 14, 8, 12, 13, 14, 0, 17, 66, 53, -7, -25, 76, 118, 38, -33, 7, 111, 123, 50, 3, 42, 89, 113, 76, 17, 21, 90, 139, 64, 27, 66, 109, 107, 46, 51, 54, 80, 100, 88, 40, 38, 66, 102, 78, -3, 38, 119, 83, 2, -12, 76, 100, 55, 14, 36, 50, 57, 65, 26, -16, 10, 64, 51, -23, -65, 7, 59, 33, -35, -52, -25, 11, -12, -12, -51, -41, -27, 11, -36, -79, -61, -25, -22, -62, -57, -32, -48, -76, -59, -26, -46, -36, -79, -73, -51, -33, -13, -74, -120, -56, 13, -2, -87, -118, -67, -17, -16, -23, -65, -117, -77, 10, 8, -55, -115, -82, -3, 9, -36, -36, -48, -77, -14, 31, 15, -30, -76, -33, 43, 41, 10, -27, -39, -19, 58, 83, -5, -53, -41, 27, 79, 53, -1, -44, -3, 62, 103, 42, -26, -27, 44, 112, 68, 8, -16, 15, 54, 93, 61, 0, -17, 47, 92, 87, 33, 14, 21, 49, 62, 70, 62, 8, -26, 53, 90, 52, 14, -6, 18, 34, 85, 58, 0, -61, 0, 92, 95, 16, -66, -28, 68]
2296F8L2n7r1k6P2R5k3j09k9L0P6Nl6o0k1N8N0Kp2k4N1J6k3j8K6j7k2J6L2J5o0
2327d4l0K7N2ll9k6j6L7N5Lq2l4M2P6Jp4o1N3P8Ln4o0OM7M3l7l2k4N6L4k7j8K
2360d6qjL8j0nk1mPJ3L9qm3l2M0R2k0r5n1O8Q7Qo0o3qQ5J00n4q3o6J12J00l8q7
2393a4m8N8P6qk7k3kPM7Jk0j7k5QL7L0K1q7m9M8J01J7r2q3J1J00R3n8j15n0P3
2424A0J43qj24q5N7J22K0p5n5j0N0O3np1n6M0M0K1rj6m3m5L5R4Kr5o1L0Q9L7n1
2455D4q8l7O3J00J4j38p4M3J34Nr4p2K3Q0J5k0m9m6M4L7Pl4k8Mj1J3J9J4m3l8
2485a13oP1N1m3o3k3K1Q4J9q7q9L8J28L8r5q4K1J07M6n4o9k9N4R6Mq8p1O5P6K
2515Go2l4M2L0J3JLm0oL9P1m2l6oJ6K4K6J3o6l7M0J01J9j08m6M2P1K1n4m2k2O1
$$ y = [68, 100, 43, -48, -74, -2, 93, 70, -39, -68, -38, 38, 43, 7, -53, -74, -16, 34, 36, -36, -60, -9, 7, -16, -34, -8, -25, -47, -31, 1, 16, -44, -74, -47, 5, 2, -37, -63, -79, -42, 13, 16, -66, -100, -58, 18, 19, -55, -116, -63, 15, 18, -36, -96, -90, -43, 0, -37, -69, -93, -37, -3, -30, -48, -46, -54, -55, -17, -27, -32, -53, -57, -50, -37, 2, -6, -49, -81, -41, 51, 31, -64, -115, -47, 40, 48, -12, -75, -83, 2, 102, 48, -35, -101, 11, 111, 73, -14, -62, -4, 72, 64, 37, 14, 12, 19, 66, 67, 47, 30, 5, 13, 50, 80, 101, 14, -35, 13, 114, 131, 39, -44, -33, 67, 160, 102, -13, -63, 10, 153, 145, 21, -64, -7, 115, 135, 60, 5, -5, 45, 108, 103, 32, -24, 16, 56, 77, 68, 52, 9, -36, -1, 93, 95, 0, -61, -31, 58, 95, 44, -44, -81, -18, 82, 96, -42, -116, -73, 61, 66, -28, -100, -77, 3, 18, -2, -51, -97, -53, -16, -9, -43, -71, -67, -78, -65, -46, -32, -75, -113, -119, -48, 3, -40, -103, -126, -105, -21, -2, -89, -178, -140, -12, 26, -69, -153, -132, -25, 21, -33, -102, -131, -77, 19, 23, -65, -136, -71, 5, 7, -55, -89, -47, -17, -4, -3, 0, -40, -46, -7, 64, 22, -14, -20, -4, 20, 46, 59, -7, -44, -4, 97, 116, 8, -38, 4, 75, 96, 42, 0, -22, 39]
2547C9M5N2j06k2M1K7l9K4r6N2O3J7l2n5R4l8j4qL5J4j01j2j7R3rn0r0N5J39M3
2577A44o1o4m3M5N2M3Lk32O3J37N6l1j63p6J04J17j43J4Jo0P6O7j04k0j0P6j0
2604a9K7n0m8k6P5J10l8r9o5O9J0L2K5q6m3N3J17oj33o4R7Q8j4p2j9K5L7J7j4
2633a4l6k0K6N4j7n6M1M9m7n2L9P9k1q0k0O8N2Ko6n4L0R1M4o6j01L3J04M0m6q9
2663c3J3O9N5j9p9l6O2O0ko8k5M9N2m3j6K0J1k9J7L2j4l9k2N3nqK4ln7j4Q7N4
2695A46r3q8L7J20Nq9n8L1O4K0o7m1oM0P2j2j06k2O4M5k8n9j5M5J4j7k6k0K7K5
2725Hj9m7L7M0pp6j5P9L9m9q1K0P8K9l9o8lRP8M2j05q1P7O9Mj07kP4NO9p3p1P5
2758a1o6P3Rn6k3O1Ll2K1M9pm4m7N4N7l0m0k5M5N9K1q8m5K4R4L9j02m3p2J83J
$$ y = [39, 84, 136, 30, 8, 49, 76, 37, 61, -35, 17, 80, 97, 65, 10, 104, 66, 52, 44, 79, 93, -8, -20, -37, 56, 47, -3, -93, -38, 101, 144, 83, 19, -24, 21, 73, 116, 119, -113, -50, 87, 143, 112, -51, -127, -23, 94, -49, -35, -34, -94, -18, 49, -55, -75, -85, -9, -19, 8, -42, -90, -116, -41, 69, 31, -68, -133, -64, -54, -22, 3, -83, -126, -73, 44, 38, -95, -159, -62, 26, 12, -60, -79, -54, -17, 0, -14, -50, -70, -44, 10, -7, -63, -22, 27, -20, -72, -33, 46, 25, -55, -75, -7, 45, 47, -19, -73, -43, 48, 92, 26, -75, -42, 62, 102, 56, -33, -20, 49, 104, 85, 6, -30, 32, 92, 90, 22, -3, 46, 98, 55, 39, 59, 70, 41, 58, 90, 76, 37, 15, 68, 63, 55, 79, 76, 19, 5, 92, 146, 53, -35, 2, 122, 127, 38, -20, 11, 75, 95, 28, -13, -19, 21, 93, 81, -25, -47, 17, 62, 34, -25, -40, 5, 19, 2, -24, -44, -17, 8, -11, -58, -21, 19, 12, -64, -79, 0, 39, -10, -91, -71, 7, 36, -3, -71, -74, -65, 13, 55, -50, -131, -54, 15, 19, -88, -90, -16, -11, 58, -15, -86, -11, -77, -4, 5, -51, -74, -13, -10, -42, -21, 28, 21, -23, -70, -16, 41, 11, -29, -54, -9, 50, 71, -17, -62, -38, 56, 95, -7, -50, -122, 61, 62]
2789F2j8p0p8J1K26k4n8l1P9m6o8R6r2P6J8q5k4N6K5k2K0l0Pj5Q6j0j36M5J24
2818A24p3n2k9P5O5l6j20L7N1P%n9k6O7L0j1n6l4M4K9j2l8pK9Kml3j4L1J7on4
2850e6j8O7L7o0n8M0O4pq6jK8L4%j4l4j0M9M0m2p8QP4N5p5n8K2O0J9l8j7kK7L1
2883Aj9k9j8M2K1l0%NK6j2k4jM1K1m0j4nM1L2j3n3k1R9L1n2p3J6O6K5k0n9jL6
2916A9N3K1p0l7L9N1Rp3k2M5M3J7p5K5N9n7J6k7N6Rn5M4j24J05R1j03j4r0P4O0
2946H9M1r3m6J8Q6rn0o5M6O3J7m5p8J7O0rk8mj8PjJ2k8J0nL1j2k8LJ8j9n5K1P2
2980A8j7m6k5L2K3Ml7j9l2M7N9l3q6lP6L7k6o9J1L5K3ll6k5K3jK5j7m3K8L2ll4
3013h2K3J1pk7J1M9k8J1j6kJM5lm2j5K9P3m4m2j5O6L9j9l4j9nO6L4m7n1QO6M5
$$ y = [62, 44, -26, -104, -93, 133, 109, 51, 20, 99, 53, -15, 81, -11, 65, 83, -2, -26, 30, 55, 33, 53, 23, 30, 15, 101, 91, -45, 0, 124, 51, -1, -30, 45, 110, 74, -46, -9, 42, 49, 49, -10, -36, 31, 61, 50, -6, -40, 4, 33, 21, -17, -24, 5, 7, 3, -30, -44, -13, 4, -2, -56, -74, -7, 30, -30, -88, -48, 16, 9, -77, -78, -50, -16, -16, -30, -64, -74, -25, 15, -27, -105, -97, -23, 32, -43, -101, -79, -19, 0, -38, -55, -57, -30, 1, -18, -47, -65, -23, -2, -32, -32, -27, -1, -13, -37, -38, 3, 24, -16, -30, -35, 6, 38, 25, -28, -49, 50, 81, 29, -44, -28, 38, 63, 43, -16, -17, 19, 72, 93, 23, -14, 25, 76, 85, 12, -10, 35, 78, 95, 20, 45, 104, 47, 63, 36, 92, 101, 46, 90, -34, 71, 162, 59, 45, -45, 29, 89, 130, 37, -9, 9, 95, 86, 36, -29, 17, 80, 97, 52, -26, -9, 51, 42, 14, 10, -8, -1, -2, 10, -18, -8, -13, 18, 6, -22, -19, -1, -20, -75, -54, 18, 1, -45, -70, -38, -15, -11, -48, -67, -99, -52, 7, -26, -112, -115, -39, -2, -28, -97, -86, -51, -28, -31, -67, -92, -69, -70, -45, -62, -105, -77, -45, -48, -82, -59, -48, -55, -82, -71, -22, -50, -39, -55, -57, -56, -11, -14, -56, -71, -42, 31, -13, -55, -70, -4, 35, 16, -18, -37, -42, 24, 58, 11, -40, -32, 34, 79]
3046G9o0l3J4L7J1j3rJ5l6L0K3k%l0L1J0j2K3k4k7j5M3M3k4o4ML7M5pm3m5MP0
3079G5K9m1o5j0N7L4on3k7L3J3K7qo4QJ6M8n1k0K8ml5L1L5m0m2nL7K4j4l9Qk5
3112d6L3L0j2o7l4Q6J7lo7k0L3M2kl3k5%L0M6k6m1j4J8L4Lm2Rj9K3K1J0k6j3q
3145f3K7lOk6moK1M4k2l3KM7K2k4j1j7J4K5L7k7m5j9O2L2l0m2PL4J1j7Lok2L2
3179IK0J9n2OQK8oj0Mk1K5PL2j8m3J2K9Njk1k6QN3J0k9n6PM3J8om2j5K8L0K4l8
3215D1o7QN0M0l7n7K6J2K4Nmm8nJ5M3mn6KK0mJ1Ol0j7ML8jk1m7J0L2J6j1j3%k
3251b1MK7lm8rK1L0K0n3pj2L6K6ll4k4K2M3Ll0j0k0K3L6J8m1k3JL9J3k8l8K8J7
3285CLJJ3l2mL2J5Om4JJ3K0JLk1k1M0J1%n2j3M4J7J0m1k5J4K9jlk7j0L0K7jl3
$$ y = [79, 19, -14, 0, 37, 48, 35, 26, 41, 5, 35, 58, 56, 56, 26, 57, 67, 55, 78, 54, 27, 12, 55, 98, 74, 10, 14, 51, 96, 89, 46, 1, 5, 75, 104, 63, -2, -12, 45, 79, 73, 20, -7, 26, 39, 66, 58, -6, 2, 18, 66, 15, -5, 23, 19, -16, 15, 50, 10, -32, -37, 0, 24, 10, -29, -21, -46, -13, 17, 5, -62, -96, -10, 7, 4, -63, -83, -50, -8, -10, -43, -68, -68, -38, 8, -18, -59, -73, -55, -21, -18, -60, -51, -70, -47, -26, -16, -42, -55, -63, -36, -39, -33, -59, -63, -69, -48, -4, -26, -59, -57, -10, 12, -12, -23, -40, -26, -1, 36, 9, -36, -55, 7, 39, 9, -33, -26, 8, 19, 2, 5, -1, -23, 9, 29, 48, -4, 2, 10, 38, 32, 22, 26, 5, 30, 37, 69, 51, 8, 20, 49, 54, 53, 32, 6, 14, 67, 77, 48, -8, -1, 42, 60, 54, 12, -3, 25, 55, 79, 41, -26, -18, 32, 72, 35, -22, 4, 16, 40, 45, 41, -7, -12, 3, 46, 42, -14, -12, 8, 4, 15, 21, -9, -26, -22, 16, 15, -6, -53, -43, -11, 5, -6, -19, -19, -21, -17, 10, 7, -41, -50, -29, 1, 21, -32, -39, -51, -15, 11, 8, -26, -50, -28, 15, 18, -12, -22, -42, -19, 17, 35, -6, -29, -28, 11, 24, -4, -42, -14, 3, 6, 7, 20, -12, -16, 16, 31, 37, -7, -6, 7, 27, 28, 31, 10, -11, 29, 40, 40, -12, -25, 19, 36, 46, 5, -20, -6, 23, 22, 19, -8, -18, 12, 39, 38, 5]
3321Ekj1J8K3k9kk3kM1Ln3L0Jj6L3Lk6pj5K1K8k1m5K8J0J5j9pmk6L5K9j8l7lL2
3357a1J4pl3jOJ8Jnj7J4mK5pj0Pj5NJ7J5m5rMK3L3j8l1OPmM8l7l9OM2L6j9l7J3
3395iJ9K0nk0jlJ7J6rj3k5K4J5OlPk8LJ5J5k2k3J6J0J5j5k8NJ6K2%pn5K9K9J0
3431D3j9l1MJ2J3Mj2oj8L1J9m3j5K7J9k1k2JK9k2j8K8mOk6J5%%K6j7lj1QK6l6
3466a3k4J5J7j1PorNJ9rj1j4J3K0j9j6MJ0%mOMj3J2j6K4k0pM8qj8rK8ol3K2K1
3503INk5k1K0j0J9Oqj4KM6%k7l9M7M0op9M5oN3k8m7K6k4J4M6l0k7J2K6l7L0J2
3537C0k0j9O4q7OP0k2J8m3Ql1M2ol4k3J08j4n4k1M8ook6MPPJ7j4k4MK1Rk9j9L4
3572aRkk1nL1j2j3Jr%J7jk8MK0M6n3j8J8M1j0l5qJ2J6J3j3k8j0L3J2rl2ML6j0
$$ y = [5, 3, -8, 10, 33, 4, 2, -21, -23, 18, 21, -32, -2, -1, -17, 16, 19, -7, -14, -29, -8, 20, -1, -46, -18, -8, 7, -12, -19, -23, -49, -14, 15, -3, -40, -43, -11, 3, -4, -37, -38, -32, -14, -13, -18, -35, -21, -25, 0, -7, -17, -10, -25, -20, -3, 12, -33, -42, -38, -15, 18, 0, -31, -25, -18, -22, 26, -11, -50, -44, -2, 34, 15, -22, -9, 10, 30, 25, 5, 4, 1, 18, 34, 25, 12, -13, 11, 26, 32, 29, 36, 8, 11, 26, 41, 19, -4, 12, 22, 37, 22, -6, -1, 15, 37, 37, 30, -25, 4, 33, 43, 24, -7, -3, 9, 22, 26, 14, 8, -10, 21, 40, -3, -18, 9, 28, 7, -15, -14, 15, -7, -25, 3, -1, 5, -21, -6, -6, -6, 20, 3, 0, -11, -3, 23, -13, -37, -22, -5, -16, -9, -15, -24, -19, 0, -9, -20, -34, -21, -1, -20, -36, -32, -22, -22, -26, -20, -16, -29, -17, -33, -9, -29, -36, 12, 4, -14, -23, 5, -1, -34, -12, 9, 14, -11, -32, -12, -22, -3, 3, -5, -19, -17, 29, 29, 2, -37, 10, 50, 44, -35, 10, 4, 57, 29, -18, 8, -16, -2, 44, 14, -13, -1, 25, -12, 18, 30, 10, -9, 55, -32, -26, 44, 22, 40, -3, 5, -26, 16, 10, -24, -47, 61, 47, -7, -28, 20, 14, 8, -18, -14, -7, 0, 17, 3, -21, -17, 4, 13, -16, -35, -1, 8, 6, -15, -20, 11, -1, -14, -13, -22, -22, -5, -6, -34, -30, -10, 36, -17, -35, -17, 24, 14, -21, -29, -17, -1, 12, -1, -29, -39, -6, 6, -3, -35, -31, 5, -5]
3608ek1nJ5mJ1Rk7KJL3K4o5PN2k3k8j8L2J8j9j7L7Roj8%kQJ5J3m7rM1K6k2m3J
3645b5N0J3m4j6J4QJ6L7m9j5pN6on4J4M4k3j4JJ8Oj4Lk9QJ3J5j4l0OL9nk7l9M0
3680a0M0k2k1rK9mJj5k0K4K2J6l4k7K4M3k9qj2K5Kj8JrJ5jnKmj3L6l4j1J9J3J4
3716B0km1K7lPk4kJ1PJ7nl3MK8kj1k3L5J1k2j1JJ8Rj7j2J4k2L5J3l0k9L2J7qk9
3752b0K6j0JmMj7K5J%nj3J7Krl4K1K8Nk5qJ0PPj5j6lJ3K8k6l7K5QJ0k0QnJ4Qj0
3791iJJmJ1Jj8rJ9Nj5k3L9Mj1j7K1J2pj0j1JLK1k5J2j1J5J1j5k5L4Rqk7%K3jJ2
3829IlrJ4k1K3k2j0J4K1qj3j8L8J0l5J4j5J1j4K1J0j9j2K6jk0JK1J2j9LpJ0Mj2
3864DJ2lJOJj9nK3oJ2l6J7K0k3j8%J5RmJ1k5J7qK3k6kJ3Lj8jRKK7k0k0J1oPmk5
$$ y = [-5, -26, -31, -16, -20, -9, 0, -27, -25, -24, 9, 33, -32, -25, 27, 4, -24, -42, -10, 8, -11, -28, 9, 18, 12, -6, -6, -8, 0, 15, 28, -19, -28, 13, 39, 17, -26, -25, 25, 38, -6, -22, -8, 0, 16, 53, 4, -11, -18, 38, 32, -22, -8, 36, 13, -1, 0, 18, 24, 10, 13, -16, -8, 5, 20, 6, -24, -18, 21, 16, -11, -50, -10, 30, 8, -13, -22, 7, 3, 4, -11, -31, -7, 15, 31, -3, -30, -6, 37, 8, 0, -12, 13, 15, -3, -2, -11, 4, 3, -2, 0, -4, -17, 19, -15, -26, -7, 6, 20, 18, -23, 4, 1, 8, -16, -18, -7, 0, 17, 12, -21, -17, 11, 9, -2, -25, 10, 21, -1, -12, -11, 7, 16, -1, -13, 1, -21, 14, 27, -3, -32, 0, 17, 9, -20, 6, -4, -3, -7, -3, -20, 5, 6, 6, 1, -12, 5, 7, -2, -36, -15, 13, 18, -7, -15, -5, 2, 9, -6, -22, -25, -12, 16, -10, -47, -22, -14, -4, -24, -16, -21, -7, 1, -9, -8, -7, -11, 0, 1, -17, -26, -7, -2, -17, -40, -1, 3, -8, -25, -4, 8, 1, -9, -20, -19, -16, 5, -20, -8, -19, -4, 7, -8, -33, 1, 10, 2, -25, -25, -2, -3, 9, 6, -3, 11, -10, 13, -9, -19, -5, 16, 8, -5, -23, 15, 25, -10, 4, -11, 0, -14, 7, 17, -2, -14, 12, 11, -9, -8, 13, 25, 6, 9, 2, 12, 16, 4, 16, 13, 14, 20, 21, 2, -3, 20, 14, 26, -10, 7, 27, 4, -14, -14, 1, 10, 6, 17, -8, 9, 1, 24, -2, -4, 9, 12, -6, -7, 2, 4, 31, 11, -9, 2, -4, 3, -1, -26]
3904b6J8J7Nqj3kK4Mk7k0K1%lRk0kKJ1K3j3LmOj0j3J3L3j7k7%L2j5Pj0K6l5jL2
3942B0rrj2L1pj2LpJ0j2OQj0K5l6M%QlPj4J8kj0JqPJ7k7K0k1J7pL6n1N6n2k3M9
3981A1n7N2K9k5Mj1k9O2k9JqjonK2k3j9L2M4o5K3J5L7p6OL4k6K4k8K3j7jkJ1j1
4016iOQJ5j3k7J8mlJ1nj3pL4j1J0k4KK0Jpj7J3K2mj3jnKnJ2oOoQk1J7J5j8Nk0
4056a4L7J1k1lj0j2K2J2j6j4MJ3KJ2k1RqJ2j4Rl0J8LMK3n0K4Orj8K3mjj3RJ2j
4093FrJ0Oj7KJ7k1oRKQm0JK9J1j0Rk0J6oJ9j4k2J8lJ1Rk7J4LNj7MKNMJ4k0j5j
4133a4L5Pl2%NJ0j1j2ROqjK7j1l7K1Qj2oOJ7%j0NjpJnJ4JqJ6krkRj4KOJ2rJ1p
4176A0j7QL%NKj0J3k2OL%Nj3jMJ0j0j5K4oQjJ3l5K9lJ0k5jKJ4Jk1OLjoJ5j5r%
$$ y = [-26, -8, 9, 14, 6, -7, -9, 15, 19, -8, -28, -7, -7, -10, -1, -21, -23, -21, -10, 13, 0, 3, -1, 5, -5, -18, -5, 28, 11, -16, -16, 16, 1, 8, -2, 24, -11, -12, 20, 11, 2, -10, 21, 14, 2, 5, -2, 8, -4, 2, 10, 0, 25, -11, -7, -7, 1, -2, 5, -9, 9, 7, -3, -2, -10, -3, 14, -13, 7, -14, 3, -4, 32, -19, 37, -15, -38, 11, -46, 6, 35, 10, 14, 3, -26, 36, 7, 8, 0, -1, -7, -12, 10, -13, -32, 0, 44, -21, 2, 17, 54, -22, -16, 18, -8, 16, -12, 11, -6, -7, -9, 2, -9, -3, 5, 20, 7, -20, -2, -6, -9, 2, -3, -16, -23, 11, 0, 10, -14, -12, 8, 9, 2, -15, -2, 20, 16, 3, 2, -3, -1, -6, 6, 0, 6, 0, 8, -13, 4, 19, 1, 6, -14, 23, 34, 13, 10, 0, -12, 10, 22, 6, -8, -4, 9, 11, 23, 2, 11, 3, 15, 1, 10, -20, -2, 1, 5, 28, -22, 2, 8, -1, -19, 4, 0, -1, -14, -5, 7, 6, -3, 7, 13, -4, -2, 15, -6, -12, -3, -1, 7, -33, -32, -3, 8, -2, 7, -13, 3, -3, 16, 2, -20, -2, -5, 6, 15, -12, 2, 5, 10, -7, -3, -1, 4, 8, 22, 2, -13, -14, 21, 28, -4, -4, 1, 11, 0, -12, -3, 3, -5, -6, 21, 10, -27, -6, 2, -10, -16, -10, 7, 7, -3, 2, 1, -6, -5, -10, 4, 5, -3, 13, 11, 2, 0, 9, -5, -3, 3, 15, 6, 17, 10, -7, 1, 4, 4, 9, 11, 1, 14, -8, -2, 1, 1, 6, -7, -8, -4, 6, -4, -19, 5, -1, 7, 6, 19, -16, 13, 10, 20, -5, -6, -4, 10, 11, -10, -4, -1, -2, -8, 7, -8, -17, -17]
4218a7M0m0nK4JRj4j2K8Oj1j6nJK0Nj8orM6j0m1J6J6MKk1PmPj3K1j6J6KJ3k2j2
4256hPJ5k0j1J8OJj5J2j3PJ0mJlmRMj6pJ3J9ok1oJJ7qKrJ9J0k0j1J8K0Ml4QJJ1
4297A7j0jQk0K1j7K2l7LL5%k4oML4k9oJ4kMRk0rJ3O%j4%J9J%k5MK0j6J5l1J7o
4336gK6pk0k5K7K0oqrJ4Nj2onJ5MJ5j4j6RJ5nk4J4K2j4J1j5KMj1j0OJ0j0Rpj4
4374a7J2K4qkl2L4KPj6j7J7jM4r1pK5J5Rjj7J7L7k4j9k4K7K4l5NNkJ5jj2kOJ1
4411Hj1njJ3J6k3oPJ7kj6JlqL0j2j1OKJ%k2K0K1mj6j1J5mqM4l6rK1rKk1JL0j4
4451CqmL4j0j7J1PPj2mj1j2K1J2kl0J3J7%j3qJ1NJ2j0j7J8mJ5j9LPj5L8l2npJ7
4489A1qNplJ3oKLLkkqj9K5Oj1j6QJ1k%opJ2KK0l2qOpK4oj5J7Mj1Omj3RJ6Pj0q
$$ y = [-17, 23, -17, -22, 2, 3, 12, -2, -14, 14, 20, 9, -7, -12, -11, 9, 14, -4, -10, -19, 27, 17, -24, -8, 8, 12, 14, -7, 0, -4, 3, -10, 11, -5, 11, 13, 26, 4, -8, -1, 14, -6, -17, 1, 7, 8, -7, 5, -8, -1, 9, 5, 6, 3, -1, 8, 12, -4, -11, 2, 21, 15, -6, -12, -11, 6, -2, 0, -9, 10, 20, 0, -11, 7, 27, 31, -3, 5, 6, 17, 7, 6, 14, -6, 15, -2, 20, -17, -14, 21, 21, -3, -9, -5, 29, 0, -6, 8, 6, 10, 19, -1, -10, 3, 9, 9, -5, -5, 14, 15, 15, -10, -6, 14, -2, 13, -18, -1, -7, 19, 12, -8, -33, -6, 14, 8, 0, -9, 5, 10, -2, -8, -13, 2, 6, 21, 7, -9, 0, 15, 10, -14, 0, 22, 8, 19, 4, 6, 10, -1, -11, -5, 5, -5, 4, -3, -17, -5, 19, 11, 9, -23, 11, 13, 20, 4, -13, 4, 3, 47, -44, -51, -26, -11, -2, -3, -20, -3, 34, 10, -9, -33, -6, 18, -17, -12, -7, -9, 6, 5, -7, -9, -3, 8, -3, -8, -9, 4, 20, -3, -9, -2, 15, 13, -3, -2, -5, -13, 17, 5, -6, 0, 2, 3, 3, -19, 1, 22, 18, 2, -9, 6, 2, -6, 38, 2, -7, 14, 5, 7, -14, -13, 17, 3, -5, -9, 25, 15, -2, 9, 16, 23, 11, 7, -4, -16, 5, 17, 15, -15, -2, 15, 15, 2, -6, 5, 10, 22, 12, -5, 13, 9, 24, 5, 8, 15, 0, 38, 6, 1, -6, 11, 3, 8, 1, -2, 11, 5, 7, 10, 13, 11, 9, 1, -18, 7, 13, 2, -14, -6, 5, 3, 3, -3, -10, 2, 4, 24, -8, -16, -10, -17, 7, 1, -14, 3, 7, -4, 2, -2, -15, -6, 10, 17, 7, -1]
4533aKoJJK3j8lj6J3J1k3JJ7jj7MJ5k2K2lJ3j1j5J2nJ9k0rJ4j3Mj1J5rMRj0nJ0
4572hj3K8KqPj1nkJ8k4L0l7L5KrLj3Pj0J1k%OjPj3NKj1jK1J0l8J4nJ0JMj5J9j5
4613Aj2K0nnPMJ4l4J0kjMnJ4k0%J3Nol%OJ2j7j5J2oJ6j7J9rj4j6M1Lj0j4OJ2n
4653CJOjpJ7k8OJ0k3J4J2pj2NmrJ9NOj5J0j3J8nj1j3J5lKJ1k9J6Qj7J2lrJ9JJ4
4693B1k6jmJ6npJNOpJlJKmLOk0J0J0J1j7J2qk5K9J4j7R%k7J6%J7nkrMkrjJ0K0
4736B5l0kLpMK0k2J0L%JJMk3K0j3J2J2j9J7Jj4Pnj3RRNoMj4nJ5m%%kNJ2j0Lnj3
4779eJ1lKp%J3J1m5L0j3nJ7Pk6lK6j3lPlOmLrJ8j6oNQlJ1j1oPjJ6koj3lK1j2J
4822BkJ0npK4j4nmPKj1MmJ0%jj0%NQJ2k2J1qj6K1J0j6lqJ3K0k2JkMJ4j7LnK2j4
$$ y = [-1, 1, -5, -4, -3, 20, 2, -1, -17, -4, 7, -16, -15, 2, 1, -16, -12, 3, -19, 3, 0, 13, 2, -13, -1, -6, 13, -7, -16, -2, -15, -11, -22, -7, -16, -12, -3, -13, -18, -8, -21, 7, 9, 1, 8, -3, -8, -10, 8, -16, 14, -23, 12, 14, 5, 8, -5, 2, -8, 3, 1, 1, 7, 6, 13, 0, 5, 7, -4, -5, 16, 26, -12, 2, -3, 7, 8, 12, -3, 16, 1, -11, 9, 4, -1, 6, 10, 24, -10, 0, -2, -3, 1, -4, 10, -10, -10, 3, 8, 2, -1, -1, 5, 17, 0, -15, -3, -9, 7, -10, 9, 0, -14, -30, 11, 14, 4, -10, -4, 8, 3, 4, 10, 9, 2, 19, -9, -3, 7, -16, -2, 10, 3, -9, -4, -8, -17, 2, 7, 13, -2, 8, -5, 13, 8, -3, -16, -1, -4, -2, 9, -20, -4, 4, -13, -1, -4, -13, 6, 7, 21, -5, -6, -10, 6, 1, -6, -5, 0, 6, -1, 0, -3, -2, 0, -4, -1, 5, -15, -5, 5, 16, -1, 11, 3, -22, 7, 21, 4, 13, 13, -14, 2, 2, 19, 14, 12, 3, 7, 5, -4, -5, 5, 25, -5, -7, -4, -11, -7, 13, -9, 1, 4, 4, 5, 6, 10, -13, 7, -6, 6, 18, -1, 16, 17, 3, 10, 5, -8, 1, 10, 15, 9, 13, -1, -6, 9, 5, 5, 5, 3, 8, 20, 10, 13, 8, -5, 6, 3, 5, -2, -2, 11, 22, -23, 7, -6, -11, 6, 13, -13, -16, 10, -3, -6, 1, -2, 4, 0, 3, -6, 12, -4, -10, -5, 3, 0, 11, 0, -6, 1, 0, 16, 14, 8, -5, -8, 13, 1, 2, 0, 10, 5, -2, 22, 8, 3, -1, 6, 8, -3, 1, -3, 7, 7, 6, -4, -4, 1, 9, 21, -1, 10, 2, -14, 7, 17, 1, -2, -10, 3, 23, 1, 2, 0, 4, 18, 1, 4, -1, 21, 7]
4864GlOk1J1J8k9J0RJ8j7j3lJ5j2J1Qj8%NJ4j3Oj0Nj3PMJ2J1qrnK1k4J1oj2PJ5
4903A5rqj6J6J2rk2RJ1Pj2J9k5OQqJ0rJM%j4J1JMk3K2loJ1j2K0p%qj5QJ0J5j1
4943CnoJK2k9NJ2J5k2PJ8k4J3P%j7J2lnKJ0Kj5noK2kljj5J0nJ0j5K2j3j8MJ0j2
4983a4J0J8nj1PonK1j0J2qJmJ2qj1K9k6j5J1K2j9RnolJ0Kr%J0lkk4RK3nj3MKl
5024cjJ8kj6JLKQj9k4L3k0K2LrkJ2Jk0JJ2j7KNKl%J2nJ0nj0M%KNNk1lQQJ9j0j3
5068eMJ3j1nKnJ4qJ3j1Kj1J9j3J1nJj2J7j2J0KpOnjojJ4J%qj0NLrJ0jpj5K7jp
5111bj0jJ7OrKjMjj0RKLoNLNj5NLjLjqJ1rJ0nj6j2J0K5j5Okk%NJ3k0%NOQj3lj9
5158a5lJ0J5kLj4OjRlNjOqQk2oK%Rj0MJ3j4nK9j1qJ0j4J2j3jOoP%J3qqJ1j1%L
$$ y = [7, 4, 10, -11, 0, 18, -11, -1, 8, 26, 9, -4, -7, 8, -4, 7, 15, -3, -3, 2, 16, 3, 9, -1, 4, -9, -2, 2, 14, 25, 17, 8, 3, 24, 0, 11, 5, -7, 0, 15, 6, -2, -18, -2, 10, 1, -21, -12, -1, 6, -6, 13, -12, -6, 2, -6, 4, -5, -4, 0, 0, -14, -3, -2, 2, -21, 1, -2, -8, 3, -9, 11, 4, 4, -4, -19, -11, -1, 14, 3, -2, -8, -7, 15, -14, -9, 3, 18, -4, 3, 21, -3, 10, 17, 17, 0, 12, 9, 4, 6, 16, 18, 3, -2, -8, 14, 12, 9, 8, -7, 3, -2, 8, -7, 15, 2, -16, -12, -2, -14, -4, 14, 9, -2, 5, -1, -6, 15, 5, 17, 9, 10, 6, 18, 10, -1, 28, 2, -13, -2, 20, 1, 10, 5, -1, -4, 6, 8, -1, -1, 9, 6, 4, -20, -11, 12, 7, -6, -2, 0, -3, -4, 14, 12, -4, -3, 0, 2, 10, -9, -33, 0, -20, 2, 5, -4, -6, 6, 7, -13, -12, 0, -17, -15, -10, -8, -11, -11, 1, -4, 6, 1, -9, -5, -5, -3, 2, 7, -14, -17, -9, -1, 18, 8, -5, -1, 12, 1, -4, -2, -7, 7, -1, 12, 1, 3, -8, 11, -2, 9, 4, 5, -7, 10, -2, 8, 10, 3, 9, 4, 3, -3, -4, 10, 11, 11, 3, -7, -2, 1, -8, 2, 1, -6, -21, 6, 5, -2, -12, -13, 4, 10, 1, 3, 2, 6, 5, -5, 4, 6, 9, 3, 8, 11, 16, 1, 6, 9, 8, 11, 10, 2, 13, 4, 14, 9, -7, -19, -9, 16, 1, 7, 5, 3, 3, 8, 21, 1, 1, 6, 12, 20, 7, 4, -15, -18, -8, 7, 5, 8, -6, 0, -1, 8, 5, 10, 9, 15, 7, 15, -7, -13, -11, -11, -2, -12, -8, 5, -9, -14, 15, 4, -4, 6, -8, 4, -9, -10, -4, -10, -3, -3, 10, 2, -6, 5, -6, -6, -3]
5202cJJ0nrQlLpoK1j7J5k0qK6j2KQnj3J2%J8k9MPoRj3J6Nj7K0Mj5J4ppkJMmJ6
5245A6j6LrPLQmk%Qj1J3j2nROrKNr%lKNJ3l0J1Po%j2J8j5QPJ0j8KrjOj3J6jJ1
5290A1j3%j1OJ6lpqL%J2Qj7pLjK1k3K5k5K4j7LkNj4J4qOPqO%Oj1jKJ9l4PMmRQ
5334A1j4kpJ6rPPj0rJPj6K1Oj2qK9qnpJnKQKjLKrkJ8j4J6j3jj6J7j0J2MqQljj
5379GKkj0J2QqoNNj0NqnlRLJ0jnj2KKj8J3LJ0jrrRL%MkRj9J%ONlnKJJ0rkJ5Mp
5429A1j1J4j1KMOj3J9mk7J4pKmnJ0%lmJJ3qkjJ4M%kkqJj5RQj5QJ1j9J2jJ4j0k0
5472a5J4kJ3oqjjPJ5j1pMNJ5j9nQJ4qnKJ1j3LJ1p%j1LKqJ1Nk3jJ0KMkkn%j%JM
5518CNj1%LRk3J7jmJ0qjoMRmlkjPmN%%oJNJ0kNpK4l4J1nl%rK4jj7Rk0J4Pooj3
$$ y = [-3, -2, 8, 3, -6, 2, -1, 2, -5, -11, 10, -7, 8, -12, -20, 6, -6, -4, 4, -1, -14, -2, -2, 16, -13, -9, -2, -8, 1, -12, 4, 9, -8, 12, 16, 1, 15, 8, 1, -1, 0, 4, 0, 16, 0, 3, -6, 1, 4, 12, 8, 6, 6, 14, 3, 16, 4, -1, 8, 14, 5, 7, 12, 3, 3, 0, 2, 7, 20, -10, 1, 8, 2, 2, -10, 8, -7, 1, 8, 18, 0, 2, -7, -8, -2, -15, 1, 0, 11, -2, -2, -13, -7, 9, 6, -1, -9, -6, -6, 6, 14, -3, -10, -7, -8, 13, -10, 15, -10, 14, -3, 0, -2, 3, -11, 3, -5, 1, 8, 0, 6, 6, 12, 1, 0, 2, 21, -13, -6, -2, -6, 3, 11, -3, -5, -12, 4, -5, 2, 9, -1, -10, -9, -2, -18, 3, 9, -3, -11, 18, 10, 5, -2, -1, -6, -4, 4, 6, 5, 8, 10, 1, -1, 17, 3, 19, 6, 5, -11, 6, -4, 8, 12, 4, 12, 9, 8, 7, 9, 7, -3, 9, 17, 9, 3, 8, 13, 3, 8, 0, -5, -8, 1, 4, 14, 13, 8, -4, -2, 0, -18, -5, -2, 8, 7, -2, -11, -2, 1, 1, 5, 3, 12, -7, -6, -6, 0, 5, 2, -3, -1, 0, 10, 1, -1, 14, 18, 11, 0, 14, 3, 5, 9, 15, 2, 21, 17, -10, 4, -3, -1, -5, -10, 0, 0, -3, -7, -6, 7, -1, -3, -4, 10, 14, 14, 12, 10, 2, 3, -12, -3, 5, -10, -2, 9, -10, 2, 1, 15, 5, -15, -1, -3, 10, 4, -4, -5, -6, 1, 16, 5, -2, 2, 7, 22, 3, -2, 6, 20, 12, 7, 9, 20, 7, 10, 21, 14, 14, 3, 6, 8, 0, 11, 16, -7, -8, 2, 4, 8, 6, 4, -1, -1, -2, -2, -1, 3, 8, -3, -3, 0, 9, -14, 3, 2, -2, 8, 0, -1, -7, -3, 6, 2, -1, -3, -4, 3, -1, 4, 4, 4, -2, -1, 4, 14, 12, 17, 10, 34, 0, 11, 6, 3, 3, -6, 18, 17, 0, 9, -11, 3, 10, 4, -2, -15]
5566a5J3PKj1J8k0J9lk3%J5Nk3KPj0QRRk5J2J7j8LJQQj6PJJ2k0j6K4onmQmKjJ2
5608IrpJ4kQk9K2kljLmJ2Kj5Rl0L0J1j6J4k7J7Qj4Rj2J7j7PJ5k4J0J3pk1jK1m
5647FPj1j0jJ3LMk1M1j7kmj5K7qoj6J3JpPJ1qqKoLJpK6k1J0Jj8K9j7oMkjOQj1
5690@MJ0j2Oj4j1K3j2j7J9n%jjJ0j2LpJ3j2J8Rk2oQ%RnjJ9j2Oj2LJ4j2K3k0j1
5729hPOJ3mmJpjlLKj2PnOj4J9rJNPLjPoj7J8j2K%rPQqkROj8%Rj6OLlOj8OK2j3
5778aMjjOqPPj6J8Nj8J0mjoMNnLomj3J3j1J2nMQqPkqQJj6MkjJ0Ro%j5QJ0j0k%
5826gPLjknJ8rj0J4Nk2K8k1mNJ0j3oJ4j3J3ljQ%qJ4k4K1j5oRJOLJj2OJLqqJ8R
5870A9l1J5mj3J1j7K0qJmkK6pj2nQJ6j0lJ5j7rJ2jj0lK7kj3%kJ9J0j7NollJJ5
$$ y = [-15, -2, 5, 7, -4, 14, -6, 13, 10, -13, -13, 2, 7, -16, -14, -7, -17, -9, 0, 9, -16, -4, 13, -5, -2, -1, 7, 15, -1, 6, 7, 19, -1, -17, 7, 1, -4, -8, 0, -4, -2, -3, 9, 0, -7, 7, 5, 13, -16, 6, 4, 1, 0, 3, -1, 11, 13, -2, 7, -23, 7, 18, 2, 16, -11, 6, 14, 0, 9, -3, 14, -3, 4, 19, -5, 5, 18, 11, -10, -11, 10, 6, 13, 2, -8, -9, 4, 7, 11, -10, 31, 14, 12, 8, -7, 20, 12, 6, -10, 3, 4, -3, 4, 15, 7, -1, 1, -5, -2, -1, -8, 18, -3, 7, 8, -10, 19, 2, -4, 0, -2, -3, 3, 11, 0, 4, 14, 2, 8, -6, -17, 6, -6, -23, -4, -9, -9, -10, -11, -1, -13, -10, -17, -4, -16, 2, 11, -11, -17, -9, -9, 0, -5, -6, 13, 1, 7, -5, -2, 12, 0, 23, 3, -8, -1, 5, 18, 14, 10, 11, 4, 3, 0, 3, 5, -7, 0, -5, 1, -13, 6, -3, -2, 3, 10, 13, 12, 19, 13, -4, 14, 2, 4, 4, -5, 2, 10, 2, 0, 9, 15, -3, -3, 6, -10, -4, -1, -4, 2, -16, -10, 12, -1, 3, 2, 1, 7, -1, 6, 13, -3, 15, 20, 2, 12, 8, 7, 1, 5, 10, 5, 8, 2, -2, -15, -2, -13, -1, -6, -2, 6, -2, 5, 3, -5, 3, 4, -12, -8, -10, -11, -1, 8, 2, 2, -13, -5, 5, -5, -7, -7, 0, 3, 2, 0, -5, 13, 4, -6, 8, 13, -9, 19, -2, -6, -1, 9, -4, -10, 4, -9, 4, 1, 0, 8, 8, 0, 14, -10, 11, -4, -10, -1, 0, 6, 9, 10, -2, 4, 5, 8, 0, -8, 10, 19, -12, 3, -1, -14, -3, -20, 0, -8, -7, -11, -13, 13, 6, -6, -11, -3, 13, 3, 0, 15, -2, -11, 1, 0, -10, -13, 14, 12, -1, -1, -3, 16, 26, 9, 14, 8, 5, 2, 3, 18]
5910A8k1%NJ8j1nqLjM%J4mJ3j0poM%LKNj8OqJ3npJ5j6J0k%LLj9j0J2JQQl%j5O
5955bMOjj8J0j3J2J3oj1J7pMj2JJ7j7K0k5K5k3jJ2j4Qj0J0j1J0qOj0J8pn%KkQ
5994@j2Qp%RoQj3K2k5OOk0K2JjjLlLOoPrk4K6pOJJ7k8K9k2lJ7pkk3K5j9OJ5j5
6037a0J0koJJP%j8%K0k1J5nJ6%j7J3j6K5kqpKPk1JqK5rNJj5J5Jj0jjrJ2jj9J7
6079a2J4pnlJ1k0K4k5J0J2Lj0Qj2J0pjJ2j1%J2oj5J3J%j2lLL%J9qNl0K5j1oQj0
6119b1pL2r%LoJ3lmJ3jPl2PnJ4llqJ0J0j0%J5Jj0JrJ1Nj1J7mK%Jj0kqJ0Oj5J8
6162A5j3%J0l0J0mJ9PrKk9J8KJPrLM%Npkj3MRlJ7rpPqlKJ2oLrLRj1JmMQj1jJO
6210ALj%koKj4J7%Lj6RJ4k0QnjJ1K0k8pRlj2K0j8kjK4lnk0LJ0R%j3lJ3lR%Okj6
$$ y = [18, -3, -3, 2, 20, 9, 4, -4, -1, -2, 2, 2, 16, 12, 25, 15, 8, 2, 6, 6, 9, 11, 16, -2, 4, -4, 9, 4, -3, 12, -4, 6, 4, 4, 7, 10, -9, -19, -7, -6, 2, 10, 7, 7, -8, -2, 2, 8, 7, -11, -1, -14, -2, 11, 5, -6, 11, 4, 8, -4, -3, 14, -3, 17, -8, 17, -6, -7, 5, -9, -1, -11, -1, -12, -2, -10, -4, -14, 4, -3, -8, -8, -6, -8, 0, -12, -4, -11, -11, -2, -8, 0, -13, 9, -16, -10, -4, -24, -2, -1, -2, -3, 0, -3, 0, 6, 0, 7, -2, -26, 0, -7, -1, 0, 17, -11, 18, -4, -7, 10, 3, 1, -22, 3, -16, -10, 5, -10, 0, -2, -8, -7, -6, 1, 1, -17, -17, 3, -18, -3, -8, 8, 8, -9, 4, -12, 13, 11, 3, -4, -2, 5, -16, -15, -23, 2, -7, -2, -1, -16, -1, 0, -10, -11, -12, -21, -9, -10, -29, -12, 2, -5, -10, -13, -2, -22, 2, -23, -13, -1, 2, -8, 0, -12, -2, -9, -10, 2, -9, -9, 3, -3, -18, -5, -4, -4, -16, -19, -16, -13, -13, 6, -2, 3, -27, -2, -13, -19, -11, -21, -28, 4, -5, -5, -2, -8, 5, 2, -2, 11, 10, 17, -15, -8, -13, 1, -2, -5, -13, -3, 7, -3, -3, 12, 13, 3, 4, -5, 6, 11, 0, 17, 13, 15, 15, 16, 6, 4, -4, 6, 12, -3, 15, 2, 2, 12, -18, -8, -12, 7, 14, 5, 7, -22, -4, -2, -1, 6, -3, 0, 4, 4, 9, 2, 0, -13, -9, 0, -3, 14, 5, -2, 5, -3, -6, -4, 8, 2, 5, -4, -1, 8, -3, -2, -6, -2, 6, -5, -6, -5, 1, 4, 3, 3, 1, -5, -3, -17, 0, 0, 3, -13, -4, 10, -10, -2, -7, -8, 3, 23, -5, -12, -3, -6, -18, 2, -16, -18, -19, 5, 2, -3, -23, -20, -10, -1, -1, -14, -17, -4, -7, 2, 2, 8, 6, -10]
6255a0J7j5PNNj4J5jj4K7j9K%PoJ0Pk4NMpLlj2Pj1K3rmlJ0j0oK2j8K5pNk2K1j3
6296aNj2%J4Lk4J4K3k2qQj1J2LlJ3rqkK2k3OJ0j7J6j2pJ7nNoJ0kprljK0k2nK3
6337EloNlJ0j8LkKPnm%JJ0j1kJ1qoJ5j6K2l0K4j2jQnKmJ0Qj2OKmk7L5Qj9jPPl
6382Fqj3PlJ0oK0lj0Mj4J3%kQlpNj0J1%j1K0j9QLj4RpJ0jKNj1k5J2jJ2Q%qpK6
6425A6j4J4rk2J9j5QqLKQlPJrpKQqpJ1j5L8k4J0Mj1Qj1J6k0lK3k3QPj3OrnJ0P
6467@j2nJ6oqK5j4k1J4J9j0kjj5J7PrJ8lj1rQJ1kmj5J5J1k1J4mnK4j6oJ9k5J2
6505Fj4J2NKk1NJ1%kNk7J5lrK0lMrJ4nkKnj2J3Kj2jJ2k0J0%Qj3J5k0K3jj8J1%
6546bJj2J2K0j4Nj1LJ6k1jJ3j2%J0oK1j7j0Rrj1K3kJ3j7jnj6L4j0%j3J0Kjnkj2
$$ y = [-10, 7, -8, -1, 4, 9, -5, 10, 9, -5, 22, 3, 5, 5, 12, 6, 16, 23, -1, 4, 8, 1, 4, 1, -11, -4, -15, 8, -1, -5, -8, 2, -8, -14, 8, -10, 15, 8, 13, -9, 12, -1, 4, -8, -8, 6, 9, -15, -1, 22, 0, -8, 0, -11, 1, 4, 1, 14, 5, -3, -5, 17, -6, 0, 10, -7, 9, -3, -10, 7, 2, 7, 1, 11, 9, 2, -7, -10, -11, 9, -13, -18, 5, 2, -4, 1, -2, 8, -10, -7, -9, -7, 0, -5, -9, -9, -8, 2, -9, -11, 0, -8, -14, 1, -15, 7, -23, 1, -11, -12, -4, -9, -7, -11, -1, 7, -5, 1, 3, -1, -28, 7, 15, -4, -5, 2, 9, 6, -2, -15, -8, -11, -1, -7, 13, 10, 0, 4, -10, 3, 3, 1, 9, 6, -1, 4, -6, 5, 5, -6, 14, -5, 3, 6, -8, 1, -6, 4, 3, 5, 10, -1, -26, -14, -15, -3, 5, 5, -3, -10, 16, 2, 16, 7, -15, 4, -11, -3, -11, -8, -6, 2, -1, 6, 7, -2, -9, -7, 1, -7, -14, -3, -18, 20, -4, 6, 10, -1, 7, -4, 12, -8, -11, 12, -11, -3, 4, -9, -3, -12, -17, -7, 0, -12, -17, -1, -7, -15, 10, -4, -25, -11, 8, -2, -4, -5, -20, -3, 4, -5, 13, 10, -1, -10, -2, 9, 7, 3, -12, 3, 14, -7, 7, 3, -2, 22, 6, 0, 19, -6, 6, -8, 4, 9, 11, -10, -5, 6, 6, 4, 9, -18, -3, -6, -15, 5, 2, 6, -3, 11, 6, 4, 6, 1, -11, 2, 4, -8, -9, 3, -17, -7, -7, 1, -12, 3, -17, 6, 5, -13, -2, -2, -1, -13, -1, 19, 5, 10, -1, 2, 18, -3, -4, 9, -3, -3, 7, 1, 22, 5, -5, 4, -5, -16, 7, 5, 18, 1, 0, -5, -21, 13, 3, 3, -10, 0, 2, 1, -4, -6, -18]
6585a8L2lk5OkJ0pJ2qlJ0J2k8J0k2J6J2pLkNj6OmOLjOpj1K3j2%MJ1rkJ2mJ6j3
6626A1LrJ4k0RMj3lRloQNk0MJ4lnj2K3j0oNJ7l0K4k8J0qJ6QO4n8K9r1j2K9Q3k4
6665B8j19M2M1Q3k0q5K1M2o1L2Jk1J7jKPn9RL0L2k6J6Mj2qjJ6rN%j1jpJ5k6J2
6701a2MJ0j1KNOorKj2K5j0j5L6j5J0j3oNj0QLj1K7Jj0lNj2K0j4j4K1j0QqOJk1
6740a7J0LROk0NJ2lQqkKnmJ4pmrRpkJ2oK0j0lJj5jRjKj3K7nKlj2J4j0JNj0oJ7
6785EKj6L5j8j5J7pkJ2j6J7pj0kKJ1j2MJ1k8K3MJ3l6J7Oqj9J7j0PKMqpJ6lj1J3
6824Cj7J5Mklj2Rk%j3J5KJqJ3j4lJ2oOrLJ4MqJ0rJ5qMk0QPj2J4j9OJ0j4lLJK5
6867B2k5jL%j1OJJ8j3Ljj3K1j2MpKjJ8j2j3PrJ0jMjOrOPj1pmJ0J4j0%NljLJ4j9
$$ y = [-18, 14, 11, -14, -8, -10, 0, -7, 5, -3, -6, 4, 16, -12, -2, -24, -8, 4, -3, 0, -2, 3, -13, -7, -11, -5, -2, -3, 3, -4, -15, 8, -4, -4, 0, 11, 2, 0, 12, 8, 24, 11, 14, 5, 19, -1, 8, 12, -1, -4, 5, 2, -4, 4, 9, -11, -7, 7, 4, -1, -13, 10, 0, -6, -1, 16, -14, 10, -18, -8, -16, 0, 8, 72, 14, 43, -48, -60, -31, 52, 28, -91, -49, -8, 75, 55, -30, -9, 33, -28, 4, 5, -16, 1, 0, 2, 9, -50, -41, -11, 21, -5, 11, 15, 3, -5, -6, 10, 1, 6, 6, -5, -6, -13, 2, -24, -12, -8, 2, -9, -7, -2, 4, -2, -11, -9, -21, 4, -6, -21, 15, 0, 10, -3, -9, -4, -14, -6, -3, -14, 13, 14, 4, 1, 6, -6, 14, 0, -14, 7, -3, 5, -3, 3, 4, -17, -7, -4, 5, 11, -9, -4, 8, 5, 13, 5, 3, 5, 0, -4, 10, 3, -1, -10, -1, -8, -10, 2, -4, 16, 6, 3, 4, -11, -12, -3, -4, -2, -15, 12, 7, 9, 6, -6, 8, -2, -1, 4, -6, -12, 5, 7, -9, 26, 8, -7, 10, 3, 1, 13, -3, 14, 7, -3, -5, -3, 8, -4, 0, 11, -17, 6, 10, 23, -13, 4, 10, 2, -17, 0, -10, -3, -1, 3, -5, -12, 4, 1, -10, 3, -14, 1, 5, 3, 0, -12, -3, -5, -5, -18, -3, -1, 0, -8, 5, -9, -12, 0, -6, 0, -9, -6, 8, 12, 4, 14, 5, 20, 12, 16, -4, 4, 11, -1, 13, -6, 0, 10, -4, -7, -4, -3, 22, -3, -4, -1, -1, -12, -6, -5, 13, 0, 3, 2, -11, 10, -2, 2, -5, -3, -4, 14, 2, -11, -4, -13, -3, -4, 0, -1, 5, -4, 2, 9, -2, -9, -13, -3, 11, 1, 1, 6, 3, 2, 5, 19, 0]
6911@QoKrOnQj0K5qMj1LrnoPLRLm%Pj8PkPplj5J8rj1K6pRj5rK1j0KjMppJ7NoN
6960Fk2K1ll%lJ1k3K2nMqj5J2K4k7%jJ%j4L4rj5J2qJ6j2MpJJ0j2NQj1j6J6j2J6
7000ck0J3MMmJ5j4lokj1K3%nJ2k8J2K0%j4OmPnJ3J2jj4Kj2j%JL%J1pj0jJ3kJ0
7042A4j6J6j5J2j2jJ0J2oj8jrJ3OQk2J2KOj1Mk1K0j3mqK8kj4NKPpk0K4j0j1J5
7080ekQpQJ1kk1lOJ4qJ0%j4OQj9KJ0j5J4oJ2j5OlOpk0J5KQLj1J7j7K1k7QRnMj
7123@JoMj1MK4k4J4nj7NJ2o%LlJ0nJ0k7J1%NrLJ1Rk1K7k9J2j2K9j0Opk0K3%j5
7163dMK6k3j1J7ojj0J8j8KJ4k0J7k9J2LMolJ0mJ0nQkPj4LpJLMj7J0PjRj3Qk3L5
7205A5k0J1j3J6j1j0NJlJ1%j2Qj1J5rnJ1QJ0k8J5jNj8PLj6K1pjKPj2qKONJ3qp
$$ y = [0, 8, 2, 4, -5, 1, -4, 4, -6, 19, 11, 15, 4, 7, -2, -7, -13, -6, -3, 6, 9, 5, 5, 12, -6, 1, -1, 6, -1, -4, -19, -1, -10, -21, 5, -2, 7, -8, -17, 4, -6, -4, -5, -1, -8, -15, 2, 7, 1, 6, -16, 5, 2, -1, -1, -4, 7, -16, 6, 1, 5, -3, -18, -6, 18, -9, -9, -10, -9, -9, -23, 11, 2, -13, -1, -9, 7, -5, -1, -8, -7, 3, -9, -4, 4, -7, -23, -7, -19, -3, -23, -10, -6, -2, -6, 9, -5, -8, -14, -16, -27, -4, -4, -9, 3, -25, -13, 7, 7, -7, -1, -5, 2, -3, 10, 22, 21, 7, 9, -3, -4, -4, -3, 0, 0, 11, 4, -6, -7, 6, 4, 14, -2, 14, -1, 11, -1, -2, 8, 20, 14, -4, -5, -14, -1, 5, 13, -9, 3, 5, 11, 0, 4, -17, 3, -10, -14, -22, 6, 4, -10, -5, -3, 4, -3, -23, 1, -9, -20, -5, -7, 1, -6, 2, 13, 11, -10, -13, -7, 7, -1, 9, 9, -5, 1, 9, -10, -8, 2, -13, 1, -5, 7, -8, -2, -5, 1, -6, -26, -11, -9, -1, 2, -9, 8, -9, 12, -15, -7, 2, -3, 1, 0, 1, -5, -1, -12, -8, 16, -8, 6, 1, -16, -11, 1, -5, -5, -2, -5, 5, 0, 10, -17, -6, -6, -1, -10, -7, 4, 13, -8, 19, -10, 2, -10, 19, 9, 15, 8, -12, 11, 11, -4, 0, 26, 3, -8, 9, 3, 2, -8, 10, -8, -6, 8, -12, 5, -24, -12, -9, -5, -11, -14, -4, -8, 2, -3, 5, 3, 10, -4, -1, -8, -7, -4, 0, -17, -7, 0, -1, 8, -5, 3, -20, 15, -5, 6, -7, 9, -2, -12, -7, -6, -9, 2, 2, -10, -2, -13, 2, -7, -12, -1, 7, 17, -11, 4, 3, 8, -10, -3, 0, -16, 5, -2, -3, -1, 6, -6, -14, -12, -6, -1, 12, 4, -3]
7246clrJ1j5K4Nj9RqJ3Jj9J3J5j2Oj6J7lkQQj9J0j7j1K3k5K9j0%j6K5%J0Okpp
7285A0j7kN%Qj5K7kj9J0Rj6LpJOrMmOk3K1%LkJ0j5qJ0KMj0Q%ORnrj1QPKnkMj0
7331hPJ5k1OjJmJ5j4Rj4J5Nj3jJ5jqp%%oPJ3k7J2J2prJ2okJ1k1J4kJ0l1K1mK1
7372A4l0NJ3rJ5ojmjnMlJJOJ1j1Pj3J1mnJ3lmj1K7j8J1l6K4jrJ5j5QkKkJ1qJ6
7414A4k1J2qkJ5j7K4k0J7qj2KjJ7j1mq%J1K%j3K3j9NNqqJRMlQ%j2KJ0J0rjLmo
7457aJ4k3ROLk0MnK2kj7NoJ3mk2J6jkjp%NplPJ9mpjPQjj5J2j4JKQLj7KJ7j1qK9
7503A3k2J4klNj0Nj0RRnK%K0k3J0j8NJ4oRj2LNj3J3k2J5j1J0poJ5plNNj0KJ0q
7544@j3LJ2kMojjNMrMKj5J1Okj6K7j0j1OPqK1k5%j2K6j5MkOnPKj1nOJ5qJ0j6L
$$ y = [-3, -6, -15, -4, -19, 5, 10, -9, 0, -8, 5, 6, -13, 0, 15, 3, 9, -7, 10, 7, 5, 13, 21, 2, 12, -5, -16, 7, -18, 11, 1, 1, -15, 10, 10, 20, 26, 24, 17, 10, -7, -9, -4, -4, 4, -11, 16, 14, -5, 5, 14, -2, 1, -6, -5, 1, -8, -4, -8, -2, -25, -4, -4, -1, -3, 7, -8, -16, -6, -4, 0, -10, -2, -2, 4, 13, 8, -1, -12, -4, 3, 5, 0, -2, 2, -8, -1, 14, -7, -1, -2, -1, -5, 10, -4, 5, -9, 6, 11, -2, -3, 12, 11, 3, -4, -4, -4, -10, -3, 10, -17, -5, 7, 0, -9, 3, -3, -5, 6, -15, -1, -3, 7, -24, -3, -7, 14, -16, -11, 2, -7, 8, 2, 1, -3, -4, -9, -5, -8, -7, -6, 0, 11, 0, 7, -6, 5, 1, -4, 9, 6, 2, -9, 18, 0, 11, -25, -1, -2, -11, 4, -11, -3, -5, -3, -5, 6, -2, 14, -7, 5, -3, -5, 10, -7, 17, -3, 14, 6, -6, -4, -5, 12, 1, -3, -11, -11, 0, 2, 2, -11, 12, -7, -2, 3, -5, -13, -12, -3, 1, -2, 6, 6, -6, -4, 6, 16, 7, 6, 9, 5, -1, 13, -10, -1, 5, 8, -12, -8, -13, 9, 7, -10, -5, -11, 2, -2, -24, -8, -9, -11, -12, -19, -19, -14, -21, -24, -17, 2, -2, -9, -10, -3, 5, 4, -11, 1, -13, -12, -10, -2, 1, -16, -14, 3, -8, -16, 13, -9, 5, 3, 0, 5, -5, 0, -10, -1, 8, 3, 5, 5, 25, 2, 12, -6, -1, 13, 7, 16, 4, 7, 12, -1, 12, -10, 5, -6, 4, -3, -9, 6, -1, -4, 1, 6, -4, -2, 8, 0, -13, -10, 2, 0, 4, -2, -3, -4, 1, 5, -4, 0, 2, -13, -2, 4, 2, -14, 13, 3, -8, -2, 5, -3, 18, -7, -7, -19, 7, -8, -4, -6, 0, -5, 2, 4, -7, -12, -6, 9, 1, 11, -5, -2]
7588bLJ8%j6Lj3J3j3oO%JpK5k1RllJ6j0JoKPj7K5qj0oJ0llLJ6mj8K2k1J2loL1
7630B4l1J1j1J3rQn%p%KqKKqK2j1OPj2PoqK4kj2Mj7K1%J0j2j1jkJ7j0J8Jj0j2
7671fQnMk4J4KnQj1QRlqnJ4jK1j3l5L5LJj2Qj5KnJ1j4K1Ok3%J5j8JJ8pOqmkMJ3
7715Hj6MPqQmlOj0J4j1KmJ5%jlrMOrJk3K2LLPk4K0j6LJ4JkRj6LpJ0j2JJ0QoRj5
7761alJ5j9J1oJ0j1J4rKKj9J3j5j3J9J1kMLj3m%J6%Qj7PkNj4J0j1lJ0oMnMkJ7
7802A0nj3QJjJ3j6ljJ6k1OJ3mMqqJ8pQnrpJ4j1kPkj8L5j1Nk5J0j0J1Ok1J8qL%
7844a0mK5k3kN%jnNkK0Jj2LJjQk2J5oJ4k1K2MpqoJ4rk8L1Lj8K1k3kJ3RrLnmJJ1
7888AqMk1K8Jk0J5k0J4Kj7RJ3nj%jKLkoj3L1j6kJ1J5j0j3NpOMJ6kj6nRj0LMMq
$$ y = [-2, 1, 19, 19, 3, 6, -7, 6, -7, -13, -7, -7, -6, -13, 12, -9, 0, -3, -6, 10, 0, 1, -5, -3, 4, -13, 12, 4, -6, -12, -2, -5, -8, -5, 11, 7, -11, 11, -10, 2, -1, -7, 24, -7, 4, -7, 6, -3, 5, 0, 0, -7, -7, -5, -13, -11, -9, -17, 5, -6, 0, 7, -5, 2, -4, -12, 12, 10, -2, 2, -15, 6, 6, 16, 4, -7, -8, -10, 7, -3, 15, 16, 6, -6, 2, -3, 1, -23, -9, -7, -12, -4, -15, -7, 2, -1, -9, -14, 0, -1, 20, 7, -28, 7, 10, 11, -1, 7, -8, -6, -11, 0, -14, 7, 13, -10, -10, 5, -13, -12, 6, -1, 5, -3, -7, -9, -5, 8, -8, -4, 3, -5, 3, -1, -4, 2, -8, 6, -5, -3, -7, 8, 8, 7, 4, -5, -1, 5, -4, -3, -26, -4, -1, 2, 9, -15, 5, -11, -8, 6, 7, 5, 14, -2, 1, -6, 4, -8, -7, 3, 11, 5, 14, -1, -4, 11, -8, 3, -3, 7, -4, 10, 1, 3, 5, -14, -1, -16, -29, -10, 1, -1, 3, 6, -7, -11, -11, 5, 5, 13, -4, 3, 1, 6, -8, 2, -9, -12, -2, -8, -4, -9, -5, -7, 10, 5, -8, 0, 1, 0, 13, -3, -6, -7, 9, -12, -6, 7, 3, 7, -1, -9, 9, 2, 10, 5, -4, -11, 3, -8, -10, -3, -5, -23, 12, 1, 6, -19, -9, -19, -8, -2, -23, -5, -13, -10, -10, -14, 11, -12, -14, -9, -9, -10, -15, -10, -12, 8, 9, -3, 0, 1, 0, 8, -14, 1, -5, 9, -12, 10, 14, 7, -1, -7, 7, -2, -30, 1, 4, -14, 7, -16, -18, -5, 4, -5, -2, -7, -11, -10, 1, -7, -3, -24, 4, 5, -15, 0, -20, -6, -4, -21, -12, 1, -4, -5, -5, -6, -4, -1, -3, -9, -22, 9, -7, -9, 2, 17, 7, -6, -1, -8, -2, 2, 18, 16, 0, -5, 4, -6, -3, 1, 5, -3]
7931cQOj7KPj4K1l0J6rOPJ0LnrJ9j4k0J6kpPQlQk6J6j1J4j8K5okjJ3j1Ok3MRj7
7973a7K1nqj5K1LRkrP%J0j5MjnJ0qOnoKj5K2k0J8j2mJ1jmqJ9r%llLMm%Lj1J9j0
8018hj1RK1j2k%lJ2Oj1rJ3k1K4j2J2koPj9J6oJ2qJmpK3j4J0k0PJ4Jj1mPmKRj7
8059epNJ4Lj9QoJ2j3J0kmj2QlJ2k4J0PknK0mmRk3K1j0OlJ7j5j2JMkJ1Qj3Qk1J4
8101akmJ8Lk8J2NrRrJ1LoKj3J0LpNojLj0J5oJ3qkjlJrRJ3npj7PK0j5PrJ2j5J0
8146bJ4j7J4lj%j2QloJ2j4K4j2J2j1jpKjK7j4oRJj5JMKj6ORJ2l0K2j7pJ8lkm%
8188gkJ3o
$$ y = [-3, 5, 11, -6, -4, 3, -11, 10, -20, -4, -13, -7, 0, 10, 13, 8, -1, 18, 4, -16, 0, -2, -9, -2, 6, 3, 11, -15, 1, -10, 4, -14, 11, 5, 3, 2, 15, 4, 10, -13, -9, 0, -17, 4, -1, -9, -24, -3, 0, 9, 7, -2, 5, 5, 15, 0, 4, 3, -2, 8, 0, 6, 1, -5, -3, -18, 4, -16, 2, -10, -14, -3, -4, -8, -16, 3, -6, -6, -9, -12, -9, -5, -9, -9, -6, -17, 2, -8, -19, -10, 11, -1, -3, -3, -6, 6, 12, 1, -8, 5, -16, 8, -4, 8, 6, 0, 7, -12, 4, -2, 10, 2, 3, -1, -8, 15, 1, 11, -9, -2, 12, 13, 2, -2, 5, 1, 3, 12, -5, -12, -7, 7, 10, -9, -1, -7, 5, -8, 2, 0, -4, -16, -8, -11, 1, -23, -13, -6, -8, -13, 7, 3, -1, 8, -15, 6, -4, 2, -1, 16, 1, -11, -10, -6, -8, 3, 11, -2, 6, -15, -1, -3, -7, 11, 14, -14, -2, 3, -6, 3, -6, 5, 8, 2, 4, -9, 1, 4, -3, 2, -4, -5, -2, -12, 3, -3, 10, 2, 0, -1, -4, -3, -12, -3, 10, 5, -2, -19, -12, 8, -7, 0, -9, 3, -12, -2, 12, -5, 9, 6, 5, 5, -7, 1, -2, -8, 4, -10, 14, 2, 14, 3, 2, -5, -3, -4, 23, 9, 3, 12, 13, -2, -1, 3, 5, -11, -5, 4, 16, -14, 8, -9, -16, 2, -1, -3, -7, -7, -9, 4, -2]
8191b
##END NTUPLES=NMR FID
##END=
