##TITLE=1H_DPAH6-11
 CDCl3
 8 sc, 
 11.03.2022
##JCAMPDX= 6.0         $$ Bruker NMR JCAMP-DX V2.0
##DATA TYPE= NMR FID
##DATA CLASS= NTUPLES
##ORIGIN= UXNMR, Bruker Analytische Messtechnik GmbH
##OWNER= root
$$ XWIN-NMR		Version 3.5
$$ Fri Mar 11 10:54:16 2022 Russian Standard Time (UT+4h)  she@DPX200
##.OBSERVE FREQUENCY= 200.131346
##.OBSERVE NUCLEUS= ^1H
##.DELAY= (6, 6)
##.ACQUISITION MODE= SIMULTANEOUS
##.ACQUISITION SCHEME= undefined
##.AVERAGES= 8
##.DIGITISER RES= 18
##SPECTROMETER/DATA SYSTEM= spect
##.PULSE SEQUENCE= zg30
##.SOLVENT NAME= CDCl3
##.SHIFT REFERENCE= (INTERNAL, CDCl3, 0, 15.7039)
##AUDIT TRAIL= $$ (NUMBER, WHEN, WHO, WHERE, WHAT)
$$ ##TITLE= Audit trail, XWIN-NMR		Version 3.5
$$ ##JCAMPDX= 5.01
$$ ##ORIGIN= Bruker BioSpin GmbH
$$ ##OWNER= she
$$ F:/spectra/data/she/nmr/H-F/1/audita.txt
$$ ##AUDIT TRAIL=  $$ (NUMBER, WHEN, WHO, WHERE, WHAT)
(   1,<2022-03-11 10:53:09.89 +0400>,<she>,<DPX200>,
      <created by zg, POWCHK disabled, PULCHK disabled
       configuration hash MD5:
       00 E9 B6 7A A2 85 ED C7 34 08 36 98 17 FE 4E 26
       data hash MD5: 16K
       B5 01 37 16 87 F0 DC E5 BC 8D 80 6A 12 F9 15 04>)
$$ ##END=
$$ 
$$ hash MD5
$$ D7 FC D7 25 FD 35 02 8E 9E 48 C9 D5 61 8F A3 C2
##$RELAX= 
##$RELAX= 
##$RELAX= 
##$RELAX= 
##$RELAX= 
##$RELAX= 
$$ Bruker specific parameters
$$ --------------------------
##$DU= <F:/spectra>
##$EXPNO= 1
##$NAME= <H-F>
##$PROCNO= 1
##$TYPE= <nmr>
##$USER= <she>
##$AMP= (0..31)
100 100 100 100 100 100 100 100 100 100 100 100 100 100 100 100 100 100 
100 100 100 100 100 100 100 100 100 100 100 100 100 100 
##$AQSEQ= 0
##$AQ_mod= 1
##$AUNM= <au_zg>
##$AUTOPOS= <>
##$BF1= 200.13
##$BF2= 200.13
##$BF3= 200.13
##$BF4= 200.13
##$BF5= 200.13
##$BF6= 200.13
##$BF7= 200.13
##$BF8= 200.13
##$BYTORDA= 1
##$CFDGTYP= 0
##$CFRGTYP= 5
##$CHEMSTR= <none>
##$CNST= (0..31)
1 1 145 1 1 1 1 1 1 1 1 1 1 1 1 1 1 1 1 1 1 1 1 1 1 1 1 1 1 1 1 1 
##$CPDPRG= <>
##$CPDPRG1= <>
##$CPDPRG2= <>
##$CPDPRG3= <>
##$CPDPRG4= <mlev>
##$CPDPRG5= <mlev>
##$CPDPRG6= <mlev>
##$CPDPRG7= <mlev>
##$CPDPRG8= <mlev>
##$CPDPRGB= <>
##$CPDPRGT= <>
##$D= (0..31)
0 1.2 0 0 0 0 0 0 0 0.06 0 0.03 0 0 0 0 0.0002 0 0 0 0 0 0 0 0 0 0 0 0 
0 0 0 
##$DATE= 1646981589
##$DBL= (0..7)
120 120 120 120 120 120 120 120 
##$DBP= (0..7)
150 150 150 150 150 150 150 150 
##$DBP07= 0
##$DBPNAM0= <>
##$DBPNAM1= <>
##$DBPNAM2= <>
##$DBPNAM3= <>
##$DBPNAM4= <>
##$DBPNAM5= <>
##$DBPNAM6= <>
##$DBPNAM7= <>
##$DBPOAL= (0..7)
0.5 0.5 0.5 0.5 0.5 0.5 0.5 0.5 
##$DBPOFFS= (0..7)
0 0 0 0 0 0 0 0 
##$DE= 6
##$DECBNUC= <off>
##$DECIM= 32
##$DECNUC= <off>
##$DECSTAT= 4
##$DIGMOD= 1
##$DIGTYP= 9
##$DL= (0..7)
0 120 120 120 120 120 120 120 
##$DP= (0..7)
150 150 150 150 150 150 150 150 
##$DP07= 0
##$DPNAME0= <>
##$DPNAME1= <>
##$DPNAME2= <>
##$DPNAME3= <>
##$DPNAME4= <>
##$DPNAME5= <>
##$DPNAME6= <>
##$DPNAME7= <>
##$DPOAL= (0..7)
0.5 0.5 0.5 0.5 0.5 0.5 0.5 0.5 
##$DPOFFS= (0..7)
0 0 0 0 0 0 0 0 
##$DQDMODE= 0
##$DR= 18
##$DS= 0
##$DSLIST= <SSSSSSSSSSSSSSS>
$$ [...]
##$SUBNAM2= <"">
##$SUBNAM3= <"">
##$SUBNAM4= <"">
##$SUBNAM5= <"">
##$SUBNAM6= <"">
##$SUBNAM7= <"">
##$SUBNAM8= <"">
##$SUBNAM9= <"">
##$SW= 18.0517287032376
##$SWIBOX= (0..15)
0 0 2 0 0 0 0 0 0 0 0 0 0 0 0 0 
##$SW_h= 3612.71676300578
##$TD= 16384
##$TD0= 1
##$TE= 0
##$TE2= 300
##$TE3= 300
##$TEG= 300
##$TL= (0..7)
0 120 120 120 120 120 120 120 
##$TP= (0..7)
150 150 150 150 150 150 150 150 
##$TP07= 0
##$TPNAME0= <>
##$TPNAME1= <>
##$TPNAME2= <>
##$TPNAME3= <>
##$TPNAME4= <>
##$TPNAME5= <>
##$TPNAME6= <>
##$TPNAME7= <>
##$TPOAL= (0..7)
0.5 0.5 0.5 0.5 0.5 0.5 0.5 0.5 
##$TPOFFS= (0..7)
0 0 0 0 0 0 0 0 
##$TUNHIN= 0
##$TUNHOUT= 0
##$TUNXOUT= 0
##$USERA1= <user>
##$USERA2= <user>
##$USERA3= <user>
##$USERA4= <user>
##$USERA5= <user>
##$V9= 5
##$VALIST= <valist>
##$VCLIST= <CCCCCCCCCCCCCCC>
##$VD= 0
##$VDLIST= <DDDDDDDDDDDDDDD>
##$VPLIST= <PPPPPPPPPPPPPPP>
##$VTLIST= <TTTTTTTTTTTTTTT>
##$WBST= 1024
##$WBSW= 4
##$XGAIN= (0..3)
0 0 0 0 
##$XL= 0
##$YL= 0
##$YMAX_a= 639166
##$YMIN_a= -573498
##$ZGOPTNS= <>
##$ZL1= 120
##$ZL2= 120
##$ZL3= 120
##$ZL4= 120
##$ABSF1= 10
##$ABSF2= 0
##$ABSG= 5
##$ABSL= 3
##$ALPHA= 0
##$AQORDER= 0
##$ASSFAC= 0
##$ASSFACI= 0
##$ASSFACX= 0
##$ASSWID= 0
##$AUNMP= <proc_1d>
##$AZFE= 0.1
##$AZFW= 0.1
##$BCFW= 1
##$BC_mod= 2
##$BYTORDP= 1
##$COROFFS= 0
##$CY= 11.3945322036743
##$DATMOD= 1
##$DC= 2
##$DFILT= <>
##$DTYPP= 0
##$F1P= 2.36226072786647
##$F2P= -0.459571619588291
##$FCOR= 0.5
##$FTSIZE= 0
##$FT_mod= 4
##$GAMMA= 1
##$GB= 0.15
##$INTBC= 1
##$INTSCL= 1
##$ISEN= 128
##$LB= 0.24
##$LEV0= 0
##$LPBIN= 0
##$MAXI= 10000
##$MC2= 0
##$MEAN= 0
##$ME_mod= 0
##$MI= 1.114404
##$NCOEF= 0
##$NC_proc= 0
##$NLEV= 6
##$NOISF1= 3.799351
##$NOISF2= 2.8
##$NSP= 1
##$NTH_PI= 0
##$NZP= 0
##$OFFSET= 15.70392
##$PC= 1
##$PHC0= -16586.3
##$PHC1= 11.60078
##$PH_mod= 1
##$PKNL= yes
##$PPARMOD= 0
##$PSCAL= 0
##$PSIGN= 0
##$REVERSE= no
##$SF= 200.130013532006
##$SI= 16384
##$SIGF1= 3
##$SIGF2= 2
##$SINO= 400
##$SIOLD= 16384
##$SREGLST= <1H.CDCl3>
##$SSB= 0
##$STSI= 0
##$STSR= 0
##$SW_p= 3612.71676300578
##$SYMM= 0
##$S_DEV= 0
##$TDeff= 0
##$TDoff= 0
##$TI= <>
##$TILT= no
##$TM1= 0
##$TM2= 0
##$TOPLEV= 0
##$USERP1= <user>
##$USERP2= <user>
##$USERP3= <user>
##$USERP4= <user>
##$USERP5= <user>
##$WDW= 1
##$XDIM= 8192
##$YMAX_p= 0
##$YMIN_p= 0
$$ End of Bruker specific parameters
$$ ---------------------------------
##NTUPLES= NMR FID
##VAR_NAME=  TIME,          FID/REAL,        FID/IMAG
##SYMBOL=    X,             R,               I
##VAR_TYPE=  INDEPENDENT,   DEPENDENT,       DEPENDENT
##VAR_FORM=  AFFN,          ASDF,            ASDF
##VAR_DIM=   8192,          8192,            8192
##UNITS=     SECONDS,       ARBITRARY UNITS, ARBITRARY UNITS
##FACTOR=    0.0002768,     1,               1
##FIRST=     0,             0,               0
##LAST=      2.2672688,     0,               0
##MIN=       0,             -573498,         0
##MAX=       2.2672688,     639166,          0
$$ Real data points
##PAGE= N=1
##DATA TABLE= (X++(R..R)), XYDATA
0@%%%%%%qQqJ6j6K4l2M0n6P2q8J12j36J60j92K32k80L28l84M49n22O06p02Q08
30D31r25J055j199J362j540J735j952K192k454K740l052L394l768M176m623N111
46B683n642O223o861P561q329R174j0111J1151j2312J3619j5098J6787j8742K1031
60A1134k3752K7056l1169L6451m3519N3524o8899R5838j56854N49193J67004m01253
72B14754L89513l07001p4842J67353l88699m49234K87738q6304k60901K28110
82b79513M2483l36468K06233K55367o4270J63311J93338j70164J02918K56519
92C69754j15491j49442O8040l0957k0282P437j17287n1506P7542k8846k9618R611
104a1045n0198J1283K1706j06959K3741R8235j18811p3547P9247o0717L576J50240
$$ y = [0, 0, 0, 0, 0, 0, 0, -8, 0, -8, 8, -8, 16, -16, 24, -32, 40, -48, 64, -72, 88, -104, 128, -152, 176, -208, 241, -281, 325, -377, 431, -494, 561, -638, 724, -816, 919, -1033, 1159, -1295, 1445, -1607, 1787, -1981, 2195, -2428, 2683, -2959, 3264, -3597, 3964, -4365, 4809, -5302, 5849, -6463, 7156, -7942, 8845, -9897, 11134, -12618, 14438, -16731, 19720, -23799, 29725, -39174, 56664, -100190, 449003, 616007, 214754, 604267, 297266, 222424, 389777, 1078, -448156, -160418, -246722, -507623, -279513, -237030, -573498, -367265, -111898, -176168, -12857, 180481, 10317, 113235, 369754, 254263, 104821, 172861, 141904, 121622, 129059, 11772, -39734, 37808, 8962, -20656, -11045, -61243, -49960, -28254, -135213, -111472, -13237, -132048, -205595, -126348, -187065, -183489, -33249]
116c3249o6180l8165K39681L7021j02652J81438Q9171j43741N5390L7485j64110
127I2089M5305N2362k52987q0464J14079j22747q6506Q0858r9075m4361J92620
138a08827J8746m9799J75346O5127p6450J06858P8996o5071L9239m310j27213
149E2642L6396N0387j37087l8242N0178q6266k9863M8963p5410n410J21974l1305
161d3043o4402P7226J0792k3060Q2372n655o9456O2430K3929n8777O9521N5760
173A17637r0741j5180M9752l5531K931L5222o6991l6469M7194j8122l9025J0984
185c8339k0439j7132K5780j1609j0652M5796K1880k206K3578P560M964K4823p778
198D6226j956K6322k8895k7305L7161j2711m2191J9592k2094n6829L5854K0961
$$ y = [-33249, -99429, -137594, 102087, 139108, 36456, 217894, 307065, 163324, 218714, 256199, 92089, 137394, 189756, -63231, -143695, -29616, -152363, -238869, -158011, -257086, -301447, -108827, -90081, -139880, 35466, 100593, 24143, 131001, 209997, 144926, 184165, 179855, 52642, 89038, 139425, 2338, -35904, 14274, -71992, -101855, -52892, -128302, -133712, -11738, -43043, -107445, -30219, -19427, -42487, 39885, 34230, -35226, 27204, 51133, -7644, 61877, 117637, 26896, 11716, 61468, 25937, 28868, 64090, -2901, -39370, 7824, -10298, -49323, -38339, -58778, -75910, -50130, -61739, -72391, -26595, -4715, -6921, 16657, 24217, 29181, 54004, 46226, 44270, 70592, 41697, 14392, 51553, 38842, -3349, 16243, -5851, -62680, -26826, -5865]
210e865n5435J4885L2644m2087J9583N0261m6687l960O3766l1203j8773P3555
222E0684j1407m5043N5807Q414n6128K9725J8501n7456Q985K6517m7716j851L1474
235A0506m2388j2704M0119k5849j9984M3949l519k3429L6241J2041k4802J7940
247H121J5120k1483N258J6184j0026M950O055j9499M062J5697j9188j4064P806
260a007q888r083J1593L895p808q2p4k276N997N258m464m414j05J0054J9553P583
276B5732q759l857N284M425m362p102l819j1153j4654M764J2111m354r169j787
290a6700j219P187J7197J208j3377j74R575Q410R712k582j1441J954L179p806
304E123K917L940k0680k0783O685R843l522l356l905l604J1046J5529K453m885
$$ y = [-5865, -61300, -46415, -13771, -55858, -36275, 13986, -32701, -36661, 27105, -4098, -22871, 50684, 39277, -5766, 50041, 58455, 2327, 32052, 50553, -6903, 2082, 28599, -19117, -20968, 10506, -31882, -44586, -4467, -30316, -50300, -6351, -9870, -33299, 2942, 14983, -9819, 8121, 23241, 1758, 7016, 23200, 13174, 18124, 24179, 4680, 8742, 24439, 5251, -8813, -1007, -9895, -18978, -7385, -3490, -11298, -11380, -11454, -13730, -7733, -2475, -6939, -11353, -11458, -1404, 18149, 25732, 16973, 13116, 18400, 22825, 18463, 11361, 7542, -3611, -18265, -13501, -1390, -5744, -14913, -16700, -17919, -10732, 6465, 7673, -5704, -5878, 3697, 12107, 21819, 19237, 7796, 9750, 12929, 5123, 8040, 11980, -8700, -29483, -22798, -12955, -16477, -19833, -23738, -27342, -16296, -767, 1686, -3199]
318c199k721o43O463J0490L528j556R72r38K89J1853O849j7854k0026N87M392
333a514n131m807m490p426K083J1296P090M93j985l567K029R303O166J915Q30
348A2285k467K740J5479R997j0824j1623J323j138q754l534k873j1976q111M319
362a5157L154k265q76n046m156P612O325j126O040L405l083J3542J6637p975m983
377A2048J1103p285j2992R881l182k2879k078J877j0341O743O897j3685L553J5147
391e193n539M818J8458j0291j0148J9938L135j2637J0687J980j7013L590O957
404H742j0783k026K609m040M806M396m722N010O593n334k89K552o675k397k76
419a834l216O707k080j2991J2022J1468j3611Q758J5333j8231K754K3934j8766
$$ y = [-3199, -5920, -6563, -100, 10390, 13918, 12362, 13334, 12396, 12685, 24538, 31387, 13533, -6493, -5906, -1514, -6645, -11452, -15942, -23368, -21285, -9989, -2899, -2406, -4391, -7958, -5929, 3374, 9540, 11455, 12285, 9818, 12558, 28037, 38034, 27210, 15587, 16910, 15772, 7018, 3484, 611, -11365, -19476, -15157, -12003, -14268, -15144, -20190, -24346, -16734, -10409, -11535, -5495, -2090, -5173, 8369, 25006, 17031, 12048, 23151, 15866, 2874, 12755, 9573, -13306, -15384, -13507, -23848, -17105, -10208, -23893, -20340, -5193, -10732, -5914, 12544, 2253, -7895, 12043, 15178, 2541, 13228, 15208, -1805, 1785, 8742, -2041, -4067, -1458, -5498, -692, 3704, -1018, 3992, 10585, 5251, 4962, 7514, 839, -1558, -1834, -5050, 1657, -423, -13414, -1392, 10076, -3535, 5223, 20556, 2325, 5079, 29013, 10247]
432A0247j4973J9994j3151k3082J6034q945k2918K4144Q06k9370K7257K1790k6329
445a8496J9050L0448k6018N372L4731j9327r792K1673k6209k1629K6426j2875
457C354k6335J3748j6902k0536L6763J725l2713K5715J7516k1724K2318J6682
469A9611k6056J8561K4186l1441K022J9589l1735N970L9075l4222k5568K9593
481I585j7377j0608M9687j4893n3862K1309J7315j5878K6088k042n1572J4446
493b7802L5042k0092P450K0893l2019O62M1837q489j3500J6168j1862n352K2950
506B5886j0181j9461N581n778N860J8577k8848k2618K7164j52o728K4711k4581
519a0568k9205M3509J0419k6615L1499o716n2587M4471L8160n6644J1700L6027
$$ y = [10247, -4726, 15268, 2117, -20965, -4931, -13876, -36794, -12650, -11844, -41214, -13957, 7833, -18496, 554, 31002, 4984, 10356, 45087, 25760, 15968, 37641, 11432, -10197, 16229, 3354, -22981, -9233, -26135, -46671, -9908, -8183, -40896, -15181, 2335, -19389, 2929, 19611, -6445, 12116, 36302, 4861, 6883, 26472, -5263, 707, 39782, 5560, -20008, 9585, -7792, -18400, 31287, 16394, -37468, -16159, 1156, -14722, 11366, 9324, -42248, -27802, 7240, -12852, -5402, 15491, -16528, -15866, 25971, 17482, 3982, 20150, 8288, 2936, 25886, 15705, -3756, 1825, -3953, 1907, 20484, -8364, -30982, -3818, -3970, -10698, 14013, -10568, -39773, 3736, 14155, -12460, 19039, 12323, -40264, 4207, 42367, -14277, -2577, 33450]
531C3450o2972P262P8205m6267l8913O2513k6555m4765P0248m513p2297M3897
543g07J5632o9645M2738N1429o8582M762N8578n0252q247P2928l0908m5549M4620
556A6797p599l3288M4735M674m7479J7778J6101k7935J1907R790k9407R327K2587
569G988j2637J049Q108l808J6568O812j7561J27j0536j6530L4193J2151m5246
582a9322j228J6759k1280K8552L4710n4738k0366M5377j3075m157M4393l4899
594G26l9950N1482J927l5704M4076L004o1696K9133L6391m3783R762L1159m2413
607a5886M678M2235l5461q679M6537k1405k1911K7509k7913k1067M7356r780m0282
620c4069L0247L975k7195L6539J2214l5707K1514O913l8358L3674L1038m7392
$$ y = [33450, -29522, -22260, 55945, 9678, -29235, 33278, 6723, -38042, 32206, 27693, -44604, -707, 14925, -54720, -11982, 39447, -29135, -24373, 34205, -16047, -24294, 48634, 17726, -27823, 16797, 9198, -24090, 20645, 25319, -22160, -4382, 11719, -16216, -4309, 5481, -23926, -14599, 7988, -4649, -3600, 4508, 700, 17268, 24080, 6519, 6646, -3890, -20420, 13773, 25924, -19322, -20550, -3791, -25071, 3481, 38191, -16547, -36913, 8464, -4611, -8768, 35625, 726, -39224, 12258, 14185, -21519, 22557, 25561, -36135, -7002, 29389, -14394, -4632, 26527, -15886, -11208, 31027, -4434, -13113, 33424, 12019, -9892, 17617, -10296, -31363, 15993, 6213, -34069, -3822, 153, -27042, 9497, 21711, -13996, 7518, 14431, -23927, 9747, 40785, -6607]
632f607N393L2680l6022M304L7171m6233j9268M9677k3780l3916M0395m548k8186
645b8940L7284l902l8691L5663J4440m1417K1933K7991l4349J440K4830j9606
657c324K619J8889k7367q074K7383l615o347N717j5996M861K1094j8307q011J8720
671H242j3187n956K1479r695k777J9823k7403j7375M1081m652l1863K7680K683
684H080k9157L5273J1995m8029K0943L2823m5513k817M0322k5280o253L6933k8373
697I47k1324M3772j5160l9275L9791J2132m1230J6264J9437k7872J3610K1674
709B2766l7964q858L1636j1122j3022K0999k690r558J4426o042j2936J9044N542
722A2221k1210J449J5714P48r97P36m284r67m45n336k131J358K207J002o618j289
$$ y = [-6607, -1214, 31466, -4556, -252, 36919, -9314, -28582, 21095, -2685, -36601, 3794, -754, -28940, 8344, 4442, -34249, 1414, 15854, -25563, -3630, 24361, -9988, -8548, 16282, -3324, -705, 18184, -9183, -17257, 10126, 6511, 164, 5881, -10115, -5254, 15840, -2467, -10478, 8242, -4945, -10901, 10578, 883, -1894, 17929, -9474, -26849, 14232, 9580, -22283, 5397, 8080, -21077, 14196, 26191, -21838, -895, 31928, -13585, -16402, 23920, -1360, -7613, 29320, 947, -20377, 23395, 8235, -31040, 8751, 20883, -20347, -4083, 15354, -12518, 1092, 22766, -15198, -24056, 7580, -3542, -16564, 4435, 1745, -7813, 6613, 571, -12365, 6679, 12221, -8989, -7540, 8174, 8922, 7925, 8661, 4377, 3410, 2965, -2371, -4502, -3144, -937, 65, -6553, -7842]
738g842J1267J28j2598j939N023L038M420l113m855J1934O487j3110j793R088
752F135n191l991O270k832L23R820n017q695P260J160r410k392k26J543Q730j969
768A518j0586O185R884q275n518M963j248r82L337r96K976O789m028o024L707
783A702K797p35J249l290l322P456M525q432k648N681k647n419J783L702Q12k334
799H80m134o90L452j76o185k497L490K644L003L725j701k159L786M1o175m70M669
816A503k658l399O712O516j936k729k795k327K267j824o000J12L154o73K237N037
832C197l445m272K817l10m818L432L731m565O7O715K614q12l01k207r1L140j091
849C801l107K138k09m717L212M361n869k319N064j513l242M720m09p005J036K698
$$ y = [-7842, 3425, 3553, -9045, -10984, -5961, -2923, 1497, -1616, -6471, 5463, 11950, -1160, -2953, 6135, 944, -3047, 3223, 391, 714, 10534, 5517, -3178, 4082, 5242, -4168, -6560, -6786, -5243, 3487, 1518, -9068, -2883, 7001, -1274, -6792, -1829, -3077, -4059, -722, -1718, 1258, 8047, 4019, -2005, 1702, 4499, 3764, 5013, 1723, -1599, 5857, 10382, 1950, -698, 4983, 2336, -3083, -1300, 2402, 3214, 880, -3254, -3944, -492, -668, -6853, -9350, -5860, -3216, -213, 3512, 1811, -348, 3438, 3479, -2696, -3166, 1503, -1155, -4554, 2158, 8674, 6738, 4009, 1214, -1113, 1154, -670, -6670, -6558, -3404, -4077, -1840, 3197, -248, -4520, -1703, -2013, -6831, -3399, 332, -4233, -4166, 2549, 5163, 4351, 4050, 1843, 1752, 4892, 3801, 694, 2832, 2623, -2094, 1118, 5479, -390, -2709, 2355, 842, -2400, 2320, 1911, -5094, -4058, -1360]
865a360k679J024K260l592K704N607k988n43M217n142l680P578Q64o930L392M740
881E472l359P05K781m072k450K91k600Q34K237k640J22L397l40o48K273k013l005
898c015J793J667r76j798n4L780N23n039J264M604l337k027M957p25j324L631
914C924j669k811M646p52m493L233r36m561N475k3q179M709L214j0099P19Q430
930H27l530j346K523m356L478Q818o925l389P617n159k121J2368m052q766R848
945E835j132r515J0928L277j3307L754M304q527P328N521j6365J983J3499j2926
959e343m219J5274q067q322J3686l752r119J3408J111j2038Q044M759p861P969
973E530M588j0827N674O985j1788J236Q273r311l284M900n269P62K681q636K131
$$ y = [-1360, -4039, -3015, -755, -4347, -1643, 3964, 976, 433, 4650, -492, -4172, 3406, 4270, -2660, 732, 5472, 2113, 2818, 5599, 1527, -923, -632, -3232, -2398, -161, -2801, -2679, 718, 378, -270, 2003, -10, -3015, -1222, 445, -531, -2329, -2383, 1397, 1920, -3119, -1855, 2749, -588, -2615, 2342, 1617, 293, 3924, 2255, -556, 4090, 3338, -1155, 2078, 1142, -3419, 2056, 2033, -6146, -1437, 1777, -8322, -7603, 827, -2703, -4049, -1526, -5882, -2404, 6414, -511, -3900, 3717, -1442, -3563, 8805, 4753, -4013, 5835, 4703, -4812, 6116, 9393, -3914, -160, 4144, -4383, 2945, 8466, -7899, -5916, 7583, -5343, -9562, 5712, -2355, -10677, 3009, -743, -9862, 3546, 4657, -7381, 663, 5422, -2439, 5530, 10118, -709, 4965, 11950, 162, 1398, 9671, 360, -2924, 1976, -3293, -2531, 150, -8486, -6355]
988f355P228r132k61Q601q806J574J6236j0502r083J7153k039q052J6361m815
1002H108j7250J5980M345j6339J4959N585k8600O469K0717j8969k078J8673j9999
1015h399r736K5362o818j4347J8751m009j7152J6908K830j5335J5352Q001j8438
1028g030O536J0379j3091N264J2943j3270m757N531p606N314R681j2267k412N429
1042F44j0753O038J5101j5053o371J3944r258k291K0233j0161j2624K0079l421
1055F107j4160K1082k077k4556J8708R491k7386R812J6916k4953L032K4381j9292
1068b895q250K1659j1672r499K1799q722j6473K1116K755j5806J3631J735j8789
1081i411J1917J0613j7012j092M712j1031N919J0172j0170K03L186j1452R228
$$ y = [-6355, 873, -8259, -8520, 81, -8725, -7151, 9085, -1417, -10500, 6653, 4614, -3438, 12923, 8108, -9142, 6838, 11183, -5156, 9803, 15388, -13212, -6743, 13974, -4995, -7073, 11600, -8399, -18135, 7227, 409, -13938, 4813, 804, -16348, 560, 3390, -11945, 3407, 11408, -7030, -494, 9885, -3206, 2058, 15001, 1731, -3026, 2505, -5101, 213, 9894, -2373, -4785, 644, -10109, -4071, 11030, -4023, -10394, 3550, -5708, -7999, 12234, 2073, -10551, 9528, 6107, -8053, 13029, 10952, -13604, 5104, 14595, -12791, -2979, 13937, -11016, -7984, 16397, -2895, -11145, 10514, -1158, -10657, 11142, 2420, -14053, 7063, 9818, -5988, 7643, 9378, -9411, 2506, 13119, -3893, -4985, -273, -11304, -5385, 4787, -5383, -5180, -1994, -13446, -4218]
1094d218J4191j4186k814J0746j0941K380J9357j1403q252J8482p476j2183J8150
1107A1833n457j6793K0037n2k7301J2852J2070k1629J0456J8707k6223p302K2256
1120C454q818k414K2137j3969j7770K2514N124j0082J6387j516k2019J1204J1083
1133A5315j4791L846P244j6116k112R627o315K82N635j0434m05P861q489J587
1147g265J0525r435j157J1699p830q32J4587q002p225J4650m553q909J6193m720
1161G726j6746J7638M390k2470R671J0066k1850M122J6501j8776m476J8236j0187
1174f155p008J7863p142j1193J9110K293j3615J1562L241j4578J0757J0953j4732
1187A356l443O984p183L07P701o618n652L409q79K670M855n407j383N276k028
$$ y = [-4218, 9973, -4213, -7027, 3719, -7222, -4842, 14515, 3112, -5140, 13342, 5866, -6317, 11833, 6376, -10417, 9620, 9568, -17733, -4881, 7189, -14440, -3984, 14723, -11500, -18802, 3454, -5364, -7778, 14359, 390, -17380, 5134, 10258, 176, 16563, 15047, -6972, 4232, 15315, 524, 4370, 11614, -4502, -6614, 3013, -3302, -3020, 2615, -7819, -8224, -363, -8852, -7265, 3260, -6175, -7332, 4367, -3463, -4295, 10292, 2290, -4935, 9715, 5162, -3747, 12446, 7726, -9020, 8618, 13008, -9462, 209, 10275, -11575, -7453, 9048, -9728, -14204, 4032, -6155, -13163, 4700, -2442, -13635, 5475, 7768, -5847, 5715, 8956, -5622, 5135, 16088, 1356, -2087, 4897, -2286, -1979, 5722, -896, -6548, -3139, -4018, -1348, 3507, -1900, -3283, 1993, -35]
1202c5n64L593m314O03M792n325j861N298n360k29R570o258p999R514O28o119
1218d066J0809J380j4306M531Q353p338K426L192j2436J828J1655p646l428J0298
1232E252n573n757J1277j434q436Q181J872r438M877L575q608K217L669o378K259
1247b445K896q330L434J0378o099m613P315p03j520O572k525n013N805j63n596
1262f07L447l54n838K303J0n557M518L922p280k44P788j873l420K120j31J242
1278D6L015k991k195M119L57j812J021p57p51K271q98j867L364J610l331k005
1294h04q00J752K512n044m595N357K183m460J225K429l305P86K024l540K511N847
1310D078l954k559O741Q19k431J923m537l905P492O52r357K673P012n030j628
$$ y = [-35, -599, 2994, -1320, -717, 4075, -1250, -3111, 2187, -3173, -3402, 6168, -90, -8089, 1425, 2053, -4066, 6743, 8123, -6183, -1652, 6701, -637, 1789, 4981, -7455, -5627, 6028, -1618, -5046, 5252, -321, -6078, 5199, 3765, -4671, 3510, 5382, -4056, 821, 4396, -4212, -1995, 1674, -4704, -2445, 451, -7879, -4445, 5933, -166, -4779, 2536, 1833, 313, 6885, 4360, -653, 5152, 4989, -607, 2840, 2486, -3352, -1049, -1039, -6596, -2078, 1844, -5436, -5680, 2108, 235, -3185, -1065, -1196, 46, 3061, 70, -2125, 1994, 2351, 539, 1560, 803, 52, 2323, 1425, -442, 2922, 4532, 1201, -804, -1604, 148, 2660, -2384, -6979, -1622, 561, -3899, -2674, -245, -3550, -2764, -740, -4280, -1769, 4078, 124, -2435, 4306, 5125, 2694, 4617, 80, -3825, 3667, 4319, -5038, -2365, 4647, -383, -2011]
1325b011N084k554j733L271l993j862P727r75p310K964K872k361K337n16o061
1340e121K885O990m833l575O416M46m559J648J795K77J983k112l532L420L089
1355E217m522l135J074n21k27J456j800r96L924N84m750o44L700m24m236m18L682
1372b036J995p2j003m3K969J733l389j601L480J098j149J283K77j116K470m77
1388D419o060o6L714l831l534K400Q00q9K69k638N26N000j299l833M365L429j511
1405B061K164J130k776K376K014n216l02L446j970j247N49k976J077J961o712
1420d421k848N822j854m557M062J587j622L759k63l893M636K133m168K673L218
1435D264l359J941K458n189Q42M881o101m286M919k71j834K150j732j450K594
$$ y = [-2011, 3073, 519, -1214, 2057, -1936, -3798, 3929, 2954, -4356, -1392, 1480, -881, 1456, 940, -5121, -2236, 4754, -79, -3654, 2762, 3208, -1351, 297, 2092, 2369, 4352, 2240, -1292, 2128, 5217, 695, -2440, -1366, -1887, -2114, -658, -2458, -3454, 470, 1054, -3696, -4340, -640, -1064, -5300, -5718, -2036, -41, -113, -1116, -1159, 1810, 3543, 154, -1447, 2033, 3131, 1982, 3265, 3542, 2426, 4896, 4419, -1641, -1707, 2007, -1824, -5358, -2958, -2158, -2247, -1978, -4616, -4090, 910, -389, -4222, 143, 3572, 2061, 4225, 5355, 2579, 4955, 6969, 1753, 1451, 4897, 2927, 1680, 2229, -747, 330, 2291, -4421, -7269, -1447, -3301, -7858, -3796, -2209, -3831, -72, -335, -4228, 408, 2541, -1627, 1046, 4264, 905, 2846, 5304, 115, 957, 5838, -263, -4549, 370, 99, -1735, 415, -1317, -2767, -173]
1450a73k064j963M458p57l179L524L44j595M823p01n589K620J740l107L528J054
1466B963m166M979K485p440K186N351r452j852P974n528l145Q562m119m469R823
1481D152j600q074P840J170p736Q280L358j0816M124P095j0546p64P671r118l188
1496h152R508l968l897P361k840k490R789j279n856O197l89m803P896N82r380
1511a721K162J063o028M821J590q735L737M245p134N267N731j0239K555R706j0167
1526c147k754J0800o061l963J1302n791r396J1213No898J1741j13j3990R696Q536
1541A1180r968L895M592j4514q1J1063p877m965N875o788k685R232l801l133Q374
1556C99k624k224J0501r62m575P351r46m857N671l770p980P586k69q894O684J
$$ y = [-173, -2237, -4200, 258, -499, -3678, -154, 190, -1405, 3418, 2717, -2872, -252, 1488, -1619, 1909, 2963, -1203, 3776, 6261, -1179, 1007, 6358, -3094, -4946, 3028, -2500, -5645, 2917, -1202, -5671, 4152, 2552, -5522, 2318, 3488, -4248, 4032, 7390, -3426, 698, 7793, -2753, -3517, 4154, -4964, -8152, 1356, -2612, -6509, 852, -1988, -4478, 5311, 4032, -1824, 4373, 3984, -819, 7077, 7659, -1721, 441, 1504, -4524, 297, 1887, -6848, -3111, 1134, -6000, -733, 4998, -5241, -2686, 7020, -3147, -5901, 4899, -1162, -5125, 6177, 386, -9010, 2203, 2208, -4690, 7051, 6938, -7052, 2644, 11180, 1212, 5107, 9699, -4815, -4896, 6167, -1710, -6675, -800, -7588, -10273, -1041, -4842, -7975, 399, -2225, -4449, 6052, 5090, 515, 7866, 6920, 2063, 7734, 3964, -4016, 3570, 3301, -5593, 1091, 1092]
1572A092j0738R328N956j4108M365J0625j2841P72J3889j0322l865J3079q934
1585a702q024J6125l708j2574J3002R13j3582J2855Q470j5148M319Q887j2883
1598c050K612J3131j1203p461P384n320p54J0425p511r322Q623J944k579Q127
1612E046l005q078O700L657l010M087l360o810P816K136o786L801j883q782R536
1627A065O402j3372N4Q180n944M334Q978j3174m681J2997l318l677R487q888j0489
1642a2046J4625L939j0564N934M11j2538Q307J0130j0508j339N470o685K295Q597
1656F028p512k755P398l773k125P126l775l125P269j020m294M101k188k668O612
1671E299k750n818N045k015n222Q103o5j0256N579M403q621N025O351r663J988
$$ y = [1092, -9646, -318, 5638, -8470, -4105, 6520, -6321, -5549, 8340, -1982, -5847, 7232, -1702, -9726, 6399, 2691, -9883, 3119, 4032, -9550, 3305, 11775, -3373, 946, 9833, -3050, -438, 12693, 1490, -5971, 1413, -3907, -4661, 5764, -1747, -11069, -2446, -502, -3081, 5046, 2041, -6037, 663, 4320, 1310, 5397, 2037, -4773, 3043, 5179, -1607, 2194, 311, -8471, 1065, 7467, -5905, -5851, 2329, -3615, 719, 9697, -3477, -8158, 4839, 1521, -2156, 7331, -1557, -12046, 2579, 6518, -4046, 1888, 2299, -10239, -1932, 8198, -2310, -3649, 1821, -4864, -2569, 6028, -1484, -4239, 3159, -614, -2739, 4387, 612, -2513, 4756, 3736, -558, 3543, 1355, -1313, 5299, 2549, -3269, 1776, -239, -5461, 2642, 2577, -7679, -2100, 2303, -6318, -1293, 5058, -4605, -2617]
1686b617R100p819n31J0072o916m298J1037m886q555J0960K95j1049O489L155
1700D437j0348M601N981r394l0O289o316j02O720n628k596P865k290l390O799
1715B598q05n008N119J684l930K415N03k502L442L14m045K554P68l798K352Q6
1731A747o460J812L474l629j71K298l673J217M982k785l48L846l954l68P464j986
1747C466m224M397m41l421M560J59o177J571K012l896J443R94m615J930L754m291
1763b779O57M014l878q51N414j695k323L045j392k032M173q66l475K966j0l714
1779b746L640J132m904K215K998m128M44M147k348j359L393j457j315K924j713
1794I23k563K971j41l371K122J162l697P45K090k047r46K508m25j829K114J275
$$ y = [-2617, 6483, -1336, -1867, 8205, 1289, -3009, 8028, 3142, -5413, 5547, 5842, -5207, 1282, 4437, -5911, -1310, 4671, -4723, -4753, 1536, -4780, -4882, 1838, -3790, -6386, 1479, -811, -4201, 2598, 1793, -3215, 1904, 3588, -342, 2073, 2576, 74, 3516, 3830, -215, 2339, 3107, -691, 1661, 1747, -4713, -2901, 573, -3056, -3227, -929, -4602, -3385, 1597, -1188, -1536, 2310, -1644, -2012, 5452, 3466, -758, 3639, 3198, -223, 4337, 4496, -1681, -110, 1902, -1994, -551, 443, -4172, -2242, 1512, -2779, -2122, 1892, -1986, -2837, 2577, 882, -1441, 1604, 212, -1820, 2353, 1487, -1988, 978, 968, -2746, 894, 2026, -2878, -663, 2335, -1793, -1349, 2798, 450, -909, 2484, 1027, -288, 2636, 923, -1640, 1331, 1190, -2181, -59, 1103, -2594, -1849, 241, -1806, -2752, -244, -669, -2498, -384, 891]
1810H91q37L1N32k22M33N93k83j05M52k44j014J009R08j946o29J761r75j704K163
1829H14M20l058L61J621k500q28J950j533j295K445m3n62L159M33j330L326J305
1846D685l110K273K743l772j149K509k565k872J815j921k723J686j183k342K445
1861c481J215j981K254K193j937K322L342k415n20L214j323k455J685k45j901
1876c3L83l74p53J601M91k150O24J552j304j78O44j297m77P21p65j243L97O91
1894a470j31p26O20K060N44q44Q67K110K69o88j31q35J21o3k007r52L85j404n14
1913b789J154j083PL116q94j714L394J928k053L15R26j421M13m06k943J146J576
1930F72l675n50L241j243o72L156j154j282M571K6l874K286J842l075Q24N35l047
$$ y = [891, 54, 85, 617, 395, 828, 1421, 1138, 1033, 1485, 1241, 227, 1236, 2144, 198, -431, 1330, 355, -1349, 814, 1234, -1824, -1463, 158, -2342, -3170, -1220, -2753, -4048, -1603, -1646, -2208, 951, 1384, 54, 3380, 4685, 1575, 3848, 6591, 2819, 1670, 4179, 1614, -1258, 557, -1364, -4087, -2401, -3584, -5926, -3481, -2266, -4247, -1993, 200, -1737, 585, 3927, 1512, 992, 4206, 2883, 428, 2113, 1868, -33, 350, -24, -777, 824, 1315, -835, -211, 1341, 37, -141, 503, -794, -1271, -550, -1315, -2558, -2161, -1470, -1601, -2327, -1707, 353, 897, 53, 920, 3030, 3299, 2611, 2480, 1645, 1766, 1703, -304, -1256, -871, -2275, -2789, -1635, -2718, -2711, 405, -489, -2203, 1191, 3119, 1066, 1381, 2307, 886, 1299, 893, -2050, -904, 672, -3003, -3553, -312, -1555, -2227, 929, -225, -1507, 3064, 3090, -784, 1502, 3344, 269, 1093, 1628, -1419]
1947a419K114J682m469J002M088l703j980L946n02j750K566j763k658L810P08
1962A672m284M25R68j871J994R81k266K448K954k349N64L208q97j772K35n82M7
1979A475k6k877l81J497j754l39N08k440J173L681k753j687M135j86j265L274
1995B035j313j862M673j507m785N721J744o858K388L600n468K000M478o045n95
2010a794N908m411l072N768l064m293M634j953l350P234j96p043M924M405m070
2025c73K209J443m937K241M081m081L91K292n126P37M558m339j217L412m520k55
2041c484P417l073m642M440l07j348M981l726o654O553K933n493L499P41q475
2056f638M306P700n977n64M109o352R06R345l197n295L237k627j801P879k339
$$ y = [-1419, 695, 2377, -2092, -1090, 2998, -705, -2685, 1261, 759, -991, 1575, -188, -2846, 964, 1672, -2612, -2187, -1219, -3090, -1096, -115, -2381, 67, 3021, 672, 1236, 4444, 3547, 1775, 2010, 1428, 1475, 1449, -1428, -1809, -312, -2066, -2405, -1897, -4337, -3164, 517, -2236, -3923, 212, 26, -1239, 2035, 722, -1140, 3533, 2026, -2759, 2962, 4706, -2152, 236, 3836, -1632, 368, 4846, -1199, -1794, 4114, -297, -3369, 2399, -665, -4958, -324, -2277, -5627, 1607, 1411, -5632, -708, 3697, -373, 1836, 3279, -1658, 583, 4664, 583, 974, 3266, -1860, -1123, 3435, -904, -2121, 1291, -3229, -3484, 3933, 860, -3782, 658, 351, -997, 3984, 258, -6396, 157, 3090, -2403, 1096, 1837, -6638, -2332, 5368, -609, -1173, 2936, -3416, -2510, 6835, 3638, -1657, 1580, -1047, -2848, 5031, 2692]
2071B692p689M337K328m089L831J026o111K591L118l932J632J308m494K830L242
2086B620m560M93K686n232J967O531n241k091N720l182r28O970m283m350P207
2101D327k175n982Q005N8q782N608K528r521L804O189r095L88P527o247o42Q236
2117D226n231l838Q230k752l899P992j307o920O195K742n427K754P56o288K378
2132c89L410m349J181O80m657K732L251m945O66L053m219J682M425m753k34N882
2148C416l351r81N193n510k483Q616k113n560O220j630p095P819L094q846K214
2163i97L408o839L350O255p462j371O737m879j512P001m398m356P329l77n420
2178c531M544J230m808L720J797m539J039J883k803K526J849m471L93K792k598
$$ y = [2692, -4997, -660, 1668, -2421, 1410, 2436, -3675, -1084, 2034, -1898, -266, 1042, -3452, -622, 2620, -1940, -1447, 1239, -3993, -2026, 4505, -736, -2827, 2893, -289, -1217, 5753, 1470, -2880, 4327, 2152, -3830, 4175, 4233, -4549, 1059, 3587, -5934, -2130, 4059, -5036, -4648, 2879, -3368, -4010, 4226, -1005, -4843, 3387, 635, -3264, 4728, 3421, -3499, 2696, 5438, 11, 2765, 3521, -2767, -389, 3021, -1328, -147, 533, -4124, -1392, 1859, -3086, -2420, 633, -3586, -1904, 2521, -2232, -2466, 3416, 65, -916, 4277, -1233, -3716, 4900, 2787, -2773, 3447, 1817, -5278, 2541, 5635, -3211, -997, 2411, -4428, -1078, 5177, -2285, -3656, 3081, -1798, -3310, 3691, -707, -5063, 2266, 1889, -3531, 1013, 2243, -2565, 1155, 2952, -1587, -548, 1335, -1468, 1058, 2907, -1564, -1171, 1621, -977]
2193i77J623K340m032j60L089k110j99K541l800n89L772k603j371M851k581l300
2209c506N323m08m538L904N55m406L315K475m742J932L505m518P01M001m352m01
2225a160M705l404k277N183j221l392L181m46l681K317L0l188K241P63l245K082
2241a512K060k622J814K387k981R28K659k139m23K171j580m73J659j896q45K603
2257A810j724j812K666q41k590K350N11k039J406P36k227J017J595j589M40K60
2273c1j991P97J928j517J51J967q56k37J983n81l13J62q79j76Q52j220l86P38
2291C91j425l46J930q75j760J849J8j794K004N65j892J491M76j911J555J195k917
2308a446M33K528k055m52L036j570j560K687Jj786J464K75k208J170P93k251K45
$$ y = [-977, 646, 2986, -1046, -1206, 1883, -227, -426, 2115, -1685, -2274, 1498, -1105, -2476, 2375, -206, -3506, 1817, 1409, -3129, 775, 1330, -3076, 239, 2714, -2028, -96, 3409, -1109, -408, 3593, -759, -1160, 3545, 141, -2136, 3047, 1826, -1566, 1615, 1169, -2512, -195, -165, -3353, -1112, -349, -3594, -1512, 548, -2074, -260, 2127, -854, 74, 2733, 594, 171, 2342, 762, 289, 1948, 52, -793, 1810, 86, -1726, 940, 99, -2491, -141, 370, -1669, -263, 473, -1754, -737, 858, -731, -291, -31, -2022, -1225, 703, -814, -663, 1304, 448, 211, 2194, 1613, 1300, 1462, 583, 407, 1259, 39, -347, 391, -1034, -1380, 550, -325, -2085, -236, -218, -2012, -8, 557, -1335, 156, 632, -1279, 276, 1471, -1446, -1013, 1515, -540, -992, 2044, 474, -1086, 1601, 1602, -184, 1280, 1555, -653, 517, 1310, -941, -696]
2325f96J112k276N3K263j291j357J975n0j427K007R85j824K75R21n99J71O75q41
2343G6l69Q69j37k19O64j08j180O57J026q29l58P73m75r63L08O19j122n81P79
2362e70n06k45L30nk20N41N6k17J166M48j020R39R68j175K36J103j095p20J269
2381A283j44j292M86N94j018P9L04j025J31L06j294O4J482r48q29J388jj082J244
2400b72Q34j060N54J263n56J03J059l52o44N69q03l42R62r17r44O15K24j283l8
2419a028R22j136o17Q76l07l77P88K96k23L99K94j29N01K56k50L41P93q22p9R68
2439A466O3j206L48L32q77m38Q14m96j096M71M69p90J55O24q10J42R49j173K42
2458h11J358j297o37K293l14j884K214J422k542R38J723k422Q0K360j839j435
$$ y = [-696, 416, -1860, -1807, 456, -835, -2192, -217, -267, -1694, 313, 1298, -526, -251, 670, 71, 242, 917, 76, -293, 576, 439, 220, 884, 776, -404, 253, 1279, 450, 92, 865, 390, -573, -265, 354, -768, -1349, -570, -1076, -1321, -991, -996, -1216, -675, -619, -836, 330, 778, -242, 697, 1665, 490, 726, 1829, 734, 14, 1283, 1139, -153, 333, 927, -91, -12, 292, -733, -602, -296, -1590, -1526, -44, -992, -1821, -433, -434, -1516, -272, 562, -498, 56, 1319, 763, 866, 1925, 1573, 929, 1498, 695, 353, 1315, 398, -546, 69, 293, -990, -1028, -106, -1242, -1859, -983, -1290, -1667, -879, -583, -806, -407, -113, -242, 259, 515, 265, 606, 1399, 577, 498, 1466, 1529, 323, 671, 1003, 126, -312, 502, 6, -1090, -619, -150, -940, -785, -161, -971, -829, 120, -1053, -811, 547, -750, -1387, 906, 592, -1292, 922, 2344, -198, 740, 2463, 41, 121, 2481, 642, -793]
2474g93J809j303j225L334r54l436K216N86k838J948K095l703L19L185j762l95
2490i17K840j973j366K816o37j945J992n47j872L254O65l194R20J542j612R46
2506I12Q94k485k12J093o35K17P36j716l75J336j022N43J672j838r31K295k75
2523B09o66J607j178n65K125r14j296K243n69k597K103Q14k443J633P77k884J583
2540a8K442k345m84J137k098L85K343k404l61K190k350p25L838j301k262K564
2556E51q91j334L590m57l473L119P72k654K428L20m349K554L412m939M35L517
2572B601l935o48M919k890k433L816k670k197N470o46n378L430J297l780L521
2587D77K063m978J214M457l765k28L952k364j375K953j821j102K636j591j720
$$ y = [-793, 1016, -287, -1512, 1822, 868, -2568, -352, 234, -2604, -656, 1439, -2264, -1945, 1240, -522, -917, 1923, -50, -1416, 1400, 763, -1182, 810, 263, -1609, 1645, 2310, -884, 36, 1578, -34, 912, 1806, -679, -891, 202, -433, -216, 520, -1196, -1571, -235, -1257, -714, 958, -880, -1811, 484, 209, -457, 1150, -28, -593, 1532, 618, -678, 1565, 996, -1601, 502, 1316, -1127, 506, 1283, -1601, -18, 2424, 79, -405, 732, -1366, -981, 1362, -1042, -1403, 787, -1563, -2288, 1550, 249, -2013, 551, -340, -1674, 1916, 1459, -2014, 1105, 1877, -777, 1651, 1971, -2378, 176, 3588, -1351, -916, 2601, -1334, -1982, 2937, 47, -2386, 1430, -1240, -3437, 2033, 1387, -3991, -561, 736, -3044, 477, 2540, -2438, -1224, 3233, -532, -760, 3192, 828, -547, 2406, 585, -517, 2119, 528, -1192]
2602a192K319n71k364J599k0j192J613r17j580K153P6j152J956j111j762L737
2618A592j37l687L196J441l928J995K242l974J203L133m571N32M796m492k110
2633b769N448k486k748M721j969m463N499J075o027K664K711m560J924L214m349
2648b115Q80L633l697l7N034l125k307M055r04k027L489j734l283L046N38k478
2664a032J649m77k714K813N06k951K642Q45l625J804K558l041P11J825l181O09
2680a059L130l207r63L691k001r83L545j919k106M556n00l658L274L36l322J870
2696F84J013l241J149J082l210J016K504l033RK585k128LL060j801o34K971j322
2713G07j422K103j009j166K215j581j788L028K20k724K529O97k901J892J563l298
$$ y = [-1192, 1127, 556, -1808, -209, -229, -1421, 192, -725, -2305, -152, -76, -1228, 728, -383, -2145, 1592, 1455, -2232, 964, 2405, -1523, 472, 2714, -1260, -57, 3076, -1495, -963, 3833, -659, -2769, 2679, 193, -2555, 2166, 197, -4266, 1233, 2308, -3719, -1055, 1656, -2904, -980, 2234, -2115, -1235, 2398, -1299, -1336, 3698, 573, -1734, 2321, 1417, -610, 2879, 1145, -2138, 908, 1446, -1032, 617, 140, -2574, 239, 745, -2206, 436, 1281, -2344, -540, 2018, -1023, -312, 1513, -1668, -1059, 2071, -1136, -2099, 1592, -409, -1392, 2153, 234, -1872, 2684, 2184, -1474, 1800, 2136, -1186, 684, 1697, -1544, -395, 687, -2523, -1507, 997, -2036, -2027, 558, -1570, -1567, 1493, -308, -942, 2029, 707, -715, 1388, 379, -787, 1428, -153, -1941, 1087, 1307, -1417, 1112, 1809, -1092, 800, 2363, -935]
2729i35J218J510l307M11K255k895k49K546k223p48L140j318j936L556K87k288
2745i76K063P47j787J742L63k305J075Q25k204M47Q91k462L27J898j297k59J500
2762E88j016l05J437p31o02O43j089l04J803q56j208J722n2j130K047K73k016
2779g96J393J220j216P27M98j928P80J150j806o57J102j608o69K019o16j736J547
2796e96M86r18J338L22j201K62P27o23M60M50j281K0J139m42k74N31r6l11O89
2815F82K32k71j8k80r3J53o05K3L78j135j51N44k1o79O26o2k24R64k8j59R39j05
2837G10r22R04L06j088J34O44r57J85J110p94n00O81J07m87K76n4o09O08j02o81
2857e29N91oj227K62L56l92P9M60J0k27R23J21k76M31J85k26L39j52l78M13Np29
$$ y = [-935, 283, 1793, -1514, -1103, 1152, -1743, -1992, 554, -1669, -2417, 723, -595, -2531, 1025, 1312, -976, 1087, 1834, 47, 1789, 2152, -153, 922, 1747, -457, -10, 881, -1581, -1254, 644, -653, -912, 588, -428, -733, 704, -27, -629, 14, -1075, -1379, 424, -432, -1640, 82, 30, -1100, 947, 1220, -796, 597, 1817, 601, 1328, 1826, -102, 678, 1828, 22, -635, 467, -1141, -1810, 209, -407, -2143, -596, -110, -1028, 310, 632, -569, -307, 420, -203, 257, 707, -574, -554, 585, 143, -131, 400, 304, -7, 682, 914, 643, 625, 345, 252, 405, -200, -177, 201, -934, -1085, -541, -562, -1241, -615, -677, -901, 63, 35, -124, 815, 710, -212, 692, 998, -90, 44, 688, -269, -84, 1026, 232, -268, 413, 520, 33, 309, 255, -354, 254, 152, -529, 62, 56, -1171, -909, -553, -945, -866, -406, -396, -623, 300, 421, 145, 576, 761, 535, 874, 722, 344, 757, 762, 33]
2879C3N0M48o26l04K13j7o8M6K58l66L9Rkq1j13p3M1J67m0J54K94J2m18M32O92
2904G80k89j58O34nn02J85K46o10j26P5l64j68J63o56n7N05n25M5O32j82p14Q25
2926b66O79j035K97J159p45k22R55l82m38O70k90n31J039j20j102P29M22j240
2944d21M48J325j949j70J297q27p51J199m59j157J176O6q18R21M16j304Q36R90
2962H18j121K6J349j130m03J662m65p86P80n7o09Q3L18q66K72L1j92J19K2l23
2982d72J05K26l06l2K3NL33n09J02P27m65j45R14pq68Q38N96j126P42M17j142
3003d4M61P77j246K50P86j444k06J695j504r65J507m43j488J756L97j747J021
3020d37J065j446R65P85j778N63J304j499M53J431j416k02K252j403r83J783o21
$$ y = [33, 83, 531, -95, -399, -186, -203, -271, -225, 33, -333, -294, -285, -287, -368, -481, -554, -513, -346, -386, -232, 62, 74, -344, 88, 780, 491, 333, 967, 962, 460, 645, 891, 281, 155, 230, -134, -302, -139, -795, -852, -347, -872, -827, -195, -377, -1091, -266, 413, -622, -325, 834, 89, -133, 822, 440, 2, 672, 382, -149, 890, 770, -332, 397, 819, -421, 27, 1352, -597, -767, 530, -297, -1048, 151, -308, -1465, -289, -223, -1041, -120, 296, -1008, -172, 818, -303, -277, 1072, -58, -461, 1201, 736, -50, 730, 673, 64, 147, 465, -401, -129, -98, -290, -171, -149, -472, -367, -141, -447, -479, -456, -451, -118, -627, -525, 202, -263, -408, 506, 499, -369, 469, 1065, -61, 681, 1098, -44, 417, 1194, -52, 198, 984, -460, -666, 1029, -475, -1440, 67, -376, -1864, -108, 289, -1458, -437, 628, -818, 147, 932, -846, -283, 1021, -478, -25, 1406, -10, -212, 2040, 637, -346, 1437, 816]
3037H16j430J211o6j682J268l7j581J465L36k274J150J313j877L44J815j633j65
3054a027K211m79r92J517o76q50J644m65j219J123o8j455J100M91j500M54O05
3071D14p99K41L48r80K88N18q79P02j12j347J165J181j503M37J038j540O57J928
3089A757j793j86J699j573m52K696j583j925K657m23k708K486N84l436J929K016
3105A745k978N18K092k802J91L184k546j502L224j424j565L522p81l230K760Q69
3121A277k702K020J246k673J152J532j953K00J513k121J17J552j677n25J768j330
3137f04o14J884j179j015J591m00p56J581n93j061J915n10j573K215J85j890J511
3154F87M27j937J568J130k156M48J211j813L23J761j983p12J787j376o95K204
$$ y = [816, -614, 597, 531, -1151, 117, 80, -1501, -36, 300, -1974, -824, 489, -1388, -1044, 771, -862, -1027, 1184, 705, -287, 1230, 554, -296, 1348, 883, -336, 787, 719, -736, 364, 855, -645, -191, 414, -385, -144, 204, -776, -488, 30, -849, -147, -259, -1606, -441, 740, -763, -326, 712, -828, -171, 1757, -36, -222, 1477, -96, -548, 2148, 565, -1360, 1297, 874, -1834, 652, 1236, -2200, -271, 1745, -1233, -715, 1377, -1425, -1234, 1950, -596, -2098, 1126, -298, -1863, 1659, 878, -2352, 408, 1277, -1425, 595, 1841, -832, 320, 1852, -101, 99, 1612, -509, -392, 1160, -517, -1042, 726, -604, -1218, 666, -513, -1528, 63, -337, -1093, 488, -105, -1166, 749, 239, -1334, 881, 1066, -824, 687, 1114, -823, 745, 1875, -281, 167, 1378, -435, -112, 1649, -334, -1046, 741, -635, -1330, 874]
3170H74j236k144K195L29j224J313l18j556K351P27j568P30K97j756J640J533
3186B187k358Q1J182j850O55K050k256q94J726j046j34K107k034j681K807M5k402
3203a815J997r4k400K430J284k717P62J582j975R09K084k077o48K165j024m04
3219E9K099j458k024K116j7j704J020k30j154J273L35j446P52L95o75L63O21j314
3237i89P64P07r71L50Q88r84k2P74p42M47O15j442L78J588j291o47J763p28r65
3256e07J410o79j416J440K04j748R76N70j487Q92O86j555P91J401j781J75J675
3273A047r71r13J519j88o45J030l62p45J188j67j208N71J70p17O25K80j359O49
3291a96Q76q94k42N41m99k20O35n01k80Q04o90P8J066m05p54P58K05l93Q93n3
$$ y = [874, -362, -2506, -311, 18, -1206, 107, -211, -1767, 584, 1311, -257, 473, 770, -986, 654, 2187, -171, -90, 1092, -758, -103, 1947, -309, -1203, 523, -523, -657, 1450, -584, -2265, 542, 587, -1815, 182, 88, -2312, 118, 1402, -1315, -553, 1029, -946, -37, 2047, -30, -678, 1487, 463, 59, 2158, 700, -1324, 792, 775, -929, 91, -139, -1293, -20, 315, -1131, -379, 16, -659, -296, 325, -989, -225, 482, -489, -139, 749, -235, -257, 517, -225, 222, 837, -605, -227, 1361, 70, -577, 1186, 458, -507, 903, 224, -1192, 248, 452, -1296, -320, 250, -1237, -345, 341, -1214, -423, 978, -803, -628, 1047, 76, -837, 682, 494, -151, 879, 517, -228, 960, 793, -415, 156, 326, -391, 234, 514, -845, -196, 680, -214, -456, 85, -414, -634, 1, -500, -780, 24, -666, -588, 478, 73, -681, 77, 282, -111, 782, 729]
3311G29j004N11O64m81K84l0j091O88K68p87q7M93q35l10R83l31l73L72l15J48
3331e04N41o8l49K62O9o1M94J22o66N76M38n73J2L94l84q4M5j84J82M1n79j20
3353c96N47n25l5J67m08j88O56r6l85L58Q9l38L64K67O5K72j99m44P58L83n93
3374C19l8M35m43k08N11n84m2k4j23j18J48k38j05L27n00k6P94j67m33K58L09
3395E2l47K64K13k57KM34k36K34K68n33l4M32k71j13N51l74m61K70J43n02J46
3416a19n7n46L00L4k37K84R8l49K44N99m60k66Q63k15r5L10J23k07k61K03J0p1
3438A85L6L5o7nP6k42Q4j94K9j81Q5o6j54r0K28k11k95N70J4m82L65M60n16L15
3462b1O09m58K07L64l49o9N25n51k72O32n04n18P22j6j070N34M33r71J47P02n52
$$ y = [729, -275, 236, 900, 419, 703, 673, -418, 270, 538, -249, -336, 157, -678, -988, -5, -336, -709, -337, -652, -504, 37, -31, -380, -118, -49, -110, 384, 506, -160, 416, 854, 281, 293, 687, 303, 219, 264, 80, 262, 303, -276, -396, 151, -374, -409, -242, -650, -838, -182, -278, -663, -305, -216, -554, -190, 77, 142, 414, 215, -229, 529, 912, 319, 281, 716, 273, 65, 576, -8, -50, -74, -197, -315, -167, -405, -510, -183, -683, -709, 85, -82, -515, -257, 52, -295, -31, 182, -75, -73, 361, 125, 359, 627, 94, 60, 492, 221, 108, 659, 285, -176, 94, 237, -265, -119, -176, -722, -422, -388, -625, -341, -243, -592, -348, 251, -209, -475, 388, 173, 78, 388, 511, 304, 43, 246, 256, 185, 221, 256, 189, 184, 260, 18, 102, -92, -63, -244, -159, -225, -379, -469, -241, -452, -747, -177, -163, -645, -280, 180, -336, -21, 588, 130, 337, 701, 352, 283, 808, 257, -15, 617, 113, -405, 317, 301, -769, -235, 198, -773, -626, 76, -476]
3483d76j06O26n01K03N02l33m21Q33k95l17N05J39n38N32K15m46J43K82l51M04
3503F00r1n65K52Q7p21K32M06j051L17L95n15M8O12n39k8O61k54l10O60j66k17
3524a87J158m84q31J003K7r30P26L32j133P2M58q5P7K44r67o0R87q30L1O40p59
3545e11l77R93m76l37R75m63l72J050l66o64J092j54q85J213K37j389Q59N73j520
3564e22N79R88j337k00J215j288J06J067q67o62J388p50r17J761l70j372R82N15
3582C16j022P79P34j537K79J298q71j3P60r92j80J430n36o26R92p68m19J400l14
3601G10j265M66o7k41Q25l84j004P26o7m04Q29p5j263R23Q97j051N37N09r64O11
3621B48J137j291j16R65j049J03J541j298j112J389l24r41J475n47j795J185O91
$$ y = [-476, -582, 44, -457, -254, 248, -85, -506, 327, 32, -285, 220, 359, -179, 353, 568, 122, 265, 547, 196, 600, 509, -56, 196, 283, -438, -206, 200, -851, -534, -139, -654, -606, 6, -533, -561, 100, -154, -464, 196, 30, -187, 971, 487, -344, 659, 686, -244, 482, 814, -319, -247, 211, 126, 203, 447, -520, -580, 407, -423, -392, 248, -511, -888, 105, -371, -708, 267, -196, -568, 482, 116, -548, 544, 390, -495, 718, 955, -434, 425, 998, -522, 57, 1045, -292, -492, 723, -565, -459, 608, -259, -921, 467, -283, -1200, 561, 191, -1181, -199, 316, -706, 73, 807, -730, -451, 847, -24, -37, 723, -269, -449, 981, 445, -181, 811, 43, -376, 1024, 710, -555, -89, -156, -397, 428, 44, -960, -234, -301, -705, 124, 49, -1214, -291, 606, -445, 92, 601, -363, 248, 1385, 94, -22, 943, -106, -3, 1538, 240, -872, 517, 193, -748, 727, 180, -1615, -430, 261]
3638B61j018M61M68j525J019J001j162Q5J008j058J76J487p63r35J314j52o27
3655D0J232o74j011J034k15o12O70j94j480J183M06j472M73P55j380O39J187j406
3673h25L59J007q47M7J273r68m25J543n91j020J414k62j137P60M94j525P44M81
3691E22j089M42L68j045O38P44j084q4Q05o38j0R26p25n41Q87k5k47O10o91k90
3711e27J091l04l77P90m48r72J519o6j051N49J98p74P83N77j633K72Q02j154M02
3730c23J162j646j97J452l40q28J157m71r61J151M41j262O58L89j063Q96Q11j301
3748b75K61R77r96P4J009q46o19R56k66n45M02l19m14L50J8n78O31q4p18N28N67
3769A13p24O57L01n06K76N97m37N6L25n26J19L95n47P2M22n41j94N92n73m81N57
$$ y = [261, -757, -296, 172, -1353, -334, 667, -495, -410, 598, -460, -284, 1203, 440, -495, 819, 667, 40, 1272, 598, -413, 621, 406, -206, 464, 270, -1210, -27, 379, -1093, -620, 135, -1245, -606, 581, -825, -466, 541, -306, -259, 1014, 46, -379, 1164, 573, -447, 967, 705, -432, 328, 822, -703, 41, 522, -567, -125, 243, -802, -164, 580, -504, -588, 217, -421, -431, 495, -230, -771, 116, 91, -156, 454, -237, -527, 564, 260, -117, 673, 225, -747, 772, 706, -345, 204, 402, -372, 411, 988, -645, -373, 429, -725, -323, 839, -807, -1004, 448, 108, -720, 437, -34, -995, 156, 597, -665, -7, 382, -681, 215, 1026, -275, -14, 963, -33, 41, 1050, 204, -415, 541, 275, -270, 132, -187, -601, -251, -233, -811, -180, -264, -982, -454, 113, -611, 46, 347, -159, 117, 714, 277, 333, 658, 132, 251, 646, 99, 171, 593, 52, -142, 450, -123, -604, -47]
3790d7j85o15N04J91l54M79j84m07O87J66o83N17M74p02K67N35n30R3L39m14Q7
3811B18L20l86j57M68l04m81M62k13m94P47l8n17L03J58m21K06J12l86L54J6n23
3832e56K90O27m84n3N81k78m32P37Qn67M20J00k05MK04k90K72k43k89J18n2k38
3854c26j55M63l63O2J54P4k83K41j06OJ73K04K1Kr0M9K59P0k54K19q1j59J62k03
3878A39j27J92n3l98M36k33l56k4M5M8N9K38k92j05K50K64l04J77J04O3L11j56
3900B78r2J15O1j32Q1O5k41j61L27l23k6J00j80n9m9j8K27o8j60M6J00j76j54
3923d39N62o1j58J91q1J36N4J64l05J76m8l7JL4m65L47M27n26j83M10o5l15LK91
3947A13j96J64k12j98K75O2m23R9M5k41L67L11j88j32M90j27j01J52N1jMj25K9
$$ y = [-47, -232, -847, -343, -152, -506, -27, -211, -618, 69, 235, -448, 69, 543, -159, 108, 643, 113, 206, 545, 131, 218, 538, 152, -5, 463, 159, -322, 140, -73, -567, 180, 142, -375, -72, 86, -335, -129, -17, -403, -49, -33, -556, -266, 361, -123, -176, 405, 127, -305, 432, 440, -127, 293, 393, 188, 192, 396, 106, 378, 135, -154, -36, -88, -326, -481, -18, -381, -319, -165, -91, -374, -133, -239, -233, -60, 144, 165, 167, 77, 126, 385, 455, 201, 420, 339, 180, 342, 139, 12, 204, 151, -247, 189, -44, -400, -424, -379, -331, -272, -34, -326, -431, -181, 83, -221, -44, 60, 123, 434, 278, 186, 301, 362, 230, 311, 376, 135, -26, 301, -22, -48, 52, -128, -187, -236, -254, -27, -95, -255, -209, -109, -285, -439, 123, 62, -96, 95, 14, 150, 204, 368, 63, 239, 191, 154, 155, 189, -276, 71, 498, -28, -211, 199, 134, -181, -178, 113, -83, 81, -131, -329, -54, 8, -415, -316, -271, -512, -145, 166, -22, -154, 336, 209, 108, 260, 311, 310, 314, 189, 218]
3970B18K72n11j3J02l17K18K0k89O7Q3j53p8K33j28j75K17N2l6L64j10l95N23
3992A64K68l63J70K81l69k4N27n00j29M95n28q3M66m70l38N74j59o53N18M3m61
4013e71J97K51k26J3K11j10R3M67l88P1O75m89j81N86m50l66P64l1o29L04j38
4034E3k41L81k02m35K63J1l17N34J43p76K1N67j01k3J04l67J09N65k76n5J94k82
4056a30J6O84j92l43K60L1l93O40k44n84K89R0k98L64j41p20M62J20m44L07L68
4077A42p80J78O71l48n8N49n73n8Q56n12l68R92n14n80R46J61j137O93K98r61
4097d03L72O98j012J66N31r76J6J084r19k82R79n99m03Q11M5o87O85K35o05O74
4117D10m8n56K65M38k61J46N9p74L07N55o76J12L39o22n2O30n32Q3K47n42Q8O24
$$ y = [218, 490, -21, -34, 68, -249, -31, -11, -300, -233, -150, -303, -381, -148, -276, -451, -234, -182, -218, 146, 36, -359, 164, 432, 69, 239, 520, 151, 127, 654, 154, 25, 520, -8, -91, 375, -95, -433, 141, -18, -671, -153, -110, -571, -374, -123, -349, -336, -125, -235, -142, 325, -63, 8, 683, 194, 13, 599, 149, -217, 547, 516, -113, 191, 53, -188, 193, -9, -444, -181, -170, -487, 47, 190, -586, -565, 2, -99, -122, -18, -385, -276, 289, 13, -42, 152, -130, -114, 570, 378, 35, 295, 326, -67, 573, 329, -255, 34, 124, -174, 190, 49, -671, -209, -89, -533, -226, 142, -638, -460, 211, -137, -195, 354, -219, -277, 579, 67, -301, 691, 177, -403, 543, 704, -433, 260, 558, -403, -31, 667, -345, -179, 352, -624, -608, 476, -443, -725, 254, -345, -748, 63, 108, -579, 106, 341, -264, 410, 362, -194, 71, 509, 248, 394, 453, -321, -14, 541, -135, -23, 316, -306, -358, 272, -260, -177, 70, -472, -384, 240]
4139B40n87q9N90m48j22R09k87n87Q36k3p92N94K10p64N19M86r13L69K96r56L37
4160a82R67j001l16R96n26m58Q47l75p30P40q6m66M59Kp64Q27K94n65N03J94o34
4181b74L87P36p09lN29n29j43O44o95l57Q82n68m38P17j96p24R19n7n66K44L82
4202A81q15M85O57j051M29L51n45J27O22m80j50O66m98K1O93k03m64L14K3n32
4222a69M79o5l62R2r0m96M51J17n53L02M56n90L28K27m18K22M64n64K30M34n92
4243i7J56N73o02j59O01l52l69O86p0p99O26O4n05M51n7m88K20K18p02K52N46
4264A93n71m4Q42o45j01P36k71l86N40q7k27M66j70l50L33J39m56J44K88n55J40
4285d2M55m95o0M12n17m2K68m01J04L0l1j55L76n4k69M41M5j7J44J84l14J85q
$$ y = [240, -347, -436, 154, -294, -416, 493, 206, -381, 455, 432, -360, 234, 444, -320, 199, 685, -228, 141, 437, -519, -182, 785, -216, -532, 464, -62, -520, 327, -48, -778, -38, -124, -590, -131, -129, -893, -66, 228, -337, 166, 360, -274, 113, 849, 140, 137, 666, 137, -6, 638, -57, -414, 468, -100, -538, 179, -17, -741, 178, 121, -445, -201, 181, -634, -149, 508, -543, -114, 237, -308, -181, 441, -39, -189, 477, -21, 0, 693, 490, 26, 340, 363, -169, 310, 245, -117, -25, -115, -611, -160, -43, -596, -294, 162, -428, -100, 127, -291, -69, 395, -169, 61, 495, -97, 59, 632, 30, -129, 472, 120, -249, 437, 367, -432, 194, 258, -247, 204, 147, -341, -121, 97, -605, -353, 193, -378, -422, 420, -225, -326, 410, 139, -247, 293, 206, -21, 445, 275, -75, 258, 397, -59, 85, 373, -182, -42, 413, -82, -142, 270, -247, -289, -21, -422, -318, -288, -319, -474, -98, -152, -421, 20, 65, 48, 192, 376, 62, 247, 239]
4308B39k12M84j47l49J08M4l63N0L40l15j36K02q9k29L69j39l0lo8J51J61j34
4330f6j93L74n5k41L67n5l14L70k0jK70k52k28M7L16m76J48J49l24p9M03l36k39
4353d35M55j31j84K93R4l17K42J9k08J63Q0l46N0K75q2p8L15j43O6P3N3m3j30
4376H1k7K1j0j39L8K63k16k42J10j33m3L3J24o4l4L65j59P7m6K5n7P0j02J36R5
4401A66k65K25K28j87j70K30j28K06k49K4p4Qk32O5M4o4k98J28R7j21N6rQ2k04
4425d42M30K55k23J10m2J93J74j11j7k09o3J16Mj11l6m6lj1j24Q3q7J72j53j54
4449b95K7J85k40J15J97q3k3K81K2k29Q9P2l2J18pj4Q6p2j68K86j38k69J79J01
4473A88j83j59J22k90J92Mj42J53L4j12o5L03l5j60J64j46n4K97K76l49L3J24
$$ y = [239, 27, 511, 364, 15, 123, 167, -196, -146, 194, -121, -257, -55, -144, -373, -4, -143, -173, -176, -244, -93, 68, -66, -259, 115, 60, -181, 186, 131, -183, 187, 167, 166, 436, 184, -44, 3, 319, -157, -9, 140, -184, -263, 140, -196, -435, 20, -111, -295, -2, 92, -225, 17, 36, -172, -9, 71, -275, -225, 50, -32, -110, 205, 62, 128, 201, 254, 211, 81, 54, 75, 65, -74, -36, 227, 11, -231, -121, -254, -297, -264, -140, -204, -238, 127, -32, 45, -1, 24, -33, 37, -65, 71, 166, -99, 126, 354, 167, -3, 227, 99, 305, 56, 80, 6, 14, -218, -153, -109, -173, -471, -343, -246, -367, -311, -320, -238, -442, -12, 243, 20, 130, 88, 281, 455, 344, 327, 118, 55, 171, 175, 64, 28, -18, -21, -32, -156, -73, -160, 12, -141, -295, -268, -83, -323, -208, -11, -94, -117, 164, 186, -43, 46, 118, 86, 204, 197, 183, 269, 197, 29, 315, 177, -92, 87, 188, 5, -154, -32, -322, -130, -126, -268, -115, -81, -193, -258, 45, 10, -150, 14, -132, -186, 111, 387, 38, 71, 195]
4495A95M6j0j40l2N9r7p6O3J85k86o9J55r8j96N5qm0J48J8j02J69j13K3J89k31
4520a93R6M05k10k05R8L60j5k65J87j66J7K56n35Q7K67l87J09J97l37j83M20k67
4542b64QJ73O2k11K67j11j35L18m6k65L43J49n52K05K96k86K07K54m33J4L44j91
4564A46k37L92k62j62K93l36k69M35j77m37N46Q9k76J47L60m86L26J66l80R7K90
4585B65l94Q4M27l19k05M95j91k57L12nk35L30K0l56N2J9k48K67j91k62K19o4
4607b37l22O95j47j14J01J54j79J31J18l30K65J69l45R3L72m94j03M42M8p22N68
4628A63Qo64O57J4n88M21O3n30K84L96o36K43L21n48j0P29n40j47P01l42K5M95
4650E15j64m21N43kp48N05j15l69L70N4p29M50M39m00k55N54k71j49M85m03j01
$$ y = [195, 241, 231, 91, 59, 118, 21, -55, 8, 193, -93, -162, -7, -105, -301, -246, -254, -294, -146, -128, -230, -61, -174, -151, 38, -193, -97, 308, 98, -107, -9, 351, 336, 71, 258, 92, 109, 365, -170, -83, 184, -203, -94, 103, -234, -417, 3, -264, -256, -83, -21, -232, 35, -76, -211, 107, 61, -204, 139, 288, -264, -59, 237, -49, 158, 412, -21, -7, 337, 146, -91, 301, 39, -123, 170, -166, -435, 0, -177, -614, -68, 21, -255, -108, 252, -234, 92, 258, -122, -25, 265, -129, -45, 382, 63, -142, 353, 162, -95, 217, 212, -23, 307, 327, -29, 23, 42, -206, 61, -130, -392, -173, -237, -559, 136, -11, -125, -24, 130, -49, 82, 200, -130, 135, 304, -41, 52, 424, -70, -173, 269, 317, -405, 163, 171, -493, 164, 178, -410, 11, 74, -456, -172, 224, -412, -169, 152, -396, -406, 323, -217, -364, 337, -5, 20, 515, 351, -70, 473, 471, -277, 228, 113, -256, 114, 168, -561, -111, 328, -72, -327, 227, -44, -193, 292, -111, -212]
4671b12L49k38k52N35k11m68N83J94m43L85p1j58K42J37k62k1J50l89L46o3m01
4692b68J37K82n32Q9N22o71J80J81l05J6N71m81P2M95l00k13O63m28l37N39J4
4713B26m32M58J70o93M22R0k90J86K99o50R2L17l72p8L94k67n96Q41k04l68M23
4734c2J19n77O74J62l36N1K44l67K29L11n39j24M58l61Q1K73k51l09L20J12j59
4755b1J85l95l7J71Q0o4k8j81J36K05j01j2k2L6p0J92K18l16J63J49k88L70J77
4778E47o41p5M87k58MJ30k07k91K91j62q6L01j31j14R5J65l78L29J58l75J05J86
4800H0l72K06L52l11J79J57l81K68J90k25OK01l12j85L71P3n56K75m4k16R8N5
4822i1m9j01K21k13N7K78j28k35L48K9k58L91N2j19Nm1O0k6j16j45K01n1o8O2
$$ y = [-212, 137, -101, -353, 182, -29, -497, 86, 280, -163, 222, 151, -7, 235, 372, 110, 89, 239, -150, 196, 133, -268, -131, 151, -381, -292, 230, -441, -261, -80, -385, -369, 202, -279, -207, 288, -12, -225, 438, 10, -327, 212, 226, -206, 252, 422, -271, 151, 241, -49, 137, 436, -214, -122, 195, -177, -255, 139, -128, -724, 117, -87, -455, -32, 87, -490, 184, 346, 10, 61, 305, -62, 167, 478, -61, -185, 273, -88, -7, 266, 15, -294, 26, 138, -21, 164, -231, -268, -97, -17, -81, -109, -290, -154, 51, -50, -62, -84, -48, -118, 74, 292, -24, 139, 288, 0, 370, 547, -94, -169, 318, 60, 64, 194, -13, -304, -13, -175, -261, 40, -91, -205, -110, 55, -323, 6, 164, -211, -106, 80, -292, -86, 266, -45, 134, 291, -90, 178, 368, 143, 149, 350, 38, -147, 224, 297, -259, 16, -28, -244, -146, -91, -140, -241, -20, -233, -176, 102, -26, -261, 87, 116, -142, 249, 301, 182, 187, 146, 206, 180, 64, -81, 120, 69, 1, 63]
4846F3q8k30J16m6L38k32p5J0P9K6j31j21J21m2K25R8l21J81J07o4M3K62j73q8
4870E8N0P2N1j68P4j00l7j18j81K42J04l59O8J64q3R0J2j7pJ62Nk48J36j03J31
4895bK76k45j79J34K2P7R7O7k02oJ71p3q0J17k23K8p9p5n6K11j05j17K2K09j22
4920a33j80L18P1j27J63l5J10p7M3o4n9o6Pq0J8J64J27kk54J2R7p3J48l49K95
4945G4P2l33M6O8j06n5R0L3O3k1J4k3J31M0P1n7j25J68J06o2j28j05J00lk00K69
4971A27m8k34o8J56l8K4J64k08J90k2k21J27k7j37O4O2m0J20R3L0j59K29k06O8
4995D6J21q2j25K91j83p7L8J00k35j5l5j8J20mj09j4J83o0k1M5j31K69L4j88K0
5020c0J88p8k63J78P9K5J6Rk99L55k08J3L27l44j37L42k87N0K04j41j96P3J47
$$ y = [63, -25, -255, -139, -185, 153, -79, -154, -144, -65, -39, -170, -291, -170, -212, 13, 111, -210, -29, 78, 14, 57, 319, 146, 58, 108, 180, 231, 63, 137, 37, 0, -118, -299, -57, 47, -312, -244, -80, -163, -73, -61, -78, -85, 77, 82, -166, -30, -133, -2, 274, 29, -150, -16, 6, 83, 180, 247, 45, 39, 210, 137, 57, 174, -49, -21, -100, -175, -231, -20, -125, -242, -220, -11, -133, -313, 5, 76, -51, 112, 77, 187, 110, 153, 89, 30, -36, -29, -109, -91, 73, 200, 198, -56, -44, 53, -20, 128, -221, 74, 146, -187, -141, -73, -179, -234, -144, -111, -48, -69, -55, -78, 53, 93, 164, 107, -18, 150, 256, 194, 66, -39, 61, 58, -142, 127, 79, -155, -223, -67, -105, -81, 83, -125, 65, 43, -178, -51, -78, -215, -151, -89, -129, -9, 84, 114, -45, 184, -22, 46, 167, 85, -40, 251, 68, -9, 29, 129, -106, -121, -156, -174, -54, -58, -167, -181, 2, -58, -79, -34, -165, 104, 138, -50, -30, 158, 80, -183, -5, 74, 99, 115, 124, -175, 180, -28, -15, 312, -32, -169, 173, -114, -64, 140, -1, -197, -124, 23]
5043B3j65j01K75j70N7K21k91j4M48q8k20K50n5k13K44pj92J12J24m81N7K84l07
5066b09K90n9Ok71K86j53kJ2R3j30N1L1n8j3p1K69p9L5q9J64p7j19K89q2l13L63
5092A64o5q2J20j67j97N6K10k47N1L31l36p2K43j16j71L52j37j10L58Mk04J26
5114A11J15l22J23K11k13J35Q0m78L50K08l59Q9J34p1j62J6p8k21K75n1j11K82
5136F3j15j84O8J82l40M68J23l46lK11J0jJn9p1K80l05J70J8j17o2J23k69j06
5160b61L26N4j43J42j54j64J87j07l3K46n4m58M09K22k85Q5K80m94K38L36l39
5181C3q9L25k62o3M04k65j37L20k32l77M47j58k48L99O1m00PK65k57K81J12n42
5203c76J90K07k07J42K92k58r5M24k95K3K27O6m96K23j7j64K41j09q5L4K29l90
$$ y = [23, -142, -243, 32, -138, -81, 140, -151, -165, 283, 195, -25, 225, 170, -43, 201, 194, 2, 114, 238, -243, -186, 98, -209, 81, 22, 28, -243, 43, -110, -112, -100, -7, -137, -86, -55, -113, -126, -197, 72, -7, 28, -61, 103, 26, -93, 196, 114, -199, 164, 99, 17, 137, -30, -227, -171, 39, -208, -157, 174, -162, -234, 9, -107, -278, 74, -63, -173, 185, 189, -15, 111, 226, -96, 27, 238, 25, 160, 240, -238, 112, 320, -39, 50, 184, 113, -49, -33, -111, -332, -57, -108, -219, 63, -52, -236, -168, 14, -326, 142, 265, -81, -84, 127, 137, 136, 137, 78, 7, 287, -18, 152, 170, 53, -9, 114, -155, -261, 65, 119, -24, 118, -36, -200, -13, -120, -153, 93, 39, -419, -10, 212, -73, 12, 292, -202, 36, 372, 33, -56, 269, 7, -56, 348, 83, -54, 266, 34, -343, 104, -54, -302, 97, 158, -242, -235, 30, -227, 54, 166, -376, -186, 21, -186, -44, 248, -10, -105, 319, 24, 47, 274, 340, -156, 67, 50, -114, 127, 18, -67, -33, 196, -194]
5225a94R8J35l15K58j6m1l9J08j17J46J13n6k0j6j08P8L30l04q5K04J7j80K46
5248B42m8j90K14j75k12M48k24k33l9K77l73J26L83m26OK74k56J98R3j80m8L69
5270B26N3k05K34k49k04M09J25n27J28N5p7N5J07j88r8J71j93J14J96j75k08K44
5292go9n7J96kk55L23J18k65M4J96m5n3j90M3J12%m3R5k8j67K2J14l03K15O7L
5318F4j12R5j35K9n9J86j60k4Q0q4J20q7r9K31Kn5N0j00j1K34o0j21J22J30l37
5343a01O7J82k66J1J73r4j04J88n3k21J82Q5j90P8R6j74P9J12r9R7Q9k65k1K18
5367F9n5l5K03p5j66L1L9j15J81J22l99J26J66j30RJ12l12L9K50l4Nj85N8N7l9
5392g8K38j8o8R5q9K3j2J24O5j62j26J57k63K62n6k63J88OOk10J26o2J44k1j00
$$ y = [-194, -96, 39, -276, -18, -34, -75, -114, -6, -123, 23, 136, 80, 60, 44, -64, 14, 344, 40, -45, 159, 176, -4, 242, 194, 4, 218, 43, -169, 279, 55, -178, -217, 60, -313, -187, 196, -230, -224, 50, -206, -8, 85, -95, -143, 226, 279, 74, 308, 59, -145, 264, 389, -138, -10, 45, -32, 23, 130, -58, -156, 15, -178, -64, 132, -43, -251, -7, -76, -133, 63, 61, -194, 129, 247, -18, 26, 222, 177, 124, -66, -23, 89, 89, 46, 141, 113, -54, -32, 82, -221, -6, 61, 64, -48, 47, -88, -59, -118, 68, -92, -116, -36, -120, 0, -87, -186, 45, 47, -8, 42, -58, -69, 165, 105, -16, 106, 236, -101, -34, 148, -118, -107, 66, -28, -132, 56, 3, -218, -36, 49, -141, -63, 33, -141, -62, 50, -49, 48, 137, -128, -149, 69, 14, -21, 182, 107, -59, -28, 11, -104, 77, 199, -200, -74, 92, -38, -29, 83, -229, -190, 60, 26, 31, -154, -96, -39, -78, 160, 142, 74, 169, 80, 103, 91, 215, 280, 118, -8, 149, -114, 148, 92, -171, 17, 23, 29, -181, -55, -117, 27, 6, -94]
5417i4o6J27q8j21K69J25k76J63N4q2L6J84j18r8J72l4j56J77j28j30J51oj81
5440a20JO1J9L9J0o8j68J17j0mJ04J62l81L42r9n5N8l3J68m7m6r8n1L98j56j17
5466B6Q4Kk34J03N6p8j08J43K15j42m9m8m9JL7N0Q7j65l4J75l00K10N1J15p6j06
5492c4J1J84k26R2K50k35r4K26m1r0n1J12q6Pj96O9K1Nn2M4J90j36p9J11Q9j32
5518d1J11j01j81K83n4M8j17K33o6M1Pj37QK1K5j98J85M7k32PJ4L0L6R1j63l1
5544a34J10j16L4Q5J46M8j05n7J07P8j16r9J00P4j4j06O2j10J16j27o8J72k80
5567b00J28J27j03k3Q2m4J19m1n8j6J49o5j52P5R7j42J20O7q1J02M5k35j2L29
5591B68j42k10K03r1j19L13l88J80O6j24k27J35K08j00J20p5j34J14m1N2Q7kj30
$$ y = [-94, -160, -33, -121, -242, 27, 152, -124, 39, 93, 11, 47, 231, 113, 15, 187, 153, -3, 174, 46, -84, 67, 61, -120, -119, -58, -39, 0, 10, -58, -226, -109, -119, -123, -19, 143, -238, 104, 5, -50, 8, -25, 143, 96, 50, -48, -99, 299, 143, 26, 110, 112, -122, -19, 37, -41, -149, -6, 209, 67, 18, -30, -79, -78, -41, 9, 96, -69, -103, 72, -228, -18, 33, 148, 72, -34, -23, 161, -65, 27, 277, 42, -52, 174, 133, 43, -8, 104, 18, 25, -171, -102, -81, -76, -128, -84, 106, -30, -109, 2, 91, -41, 70, -31, -212, 71, 17, 65, -52, 181, 115, 156, 163, 26, 34, 55, 80, -118, 67, 114, -118, -111, -97, -67, -31, 60, -103, -134, -24, -140, -106, -21, 125, 173, 68, 11, 118, 196, 80, -19, 81, 155, 141, 35, 97, -13, 103, -24, -92, 80, -200, -72, 55, -48, -71, 11, -33, 86, 45, -13, -29, 120, 55, -97, -22, 75, -67, 53, 120, 39, 141, 186, -49, -61, 268, 126, -84, 119, 28, -91, 222, -166, 14, 80, -44, -271, -136, 72, -28, 92, 17, -117, -3, -44, 8, 95, 93, -37]
5614c7p5L65j41j72J50r4p1J53O4k15K6J81j90M3J52k25m4J59o9K5L2j14K9J17
5638D9p7j24K10j50M2J27k31J77J75l41K8L35k80J5J21r5j04N4L19k43J59k15
5660d9p3J33M1j72m4K4l2Q3J99j21k72L28L9q2J07k1k76K16N0j57K19j7k8N2J12
5685B59l36N3L19k79j34J56j40R6n9j03K2J62kj04Q7p9q7K53j79k9K20M6o6q6
5709a0K27k16K52r8l12J82P0L2J7J39l79l1K31m7k18K12j15j73J40P6m4j39J46
5732e8q6J11k0j58J73J13l48K30J20j95J00J48j51o0K15m3M5l2j72j8M5M3k03
5755b01K47j7j02K15j09j39P8k0J6J04j36P1n9R1q2J54l9Q3j15K67j70k06O6L
5779@m8K42j70K6r6p4K4K07j67k11K64n0J7j46J26PO3j07l4K00J7r8j42Q1K51
$$ y = [-37, -112, 253, 112, -60, 90, -4, -75, 78, 142, -73, -47, 134, -56, -13, 139, -86, -130, 29, -40, -15, 17, -97, -68, 49, -28, -152, 58, -92, -50, 77, -154, 23, 198, -143, -115, 220, -60, -45, 76, -19, -123, -69, 250, 7, 166, -49, -122, 11, 52, -120, -164, -140, -172, -89, 110, -11, -283, 45, 84, 2, 109, 88, -188, 28, 78, -79, 140, 123, 95, 147, 259, -77, -24, 295, 16, -118, 38, -102, -6, -65, -168, -146, 16, 14, -90, -3, -82, -169, 84, -95, -124, 96, 142, 76, -10, 217, 1, 253, 155, -157, 25, 95, 127, 144, 283, -96, -127, 104, 57, -161, 51, -64, -237, -97, -21, -65, -204, -58, -144, -33, -53, -211, -38, 75, -273, -43, 77, -118, -18, 130, -21, -81, 134, 91, 136, 104, -68, -86, -41, 2, -201, 46, 29, -73, 142, 33, -106, -28, -48, -32, 72, -64, 7, -52, 39, -43, 111, 72, 155, 40, 307, 137, -69, -3, 0, -48, 194, 24, 50, -46, -120, -96, 111, -56, -267, -3, -53, -36, -182, -56, -49, 14, -93, -127, 73, 90, -8, -150, -69, 182]
5804A82j72J21P8k34J46J06k15J1N4k05J76j84q4J90j11m3J45K17n69L23R9j47
5826a16P7J09r3r9K05Rj55J55O4j82JJ76j63Q8J17k06o7J00j00k9N9M8p2j7m7
5851a38J25j9j32o2J31jN0K4J01n3Q1r2n0J15j44P5Kj5J25j29P9n5j6k9j18K28
5877H3r3j10N6J26j11k1J34k36QJ84j50o9J56qk2K2P8j4j19K68j74r7L20l67Q9
5902f7J45j5k3l4q9m1J79j3r8K6j42J73R4j76j68K29q3J49j2k10J89o4J35P7l13
5927a52L11k2j84P9n2R0o8Q0r9P2J34j76Lk8mn4M9L2l6n1P3m3j00K06j61j56J56
5954a01J64k73L53OJ6j17J23k01n3L4N9M0p9K6J2mk5j21J17K05k07m4J05O9j82
5979g8qR5K2m4J23j25k4K32k10J88k4r7l23L88r4k6J32q6n3Q3L8o8j35K32m8j40
$$ y = [182, 10, 131, 209, -25, 121, 227, 12, 23, 77, -128, 48, -136, -220, -30, -141, -184, -39, 178, -391, -68, 31, -116, -39, 70, -23, -122, 83, 92, -63, 92, 156, -26, -25, 151, -12, 76, 193, -13, -80, 20, -80, -109, -50, -2, -74, -91, -138, -13, -32, -164, -226, -95, -96, -46, -22, 79, 26, 107, 15, -35, 80, -64, 11, 13, -2, 123, -6, 73, 18, 2, -27, -145, 83, -10, -120, -64, 62, -49, -70, 64, -172, -164, 20, -130, -199, -43, -51, -73, -51, 27, 13, -106, 162, -12, -109, 211, -156, -67, 78, 63, 40, 6, -83, -124, 55, 42, -56, -30, -172, 1, 95, -81, -249, -20, -103, 46, 34, -176, 13, -51, 84, 161, -152, 159, 137, -47, 32, -20, 70, 2, 82, -17, 55, 189, 13, 16, -12, -16, -70, -21, 11, -25, -76, -3, -46, -146, 60, -101, -257, -101, 63, -210, 143, 149, 165, 48, 171, -30, -83, -49, 10, 50, -29, -3, 9, 5, -20, -141, -24, 181, -26, -70, 35, 104, -78, -86, 9, 31, -13, 110, -15, -39, 193, -17, 171, 147, 50, -273, 115, 21, -5, 127, 41, -12, 71, 109, 41, -94, 138, 90, -50]
6005e0O6k01K9J18j0r6J19O3j66P7J80k2p2q4K49q4l0kk02P4M3N9o4R3p2J48k72
6032a09J82k52J27k5J66j51M5m4M9q8Q5j5m9J77p6p1Q0R6n4q1P2L2l8MR8K0j29
6059E1j03J03r3KJ13m3o0P0j45lJ41j30K3R6O3j45l0K55j98n3N6J39n3O7n0m3
6085C0j18K49k07p1K80k05K5M5O8P4o6j37p8L8PJ4J44n1n7J18j41J29j61k3M1
6110e3K20j50RJl7J07j57J25J69j36L1m1o3r5M6P9j66o4K26p8m2j8R0l6q6l0J04
6137d5j57J57Oj37J87Ok92K90J26j42J93K8k83Q2O5k4j3J62m4j22M4j01j67K45
6161F4q6p5J55k49J97j9q8j1R4P4j8Q9r2j8o1K00j81J25J63l00K08q0o6J1R3r5
6187C4j07J06K23j85r0j95P2J73p4j26J44jK2p9K53m71L38j29J00N9ro8l6J83
$$ y = [-50, 16, -185, -156, -38, -48, -144, -25, 38, -128, -51, 129, 107, 35, -49, 200, 116, 86, 84, -118, -44, -1, 58, -6, 87, 15, 163, -109, 73, -179, -52, -77, 89, -62, -17, -61, -12, -100, -15, -30, -79, 98, 22, -49, 31, 127, 73, -8, 64, 96, 58, 62, 160, 180, 51, -52, 51, -42, -40, 73, 30, -30, 40, -105, -108, 33, -97, -74, 22, 85, -60, -90, 165, -33, -86, -30, 109, 56, 123, 73, 30, -88, 161, -46, -117, 163, -42, -17, 28, 96, 170, 104, -33, -111, -73, -66, -52, 92, 41, -16, 102, -39, 90, -71, -94, -53, 167, 17, 26, 27, -10, 97, -60, 65, 234, 98, 129, 88, 25, -70, -24, 55, -111, -175, 51, -27, -69, -87, 3, -33, -119, -149, -45, -202, -45, -39, -176, 11, 17, -275, 15, 141, -1, 192, 220, -63, 19, 84, 60, 47, 209, 165, 43, 87, -14, -181, 64, -22, -97, 58, -191, 6, -13, -101, -112, -18, 56, 38, 127, 35, 17, -44, 156, -25, 100, 263, -37, 171, 91, 25, 36, 129, 34, -73, 33, 256, 71, -19, -214, -142, 31, -43, -169, -25, -26, -4, -83, 170, -301, 37, -92, 8, 67, 58, -10, -46, 137]
6211A37m8j27J72j45mK03n2l07K21nj86Q6N7J7l0n2M0J8o5Q4j05L43k92j1Q2j66
6237a35l1O1J57o0L44k78j09J20nj22K37k14L8M9k0l07L35J1q3k13K69o1j48K25
6261F0j56P3m1q4l6J97k8j24K11j1j9kJ92l72N4L5KJ02q2J63j08J69k46LK1j27
6287a54o7J72qm6J43j00KJ83L9k08J44k70J12L3J26q1J5K2N7k2r4k0J10R5k39
6312e6J83k23Kj7J08N8j97O7j5q4K72j05n5M5K8k8l4K50k63K8o9J52j93K57j55
6337d4nJ35J8j81M2l7J40j11J25j76J49q7j6m1J31k01K2K37j91R2n9jLK00lj48
6363gk1j59J96P4j50l2J53j10O9j46J30m3n4M1M0J17j27n6L10m17P1J19N6j72
6387a18k0J69k0l2M9j27N8M2P2N3j53k8J62%l1j34L7R8j58o6J9R3l7Q5J76j96
$$ y = [137, 89, -38, 134, -11, -15, 188, 136, -171, 50, 45, -141, -55, 2, 19, -11, -63, -23, -5, -70, 14, -91, 252, -40, -51, 31, -135, -166, -105, 52, -8, 336, 58, -51, 69, 64, -58, 179, -35, 3, 52, 32, -275, 60, 71, -12, -225, 44, -17, -165, 60, -96, -23, -64, -148, -184, 13, -15, -139, 72, 61, 42, 40, 232, -140, -86, -51, -49, 53, -29, 134, 26, 195, -51, -48, -27, -154, -221, -49, -57, -103, 40, -60, -58, 125, 164, -44, 100, -170, -58, -25, 101, 20, 35, 57, 114, 92, -2, -22, 88, 183, -56, 127, -96, -94, -111, -3, 55, -142, -75, -90, -174, 98, -7, -62, -17, 11, -17, -51, 199, -64, -36, -105, 47, -146, 111, -44, -49, 86, 104, -77, -35, -72, 68, -43, 82, -94, 55, -32, -48, -89, 42, -159, -137, 100, -91, 1, -58, -59, -56, 144, 141, -7, -28, -187, 9, 83, -67, -99, 54, -56, 13, -133, -3, -46, -100, -59, -19, 98, -29, -85, 225, -192, -121, -2, 54, -118, -138, 31, 11, -21, 28, -99, -41, 1, 73, 126, -27, -55, 107, 107, 76, -58, -21, 77, -81, -147, -128, -35, -72, 13, 189, -7]
6413gP4k39J86J2k07J56m0L8j03J78N5j15O4j51J38j3o7L6o1P6JK5N3P9k61J7
6439g6R1j79J77m3P7j45L3q5J04q2N5JO1j42J3J36m9L1r7P2M2N4Rnj75J73J46
6466A97k97O2J87k04M9N2r5j4k2oJ15q8P7k6LO1j39J45k2p4m4J36L8K2j55jj46
6493a89K55J56j24j26L1O8J7j16l8j26L12n2j38J91j66K8q4J04m6N7o1M2lP8o2
6518HM6J19k99K18j6o1j65J64l5N5J7j28J24j03K34j26m2Q5m7M4l28K38m5j3j31
6543a87J91M0j00L4j00J63j62N0L1J3L9k8K0L8J1J1l7M7P9j63l6n5j08K07L9j27
6569i0Q3p2K2M0j74J66L0l3n0L5J00m5j09J90n6Q1j57O0J2j36O7Q7m3oQ9l1j04
6596d4m3K17j01p2M6j0r1Ml9J61p4J3k7J83j95K02K9Oj80j20J98kl9K32k46%P8
$$ y = [-7, 67, -172, 14, 26, -181, -25, -65, -27, -130, 48, 103, -12, 52, -99, 39, 26, -41, -5, -66, 10, 11, 36, 89, 168, -93, -76, 15, -164, 13, -30, 47, -98, -65, -150, -46, -128, -73, -72, -11, -153, -140, -4, -53, -22, -119, -47, -5, 49, 58, 53, -122, 51, 197, -100, -38, 149, -55, -6, 46, -49, -63, -85, -91, 24, -64, 13, -13, -10, 51, -88, 57, 35, -39, -83, 53, 91, 113, -42, -43, -189, 66, 222, 98, -28, 3, 71, 88, -28, -66, -192, 120, 68, -70, 121, -45, -17, -101, 3, -43, 14, -47, -5, -8, 70, 8, 54, 173, -126, 92, 76, 15, -150, 14, -21, 34, 51, -77, 47, -56, 178, 52, 10, 95, 48, 92, -236, 2, -43, -56, -187, 4, 44, -56, -22, -122, 41, -121, -71, -40, -27, 12, -16, 4, 42, 53, 64, 27, 74, 153, -10, -46, -101, -209, -2, 37, -90, -7, -79, -57, -17, -191, -25, 5, -28, -78, -43, 57, 12, -97, 93, 37, 118, -39, 21, 33, -103, -36, 51, 8, 2, 91, 60, -44, -87, 130, 29, -43, 3, -7, -98, -94, -133, 28, -46, -33, -60, 123, -72, 130, 159, 165, -15, -135, 63, 61, 22, 254, 8, 8, 86]
6623H6p4N9j34K2J06q6j4%K4J71k90K1L0Q9N4m8n3N1n3J3J7JM7p3P5m1p7K2L6
6652a9J2J26j95J15j42J23q9M8m4q6L81k18n4J39k5q1P2k40L13o3j36j58J87R6
6676F2k57K33J37k39K79j48q0O5rj86J65pK9J1o3m0J45J10k03j11O2J73q9p7j13
6701a51J22R5j7%m5j2J47m1m9r5M4J03m0j88K63l0j9n1Lp5m5Q7j56J05o8p3J53
6728c3o5j39L04j26M4P9k34K39l8q6K18j58J0j41K23j18P4O8j8M8k32J50r8M5
6752A6q6J12M2k24J48nL8j19J31Q4j30k11L06L1j62j24J65J08p3o3j4k7J35J0
6776H8j34M0pK2N8k05j07J20Q3k4k0Kj01J84lo0K56m28J55J20o9N1l0K4q2j01
6802a68L43n0j50M6r1R4r5N4j74J29K6l4N0J01k74J20M9j24J49j36L57k87N2j19
$$ y = [86, 12, 71, -63, -41, 65, -21, -35, -35, -11, 160, -130, -109, -79, 10, 64, 16, -37, 14, -39, -26, -9, -8, 39, -34, 41, 0, -77, -55, -19, -7, 119, -76, 39, -103, 20, -69, -21, -65, -151, 230, 12, -42, 97, 72, -9, 63, -177, 136, 73, -63, -221, -34, 62, -195, 38, 175, -64, 215, 67, -13, 52, 43, -143, 22, 15, 44, 55, -8, -48, 97, 207, 4, -107, -45, 128, 39, -38, -151, -29, 66, 49, 49, 4, -8, 139, 98, 49, -46, -2, 101, 61, -127, 136, 106, 87, 36, 39, -36, -81, 6, -150, -45, -113, -186, -33, -98, -237, 67, -59, -15, 64, -170, 69, 31, -55, 163, 5, 15, -126, 97, -21, 53, 121, 103, 151, -81, 69, -29, 16, -70, 42, 84, -140, 8, 3, 41, -78, 53, 137, 7, -204, 102, 133, -29, -153, 12, 120, 47, -16, -30, -57, 78, 88, -46, -6, -13, 9, 67, -138, -245, -125, -42, -66, -86, -84, -185, -1, -4, -64, 192, -236, -81, 39, -30, 21, -9, 15, -67, -168, 175, 125, -25, 21, -70, 24, -71, -17, -191, -62, -36, -70, -20, 81, -193, -73, -24, -148, 1, -135, 222, -65, -13, -132]
6826a32J14m5k1L3J52p3Q5Lp4L7qnn7J67k88J57l2k00N8K60k29N0J9j39K06M2
6852H0m7m0j29R4N3l8l9q4J96N6n9L8J03j98K46r6K6j91oJ48p1pJ21j59k7j42
6878a72J08l4J01j50Q3O6q4j35L12r9L5l1j51K86j48rJ21Nj55Q3q0Q6P3m2Qr5
6904a8O7O3q6l9l5QJ3j33J25N8Rk6j02n8j97K64J35J42k30r0N7K16j06p6K87k33
6930A5R8r0k4n3R8j35J16r4N3O2r9O2q2NJ43r3q4k0RR4J04l32K72j72O5j18L3
6957a67Q3O1J72j70J05J23k00N4q4O5M7n8l0P1r3r2L5q2n3J32J11k42J68J07l22
6982b59L68j67j6o9J34O5j29J04J1j0J6J21j03M1r9N8N2n0r9p4L33n7k72J33J5
7007D7j09j00J68OP1j44p0J18j2J92j43n5p9K21o8n2J88o8j17J9q6J66k18J23
$$ y = [-132, -18, -63, -84, -51, 101, 28, 113, 116, 42, 79, 71, 66, 9, 176, -112, 45, 13, -187, -129, 131, -98, -48, -29, -168, 38, 80, 33, -7, -136, -42, 11, -27, -66, -150, 46, 102, 43, 81, 184, -14, 232, 136, 162, -29, -35, 113, 42, 35, 156, -3, -30, -172, -64, -98, 3, -147, -64, 2, -82, -217, 95, -4, 31, 0, -151, 135, -13, -22, 99, 104, -51, 32, -48, 38, 111, 69, 77, -18, 49, 112, 26, -13, -48, -40, -27, -160, -35, 23, 32, 6, -96, -154, -351, -87, 48, 190, -40, -130, -73, 143, 37, -39, 248, 15, 113, 23, -1, -54, 44, -91, 25, -69, -16, 46, -53, 9, -73, -68, 75, -18, -102, -122, -113, -19, 85, -247, 25, -147, -82, -200, -167, -84, -23, 149, -21, 84, 207, 7, 61, -23, 42, 89, 31, 1, 72, -21, -113, -78, -160, -213, -81, 30, -212, -44, 63, -259, 109, -58, -74, -143, -9, 56, -73, 31, 42, 32, 48, 169, 66, 107, 8, 66, 118, 68, -31, -105, 228, 171, -101, 32, 47, -62, -162, 6, 12, 83, -61, -131, -13, -25, 167, 24, -31, -110, 111, 43, -9, 179, 111, -6, 13, -73, 93, -125, -2]
7031bm1j3N6O9n4q4J96q3k13NL6K0Q5Nn7J42n0L5O3k08K41j11j05J61r6j10L15
7058B02j13n1l3M3o6L9M0n9j3L8q8m6MJ71pm3K7Nj19J09j9L7j21P2lL1K4r8J45
7087A08n8J33j72N4j73r3K40n7K4P7j04n2J26N1j79o1P7O1L2m2n3J41n0j78N9
7112h9j11K22k7MJ0N0m7N7k1J08j30o3k3L7L8J34k97Q7k0l8P2J03l5O6M5j61R8
7139F9j18ojl7K1N6J01rp6l7R0M6rj21L1m4K5j5J8J00j96J13J96j8j47m2o8J48
7167G0j02K83l03J7j4J34j22K0rJ4L4m5N8rM3m4p7J16n4k6J00k10J26m7m1O3j12
7194a37J71j13P3r6P2j76J98J10k11J68N8j63K14l83M02k41K70j63p6J53q8n0
7216hQ6n5o6J49j36M9n0M3l0Q1Rk15L4K21p1J08r6o8p9P6L6P9j51l0m8J49pp4
$$ y = [-2, -43, -56, 0, 69, 15, -69, 127, 44, -169, -164, -128, -108, -23, -18, -75, 67, 17, 52, 115, -93, 148, 37, -68, 93, -3, -113, 202, 89, 38, 5, 48, -18, 21, 61, 2, -11, 27, -61, -107, -103, 68, 61, 18, 45, 50, -69, 40, 21, 58, -63, 9, 6, 37, 61, -37, 108, 50, 183, 11, 65, -108, -201, 39, -18, 6, 83, -21, -73, 53, 104, -75, -136, -59, 2, 34, -8, -61, 80, 30, -148, -89, -200, 22, -5, -1, 9, 59, 12, 69, 48, 156, 26, -37, -60, -23, 15, 149, -148, -61, -81, -119, -47, 56, 21, 87, 132, -29, 69, -49, -55, -56, -93, -72, -16, 85, 76, 0, -37, 53, 99, 90, -31, 0, -44, -19, -34, -16, 84, -112, 1, 197, 179, 32, -10, -78, 70, -32, 251, -52, -35, -49, 85, -37, -17, -26, -12, 22, -23, 35, 26, 69, 25, -52, 64, 10, -16, 84, -126, 0, -47, -88, -25, -137, 34, -79, -6, -102, -30, -206, -8, 102, -109, 59, 117, -46, 168, -215, 187, -54, 216, 53, -23, 130, 42, -8, 78, 23, -43, 106, -30, 19, -31, 12, -18, 63, 72, -143, -109, 112, 41, 149, 53, -15, -94, -18, 18, 97, -54, -84, -132, 17, 10, -64]
7244f4OJ42k31J41J23j52j9J95k62J49k6j19O6J35j40k5J97j40O9l2J22k20J46
7267F1j90K10Nl6j18J54k1p5J14j12j51L68k82J22n1m7K87k95J28L6j2j04j06
7290a15j7J91q2jn0P1kR5j26P0l3k49L17J44k33J62p1O6j05n4Q5o5j04J47pp4
7316d0M7m8o7J49j11r4J14j0K6L5l6M2r8L3K7K7LK5j01J24k8l0Q1mJ6j39O6j60
7344a51K75j24m2J37o4o9K4J09n3r6M9j74J95J5R7J59k19n9l9k8O9o5o4J30Jk2
7370ij7J53j11lP3j14K0O2j40J25j80J56o1N4r6J70j05J2m2J10k9k8M2j7j2j1
7396BJ35lj67OO4j5p6R1J32j49lq6J12Lj25K00n4q5P9k04J45j8N8O3j31O2L9j17
7424d2M9L9q4M8M5J2lj0p9N6N7j88P7L7kj9l0k0J09J3j42J19j05K11k86J54K5
$$ y = [-64, -58, 84, -147, -6, 117, -35, -54, 141, -121, 28, 2, -117, -51, 84, -56, -81, 116, -24, 45, 13, 135, -85, 61, -129, 81, 86, 50, -68, 86, 65, -10, 104, -8, -159, 209, -73, 49, -2, -49, 238, -57, 71, 107, 95, -9, -115, -132, 59, -23, -24, -74, -3, -5, 90, -36, 34, 1, -248, 69, 213, -20, 142, 71, 137, 32, -22, 63, -2, -106, 41, 34, -40, 7, -41, -108, 41, -70, -164, -50, -60, -34, 1, -35, 7, -91, -58, -31, -4, -1, 24, -77, 47, 19, -11, 70, 66, 82, -57, 9, -151, 124, 0, -42, 95, 31, -38, -14, 95, 42, -54, -5, -179, 16, 31, 128, 287, 68, 9, -30, -58, 11, -54, -118, 12, 13, -9, -26, 127, 16, 13, 86, -28, -8, 54, -86, 39, -141, 15, -46, 8, -88, 82, -23, -11, -53, 57, 28, 0, 42, 25, 13, 2, 137, 134, -33, -27, 37, 22, -54, 37, 169, 20, 17, -69, 43, 46, -79, 121, 67, -18, 61, -143, 2, -16, 42, 105, -26, 36, 75, -42, 7, 46, -38, 10, 55, 67, 64, 54, -25, 31, 88, -100, -23, 14, 12, -7, -37, -57, 52, 65, -77, 42, -63, 148, -138, 16, 41]
7451D1N2j04p3N5k7M0K5Q2K3j33j65J57j6N7o4m0j0J62j2j67P1k7Rn7K52k80J95
7478D6m5j2o5j5M4j6Q7j89J60n1L4L9r1n5j7J04Q2K6p6Kj17P6N6m3Q8M8qq3j01
7507i2M3NN4m1j3KjP9L7j42N1J25L3n2j22M8m4j22K75p6n0R8j43N2n8m3J39Mr3
7536d7J72p0P0j36j03N4M7N6l0j41J59j17j14J08L7l0J62j4o0p5L5P0K1n2Pj47
7562a38J58Q4l1j0o8Q9m2j26Q2j2m3p9P8n6P6N7n9J00j63K66q2k22K22j40N1N6
7588D8n6n2K15q4k2L6k5j21J96j71J91k30R1k9M4p9o0J34Rj56j0K96j08m2O8j16
7614c3j4K4N5p8K01q8j37R9N8p3o1R2K2r4O8p1jJ40j00Q2j59J08M0j38J57j73
7640g4K6L6j28K23j40L5J10o7Jj00J28Q0r2%n4M8K1j83K31j82K9R3o8Q3r6J19
$$ y = [41, 93, -11, -84, -29, -56, -16, 9, 91, 114, -19, -184, -27, -43, 14, -50, -90, -100, 62, 50, -117, -46, -73, -64, -121, 131, -149, 46, 1, -11, -76, -91, -47, -63, 24, -165, -5, -56, -22, 17, -74, -129, -146, -42, 40, 66, -10, -8, -125, -49, 7, -36, 52, 100, 92, 9, -92, -49, -44, 10, -31, -44, -42, -43, 36, 73, -69, -18, 107, 140, 88, -34, 14, -30, -152, 123, 47, -3, 95, -48, 4, -54, -97, 42, 46, -47, 125, 55, 125, -11, -114, -60, -13, 43, 13, -128, 31, -86, -200, -92, -55, -85, 77, 63, 3, -72, -37, 33, 54, 2, 9, -138, 20, 104, 73, 63, -5, 84, 42, -84, -2, -14, -57, -136, -58, -114, -38, 19, -40, 60, -103, 163, 81, -141, 81, -59, -8, 48, -8, -60, 155, 71, 49, 85, 60, -61, 135, -36, 155, -75, 16, -13, 31, -48, -108, 26, 35, -121, -131, 165, 57, 15, 83, -33, -47, -23, 32, -46, 155, 67, -70, 29, 87, 14, -47, 45, 67, -27, 41, -30, -31, 109, 9, 91, -68, 40, 80, -58, 99, -74, -48, -12, -140, 83, -57, -22, 88, 21, 22, -78, 50, 130, 38, 38, -16, 32, 53, -130, 101, -81, -52, 41, -27, 56, -40, 79]
7666G9J01p7j42p5J67j4n5q5K96j71Kj5j7r8J48Q1j18Q4j73K8Q3P0k37K1K88j81
7692a0k8m8J55Jj93q1J89O8P7j67R9L0k38K24j81K3%P5k32L53j20%Pm3K59j98
7718B1Pk6L1J8j78M3J31k7j61J26l0k0J68j34N8j77J22N4m2Q1j18n1J19K8l3L9
7744D9j47R9J84p2j40M7Q7j04M9J3M6j96L6j9J14j55L9J15j0q5k2K04j16j3l4
7769c1q2%J09r2K7j2J37O1k64J09N0L3j37O6n3J12N0j06r9K01k74K29j67K3J24
7794A4q6Q2o5o2N2O0RP9M9K8j39K8k87J49J16j41N0pM1KJ75k31O1Q1r0R7m7j5
7822Cl4j9K66k60J62P3k78Q5J53k24J39j20M8lo8J54o9oK3k3M0r8J03j09O3r0
7848h9J02Lj35J82o4m1r4p2J87J27j69Q9M0k15K02J3l7J42k73J10O7M2j0M7o0
$$ y = [79, 180, 103, -39, -114, 53, 39, -16, -101, 195, 24, 26, 11, -6, -104, 44, 125, 7, 91, -82, -54, 29, 99, -138, -117, 171, -10, -38, -86, 69, 70, -123, -204, -15, 53, 130, -37, 62, 92, -146, 78, -103, -80, -80, -5, -237, 116, -4, -4, 3, -40, 219, 21, 28, 2, 33, 51, -127, -84, 47, 20, -141, -15, -45, -65, 103, -31, 27, -150, -28, 26, -16, 65, -53, -104, 15, 43, 10, 49, -98, 1, 185, 113, -27, 20, 107, 3, 52, 65, 111, -85, -49, -68, 46, -109, -70, 45, 35, -50, -72, 132, 16, 3, -31, -113, -113, -4, -96, -69, -81, 56, 117, -147, -38, 12, 45, -92, -26, -79, 33, 83, -23, -122, 79, -195, 34, -133, -110, 14, -72, 10, -55, -117, -65, -5, 4, 83, 132, 160, 21, 49, -238, -89, 27, -114, -64, -71, -30, -28, 147, -84, -23, 58, -32, 65, 18, 3, -31, -50, 216, -44, 118, 191, -87, -2, 151, -73, 66, -54, -6, -9, -77, 77, 8, 2, 25, 2, 42, -56, 47, -62, 1, -89, 13, 16, -119, 63, -1, -42, -136, -208, -21, 106, -63, 26, 66, -149, 53, 66, 29, 171, -102, 8, 75, 117, 107, 154, 94]
7873I4j12J8p0M7J13P7n0k9j78L9l2J45j99J11J03q4K3p0j07J55Q5j48J55k45
7897a59J19r8P2J59k0p0K3Q8m1l8m2n3J52P2j91P4q1n6J5N8r0R8J00l9m8L4k3
7924A5OMk2J8l8J0m6M7k3KK32j90M0rj0n4l9J25Q6k56J18j22j10K83k01J15N6
7951C7lq2O9j41R0J9Jqjr5K03j10m1J20M6j57K48k29k03K17p7P7jm5ML0l8%N5
7980a5N5Q6j59l3J74j94K26l0k48K50j52PR0nlj8j38M2K63N7j71k11O7p4j5o7
8006b16K27oj7q3J4K60k77J12j67j44K44j13L6J18K6oO7j45o6K03Np1M5j26J40
8031F0m6j45J98o2lk2R8p5Q7o3n2kL0J07m0O3j32n4J27j09lK6j19K22K8Lj39M5
8059B8k4NKl0j06OK7Q6mL2j2mj22P2Q4j65J64o9Q3k12J14J11j21M7r0j8J08J57
$$ y = [94, -18, 0, -70, -23, 90, 167, 117, 88, -90, -51, -83, 62, -137, -26, 77, -7, 16, -54, -161, -6, 79, -69, 86, -159, -40, -138, -66, 93, 73, 3, 26, 114, 73, 35, -7, -60, 92, 164, -27, 47, -34, -90, -75, -17, -107, -9, 91, 52, 4, 38, 15, 21, 25, 3, 21, -17, -7, -53, -6, -29, -27, 205, 15, 55, 46, 36, -18, -57, 68, 154, -102, 16, -106, -216, 67, -134, -19, 37, 34, -48, 21, -120, -30, -11, -10, -18, -19, -114, 89, -21, -62, 58, 104, -53, 195, -34, -237, -20, -97, -20, -21, -66, -62, -32, -70, -70, -15, 40, 126, -33, -66, 108, -86, 140, 110, -138, 112, -40, -33, 57, 52, 49, 31, -107, -65, 198, 255, 84, -127, -60, -134, -149, -216, 11, 5, -12, -95, -81, 179, -98, 14, -153, -297, -53, -166, -130, -12, 14, 8, 75, -70, -136, 67, 72, 1, 46, -80, 60, 14, -131, 67, 5, 2, -20, 78, 3, 90, 27, -25, -27, 3, 110, 70, 133, 1, -53, 74, -35, -38, -12, -131, 91, 119, 122, -17, 28, 4, 9, 11, -19, -125, -119, -92, -6, -10, 22, 10, 6, -116, -44, 40, -125, 39, -30, 53, -159, -45, 66, -55, -8, -98, -116, -8, 149]
8087A49o3j7q0j15J44r4J25J16j68K7K4j09J87r4o2O7j22K50k13j21R0n1K01r3
8111b2j16J12o0O8r4Q7O3M0j23j46L43j71qq3J73L1r5rj7r5M4O1j9j43K84k55
8137a50J42N7q7%J57r9j7p6R2r2P9J89k11m5J19rQ2O0j13j23J42J7l0n5Q1l2j34
8164e6J48r5j74Q7J27k14J87q6J09j0l0j1J13J7k07J31p9J20J69k27JL5n6n2Q1
8189B8j15n1
$$ y = [149, 86, 69, -11, -126, 18, -76, 49, 165, -3, 24, 48, -61, 126, 32, -30, 37, -85, 165, -48, -169, -79, -130, 71, -22, -138, -26, -86, -18, -112, -25, 38, 78, -45, -191, 152, -19, -27, -110, 63, 94, -1, -10, -27, -122, -78, -17, -36, -179, 105, -150, -8, 49, -38, -38, 119, 20, 3, -73, 19, -73, 6, 195, -16, -61, 58, 49, 131, 191, 78, -45, 97, 114, 84, 29, 110, 78, -56, 92, -3, -177, -90, 37, -177, 10, -76, 33, 23, -7, -18, 95, 112, -95, 36, -43, 77, 246, 19, 20, 55, -1, -53, 28, -87, -138]
8191a38
$$ Imaginary data points
##PAGE= N=2
##DATA TABLE= (X++(I..I)), XYDATA
0@%%%%%%%%%%%qJ6j6J6k4L2m0M8n6O9p7R2j12J31j51J74k02K33k67L06l50L96
33B10m48N05n68O36p13P98q87R87j099J219j347J489j646J817k003K206k428K675
51A403k949L251l588L967m394M881n442O097o872P804q953J0409j2322J4952j8803
66a0559K4980l6436O4367k50507k70293O96087J38791p0794L53530p3346l37410
77B28410L27733P3550m29207Q225O972m62883k3280K11728k22473q0038J65622
88a95641j31211K5558K89564o0942j40292J91709J25869k874M0619n7664m1951
99D2744J05702K802o7817R208l3307j6285N4175l8801J4036J02724j10171j34447
111f9437Q3287j6259q7065N0407j05998j56672J45779M7246j73397R3855J34491
$$ y = [0, 0, 0, 0, 0, 0, 0, 0, 0, 0, 0, 0, -8, 8, -8, 8, -16, 16, -24, 24, -32, 37, -40, 52, -60, 71, -80, 94, -108, 125, -142, 164, -186, 210, -238, 267, -301, 335, -378, 420, -467, 520, -579, 640, -707, 782, -864, 953, -1050, 1156, -1272, 1403, -1546, 1705, -1883, 2084, -2310, 2571, -2871, 3226, -3646, 4158, -4795, 5614, -6708, 8244, -10559, 14421, -22015, 42352, -208155, -478448, 217639, 356430, 285636, 639166, 565820, 228410, 556143, 629693, 200486, 208711, 215683, -247200, -270480, -58752, -281225, -361263, -195641, -326852, -301294, -11730, -72672, -212964, -21255, 104614, 101740, 142359, 84695, 42744, 148446, 151248, 83431, 92639, 59332, 43047, 97222, 58421, 72457, 175181, 65010, -69437, 13850, -2409, -89474, -39067, -145065, -301737, -155958, -108712, -282109, -188254, -53763]
122e3763j17580P2645K01640l0330P0371J63791j30822n0702K00955n7968j78043
133I0194K2963r6159j40477J00400k4500j88481M4748M9135j16873O8941J34642
144e5467m6519L1728R1460l1599Q0275J39524p9375n5678Q4268m4122n8086N3034
156A09443o2646p4901P3595l1776j07040N3110K5888p0920L5972J8280o8563M9453
168e0105N4500o8258K7619P5372o7230k0923Q2452j0887j5344N9961j6602k6717
180B3838O0239l209n6203J3151L194l0414J874k5247m2697K1013J3471l0984p048
193e9022m370j1115K6351J9034O276L2903m307j8346N4112K7904l3085J4310P66
206E1411n1129K8770M3998n4317j8223K7617m7699j4383N0173l9163m0331M7855
$$ y = [-53763, -171343, -98698, 102942, 72612, 142983, 306774, 175952, 125250, 326205, 268237, 90194, 113157, 16998, -123479, -23079, -47579, -236060, -191312, -142177, -259050, -190109, -55467, -101986, -70258, 21202, -10397, 69878, 209402, 130027, 74349, 158617, 114495, 56409, 109443, 46797, -28104, 45491, 13715, -93325, -40215, -14327, -85247, -49275, -30995, -99558, -50105, 4395, -63863, -36244, 39128, -28102, -49025, 33427, 22540, 7196, 67157, 50555, 23838, 84077, 80868, 24665, 37816, 41010, 10596, 12470, -12777, -55474, -34461, -20990, -51974, -59022, -63392, -74507, -48156, -29122, -22846, 10057, 5750, -12596, 41516, 69420, 36335, 50645, 51411, 282, 29052, 73050, 18733, 510, 28127, -19572, -33955, 16218, -22945, -63276, -15421]
218a5421k0062l9543O9673J4181o1645L5759L2481m7653L0109N3999m2990n803
230C085M5866k5542p792M5457l1772l8981L2228j2886l3076L5050j862m9250J3746
243b5729J9088k5940R508K0911k5522l435K9268L286L242J0212j7521l517K3867
256A7718m788j0973J2813l434j1747J4561J1513r072q141p367j0662L35N062o484
270a0666r905m483M203J4332P292p786m115N635N541K704M447P727m27q978N270
285A0791J4710k475j2418o695q092n140O377j581j5045k675Q933M279P495N702
299D166k842N397P955m480L931J1752j0264j5945Q245J0496p040o351j980o730
313c690r07K534q283j1038k708j90J714N525K988J629O283M812J114P828P342
$$ y = [-15421, -35483, -75026, -5353, 8828, -52817, -17058, 15423, -32230, -2121, 51878, 8888, 3085, 48951, 23409, 15617, 61074, 29302, -9679, 22549, 9663, -23413, 11637, 9775, -39475, -25729, -6641, -32581, -23073, -2162, -27684, -31119, -1851, 1435, 4677, 14889, -2632, -6149, 17718, 12930, 1957, 14770, 11336, -411, 14150, 25663, 16591, 8450, 1083, -9579, -9244, -4182, -10666, -20571, -25054, -20851, -6519, 773, -7013, -11128, -5493, 48, 2752, 7199, 14926, 14499, 5521, 10791, 25501, 23026, 10608, 3913, -4179, -9319, -2942, -4523, -19568, -22243, -13310, -9031, -1536, 4166, 1324, 6721, 14676, 10196, 14127, 25879, 15615, -330, 7915, 18411, 11371, 5020, 3040, -3690, -4597, -2063, -10346, -21384, -24092, -24282, -22568, -17043, -14055, -12426, -6143, -1331, -217, 7611, 14953]
328A4953r119q664J0605R870n881m638K140r31r14J204o362j1164o272m319k589
343b2081J800k30j363M320M946N462J0838O453q281l580J2429Q592m783m24O194
358B0292K41kO621K86j0567p670n629o955r97k902j1590l403L595j562P248J1844
374a150q395o210J8917Q296p122J1415O158j5276L441J4414q513n081Q85j8289
388f510o129J1847r911j2074R170o662j0227K2535J1660j4520P064J1874j0301
401b184L852J1954j1756p858N599k225J146L350p655p79P820k150n3O261l430
416A892k649N050j13L211q80j5506J880J0917j4380j057J6873j3460m982K7827
430A4623l501j3981K6048L387k3151J6120P023k4942J0711L185l9631N104K1997
$$ y = [14953, 5834, -2830, 7775, 17645, 11764, 7126, 9266, 8335, 7421, 8625, 2263, -8901, -15173, -19492, -22081, -20281, -20511, -21874, -17554, -12608, -7146, 3692, 10145, 1864, -1716, 10713, 19305, 14522, 14098, 20292, 20533, 20531, 27152, 27438, 16871, 9201, 3572, -3383, -4380, -7282, -18872, -22275, -18680, -20242, -12994, -1150, -9545, -15755, 3162, 11458, 4336, 15751, 21909, 6633, 10074, 24488, 15975, 10894, 11779, -6510, -12639, -792, -10703, -22777, -13607, -20269, -30496, -7961, 3699, -10821, -3757, 8117, -2184, 1668, 13622, 1866, -5992, -393, -2618, -1472, 1878, -5777, -6556, 1264, -886, -939, 5322, 1892, -757, 4293, 4180, 7391, 6511, -8995, -7115, 3802, -10578, -11635, 5238, -8222, -13204, 14623, 11122, -2859, 23189, 26576, 3425, 19545, 26568, 1626, 12337, 15522, -24109, -19005, 2992]
443B992l3713n407K8938k3404p444M2694l300j4407L1576r94j6115L5648P860
456D4924l0771J0112j531k7304K1472M129m7007M605K0516k9947L124K3713k3857
469b7822M055L2101k2430o145L4449j4084n776L9363k1764l5029L6097N144k3032
482d873L4824l178n6332K1066L8791k1848L121N034m5133O643M4373k2242j8445
495a8199J9413k3926j1178M0782n238k7890J7251M611p243K4607N72k0140J3023
508F445R575m66J2842k0814k6679K8036R960k1608J0816j1361l1828L6407K3617
521B4942l8318J0626J1243m6353K6901N1053n4172j5755N0310l9264j4228P9187
533D6172k6194o2107O0220Q044n6761N4736K2590p8880K4169M6621o2891J3130
$$ y = [2992, -30721, -36128, -7190, -30594, -38038, 4656, 1356, -13051, 18525, 17531, 1416, 37064, 44924, 14153, 24265, 22734, -4570, 16902, 21031, -25976, -21371, -855, -30802, -27678, -3965, -27822, -23767, 8334, -14096, -20241, 14208, 124, -5652, 33711, 11947, -23082, 13015, 18159, -4873, 29951, 26773, -29559, -8493, 30298, 8450, 11571, 16605, -28528, -21885, 22488, 246, -18199, 1214, -22712, -33890, 6892, 1654, -26236, -8985, -4374, -11617, 12990, 13562, -6578, 6445, 16020, 15554, 28396, 7582, -19097, 8939, 18899, -2709, 8107, -3254, -35082, 1325, 24942, -13376, -2750, 8493, -37860, -10959, 40094, -14078, -29833, 20477, -18787, -33015, 46172, 19978, -42129, 18091, 26135, -30626, 24110, 46700, -32180, -8011, 38610, -24281, -11151]
545a1151O3501o4076k8827O6066l1982l6080O7209j2549o2011M4913K3862l7345
557a8470L4040K2792m9916P613L2322k8482m506J6909k7322k620K6318j3978j0651
570a5951J3467k443O627Q617j7751j333Q614o474K5218J7226m3370r312L3376
583A6511j2446K497K7463m8198l3507N3609M527k7014L2512j5758m5354M8866
595C708K5665m6104K2753K0161n8992J3111N2203m1232j4953M0830k9298j3424
607b5572M8772j9771k5282M7488o040l7073K7983k674k6573M0958N401n0031J9514
620b900K1293l4465J5583J8890m3783L109K4035l1722J7271M2110m0642j0275
632b1496M7854k0010j2965M2016k6331l0921N1393l329m6820L4008J3157m0821
$$ y = [-11151, 52350, -11726, -40553, 25513, -6469, -42549, 24660, 12111, -49900, -4987, 18875, -18470, 15570, 38362, -11554, -3941, 28381, -101, -4607, 12302, -15020, -17640, 8678, -5300, -15951, -2484, -4927, 1700, 10317, -7434, -8767, -153, -6627, 18591, 35817, -7553, -16865, 16511, 4065, 6562, 34025, -14173, -47680, 5929, 10456, -16558, 15954, 196, -45158, 3708, 29373, -16731, 6022, 26183, -32809, -19698, 32505, -8727, -23680, 17150, -12148, -25572, 23200, 3429, -21853, 25635, 19595, -17478, 10505, 7831, -18742, 22216, 27617, -22414, -2900, 18393, -16072, -489, 18401, -25382, -22273, 1762, -29960, -12689, 29421, -11221, -21496, 26358, 6348, -6617, 35399, 9068, -21853, 29540, 26211, -20609, 13399, 26556, -14265]
644a4265K0373J0304m4544J9934K8150m2377M608L7861l0266j2134L3868j1611
656i9j1122K2314j6075j3451L1126J473j8976N614o532j946K0758j2768j6334
669a6018K1064k217j2639K0940j961j5536J5277j2699k1710L6373P266m0298J7261
682d897J8907l1697J7072K2810m5825M056M4250l4900j7385M8402j1383k4397
694a4987L4866j2090l2366L8797L646m4465L0479K7796m3468K931L2866k4903
706h98l116K5811k8922j6586L7287j802k3364J7898L392j8717Q018K67j6068J3383
720c417R814k0930o03K1258J243o371J123j872n99L185j420P14M516J605q35m855
736B556k653P862q99j4831k521Q289K037O31k556n404P120N627j3173m178J2339
$$ y = [-14265, 6108, 16412, -28132, -8198, 19952, -22425, -17817, 20044, -10222, -22356, 11512, -99, -11221, 11093, -4982, -18433, 12693, 14166, -4810, 804, -5728, -7674, 13084, 316, -16018, 5046, 2829, -9810, 11130, 9169, -6367, 8910, -3789, -25499, 10874, 18140, -22158, -4897, 14010, -17687, -615, 22195, -23630, -19574, 24676, -10224, -27609, 20793, 9410, -14987, 19879, 7789, -24577, 14220, 17866, -26599, 3880, 31676, -11792, -8861, 24005, -898, -4014, 21797, -7125, -23711, 13576, 11774, -11590, 6308, 9700, -9017, -999, -732, -16800, -3417, 6397, -14533, -15136, 6122, 7365, 994, 2117, 245, -354, 2831, 1411, 2125, 6641, 8246, 7411, 2556, -97, 7765, 6866, -7965, -10486, -2197, -160, 471, -2085, -7489, -369, 5258, -7915, -12093, 246]
751B46j351o226P646K203j836P684k670j0374O082N010q637j256N312J525M254
766G612j440j0599L085R093r087r405O515K471k813K853j64p92M414l509o740
781h506M203M476k404J27K76j506O191M281q157l089Q516P27n230K998M760l56
797G307k759k892o36K604j183n369j426N361K781j516m22k930l383K371J74n733
813g651qO713J185k075O067N073n030m745l40J98K077J87m263J836O171N28q49
830E074J123m733o101K336J391m944O96L650l771q40O903J055m506j865j25J259
846c398L996K26l543J420L005k336K612N023n256m115O002J274m061K979k22p058
862c452L71N824j731j297J568l388j7N325k812m690K336l284l580Q461L760p041
$$ y = [246, -1105, -7331, 315, 2518, 682, 8366, 5696, -4678, 1404, 6414, -2223, -3479, 1833, 3358, 7612, 6172, -4427, -1342, 7751, -1336, -10741, -4226, -1755, -4568, -1715, -1879, -2671, 1743, -1766, -8506, -4303, 173, -2231, -2104, -1828, -3334, 2857, 7138, -1019, -4108, 4408, 5135, -95, 2903, 7663, 7307, 4548, 1656, 1020, 3624, 2441, -2928, -4354, 1007, 3788, 2272, 1850, -1080, -4463, -2092, -1918, -7651, -7659, -946, 239, -1836, 4231, 9304, 4274, -471, -811, -613, 1464, 1651, -2612, -776, 5395, 5923, 5074, 6197, 1464, -4637, -2301, -910, -5854, -5158, -1508, -5279, -6119, 784, 1839, -2667, -4532, -4657, -3398, 598, 824, -2719, -1299, 1706, -630, 1982, 7005, 1749, -2366, 3636, 4910, 849, 3828, 3606, -3452, -3081, 2743, 1012, -285, 1283, -2105, -2122, 3203, 391, -4299, -1963, -5247, -8827, -366, 3394, -3647]
878c647J761O443k649o38M072l238m077J760NJ378L432k362k747K242j99j657
894a21J806j455l827J310L152m81m36L89J403n74m580P28N415l148m549L623R88
911c57k279L490K50m306L470K193l493L981K382n003L100L047o939K653N296r673
927b188k893R482k184n263K848l468j321P169m650o376P904j607n848J0333O97
942B635j0290P761L548j0686P390Q365j1731K08R027p101K029R146j2051k369
956d119J5020r008r754J5951k073j3637R757N33j3205R694N610j4950K718Q367
970I04q331L482Q684r237K49J0186q114n41J3255n331o006P793j174j502N514
985I831o116l252O401p933m726R502n973o656J1963o681j3368J6134M735j4712
$$ y = [-3647, -1886, 4557, 1908, 1270, 5342, 2104, -1973, -213, -208, 1170, 4602, 2240, -507, 1735, 1536, -121, 1685, 230, -3597, -2287, 865, 384, -52, 337, 1740, 1166, -3414, -2686, 2729, -419, -4968, -1345, -357, -2636, 854, 1104, -3202, 268, 2461, -1032, 2949, 5331, 328, 3428, 6475, -464, 2189, 7485, -2188, -5081, 4401, 2217, -3046, -198, -3666, -4987, 2182, -2468, -8844, -940, -2547, -8395, 1938, 2635, -7655, 106, 3654, -7032, 358, 8723, -3008, -2800, 6227, -874, 1155, 10301, -1750, -4119, 10901, 1893, -7861, 8090, 6017, -7620, 2137, 2670, -10535, -841, 4769, -10181, -7463, 904, -7427, -3945, 4739, -4498, -4249, 5937, -2177, -2718, 10537, 5206, -800, 6993, 5819, 4317, 9831, 3715, 463, 6864, -1069, -5795, 3707, -2266, -8922, 3041, -3640, -17008, -874, 3861, -10851]
999a0851R685L381j6553J3590J3734j7677N320J2837k1932K107K7070j4274j3423
1012f986J9912r481j4833K4128k61k4325J3071N012j9837J1152R218j9177O922
1025e485J3724j7598l58J5347j1067j493J6314r064q406J0666j986M45J1653r171
1039C521p397Q570o309j111J4729j1433j3268J4180l122r451J7439k875j8378
1052a4905J5915M703j8492J5034Q543k3954J0715J7964k4425J884K5532j8863
1064c49q644K4913j3101j7439K2776k926j8776J7127L76j9511J7946J1265k0610
1077f953N982J0077j6034P625J6478j6797o889J2245m784J956J1784j1446q178
1090d934O260o759K679J3382j5013j1803J3136l334l198J8120p655j5694J7137
$$ y = [-10851, -1166, 2215, -14338, -748, 12986, -4691, 629, 13466, -8466, -6359, 20711, 6437, -6986, 12926, 3445, -11388, 12740, 12479, -11846, 1225, 6237, -13600, -2448, 6770, -12407, -5485, 8239, -9359, -9717, 5630, -5437, -6930, 9384, 320, -8086, 2580, 594, 1039, 12692, 3521, -3876, 4694, -1615, -2726, 12003, 570, -12698, 1482, -1640, -11091, 6348, 3473, -14905, 1010, 5713, -12779, 2255, 10798, -13156, -2441, 15523, -8902, -7018, 18514, -349, -8993, 15920, 2819, -14620, 8156, 5230, -13546, 3581, 3957, -15554, 2392, 13657, -6953, -971, 9106, -6928, 697, 17175, 378, -6511, 5734, 950, 2906, 14690, 3244, -4934, 1326, -5433, -2754, 10628, -4385, -16188, -3052, -6386, -9584, 8536, 881, -14813, 2324]
1103B324K313j4601J5448M197j9338J4215J0919k4291P381K0885k0380k182K0910
1116A7800k0881j5687K3991l324j5002J6740o411k2042J9546J2402j6841Q177
1128a532O981j9638Q136J8693j2223j155J4597j0529n045J3460k976m958O862
1141A0673p674n981P754n928m099J0497o785q207R868l756o546J3367l332j2492
1155a2641J1909J897j1060J3540M156j7408J2001J2907k0052M655J8350j7836
1167D18m103J9742j2826j1579J9004n771j6780J3138j022j5515J3858O052j8479
1180a3863N425J1072j1878O521J4917j3875o475J3632q53k452P232n811q390N417
1194F19K549j195J700n656m724O114R47k448L375k513j534O256j953l357N246
$$ y = [2324, 4637, -9964, 5484, 9681, -9657, 4558, 15477, -8814, -1433, 19452, -928, -3110, 17800, -3081, -18768, 5223, 1899, -13103, 3637, -2774, -24816, -5270, 7132, -9709, -1532, 5449, -14189, -6053, 12640, 417, -738, 13859, 3330, -1715, 11745, 8769, 3811, 10673, 2999, -2982, 4772, -1156, -5255, 5242, -1543, -9750, 118, -3638, -10184, 3183, -149, -12641, -732, 1165, -9895, 3645, 7801, -9607, 2394, 15301, -4751, -96, 18254, 418, -3685, 16057, 3231, -8348, 10656, 4885, -11895, 1243, 221, -15294, -1436, 4616, -13863, -8438, 2634, -9244, -2723, 12194, -1681, -8156, 5476, 4623, 2171, 9403, 3592, -4798, 619, 3168, 1973, 3673, -1983, -6707, -593, 354, -2094, 1281, -1232, -2766, 3490, 1537, -1820, 3426]
1209C426l046m254Q111k645j0341P823L963q823O491N247j2743J931J2104o416
1223H28k420P116p939j459J1838n606q470R798j382r651P962K364r759O868O313
1238F401r477K043P132o651Q01O790o028k433M088o416j41R437o578r682O757
1253c957K718l495N698q4n976N565M420m434L109K597n828J075L385m312J945
1268B426L791p892l539P976j177n913J448J134r69K613j361j731L409O26l144
1283b303Q39J282n04J455m04k027K860K722l048j509J252J586K594k686l418M983
1299C674K481o255j041L157l444k319J658k778oN846k511m372N793J817m317J758
1315h59k08k881O286K563q336J864Q554m298n423M746r50l499L406j387l201O309
$$ y = [3426, 380, -3874, 4237, 1592, -8749, -926, 3037, -5786, 705, 5952, -6791, -4860, 7244, 828, -1592, 5524, -2415, -3874, 7964, 2358, -6112, 3686, 2304, -7347, 615, 2979, -6780, 88, 6401, -3076, -1033, 6099, -552, 249, 7039, 1011, -1422, 2666, -3750, -3891, 5546, -1032, -10714, -3957, -1239, -4734, 964, 880, -5096, 469, 4889, 455, 3564, 6161, 333, 1408, 4793, 481, 2426, 6217, -1675, -5214, 2762, 1585, -4328, -2880, -1746, -2715, -102, -1463, -3194, 215, 841, -2303, -1464, -182, -686, 769, 365, -1662, 1198, 3920, 872, -637, 615, 2201, 4795, 2109, -1309, 3674, 6155, -100, -1141, 2016, -1428, -3747, -2089, -4867, -4873, 973, -1538, -5910, -117, 1700, -2617, -859, -1067, -3948, 2338, 4901, -3435, -1571, 6983, 2685, -2738, 2008, 1058, -2441, 965, -422, -3623, 2686]
1331B686R74p155K693N307l640j104J368m441J625O275m791o314N908K287n226
1346c548J081L334p25J014K96k188K946L270m274l362L740K069q54N70j034j795
1362E40L032O37n288j761L194l8l721L19L762O28k607j793j86J676L70l884j799
1379f919M022K524r13Q98J558p34J972J472l719K91N098k204m051L322J930k790
1395A757j552k751j185L278j447n245K373L725k800J54K323k232J314L502k734
1410a520M24O027J1j951J676m97L58K607m581l664N733k95n974K775K206m858
1426a523K4j58m673K452L171m786Q06N076k219N17M163l689o47O229l081m261
1442b599N841J788l969J254n52k691J728r77l033L391R54m265K426J643k972J913
$$ y = [2686, 3660, -3495, -802, 4505, 865, -239, 1129, -3312, -1687, 4588, -203, -6517, -609, 1678, -3548, -2467, 867, 142, 1156, 1452, -736, 2210, 5480, 1206, -2156, 1584, 3653, 2799, 3369, 2335, 540, 3572, 4209, -1079, -2840, 354, 316, -3405, -3086, 676, 1304, -1303, -3096, -3282, -1606, -1236, -5120, -6919, -2897, -373, -1286, -388, 1170, 436, 2408, 3880, 161, 452, 5550, 3346, -705, 2617, 4547, 1757, 205, -2546, -3731, -453, -1900, -7145, -4772, -1047, -3847, -3693, -1370, -3602, -2288, 1214, -1520, -1096, 4931, 4942, 2991, 4667, 4170, 4528, 7135, 2554, -1110, 4623, 4328, -1646, 1129, 3335, -1523, -1499, -1657, -6330, -3878, -707, -5493, -4687, 389, -1830, -1313, 2850, -839, -1486, 4743, 1662, -2599, 3242, 5030, 1061, 2315, 1763, -928, 800, -177, -3210, 181, 1135, -3130, -704, 939, -2033, -120]
1458a20N72n792J386L961k962J545L259l879K314M325o505O6P477n915l587R553
1474E698k289o278P364j006q332O388P08j0569N316N338q048M865O875r220J515
1489a675J1021p896m077R731m950o372R451j769q826M918o19o450O782O20q548
1504h659N046M311m596O400M151q571J409O298m159J617L954q503j11O484o786
1519a715k35O527q611k253J1220o083o055J1928j532q412R202j377j1900Q428
1533h68M637j0883N766M082j3813O232J3536r317j311R692q339j289J4991m219
1547H897q838O566k735o693O685k805r054M894o74o425O957J370p220O287L964
1562A176n363N658K479o359P165M877r163K980M230j0846L682Q606j3900k015
$$ y = [-120, 452, -5340, -3954, 7, -2955, -1410, 1849, -2030, 284, 4609, -1896, -1830, 5647, -268, -3855, 5698, 3409, -2869, 4495, 3489, -4843, 1545, 2253, -8316, -3000, 2338, -5710, -845, 6030, -3190, -1675, 9346, 1450, -2627, 7104, 2154, -4218, 5233, 3464, -5362, -444, -1063, -7513, -731, -111, -8659, -3613, 698, -3898, 2502, 6653, -1918, -509, 5789, 1630, 3247, 7201, -1302, -1413, 5071, -1715, -1950, 4577, -4034, -6287, 4933, -1150, -7205, 4723, 3191, -5221, 3981, 2604, -9296, -868, 3769, -7114, -1348, 2734, -11079, -4847, 8689, -628, -1939, 7753, -586, -1875, 13116, 8897, 59, 6625, 3890, -2803, 3882, 1077, -7977, -3083, -3757, -10182, -3225, -1855, -9075, -2788, 1176, -4187, 1471, 3950, -2409, 4756, 9633, 470, 3450, 7680, -3166, 516, 9122, -4778, -6793]
1576f793J3124r206m981J5176n675r426J2863k478j1803J3408J635j6420Q299
1589b277P062j4741O433J2132j5174j452J4075q223j863J5276p065j0685J0607
1602D105J359m904Q249m796j2296P885M937p090K805r18r171N631P110m744J423
1617d15R39n239O738N756p739P21K699p543N403Q220j3178l899J1606l493k161
1632a585Q526r599p503J4594J118r071P277k789j0990J3015Q015j3915Q69N614
1646C576j0552M389J2514j0414o336Q599l039j717Q064n431o536P873p35n532
1660e277O026j066n369O387J400o178L697J648l128N508L33o336M723K180n985
1675a437N271K398j0548K214P357q166m68P629q057k839J0230n496m975J0386
$$ y = [-6793, 6331, -2875, -7856, 7320, 1645, -7781, 5082, 2604, -9199, 4209, 5844, -10576, -2277, 4785, -9956, -3523, 8609, -6565, -8017, 6058, -2165, -4028, 11248, 4183, -6502, 4105, 5464, 560, 8809, 4013, -8283, -398, 4539, -2551, 254, -664, -9835, -4204, 2906, -1838, -415, 524, -4715, 2023, 7779, 40, 761, 3460, -4083, 1320, 9540, -3638, -7537, 4069, 576, -1585, 6941, -2658, -10161, 4433, 5551, -3520, 3757, 968, -10022, 2993, 11008, -2907, -2038, 3576, -6976, -2587, 9927, -487, -6823, 1776, -1263, -2980, 5084, -347, -6883, 990, 255, -5277, 749, -317, -5686, 701, 2101, -4077, -380, 1268, -1860, 3648, 3981, -2355, 2368, 4548, -1437, 3834, 6232, -4316, -2102, 5255, -2911, -3379, 4250, -3807, -6646, 3584, -1912, -6887, 3499]
1689C499l145p460J0446J52r713R226N172j1329L668P866r241Q94Q660p997l846
1704c148Q210m142l983O780l726n682O826j27o474M510J240o776L250L783m582
1719d041J100L016k220K507K284l634J709L181l084R90K278m679P90N214l473
1734A938k812K787k842j631M364l125l625L582k321k191O530j80n727M258K993
1749A998l465L381K400n414J460M357l167n55K705l796k17M178l791k411M273
1764A936k908k861M896l31m127K882P94k441L476Q12m189K338J865l815J915K346
1780B588m973M22M158l427j580M635j570k873L189J48k254K508K60k606K680J667
1796B972l407J291K507l218n91K820j778k182J944j50k575J103J290j609p12Q11
$$ y = [3499, 354, -7106, 3340, 3492, -6221, 3005, 8177, -3152, 516, 8382, -859, 35, 8695, 698, -3148, 5062, 920, -3063, 3717, -9, -5691, 1135, 1008, -5466, -956, 284, -6492, -3242, 541, -4041, -2941, 75, -2145, 362, 2646, -988, 721, 3902, 818, 1808, 4086, -593, 197, 5411, 1938, -874, 1913, -929, -2560, 1804, -1321, -4946, -1364, -3685, -5876, 654, 474, -5253, -995, 1998, -1467, 1914, 4314, -1100, 360, 4717, 1550, 995, 3700, -96, -313, 3865, 74, -2337, 1936, -972, -3833, 1063, 732, -3395, -513, 281, -2160, 1316, 2128, -2061, 277, 2142, -1673, 242, 2588, -2385, -1963, 2195, -1232, -2812, 1823, 253, -2620, 569, 717, -1537, 971, 1231, -1375, 1305, 2972, -435, 856, 3363, 145, -446, 2374, 596, -1586, 358, 208, -2367, -1264, 26, -1583, -2295, -1484]
1812a484K5M11P38M7n07Q80J27m68P20J130j599q67K213M12j574J665J461k519
1830H11l43K541j580j734J633j072k406J317j63k643J364l42k523J737J745k309
1846c967J512M069j520o72M927K09k119K892J44k719Q72k05l680L93M98l512m66
1863c344J463k446K55L084j647j466L944N25k213K528J529j710L43O11q07O74
1879A323L96k268J48J684r47l57J349k83l09J319l34j125m4K62j223j198q31R26
1897a512k68j846M50K118J73k83R87R00J027J238n87m07J179p12j590O20j561
1914g4j565J375j093k655K105K290k209k73K867k41M00J277j460M90K242l026
1930D50k089L065j158k958K081r00k400L032J207m121J984L660k315J75K375j841
$$ y = [-1484, -1459, -1048, -310, -263, -770, 110, 237, -231, 489, 1619, 20, -847, 1366, 1778, 204, 1869, 3330, 811, 468, 3009, 1429, -305, 1328, 256, -2150, -833, -996, -3639, -2275, -2617, -5140, -3403, -1658, -3967, -2455, 1614, 94, -578, 4349, 4558, 2439, 5331, 5475, 2756, 3628, 3423, -257, 136, 634, -2878, -3344, -1881, -4327, -4072, -988, -2635, -4101, -157, 368, -1845, 683, 2212, 502, 845, 1456, 649, 1323, 1719, -549, -401, 1283, 336, -21, 1328, 1045, 736, 2055, 1721, 596, 552, 814, -409, -1607, -2438, -1512, -1780, -3626, -3176, -1058, -885, -1168, -181, 719, 1746, 2984, 2397, 1990, 3169, 2457, 867, 1487, -74, -1639, -264, -1357, -4012, -1907, 383, -1826, -2099, 768, 527, 927, 2204, 744, 1234, 3476, 450, -1639, 1426, 268, -2690, -609, -1509, -3909, -877, 330, -3791, -1807, 1853, -462, -287, 2088, 247]
1946B47P23K468l799r44M174k595l418M335R51l067K117L41k710L253J921m923
1962i26m22K275j957n7J040k993M04K638k243j112L423j58j475J516J546N35J267
1979C301j212j02K339j063j957M33k002p99K720k953l303L186O35k768K527J02
1995i16k572L635O15m823M007L692o718L72N869m193l98N928m061k565O828j743
2011B957m848N578l27n860L564J026m981M435R52q146K130N925m990q50L251l536
2027c720R45N919k683j367L997k832r27N343k780l652L694j982k355O234j619
2042B215o898M330K616l312L008p11o618N797N662p271K61L212o829J641Q489
2057E592n805m747N530l003j486Q916j875p987L968J641k423O045q6q600L637
$$ y = [247, 970, 3438, -361, -1305, 2869, 274, -3144, 1191, 2142, -925, 1192, 1533, -1177, 2076, 3997, -926, -1348, 927, -1030, -1087, -47, -3040, -2636, 2, -2241, -3353, 70, -88, -1563, -47, 1499, 2034, 3301, 2089, 1987, 4326, 3263, 1306, 1739, -263, -1062, 1658, -1295, -4598, -1412, -777, -3545, -1018, -916, -3488, 147, 762, -4061, -54, 3638, -3080, -2708, 3161, -1032, -1430, 4498, 437, -2128, 4700, 2957, -1891, 3687, 3360, -2500, 1064, 2090, -2891, 1544, 2496, -5650, -3520, 2405, -2585, -3435, -184, -3720, -2775, 3144, 461, -906, 3091, 259, -668, 4675, 1895, -1757, 1937, -45, -2400, 3834, 2215, -4683, -353, 2263, -1049, 1959, 1248, -5370, 427, 6089, -1182, -921, 2291, -4538, -2897, 5592, -213, -4960, 570, -2433, -3919, 4997, 3122, -4865, -897, 744, -1679, 4366, 4280, -4320, -683]
2072f83N258n021J097K362n619Q78M771l475n78K936l363Q94M353m274j813L504
2088A227l237n73O273m268m897N839m04l803N974j582n995O763J865o821O198
2103B559L592r122L067O181q120L90Q428p405l563Q647m296m953P538l083o892
2118g032O767P31o288O024J408p499M964N557o126P14L773m910J543N882l644
2133A864j116K694l803P54M093m620j914L879l346j006M716l583k713N581j497
2148a7l837M921k077m071Q026N87p784M823K318p056N254N455r020m14O826m868
2164i34q1P220o066m515P697k358m516O283j667o317O341J851o905L132L573n317
2180b579J664L443m602k46M126k703O43K701m142n75L977j794l05K738l018j353
$$ y = [-683, 4575, -446, 651, 3013, -2606, -1728, 3043, -432, -1010, 1926, -1437, -543, 3810, -464, -2277, 1227, -2010, -2583, 3690, -578, -5475, 364, -40, -3843, 2131, 549, -5446, 1317, 3182, -3639, 2559, 6151, -2971, 96, 6277, -1843, -1453, 6975, -430, -3993, 4654, 358, -4595, 2943, -140, -7032, -265, 466, -5822, 202, 1610, -5889, -925, 4632, -1494, -780, 2993, -1917, -374, 5508, 1864, 748, 3442, -361, 393, 4486, -134, -2048, 1831, -1515, -2521, 2195, -1388, -4101, 1480, -17, -3854, 1067, -1010, -5081, 2945, 3532, -4252, 571, 2889, -4167, 1087, 6542, -2478, -2892, 3934, -934, -1015, 6205, 139, -4376, 3321, 963, -3553, 2730, 1063, -5254, 1087, 2938, -3967, -835, 2738, -2579, -915, 2528, -2074, -2320, 1806, -897, -254, 2447, -1695, -2270, 1707, -87, -392, 2346, -672, -2025]
2196b025M144p75j977K560k063j566M074j445k835M046o91m847M157J506n320
2211c057K123K580m443J480M193m418l56M273l502j448M636k680k387N110j335
2226G69l476M931Q61m301K737J657l747J600J742l436J030J743l495K75K335k915
$$ y = [-2025, 2119, 1344, -633, 1927, -136, -1702, 2372, 927, -1908, 2138, 1447, -3400, 757, 2263, -3057, -934, 1646, -2797, -1317, 2876, -1542, -1898, 2375, -1127, -2575, 2061, -619, -3006, 2104, 769, -2707, 2224, 3085, -1216, 1521, 3178, -569, 1031, 2773, -663, 367, 2110, -1385, -1110, 1225, -1690]
$$ [...]
8191d8
##END NTUPLES=NMR FID
##END=
