##TITLE=1H_DPAH47-2
 CDCl3
 8 sc, 
 6.04.2022
##JCAMPDX= 6.0         $$ Bruker NMR JCAMP-DX V2.0
##DATA TYPE= NMR FID
##DATA CLASS= NTUPLES
##ORIGIN= UXNMR, Bruker Analytische Messtechnik GmbH
##OWNER= root
$$ XWIN-NMR		Version 3.5
$$ Wed Apr  6 11:09:19 2022 Russian Standard Time (UT+4h)  she@DPX200
##.OBSERVE FREQUENCY= 200.131346
##.OBSERVE NUCLEUS= ^1H
##.DELAY= (6, 6)
##.ACQUISITION MODE= SIMULTANEOUS
##.ACQUISITION SCHEME= undefined
##.AVERAGES= 8
##.DIGITISER RES= 18
##SPECTROMETER/DATA SYSTEM= spect
##.PULSE SEQUENCE= zg30
##.SOLVENT NAME= CDCl3
##.SHIFT REFERENCE= (INTERNAL, CDCl3, 0, 15.7039)
##AUDIT TRAIL= $$ (NUMBER, WHEN, WHO, WHERE, WHAT)
$$ ##TITLE= Audit trail, XWIN-NMR		Version 3.5
$$ ##JCAMPDX= 5.01
$$ ##ORIGIN= Bruker BioSpin GmbH
$$ ##OWNER= she
$$ F:/spectra/data/she/nmr/H-F/1/audita.txt
$$ ##AUDIT TRAIL=  $$ (NUMBER, WHEN, WHO, WHERE, WHAT)
(   1,<2022-04-06 11:08:19.20 +0400>,<she>,<DPX200>,
      <created by zg, POWCHK disabled, PULCHK disabled
       configuration hash MD5:
       00 E9 B6 7A A2 85 ED C7 34 08 36 98 17 FE 4E 26
       data hash MD5: 16K
       C4 8F E2 56 1E 26 C9 AF 9F 08 50 A3 4B 24 A0 17>)
$$ ##END=
$$ 
$$ hash MD5
$$ E7 9F 33 4C FA E3 40 AF D5 6F 86 46 E0 F0 6E CA
##$RELAX= 
##$RELAX= 
##$RELAX= 
##$RELAX= 
##$RELAX= 
##$RELAX= 
$$ Bruker specific parameters
$$ --------------------------
##$DU= <F:/spectra>
##$EXPNO= 1
##$NAME= <H-F>
##$PROCNO= 1
##$TYPE= <nmr>
##$USER= <she>
##$AMP= (0..31)
100 100 100 100 100 100 100 100 100 100 100 100 100 100 100 100 100 100 
100 100 100 100 100 100 100 100 100 100 100 100 100 100 
##$AQSEQ= 0
##$AQ_mod= 1
##$AUNM= <au_zg>
##$AUTOPOS= <>
##$BF1= 200.13
##$BF2= 200.13
##$BF3= 200.13
##$BF4= 200.13
##$BF5= 200.13
##$BF6= 200.13
##$BF7= 200.13
##$BF8= 200.13
##$BYTORDA= 1
##$CFDGTYP= 0
##$CFRGTYP= 5
##$CHEMSTR= <none>
##$CNST= (0..31)
1 1 145 1 1 1 1 1 1 1 1 1 1 1 1 1 1 1 1 1 1 1 1 1 1 1 1 1 1 1 1 1 
##$CPDPRG= <>
##$CPDPRG1= <>
##$CPDPRG2= <>
##$CPDPRG3= <>
##$CPDPRG4= <mlev>
##$CPDPRG5= <mlev>
##$CPDPRG6= <mlev>
##$CPDPRG7= <mlev>
##$CPDPRG8= <mlev>
##$CPDPRGB= <>
##$CPDPRGT= <>
##$D= (0..31)
0 1.2 0 0 0 0 0 0 0 0.06 0 0.03 0 0 0 0 0.0002 0 0 0 0 0 0 0 0 0 0 0 0 
0 0 0 
##$DATE= 1649228898
##$DBL= (0..7)
120 120 120 120 120 120 120 120 
##$DBP= (0..7)
150 150 150 150 150 150 150 150 
##$DBP07= 0
##$DBPNAM0= <>
##$DBPNAM1= <>
##$DBPNAM2= <>
##$DBPNAM3= <>
##$DBPNAM4= <>
##$DBPNAM5= <>
##$DBPNAM6= <>
##$DBPNAM7= <>
##$DBPOAL= (0..7)
0.5 0.5 0.5 0.5 0.5 0.5 0.5 0.5 
##$DBPOFFS= (0..7)
0 0 0 0 0 0 0 0 
##$DE= 6
##$DECBNUC= <off>
##$DECIM= 32
##$DECNUC= <off>
##$DECSTAT= 4
##$DIGMOD= 1
##$DIGTYP= 9
##$DL= (0..7)
0 120 120 120 120 120 120 120 
##$DP= (0..7)
150 150 150 150 150 150 150 150 
##$DP07= 0
##$DPNAME0= <>
##$DPNAME1= <>
##$DPNAME2= <>
##$DPNAME3= <>
##$DPNAME4= <>
##$DPNAME5= <>
##$DPNAME6= <>
##$DPNAME7= <>
##$DPOAL= (0..7)
0.5 0.5 0.5 0.5 0.5 0.5 0.5 0.5 
##$DPOFFS= (0..7)
0 0 0 0 0 0 0 0 
##$DQDMODE= 0
##$DR= 18
##$DS= 0
##$DSLIST= <SSSSSSSSSSSSSSS>
$$ [...]
##$SUBNAM2= <"">
##$SUBNAM3= <"">
##$SUBNAM4= <"">
##$SUBNAM5= <"">
##$SUBNAM6= <"">
##$SUBNAM7= <"">
##$SUBNAM8= <"">
##$SUBNAM9= <"">
##$SW= 18.0517287032376
##$SWIBOX= (0..15)
0 0 2 0 0 0 0 0 0 0 0 0 0 0 0 0 
##$SW_h= 3612.71676300578
##$TD= 16384
##$TD0= 1
##$TE= 0
##$TE2= 300
##$TE3= 300
##$TEG= 300
##$TL= (0..7)
0 120 120 120 120 120 120 120 
##$TP= (0..7)
150 150 150 150 150 150 150 150 
##$TP07= 0
##$TPNAME0= <>
##$TPNAME1= <>
##$TPNAME2= <>
##$TPNAME3= <>
##$TPNAME4= <>
##$TPNAME5= <>
##$TPNAME6= <>
##$TPNAME7= <>
##$TPOAL= (0..7)
0.5 0.5 0.5 0.5 0.5 0.5 0.5 0.5 
##$TPOFFS= (0..7)
0 0 0 0 0 0 0 0 
##$TUNHIN= 0
##$TUNHOUT= 0
##$TUNXOUT= 0
##$USERA1= <user>
##$USERA2= <user>
##$USERA3= <user>
##$USERA4= <user>
##$USERA5= <user>
##$V9= 5
##$VALIST= <valist>
##$VCLIST= <CCCCCCCCCCCCCCC>
##$VD= 0
##$VDLIST= <DDDDDDDDDDDDDDD>
##$VPLIST= <PPPPPPPPPPPPPPP>
##$VTLIST= <TTTTTTTTTTTTTTT>
##$WBST= 1024
##$WBSW= 4
##$XGAIN= (0..3)
0 0 0 0 
##$XL= 0
##$YL= 0
##$YMAX_a= 82791
##$YMIN_a= -81614
##$ZGOPTNS= <>
##$ZL1= 120
##$ZL2= 120
##$ZL3= 120
##$ZL4= 120
##$ABSF1= 10
##$ABSF2= 0
##$ABSG= 5
##$ABSL= 3
##$ALPHA= 0
##$AQORDER= 0
##$ASSFAC= 0
##$ASSFACI= 0
##$ASSFACX= 0
##$ASSWID= 0
##$AUNMP= <proc_1d>
##$AZFE= 0.1
##$AZFW= 0.1
##$BCFW= 1
##$BC_mod= 2
##$BYTORDP= 1
##$COROFFS= 0
##$CY= 11.3945322036743
##$DATMOD= 1
##$DC= 2
##$DFILT= <>
##$DTYPP= 0
##$F1P= 2.36226072786647
##$F2P= -0.459571619588291
##$FCOR= 0.5
##$FTSIZE= 0
##$FT_mod= 4
##$GAMMA= 1
##$GB= 0.15
##$INTBC= 1
##$INTSCL= 1
##$ISEN= 128
##$LB= 0.24
##$LEV0= 0
##$LPBIN= 0
##$MAXI= 10000
##$MC2= 0
##$MEAN= 0
##$ME_mod= 0
##$MI= 1.114404
##$NCOEF= 0
##$NC_proc= 0
##$NLEV= 6
##$NOISF1= 3.799351
##$NOISF2= 2.8
##$NSP= 1
##$NTH_PI= 0
##$NZP= 0
##$OFFSET= 15.70392
##$PC= 1
##$PHC0= -17681.34
##$PHC1= 30.40078
##$PH_mod= 1
##$PKNL= yes
##$PPARMOD= 0
##$PSCAL= 0
##$PSIGN= 0
##$REVERSE= no
##$SF= 200.130013532006
##$SI= 16384
##$SIGF1= 3
##$SIGF2= 2
##$SINO= 400
##$SIOLD= 16384
##$SREGLST= <1H.CDCl3>
##$SSB= 0
##$STSI= 0
##$STSR= 0
##$SW_p= 3612.71676300578
##$SYMM= 0
##$S_DEV= 0
##$TDeff= 0
##$TDoff= 0
##$TI= <>
##$TILT= no
##$TM1= 0
##$TM2= 0
##$TOPLEV= 0
##$USERP1= <user>
##$USERP2= <user>
##$USERP3= <user>
##$USERP4= <user>
##$USERP5= <user>
##$WDW= 1
##$XDIM= 8192
##$YMAX_p= 0
##$YMIN_p= 0
$$ End of Bruker specific parameters
$$ ---------------------------------
##NTUPLES= NMR FID
##VAR_NAME=  TIME,          FID/REAL,        FID/IMAG
##SYMBOL=    X,             R,               I
##VAR_TYPE=  INDEPENDENT,   DEPENDENT,       DEPENDENT
##VAR_FORM=  AFFN,          ASDF,            ASDF
##VAR_DIM=   8192,          8192,            8192
##UNITS=     SECONDS,       ARBITRARY UNITS, ARBITRARY UNITS
##FACTOR=    0.0002768,     1,               1
##FIRST=     0,             0,               0
##LAST=      2.2672688,     0,               0
##MIN=       0,             -81614,          0
##MAX=       2.2672688,     82791,           0
$$ Real data points
##PAGE= N=1
##DATA TABLE= (X++(R..R)), XYDATA
0@%%%%%%%%%%%%%%qJ6j6J6j6K4l2L2m0M8n6O6p4Q8j04J20j36J52j74J99k24K53
$$ 0 0 0 0 0 0 0 0 0 0 0 0 0 0 0 -8 8 -8 8 -8 16 -16 16 -24 24 -32 34 -40 48 -56 64 -72 80 -94 105 -119 134
36A34k85L20l59M03m50M98n53O13o78P49q26R12j004J107j221J346j484J637j807
$$ 134 -151 169 -190 213 -237 261 -292 321 -357 392 -434 478 -526 581 -640 706 -778 859 -948
55i48J998k214K461k749L083l482L968m570N344o379P846j0103J4056k3035Q4688
$$ -948 1050 -1164 1297 -1452 1631 -1851 2117 -2453 2891 -3488 4358 -5745 8311 -14724 69964
70F9964J0537o5448O1176k7001l3484L731r667m8678o0l951j4063J0516J5439
$$ 69964 80501 15053 76229 49228 15744 19475 9808 -38870 -38930 -42881 -56944 -46428 -30989
83c0989j7874J1983K7201K520M731K7734P50j0536J0228J3944j3610j4571L918
$$ -30989 -48863 -36880 -9679 -7159 -2428 25306 26056 15520 25748 39692 26082 11511 15429
96A5429J450j6999o168P124p73o410L893j719p352J182J301q604M389Q179p174
$$ 15429 16879 -120 -6288 836 63 -6347 -2454 -4173 -11525 -10343 -9042 -17646 -13257 -5078 -12252
111a2252L510J5155o904k368K0100k557j7290J2528J2066j6944o109J0676p507
$$ -12252 -8742 6413 -491 -2859 17241 14684 -2606 9922 21988 5044 -1065 9611 2104
124B104j0505N616k048o456M329k857n947R315O266m182P988J2163n029m748R824
$$ 2104 -8401 -2785 -4833 -11289 -6960 -9817 -15764 -6449 -183 -4365 3623 15786 10757 6009 15833
139A5833n54j4604p35M773q966o805N409O43n753M09K326n02M173N174k423K145
$$ 15833 15279 675 -60 4713 -4253 -11058 -5649 -5006 -10759 -10350 -8024 -8526 -4353 821 -1602 543
155E43P496k899j108R894O80j0034J577L405r960n455N922m467p924O557M449
$$ 543 8039 5140 4032 13926 14606 4572 6149 9554 -406 -5861 61 -4406 -12330 -5773 -1324
170a324n419K038L834m229O66M954j228r69N996J093l789L274M196n396j550M068
$$ -1324 -6743 -4705 -871 -5100 -4434 520 -708 -1677 4319 5412 1623 4897 9093 3697 2147 6215
186F215m517n353L450K21n868J426M810m090k878N504j70n036L345J629l246L896
$$ 6215 1698 -3655 -205 16 -5852 -4426 384 -3706 -6584 -1080 -1250 -6286 -2941 -1312 -4558 -662
202f62M835j828J754M440l453m029L551o15n533J723J561n726M96M410m051k253
$$ -662 4173 2345 4099 8539 5086 1057 4608 3993 -1540 183 1744 -3982 -3486 924 -3127 -5380
218e380M526j132m136K721K107l133J590M838j942k16N067j11l429J606L97k964
$$ -5380 -854 -1986 -6122 -3401 -1294 -4427 -2837 2001 59 -157 4910 4799 1370 2976 3373 409
234D09L72J698j499K75K356k753l668M014P3o516R60L690l581j991N103J789l169
$$ 409 781 2479 980 1255 3611 858 -2810 1204 1277 -5239 -4279 -589 -4170 -6161 -1058 731 -2438
251b438J218K491k173J67J745k023P68K511j942O54N309j153m602L082K901n944
$$ -2438 -1220 1271 -902 -735 1010 -1013 -245 2266 324 978 6287 5134 532 3614 6515 571
267E71k568N185j210n184K747J889l124j080P21k040r23N23p91J93L544M43j139
$$ 571 -1997 3188 1978 -3206 -459 1430 -1694 -2774 -2053 -4093 -5016 -4493 -5284 -5091 -1547 -1104 -2243
284b243M448K287l807J787M619k744l411L854J357m430q8L749k688m170R09m90
$$ -2243 2205 4492 685 2472 7091 4347 936 4790 6147 1717 1629 5378 2690 -1480 -571 -1061
300a061l107k26o01o42J710l02q5K698K309k846k15M946r54m130M457L815l893
$$ -1061 -4168 -4394 -4995 -5637 -3927 -4229 -4314 -1616 693 -2153 -2368 2578 1624 -2506 1951 5766 1873
317A873q37M355J19l696J16J254k113k278J80l41R11l37k677J854K782l759k634
$$ 1873 1036 5391 5510 1814 1930 3184 1071 -1207 -1027 -1368 -457 -794 -3471 -1617 1165 -2594 -5228
334e228M239L98m796J742N293j272k644L719K479k876n80J853k57q50j27k34J509
$$ -5228 -989 -591 -5387 -3645 1648 376 -2268 1451 3930 1054 474 2327 2070 1220 1093 859 2368
351B368M35j914m35K607j524m558J763J837m444r33M650k88l139J913K597k170
$$ 2368 2803 889 454 3061 1537 -3021 -1258 579 -3865 -4798 -148 -436 -3575 -1662 935 -1235
367a235j226K704n01j075J385L07Q61J752q30l74K012q42k939J91K461k766k954
$$ -1235 -2461 243 -258 -1333 52 359 1220 2972 2142 1768 3780 2938 -1 190 2651 -115 -3069
384c069L604J264m580L67K765j780k382J155J294r43k43J679J485J069N50r34
$$ -3069 535 1799 -2781 -2414 351 -1429 -3811 -2656 -1362 -2305 -2548 -869 616 1685 2235 1301
400A301J697J250l500j016K587j425l249J633K362l132k138L421o03k311J156
$$ 1301 2998 4248 748 -268 2319 894 -2355 -722 1640 -1492 -3630 -209 -812 -3123 -1967
415a967J143n92R39N29M38J678P07j983K20J421k141k240K015N74k643J224K361
$$ -1967 -824 -1416 -477 52 490 2168 2875 892 1112 2533 392 -1848 167 741 -1902 -678 1683
432A683j899q59J561o8k029M46O44r57k60R71l42R4J772m77l81J212n90r88J744
$$ 1683 -216 -1075 486 418 -1611 -1165 -521 -1478 -1738 -767 -1109 -1015 757 280 -101 1111 521 -467 1277
451A277J121j277j73K199j161k343J585N34l331p46J640j059n32J289M19o38P53
$$ 1277 2398 1121 948 3147 1986 -357 1228 1762 -1569 -2315 -675 -1734 -2266 -977 -558 -1196 -443
468d43R83j042O68O54j671n8K349j169q26J782P21j725K51J781j439q32J786r54
$$ -443 540 -502 166 820 -851 -909 1440 271 -555 1227 1948 223 474 2255 816 -16 1770 816
486H16j039K305P5j798L18J82k003j158R79j030j344J670k55o85J835R26j385
$$ 816 -223 2082 2157 359 677 859 -1144 -2302 -1323 -2353 -3697 -2027 -2282 -2967 -1132 -206 -1591
503a591J805J258j516N39K477n60j313J828P16j879J09J322j093j936m99j152
$$ -1591 214 1472 -44 495 2972 2412 1099 2927 3643 1764 1873 3195 2102 166 -333 -1485
519a485l87J85n80j71P37m34p99N12J441n49j019K153J449r30R53K188k31j438
$$ -1485 -1872 -1687 -2267 -2438 -1701 -2135 -2934 -2422 -981 -1530 -2549 -396 1053 123 1076 3264 3033 1595
537A595J436R48k337n23J405j533j233J095m65q44M82j372j233J134k60k201J280
$$ 1595 3031 3979 1642 1119 2524 991 -242 853 388 -456 26 -1346 -2579 -1445 -1705 -3906 -2626
554b626J926j882j29M024k24k287K495J071k442P56J861m24n90J97k26L1K74j387
$$ -2626 -700 -2582 -2711 1313 1089 -1198 1297 2368 -74 682 2543 2119 1529 1726 1500 1531 1805 418
572D18q33J398j575k523K028J608k180m92K343K55j695pJ721n31k306O34J688
$$ 418 -415 983 -592 -3115 -1087 521 -1659 -2151 192 447 -1248 -1255 466 -65 -2371 -1737 -49
589d9J97p77Q15J325o80j010R02R55J57j522k21J901J05k678N80K123k425j942
$$ -49 148 -629 186 1511 831 -179 723 1678 1835 313 92 1993 2098 -580 0 2123 -302 -2244
607b244J643J23k191N59J096q08P0J466L3Q27J52j064M28J407j066p97K421K02
$$ -2244 -601 -478 -2669 -2110 -1014 -1822 -1752 -286 -253 574 726 -338 90 1497 431 -366 2055 2257
625B257k631P02K151k471j671K266m24k062N89J581m91j03j78K36M41rq64O26
$$ 2257 -374 328 2479 8 -1663 603 179 -1883 -1294 287 -204 -307 -485 -249 192 183 -681 -55
643e5Q85j284j041K429J155k811M07K417j132k176J148R91j285j268J194M68n71
$$ -55 830 -454 -1495 934 2089 -722 -315 2102 970 -1206 -58 933 -352 -1620 -426 42 -529
660e29j74L42J4j73o84Q26J271m50r76O65J613n05j748K309N30k877l78J474k27
$$ -529 -703 -361 -347 -520 -1204 -378 893 443 -533 132 1745 1240 -508 1801 2331 -546 -924 550 323
679C23k017P33O66o84K08O95m51J82J46j235L38J709j193L46J754q95j105J152
$$ 323 -1694 -961 -295 -979 -771 -76 -527 -345 -199 -1434 -1096 613 -580 -234 1520 625 -480 672
697F72Q47j385j62J512q14p80Q99J55m9j52m43l04J05p94o69o3K65m36m08J313
$$ 672 1519 134 -28 1484 670 -110 789 944 895 743 300 -4 101 -693 -1362 -1425 -1160 -1596 -2004 -691
717f91J29o81P07Q41q41j46J408N07n70K30J217n41l90M49n68j57L4q27q52O52
$$ -691 -562 -1243 -536 305 -536 -682 726 1233 663 893 2110 1569 1179 1628 1060 903 937 110 -742 -90
737i0j09j017J17N93p31p21J145k28j108R90P32r29J108Q59q3rN65L88o58P14
$$ -90 -199 -1216 -1099 -506 -1237 -1958 -813 -1041 -2149 -1159 -427 -1356 -248 611 528 519 1084 1472 814 1528
757A528p5n38K0Q50q27m85M19j49q72m63l4o80J23j49m65J21J230k76o00R46M94
$$ 1528 1453 915 935 1785 958 473 892 743 -129 -592 -626 -1306 -1183 -1332 -1797 -1676 -446 -722 -1322 -376 118
778A18p41j06J239N7m86J115M10q37N53M88o57Ql32q66P86n46p25j79R10m47j249
$$ 118 -623 -729 510 567 81 1196 1606 769 1322 1810 1153 1161 829 -37 749 203 -522 -701 209 -238 -1487
799a487N66P08j531p2J026r6m04Q71P20l17M76J29L70n25k8O45k44K61m48N5O09
$$ -1487 -921 -213 -1744 -1816 -790 -886 -1290 -419 301 -16 460 589 959 434 406 1051 807 1068 620 675 1284
820A284k11j309O33K76j287r06Q26O89j283j56J282k91k81L97K07O4k44p6N32
$$ 1284 1073 -236 397 673 -614 -1520 -694 -5 -1288 -1444 -162 -453 -734 -337 -130 -66 -310 -386 146
839A46N24o32j92J221M32j544k73J750o74j874J031Q72q32n70Q47L80q29n63M30
$$ 146 670 38 -154 1067 1499 -45 -318 1432 758 -1116 -85 787 -45 -615 232 612 -217 -780 -350
858c50L94o38Q2O6Q08l36o00P42O11q85p18J123L29j454K8J470k21j189Q71N63
$$ -350 44 -594 -512 -446 362 26 -574 168 779 -106 -824 299 628 -826 -798 672 451 -738 133 696
878F96m99n03L77K28m73k75K28L88j30m10P01P22r45p29J035N64j210o32J580
$$ 696 197 -306 71 299 -174 -449 -221 167 37 -373 328 1050 105 -624 411 975 -235 -867 713
897G13Lj148J66J168o94j134L77L06l07l74j15P94M84q35Q2J420k60j014N12J224
$$ 713 716 -432 -266 902 208 -926 -549 -243 -550 -924 -1039 -245 239 -596 -514 906 646 -368 144 1368
917A368q68p14J198J74p99P3L55k35n97n74K74L04o25l32M91K63o49n00J134N45
$$ 1368 500 -214 984 1158 359 432 787 552 -45 -619 -345 -41 -666 -998 -507 -244 -893 -1393 -259 286
937B86j256J52J000kn14N56Q48k76k82R20n3o47J0P9l05j44l97P4r2j59l47PJ46
$$ 286 -970 -818 182 180 -334 222 1070 794 512 1432 1379 732 742 821 516 372 -25 49 -43 -202 -549 -542 -396
960c96m70p74P47K26j078Q13J000j96p39J165M32n40L28L91K3l22J70m1M35j05
$$ -396 -866 -1640 -893 -667 -1745 -932 68 -128 -867 298 730 190 518 909 932 610 780 739 1174 1069
980A069n81j63N61q99n46M93K57j371K26O82m47k34K25J60r0q3m5J83P83j77l8
$$ 1069 488 325 886 -13 -559 -66 191 -1180 -954 -272 -719 -953 -728 -568 -658 -741 -786 -603 180 3 -35
1001c5O50K65l7P8O67n67k33j53q6K53l88n0r5n77j27K40o25j09J45k29PL20L29
$$ -35 615 880 843 921 1588 1021 788 635 549 802 414 364 269 -308 -435 -195 -820 -929 -784 -1013 -1006 -686 -357
1024c57l42P7O83l27N1P97l2m29P61n8l20N98R8p60L55Q2r29m41P21m32o63K77
$$ -357 -699 -622 61 -266 -215 582 550 121 882 824 504 1102 1200 440 795 877 -52 -493 228 -204 -867 -590
1046e90K03o10L24O20n42K0K12j72L19J41j07j0N58K14m70O54J12p51j84M98m60
$$ -590 -387 -997 -673 -53 -595 -575 -363 -535 -216 -75 -182 -192 366 580 110 764 876 125 -59 439 -21
1067b1o0J46K85j86l50m4L51l76j38kK62j32k69O32K46o90J62M3K39q2l91K64
$$ -21 -81 65 350 164 -186 -230 121 -255 -393 -395 -133 -265 -534 98 344 -346 -184 -141 98 16 -375 -111
1089a11K70o23J61R79j33p41K98K23k04q2k22P48m38l12j14N04K62m06k79N13
$$ -111 159 -464 -303 676 543 -198 100 323 119 37 -185 563 125 -187 -301 203 465 59 -220 293
1109B93k60j163Q19R26o00n65N27N99j053J55P47on90K8l4K60Ko25N76P14o53
$$ 293 33 -1130 -311 615 15 -550 -23 576 -477 -322 425 419 -171 -143 -177 83 85 -540 36 750 97
1130I7n58O45L41j197L95Q19m83k64P20J50o41m6M43J17o73L08O1p7n83M9P16
$$ 97 -461 184 525 -672 -277 542 59 -205 515 665 24 -22 421 538 -135 173 234 157 -426 -377 339
1151C39j20q47j75N30j30j13l71P77J78o87N69J122j91r84K81Q43m95m63N98J59
$$ 339 219 -628 -803 -273 -403 -516 -887 -110 68 -619 -50 1072 881 -103 178 1021 526 63 661 820
1171H20o02J7l16L15r9m73l03M94p27p05J208M68q98k71J051j48l17N37M00k68
$$ 820 218 235 -81 234 135 -338 -641 -147 -874 -1579 -371 97 -801 -1072 -21 -169 -486 51 451 183
1191A83J18J10L32K91L6m41M04m2q33L9K43k98r90J35O41r48L69K60n3o32L45
$$ 183 301 411 743 1034 1070 629 1033 991 158 197 440 142 -848 -713 -72 -1020 -651 -391 -444 -1076 -731
1212g31L18J59l47L29L62j58K68J33K96K52n30O5M57k29p08L89M48l07n94N21
$$ -731 -413 -254 -601 -272 90 -68 200 333 629 881 351 416 873 644 -64 325 773 466 -128 393
1232C93K87j259j50Q07l46n96j15O45l1n22K57Q7K65J82j26J59L67k83J01R32
$$ 393 680 -579 -729 78 -268 -864 -979 -334 -365 -887 -630 -543 -278 -96 -222 -63 304 21 122 1054
1252A054j87n92R6N54k21p37M16K48o52J08R5l08M54l70m26r6K94m31o4K33m9
$$ 1054 867 275 371 925 704 -33 383 631 -21 87 182 -126 328 -42 -468 -564 -270 -701 -765 -532 -581
1273e81m2M07L65n10m9N55r0P7O09k04l57M24J18j75j49M0j45j63l29j90m8J91
$$ -581 -623 -216 149 -361 -410 145 55 132 741 537 180 604 722 547 398 438 293 130 -199 -389 -437 -246
1295b46k79Q0J13Q9j35K78K7n0k95L52K04l89K01K04p6n9Q4ml1k10M30l81L94
$$ -246 -525 -445 -332 -243 -378 -100 -73 -123 -418 -66 138 -251 -50 154 78 19 103 99 68 -142 288 -93 301
1318C01k7r9J7o9J76n28J18K97n18L50n8l87Q5L30J4k29M06O7l11K0R8j18j59
$$ 301 274 175 192 123 299 -229 -111 186 -332 18 -40 -427 -342 -12 2 -227 179 246 -65 -45 53 -65 -224
1341b24M43o8j64l91M69n4k46J39j2L21O4l34J1N44P0p07M82J87o83j3K51N01
$$ -224 219 151 -13 -404 65 11 -235 -96 -108 213 277 -57 -46 498 568 -139 343 530 -153 -166 85 586
1363E86p91k7L70j40j52j33j34L21m17k54P58J90l00k82N54J36m24J66O45r8l15
$$ 586 -205 -232 138 -2 -154 -287 -421 -100 -517 -771 -13 177 -123 -405 149 285 -139 27 672 574 259
1384B59j02L36ql5L8J38o44J89O7l91J86l83k75M29L2p57N79M84p15J85K35L60
$$ 259 157 493 485 450 488 626 -18 171 238 -153 33 -350 -625 -196 -164 -921 -342 142 -573 -388 -153 207
1406B07p37K48P60k15k90N13K38j98k09K33n0j87j73M9P4pn59K94L59o47m73M02
$$ 207 -530 -282 478 263 -27 486 724 526 317 550 500 313 140 189 263 256 -303 -9 350 -297 -770 -368
1428c68O0k65m40J083J14n81Q5N54j50m25J15L43N21l41n2J52J24k6k01J86J82
$$ -368 -308 -573 -1013 70 184 -397 -312 242 92 -333 -218 125 646 305 253 405 529 503 302 488 670
1449F70n26N3K69l40m81K05J36o06N2J40q8j39l2J06j03M40j88M47L70k43p1N11
$$ 670 144 197 466 126 -355 -150 -14 -620 -568 -428 -516 -655 -687 -581 -684 -244 -432 15 385 142 71 582
1471E82J36n90N03J45j47l32n6L17l83k10k9J47l33l41K5M34m96p3N28O9L4m51
$$ 582 718 128 631 776 629 297 241 558 175 -35 -64 83 -250 -591 -566 -132 -628 -701 -173 -104 -70 -521
1493e21O00J05j58k35N82k9k41K51K11J30l54J6L4l6l23mJ0k9j79k88K59J71m0
$$ -521 79 184 26 -209 373 344 103 354 565 695 341 357 391 355 32 28 38 9 -170 -458 -199 -28 -68
1516f8k43K37J44p85M60M53k59q7N31l68L0J75l37K01j58J32k01L23O2k56nL28
$$ -68 -311 -74 70 -715 -255 198 -61 -148 383 15 45 220 -117 84 -74 58 -143 180 242 -14 -19 309
1538C09j7j48K23j20k40L1J29l32O7j33j29o5K27j85p4L52k60J65J50k2J18J85
$$ 309 292 144 367 247 7 38 167 -165 -98 -231 -360 -425 -198 -383 -457 -105 -365 -200 -50 -72 46 231
1560B31k80K05j32K91Ml99q2L34p3k08j48K42R3k68L16K15k47j01K19l68n0L09
$$ 231 -49 156 24 315 319 -80 -162 172 99 -109 -257 -15 78 -190 126 341 94 -7 212 -156 -206 103
1582A03k38K85NO3m60j26L37k52K49q4K19j78R5j20K2J83k47k2L79j87PK6J00
$$ 103 -135 150 155 218 -242 -368 -31 -283 -34 -118 101 -77 18 -102 -80 103 -144 -166 213 26 33 59 159
1605A59j16O8K07j65L0p9j51O1r6l55L97r9j38n24L39K83j79k62L97J66k41M04
$$ 159 43 111 318 153 183 104 -47 14 -82 -437 -40 -139 -277 -801 -462 -179 -358 -620 -223 -57 -298 106
1627A06N3L15j37k69N27j70m4k61L88j16l80K31r7k16r0p1J45r7k01k75N16q1
$$ 106 159 474 337 68 595 425 381 120 508 392 12 243 146 -70 -160 -231 -86 -183 -384 -659 -143 -224
1649b24l47M94o7Lk14J25J39k4L07L03k47M9qq0K14P1k03P5K14m77k12L81n23
$$ -224 -571 -77 -144 -141 -355 -230 -91 -115 192 495 248 297 289 209 423 494 291 366 580 103 -109 272 -251
1672b51m2L49j73k54j66J00O4P1j86J02K81j48KL25L27n71K04M41m8L7m76Q03
$$ -251 -293 56 -117 -371 -537 -437 -373 -302 -488 -386 -105 -253 -251 74 401 -170 34 475 427 464 -12 791
1694G91n25j49K04L32l47l56L4j11j3j25j95KJ93j75Q1N9K30l86L59k5n5n5M16
$$ 791 266 117 321 653 306 -50 -16 -127 -140 -265 -460 -458 -265 -440 -359 -300 -70 -456 -97 -122 -177 -232 184
1717A84K00m26K05L19K1k98M5K41k08m14K82J11M3m69J19j12K25m62j6L85k21
$$ 184 384 -42 163 482 503 205 250 491 283 -131 151 262 305 -164 -45 -157 68 -394 -410 -25 -246
1738b46n8j3J56J52l24L67o2r9K29J7J2k13L67J08M3k45j71K52J66o10n1L24K0
$$ -246 -304 -317 -161 -9 -333 34 -28 -127 102 119 131 -82 285 393 436 191 20 272 438 -172 -223 101 121
1761A21k22k02M03j19l26J47rJ18N1j02L6K1r3K60L26j79j62J99Oj17j68Q0K19
$$ 121 -101 -303 100 -19 -345 -198 -207 -89 -38 -140 -104 -83 -176 84 410 231 69 268 274 157 -11 69 288
1784B88l60K00N0j42J03k43L44j52m02j06M24k36Q8P1n9o1K15%J22j0l59J61j2
$$ 288 -72 128 178 36 139 -104 240 88 -314 -420 4 -232 -144 -73 -132 -193 22 22 144 134 -225 -64 -76
1807g6j26O6L2K32l41K80J13l25J61j5J09K29j51m4R8r3P2n8K2J63l16l01M75
$$ -76 -202 -136 -104 128 -213 67 180 -145 16 1 110 339 188 144 242 149 221 163 185 348 32 -269 206
1830B06j3k46J00Nj90l2j20J46k02O8J80j22j61K68O7K33lMM4J97M6l40r5L76
$$ 206 193 -53 47 52 -138 -170 -290 -144 -346 -278 -98 -220 -381 -113 -46 187 184 188 232 429 475 135 40 416
1854D16q0j22r5M5q7k18k82l8L43q4k15J05K79m9k36K56J69k80J17k0O7o7J20
$$ 416 336 214 119 164 77 -141 -423 -461 -118 -202 -417 -312 -33 -82 -318 -62 107 -173 -56 -76 -9 -76 44
1877D4M5J80k78J09J03J21l94K67J19J15j48O4j29J55j31m50m8J44n30K24J82
$$ 44 89 269 -9 100 203 324 -70 197 316 431 283 347 218 373 242 -208 -256 -112 -642 -418 -236
1898b36l35R3K46J8Q8k1K34L7K15k78K76J48m3J46k90L41n61p4K76k45k66J78
$$ -236 -571 -478 -232 -214 -126 -147 87 124 339 61 337 485 442 588 298 639 78 4 280 35 -231 -53
1920e3J49r6m28J92M3j90J16j5j1l1K1n2J00J58n1J55K70k17L3M39n3Pm03K6K92
$$ -53 96 0 -428 -236 -193 -383 -267 -282 -293 -324 -303 -355 -255 -97 -148 7 277 60 93 532 479 486 83 109 401
1945D01m35J1R8j26j80m3J17j79J89j9J79j18k42J27M46n31J28K95J3k23m1L23
$$ 401 -34 -23 75 -51 -231 -274 -157 -336 -147 -166 13 -105 -347 -220 226 -305 -177 118 131 -92 -133 190
1967A90m2Q6j30j35M82n9l93J51j58J99j4j94R8j77OJ92k53l62L47J47r7k47K56
$$ 190 148 234 104 -31 451 392 -1 150 -8 191 177 -17 81 -96 -90 102 -151 -513 -166 -19 -116 -363 -107
1990a07o4k47J88K24p6J14j44J15K49j00L7n0J20k47J58L8n1R4p33O15j7n14M40
$$ -107 -171 -418 -230 -6 -82 32 -112 3 252 152 189 139 259 12 170 208 157 251 -482 133 116 -398 42
2013D2o3m25L31K84l75J81j53q6j24K27j66P5K79q4j65L94Q6j56l42N06l20M1
$$ 42 -21 -446 -115 169 -206 -25 -178 -264 -388 -161 -327 -252 27 -57 -222 172 258 102 -240 266 -54 -13
2035a3k12L48L6j58MP8k68L19m6J74n03K33M0J02j21L5J0j8l98K60J17l07J07
$$ -13 -225 123 159 1 5 83 -185 134 88 262 -241 -8 32 134 13 48 58 40 -358 -98 19 -288 -181
2058a81k14K34J14k82K98P7o4j9L07j38N1k6J72j62j40J22l6R2n8j42J25nj78
$$ -181 -395 -161 -47 -329 -31 46 -18 -37 270 132 183 157 329 167 27 149 113 205 147 5 130 125 -53
2081e3l35M49j89RJ7P1p9R2m6r5m3K98pj01K41j42R7P0N7j87O9j48J68K33n20
$$ -53 -388 61 -128 -119 -102 -31 -110 -18 -64 -159 -202 96 89 -12 229 87 184 254 311 124 193 45 213 446 -74
2106g4L69N4n57RJ38Q8l20J00j91k37L08j36L32j43L36k15J30l8J00J56N9j66
$$ -74 295 349 -208 -199 -61 27 -293 -193 -384 -621 -313 -449 -117 -260 76 -139 -9 -47 53 209 268 102
2128A02J07M1J36p6j28j12J27k28L34Pk57p1j80J39k13j6o2Q6Q4j21R1N6k29M08
$$ 102 209 250 386 310 182 70 197 -31 303 310 53 -18 -198 -59 -272 -288 -350 -264 -180 -301 -210 -154 -383 25
2152B5O9j90J19J97jM0j08L1O5N8J06l33L8l3K6k16l1p3p1k4k9L16p9N6j94J15
$$ 25 94 -96 23 220 219 259 151 182 247 305 411 78 116 83 109 -107 -138 -211 -282 -306 -335 -19 -98 -42 -236 -121
2178a21K8J02j18J39k8p1N2k1OJ34r6K34M5j30j22K67J1k67Kk9K21l85J28j79
$$ -121 -93 9 -109 30 2 -69 -17 -38 -32 102 6 240 285 155 33 300 311 44 46 17 238 -147 -19 -198
2202a98J69P1l58J29J51k5j31J99k48Q8L23J44l88j24J16K94n6n1N5q5M9p1o1
$$ -198 -29 42 -316 -187 -36 -61 -192 7 -241 -153 170 314 -74 -198 -82 212 156 105 160 75 124 53 -8
2225hR0k78m1M59k27p1q8j32L63j65j56L9J79Q3j61q9L63q7j50l3L1j88K46J12
$$ -8 82 -196 -237 222 -5 -76 -164 -296 67 -98 -254 -215 -36 47 -114 -203 160 73 -77 -110 -79 -267 -21 91
2249I1l07J73J19m2j37o0L97M7j21j46J10J62j41j30J33j61r8K11m14M51j72j36
$$ 91 -216 -43 76 34 -103 -163 234 281 160 14 124 286 145 15 148 -13 -111 100 -314 137 -35 -171
2271a71K16N6k46K26k01K3L9M8qJ08j88J52J40q4r2p9M46l02J14J1J79n24J58
$$ -171 45 101 -145 81 -120 -97 -58 -10 -18 90 -98 54 194 110 18 -61 385 83 197 208 387 -137 21
2294B1N1j0q0j58q3Q4M4l1k23L89j55j03Q5o5K30p2K00j67K15O2j20j4p0R7J60
$$ 21 72 62 -18 -176 -259 -175 -131 -162 -385 4 -151 -254 -169 -234 -4 -76 124 -43 172 234 114 100 30 127 287
2319B87k5Km8k22K14j00j3J54k94J95m8l08r8J73L2J14l27L5J4K99k68K62q7O9
$$ 287 262 264 216 -6 208 108 95 249 -45 150 102 -206 -304 -131 -99 15 -312 -277 -263 36 -232 30 -57 12
2343A2J14M0p6j72K42L40l94OM9J73n6o9j01n7k15O7J28j64j29k22L29n4p7J26
$$ 12 126 166 90 -82 160 500 106 112 161 334 278 209 108 51 -164 -97 31 -133 -262 -484 -155 -209 -286 -160
2367a60K53k65p0K16K10Ql9Q8k51J66j22J63m3J11l5Pk43L21k80k93M67k83j76
$$ -160 93 -172 -242 -26 184 192 153 241 -10 156 34 197 154 265 230 237 -6 315 35 -258 209 -74 -250
2390b50M5k88M52l76J60P8k61L53Q1l37J9L16J56l29L50j8LJ76k03m2k9J51k51
$$ -250 -205 -493 -41 -417 -257 -179 -440 -87 -6 -343 -324 -8 148 -181 169 151 154 330 127 85 56 207 -44
2413d4N4Q0o2j26j51L72k01k11K12j55j45J88J79k69J4r3J64n4J27K15J10j50
$$ -44 10 90 28 -98 -249 123 -78 -289 -77 -232 -377 -189 -10 -279 -265 -358 -194 -248 -121 94 204 54
2435E4P3k8O3p9K05k39p1L7J19n1m6j32J17j84M8K17k50K79k55Q4J42l40K48p5
$$ 54 127 99 162 83 288 49 -22 15 134 83 37 -95 22 -162 -114 103 -147 132 -123 -39 103 -237 11 -64
2459f4l6J79po6r6m2j2K76k7O6k15J38O1j92J78j73N7q5M9L9J45k79P0J84n6j37
$$ -64 -100 79 72 6 -90 -132 -144 132 105 171 -44 94 155 -37 141 -32 25 -60 -11 28 173 -106 -36 148 92 -45
2485d5J11L5j71Q7l58J27J15J5J45J33l76J89K3L1j11j71M70m68K58M5K08j22
$$ -45 66 101 -70 17 -341 -214 -99 -84 61 194 -182 7 30 61 -50 -221 249 -219 39 84 292 170
2507A70J9k56N7N0M0j74P8K43m67Q3n3N1k82L14J80j83j5n9J74k5J84l04K87J46
$$ 170 189 -67 -10 40 80 -94 -16 227 -240 -157 -210 -159 -441 -127 53 -130 -145 -204 -30 -55 129 -175 112 258
2531B58p7o3j01P4j4j58J34pK39k27J3k5l1J53r8j49j3r9K12k47J32m8q0L2K8
$$ 258 181 118 17 91 77 -81 53 46 285 58 71 46 15 168 70 -79 -92 -191 21 -226 -94 -142 -222 -190 -162
2556a62J03O3P3k49J06j5O5J21J94j91J90l77K92k73K63oj40P6j93P1k03K89m8
$$ -162 -59 4 77 -172 -66 -81 -16 105 299 108 298 -79 213 -60 203 197 57 133 -60 11 -192 97 49
2579D9j28p4K5J9R0j7j11J09q5k03K00K22K5PN7J31n8j97L12m93N3J25j08K24
$$ 49 -79 -153 -128 -109 -19 -36 -147 -38 -123 -326 -126 96 121 128 185 316 258 61 373 -120 -67 58 -50 174
2603A74L5k59J33q2J10k99K50l3k26j95K11J42l92L68k08K70L8J68l3K2l29K27
$$ 174 209 -50 83 1 111 -188 62 29 -197 -392 -181 -39 -431 -63 -271 -1 37 205 172 194 -135 92
2625I2q8NJ87j75rL25q4j70L1j03n8K41j05j92p6J97j07l08N58l62k9l0J01m5
$$ 92 4 9 196 21 12 337 253 83 114 11 -47 194 89 -103 -179 18 -89 -397 161 -201 -230 -260 -159 -204
2649b04K47Qm2O6K7j51J29L04l01j6j79L08o3j06nk1k85K67q5R0J3j5q0R3j49
$$ -204 43 51 9 75 102 -49 80 384 83 67 -112 196 133 27 22 1 -284 -17 -102 -12 1 -14 -94 -1 -150
2674a50j49K8K75j04J38J17r1j56K93o8j8j10k2J18J6j27J72j53n5J90k05j72
$$ -150 -299 -271 4 -100 38 155 64 -92 201 133 115 5 -17 101 117 -10 162 9 -46 144 -61 -233
2696b33J41J13J27m10L71k29j6N38n47K47l33r2N6M93j55k51Q2K84j26j95L1O7
$$ -233 -92 21 148 -262 109 -120 -136 402 -145 102 -231 -323 -267 226 71 -180 -98 186 60 -135 -104 -37
2718c7R5J78J18k69J80j8O3n9j00Q9l5j89Mk56K22k73M13l47JL20j77P1k01O7
$$ -37 58 236 354 85 265 247 310 251 151 240 205 16 20 -236 -14 -287 126 -221 -220 100 -77 -6 -207 -140
2742a40M3j4j23J20K41q5R7J22l78L16q3P6r8m8J60r2J5j35L4l02L96r3j21J5
$$ -140 -97 -111 -234 -114 127 42 139 261 -117 199 116 192 94 46 206 114 129 -6 28 -274 122 29 -92 -77
2766g7K31j41M1l63K19J88k09j20M7k6J54j8j03M27l98K01K74l38J06q5L17l55
$$ -77 154 13 54 -309 -90 98 -111 -231 -184 -210 -56 -74 -177 250 -148 53 327 -11 95 10 327 -28
2788b8o3K53j18O5j23p4mK8M0L4j28j30K21Rm2q1L8J20j06K04r3k47L71k09J0
$$ -28 -91 162 44 109 -14 -88 -92 -64 -24 10 -118 -248 -27 -18 -60 -141 -103 17 -89 115 22 -225 146 -63 -53
2813e3K00k14M5N2K81l42L30l29qJ95k7l05K10j43J46k06PK10l0j27o9N5K03l88
$$ -53 147 -67 -22 30 311 -31 299 -30 -38 157 130 -175 35 -108 38 -168 -161 49 19 -108 -177 -122 81 -307
2837c07L44Q6j43J76j31Q6j80K88J71j04l60J57R8P2k02K20k47L5r1J30J5j52
$$ -307 37 123 -20 156 25 111 -69 219 390 286 -74 83 181 253 51 271 24 59 -32 98 113 -39
2859c9q2o9K8P8Q9k30K39l3p7n5j02J67Q8m3M9J20j33k0J66j54j92K77j08R7q7
$$ -39 -121 -190 -162 -84 5 -225 14 -19 -96 -151 -253 -86 2 -41 8 128 -5 -25 141 -13 -205 72 -36 61 -26
2884b6j32J59k49K64q1M8j9J01J5q6k11K20M0j16o1K5K0P8K6K49k73M6J77j44
$$ -26 -158 1 -248 16 -65 -17 -36 65 80 -6 -217 3 43 -73 -134 -109 -89 -11 15 264 -9 37 214 70
2908G0J28k03J76l24L40j44q5O3J26l53K89j64Q9J4k49K97o6j05l6Mk5P8J46j13
$$ 70 198 -5 171 -153 187 43 -42 21 147 -206 83 -81 8 22 -227 70 4 -101 -137 -133 -158 -80 66 -47
2932d7Q0l55P01n1k13j3k63K16K8J41l24L64Q9j87j41j6N4p5k45J1L21l40J14
$$ -47 33 -322 379 328 115 102 -161 55 83 224 -100 264 353 166 25 9 63 -12 -257 -246 75 -265 -151
2955a51P3J07k96K66k7oK2j6p1J43j07n2J46KL1k4O0J79o1L0p6R8k1l12J17J34
$$ -151 -78 29 -267 -1 -28 -34 -12 -28 -99 44 -63 -115 31 33 64 40 100 279 218 248 172 270 249 -63 54 188
2981A88j84L5J67l25j6J5k2Q5R8j80N3j65R7R6RJ25j28J43K2k12q0M14j42m5J13
$$ 188 4 39 206 -119 -135 -120 -142 -57 41 -139 -86 -251 -154 -58 -49 76 -52 91 113 -99 -179 235 93 48 161
3006A61k7p7R2m0o3L8O9k27m7l5K97j95j72J96r3P9j2j86Q9K98j98j50K12M9j32
$$ 161 134 57 149 109 46 84 153 -74 -121 -156 141 -54 -226 -30 -123 -44 -56 -242 -153 145 -53 -203 9 58 -74
3031g4k1K14P6J14k22p6J83l8j92L55l92r8K11K8q5r2J31K02k24j45L46j64l4
$$ -74 -95 119 195 309 87 11 194 156 -36 319 -73 -171 40 68 -17 -109 22 224 0 -145 201 37 3
3054Ck00P0K40j49N9K22R4m99M52j81n8K71j15r8o2Kq1J43j18N0k06J70j25J80
$$ 3 -197 -127 113 -36 23 245 339 -160 292 111 53 324 209 111 49 51 -30 113 -5 45 -161 9 -116 64
3078F4o9Oj43K65j53r5k34L39j11J18J5j40K57j40P7j44J55J4L5j1k40J84J58
$$ 64 -5 1 -142 123 -30 -125 -359 -20 -131 -13 2 -138 119 -21 56 -88 67 81 116 105 -135 49 207
3101B07k38K15k46m8j07L95j21k84n2J12j4L00l66L94j40j22J60p6j36P3L02j80
$$ 207 -31 184 -62 -110 -217 178 57 -227 -279 -167 -181 119 -247 147 7 -115 45 -31 -167 -94 208 28
3123B8j15Q6J51q7k05L19j10p5J98o0o7L58k81k13Q2J40m69K83m6k4R6q8j1L18
$$ 28 -87 -1 150 63 -142 177 67 -8 190 130 63 421 140 -73 9 149 -320 -37 -83 -107 -11 -99 -110 208
3147B08k72J24L4Qk16L08j94j8J80j60J58k18J42O6j06lR7k1r5J27j56m1N2J27
$$ 208 -64 60 94 102 -114 194 0 -18 162 2 160 -58 84 150 44 41 138 117 22 149 -7 -48 4 131
3171A31k47rN4j00J37p3K07j33j37J70o0J46K08l51J82k65K6J52J77p0l75M97
$$ 131 -116 -125 -71 -171 -34 -107 100 -33 -170 0 -60 86 294 -57 125 -140 -114 38 215 145 -230 267
3193B67k60m1J12o1R9J19k60l9P5rk04O8J39OJ3j54j63k6O2J78J43%J36j17k03
$$ 267 7 -34 78 17 116 235 -25 -64 11 2 -202 -134 5 11 24 -130 -293 -319 -257 -79 64 64 200 83 -120
3218a20J4J42P7j9l4k39K46N7L8J05k69j32K53j48J21k00L34k88p8m6j31J78O9
$$ -120 -106 36 113 94 60 -179 67 124 162 267 -2 -134 119 -29 92 -108 226 -62 -140 -186 -317 -139 -70
3241g0l5J09k4J62j69R2k11K75j83J73P4j0J25m74L85p2N4l35J64k40J21Q4k71
$$ -70 -105 4 -20 142 -27 65 -146 129 -54 119 193 183 308 -166 219 147 201 -134 30 -210 -89 -5 -276
3264b76L60j84l5K91j20k63K9L1Q4j74M15j30q5p2R5K85m40L10LJ22M4k82R2J39
$$ -276 84 -100 -135 156 36 -227 -198 -167 -83 -257 158 28 -57 -129 -34 251 -189 121 124 246 290 8 100 239
3288B39l4j16k25L22j71j08p7q8J44qL9k06L68k1l7j61P9J45l11J65l8J51J59
$$ 239 205 89 -136 186 15 -93 -170 -258 -114 -122 -83 -289 79 58 21 -140 -61 84 -227 -62 -100 51 210
3311B10m03L94m1k83L34j41k98J73Q3N3L8j29o2K11P7m38K51l05K4K71r1j1k5
$$ 210 -193 201 160 -123 211 70 -228 -55 28 81 119 -10 -72 139 216 -222 29 -276 -252 19 -72 -83 -108
3334a08n2J00J91k83J58Q9q9L50l79P1J21j74K18l91K22M7R6k42o1L37l17q9l6
$$ -108 -160 -60 131 -152 6 95 6 356 -23 48 169 -5 213 -178 44 91 187 -55 -116 221 -96 -185 -221
3357b21L91j62N4p3R7l88R0K32j95LJ71o2J78o6k4J93l20J39J26m6K6l19J63K58
$$ -221 170 8 62 -11 86 -302 -212 20 -175 -172 -1 -63 115 49 25 218 -102 37 163 117 143 -176 -13 245
3381B45l75K26j48J57j47L4k28K13O5k69K08n7K16j73j63K96j65O1Ml9m8L0kJ41
$$ 245 -130 96 -52 105 -42 -8 -236 -23 42 -227 -19 -76 140 -33 -196 100 -65 -4 0 -39 -87 -57 -59 82
3405H2N3k28J80m1j18J25j97L17j12j72n6L99j24O4o9k14K97k26Q3j51L8K1r5
$$ 82 135 -93 87 46 -72 53 -144 173 61 -111 -167 232 108 172 103 -111 186 -40 43 -108 -70 -49 -144
3428a44O0L0n3K74m4q2L6m2J71k01O7j7R7QJ06k77Q0r5K00k56M7j03J27j55P7
$$ -144 -84 -54 -107 167 123 41 77 35 206 5 72 55 152 160 266 -11 69 -26 174 -82 -35 -138 -11 -166 -89
3453h9K62j75l2k33J74m21L10J19K26k14QJ53O6j26k30K88J80J07m34k82N60m14
$$ -89 173 -2 -34 -267 -93 -514 -204 -85 141 -73 -65 88 154 28 -202 86 266 373 -61 -343 217 -197
3475a97K37L2K7j8K5l64N9J01L13j98j13N8R1j92J6j72K63Q3j1P2q1j85L08P0
$$ -197 40 72 99 81 106 -258 -199 -98 215 17 -96 -38 53 -139 -123 -295 -32 51 40 112 31 -154 154 224
3499B24m41NK53N0k12L80k31J23p6L1l3k5o9o2N6j33K75j15q2J22k27L3OL0J70
$$ 224 -217 -212 41 91 -121 259 28 151 75 106 73 48 -21 -83 -27 -160 115 0 -82 40 -187 -154 -148 -118 52
3524E2j15K61k44L8R2m5%j75L84l98J23K44j98l2mj97L5M19l79O7o7J7qn5L24
$$ 52 -63 198 -46 -8 84 39 39 -136 248 -150 -27 217 19 -13 -17 -214 -179 240 -139 -72 -139 -122 -130 -185 139
3549A39jj67o4k7K05l69K13K0K03k68J07%j24K94k34P8L15n47L18o0p8M1n4J15
$$ 139 138 -29 -93 -120 85 -284 -71 -51 152 -116 -9 -9 -133 161 -73 5 320 -227 91 31 -47 -6 -60 55
3573E5K7n5nJ92j85j06M6j05j2J82j91J88k26n6Q6J39R1J11q6j41R8N1j09j88
$$ 55 82 27 22 214 29 -77 -31 -136 -148 34 -157 31 -195 -251 -165 -26 65 176 90 -51 47 98 -11 -199
3597a99K71j47K90n3p9j2kj63O8k04K84J4j34n4l6N4K3j17J76J08j14N0%j20J4
$$ -199 72 -75 215 162 83 71 69 -94 -26 -230 54 68 -66 -120 -156 -102 -79 -196 -20 88 -26 24 24 -96 -82
3622h2K8l2J64l0K13k94N2Q5j78N3K27j03o6n1J0j66L90l13J01O0j16o2J17J90
$$ -82 -54 -86 78 48 261 -33 19 104 -74 -21 206 103 37 -14 -4 -170 220 -93 8 68 -48 -110 7 197
3646A97k99kJ90m4k33K19j66K17K4o2Q5P2j81j09lJ05J37r4N4j9j67r4J94J12
$$ 197 -102 -104 86 42 -191 28 -138 79 103 41 126 198 17 -92 -95 10 147 53 107 88 -79 -173 21 133
3670A33mm8M8m8k65J63q9J49p2o0J99j20m3K37j75P7j40j79L11K9J08r2p0J64
$$ 133 129 81 129 81 -184 -21 -110 39 -33 -93 106 -14 -57 180 5 82 -58 -237 74 103 211 119 49 213
3694B13k30q0M01j44j66J12j57l4l5L4K20j26k4n9R0L9o5K43l17J31j93L16p9
$$ 213 -17 -97 304 160 -6 106 -51 -85 -120 -86 134 8 -16 -75 15 54 -11 232 -85 46 -147 169 90
3717I0k19L16k38J17r9K99k45k91M67j42N6J8K6p4j44k9p6K44j70O8Rj08J26j32
$$ 90 -129 187 -51 66 -33 266 21 -270 197 55 111 129 155 81 -63 -92 -168 76 -94 -26 -17 -125 1 -131
3741a31q4J62Mp4L85k16j09j48J22k1K06J02j13J44k18P0j65P0J76k58LK28j42
$$ -131 -215 -53 -49 -123 262 46 -63 -211 -89 -110 96 198 85 229 11 81 -84 -14 162 -96 -93 135 -7
3764gj09N7P3j46r4L1n3M6J95P5j2n5J47l31J15J76M9l68Q4L01j83j57K42j69
$$ -7 -116 -59 14 -132 -226 -195 -248 -202 -7 68 56 1 148 -183 -68 108 157 -211 -127 174 -9 -166 76 -93
3788i3K27k7k35K91l09P6q9K04Nm10J80J33j2K16J8j54L2j13L5K44n04L13j9N3
$$ -93 134 107 -128 163 -146 -70 -159 45 50 -360 -180 -47 -59 157 175 21 53 -60 -25 219 -285 28 9 62
3812F2m2k4k4K70k81N9k90K34j20Q7LR4j8J1k48K30J01p1N8m1j36nP2J65j00K0
$$ 62 20 -4 -28 242 -39 20 -270 -36 -156 -69 -66 28 10 21 -227 3 104 33 91 50 -86 -91 -19 146 46 66
3838F6Q7Lk1j85R7j18L9j4J77j8j8j39K54q1r7j21Q9p7j08J40K76l43O7PqN6M5
$$ 66 153 156 135 -50 47 -71 -32 -46 131 113 95 -44 210 129 32 -89 0 -77 -185 -45 231 -112 -45 -38 -46 10 55
3865E5J94k61lK47j41j91J74n0j34L2K42k73L49k22l1K33l29P0j18K83k19P1k82
$$ 55 249 -12 -15 232 91 -100 74 24 -110 -78 164 -109 240 18 -13 220 -109 -39 -157 126 -93 -22 -304
3888c04K21K39k10P6nj29K40j69J11r1m66O35k05j15P3j03P1K61j77p8K34l09
$$ -304 -83 156 -54 22 17 -112 128 -41 70 -21 -487 148 -57 -172 -99 -202 -131 130 -47 -125 109 -200
3910b00K01J06M4j01j36K05j12m3o8K3j55kR6J42k14K41k01J25L2o5J53j53J36
$$ -200 1 107 151 50 -86 119 7 -36 -104 -81 -236 -238 -142 0 -214 27 -174 -49 -17 -82 71 -82 54
3933E4N3k34K00p8O7p7K22k21K31j99r2q0Q8J20l67M07j05k2pP4p9N0J62j27l52
$$ 54 107 -127 73 -5 62 -15 207 -14 217 18 -74 -154 -66 54 -313 94 -11 -33 -40 34 -45 5 167 40 -312
3958c12K78K16k82j91M01k53J0Q3j7J31O4k2j26J29J25j25j3j98L29j73o0p8O0
$$ -312 -34 182 -100 -291 110 -143 -133 -50 -67 64 128 106 -20 109 234 109 96 -102 227 54 -6 -84 -24
3981b4K6QO9j74M6k07j46K53J78k32J16J8N7nR4k38K65Kj42K78l12n2J74M2k42
$$ -24 2 10 79 -95 -49 -256 -402 -149 29 -203 -87 -69 -12 -17 77 -161 104 106 -36 242 -70 -122 52 94 -148
4006a48j3J63J65j46j48J43j07j15M45l48NpK43k53JK7J28n3J2Q0j29j0l3M5J01
$$ -148 -161 2 167 21 -127 16 -91 -206 239 -109 -104 -111 132 -121 -120 -93 35 -18 -6 74 -55 -65 -98 -53 48
4031D8j40J52j45k2M2M3m1J80K5k5Jk1j89L35m05J01R8o5j53J20K88k42l9J28
$$ 48 -92 60 -85 -107 -65 -22 -63 117 142 117 118 97 -92 243 -162 -61 37 -28 -181 -61 227 -15 -54 74
4055G4l5N3M4jm01k2M56n65L42J87o8k7l7O5O7j18N3j61R0J44r7j00k26Q4L02
$$ 74 39 92 136 135 -266 -288 168 -397 -55 132 64 37 0 65 132 14 67 -94 -4 140 43 -57 -283 -199 103
4080A03j94N6Q4j91J31k85L98J20k35J77k97J81k2o8J5%pK26j26J33l01P5J45
$$ 103 -91 -35 49 -142 -11 -296 102 222 -13 164 -133 48 26 -42 -27 -27 -34 192 66 199 -102 -27 118
4103A18j84K23o3j36M4O9r9J00r5J24j36n2J20j1j1j05K03j55q3K48J47k05l1
$$ 118 -66 157 94 -42 2 71 -28 72 -23 101 -35 -87 33 22 11 -94 109 -46 -129 119 266 61 30
4126C0r5J30j9k80k2K26J43j28J79k87K64k48K00N8j62k16J88K68l38J12j78K32
$$ 30 -65 65 46 -234 -256 -30 113 -15 164 -123 141 -107 93 151 -11 -227 -39 229 -109 3 -175 57
4148E7j6l34R5J91J10j05j03K32k1o3M6J53k28j37Q7J9M8Q5OJ4l51K40J22n8k24
$$ 57 41 -293 -198 -7 103 -2 -105 127 106 43 89 242 14 -123 -36 -17 31 116 122 136 -215 25 147 89 -135
4173a35J6L01j16O3m2j85K54j2j22j08R9k6L3J35k29l6K15j18Lr4K73j64p4J68
$$ -135 -119 182 66 129 87 -98 156 144 22 -86 13 -13 20 155 -74 -110 105 -13 -10 -104 169 5 -69 99
4197I9o4j2j80M06o7k04nj11J52j40J11r8j61M42k40L0J54m8j18M7j04K57ok41
$$ 99 35 23 -157 249 182 -22 -27 -138 14 -126 -15 -113 -274 168 -72 -42 112 64 -54 -7 -111 146 140 -101
4221a01O9J87k40J20j72P5K29n2j16K1J21%k52K8J49j95J21j04K15j00J03k92
$$ -101 -32 155 -85 35 -137 -62 167 115 -1 20 141 141 -111 -83 66 -129 -8 -112 103 3 106 -186
4243a86K06p7K00J12j21l41P6K52n7k04j13O63n17J42j06J47j21j58J27J21K5
$$ -186 20 -57 143 255 134 -207 -131 121 64 -140 -253 410 -107 35 -71 76 -45 -203 -76 45 70
4264G0l64K90j10P0J81jl07K80nk58J5k1N74j45m43K21j50J26k17M36j95k11m8
$$ 70 -294 -4 -114 -44 137 136 -171 109 104 -154 -139 -160 414 269 -174 47 -103 23 -194 242 47 -164 -212
4287b12M07l40J1l9J01J91k8j95l4J59j8J20k9k44q1M40r1m11L25k09K56J43k64
$$ -212 195 -145 -134 -173 -72 119 91 -104 -138 21 3 123 94 -150 -231 209 118 -293 32 -177 79 222 -42
4310d2n0M6M9L5p3J60j90K2P0M3J14j65JM1P2p7n5K4p0J45k4R9K6k55o3p5J29
$$ -42 -92 -46 3 38 -35 125 -65 -43 27 70 184 19 20 61 133 56 1 25 -45 100 76 175 201 -54 -117 -192 -63
4337f3P2n6r9J37N5j12M9L45l36L6J31m8K2j52k1L04p6m23K12l6J82Pk77K63r9
$$ -63 9 -47 -146 -9 46 -66 -17 328 -8 28 159 111 133 -19 -40 264 188 -235 -23 -59 123 130 -147 116 17
4362A7P0j53%J0MK27l61j71J47J58JJ12M8k92K11K6n01O19j86J37j95K40j53M
$$ 17 87 -66 -66 -56 -52 175 -186 -357 -210 -52 -51 61 109 -183 28 54 -447 172 -14 123 -72 168 15 19
4386A9Qp4j17O0K20n7k82J26K09j60M4Q8J28j10M3J9j20m8K83l32K29k32NmK02
$$ 19 27 -47 -164 -104 116 59 -223 -97 112 -48 -4 84 212 102 145 164 44 -4 279 -53 176 -56 -51 -55 147
4411A47j16J2j97K0J71j97k47K27j6N6L00j51J4%o9%k0Q4J59j09k19J66j50J18
$$ 147 31 43 -154 -134 37 -160 -407 -180 -196 -140 160 9 23 23 -46 -46 -66 18 177 68 -151 15 -135 -17
4435a7J26l0j45J66J2k46L82k60L8j94L00J15l34k6j52M19k18J22r7JqP3n0j09
$$ -17 109 79 -66 100 112 -134 248 -12 26 -168 132 247 -87 -113 -265 154 -64 58 -39 -38 -46 27 -23 -132
4459a32J59l0o2K01mN3Nk22n0J41n8pJ39j82J82j91J64j1k04L94j01j23j36j33
$$ -132 27 -3 -65 136 132 185 190 -32 -82 59 1 -6 133 -49 133 -58 106 95 -109 285 184 61 -75 -208
4483b08K96O4Q1k49K7o2J8j47j5L12j3j20o1L08k19k9J18j71l6R4K5J8N6j61K07
$$ -208 88 152 233 -16 11 -51 -33 -180 -195 117 104 -16 -77 231 12 -17 101 -70 -106 -12 13 31 87 -74 133
4508A33m1p5k44L72k51J57J14m7j76J43o0K6N9j01J0k28J45P3P2k64L55j51P9
$$ 133 92 17 -227 145 -106 51 165 118 -58 85 25 51 110 9 19 -209 -64 9 81 -183 172 21 100
4531A00O2k03r5K14p6J17J56j77lk17j74L81k1J11k78p5K32j72M5Pm3K21o4n0
$$ 100 162 -41 -136 78 2 119 275 98 95 -122 -296 85 64 175 -103 -178 54 -118 -73 -66 -109 112 48 -2
4555bk27J72J47O0j37q6j79J96j22J25k3J70j99J45p5j29J62Qk84L05Kj82J00
$$ -2 -229 -57 90 150 13 -73 -252 -56 -178 -53 -76 94 -105 40 -35 -164 -2 6 -278 27 29 -153 -53
4578e3K87j85j28K23j19j17K2%q8J02o8J60K19k10j14K81r4K8k18J51q4M0l88
$$ -53 234 49 -79 144 25 -92 -70 -70 -158 -56 -124 36 255 45 -69 212 118 146 -72 79 -5 35 -353
4601c53L76J5J0O0j45K9q5M99m24n8K9K13k53RJ14kRk88K68k26M91k86J55j39
$$ -353 23 38 48 108 -37 -8 -93 406 -18 -76 -47 166 -87 -78 36 34 43 -245 23 -203 288 2 157 18
4625A8j91J36j3J28p6N4p3M2j45L53k54K6Q5k83L00P2L8j79M5j02J63j56Q6Q2
$$ 18 -173 -37 -50 78 2 56 -17 25 -120 233 -21 5 90 -193 107 179 217 38 83 -19 144 -12 74 156
4649A56k52j73L41n5m5n3k8O1j08K57l43L46O8n45N60l43R9j2k41J96k5J74j33
$$ 156 -96 -269 72 17 -28 -81 -109 -48 -156 101 -242 104 172 -373 187 -156 -57 -69 -310 -114 -139 35 -98
4672i8p1J59j81J49N9j28M7j56J23P7r8Q4J1j4K31k45J2n8K10ok18n1K07k4r4
$$ -98 -169 -10 -191 -42 17 -111 -64 -220 -97 -20 -118 -34 -23 -37 194 -51 -39 -97 113 107 -111 -162 45 21 -73
4697g3J35k1k34Q0J29j32K54r7j79K34j59K31k0l23K96l4j38M6q5J58J68n10L89
$$ -73 62 41 -193 -113 16 -116 138 41 -138 96 -63 168 148 -175 121 87 -51 -5 -90 68 236 -274 115
4720A15N6k20M7k7k4R8J36j79R5OK7j09p8NQ8O7j54J94L4r4j73L6K7k81J78k6
$$ 115 171 -49 -2 -29 -53 45 181 2 97 103 130 21 -57 -52 36 103 -51 143 177 83 -90 -54 -27 -308 -130 -156
4746a56K63j65J81j3Q0j12j79M7J77j74N6l2Q1j52K07q9P0p3J5k92K54J03j43
$$ -156 107 -58 123 110 190 78 -101 -54 123 -51 5 -27 54 -98 109 20 90 17 32 -260 -6 97 -46
4769d6n3J2L00j59r4j65L74k45J56J09j1k3r7j47J67k5lj7J70j21j15p4R9j13
$$ -46 -99 -87 213 54 -40 -205 169 -76 80 189 178 155 58 -89 78 53 50 33 203 82 -33 -107 -8 -121
4793a21J29M8j71J67J71n4l05J19L8K1k03K11k66K97k79Q2J42q1L7M0K00k04k7
$$ -121 8 56 -115 52 223 169 -136 -17 21 42 -161 50 -216 81 -198 -116 26 -55 -18 22 222 18 -9
4816ir6K93j33p4n5K5K1j12K03j23k94J39M3M4M9j52J90k8L0M1J2j12K0K74l67
$$ -9 -105 188 55 -19 -74 -49 -28 -140 63 -60 -354 -215 -172 -128 -79 -231 -41 -69 -39 2 14 -98 -78 196 -171
4841a71J33m7Q5J3j16L39m36m5N18n88M01l47K56J34R1j28n07K33J71o9m5J95
$$ -171 -38 -85 0 13 -103 236 -200 -245 273 -315 86 -261 -5 129 220 92 -415 -182 -11 -80 -125 70
4863G0R4p2q2J05N9o6o5m4nk19J63J0L32p7m8p2l7Q0p5J46k87K7o4J81j53j4P9
$$ 70 164 92 10 115 174 108 43 -1 -6 -225 -62 -52 280 203 155 83 46 126 51 197 -90 -63 -127 54 -99 -113 -34
4890c4J6r7J06K33k63PJ90o1j50n0K36l81K60LJ02P2k10n2Q4L9p5p1J67j57J86
$$ -34 -18 -115 -9 224 -39 -32 158 97 -53 -103 133 -248 12 15 117 189 -21 -73 11 50 -25 -96 71 -86 100
4915A00k50M1O2q1j8lJ83p3L8k01J40P5J0k04K53k26nK12J42o2j49J27o9K3j48
$$ 100 -150 -109 -47 -128 -146 -149 34 -39 -1 -202 -62 13 23 -181 72 -154 -159 53 195 133 -16 111 42 65 -83
4940h3Q1K8m9J62k83j7K74p5k19K66j2l6J93M4n42L80j42OJ1j21J84j64o2L01
$$ -83 -2 26 -23 139 -144 -161 113 38 -181 85 73 37 230 274 -268 112 -30 -24 -13 -134 50 -114 -176 125
4964A25j11j24o8J15M7kJ97j23O0k35J18k2J22k43j38L47j58K14q6j68j9J33J01
$$ 125 14 -110 -178 -63 -16 -18 179 56 116 -119 -1 -23 99 -144 -282 65 -93 121 35 -133 -152 -19 82
4987H2j85K61j97O6Q2l04j2K37L4k79QQ3K25J8k12J3K1m2J36m3L47m10K23m52
$$ 82 -103 158 -39 27 109 -195 -207 30 64 -215 -207 -124 101 119 -93 -80 -59 -101 35 -8 339 -71 152 -300
5011c00K93K83m24%K50j06l10O25k56o1q7q3J67J47k16K87l47J6K64m8r1p7K69
$$ -300 -7 276 -148 -148 102 -4 -314 311 55 -6 -93 -176 -9 138 -78 209 -138 -122 142 94 3 -74 195
5034A95j41j66J53M0J45j48K29k95q8N0m2N7K83j71n7j60L0K88l65J30J9J24r0
$$ 195 54 -112 41 81 226 78 307 12 -76 -26 -68 -11 272 101 44 -116 -86 202 -163 -33 -14 110 20
5057B0P2q8m9NK19j25l7J32R7l10P9l4J96m13L52j42j26J78k6K25l85K23p2j83
$$ 20 92 4 -45 -40 179 54 17 149 246 -64 15 -19 177 -236 116 -26 -152 26 0 225 -160 63 -9 -192
5081a92K24J85j99P4j65k18L84r3O1p7J63j24o1J14j66o0K33n7P4j20r2N3o2O3
$$ -192 32 217 18 92 -73 -291 93 0 61 -16 147 23 -38 76 -90 -150 83 26 100 -20 -112 -59 -121 -58
5105e8j07J54N0K9N2k0%m8j29J45j87rL31l53R3L59k82J65n8j97R4n5o6QR0q3
$$ -58 -165 -11 39 68 120 100 100 52 -77 68 -119 -128 203 -150 -57 302 20 185 127 -70 24 -31 -97 -89 1 -82
5131h2J02J89l21J70m3k7J35l75K63k7oR5k72M12j26O5N4j17L22m47J6L4Q0j44
$$ -82 20 209 -112 58 15 -12 123 -252 11 -16 -22 73 -199 213 87 152 206 89 411 -36 -20 14 94 -50
5155e0K49k2o0L3p1m3J07r1J43r9j54J85k55J41j95J96j85Q0K07l5l07M5jK81
$$ -50 199 177 117 150 79 36 143 52 195 96 -58 127 -128 13 -182 14 -171 -91 116 81 -226 -181 -182 99
5179I9j21L4P8k03R1M8n7jj58K37n9J9K4m4j99J64k7J26r3J95R6k71P2j59R3j21
$$ 99 -22 12 90 -113 -22 26 -31 -32 -190 47 -12 7 31 -13 -212 -48 -75 51 -42 153 249 -22 50 -109 -16 -137
5205a37K74k46K65l67K79j72L73Rk72J64l78K66M8k67L47Q7q4j91Q3j00j63O8
$$ -137 137 -109 156 -211 68 -104 269 278 6 170 -208 58 106 -161 186 273 189 -2 81 -19 -182 -114
5227a14O2j44J36pm0L57k30q2J76j73k17L93l68j27L30j63J35K6J43m2n0p5R3
$$ -114 -52 -196 -60 -67 -107 250 20 -62 114 -59 -276 117 -251 -378 -48 -211 -76 -50 93 51 1 -74 19
5250A9N6j32m5J09L4J47k54J68j42J28N7l0K0j79q0J47o1j22K24R4lL3j70j44
$$ 19 75 -57 -102 7 41 188 -66 102 -40 88 145 115 135 -44 -124 23 -38 -160 64 158 155 188 18 -126
5274a26K60m0q0j48K77j84j29J18Oj71L03n2O8j57Q3Q7j34j04J82k00K09m5j69
$$ -126 134 94 14 -134 143 -41 -170 -52 -46 -217 86 34 102 -55 28 115 -19 -123 59 -141 68 23 -146
5297a46K27l42J32K33j65JJ10l3p2J41j69k6J03j5p8J80j10K58k76J20j38R2k3
$$ -146 81 -261 -129 104 -61 -60 50 17 -55 86 -83 -109 -6 -21 -99 81 -29 229 -47 73 -65 27 4
5320Dm4p1J60j68J22j24J62O8k25K18j31j5j18M8L1j41J15L9j5M7k0K52k80j03
$$ 4 -40 -111 49 -119 3 -121 41 109 -116 102 -29 -44 -162 -114 -83 -224 -109 -70 -85 -38 -58 194 -86 -189
5344a89J64J21k21J12J99n2j95K88k41r2K3K51k7j34p0R3J59j84j8j36J88j73
$$ -189 -25 96 -125 -13 186 134 -61 227 -14 -106 -83 168 141 7 -63 30 189 5 -13 -149 39 -134
5366a34R0J7J09j99Q2j99J79k8J96j8J3k88K63j38J19n0k07L02Rj21r4M9K5j32
$$ -134 -44 -27 82 -117 -35 -234 -55 -83 113 95 108 -180 83 -55 64 14 -193 109 118 -3 -97 -48 -23 -155
5390a55K22j36J53k34K7J99k7j30j59J73Q9K14j75O7r7j36R2K8L1J28O6j22l1
$$ -155 67 -69 84 -150 -123 76 49 -81 -240 -67 22 236 61 128 31 -105 -13 15 46 174 240 118 87
5413H7r3r0K37l27M4M54j80j50L18k05o3n4K15l13K39q6K46k86K7K69k68o0p5
$$ 87 -6 -96 141 -186 -142 312 132 -18 300 95 32 -22 193 -120 119 33 279 -7 20 289 21 -39 -114
5436a14L85l36J00m6K31n6K3q9j49j1r7J08K9O6j3J97j83k44L43q6j77J00mJ98
$$ -114 271 -65 35 -11 220 164 187 98 -51 -62 -159 -51 -22 44 31 228 45 -199 144 58 -119 -19 -23 175
5460A75k27j00J29K90m52J68J88k51n9j8J50j15J96p2k9j15mN4N3k6L99k24j58
$$ 175 -52 -152 -23 267 -185 -17 171 -80 -139 -157 -7 -122 74 2 -27 -142 -146 -92 -39 -65 334 110 -48
5483d8q3J17l8N2j4N1J50k60K44k87j49L29j05o6J75j24R4L9J31l37J08j76M21
$$ -48 -131 -14 -52 0 -14 37 187 -73 171 -116 -265 64 -41 -107 68 -56 38 77 208 -129 -21 -197 224
5506B24n4k89J20j93O0J14L3J12J03k03R2r1o9Q2j39k27M40k51LM7M1J47k15L48
$$ 224 170 -119 1 -192 -132 -18 15 127 230 27 119 28 -41 41 -98 -325 115 -136 -133 -86 -45 102 -113 235
5530B35l33J5l2J64p9M7K13l58J5J74m0r5K6o2K32N9j04K7Mp2m3m5M4k01K89r6
$$ 235 -98 -83 -115 49 -30 17 230 -128 -113 61 21 -74 -48 -110 122 181 77 104 108 36 -7 -52 -8 -209 80 -16
5556a6P4l7n9q8J95Jj13J17j45M7j34L65j97P5k1k2j59J85mm71M40Q6j81M33k27
$$ -16 58 21 -38 -126 69 70 -43 74 -71 -24 -158 207 10 85 64 42 -117 68 64 -407 33 119 -62 371 144
5581A44j27L1Pj04KL04l13J74Pj43L14j65j35j00R2j25K17j67J36j44P4j86Q8
$$ 144 17 48 55 -49 -47 257 -56 118 125 -18 296 131 -4 -104 -12 -137 80 -87 49 -95 -21 -207 -119
5604a19K67k4r0K3k94K48R0k4k6r3M4kq9L9j45J74O3j99K13j25m8J39K54r9k62
$$ -119 148 124 34 57 -237 11 101 77 51 -42 2 0 -89 -50 -195 -21 42 -157 56 -69 -117 22 276 177 -85
5629h5L18j38j64J26Q1m3l6j69l2J85R2k55K04P2k95J28q3oJ63l21J45J18J53
$$ -85 233 95 -69 57 138 95 59 -110 -142 43 135 -120 84 156 -139 -11 -94 -100 63 -258 -113 5 158
5652A58o3r8J00j6k21K14j05P2k65K38J87j45L4k11RJ26Q6J94l92J43p1J04j74
$$ 158 95 -3 97 81 -140 74 -31 41 -224 14 201 56 90 -121 -112 14 100 294 -98 45 -26 78 -96
5675i6K16m05r6L82j54J1M3J45j43m3L19j73j05j1J22p1j06k2K09R6o0j0J9j0
$$ -96 120 -285 -381 1 -153 -142 -99 46 -97 -140 179 6 -99 -110 12 -59 -165 -187 22 118 58 48 67 57
5699E7l47K22K0K16m02J9J47O6jM0J10j43j58q2K80p1K00k7l78M34q6m0j05m2
$$ 57 -290 -68 -48 168 -234 -215 -68 -2 -3 37 147 4 -154 -236 44 -27 173 146 -232 202 116 76 -29 -71
5723g1p8J12J16O4k94J79j89K52J6o0r7J12k94J70o8K86r5k53J09M1j05K58l9
$$ -71 -149 -37 79 143 -151 28 -161 91 107 47 -50 62 -232 -62 -130 156 61 -192 -83 -42 -147 111 72
5746G2j50J48j41j5K00j81N2n35N30q6K72j96l3p4K53k05QL14m7k69K56j26Nj65
$$ 72 -78 70 -71 -86 114 -67 -15 -550 -20 -106 166 -30 -63 -137 116 -89 -81 233 186 -83 173 47 52 -113
5770a13O7J07k07J35N8K17l04j09L07k0l33K65q6j15P6J60l04K25q3Q8j06j5O6
$$ -113 -46 61 -146 -11 47 264 -40 -149 158 138 -195 70 -16 -131 -55 105 -199 26 -57 31 -75 -90 -24
5793b4j08k3J58j20K7k6J69k13K01k7l3m2j5P8N6L1N6m8j44j6j0L3o4j5P9J13
$$ -24 -132 -155 3 -117 -90 -116 53 -160 41 14 -19 -61 -76 2 58 89 145 97 -47 -63 -73 -40 -104 -119 -40 73
5819G3j00K16j33k30J85k0P9m0j45J71j53Q9k28m5L89Kl48P1N6L00j74k00L12
$$ 73 -27 189 56 -174 11 -9 70 30 -115 56 -97 -8 -236 -281 108 110 -238 -167 -111 189 15 -185 127
5842A27P1j11j36l3J57l1K8j60J99m3n4O1l28K10P1q8L15k99PM4j91L28j01O3
$$ 127 198 87 -49 -82 75 44 72 -88 111 68 14 75 -253 -43 28 -60 255 -44 -37 7 -184 144 43 106
5866A06O8k37M0J01m8j39J58l11K72k3k4J0K31q6q4J3j80J44O9j57J25k80L00
$$ 106 174 -63 -23 78 30 -109 49 -262 10 -13 -37 -27 204 118 34 47 -133 11 80 -77 48 -232 68
5889F8j49J44j22r1p0J96J21j82K80l95J40J98J1j07k6k37K84j4k69J44K7O0J81
$$ 68 -81 63 -59 -150 -220 -24 97 -85 195 -200 -60 138 149 42 16 -221 63 49 -220 -76 -49 11 192
5912A92k74k3J85j89J58q2J14L6l9p1o9J05k38J78p8j94K17J61P6k71o9K57j51
$$ 192 -82 -105 80 -109 49 -33 81 117 78 7 -62 43 -195 -17 -95 -289 -72 89 165 -106 -175 82 -69
5935f9o8J20O5p5nJ89k3k7k94LJ49j14K02M2N5j53k88M19p6k83J14P8R6O8j54
$$ -69 -137 -17 48 -27 -32 157 134 107 -187 -184 -35 -149 53 95 150 -3 -291 128 52 -231 -117 -39 57 125 -29
5960b9J79m5n0l5K44l39j97L32j16N3k6J3K91l77J52j38K19j54k84L22J19j68
$$ -29 150 105 55 20 264 -75 -272 60 -56 -3 -29 -16 275 -102 50 -88 131 -23 -307 15 134 -34
5982c4j00j64J22J15J13j16J7%j09K4P2j66K38r6J20j44O1o9J55K12n2j06j67
$$ -34 -134 -298 -176 -61 52 -64 -47 -47 -156 -132 -60 -226 12 -84 36 -108 -47 -116 39 251 199 93 -74
6005g4J49N6k64J0J34J13j34L5k16K88q9l6K36l40nK19j52K09r1j2K7j54j13L60
$$ -74 75 131 -133 -123 11 124 -10 25 -191 97 8 -28 208 -132 -137 82 -70 139 48 36 63 -91 -204 156
6029A56k15K36j71J22q6J50j61k18M17k65Mq7K75J0j28qN8J13j52L0j05j27J67
$$ 156 -59 177 6 128 42 192 31 -187 230 -35 -31 -118 157 167 39 31 89 202 50 80 -25 -152 15
6052A5j95K42j91K16mj41j38L06q6L47m88J2K54n0m6J00J2j40q2Jq2qN9J05p6
$$ 15 -180 62 -129 87 83 -58 -196 110 24 371 -117 -105 149 99 53 153 165 25 -57 -56 -138 -146 -87 18 -58
6077e8J72k9j55R5j70K50j18k5J32m47K74K01k20L16j7m01J01K89k68m3J97j59
$$ -58 114 85 -70 25 -145 105 -13 -38 94 -353 -79 122 -98 218 201 -200 -99 190 -78 -121 76 -83
6099h3j83K07j47M0J50j97L35R9k75j11J5K5K07j9mk95J44r3M09K0pp8j20L4j30
$$ -83 -266 -59 -206 -166 -16 -213 122 221 -54 -165 -150 -125 82 63 59 -236 -92 -185 224 244 237 159 39 73 -57
6124e7J83j03n8o8K2J39J17k62K36o7J74j97j25J18q1Q4k6P2j12J8j36P3m5jR0
$$ -57 126 23 -35 -103 -81 58 175 -87 149 82 256 59 -66 52 -29 55 29 101 -11 7 -129 -56 -101 -102 -12
6149a2L34m29K18p8j02k16N89k10qK9j25J05Q2k66J28j99NM09n23K76p5J91j67
$$ -12 322 -107 111 33 -69 -285 304 94 86 115 -10 95 177 -89 39 -160 -155 254 -269 7 -68 123 -44
6172d4J59j63J40k11L74l24J00J57r2k51J49NN3ro2J42l4r2K6K7NJ22l2j01k22
$$ -44 115 -48 92 -119 255 -69 31 188 96 -155 -6 -1 52 43 -19 123 89 -3 23 50 55 177 145 44 -178
6197a78K28p1n4j42K37j95K11p9k8j58K52k71K53N6q7j41K6J65n5L8q7j9M7o1
$$ -178 50 -21 -75 -217 20 -175 36 -43 -71 -229 23 -248 5 61 -26 -167 -141 24 -31 7 -80 -99 -52 -113
6221a13Q6oj0j58J42L49j05j28o0k7j1j69M43n53L28J57l12J40o6K7N3j70O5n9
$$ -113 -27 -33 -43 -201 -59 290 185 57 -3 -30 -41 -210 233 -320 8 165 -147 -7 -73 -46 7 -163 -98 -157
6245a57M2K11l70K51n3N8J97K16k75l4r1j16J12J63j88J59j2l92L04Q4j50R9k4
$$ -157 -115 96 -274 -23 -76 -18 179 395 120 86 -5 -121 -9 154 -34 125 113 -279 25 109 -41 58 34
6268C4J25kQ1k19J48j67J10l1j76j37K64l0r8P8n8nql6J82J01q5n0%K23k82p9
$$ 34 159 157 238 19 167 0 110 79 -97 -234 30 0 -98 -20 -78 -83 -91 -127 55 156 71 21 21 244 -38 -117
6294a17o6J19l4M0N1p1J95J8k60Q9K9M4J74m7k31J16n6k23J45J64k61j16K91P3
$$ -117 -183 -64 -98 -58 -7 -78 117 135 -125 -36 -7 37 211 164 -67 49 -7 -230 -85 79 -182 -298 -7 66
6318F6j34J21R2j44M1j40Q8J25J3K1m05K55j38J40J23k55J15pj87K33rk13r3K71
$$ 66 -68 53 145 1 42 -98 -10 115 128 149 -256 -1 -139 1 124 -131 -16 -23 -210 23 14 -199 -292 -21
6342b1m1m6LK17J56k89N5J82l21J00Q3j0J88j90J05j49J18j87QJ18j49L8j86R2
$$ -21 -62 -108 -105 112 268 -21 34 216 -105 -5 78 68 256 66 171 22 140 -47 -39 79 -70 -32 -218 -126
6366a26J30Jj5J51l8k35K89j17O3k98J55nJ56m2k67J47J57L8k61PL52j13k85M2
$$ -126 4 5 -10 141 103 -132 157 40 103 -195 -40 -45 111 69 -198 -51 106 144 -117 -110 242 129 -156 -114
6390a14l7K75q6J37k79n4K26Q4k09K1Q6k83L49r3o4M7J99k60N5L4K1j6O2J49j82
$$ -114 -151 124 38 175 -104 -158 68 152 -57 -36 50 -233 116 23 -41 6 205 -55 0 34 55 39 101 250 68
6415F8k41K90j35J22j23QP6j26O3k42J60r1K33m39J70K56j23j36J86m6K70k50
$$ 68 -173 117 -18 104 -19 -11 65 -61 2 -240 -80 -171 62 -377 -207 49 -74 -210 -24 -70 200 -50
6437e0m4K93l02R2K22j80k51M06pM4k4k64J36l02L85o2Jj77J55j08l9L34m89R6
$$ -50 -94 199 -103 -11 211 31 -220 186 179 223 199 -65 71 -231 154 92 93 -84 71 -37 -76 258 -231 -135
6461a35k6J00O5QK75m36J80k07J54l6J42j54Q2Nk3j18j74K54J14N5j85L3qj7J83
$$ -135 -161 -61 4 12 287 -149 31 -176 -22 -58 84 -70 12 17 -6 -124 -298 -44 70 125 -60 -27 -35 -52 131
6486A31j67l0P4l6j16K79L9J09k50l6k09L1K80j02J80j50j17R5p7j62J94%J15
$$ 131 -36 -66 8 -28 -144 135 174 283 33 -3 -212 -181 99 -3 177 27 -90 5 -72 -234 -40 -40 75
6509G5P8k82R3r7Q5j14n8K57j09J39j03j23K90m9K50k41j83J37L3k03K7O3j38
$$ 75 153 -129 -36 -133 -48 -162 -220 37 -72 67 -36 -159 131 82 332 91 -92 45 78 -125 -98 -35 -173
6532a73K04j82j39K14K8r2n6K24R4l08K21n7O7j56r6O8J49j85J89M7L7L4p2k5
$$ -173 31 -151 -290 -76 -48 -140 -196 28 122 -186 35 -22 45 -111 -207 -139 10 -175 14 61 98 132 60 35
6556C5K21l91j4L43j3q0j38j85J75L41l23j01j51L59n9m1M0j25J92P4l10K36P0
$$ 35 256 -135 -149 194 181 101 -37 -222 -47 294 -29 -130 -281 78 19 -22 18 -107 85 159 -151 85 155
6579A55j88j31L34j09l72K51N6j8jo4K96j58N6q4N2k6j03J75j98Q7J60N0k71K36
$$ 155 -33 -164 170 61 -311 -60 -4 -22 -23 -87 209 51 107 23 75 49 -54 121 -77 10 170 220 -51 185
6603A85J00l44j0RK28j55q7J87n9Q3l24L42p6j77J26J38k69N5j31K72o3kk6j30
$$ 185 285 -59 -69 -60 168 13 -74 113 54 137 -187 155 79 -98 28 166 -103 -48 -179 93 30 28 2 -128
6627a28J34l1N5j31j01jM01l40n1p1L4J09M9o7K37j64J11k38L31m7k30K92j97
$$ -128 6 -25 30 -101 -202 -203 198 -142 -193 -264 -230 -121 -72 -139 98 -66 45 -193 138 91 -139 153 -44
6650d4K90l7j58J90m06N4J84n3j59K38J28l18J70j05K18j39l6J31k41o7J43k90
$$ -44 246 209 51 241 -165 -111 73 20 -139 99 227 -91 79 -26 192 53 17 148 -93 -160 -17 -307
6672c07J68P5J71k5p3j61j08K11J99J41k13k07J52r4J36Rj48K79k06Q8M7j56j82
$$ -307 -139 -64 107 82 9 -152 -260 -49 150 291 78 -129 23 -71 65 74 -74 205 -1 87 134 -22 -204
6695b04K31J72Pl75J34Ljj92L14k21J92%J2J00j88M3k8m6m5J37j12j0K62j16L9
$$ -204 27 199 206 -169 -35 -32 -33 -225 89 -132 60 60 72 172 -16 27 -1 -47 -92 45 -67 -77 185 69 108
6720A08P7k94M1j5pJ07J38j11n2K40k25J56l83M33j38j11j95k7K38j87L12J00
$$ 108 185 -109 -68 -83 -90 17 155 44 -8 232 7 163 -220 213 75 -36 -231 -258 -20 -207 105 205
6742B05l85J29MJ52j09k1J10k03o6R8J86L6k83L7K65k52K01k26J17J86j37j90
$$ 205 -180 -51 -47 105 -4 -25 85 -118 -184 -86 100 136 -147 -110 155 -97 104 -122 -5 181 44 -146
6764a46q2J88J07l18L32j06l0J46k31K68k18J46l02J41J09K1j52J21j08J69J07
$$ -146 -228 -40 67 -251 81 -25 -55 91 -140 128 -90 56 -246 -105 4 25 -127 -6 -114 55 162
6785A62K0r3j39j64K44n7l79L85O8M1j28n2j8%k4J45j85J45j18K68k28P8j2o5
$$ 162 182 89 -50 -214 30 -27 -406 -21 47 88 -40 -92 -110 -110 -134 11 -174 -29 -147 121 -107 -29 -41 -106
6809a06j6J52j1L8p1Jj56n3K12j85M15j09m37M86j5j29j69L64l06K55k61m4K21
$$ -106 -122 30 19 57 -14 -13 -169 -222 -10 -195 220 111 -326 160 145 16 -153 211 -95 160 -101 -145 76
6832G6m1j04K3j09K82j52J90j77o7Lj11K55L7J00j23j63K5J57J34J60l16m3k48
$$ 76 35 -69 -46 -155 127 -25 165 -12 -79 -76 -187 68 105 205 82 -81 -56 101 235 395 79 36 -212
6855b12J49R6L2n3p1Q9j48J87j90mJ23K54m81K20K67k91J59k83j48K06J04j22
$$ -212 -63 33 65 12 -59 30 -118 69 -121 -125 -2 252 -229 -9 258 -33 126 -157 -305 -99 5 -117
6877a17K00P1j24M3m2q6j05K11n7k18L2J60k6J29k96K69j7n9R6J79jl86L20l51
$$ -117 83 154 30 73 31 -55 -160 51 -6 -224 -192 -32 -58 71 -225 44 27 -32 64 243 242 -144 176 -175
6901a75o2N8J74m0L68n33J63Q3O5l3j14K07k61L8J74j12j08j22J93p7J01K3K22
$$ -175 -237 -179 -5 -45 323 -210 -47 36 101 68 -46 161 -100 -62 112 0 -108 -230 -37 -114 -13 10 232
6924B32l86L1j1R0N2R5j03p3K79l57J62L9l3J24k06K1J35j37J25j55J0j00K43
$$ 232 -154 -123 -134 -44 8 103 0 -73 206 -151 11 50 17 141 -65 -44 91 -46 79 -76 -66 -166 77
6947G7k74K43k25J06N8M2k22J66m6R2p3j37O3k1K18RJ01k19M8o0R1r5P9n0jK11
$$ 77 -197 46 -179 -73 -15 27 -195 -29 -75 17 -56 -193 -130 -151 67 76 177 -42 6 -54 37 -58 21 -29 -30 181
6973A81k68NJ41K4Q8j01L3j13J32j02J10j78L2R3n1k13Q2RK85n2n9k03K38j20
$$ 181 -87 -82 59 83 171 70 103 -10 122 20 130 -48 -16 77 26 -187 -105 -96 189 137 78 -125 113 -7
6997gJ15j00o2J4j68L4J51J71p4j07K2j49J92j25R0m3p6J24rn4J04K3q9J16j67
$$ -7 108 8 -54 -40 -208 -174 -23 148 74 -33 -11 -160 32 -93 -3 -46 -122 2 -7 -61 43 66 -23 93 -74
7022g4J15l9o7K89k27K20m27L64j31j64J39j23J25j16J0L46l77M7L02m42J95O5
$$ -74 41 2 -65 224 -3 217 -210 154 23 -141 -2 -125 0 -116 -106 240 -137 -90 212 -230 -35 30
7044C0Pn3j87K73lj11J26q3RJ19j3m6n0k28L22p6l6r0R5N9p9k11J88J50k90r4
$$ 30 37 -16 -203 70 67 -44 82 -1 8 127 114 68 18 -210 112 36 0 -90 5 64 -15 -226 -38 112 -178 -272
7070b72K29n1K08j18O3R7m9r1J10J42l42K16j73J5k58J96K19k3n3k1Oo4K3Q6P6
$$ -272 -43 -94 114 -4 59 156 107 16 126 268 -74 142 -31 -16 -274 -78 141 118 65 44 50 -14 9 95 171
7095A71k01lQ4p2J40j54J02Lj21O1J49j00n0k68J87L72m71J30L8R0r0j78J32J51
$$ 171 -30 -33 51 -21 119 -35 67 70 -51 10 159 59 9 -259 -72 300 -171 -41 -3 87 -3 -181 -49 102
7119A02k12J02Q4J51k89N8J46l83L07k22J44J16p6k10L37O8l08Q5J83j96j78K71
$$ 102 -110 -8 76 227 -62 -4 142 -241 66 -156 -12 104 28 -182 155 223 -85 0 183 -13 -191 80
7141H0l7j59K60j09k71L15j63j0O3k25K27K49k22p4N5j51J4K76j06J84r9j66K63
$$ 80 43 -116 144 35 -236 79 -84 -94 -31 -256 -29 220 -2 -76 -21 -172 -158 118 12 196 97 -69 194
7164A94p1j77l8L56j45n8M4j72K59j46J31j73l6K13l17N08k35j01j06K39j36k23
$$ 194 123 -54 -92 264 119 61 105 -67 192 46 177 4 -32 181 -136 372 137 36 -70 169 33 -190
7186a90Q8L02j76OJ97k58Pj41J09j23L68k45l5M8k4K10k32J11j53Q5J37J59l39
$$ -190 -102 200 24 30 227 -31 -24 -165 -56 -179 189 -56 -91 -43 -67 143 -89 22 -131 -46 91 250 -89
7209h9J18L5m2J50l27j28o8M61j62J17k16J81p9J50Q1k46K10k44M3j05K19m4%
$$ -89 29 64 22 172 -155 -283 -351 110 -52 65 -151 30 -49 101 182 -64 146 -98 -55 -160 59 15 15
7232A5k77M59j56q2O4N9k36J13l0N6j62J61n1m1J29Q2L2jj11O6P4k85K76j15P8
$$ 15 -262 197 41 -41 23 82 -154 -41 -71 -15 -177 -16 -67 -108 21 103 135 134 23 89 163 -122 154 39 117
7257A17M4J8k86J65k27N9Ol6J63k19K29j57J12P9k7k73L07j57J81k9q9k3k1J30
$$ 117 161 179 -107 58 -169 -110 -104 -140 23 -196 33 -124 -12 67 40 -233 74 -83 98 69 -20 -43 -64 66
7281F6k68L38q9k13N2K17P3n0l49K00K69l09K61j20J00k42o7J46O4k33J90l0J12
$$ 66 -202 136 47 -166 -114 103 176 126 -223 -23 246 -63 198 78 178 -64 -131 15 79 -154 36 6 118
7304A18k03J11j58J00p6N0Jk02L16j31N4J32n1m1J50k18N8J0O4L2q0Ok9k2K58
$$ 118 -85 26 -132 -32 -108 -58 -57 -259 57 -74 -20 112 61 20 170 -48 10 20 84 116 36 42 13 -9 249
7329B49k22p1R2j78K42L6k35q5K64k13Q2K48l35O5J95l23k0K13k1J79k36J75K0
$$ 249 27 -44 48 -130 112 148 -87 -172 92 -121 -39 209 -126 -61 134 -189 -209 4 -17 162 -74 101 121
7352A21j92P6q2J09P2k25MK68k11K48k04N2r1j47K39o8k3Q6K83k51R5l1P2l07
$$ 121 -71 5 -77 32 104 -121 -117 151 -60 188 -16 36 -55 -202 37 -31 -54 32 315 64 159 128 200 -107
7376a07Q7L6L7j33J14k25o6K26J64k03n5j0n6K12p8N4J54L9m00o6L96q2P2K90
$$ -107 -20 16 53 -80 34 -191 -257 -31 133 -70 -125 -135 -191 21 -57 -3 151 190 -210 -276 120 38 110 400
7400D00l68K07p6j43p1j84K23J9k1L5m3N8k8QP1L6k77J8L06j47k99L76j1l59J80
$$ 400 32 239 163 20 -51 -235 -12 7 -14 21 -22 36 8 16 87 123 -154 -136 170 23 -276 100 89 -270 -90
7425i0j01K54J77k41OJ66n8O2o5m9j31J62l43J45J04K8k1L7J7J45j82J07j16q2
$$ -90 -191 63 240 -1 5 171 113 175 110 61 -70 92 -251 -106 -2 26 5 42 59 204 22 129 13 -69
7449f9m3L7J61l58L79N5k67n3J28Q4mj27J39j52J90p4j54K23p5r4l5o8J70q8N0
$$ -69 -112 -75 86 -272 107 162 -105 -158 -30 54 50 -77 62 -90 100 26 -128 95 20 -74 -109 -177 -7 -95 -45
7474d5P6k46J67J34pk4m5k14L58r7j12J99l69J12n1J68p4P8J04p0J71l4j05n8
$$ -45 31 -215 -48 86 79 55 10 -204 154 57 -55 144 -225 -113 -164 4 -70 8 112 42 213 179 74 16
7498A6M9M3q3J77l10J76o3O3M2j78J59j03l2o6O7K86l71J06l1K59k20J0k1J69
$$ 16 65 108 25 202 -108 68 5 68 110 -68 91 -12 -44 -110 -43 243 -128 -22 -53 206 -14 -4 -25 144
7522A44k20K33k58L60k29M5l5q7J76o6K41j43k68P8j21Q2J20O7k66J86j47K37
$$ 144 -76 157 -101 259 30 75 40 -47 129 63 304 161 -107 -29 -150 -68 52 119 -147 39 -108 129
7544A29m35K91p5J33K03n48L57l7J08m40L47L7M9k42K27k85K97k57J02K27k9l96
$$ 129 -306 -15 -90 43 246 -302 55 18 126 -314 33 70 119 -123 104 -181 116 -141 -39 188 159 -237
7566b37K04L3J7lP5l08K08J89k05k27K76K64k27Q1o8J1l3L1J74k29J01j1P1j90
$$ -237 -33 0 17 14 89 -219 -11 178 -27 -254 22 286 59 140 72 83 50 81 255 26 127 116 187 -3
7590cO6J6J57k92p3J45j66L30j82l0Mj68N3Q2J31J1j43n6J33J51k23J99l48L18
$$ -3 63 79 236 -56 -129 16 -150 180 -2 -32 -28 -196 -143 -61 70 81 -62 -118 15 166 -57 142 -206 112
7614A12p4Q9j16J03k2j34n2O1R9p9o3J11p6R8M4j21K22r7n3n0j58OK23l49L40
$$ 112 38 127 11 114 92 -42 -94 -33 66 -13 -76 35 -41 57 101 -20 202 105 52 2 -156 -150 73 -276 64
7639F4j2j68K1RR1K08m1j20o8Q1l60J76J11p1J63q5J63k10L7J46k29J49J9l7j
$$ 64 52 -116 -95 -86 5 213 172 52 -16 65 -295 -119 -8 -79 84 -1 162 -48 -11 135 -94 55 74 37 36
7664C6M4p6NJ06r1P3KN9k49L3Q3L21l42M9r4j53L40k1Ol78L83OK0j04j76M3R1
$$ 36 80 4 9 115 24 97 99 158 -91 -58 25 346 4 53 -41 -194 146 125 131 -247 136 142 162 58 -118 -75 16
7691A6J52l75J19K11m4%N1j11P2j07R6K12k74J57j89r0L77l25J18J03l31k1J45
$$ 16 168 -207 -88 123 79 79 130 19 91 -16 80 292 18 175 -14 -104 273 -52 66 169 -162 -183 -38
7714c8l6J34l22J74J70j27o6K67l15J55j54J06K95k30j9J15k44O5j1J90r4l0J77
$$ -38 -74 60 -262 -88 82 -45 -111 156 -159 -4 -158 -52 243 13 -6 109 -135 -70 -81 109 15 -15 162
7737A62j09m5J13l1q0P0n3O2PL8k32J9J24Q5J42j68k3M6r9M4l9L3j45k0j07OP8
$$ 162 53 8 121 90 10 80 27 89 96 134 -98 -79 45 130 272 104 81 127 28 72 33 66 -79 -99 -206 -200 -122
7764a22P3J44J2J33m28K28J60k05J4J09J92l14O8q1j12J85m2M1j68j83N36j89
$$ -122 -49 95 107 240 -188 40 200 -5 9 118 310 -4 64 -17 -129 56 14 55 -113 -296 240 51
7786E1j88J42n6J10l2j12J26Q8k13J57r2k4K4Q7l79K76o7J22j63n1J38L3j98L33
$$ 51 -137 5 -51 59 27 -85 41 129 -84 73 -19 -43 -19 68 -311 -35 -102 20 -143 -194 -56 -23 -221 112
7810A12m6J59k72N7j70l4K95k91L47p3j41n0l4J26k3k15J64P3m8K50m45K28R7
$$ 112 66 225 -47 10 -160 -194 101 -190 157 84 -57 -107 -141 -15 -38 -253 -89 -16 -64 186 -259 -31 66
7833F6o6J88j31JK42k21k9N0j02j89J42j55L08r7p0J74k3Po7k4M3J05j10r0K29
$$ 66 0 188 57 58 300 79 50 100 -2 -191 -49 -204 104 7 -63 111 88 95 28 4 47 152 42 -48 181
7858A81k3k95K5J24M4j94J68o7O8j49P6j4j18J14jK12j18r7J4k4l4J30L8L6PN1
$$ 181 158 -137 -112 12 56 -138 30 -37 31 -118 -42 -56 -174 -60 -61 151 33 -64 -50 -74 -108 22 60 96 103 154
7884A54k69N3P3N4l17J85oJ80j80K29k89Q8p8J19j06J04Q7r2L2q9J30O3r4P7j82
$$ 154 -115 -62 11 65 -252 -67 -73 107 -73 156 -133 -45 -123 -4 -110 -6 81 -11 21 -68 62 125 31 108 -74
7909g4Q0n3J29j67K25J09j87k26N8jJ06Q7j86J77R2j14p1K08j68j14k0K83k14
$$ -74 6 -47 82 -85 140 249 62 -164 -106 -107 -1 86 -100 77 169 55 -16 192 24 -90 -110 173 -41
7932d1K60k81n9J81j28L54l75J16p7r4O8J1L1J36l36J55K86j60p1O6Q8j76n4K50
$$ -41 219 -62 -121 60 -68 286 -89 27 -50 -144 -76 -65 -34 102 -234 -79 207 47 -24 42 130 -46 -100 150
7956A50k06j12J40j2PJ18l4O9k54K12l2j32J97P8k61P0oj66Q8J50j52J09j15J92
$$ 150 -56 -168 -28 -40 -33 85 51 120 -134 78 46 -86 111 189 -72 -2 -8 -174 -86 64 -88 21 -94 98
7980I8P1k17J00k4N6j0j07j02J70r7l8O2n4P7j09J89L4l8k94J85J92j66N1j27
$$ 98 169 -48 52 28 84 74 -33 -135 35 -62 -100 -38 -92 -15 -124 65 99 61 -233 -48 144 -22 29 -98
8004i8K55l57J05P1M5J53N0kk80nJ94j23K61k25p4K9Q0r5N4P5o3J14J09l91J90
$$ -98 157 -200 -95 -24 21 174 224 222 -58 -63 131 8 269 44 -30 -1 79 -16 38 113 50 164 273 -118 72
8029G2l7rM3j77J14j24J22K5m6n7J09m4K9r7j33k8L59J68m15J18j5J02j86O7K2
$$ 72 35 26 69 -108 6 -118 4 29 -17 -74 35 -9 20 -77 -210 -238 121 289 -126 -8 -23 79 -107 -40 -18
8054a8r4L73l28Q0j17J9R6j36Q8j22M22l75j23L92k23q2J06j1K01q1k5r7J34j53
$$ -18 -112 261 -67 13 -104 -85 11 -125 -37 -159 263 -112 -235 157 -66 -148 -42 -53 148 67 42 -55 79 -74
8078g4K8R6n0L3n8L4J0nL1O9m3K9p1k20L05j94K12K2l24M1j7M31j54k0l06J80
$$ -74 -46 50 0 33 -25 9 19 14 45 114 71 100 29 -191 114 -80 132 154 -170 -129 -146 285 131 111 -195 -15
8104a5jj7J29j41J47r4M4k65K43m4j18L2p9K94j89j05L60j61o4m06N59k62P9J26
$$ -15 -16 -33 96 -45 102 8 52 -213 30 -14 -132 -100 -179 115 -74 -179 181 20 -44 -450 109 -153 -74 52
8128E2k26J62J30j89M3j09Q1J32L3k67K40N9k00o9R3P1Q3j71j13J68K65k00n4
$$ 52 -174 -12 118 -71 -28 -137 -56 76 109 -158 82 141 -59 -128 -35 36 119 -52 -165 3 268 68 14
8151A4L1q3k9l7m7J14j83m0J34p7L79l43K63j61k4L9Q1k15K80j33m4K43j17Q6
$$ 14 45 -38 -67 -104 -151 -37 -220 -260 -126 -203 176 -167 96 -65 -89 -50 31 -184 96 -37 -81 162 45 131
8175A31l7j0k18J31R7j33k06K02J49k03J74k26rK28j61j60
$$ 131 94 84 -134 -3 94 -39 -245 -43 106 -97 77 -149 -158 70 -91 -251
8191b51
$$ Imaginary data points
##PAGE= N=2
##DATA TABLE= (X++(I..I)), XYDATA
0@%%%%%%%%%%%%%%%%%%Qj6J6j6J6j6K1k9L2l3M1m8N3o1O9p8Q9j00J11j26J41j57
$$ 0 0 0 0 0 0 0 0 0 0 0 0 0 0 0 0 0 0 0 8 -8 8 -8 8 -8 13 -16 16 -17 24 -24 29 -32 37 -41 48 -52 59 -67 74 -83
40h3J74j92K14k37K62k90L21l54L88m27M71n20N74o33O98p73Q59r55J070j206
$$ -83 91 -101 113 -124 138 -152 169 -185 203 -224 247 -273 301 -332 366 -407 452 -503 567 -639
60f39J367j565J815k144K593l246M287o205J0860m1743m6994J01984L3433j9017
$$ -639 728 -837 978 -1166 1427 -1819 2468 -3737 7123 -34620 -81614 20370 53803 34786
74C4786K7733K0272l3542r8O761k5401j4476l565l5029j5808J3391r444j1872
$$ 34786 62519 82791 49249 49151 55912 30511 16035 12470 -22559 -38367 -24976 -34420 -46292
87d6292J8203L971j0007J4317K1632l743n679J4114J3126q132k486J2244K367
$$ -46292 -28089 -24118 -34125 -19808 1824 -1919 -7598 6516 19642 11510 9024 21268 23635
100B3635q830P7r99r199j281J442p731j020O268q715n612R885p545j0777J3715
$$ 23635 14805 14882 13883 4684 3403 4845 -2886 -3906 2362 -6353 -11965 -2080 -9625 -20402 -6687
115f687J798j6657J2665K0639j0100m230J7931J826r872O762J567j1002j767l438
$$ -6687 -4889 -21546 -8881 11758 1658 -2572 15359 17185 7313 14075 15642 4640 2873 -565
129e65j1348K609L946q287J259J0287m262m631J1888O283q927L909J3561k486
$$ -565 -11913 -9304 -5358 -13645 -12386 -2099 -6361 -10992 896 7179 -1748 2161 15722 13236
143A3236o118O031M96r789m622m77m782k586M35m540j209O616K22j720J0743M403
$$ 13236 7118 13149 13645 3856 -766 -1243 -6025 -8611 -8176 -12716 -13925 -7309 -7087 -8807 1936 6339
159F339p408K990Q545n013l939Q241M65q153L976M424r113m179K501n316l223
$$ 6339 -1069 1921 10466 5453 1514 9755 10220 2067 6043 10467 1354 -2825 -324 -5640 -8863
174h863M246j085k415M686K409l242K466N865l481j609O015j001m306M617L228
$$ -8863 -4617 -5702 -8117 -3431 -1022 -4264 -1798 4067 586 -1023 4992 3991 -315 4302 7530
189G530m711M09M136m270n421L368j87o818P51K436l599J438M912k261p41M095
$$ 7530 2819 3228 7364 3094 -2327 1041 854 -5964 -5213 -2777 -6376 -4938 -26 -2287 -3028 1067
205A067j839l212M891L297m178K189M434l617p74M893k862n044K965p86n252R59
$$ 1067 -772 -3984 907 4204 26 2215 6649 3032 2258 7151 4289 -755 2210 1424 -3828 -2869
221b869K202l506j96M341j619k753L619J33m328J656K762j642J006L288q2J40
$$ -2869 -667 -4173 -4369 -28 -1647 -4400 -781 -648 -4976 -3320 -558 -2200 -1194 2094 2012 2152
237B152K588j064l673L237J765n956O0N131l110l510L971J076n048m57K113k640
$$ 2152 4740 3676 3 3240 5005 -951 -891 4240 1130 -2380 1591 2667 -2381 -2838 -725 -3365
253c365j630K254r00l25L072q34j73M120p48m467K336M036l968k065O549J686
$$ -3365 -4995 -2741 -3641 -3966 -894 -1728 -1901 2219 1471 -2996 -660 3376 -592 -2657 3892 5578
269E578m428K146L951l508k101J410j657j705Jj010j163J280p44k882J318J271
$$ 5578 1150 3296 7247 3739 1638 3048 1391 -314 -313 -1323 -2486 -1206 -1950 -4832 -3514 -2243
285b243l943l47N131j148l044N447M295k407K94N122q18l797J596J152k837l78
$$ -2243 -6186 -6533 -1402 -2550 -5594 -147 4148 1741 2035 7157 6339 2542 4138 5290 2453 2075
301B075L14j022N1q53k326N00M60l557j740L353l3m584L470N454l278j483N146
$$ 2075 2389 1367 1418 565 -1761 -1261 -801 -4358 -6098 -2745 -2778 -7362 -3892 1562 -1716 -3199 1947
318A947P51l409O93L154q07j666J334J459L12J94k400N10J875l510l694L333O41
$$ 1947 2698 -711 -18 3136 2329 663 1997 3456 3768 3962 1562 2072 3947 437 -3257 76 717
335G17m707N0N179j311m420K700K597m040j015K642N74o31J013R48J438R12j038
$$ 717 -3990 -3940 1239 -72 -4492 -1792 805 -3235 -4250 -1608 -1034 -1665 -652 296 1734 2646 1608
352A608l55K165o36l892J857L364l561j578M363k83m380Q20K063k950k362K040
$$ 1608 1253 3418 2782 -1110 747 4111 550 -1028 3335 3052 -1328 -508 1555 -1395 -3757 -1717
368a717L56k034J186J160j53J132m38o52J564R0k108J046L547j031k108L506K360
$$ -1717 -1361 -3395 -2209 -1049 -1202 -70 -508 -1160 404 494 -1614 -568 2979 1948 -160 3346 5706
385E706m278j013L361j768l905N29J180j507j157J155M99m19J39q84J214J921
$$ 5706 1428 415 3776 2008 -1897 -1368 -188 -1695 -2852 -1697 -1198 -1617 -1478 -2362 -1148 773
401G73k036m36M252O01k788J784L088l021k870K054L23m092K9J512j376K13P01
$$ 773 -1263 -1699 2553 3154 366 2150 5238 2217 -653 1401 1724 -2368 -2339 -827 -2203 -1990 -1289
418a289M7J030M89j348J58K004q62j992K414J659k502N25K486k040j704J376M34
$$ -1289 -1242 -212 277 -1071 -913 1091 229 -1763 651 2310 -192 333 2819 779 -925 451 885
435H85j827K38J370p91m51J224l15j112O01p94j244L46P7j392J544J806p03q1
$$ 885 -942 -704 666 -125 -576 648 333 -779 -178 -972 -2216 -1870 -1793 -3185 -1641 165 -538 -619
453f19K513L0k019J362J726k597m70K430j092j270R71k08j519j88K00r31o2J153
$$ -619 1894 1924 -95 1267 2993 396 -74 2356 1264 -6 965 757 -762 -950 -750 -1681 -1743 -590
471e90j070k83K240j38j452J526O15j941l86J707q90j393K196L72q04J678J233
$$ -590 -1660 -1943 297 159 -1293 233 848 -1093 -1479 228 -662 -2055 141 513 -291 1387 2620
488B620j623P66J359j804j000J771r3j948M40L3j713N85J70k453k06J077j864
$$ 2620 997 1763 3122 1318 318 2089 1996 48 488 521 -1192 -607 -437 -2890 -3096 -2019 -3883
505c883k41L013K29j414K038J596j005N04K099n77j243N61P75j8M40n44k90m5
$$ -3883 -4124 -1111 -882 -2296 -258 1338 333 837 2936 2359 1116 1677 2452 2434 2874 2330 2040 1995
523A995j081j792Nnj541j454J340J147j773J12K145l63j465J545J889j135l44
$$ 1995 914 -878 -873 -878 -2419 -3873 -2533 -1386 -3159 -3047 -902 -1265 -2730 -1185 704 -431 -775
540g75K742p6q08J903O64j245L22m62j616Q98p7k493L02J822k250j525K511k82
$$ -775 1967 1891 1083 2986 3650 2405 2727 2265 649 1547 1470 -1023 -721 1101 -1149 -2674 -163 -445
558d45l375J495J441k153N61K528R8l71Q12N86m2O50k54o89J292o09k373J958
$$ -445 -3820 -2325 -884 -3037 -2476 52 150 -221 591 1177 1135 1785 1531 842 2134 1525 -848 1110
576A110J585k319p47J934j41k202l21J621n92j619K44J900m7j459P2J073j186
$$ 1110 2695 376 -371 1563 1422 -780 -1101 520 -72 -1691 -1447 453 406 -1053 -981 92 -1094
593a094j530J060J213J5q00L02K146N77j582O89K446j895j871K049O11k393l09
$$ -1094 -2624 -1564 -351 -336 -1136 -834 1312 1889 307 996 3442 1547 -324 1725 2336 -57 -366
610c66J112j031r59J128l68q26J7j238K21K114o15n70K638N6k107L99L118j679
$$ -366 746 -285 -1244 -116 -484 -1310 -1293 -2531 -2310 -196 -811 -1381 1257 1313 -794 -395 2723 1044
628A044k370K002Q02k131O03J566r64r12K12kJ70l96p46L58R99j073p83K283J106
$$ 1044 -1326 676 1478 -653 -50 1516 552 -360 -148 -150 20 -376 -1122 -764 235 -838 -1621 662 1768
647A768k453l20K704j211j731R92J864j226j095J293P55p32n81j11q8o14m84M25
$$ 1768 -685 -1005 1699 488 -1243 -251 1613 387 -708 585 1340 608 27 -84 -172 -786 -1270 -845
665h45Q33o25r32N42J440k98j351J608J372j960n99K471r4j669P14J190j199l57
$$ -845 -12 -637 -1569 -1027 413 115 -1236 372 1744 -216 -815 1656 1562 -107 607 1797 598 241
683B41N61q84l63k66o24K7J293n53m47J501o44j467R48J189j493n79J830k40q86
$$ 241 802 -82 -445 -711 -1335 -1308 -15 -568 -1015 486 -158 -1625 -677 512 -981 -1560 270 30 -856
702h56J096J222o19m6J41k89M61k96m92K33M03n03k90J57j45j500j89P19j069
$$ -856 240 1462 843 797 938 649 1110 814 322 555 958 455 165 322 177 -1323 -1512 -793 -1862
721a862o18J023R10p59m5J611j08n74Q92K32k94O69j97p4J047K92j135R9Q12q29
$$ -1862 -2480 -1457 -547 -1306 -1351 260 152 -422 470 702 408 1077 880 806 1853 2145 1010 1109 1921 1092
741A092j185L48P2j889L59R10j044J30M11l28p06P65l5m52N10J149m02K56J382
$$ 1092 -93 255 327 -1562 -1203 -293 -1337 -1207 -796 -1124 -1830 -1065 -1100 -1552 -1042 107 -295 -39 1343
760A343j47k88N60L62n16k12J04j44l11r9r1n53N80n75j159P02J43j508l22J009
$$ 1343 1196 908 1468 1830 1314 1102 1206 1062 751 652 561 8 588 13 -1146 -444 -301 -1809 -2131 -1122
780a122L43o31L09Q88n80M05P93n20K58L60j18N84M41n47J05R33k87j253k02Q52
$$ -1122 -779 -1410 -1101 -213 -793 -388 405 -115 143 503 385 969 1410 863 968 1901 1614 361 159 1011
800A011j307q67J290l69p36J99L73n86k58K23j2k44o1Q51K98J85K49L4J093Q4
$$ 1011 -296 -1163 127 -242 -978 -779 -406 -992 -1250 -1027 -1039 -1283 -1344 -493 -195 -10 239 273 1366 1450
820A450j141M93N17n87j036R22P44j397k14J054k50j470J92M93n09j58j75L67
$$ 1450 309 802 1319 732 -304 618 1362 -35 -249 805 555 -915 -723 -230 -739 -897 -1072 -705
838g05N93n36R9Q92K63j037m67J757j21j545R79J236j162n96J002N65j268l35
$$ -705 -112 -648 -549 343 606 -431 -898 859 738 -807 172 1408 246 -350 652 1217 -51 -386
856c86M27J16j96n10L9P68K3q75N93Q64j054p68Q27M35q55l46J630M4j325L11
$$ -386 41 157 -39 -549 -510 258 281 -594 -1 863 -191 -959 -132 303 -552 -898 732 776 -549 -238
876b38J055p84o30K92O27m73k65K11O28l37q4kO49n43j050J030L53j202J4J364
$$ -238 817 33 -597 -305 322 -151 -416 -205 423 86 2 0 649 106 -944 86 439 -763 -749 615
896F15M39j157P5R65l33j052N44L26k32o02k06Q18Q1j191j9Q43n32j025N13J376
$$ 615 1054 -103 -28 937 604 -448 96 422 190 -412 -618 200 281 -910 -929 -86 -618 -1643 -1130 246
916B46m42j053J576O87j120K57O37r3l05m27O34J19j71k09J83M02p71q69N90L30
$$ 246 -196 -1249 327 1014 -106 151 788 695 390 -37 597 716 545 336 519 921 150 -719 -129 201
936B01j192k23P15l6p86M26P45l55o08O87O41m60K06M41L56M2lL89J66k93j72
$$ 201 -991 -1214 -499 -535 -1321 -895 -150 -505 -1113 -426 215 -245 -39 402 758 800 797 1186 1352 1059 887
957H87k83J92k16j115O83J98j078N2O21j19j014N38J61p51k52J131j40J27J78
$$ 887 604 796 580 -535 148 346 -732 -680 -59 -178 -1192 -654 -493 -1244 -1496 -365 -505 -378 -200
976b00K70M91L22o84K44P68o24o3N23K77q87K05L53k17p60J10j79l86k1m89J04
$$ -200 70 561 883 199 443 1211 587 524 1047 1324 437 642 995 778 18 128 -51 -437 -458 -947 -843
997h43J70j98k78M09J67l13L50J89OJ05M06L59L19m1J68N3j02j62L61j66p35J27
$$ -843 -673 -871 -1149 -740 -573 -886 -536 -347 -341 -236 170 529 848 807 975 1028 926 764 1125 959 224 351
1019C51j5l77L04j15q26N4J4k68l23M11K27m34M70J83k39P30N50r26P02P3L6m3
$$ 351 336 -41 263 148 -678 -624 -610 -878 -1201 -790 -563 -997 -527 -344 -583 147 697 -229 473 546 582 539
1041E39L93P4o22J87O09p52k72O76r49r3l52N6j02M02n24J25L09J23k59L54J91
$$ 539 932 1006 384 571 1180 428 156 832 -117 -210 -562 -506 -608 -206 -730 -605 -296 -173 -432 -78 113
1062A13o08l02J012km2N56K2m19l22K15L59n54l75N40K48m22N1K2J36j22p20M64
$$ 113 -495 -797 215 213 171 727 749 330 8 223 582 28 -347 193 441 19 70 92 228 106 -614 -150
1084a50J90j56o26M11O38o47j18J128m93q87k9P24k3m64O19K72k82j72J32K44
$$ -150 40 -116 -742 -331 307 -340 -458 670 177 -710 -739 -15 -38 -502 117 389 107 -65 67 311
1104C11K05l83m40P33o84l79N57P76m53p95P76L38p63k12O32l09m11M71K64nk25
$$ 311 516 133 -307 426 -258 -637 -80 696 243 -552 224 562 -201 -413 219 -90 -501 -30 234 229 4
1125Dk46J33N78p66j07L64J89p04J45J042m77n80N44K37o93J96J17N06j50k23
$$ 4 -242 -109 469 -297 -404 -40 149 -555 -410 632 155 -425 119 356 -337 -141 -24 482 332 109
1145A09K86K30m45J00M34k13n74O1K18k41l43r8K98l2n24k21R60n61n06N01P86
$$ 109 395 625 180 280 714 501 -73 -12 206 -35 -378 -476 -178 -210 -734 -955 5 -556 -1062 -561 225
1166B25o19j53J150J25l08j38M44J0k7m79J35L58j76r76P75N71j273m14O57k27
$$ 225 -394 -547 603 728 420 282 726 736 709 230 365 723 547 -429 346 917 -356 -770 -113 -340
1186c40p35J57N51m22j81N19J52J65K4j38N25L84m35K66O43k68m84N76L30o17
$$ -340 -1075 -918 -367 -789 -970 -451 -299 -134 -110 -248 277 661 226 492 1135 867 383 959 1289 672
1206F72m60K79l29n05j69O54k96m15n9K58R2l30J01J00o0l6k17M50N19n61M90
$$ 672 212 491 162 -343 -512 142 -154 -569 -628 -370 -278 -608 -507 -407 -467 -503 -720 -270 249 -312 178
1227A78N32j31n37N05M17m79l93P61qo26l3K88m12k48q4k21%m6k36k26L41J62
$$ 178 710 579 42 547 964 485 92 853 845 219 186 474 62 -186 -270 -491 -491 -537 -773 -999 -658 -496
1249d96k52Q60Lo50K42O11m10J50J20O30n45j40N80J1k24K15m28P9k15l3R0k74
$$ -496 -748 112 115 -535 -293 318 -92 58 178 808 263 123 703 714 490 705 277 356 141 108 198 -76
1271g6M3k02r6j42j1OK56n42J57J77J68j08L79k8L42k71J84K86k41J69M8j90J39
$$ -76 -33 -235 -331 -473 -484 -478 -222 -764 -607 -430 -262 -370 9 -19 323 52 236 522 281 450 498 308 447
1294D47j51j95J62Ro32L35J33k43l56K45R7j69J25J22j09k0q0m1L06N6Lj87R6
$$ 447 296 101 263 272 -360 -25 108 -135 -491 -246 -149 -318 -193 -71 -180 -200 -280 -321 -15 41 44 -143 -47
1317d7L68q4mj8j6q9N2J99o71L72K48k88k28K68K7k89N3L11n85K3N44l49l4M46
$$ -47 321 237 233 215 199 110 162 361 -310 62 310 22 -206 62 89 -200 -147 164 -421 -398 146 -203 -237 209
1341B09P4j15m95K98P8q7k39R5K4K13k95J22K39J18n79J53O99m48l33O03K62l39
$$ 209 283 168 -327 -29 49 -38 -277 -182 -158 55 -240 -118 121 239 -340 -187 512 64 -269 334 596 257
1363B57j67L97k85l7j19m5K33k93k53q0M55k19m20K65M55n51l49N31Q9m73L39
$$ 257 90 487 202 165 46 1 234 -59 -312 -392 63 -156 -576 -311 144 -407 -756 -225 -136 -609 -270
1384b70N02j51j2J02K54k00P1N8q7J19j8k40M21o88M1J28P5n21k89N78j16n08
$$ -270 232 81 69 171 425 225 296 354 267 386 368 128 549 -139 -98 30 105 -416 -705 -127 -243 -751
1406g51K09L22R8l74L86J68j93k25K15K09J23J18j6M93q8n32K14O42m35q40O73
$$ -751 -542 -220 -122 -496 -110 58 -135 -360 -145 64 187 305 289 782 694 162 376 1018 583 -257 416
1427D16K12o39l64P04K6o32l24O49l18m90L64K67n5k49R6L72j64M27m28L37J14
$$ 416 628 -11 -375 329 355 -277 -601 48 -270 -760 -396 -129 -184 -433 -337 35 -129 298 -130 207 321
1448C21k04N5O85k39n58N35K49l22k80L90l20k09j89Q5k07j94l4q6K91l72k65
$$ 321 117 172 857 618 60 595 844 522 242 632 312 103 -86 -1 -208 -402 -436 -522 -231 -603 -868
1469h68M62L0M2j05O11j36j55L15M58j25j7K00j7k03r0m03J91J4j88J11m8m67
$$ -868 -406 -376 -334 -439 172 36 -119 196 654 529 512 712 695 492 402 -1 190 204 16 127 79 -388
1491c88q0K70j01k78P4J54J26j21J1M36j4j31m1N62j69l86M05j16R2r2j62L38
$$ -388 -468 -198 -299 -577 -503 -349 -223 -344 -333 103 89 -42 -83 479 310 -76 329 213 305 213 51 389
1513C89J38m61r5J29K24p04O0M08o89P2M78m0J02j65L08l71m5K48j06J87j04Q
$$ 389 527 66 -29 100 324 -380 -320 88 -601 -529 -51 -91 11 -154 154 -217 -262 -14 -120 67 -37 -29
1535b9j72L99j34j63J78K74o17O30J4j71j00L60j49j69j55jQ9l29J66p4m4j56
$$ -29 -201 198 64 -99 79 353 -264 366 380 209 109 469 320 151 -4 -5 84 -245 -79 -153 -197 -353
1557c53k3M9K30j58j03P2p9M83q2P7L6M1j37J34k5m99J68K93k24r1M18l51J57
$$ -353 -376 -327 -97 -255 -358 -286 -365 118 36 113 149 190 53 187 162 -337 -169 124 -100 -191 227 -124 33
1580C3K54J09m61L00k99QJ44L1k61J69jj48J0pm9k72M98j60j80K13n3q3m1K77
$$ 33 287 396 -65 235 -64 -56 88 119 -142 27 26 -122 -112 -119 -168 -440 58 -102 -282 -69 -122 -205 -246 31
1604C1j19j35L99J95k93k4J21J74J60j07j21K76k81l09K96l0K2p01K92R5l75J00
$$ 31 -88 -223 176 371 78 54 175 349 509 402 281 557 276 -33 263 233 255 -446 -154 -59 -434 -334
1626c34K27l44j51K97k08N11k73K53L12O7j61K1J03J81k77K2J12j39L8j71J78
$$ -334 -107 -451 -602 -305 -513 -2 -275 -22 290 357 196 217 320 501 224 246 358 219 257 86 264
1647B64j29j39o1K49m05k85L61l91m7K02k9J80j81K22M4R2J65k28K88N6j03O0
$$ 264 135 -4 -65 184 -221 -506 -145 -536 -583 -381 -410 -230 -411 -189 -145 -53 112 -116 172 228 125 185
1669A85L75k64o1L8K20k71j76J54j83l75j69M42%lm31R3L9j98l94P74j0o7j60
$$ 185 560 296 235 273 493 222 46 200 17 -358 -527 -85 -85 -88 -519 -426 -387 -585 -979 -205 -215 -282 -442
1692d42M56J64l78J53M91k4p4Q9n3j47J19k63L42n9n71R1J47N7m94k3J02p0On6
$$ -442 14 178 -200 -47 444 420 346 435 382 235 354 91 433 374 -197 -106 41 98 -396 -419 -317 -387 -381 -437
1716d37L22k05k73L31K69l09J38L52j14k63N47O7r1KM3k21O9K4j01M2K6k74QM04
$$ -437 -115 -320 -593 -262 7 -302 -164 188 74 -189 358 425 334 336 379 158 227 251 150 192 218 -56 -48 356
1740C56m85j77k2L37k85l77N75N3k68m8J73R5k15l4R1L47k22J54M40j01k79N1
$$ 356 -129 -306 -328 9 -276 -653 -78 -25 -293 -341 -168 -73 -288 -322 -231 116 -106 48 488 387 108 159
1762A59M09n50J01P5L06o06K05k15L48j68l15K03L7k9l49l8L47k39J50K47r5j
$$ 159 568 18 119 194 500 -106 99 -116 232 64 -251 -48 -11 -40 -389 -427 -80 -319 -169 78 -17 -18
1784a8K7J02Q7K0k58L61k5k67J50r5Q4r0q5j15J89J6R0j9j25k10J13J34o1K4L7
$$ -18 9 111 198 218 -40 321 296 29 179 84 168 78 -7 -122 67 83 173 154 29 -181 -68 66 5 29 66
1809F6K42m74l1L48p8l94K62j18j63K25k62K43L23l00L46q0R7j02k6L97k68j27
$$ 66 308 -166 -197 151 73 -321 -59 -177 -340 -115 -377 -134 189 -111 235 155 252 150 124 521 253 126
1831A26J15K9O1j28j74K30n64M69n1m7n42J05K9K05j22L3%k36M40l00L02P6P7
$$ 126 241 270 331 203 29 259 -305 164 113 66 -476 -371 -342 -137 -259 -226 -226 -462 -22 -322 -20 56 133
1854A33J10%j40J50J2j11n4N3L7k13k6PK86o30K48K58l02J75o1MN5Mr9j99K58
$$ 133 243 243 103 253 265 154 100 153 190 -23 -49 -42 244 -386 -138 120 -182 -7 -68 -64 -9 -5 -104 -303 -45
1879d5m5k37J47j59J61J37mO1J87J23r5rj03M46k31l07J40r2q3l2N9k10q4l55
$$ -45 -90 -327 -180 -339 -178 -41 -45 16 203 326 231 222 119 565 334 27 167 75 -8 -40 19 -191 -275 -630
1903f30K14r2L07k88N70m34R7p6O45K16l21o0M1J64k11K11k10K90n98M34j73q0
$$ -630 -416 -508 -201 -489 81 -353 -256 -332 313 529 208 148 189 353 142 353 143 433 -165 269 96 16
1925A6j1K27j25j34l33Q3N6o3k83j0K85k23K10qL04k21J37K55J7J50k64L74p4
$$ 16 5 232 107 -27 -360 -277 -221 -284 -567 -577 -292 -515 -305 -313 -9 -230 -93 162 179 329 65 439 365
1948C65K3k09M16l98p8p1k04O0Q5j67L80m26j18P7L41k04k32K45J62o1l51N4L91
$$ 365 388 179 595 197 119 48 -156 -96 -11 -178 202 -224 -342 -265 76 -128 -360 -115 47 -14 -365 -311 80
1971H0k63%K82J14k46O2R6J24k24OL19j72J1o2Jk49k8J64K54k87l15M79j49k51
$$ 80 -183 -183 99 213 -33 29 125 249 25 31 350 178 189 127 128 -121 -149 15 269 -18 -333 146 -3 -254
1995b54K04j47K04k2r0K59j11k94j4J66J86j63K75m4J11m22N18J0j95k03J28j45
$$ -254 -50 -197 7 -15 -105 154 43 -251 -265 -99 87 -76 199 155 266 -156 362 372 177 -26 102 -43
2017d3m6Q9q0J26L1L3o8q4J41l41K96J95l25j36L03j95J18j30J6K76l07J82R0
$$ -43 -89 0 -80 46 77 110 42 -42 99 -242 54 249 -76 -212 91 -104 14 -116 -100 176 -131 51 141
2040A41p0j86O9M46m46J58MK03k36j09K89k48J18J21k05q3j0o7J43j3l22J77L14
$$ 141 71 -115 -46 400 -46 112 116 319 83 -26 263 15 133 254 49 -34 -44 -111 32 19 -303 -126 188
2063A88l76j18J36M9l06K38J99j23J26K13k1K37l41k09M40K4k42n4J65J06k07
$$ 188 -188 -306 -170 -121 -427 -189 10 -113 13 226 205 442 101 -108 332 356 114 60 225 331 124
2084A24M2k12j83m9K86p8j11J05j59j02J94J33k59M03j0n01K07K54k79L82k35
$$ 124 166 -46 -229 -278 8 -70 -181 -76 -235 -337 -143 -10 -269 134 124 -377 -170 84 -195 187 -48
2105d8K76J5RK52m42K54O3k56PP1q3J27l00Q8l07L3l39M99L0k94Qj13J89r4L41
$$ -48 228 243 252 504 62 316 379 123 130 201 118 245 -55 33 -274 -241 -580 -81 -51 -345 -337 -450 -261 -355 -14
2130a4o5r7K61J23%k37L31k78L51J56l24n6P2k16J16j79J85j93K23l33j19q7J62
$$ -14 -79 -176 85 208 208 -29 302 24 375 531 207 151 223 7 123 -56 129 -64 159 -174 -293 -380 -218
2153b18j48J98J53l90M42n3l8L15k6m4m7N9L16m23K73k89J17j54J12k27j8K87
$$ -218 -366 -168 -15 -405 37 -16 -54 261 235 191 144 203 519 96 369 80 197 43 155 -72 -90 197
2175A97m07J91rK4l0Q0j40j90K32k3j6J6m1L3O6j10K32q2J12m5L3p0P5J77j81
$$ 197 -210 -19 -28 -4 -34 46 -94 -284 -52 -75 -91 -75 -116 -83 -17 -127 105 23 135 90 123 53 128 305 124
2200A24J53l39m5K56P1Rk65l0n9K01m28L64j80Ml96M46J10o7J39J05l56K59q1
$$ 124 277 -62 -107 149 220 229 -36 -66 -125 76 -352 12 -168 -164 -560 -114 -4 -71 68 173 -183 76 -5
2223eR6K07m99K05K67J24k04p7q2K9J3q1J26j47n8R8r1k17J96qK32k55JK34k72
$$ -5 91 298 -201 4 271 395 191 114 32 61 74 -7 119 -28 -86 12 -79 -296 -100 -108 124 -131 -130 104 -168
2248a68P0l5lJ30k87J29m9K25P4k59K44J81k45M2l6K02l89L52j20J53k52m2J50
$$ -168 -98 -133 -136 -6 -293 -164 -213 12 86 -173 71 252 7 49 13 215 -174 178 58 211 -41 -83 67
2271F7l07L3K34J6k46o8L82k76N7j68J30P9j8j79K53q8p0o4K36Q3k23L23n3Lq
$$ 67 -240 -207 27 43 -203 -271 111 -165 -108 -276 -146 -67 -85 -264 -11 -99 -169 -233 3 86 -137 186 133 136 128
2296A28J92k54Q3j44J28R6j24m3j00j52J80l88L23p1j40J57J69L3j97k60L76P0
$$ 128 320 66 149 5 133 229 105 62 -38 -190 -10 -398 -75 -146 -286 -129 40 73 -124 -384 -8 62
2318F2j55K83j17j16J23O1J25k26J26m6L7K2k43J44N7k00k8R3j57oo4K09n7k03
$$ 62 -93 190 73 -43 80 141 266 40 166 120 157 179 -64 80 137 -63 -91 2 -155 -161 -225 -16 -73 -276
2342b76PK80j06j46L64Jo4j50LJ27K49k47K09j06P5r2j21M99m39j53M8j44p1K85
$$ -276 -269 11 -95 -241 123 124 60 -90 -87 40 289 42 251 145 220 128 7 506 67 -86 -38 -182 -253 32
2366C2j50k01K84m53J16L83j41Q3m17L82n8n7M68k45Q3l1K9K9L91l03n1Q2l3p1
$$ 32 -118 -319 -35 -488 -372 11 -130 -47 -464 -82 -140 -197 271 26 109 78 107 136 527 224 173 255 222 151
2390A51Q3j76J00k80J66k36J34M4q5j2J49J23l29NL50k84m3R0j5N6J89o9J18m47
$$ 151 234 58 158 -122 44 -192 -58 -14 -99 -111 38 161 -168 -163 187 -97 -140 -50 -65 -9 180 111 229 -218
2414b18K99N5r0M7O7q2j06j85K08K06k61K0P9j68P7k80L53q1j03k11K43K4j55
$$ -218 81 136 46 93 160 78 -28 -213 -5 201 -60 -40 39 -129 -52 -332 21 -60 -163 -374 -131 -107 -262
2437b62K68k7j10P0rJ14J94J8q2K64j11j80l10Q8r1KoJ07Q8j19K98l59R5K3M5
$$ -262 6 -21 -131 -61 -70 44 238 256 174 438 327 147 -163 -75 -166 -164 -170 -63 25 -94 204 -155 -60 -37 8
2462Hj35Q3k09K91j17K1j91M5M90k83j4J86j18J41k99Q7l5K4mK70k32o6K78k7
$$ 8 -127 -44 -253 38 -79 -58 -249 -204 286 3 -11 175 57 198 -101 -14 -49 -25 -29 241 9 -57 221 194
2486A94k17j3K04j11K93o17K12j10J72k66J3L17k02K5q6R1j76N4m7M39j98Q9l9
$$ 194 -23 -36 168 57 350 -267 -55 -165 7 -259 -246 71 -131 -106 -192 -101 -277 -223 -270 169 -29 60 21
2509B1J63k01Q9Q4O0j61n6J5O8N4k92M5K66n21K99J02J7l50J42N1j49K31Oo5j52
$$ 21 184 -17 72 156 216 55 -1 14 82 136 -156 -111 155 -366 -67 35 52 -298 -156 -105 -254 -23 -17 -82 -234
2534b34j26M70j61R0J84k58J86j54j1QK27M3l06M5np9Q2k61K06M93m44p5K16j87
$$ -234 -360 110 -51 39 223 -35 151 -3 -14 -6 221 264 -42 3 -2 -81 1 -260 -54 439 -5 -80 136 -51
2558e1Q4Nl15K37j05J64l26J90q3K14j43J26K96o4Ql0k71J57j9M1J14K1l3j46
$$ -51 33 38 -277 -40 -145 19 -307 -117 -200 14 -129 -3 293 229 237 207 -64 93 74 115 229 250 217 71
2582G1Mpl27J48J87l45k0J21j48O5j7O7K54R9j83j42K00NQ4q8J36P0j33K47j41
$$ 71 75 68 -259 -111 76 -269 -289 -168 -316 -251 -268 -201 53 152 -31 -173 27 32 116 28 164 234 101 348 207
2607B07j19jJ18l55JM39j00p5j64J20j98N2l2J2J81k82J29j0J29Qr5k54K80j7
$$ 207 88 87 205 -150 -149 290 190 115 -49 71 -127 -75 -107 -95 86 -196 -67 -77 52 60 -35 -289 -9 -26
2631b6M07k78o9K39j59K7mj64L06l11l8J85K16j45l79J29J39j16O7J24k00k42
$$ -26 381 103 34 273 114 141 137 -27 279 -32 -70 115 331 186 -193 -64 75 -41 26 150 -50 -292
2653b92M59k71K21j54P0j81J53Pr6J66m7K02q3j55%n2K84P2m82J29k8J49o0n4
$$ -292 167 -104 117 -37 33 -148 5 12 -84 82 35 237 154 -1 -1 -53 231 303 -179 -50 -78 71 11 -43
2677d3k48L49k34m9K20l04L96ml82K08MJ04R1j6j6k76K51J9j07K84k99n4J52j6
$$ -43 -291 58 -176 -225 -5 -309 87 83 -299 -91 -87 17 108 92 76 -200 51 70 -37 247 -52 -106 46 30
2701C0L3k86J34J84p5mK1k2K15n72J72K05Q3j08j90J7k5K82j01j39M6P9k31L62
$$ 30 63 -223 -89 95 20 16 37 15 230 -342 -170 35 118 10 -180 -163 -188 94 -7 -146 -100 -21 -252 110
2725A10j73J99J92k17M1k01K74o0k25NJ18R5k78J07M9j31j43J45N5N9k35n7L48
$$ 110 -63 136 328 111 152 -49 225 165 -60 -55 63 158 -120 -13 36 -95 -238 -93 -38 21 -214 -271 77
2748G7l6q1j46J10k1o8P3P1O0l5K2J65j44P0J03l75L02j35Q9M8j85N1k41M37j77
$$ 77 41 -40 -186 -76 -97 -165 -92 -21 39 4 26 191 47 117 220 -155 147 12 101 149 -36 15 -226 211 34
2773C4m7M5M9l34L4R4j8k05M57l82K84k43K66M7q9l5J39l5J03j13l4K86k53j47
$$ 34 -13 32 81 -253 -219 -125 -143 -348 109 -273 11 -232 34 81 -8 -43 96 61 164 51 17 303 50 -97
2797i7o8L45M1K5j27j92j01M1K26j78L27k40o1o6j58L20r2l0J71j05J32k07K19
$$ -97 -165 180 221 246 119 -73 -174 -133 93 -85 242 2 -59 -125 -283 37 -55 -85 86 -19 113 -94 125
2820A25J3k17L49k92L05r9l19M07j91q9J3k7P2k33R0J02J46l35K2j5L2N1j37J56
$$ 125 138 -79 270 -22 283 184 -135 272 81 -8 5 -22 50 -183 -93 9 155 -180 -158 -173 -141 -90 -227 -71
2844g1k5n3J44l5L88J49m74J62k10k00M99j94J55l82k2L13R4k05j00q0J98m10
$$ -71 -96 -149 -5 -40 348 497 23 185 -25 -225 274 80 235 -147 -169 144 238 33 -67 -147 51 -359
2866c59J01M08m85J24M3R7J1j58R7K08j44J46j30m5l5Q5J88q2j4Q1q5j26P6J47
$$ -359 -258 150 -335 -211 -168 -71 -60 -218 -121 87 -57 89 -41 -86 -121 -36 152 70 56 137 52 -74 2 149
2890A49j71L48o2j42l42Q4J55k39N3K2m3J2o1K84KK7%k31Q7K9j12J24J62j40J43
$$ 149 -22 326 264 122 -220 -136 19 -220 -167 -145 -188 -176 -237 47 49 76 76 -155 -68 -39 -151 -27 135 -5 138
2915A38j50j07Q7P0n7O1J06q4j31J81j32j9J53k96L23p3j95l1J13J32j53j42J08
$$ 138 -12 -119 -32 38 -19 42 148 64 -67 114 -18 -37 116 -180 143 70 -125 -156 -43 89 -64 -206 -98
2938i8K0j62J45R5N0J95k34Q4k7k38L31L0j82M1K3Lk60J5K38J10n8k67P0j34K93
$$ -98 -78 -240 -95 0 50 245 11 95 68 -170 161 191 9 50 73 76 -184 -169 69 179 121 -146 -76 -210 83
2963H3j19jj31J52j49k5K08%M5n4n6j86J81K13k06J90J99l65L4J4J14j66J48q1
$$ 83 -36 -37 -168 -16 -165 -190 18 18 63 9 -47 -233 -52 161 -45 145 344 -21 13 27 141 -25 123 42
2987D2n4Q5q3k3K71m03J1K15j11n9m9O6M4LJ7L24k58R5q4k53L30k95M98k29k38
$$ 42 -12 73 -10 -33 238 -165 -154 61 -50 -109 -158 -92 -48 -45 -28 296 38 133 49 -204 126 -169 329 100 -138
3012a38L40k4R0L23o43lK2l5q4K57k70O4K27j37Jk72J17L02j11L2p8J88l39Q3
$$ -138 202 178 268 591 -52 -55 -33 -68 -152 105 -165 -101 126 -11 -10 -282 -165 137 26 58 -20 168 -171 -88
3036h8J62K2J67j6o4J58k36%K9j38k1R2j41oN5k7J13j94L1j79K77k27L54j62n7
$$ -88 74 96 263 247 183 341 105 105 134 -4 -25 67 -74 -80 -25 -52 61 -133 -102 -281 -4 -231 123 -39 -96
3061i6R8L3l5J11j36J27Q4j35j2j70M92m02J38N1O3j17r5J92P6p9k48L41o7j96
$$ -96 2 35 0 111 -25 102 186 51 39 -131 361 -41 97 148 211 94 -1 191 267 188 -60 281 214 18
3085A8K4j07J30q2k5J89k6k12Q9l7J37k13J35N0K9j82j1K97N7j78QN2l53K35J66
$$ 18 42 -65 65 -17 -42 147 121 -91 -2 -39 98 -115 20 70 99 -83 -94 203 260 82 90 142 -211 24 190
3110A90K7m0k72J12k8p4M2j07Q3q1l7J66J93j14j10j35J20L1K39l02K03j43Q7
$$ 190 217 177 -95 17 -11 -85 -43 -150 -67 -148 -185 -19 174 60 -50 -185 -65 -34 205 -97 106 -37 50
3133E0L4M0k5l19M66k50J46k10K01r9j51K00j0k01n0J21j56J89j45r6M01k09k3
$$ 50 84 124 99 -220 246 -4 142 -68 133 34 -117 83 73 -128 -178 -57 -213 -24 -169 -265 136 -73 -96
3156i6K9Q4L9n2K49k53K0q2J40Nl9K21l08qP0P3R6j41k0Q6J7k82L04l18J61j57
$$ -96 -67 17 56 4 253 0 20 -62 78 83 44 265 -43 -51 19 92 188 47 27 113 130 -152 152 -166 -5 -162
3182a62K15q2j31Q6J4j14M4K84l91K52J65j09J09m62K21m9K39l7LJ12l15j8O8
$$ -162 53 -29 -160 -74 -60 -174 -130 154 -237 15 180 71 180 -282 -61 -110 129 92 95 207 -108 -126 -58
3205e8J83k00K7k2JK15l27M8O4j16j52N62m09q8L00o0L9j64K3J14L3K4J62Rj8
$$ -58 125 -75 -48 -70 -69 146 -181 -133 -69 -185 -337 225 -184 -272 28 -32 7 -157 -134 -20 13 37 199 208 190
3230A90k88Q5n7O5J18j6j37J83k26l6J14K65p81O32m9K5j32O1p7L6J64j98J39
$$ 190 -98 -13 -70 -5 113 97 -40 143 -83 -119 -5 260 -521 111 62 87 -45 16 -61 -25 139 -59 80
3253H0n8J74l5k19J11Rj49J46j04L38k26M7k23O5K72j79j12q4l2J00J47j63k1
$$ 80 22 196 161 -58 53 62 -87 59 -45 293 67 114 -109 -44 228 49 -63 -147 -179 -79 68 -95 -116
3276a16J31k35M0j1M7P9K3j48L30j8k32K41J6k68j4p9M00q7jk58K41J07k32J21
$$ -116 15 -220 -180 -191 -144 -65 -42 -190 140 122 -110 131 147 -121 -135 -214 186 99 98 -160 81 188 -44 77
3300G7N9q4P5pm66J67P2J3j3M9R7l0K6J29j89J10q0j13MJ81J01n1n8k47M06k67
$$ 77 136 52 127 120 -346 -179 -107 -94 -107 -58 39 9 35 164 -25 85 5 -108 -104 77 178 127 69 -178 228 -39
3326c9J5O5k5L5jj6N5P8j66k03J51j43k4J00j01P2J23J12k10M09k55J3N6q3R0
$$ -39 -24 41 16 51 50 34 89 167 1 -202 -51 -194 -218 -118 -219 -147 -24 88 -122 287 32 45 101 18 108
3351A08j06K04k18J47J96n27J59P0L9Qk5j23P8LJ22o9M0l92J5J68L67m34K16o9
$$ 108 2 206 -12 135 331 -196 -37 33 72 80 55 -68 10 13 135 66 106 -286 -271 -103 264 -170 46 -23
3375b3Rj23O6P7k09L25j74j65N17j04k28qm5K4o4J89lk37m4M33l55L17l20K94
$$ -23 -14 -137 -71 6 -203 122 -52 -217 300 196 -32 -40 -85 -61 -125 64 61 -176 -220 213 -142 175 -145 149
3399A49j94r6J23k9kR4k1j19P0j53J86j60J63q1LJK59l85nL38p6K71m42m1K10
$$ 149 -45 -141 -18 -47 -49 45 24 -95 -25 -178 8 -152 11 -70 -67 -66 193 -192 -197 141 65 336 -106 -147 63
3424F3m6N9N1j71m5K72M0k63j93J50J03N3K37m46K85m2k45K87k01Q6O9r4j87K07
$$ 63 17 76 127 -44 -89 183 223 -40 -233 -83 20 73 310 -136 149 107 -138 149 -52 34 103 9 -178 29
3448B9nk70L27J9n8r5O1M2k01J92L9k47J29j4n8j18M9O4N1J44k04J67p4j39K10
$$ 29 24 -246 81 100 42 -53 8 50 -151 41 80 -167 -38 -52 -110 -228 -179 -115 -64 80 -124 43 -31 -170 40
3473D0Q8J10j15k75J84k2J64j5j28l1p3qO3j12J80k3j41J26j09l5N0J04j45P2
$$ 40 128 238 123 -152 32 10 174 159 31 0 -73 -81 -18 -130 50 27 -114 12 -97 -132 -82 22 -123 -51
3497e1j16K69k47J36J3j5J02O6k38J32r7O8K23L6m32L28l9o0j36K38j79J36m5
$$ -51 -167 102 -145 -9 4 -11 91 157 -81 51 -46 22 245 281 -151 177 138 78 -58 180 1 137 92
3520I2pl8P1j17q4N3p3J9P3j09J41j58J83J63p3j48J32k40J82M6n9j18J42N1M4
$$ 92 85 47 118 1 -83 -30 -103 -84 -11 -120 21 -137 46 209 136 -12 120 -120 62 108 49 -69 73 124 168
3545A68j61R5l01Q6O8J53j01j69K99m36J33L65m9r6l0j74J49Qk63M41K9l0k7J46
$$ 168 7 102 -199 -113 -45 108 7 -162 137 -299 -166 199 150 54 24 -150 -1 7 -256 185 214 184 157 303
3569C03l85K3n5O3J93o5J92m08l7O40n78J65k81K53j98J30Q2M0m8k3K4J09l15
$$ 303 -82 -59 -114 -51 142 77 269 -139 -176 464 -114 51 -230 23 -175 -45 37 77 29 6 30 139 -176
3592a76K44l14J45J07k38M00k09J44j68N2J10r0K13k40Jj27J63J86j45J01j65
$$ -176 68 -246 -101 6 -232 168 -41 103 -65 -13 97 7 220 -20 -19 -146 17 203 58 159 -6
3613fo8l2L32l95J46j77K86j67o6J27J19l61K30L3Q2J33j58j5r0N7J32K7l51J62
$$ -6 -74 -106 226 -169 -23 -200 86 -81 -147 -20 99 -262 -32 1 83 216 58 43 -47 10 142 169 -182 -20
3637b0R7K0k62K52Jj67J9m1j42J15N2MJ90l6n7Q3k48O0K88k51J96j13o6R5J89
$$ -20 77 97 -165 87 88 -79 -60 -101 -243 -128 -76 -72 118 82 25 108 -140 -80 208 -43 153 40 -26 69 258
3662B58k35J04l24K89Q8J2m4J62k18O6k80kL80k95Q2k96P1K15j27q0L34j58N3
$$ 258 23 127 -197 92 180 192 148 310 92 158 -122 -124 256 -39 43 -253 -182 33 -94 -174 160 2 55
3685E5K3r1k56K20J80k26J95j75J09J34k11n8R1k7r1R6l6K6J48N6k52K17j45R4
$$ 55 78 -13 -269 -49 131 -95 100 -75 34 168 -43 -101 -10 -37 -128 -32 -68 -42 106 162 -90 127 -18 76
3709G6r5p3Q8j3KR3P6j60JL36l20R6j36k0J07K6j35J6J29k8J27j12j1n4K12q9
$$ 76 -19 -92 -4 -17 -15 78 154 -6 -5 331 11 107 -29 -49 58 84 -51 -35 94 66 193 81 70 16 228 139
3735A39l8j77J36J19l88J85M7j26J09R6j74K13k54L2o0K00j94K15j78J42M6L44
$$ 139 101 -76 60 179 -209 -24 23 -103 6 102 -72 141 -113 -81 -141 59 -135 80 -98 44 90 434
3757D34l90k20N01o5j63J3j19j2J35k42J65K5m13M36j37K3J31j00n0j07J68j85
$$ 434 44 -176 325 260 97 110 -9 -21 114 -128 37 62 -351 85 -52 -29 102 2 -48 -155 13 -172
3779a72K62O8p8k43p5J98J18j23p4L91k64R0j28n3J76j5j15J20l44J92m1P1j15
$$ -172 90 158 80 -163 -238 -40 78 -45 -119 272 8 98 -30 -83 93 78 -37 83 -261 -69 -110 -39 -154
3802a54J70r2p1K8J25K9l6p4N0k32M41r6p9k43K78n5J78q3k9N5p9L5j25L82m26
$$ -154 16 -76 -147 -119 6 35 -1 -75 -25 -257 184 88 9 -234 44 -11 167 84 55 110 31 66 -59 323 -103
3827a03K10j46J84n7j5k46J63R4k4j28q8m2j7J49k27M00r8J50l0J00j38j7O6j36
$$ -103 107 -39 145 88 73 -173 -10 84 60 -68 -156 -198 -215 -66 -293 107 9 159 129 229 91 74 140 4
3851Dj10J41M4j69J80k88K06kR0l4m6J32o0k04R5J07j61P1j47q0K1K65j61M75
$$ 4 -106 35 79 -90 90 -198 8 6 96 62 16 148 88 -116 -21 86 -75 -4 -151 -231 -210 55 -106 369
3875C69l68J72k20J07M7j98J85j12J95p0l3j24j14q2L60n0j18p1K01j21k22Q0
$$ 369 1 173 -47 60 107 -91 94 -18 177 107 74 -50 -164 -246 114 64 -54 -125 76 -45 -267 -187
3897a87J72k70K39p6l3K6K47l6p2m9N0j06R7K6N0L8n7J81q0J6l11n0R3J94k64
$$ -187 -15 -285 -46 -122 -155 -129 118 82 10 -39 11 -95 2 28 78 116 59 240 160 176 -135 -185 -92 102 -162
3922a62J64J21k49K93r9J29j78j36M9j47L27l16K26m7j18J04mk27J75j15O1L45
$$ -162 2 123 -126 167 68 197 19 -117 -68 -215 112 -204 22 -25 -143 -39 -43 -270 -95 -210 -149 196
3944A96j79N2M2L0O8q5l28K91k55M42l02O1L14l58N8k88J18K0J79o0ml18K97r2
$$ 196 17 69 111 141 209 124 -204 87 -168 274 -28 33 347 -11 47 -241 -123 -103 76 16 12 -306 -9 -101
3968a01L6M9q2L01l12R4J80j58M2j95L03j16k27J17J85L2p4j1R2r6l80K43J47
$$ -101 -65 -16 -98 203 -109 -15 165 7 49 -146 157 41 -186 -69 116 148 74 63 155 59 -321 -78 69
3991F9J4N5k74k5L7k21M10j65j65L15o7j62L17P6l65P0P1j01L02N3j41m02L21
$$ 69 83 138 -136 -161 -124 -345 65 -100 -265 50 -17 -179 138 214 -151 -81 -10 -111 191 244 103 -299 22
4014B2J20m19N59m63R9R8j69M3K78j54L0k90L47q5j36J66L0R2j87Q3q0l2K59n5
$$ 22 142 -277 282 -181 -82 16 -153 -110 168 14 44 -246 101 16 -120 46 76 168 -19 64 -16 -48 211 156
4038A56k3r0N4q1k6N4K6J19m40M24k35j2J44P6r9m3j90K02P8j08O1l8l37M59l6
$$ 156 133 43 97 16 -10 44 70 189 -251 173 -62 -74 70 146 47 4 -186 16 94 -14 47 9 -328 131 95
4063I5k30J8J7J38r8K37l25K74n1n1P9J01j71R8k51l6N9K70k02k69K11qK77l29
$$ 95 -135 -117 -100 38 -60 177 -148 126 75 24 103 204 33 131 -120 -156 -97 173 -29 -298 -87 -95 182 -147
4087a47J03k3J16j40q7K25k28K29R4j2j07O3j25J35j13J98m19J18R2M01k95j21
$$ -147 -44 -67 49 -91 -178 47 -181 48 142 130 23 86 -39 96 -17 181 -238 -120 -28 373 78 -43
4109d3J7J14J26k89j3P0J03P4J9j82K34p8k00kR0k6J16k35J2O7J11Oj11l2J9J35
$$ -43 -26 88 214 -75 -88 -18 85 159 178 -4 230 152 -48 -50 40 14 130 -105 -93 -26 85 91 -20 -52 -33 102
4135A02q3J85k57j7O0j52J77j3q3R5K8K94m37O9J40o9q3N29n96N4N9k23J15J83
$$ 102 19 204 -53 -70 -10 -162 15 2 -81 14 42 336 -101 -32 108 39 -44 485 -111 -57 2 -221 -106 77
4159G7p0RK2M3q0K16j55N7j32J94j61R6l86L97j25k5M8j6j99K93q7n0O5j03J19
$$ 77 7 16 38 81 1 217 62 119 -13 181 20 116 -270 127 2 -23 25 9 -190 103 16 -34 31 -72 47
4184D7p1Q0oJ9m8l7mR7l8q1n8Q4K01l36K59q0j4j64J47J54K5J21l50J64k81K31
$$ 47 -24 56 50 69 21 -16 -20 77 39 -42 -100 -16 185 -151 108 28 14 -150 -3 151 176 297 -53 111 -170 61
$$ [...]
8191A54
##END NTUPLES=NMR FID
##END=
