##TITLE=1H_DPAH47-1
 CDCl3
 8 sc, 
 6.04.2022
##JCAMPDX= 6.0         $$ Bruker NMR JCAMP-DX V2.0
##DATA TYPE= NMR FID
##DATA CLASS= NTUPLES
##ORIGIN= UXNMR, Bruker Analytische Messtechnik GmbH
##OWNER= root
$$ XWIN-NMR		Version 3.5
$$ Wed Apr  6 11:00:07 2022 Russian Standard Time (UT+4h)  she@DPX200
##.OBSERVE FREQUENCY= 200.131346
##.OBSERVE NUCLEUS= ^1H
##.DELAY= (6, 6)
##.ACQUISITION MODE= SIMULTANEOUS
##.ACQUISITION SCHEME= undefined
##.AVERAGES= 8
##.DIGITISER RES= 18
##SPECTROMETER/DATA SYSTEM= spect
##.PULSE SEQUENCE= zg30
##.SOLVENT NAME= CDCl3
##.SHIFT REFERENCE= (INTERNAL, CDCl3, 0, 15.7039)
##AUDIT TRAIL= $$ (NUMBER, WHEN, WHO, WHERE, WHAT)
$$ ##TITLE= Audit trail, XWIN-NMR		Version 3.5
$$ ##JCAMPDX= 5.01
$$ ##ORIGIN= Bruker BioSpin GmbH
$$ ##OWNER= she
$$ F:/spectra/data/she/nmr/H-F/1/audita.txt
$$ ##AUDIT TRAIL=  $$ (NUMBER, WHEN, WHO, WHERE, WHAT)
(   1,<2022-04-06 10:59:18.82 +0400>,<she>,<DPX200>,
      <created by zg, POWCHK disabled, PULCHK disabled
       configuration hash MD5:
       00 E9 B6 7A A2 85 ED C7 34 08 36 98 17 FE 4E 26
       data hash MD5: 16K
       51 32 F6 24 F8 AE CF 76 E6 A4 AF 68 8C 6B 90 1C>)
$$ ##END=
$$ 
$$ hash MD5
$$ 49 62 3D C0 47 5F EC 3D 5A 62 70 E4 DF FD 94 05
##$RELAX= 
##$RELAX= 
##$RELAX= 
##$RELAX= 
##$RELAX= 
##$RELAX= 
$$ Bruker specific parameters
$$ --------------------------
##$DU= <F:/spectra>
##$EXPNO= 1
##$NAME= <H-F>
##$PROCNO= 1
##$TYPE= <nmr>
##$USER= <she>
##$AMP= (0..31)
100 100 100 100 100 100 100 100 100 100 100 100 100 100 100 100 100 100 
100 100 100 100 100 100 100 100 100 100 100 100 100 100 
##$AQSEQ= 0
##$AQ_mod= 1
##$AUNM= <au_zg>
##$AUTOPOS= <>
##$BF1= 200.13
##$BF2= 200.13
##$BF3= 200.13
##$BF4= 200.13
##$BF5= 200.13
##$BF6= 200.13
##$BF7= 200.13
##$BF8= 200.13
##$BYTORDA= 1
##$CFDGTYP= 0
##$CFRGTYP= 5
##$CHEMSTR= <none>
##$CNST= (0..31)
1 1 145 1 1 1 1 1 1 1 1 1 1 1 1 1 1 1 1 1 1 1 1 1 1 1 1 1 1 1 1 1 
##$CPDPRG= <>
##$CPDPRG1= <>
##$CPDPRG2= <>
##$CPDPRG3= <>
##$CPDPRG4= <mlev>
##$CPDPRG5= <mlev>
##$CPDPRG6= <mlev>
##$CPDPRG7= <mlev>
##$CPDPRG8= <mlev>
##$CPDPRGB= <>
##$CPDPRGT= <>
##$D= (0..31)
0 1.2 0 0 0 0 0 0 0 0.06 0 0.03 0 0 0 0 0.0002 0 0 0 0 0 0 0 0 0 0 0 0 
0 0 0 
##$DATE= 1649228358
##$DBL= (0..7)
120 120 120 120 120 120 120 120 
##$DBP= (0..7)
150 150 150 150 150 150 150 150 
##$DBP07= 0
##$DBPNAM0= <>
##$DBPNAM1= <>
##$DBPNAM2= <>
##$DBPNAM3= <>
##$DBPNAM4= <>
##$DBPNAM5= <>
##$DBPNAM6= <>
##$DBPNAM7= <>
##$DBPOAL= (0..7)
0.5 0.5 0.5 0.5 0.5 0.5 0.5 0.5 
##$DBPOFFS= (0..7)
0 0 0 0 0 0 0 0 
##$DE= 6
##$DECBNUC= <off>
##$DECIM= 32
##$DECNUC= <off>
##$DECSTAT= 4
##$DIGMOD= 1
##$DIGTYP= 9
##$DL= (0..7)
0 120 120 120 120 120 120 120 
##$DP= (0..7)
150 150 150 150 150 150 150 150 
##$DP07= 0
##$DPNAME0= <>
##$DPNAME1= <>
##$DPNAME2= <>
##$DPNAME3= <>
##$DPNAME4= <>
##$DPNAME5= <>
##$DPNAME6= <>
##$DPNAME7= <>
##$DPOAL= (0..7)
0.5 0.5 0.5 0.5 0.5 0.5 0.5 0.5 
##$DPOFFS= (0..7)
0 0 0 0 0 0 0 0 
##$DQDMODE= 0
##$DR= 18
##$DS= 0
##$DSLIST= <SSSSSSSSSSSSSSS>
$$ [...]
##$SUBNAM2= <"">
##$SUBNAM3= <"">
##$SUBNAM4= <"">
##$SUBNAM5= <"">
##$SUBNAM6= <"">
##$SUBNAM7= <"">
##$SUBNAM8= <"">
##$SUBNAM9= <"">
##$SW= 18.0517287032376
##$SWIBOX= (0..15)
0 0 2 0 0 0 0 0 0 0 0 0 0 0 0 0 
##$SW_h= 3612.71676300578
##$TD= 16384
##$TD0= 1
##$TE= 0
##$TE2= 300
##$TE3= 300
##$TEG= 300
##$TL= (0..7)
0 120 120 120 120 120 120 120 
##$TP= (0..7)
150 150 150 150 150 150 150 150 
##$TP07= 0
##$TPNAME0= <>
##$TPNAME1= <>
##$TPNAME2= <>
##$TPNAME3= <>
##$TPNAME4= <>
##$TPNAME5= <>
##$TPNAME6= <>
##$TPNAME7= <>
##$TPOAL= (0..7)
0.5 0.5 0.5 0.5 0.5 0.5 0.5 0.5 
##$TPOFFS= (0..7)
0 0 0 0 0 0 0 0 
##$TUNHIN= 0
##$TUNHOUT= 0
##$TUNXOUT= 0
##$USERA1= <user>
##$USERA2= <user>
##$USERA3= <user>
##$USERA4= <user>
##$USERA5= <user>
##$V9= 5
##$VALIST= <valist>
##$VCLIST= <CCCCCCCCCCCCCCC>
##$VD= 0
##$VDLIST= <DDDDDDDDDDDDDDD>
##$VPLIST= <PPPPPPPPPPPPPPP>
##$VTLIST= <TTTTTTTTTTTTTTT>
##$WBST= 1024
##$WBSW= 4
##$XGAIN= (0..3)
0 0 0 0 
##$XL= 0
##$YL= 0
##$YMAX_a= 53606
##$YMIN_a= -54673
##$ZGOPTNS= <>
##$ZL1= 120
##$ZL2= 120
##$ZL3= 120
##$ZL4= 120
##$ABSF1= 10
##$ABSF2= 0
##$ABSG= 5
##$ABSL= 3
##$ALPHA= 0
##$AQORDER= 0
##$ASSFAC= 0
##$ASSFACI= 0
##$ASSFACX= 0
##$ASSWID= 0
##$AUNMP= <proc_1d>
##$AZFE= 0.1
##$AZFW= 0.1
##$BCFW= 1
##$BC_mod= 2
##$BYTORDP= 1
##$COROFFS= 0
##$CY= 11.3945322036743
##$DATMOD= 1
##$DC= 2
##$DFILT= <>
##$DTYPP= 0
##$F1P= 2.36226072786647
##$F2P= -0.459571619588291
##$FCOR= 0.5
##$FTSIZE= 0
##$FT_mod= 4
##$GAMMA= 1
##$GB= 0.15
##$INTBC= 1
##$INTSCL= 1
##$ISEN= 128
##$LB= 0.24
##$LEV0= 0
##$LPBIN= 0
##$MAXI= 10000
##$MC2= 0
##$MEAN= 0
##$ME_mod= 0
##$MI= 1.114404
##$NCOEF= 0
##$NC_proc= 0
##$NLEV= 6
##$NOISF1= 3.799351
##$NOISF2= 2.8
##$NSP= 1
##$NTH_PI= 0
##$NZP= 0
##$OFFSET= 15.70392
##$PC= 1
##$PHC0= -17679.98
##$PHC1= 31.60078
##$PH_mod= 1
##$PKNL= yes
##$PPARMOD= 0
##$PSCAL= 0
##$PSIGN= 0
##$REVERSE= no
##$SF= 200.130013532006
##$SI= 16384
##$SIGF1= 3
##$SIGF2= 2
##$SINO= 400
##$SIOLD= 16384
##$SREGLST= <1H.CDCl3>
##$SSB= 0
##$STSI= 0
##$STSR= 0
##$SW_p= 3612.71676300578
##$SYMM= 0
##$S_DEV= 0
##$TDeff= 0
##$TDoff= 0
##$TI= <>
##$TILT= no
##$TM1= 0
##$TM2= 0
##$TOPLEV= 0
##$USERP1= <user>
##$USERP2= <user>
##$USERP3= <user>
##$USERP4= <user>
##$USERP5= <user>
##$WDW= 1
##$XDIM= 8192
##$YMAX_p= 0
##$YMIN_p= 0
$$ End of Bruker specific parameters
$$ ---------------------------------
##NTUPLES= NMR FID
##VAR_NAME=  TIME,          FID/REAL,        FID/IMAG
##SYMBOL=    X,             R,               I
##VAR_TYPE=  INDEPENDENT,   DEPENDENT,       DEPENDENT
##VAR_FORM=  AFFN,          ASDF,            ASDF
##VAR_DIM=   8192,          8192,            8192
##UNITS=     SECONDS,       ARBITRARY UNITS, ARBITRARY UNITS
##FACTOR=    0.0002768,     1,               1
##FIRST=     0,             0,               0
##LAST=      2.2672688,     0,               0
##MIN=       0,             -54673,          0
##MAX=       2.2672688,     53606,           0
$$ Real data points
##PAGE= N=1
##DATA TABLE= (X++(R..R)), XYDATA
0 0 0 0 0 0 0 0 0 0 0 0 0 0 0 0 0 7 -8 8 -8 8 -8 16 -16 16 -24 24 -31 32 -40 45 -49 57 -65 73 -85 94 -105
37 -105 119 -134 149 -167 183 -206 224 -250 276 -305 335 -369 407 -449 494 -545 602 -664 734
56 734 -816 909 -1016 1143 -1296 1483 -1717 2024 -2444 3049 -4021 5819 -10314 50675 53021
71 53021 4980 46395 34259 14092 10559 2346 -29803 -32962 -35731 -41673 -34142 -19351 -27603 -22108
85 -22108 -3229 3956 8476 24496 24649 16863 19531 25276 15903 5113 5663 5530 -6150 -10393 -8914
100 -8914 -11898 -11223 -5865 -8868 -10272 -2422 448 -5180 -307 7415 1756 -46 6896 2329 1223
115 1223 11589 7924 -1298 5004 8394 -19 -873 3319 -3057 -8039 -5151 -8609 -12298 -6578 -6519 -10327
131 -10327 -4813 -142 -263 4141 9613 9134 8439 13464 14916 8998 7819 8119 1254 -4885 -4195 -6701
147 -6701 -11745 -12660 -12879 -14387 -11260 -4925 -4933 -3159 4440 4803 4600 11856 13450 8813 9142 9289 3169
164 3169 1432 3048 -1708 -7241 -5202 -5266 -9042 -6265 -2216 -3735 -2694 698 466 929 3793 4239
180 4239 2145 2104 2868 186 -597 1817 -662 -3629 -1095 -678 -3176 -1643 1832 -616 -2956 827
196 827 2136 -6 1873 2729 199 1802 2503 100 1128 3633 239 -2276 130 672 -3064 -2443
212 -2443 -665 -3691 -3625 -1012 -2166 -2404 231 335 -706 1145 2334 1028 1691 4115 1551 -375
228 -375 3070 2574 -262 650 1849 -227 -1100 -127 -460 -800 105 -1428 -3644 -575 129 -3137 -1986
245 -1986 434 -1641 -2307 480 1305 -296 655 1870 374 894 2363 1217 768 1924 -509 -815 1702
262 1702 921 -1247 -130 2030 -328 -1670 911 1061 -1277 -594 -334 -1644 -1140 -308 -1583 -1652 -784
279 -784 -1273 -1913 14 1186 -692 568 1786 90 769 2787 1926 677 1659 1976 665 262 1348
296 1348 53 -1384 86 -941 -1923 -745 -870 -1861 -986 -917 -1841 -1145 419 -135 -1081 969 1158 -1481
314 -1481 494 1984 -318 -99 1106 943 141 1020 1578 512 693 1355 87 231 1314 -642 -1299
331 -1299 350 -507 -1792 -697 -350 -1570 -1754 444 -200 -1517 353 432 -1387 -25 637 -499 -373
348 -373 570 491 192 1040 1517 1151 1803 2696 1132 1467 2033 -141 -520 448 -1014 -2797 -1945 -1096 -2813
367 -2813 -3120 -498 -668 -1519 31 650 854 1554 1136 1114 1656 1375 23 254 1406 -272 -1598 177
385 177 1040 -903 -525 1261 461 -17 550 823 553 16 -160 -376 -593 -334 -1674 -1001 154 -1559 -2092
404 -2092 -323 -287 -1153 -856 751 191 -362 1131 1279 593 1392 1703 582 1761 1755 659 820 1094 -47
423 -47 -417 -428 -658 -1935 -1640 -1397 -2354 -1521 -721 -1546 -1582 -119 197 -672 96 1577 1161 729 2132 1688
443 1688 605 1622 1326 594 1040 388 -668 -126 66 -1339 -1604 -36 -752 -1585 -469 725 -838
460 -838 -542 581 343 164 488 222 -282 -147 -171 -515 -329 138 -640 -454 313 358 21 719 902 423 620
481 620 1400 767 -194 818 545 -602 458 542 -636 -634 163 -952 -1463 -916 -1390 -1852 -1360 -1354 -2066 -841
501 -841 -8 -766 253 1800 1612 1431 2472 3065 2264 1941 2138 981 316 28 -1202 -1754 -1412 -2212 -2474
520 -2474 -1838 -1646 -1550 -1261 233 551 -164 1047 1771 661 496 1323 463 -55 336 -169 -447 464 216
539 216 -644 -48 1521 462 30 1233 981 253 203 -273 -405 -326 -594 -1362 -1291 -363 -1134 -1143 -38 27 -726
560 -726 461 1080 44 -17 1010 1167 83 -60 271 182 124 56 -550 -128 615 -512 193 1515 1127 89
580 89 686 1148 120 -441 425 -536 -1896 -1299 -1579 -2179 -1924 -1730 -1256 -608 -435 -284 573 2191 1722 1341
600 1341 2532 2834 1326 1090 1509 518 -119 -66 -661 -1610 -1312 -707 -1660 -1777 -389 -737 -890 -171 -636
619 -636 -250 422 95 -392 540 938 -83 -182 1091 630 246 905 528 -458 250 458 58 -343 -59 28
639 28 -386 -120 -143 -201 590 444 -899 -30 1088 -447 -915 -32 -653 -1291 -937 -5 -644 -585 99 -552 -314
660 -314 968 1021 397 1037 807 422 1058 1145 959 944 716 400 -352 296 71 -1257 -879 -705 -1173 -1571 -1077
681 -1077 -1118 -1413 -1284 -252 -445 -109 671 571 1125 1455 924 1168 1764 1055 51 445 551 -470 -1133
700 -1133 -30 -56 -966 -501 -253 -245 185 -31 -358 12 -67 -268 -212 182 -368 -865 -778 -243 -737 -363 296 -193
722 -193 -401 354 816 825 846 945 382 485 981 85 319 956 67 -823 -534 72 -124 -946 -874 -1133 -1079 -490
744 -490 -756 -919 107 143 -672 -57 710 526 444 797 481 259 834 1097 275 449 674 424 20 61 -85
765 -85 269 -198 -704 -980 -787 -187 -651 -1056 -212 -144 -750 -330 140 301 467 299 -39 -147 352 653 14
786 14 -76 239 -314 383 526 2 561 865 214 115 981 816 18 -322 -90 -619 -1341 -521 -1231 -1409 -907
807 -907 -807 -701 -343 -124 531 354 598 848 1005 1365 428 -176 420 813 -2 17 142 59 -117 -220 208
828 208 245 36 422 -375 -368 -449 -594 -518 -407 -593 -685 -922 -318 -473 -250 362 -43 -13 616 1084 306 808 859
851 859 290 544 532 715 206 102 270 -184 -463 243 -230 -303 -763 -987 -263 -496 -577 -821 -133 -324 -547
872 -547 -459 396 172 -166 367 527 222 25 300 758 533 -22 364 461 434 91 -27 471 36 -863 -221
893 -221 124 -405 -638 -517 -261 -362 -753 -528 -244 -588 -335 -412 25 110 -152 154 473 329 296 698 999
914 999 494 306 902 823 43 409 322 -356 -167 -603 -406 -696 -500 -438 -841 -674 -213 -214 -85 171 -156 65
936 65 200 -116 276 237 25 53 239 561 582 -50 613 686 284 543 256 347 -102 -257 -317 -417 -406 -692 -600
959 -600 -412 -470 -763 -121 -67 -227 220 180 228 -91 92 217 23 235 278 246 209 401 698 416 380 282 365 322
983 322 186 -210 -55 -469 -444 -706 -114 -768 -1206 -446 -386 -230 19 73 23 -31 281 327 361 188 160 185 361
1006 361 380 136 437 715 302 16 328 263 38 -20 97 -114 -387 -416 -404 -345 -543 -943 -156 -387 -431 -146
1028 -146 -244 230 -57 -68 317 629 485 636 916 402 349 526 366 424 239 200 -217 43 -50 -339 -344 -86 -396
1051 -396 -543 -452 -137 -200 -554 -88 -38 -205 -443 -85 22 195 142 156 543 600 545 603 764 806 211 298 651
1074 651 -83 -421 -3 -178 70 -321 -291 -42 -28 -54 -105 -119 -216 -605 -630 -151 -520 -586 -171 177 63 65 237
1097 237 668 632 583 813 701 775 800 153 304 -19 -492 -311 -438 -642 -683 -729 -250 -328 -385 195 -204 -154 237
1120 237 -41 -279 -113 86 9 -173 -36 2 -83 462 190 83 849 244 296 694 454 -191 492 415 -313 -283
1142 -283 -88 -282 -401 -656 -481 -336 -518 -373 -509 -58 -195 -431 232 35 173 362 108 574 210 293
1162 293 847 458 144 408 375 -129 -81 315 24 -427 -152 -443 -327 -139 -444 -443 162 -171 -576 -1 -64 -304
1184 -304 -157 395 244 -157 21 536 -21 204 634 531 450 -110 281 451 372 -203 58 206 328 -74 -356
1205 -356 454 -306 -718 -88 58 -544 -498 -592 -351 -208 -408 17 -12 275 173 243 456 389 91 271 392 -118
1227 -118 -39 487 390 182 75 159 69 -52 76 -129 -129 -138 -359 -519 -550 -627 -684 -625 -441 -425 -188 214 1 176
1251 176 504 633 464 565 550 592 225 561 245 -148 40 -28 21 -156 382 -68 -138 14 -449 -164 -478 -107
1273 -107 -502 -572 -494 -822 -841 -148 -121 -15 26 18 548 466 565 648 594 510 369 90 258 291 136 15 -232 -355
1297 -355 -127 -215 -356 -369 -326 -123 -151 -251 -30 -272 -44 -157 -169 -195 2 -6 -32 -118 105 400 387 169 -75 301
1321 301 275 92 78 209 191 -97 -16 -32 -140 -328 -329 -199 -611 -276 -445 -310 -207 -87 -143 -35 -203 102 -142
1344 -142 288 258 228 220 122 214 116 532 486 385 391 206 139 23 264 -228 -373 -29 -323 -924 -412 -241 -515 -585
1368 -585 -437 -54 164 -143 181 107 232 225 26 326 224 52 -137 370 361 307 273 336 166 144 261 311 175
1391 175 -162 -423 -356 -208 -722 -557 -363 -399 -723 -265 -40 276 54 -107 633 328 340 395 265 -9 122
1412 122 130 -18 108 -86 87 -40 170 64 356 249 11 -164 108 -189 -397 -346 -277 -180 -508 -653 -548 -339
1434 -339 -173 -58 15 158 -75 -4 475 133 431 479 355 161 98 612 357 -130 -31 40 97 -141 -143 -223 -99
1457 -99 -281 -171 -235 -428 -407 -164 -131 85 -17 69 -50 206 176 226 294 153 139 509 283 25 246 156 88 119
1481 119 -121 -126 -330 -11 -312 -147 -207 -444 -88 -429 -378 -43 -77 110 -329 -248 -108 -29 -114 -9 190 129 -80
1504 -80 275 673 278 314 350 196 470 271 -14 -230 -200 -238 -250 -129 -69 -390 -139 -62 -233 -373 -137 40 -196
1527 -196 -133 -2 150 -155 -342 164 117 415 289 194 535 482 500 693 554 25 46 -129 -111 -430 -582 -469
1549 -469 -428 -548 -223 -441 -149 -293 -165 322 -38 47 -24 -206 13 -59 -57 -145 76 82 92 65 293 297 345 369 211
1574 211 300 248 52 -177 146 -249 -480 -170 -150 -31 -207 -204 -207 -293 -201 -103 -34 -214 4 42 375 152 22 150
1598 150 131 195 349 417 355 348 170 123 199 279 -169 -124 -55 -347 -238 -299 -289 -409 -419 -426 -120 -192 -400 -53 -55 -65 229
1625 229 44 366 212 410 406 131 256 52 95 315 -69 -17 299 -85 -217 76 -158 92 -180 -93 -17 -483
1647 -483 -262 -142 -231 -268 -274 75 -45 -20 -20 106 221 277 119 349 234 237 215 294 169 55 -26 175 182 -182 42
1672 42 -147 33 -58 -169 30 -126 45 -367 -220 -202 -303 -149 -368 -250 -63 -13 22 385 355 430 409 535 523
1695 523 48 41 272 84 -260 -151 -30 -158 -315 87 -53 -56 -168 -288 -18 191 -189 -96 25 -57 -73 -193
1717 -193 121 -3 -120 203 411 97 135 355 158 227 364 357 319 70 -40 5 -178 -55 -257 -277 -264 -367 -239
1740 -239 -75 -231 -37 -270 -348 -177 20 -23 44 26 86 217 -50 279 22 316 411 433 290 204 141 303 144
1763 144 151 -176 -265 -246 -50 -211 -284 -545 -441 -341 -300 -299 -497 -295 116 261 90 142 356 100 312 170 276
1786 276 197 43 -30 -269 147 54 -134 91 154 41 49 -110 -205 71 -5 -73 -17 -360 -431 -108 -369 -373 -436 -33 -85
1811 -85 -139 81 229 200 196 319 207 295 89 242 236 166 232 290 171 -159 -163 -107 -94 -119 -265 -133 -328 -280 -269 -34
1837 -34 106 -380 -285 -227 -48 -64 10 187 250 159 388 244 372 305 19 121 187 -97 12 44 -171 -89 -49 -187
1861 -187 -45 -227 -377 -604 -348 -206 -251 -68 212 -35 -183 -4 156 264 18 -79 152 46 -50 17 -170
1882 -170 388 52 89 303 191 221 276 266 -27 -127 -391 -33 -410 -354 -160 -232 -180 -459 -293 -81 -268 -186 -30
1905 -30 -21 1 259 154 321 212 203 269 409 -74 -126 -331 38 258 -187 120 149 -47 -217 -169 -171 -150 -306 -328 -287
1930 -287 -450 -257 83 -63 -279 -79 60 73 93 166 190 262 110 320 383 149 191 214 112 63 1 -148 -268
1953 -268 -278 1 -365 -449 -285 -319 -246 -323 -106 -192 -19 191 -436 51 -91 -169 59 118 226 316 -36 112 224
1976 224 148 128 407 225 241 313 280 -133 -35 -359 -103 -339 -248 -12 -360 -463 -290 -102 -332 -51 208 72
1998 72 -33 -11 71 52 170 -65 98 207 62 269 158 140 307 -25 35 15 -138 -85 -299 111 -244 -410 -473
2021 -473 53 -411 -202 -275 -300 129 -310 352 81 16 195 16 186 115 -97 257 294 -8 273 62 -19 -44
2043 -44 188 -149 -7 -257 -66 -113 -176 38 -453 -261 -33 -131 -53 -189 -165 -307 0 -10 3 -7 4 -103 150
2066 150 419 -26 390 222 233 69 13 93 343 288 -73 2 194 -106 -95 87 -140 -185 -309 -282 -20 -361 -244
2089 -244 -134 -153 -158 9 259 199 232 451 143 520 652 -49 212 165 143 132 -46 -323 -11 -287 -453 -77 -130
2112 -130 -271 -347 -206 -85 -89 118 71 -37 -344 -22 108 82 -185 62 59 83 53 140 224 227 21 180 271 224 137
2137 137 56 152 -20 7 -154 -73 -222 -173 -95 -96 -199 -252 -58 -280 -220 -177 89 -119 -202 127 163 54 -4 315 461
2162 461 228 96 313 256 206 197 78 -55 -120 -323 -245 -219 -220 -257 -281 -313 -231 -263 -368 -74 -77 -210 -97 -117 109 89
2188 89 187 356 317 31 144 292 308 -106 248 172 243 -145 -255 -120 -125 -292 -15 -75 -169 217 -162 -192 -133 -12
2212 -12 -369 10 -114 69 -3 129 116 -71 -10 159 139 -73 118 131 140 -3 192 -51 103 152 15 62 -3 -81
2236 -81 -164 -237 -100 -436 -104 -342 -385 -172 -32 -194 -251 165 142 251 173 279 138 362 277 258 126 -61 111
2259 111 38 -224 28 37 -42 -1 -223 125 -131 -90 -129 -188 -67 -295 -467 -228 -215 81 -202 -12 -203 14 8 251
2283 251 213 262 251 220 253 110 140 194 383 249 66 -7 135 -410 -153 -284 -4 -179 -106 -8 19 -177 -270 -78
2307 -78 -60 -125 -187 -10 41 144 385 99 246 367 222 49 23 182 131 62 -131 -286 36 -94 -406 65 -15
2330 -15 -118 -208 -386 -37 -84 -246 -159 -247 -201 84 -309 -26 33 -83 159 301 166 192 471 321 247 -162 252
2353 252 138 -169 -8 89 58 57 -131 -258 -31 -209 -102 47 -209 -118 -187 -278 -59 -79 157 113 -14 -55 64
2376 64 -71 131 263 433 310 254 255 37 245 151 509 -86 -90 311 -212 -301 -330 -250 -64 -188 -68 -66 7 -148
2400 -148 -34 199 137 464 276 267 61 64 96 76 179 173 98 -5 25 -21 106 52 -55 189 -209 102 14 -283 -26
2425 -26 50 -176 -382 -300 -163 -194 27 -298 -181 145 -45 287 210 51 -28 109 135 65 -35 151 176 -261 291
2448 291 -90 -234 7 107 98 -185 -4 -51 9 -134 -195 -28 -252 -291 -242 -183 -57 -93 89 154 -70 135 81 -30
2472 -30 121 428 121 180 -130 341 -58 -115 119 -5 -163 -143 -97 29 -237 107 13 -359 -292 -298 -153 226 -16
2495 -16 -102 -14 -35 272 25 -76 98 69 238 206 209 81 -191 242 150 -121 130 -2 307 133 -147 -2 268
2518 268 -28 -66 -60 -145 -53 -336 4 -85 193 -152 60 145 -220 207 -39 141 255 73 221 121 197 -59 45
2541 45 255 -25 7 61 22 -115 36 -189 -311 74 -222 -57 180 -192 40 187 17 111 -202 44 -2 -44
2563 -44 217 -18 175 206 250 45 121 89 210 43 58 123 -117 -224 -4 -80 -215 -121 -146 199 -273 138 -334
2586 -334 148 129 7 41 52 100 37 -36 -161 -20 -164 -155 -2 184 209 83 186 331 121 -130 -34 320 -6
2609 -6 86 -157 -39 -75 -203 -108 -199 -153 -131 -414 -103 165 167 94 21 10 -199 -59 100 193 156 258 -174 201 210 234
2635 234 -22 70 68 -52 34 -237 246 -280 -105 20 -21 -17 -5 -113 -167 -199 -192 0 111 -89 19 32 162 -76
2659 -76 52 189 53 207 132 271 402 152 164 -20 26 141 -85 201 158 -182 59 109 -56 -129 119 -296
2681 -296 -128 -227 -119 -380 170 40 -87 191 137 38 -14 354 106 167 63 146 113 -136 35 105 210 4 -135
2704 -135 -211 7 -95 11 140 -117 -112 72 -69 -86 -65 -261 11 -59 132 225 33 246 104 165 205 111 68 -96
2728 -96 5 15 -82 -61 -126 -168 -220 24 13 -59 -216 52 93 58 -168 -75 -119 -37 -91 -98 11 -18 20 170 266 56 77
2755 77 -4 321 -48 106 117 362 208 178 41 61 -98 -144 8 -83 -117 -35 -251 -310 -6 -84 5 190 249 67
2779 67 59 -105 -32 208 257 271 126 174 309 -31 8 148 12 -149 -56 130 -103 -140 34 76 -207 -103 30 -22
2803 -22 -111 89 -20 8 -10 165 24 31 99 -116 207 -44 -111 157 207 110 78 14 348 120 58 122 -2 -234 -106
2828 -106 49 49 -72 -471 84 -106 -103 133 125 47 -24 -66 1 -58 107 122 110 227 228 -53 3 246 19 -75 387 175
2854 175 84 70 23 304 22 -475 -94 148 -75 -265 -119 48 -222 37 61 -21 -105 21 -22 89 72 -98 249
2877 249 111 -107 254 158 -129 89 26 154 -4 230 122 55 -94 77 -124 2 330 -253 -146 -27 -178
2898 -178 -83 -205 -111 15 -234 54 -113 2 254 155 239 94 194 61 53 138 169 70 -97 146 -184 61 -1
2921 -1 39 -12 -91 -25 -59 -189 -221 -143 -82 34 -9 -184 259 114 -375 83 92 -53 -136 233 432 -207 43 5 -125
2946 -125 44 124 -193 112 22 34 46 -46 -80 64 -69 -193 96 18 6 115 -153 104 63 15 -98 158 328
2969 328 -66 168 -85 439 6 254 -90 94 430 243 -97 -173 -82 45 95 36 -63 -31 -207 -138 -3 41 -88
2992 -88 120 97 25 -67 -224 -202 -100 171 -191 -33 -212 73 -165 149 169 191 95 219 341 263 -201 72 44
3015 44 -78 -128 -12 -99 -146 4 -58 -272 -157 -229 -165 62 -27 135 -6 -46 -230 88 129 -22 136 117 166 -169
3039 -169 81 120 176 -94 103 -36 -37 -52 -18 -167 -110 -221 -312 -121 -93 -83 -107 85 48 -38 18 244 229 -69 58
3064 58 327 46 102 130 -9 227 89 151 -100 137 -197 122 90 -196 -100 -240 -204 -149 62 -27 -279 184 -160
3087 -160 19 -65 -8 -119 -59 13 -30 -32 52 21 5 277 -119 238 72 -185 -89 -1 -42 -114 -235 36 -100 -140 -119
3112 -119 -102 179 -172 -95 -70 -66 -63 -162 -111 89 63 -103 -66 -80 28 -212 263 209 427 165 319 40 82 -170 -158
3137 -158 -186 -102 -266 -157 -252 -139 -62 84 -303 -146 -349 72 295 32 -166 111 -143 148 120 -98 181 145
3159 145 -57 179 203 267 188 84 212 337 -52 139 -211 82 -100 83 -33 -56 68 -182 -238 96 -64 -55
3181 -55 -130 -12 103 -24 -261 -9 -178 -148 54 7 84 204 1 123 55 229 333 121 -47 190 -78 114
3203 114 -166 -441 -263 28 -107 -70 181 27 66 -13 -47 -171 43 51 -57 -67 167 160 211 230 103 37 139 8
3227 8 -10 205 117 -147 99 22 13 -142 -306 -142 -54 -88 -25 -169 117 -163 139 145 -91 -97 -8 67 -247 -150 83 161
3253 161 134 -135 195 154 110 105 64 88 20 -89 -170 -103 -177 -180 -44 -142 -111 132 -86 -244 -73 -29 -278 46 10 149
3279 149 -94 80 -125 -112 -47 4 132 119 198 -18 -242 8 -217 68 0 -116 -63 -251 67 118 192 -203 201
3302 201 260 -217 -128 -172 163 -144 58 -139 -99 48 87 173 45 -48 111 -99 181 39 139 85 -186 -140 -66
3325 -66 157 -120 67 23 -88 -14 6 -161 -36 -133 -92 -2 157 -34 -98 28 -219 -409 71 200 186 134 -159
3348 -159 22 166 19 301 21 70 -53 -201 -18 298 47 -44 100 -192 -90 -16 -220 -146 -211 91 10 46
3370 46 -141 111 -17 -180 102 -12 145 231 -68 -28 -136 103 -1 -203 -36 -50 -27 147 -66 -69 55 -7 188
3393 188 -135 -54 -146 -48 24 2 -55 -75 -35 53 140 -129 -211 110 12 330 27 28 197 45 83 -83 272 6 -134
3418 -134 26 147 -31 -81 -328 81 -299 38 -51 150 24 32 -42 -44 92 -63 82 -192 -13 40 -40 5 -32 52
3442 52 307 -1 10 190 203 -62 62 -64 226 155 8 -39 -213 -112 -198 -150 -13 -318 -135 -284 -73 -112 -119
3465 -119 37 55 115 7 -4 -88 49 214 -148 62 124 133 88 -107 321 -54 80 -32 -49 -165 73 -241 -161
3488 -161 -107 67 -135 -207 -197 217 161 -144 163 -17 222 118 83 37 112 -100 100 -223 101 308 -155 -74 187
3511 187 -57 -29 259 -72 -6 -93 -136 7 -224 70 -107 -66 -284 47 -194 -27 329 -100 -5 119 144 345
3533 345 224 51 154 190 -93 -130 131 52 227 -99 32 -97 -36 -161 -212 -78 -28 -119 166 -190 -28 132
3555 132 132 65 119 -148 246 -272 -44 -105 -29 -65 -89 131 112 -212 155 -147 -7 190 161 159 -94 73 -220 126
3579 126 -36 82 209 -59 -59 41 -208 -40 -219 101 -121 -74 -56 -78 146 109 -106 -266 -80 -104 -77 466 -39
3602 -39 400 91 34 20 6 -143 -50 4 -153 264 -54 111 -111 -169 133 -54 -81 -134 -240 314 50 37 116 -24
3626 -24 -6 75 -80 -39 21 31 174 -60 -69 -208 330 -19 200 217 49 -238 -113 -126 -51 -28 -165 -244 110 -88
3650 -88 -223 74 111 191 -26 -56 -28 312 110 223 137 272 67 137 20 46 -32 2 20 -140 -21 -327 108 180
3674 180 -323 -290 272 -48 167 -101 228 171 -178 24 7 -235 6 7 132 51 20 -75 119 3 103 172 193
3697 193 -85 100 65 -98 208 -138 146 -241 -190 -345 221 206 -36 -136 -58 -4 39 -103 -108 -155 59 190 -120
3720 -120 45 -27 32 113 154 288 -305 175 6 148 128 -37 -104 180 -40 31 -101 28 199 191 -44 17 -81 62
3744 62 93 -33 -50 -25 -50 -184 -90 3 -122 60 115 -202 27 157 -143 9 -8 -175 51 -267 8 -186 -70
3767 -70 -11 -261 106 -110 132 95 -47 -101 99 -32 56 196 -31 -190 -125 15 -94 82 -20 239 -146 104
3789 104 26 63 200 -74 -24 -18 104 102 46 -3 -254 -60 99 73 5 52 154 -97 0 -97 -48 78 54 -117 -66 107
3815 107 117 324 164 -7 -39 110 -341 172 70 254 -249 56 265 -207 28 -170 -94 -160 -154 -51 -136 -153 -145
3838 -145 -56 -462 -198 -24 86 -106 235 30 139 91 120 -96 202 204 -60 219 -185 -36 -180 -166 -50 -119
3860 -119 26 -196 138 18 -32 -60 80 49 49 -42 104 90 56 -113 173 289 340 -151 44 259 -120 108 -52
3883 -52 124 6 209 -129 60 -114 110 -274 96 137 -100 103 -47 -159 -180 35 251 -223 -241 195 -54
3904 -54 87 68 73 -8 187 -64 288 -93 -123 116 48 -47 -305 99 47 -140 -253 -10 -17 99 -143 199 -32 -116
3928 -116 -1 -85 -332 -122 -121 -65 -48 23 -175 -6 98 32 113 -24 34 -112 -74 253 -34 -178 192 102 36 -144
3952 -144 -17 196 299 116 -127 -37 3 -31 43 118 143 -118 -135 96 244 20 -76 42 108 124 80 -179 89 -48
3976 -48 181 202 53 105 -201 -136 158 -25 -48 54 5 35 23 -299 -84 -244 -3 160 -78 -88 -65 -24 -87 -147
4000 -147 -73 -27 51 84 -43 94 101 -3 162 -54 -56 -1 -151 -30 -98 -41 -65 -25 -27 -141 -72 3 -16 151 183 42
4026 42 70 -30 345 158 -138 22 14 -70 -57 95 38 53 209 113 -132 331 225 49 117 -66 -82 147 22 -99
4050 -99 -241 -202 -103 139 52 -90 -11 7 -149 -150 38 92 142 4 106 68 158 -188 256 -31 -126 110 83 -170 -42
4075 -42 -47 121 235 135 30 27 -14 13 -133 5 15 -184 -103 2 102 -64 -57 -77 50 66 -59 140 274 -71
4099 -71 -10 45 -36 -273 68 87 216 154 1 138 95 -186 13 93 -88 -30 -73 -58 44 -103 -47 -147 -151 -151 -99 43
4125 43 -127 -16 -40 54 46 178 -118 -6 109 94 284 178 86 97 227 -4 -61 12 -172 121 39 4 -100 -21
4149 -21 -162 32 -96 -128 -162 118 -198 -34 105 175 -61 -13 146 254 -24 -195 -220 -54 182 -123 -142 -72 41
4172 41 -172 -108 38 -153 8 57 -75 155 -15 -113 -66 -98 -91 -55 60 -145 -40 133 168 46 -43 52 4 250
4196 250 54 -204 -19 118 3 -68 -281 119 -93 -26 -173 120 126 -181 72 117 142 -137 252 65 158 211 218
4219 218 85 128 76 -93 384 7 12 163 -25 -205 302 186 47 297 -17 -299 -49 -23 134 -60 11 -203
4241 -203 102 68 -76 8 -51 -126 143 -87 -199 102 -182 -97 -10 13 -265 147 -69 140 -35 93 67 20 272
4264 272 93 101 -50 -46 205 -122 42 -139 -192 -211 3 26 70 -265 104 11 -73 205 -19 83 73 119 -82 180
4288 180 -64 221 -157 -74 -201 -206 15 94 129 -80 373 -101 -135 113 -20 16 -171 -91 152 40 -175 -185 89
4311 89 50 64 279 22 185 -83 67 -139 74 60 -209 -13 189 50 174 -244 110 174 -50 190 -215 105
4333 105 117 -307 218 -27 -37 -39 -96 -226 9 109 84 58 62 356 142 -156 -75 148 -153 -15 -99 -32 -159 15
4357 15 -26 -97 206 118 -14 34 -106 -133 -43 124 4 -108 -254 -57 45 -161 171 -9 -15 24 241 2 -36 38
4381 38 28 62 -160 308 19 40 24 -173 49 5 203 163 52 -284 69 142 63 297 -256 -75 -58 20 -183 238
4405 238 9 171 -13 119 118 -86 138 -214 142 54 -61 -113 35 132 105 -64 -102 6 26 42 -10 -94 -102 -52 159
4430 159 -137 -217 72 -58 152 -18 -35 -113 -101 -18 -21 265 -35 -93 -78 -236 88 249 -65 156 51 141 181 -68
4454 -68 -41 -60 -158 -184 -87 -40 -294 -185 28 -166 62 110 235 5 345 34 -17 35 -24 -53 -100 118 -33 49 -81
4479 -81 196 147 -135 216 167 53 -53 -403 40 78 85 42 -163 -39 -148 71 -98 -94 -79 242 -34 190 4
4502 4 31 241 183 -104 -161 147 16 135 92 34 25 -18 -264 108 -71 150 -180 -77 -203 -60 7 -134 -260 -16
4526 -16 79 365 -21 256 -224 104 -5 14 102 31 251 -70 167 -39 193 -16 131 -137 -29 -16 -25 84 -140
4549 -140 -164 -134 -63 90 -186 -120 0 -18 176 54 -71 57 -121 112 62 -21 -25 -50 -61 -107 145 -5 152 123
4573 123 238 -28 185 -20 -90 -237 -65 -191 -13 20 -142 23 23 -54 248 61 48 -9 -63 247 -119 126 -141
4596 -141 238 360 -43 165 -83 -102 12 -73 394 -142 24 82 -126 16 -65 -16 26 -169 -6 95 -126 185
4618 185 -127 -184 106 108 -19 -133 -143 101 49 66 -105 -258 114 -168 103 21 -151 105 95 -62 114 20 49
4641 49 -45 65 -151 -151 -21 -75 -194 93 229 27 240 40 47 -16 113 35 112 -76 99 134 -133 -151 -15 13
4665 13 -51 319 26 -98 -8 -5 -108 109 -181 -34 -170 -78 -319 -162 -320 -316 55 103 129 -84 -202 -295 72 -99
4689 -99 89 51 8 -14 -339 -61 82 -158 14 108 81 18 21 -175 -75 -223 -119 55 176 134 95 -76 58 79
4713 79 -120 -118 181 -267 210 -67 -174 81 408 76 123 235 -14 142 -116 30 -129 -107 -57 -122 -35 -108 -103 105
4737 105 -245 121 54 -154 -123 30 63 -27 78 22 188 -58 -33 -153 -444 -57 70 -126 106 178 27 88 -94
4760 -94 -53 3 -135 -148 26 -21 -5 -144 207 103 30 -5 153 137 -324 -113 84 107 13 33 -226 -19 51 -139
4784 -139 -82 104 190 179 82 28 -82 -20 -255 35 136 151 -86 138 146 115 71 55 22 52 250 -297 246 65 1
4809 1 -42 75 28 -7 116 63 34 -104 229 8 118 -110 133 78 -8 70 -147 8 -17 -94 160 12 -91 -121
4833 -121 -64 29 -81 78 -14 87 7 -44 -5 -3 18 137 41 49 -56 -123 -232 -111 63 -42 -74 197 13 73 -60
4858 -60 56 176 39 -51 -131 -171 -59 82 115 -17 -75 -57 -70 -57 -27 -119 -31 -7 136 -70 -131 70 92 95 45 -84
4884 -84 142 32 -84 -241 80 43 -2 84 1 85 -129 129 -76 -150 -53 -78 83 300 -19 6 -49 109 163 -179
4908 -179 9 15 66 49 -38 -28 120 64 42 -62 -231 121 96 -63 -56 -191 -38 -175 185 -91 50 -37 46 -105
4932 -105 130 122 41 54 -58 350 134 263 153 305 -80 -168 -87 2 -94 156 77 -108 -85 -18 203 -246 81 -204
4956 -204 -236 119 -304 -117 -10 165 -62 -100 -40 -8 54 -202 -149 69 28 -277 -127 -13 39 -1 3 -83 -62 11 153
4981 153 278 38 89 290 -38 51 1 -127 -95 -329 128 76 -127 -74 -40 15 30 -131 -46 236 86 -122 233
5004 233 -14 -78 180 -138 -41 -7 327 29 -57 -4 -55 -62 146 -55 0 -32 127 -3 81 -246 191 113 -62 104
5028 104 216 -57 -115 -113 150 32 3 -48 165 -30 32 -51 132 -234 -63 0 -72 66 42 -352 24 123 102 -64
5052 -64 85 -302 -36 72 -111 116 3 -97 93 -72 188 101 -26 -49 -86 107 -302 36 -71 107 193 155
5074 155 -12 -238 -31 -72 56 181 -171 -170 10 140 2 81 -81 -11 -21 -139 -41 49 -28 -25 96 135 -145 99
5098 99 -260 -243 -103 -29 98 -46 -35 -127 129 -144 39 -104 -168 70 69 -147 -118 -60 209 -41 -57 93 39 -69
5122 -69 -51 -52 9 -2 366 -45 -25 -126 60 108 -134 78 -16 -98 -105 -52 213 144 -121 86 -186 276 55 -8 -99
5147 -99 65 117 -107 129 49 55 20 39 -171 107 50 -27 198 -124 90 -76 172 92 14 261 121 49 136 -111
5171 -111 111 -29 -67 -62 -14 -37 -80 30 168 -23 -233 -82 -27 -108 22 82 5 -49 -27 53 41 203 -38 -30 103
5196 103 113 30 32 -100 88 -35 102 67 101 60 -144 62 56 -66 -25 -190 224 -103 22 -113 -53 13 -61 -101 41
5221 41 -186 70 -156 -119 134 -98 55 -80 57 -107 0 97 29 -83 303 143 -28 22 -11 67 -181 -121 265
5244 265 202 38 -33 76 102 -18 -123 -66 6 119 164 163 -108 16 11 248 261 132 45 -278 189 -225 98 154
5268 154 -113 -36 -5 2 -63 -24 -5 -191 94 -122 -24 103 57 12 39 -172 -221 -7 -50 -129 -111 -126 111 -55 -82 -106
5294 -106 189 -21 15 -17 106 -257 -171 -105 -170 -172 53 -60 131 43 -7 -35 85 -404 -12 167 -182 429 46
5317 46 110 -244 -35 -64 173 107 182 163 142 8 -127 5 21 -17 -50 -189 -227 76 12 -74 175 221 -48 -151 133
5342 133 159 42 -13 10 167 42 40 -28 301 58 127 -183 -193 79 247 24 -101 -3 -21 -9 131 -239 -47 61
5366 61 50 296 -202 -30 42 33 210 224 42 -207 -21 -117 -120 32 79 69 132 126 98 61 -103 -256 101 73 -30 -92
5392 -92 189 124 127 -112 -139 55 -182 12 -32 -40 -181 -47 94 146 -76 105 -52 77 38 3 47 68 9 291 -143
5417 -143 -128 20 -130 -3 310 20 -91 141 70 3 -83 16 -116 -223 34 -217 92 -287 60 131 -31 -128
5439 -128 128 104 -75 24 -101 3 -260 228 52 -50 27 111 298 -88 89 -218 132 -161 115 -304 -94
5460 -94 45 50 -145 -145 88 -50 39 84 309 119 -125 -143 161 -51 17 125 229 -13 193 281 -53 -156 83
5483 83 -76 -46 80 -5 107 -104 -164 -333 -48 143 245 -31 6 31 15 44 -48 -98 196 59 28 -228 -58 236
5507 236 -159 -69 -91 62 49 -100 -157 9 140 -219 -43 -128 -198 211 250 76 8 -5 -152 198 -72 38 164
5530 164 132 58 112 156 -48 -37 -135 8 -36 46 -10 -47 200 -69 63 162 108 -108 -235 -106 -320 -8 35 -35 133
5555 133 11 -291 -201 20 132 -94 -9 -91 88 169 206 -122 83 99 53 -27 67 125 117 -349 -57 -37 -16 -108 -26
5580 -26 5 -34 -151 -1 -56 -139 -4 -192 44 76 26 -96 -90 192 -121 -194 47 -55 -285 -108 124 -109 -148 -15
5604 -15 227 -264 -29 100 55 178 142 -83 85 -174 60 -186 -25 30 32 -46 -13 -53 -266 -153 142 113 -152
5627 -152 67 290 80 142 46 5 -62 -328 128 -76 250 131 136 -60 90 54 234 -38 -175 27 -314 62
5649 62 -40 199 136 33 279 -29 -204 -181 7 75 168 -35 -39 -28 -87 -9 -7 -221 19 -22 -122 45 -237 -271 -232
5674 -232 149 26 10 58 -237 -84 45 -56 32 137 -141 -31 -31 50 -122 131 -31 -175 189 106 310 -115
5696 -115 178 -148 98 14 -114 -61 -2 2 -76 -72 -55 -134 -20 -54 205 52 104 -93 -235 -5 -192 99 -58 32
5720 32 180 150 237 -131 161 -101 229 -2 77 41 -91 -231 -78 -138 -21 -34 -125 66 -35 -57 -51 63 -120 -129
5744 -129 -133 37 -151 -186 105 -29 -92 -78 303 -68 96 115 71 53 110 3 -49 -115 94 31 35 184 -111 -6 -186
5769 -186 283 119 -77 -93 -16 -29 246 -21 -294 -8 0 27 -54 103 99 59 -68 -216 23 -140 62 -95 -147 -44
5793 -44 24 110 119 -71 27 204 6 -96 3 -137 -260 226 119 -7 -162 -80 129 6 -5 30 26 107 133 24 -275
5818 -275 -178 -107 -18 84 -175 80 153 -133 -99 42 -12 -233 -182 45 -237 141 205 46 16 -29 60 31 -283 -4
5842 -4 15 -115 -88 66 -154 158 198 67 164 269 132 -28 -171 34 -1 50 89 -39 214 -77 -10 -180 -84 220
5866 220 20 68 77 156 -94 -117 -167 -76 -32 -33 -99 -95 152 -39 15 115 351 54 -60 -9 -46 -70 -90 -49 160 -26
5892 -26 32 -49 -91 17 97 70 112 -137 -90 43 211 -58 -12 -111 -19 -19 88 -52 -17 78 -226 189 8 -157 104
5917 104 -87 -146 -54 36 -1 -120 -164 -71 -124 -48 79 25 69 203 -53 90 -307 -34 21 -13 68 -154 211 77
5941 77 62 106 1 -107 -91 144 -143 56 -175 -13 56 -53 -8 -127 -18 -29 36 61 -45 142 212 153 86 362
5965 362 187 -25 91 -6 49 253 -28 -219 -121 -27 223 -144 49 -60 93 339 -301 -137 72 -162 -64 -64
5987 -64 -76 -46 16 21 186 -84 -5 -51 -6 66 -40 -126 124 -130 239 155 104 -137 252 153 -72 124 -189 89 -41
6012 -41 140 -35 9 -72 61 -21 155 -132 35 -69 -134 -64 -199 212 -61 27 -87 118 -137 3 155 -123
6034 -123 28 78 -124 -101 9 -5 195 -59 -49 100 -6 105 41 187 -209 -237 -46 -145 24 53 12 -128 -265
6057 -265 12 -111 -263 65 14 -22 -197 51 -111 -43 -145 54 -83 -28 300 142 -8 -17 38 71 135 -11 -125
6080 -125 -101 -190 -110 -29 -82 173 -182 -63 -75 3 -137 -285 -5 112 98 125 18 -130 -20 -56 -72 95 171 -147
6104 -147 172 237 286 -216 51 58 -97 149 -362 126 3 21 -160 135 -139 28 -4 -211 -17 131 113 94 -83
6127 -83 37 100 104 -51 -221 46 -128 -14 190 58 -91 107 -66 -36 -28 105 72 132 -74 -69 3 -68 -108 -300 19
6152 19 0 206 115 46 -135 118 -119 -163 63 46 103 -121 -178 69 68 -66 -98 -107 -89 -73 20 176 -60 -106 -150 -75
6178 -75 -176 -70 -200 -131 -122 -108 18 110 -83 -9 319 -83 19 -334 0 144 -59 -238 -16 65 59 -131 -1
6201 -1 -84 -92 109 -97 -33 9 72 -13 144 -29 -90 -265 50 20 -177 -67 -59 -30 52 86 -135 -11 124 79 204 50
6227 50 -129 -47 42 139 -67 -47 -162 -95 -182 -32 -155 184 -63 -177 107 -199 -122 -154 165 33 -125 -46 -113 -47
6251 -47 143 51 -235 31 -318 168 263 202 30 68 157 188 66 67 337 29 -77 -73 146 -46 -174 66 -93 -171
6275 -171 -230 70 12 -49 218 153 -87 -22 303 -10 254 -202 -141 58 61 -233 -262 -174 -55 16 -60 -20 -84 65 -11
6300 -11 -52 43 -174 56 211 30 -178 80 -46 26 131 59 -229 -223 -100 259 29 -60 97 -103 15 41 14
6323 14 -2 -125 101 -35 163 112 24 41 -209 154 118 12 124 -64 -2 -98 -51 -3 -203 101 24 -3 71 97 190
6348 190 39 151 -176 -171 56 66 19 -32 -143 99 -64 -164 129 112 -107 -81 95 -219 188 -62 51 193
6370 193 -164 271 -130 -41 80 63 -125 7 -4 -274 88 -159 219 93 -140 -31 -118 132 79 -150 -116 -23
6392 -23 138 168 62 60 117 1 223 192 71 97 -38 95 68 121 16 -226 20 110 175 -185 -71 -119 52 86
6416 86 -31 103 -254 80 228 75 108 -48 -7 -253 -28 69 4 -12 -19 166 145 45 -135 326 23 59 37 82
6440 82 -13 217 65 121 -81 135 63 -133 -57 -5 -47 -105 -16 -36 -294 -8 -32 -274 65 84 -41 -33 -13 152 88
6465 88 134 116 -5 110 63 163 -8 -47 155 32 8 57 -141 236 -136 -90 3 210 127 43 -83 38 226 -130
6489 -130 -148 -29 -64 -267 108 -44 -48 129 -30 43 -82 23 116 64 52 -38 -103 135 81 -214 -195 -284 -67 1 -234
6514 -234 -166 -242 -53 137 12 -7 198 113 -95 94 35 -33 110 -16 146 -65 36 254 -33 -17 -220 4
6536 4 -30 24 -45 112 173 -54 50 39 9 -111 63 85 -43 -212 -136 6 113 87 205 -78 203 7 -36 -408
6560 -408 -35 28 -149 252 -159 25 -201 22 53 -104 -31 -15 -99 -6 -10 73 -46 75 94 52 -198 179 -31 -102
6584 -102 248 -176 -2 212 -75 -149 0 11 1 26 -69 -73 -191 14 105 -41 -124 48 77 -127 -54 -212 72 153
6608 153 15 165 -24 -61 18 -84 54 -105 -104 103 167 -12 46 -156 58 -32 -14 170 129 -49 -142 -81 -57 -30
6632 -30 -106 -7 -10 -63 -71 -111 49 -106 93 52 40 -10 -118 -24 -60 6 -168 -217 139 -112 -156 -19 128 -149 24 6
6658 6 253 23 -80 -94 140 -253 30 -124 117 135 102 249 -19 -208 150 163 159 85 56 -81 -58 79 102 24
6682 24 67 25 -52 78 186 55 23 82 -198 147 59 35 53 -113 -171 343 218 105 -84 -33 -79 12 -42 -3 -147
6707 -147 -164 -3 -114 42 52 -130 167 -40 158 95 -104 -72 157 -121 140 -46 -67 21 45 142 -90 -21 178
6730 178 -319 147 29 79 96 40 195 -72 -137 65 27 37 -40 -59 -46 -187 -117 162 156 13 -9 29 346 126 96
6755 96 114 99 -138 -149 12 173 25 -247 -98 71 -12 30 -270 -156 -127 182 -267 -197 -129 -20 76 66 142 19
6779 19 -46 51 -45 -29 99 42 38 54 -28 264 85 20 161 -7 102 -6 -183 54 -49 288 90 -67 67 -74
6803 -74 87 56 -75 4 7 -1 -13 -186 -213 -113 48 86 -135 138 -54 -35 73 24 -123 -34 -198 77 -17 -210 22
6828 22 21 66 -50 -164 103 -112 -119 185 7 -132 -226 7 -71 -112 -126 39 109 -93 81 76 42 -84 330 -60 12
6853 12 118 67 77 -180 -21 -220 41 -49 39 -103 -54 -10 -156 107 -114 55 10 221 210 209 -145 95 -134 55
6877 55 -21 121 335 41 -142 -164 -87 -40 -286 -358 19 -291 -168 15 -6 4 -96 54 346 6 -16 14 41 130
6901 130 10 249 -49 105 -258 -71 44 126 224 -31 -156 -183 116 -82 -44 99 -93 19 -51 -142 24 -180
6923 -180 163 -189 39 -132 -56 -30 -182 155 -21 -358 42 -163 142 43 -8 32 -110 156 -170 51 90 131
6945 131 130 68 -214 -82 157 3 -157 106 -132 69 148 -260 113 -25 -169 60 33 -93 36 -67 -14 81
6967 81 -185 127 58 -104 120 76 103 71 -142 -48 65 -19 -7 15 -227 14 -57 152 5 120 131 -125 -122 150
6991 150 -245 -1 -17 -12 -39 38 -106 25 -136 157 92 -69 -78 135 19 28 -87 311 28 15 120 226 -78 -45
7015 -45 79 -247 -248 -14 -86 74 82 -41 0 362 259 -64 119 160 83 50 333 149 -155 98 26 145 114 11
7039 11 -253 205 -77 7 51 -17 207 24 5 -79 122 -147 -59 36 51 -83 167 -112 181 15 204 -128 193
7062 193 -15 -148 -99 -110 -43 131 176 -209 69 -26 138 28 -157 175 41 -190 162 68 -92 -74 262 57
7084 57 -52 206 61 -80 61 172 73 33 -64 -56 190 -14 84 -23 -44 -20 131 -143 137 137 -26 -63 27 273
7108 273 92 -100 -83 29 -134 -216 36 -127 -63 -65 -54 -86 59 173 -29 -171 107 52 -174 -80 -29 8 175 34
7132 34 -244 -90 -61 -125 140 -101 16 -55 -23 -36 43 -259 -72 -101 156 186 208 -159 -25 297 -292 -127 91
7155 91 90 1 126 23 -78 -135 174 -22 -5 -106 126 -58 -47 38 174 -76 89 -129 -198 -105 -16 -29 -24 -82 186
7180 186 41 202 21 -53 145 -182 -190 182 121 53 289 169 77 110 -108 -29 100 -157 -352 200 -17 -61 -87
7203 -87 -135 -92 -79 -59 -141 -133 -135 67 -36 -201 -101 -183 147 7 -98 -136 -113 44 135 30 95 -43 3 -60 41 -40
7229 -40 104 -61 -182 -83 131 210 -110 13 214 116 -101 36 -196 197 -229 -73 -44 -126 214 27 -5 -17 55
7252 55 136 69 68 -76 38 85 27 -187 -39 -343 -67 33 -22 -108 184 308 -54 -95 -126 20 -41 101 26 -78
7276 -78 -199 142 -88 170 146 10 66 -20 12 -85 121 78 -36 -147 28 -174 83 -120 231 -101 -124 99 -161
7299 -161 9 -89 87 164 34 53 147 -74 -209 220 -25 -42 100 60 -106 -56 66 -101 -117 -74 -33 88 68 -261
7323 -261 88 98 -109 -98 -235 164 164 -44 -120 -40 -11 7 26 134 15 -189 -27 -122 -209 -6 -201 -65 234 -182
7347 -182 103 171 84 142 214 163 -58 -8 337 -135 37 161 143 -117 -131 87 83 248 101 -150 -86 60 142 14
7371 14 -14 76 17 96 40 70 -211 1 -63 -28 248 204 -127 192 -138 -53 -151 138 110 -11 85 32 92 -252 109
7396 109 114 46 -34 -150 278 -119 -66 -61 7 -152 57 18 -70 11 47 -137 -125 -181 4 -127 30 12 146 -114 66
7421 66 257 256 131 -40 -180 -241 -154 22 -105 -27 124 -159 110 24 -13 204 -172 18 -20 -72 131 62 202 72
7445 72 -44 -3 238 -84 -37 27 137 70 5 -216 193 -76 -168 165 -319 -63 181 -246 76 237 -83 56
7467 56 44 71 200 344 157 287 36 54 -21 -63 19 -141 10 115 179 218 -69 -62 149 161 -106 -12 51 215 -180
7492 -180 76 37 -24 -5 -34 -13 -185 28 -57 86 27 144 -116 50 68 84 -108 -35 95 -97 200 51 6 115
7516 115 203 46 199 -147 130 -70 78 -43 -39 27 -48 -356 22 -158 128 105 -8 72 -19 -109 -47 115 -53
7539 -53 -210 46 108 34 -142 -150 36 -73 192 -363 -99 -196 -22 -167 -218 70 -100 -19 -144 -79 119 24 -161
7562 -161 66 -324 47 -69 -64 226 10 -231 207 -3 8 -77 15 86 -167 -20 108 25 41 141 -178 -254 -154
7585 -154 255 -422 -61 -293 -95 -234 17 -113 -51 -1 130 -86 73 -81 210 59 -172 131 36 -6 16 -237
7607 -237 -10 169 121 -183 -248 -163 78 -32 -278 118 90 203 63 -67 46 -11 91 -63 -181 218 144 0
7629 0 1 290 94 165 75 98 15 117 -191 -116 225 37 102 16 -60 33 -16 53 -103 21 -49 37 62 7 140 -204
7655 -204 269 -52 -102 -361 87 105 187 -149 -149 100 69 69 -98 119 -61 195 -259 -61 57 232 85 -128 -76
7678 -76 -98 -83 -148 317 17 -156 -98 -199 61 59 25 18 -69 -66 206 26 268 22 74 33 172 112 169 -127 -307 86
7704 86 -136 55 133 43 227 -1 -63 -50 42 -46 -255 -28 -88 -47 -3 -141 229 -162 -66 46 -58 -174 -163 -90
7728 -90 -72 169 -212 -95 134 -29 99 47 84 86 25 53 -260 99 -163 30 -4 -75 -266 346 36 -133 -120 13
7752 13 189 -94 159 -16 -97 -191 30 283 -143 108 -186 34 75 -51 -110 185 -164 -104 -35 160 -8 -152
7774 -152 -199 -143 313 -35 -69 -80 -18 107 -102 -119 129 -21 -46 -83 167 28 101 -136 -15 131 26 212 -50
7797 -50 -149 -63 -157 23 13 100 108 -68 -3 -4 236 -112 -47 -159 -225 -28 -51 -1 144 -230 17 -57 226 108 123 -46
7823 -46 -376 188 232 37 101 141 -132 72 -4 -193 -193 11 45 -313 -200 -102 -14 -152 -77 162 -44 17 5 0 70
7848 70 -75 -206 6 -110 271 138 -121 47 88 -79 -202 85 -79 -38 3 121 -12 -26 252 -246 -66 -42
7870 -42 -45 -59 -79 139 60 169 -42 67 221 92 202 -161 -142 86 202 -79 -5 25 -61 16 -158 134 -116 10
7894 10 27 -88 2 -67 -107 -53 86 -220 -96 -43 123 200 111 78 -233 -71 119 -2 47 20 101 -206 -194 49 -153
7919 -153 -53 -288 -81 16 -141 271 -30 -114 -91 -178 -29 -134 -48 -194 148 252 22 144 -175 -53 37 -87
7941 -87 58 22 -86 -47 7 16 -310 68 -63 98 -53 240 -28 145 68 -11 -305 -29 104 11 204 59 -43
7964 -43 -186 -100 201 -75 -45 -22 -70 -16 -124 -90 322 64 -225 323 128 166 0 -13 129 -66 104 76 34 16
7988 16 -13 -73 104 -78 48 -45 -42 -238 279 193 119 141 186 -17 -86 -87 -38 181 -67 -112 -46 74 -82 -35 154 74
8014 74 -129 104 -182 -219 95 -100 -44 128 -34 -27 -101 -36 -107 36 -8 -84 206 209 -80 -55 94 102 104 70 -41 -89
8040 -89 -268 166 -22 56 -137 66 -120 -10 -115 -239 -13 -6 -77 59 11 -144 10 -38 -215 -67 197 -173
8062 -173 -127 53 -9 60 -49 -15 -54 129 114 109 73 86 -133 58 164 112 -285 -348 -46 -18 94 -15 -80 -29 181
8087 181 -81 55 -285 -16 39 -117 171 -19 15 64 -88 12 126 3 14 -20 -175 -58 -81 116 96 98 19
8110 19 -28 116 127 -76 111 -47 -125 111 116 380 82 -346 -60 -247 272 6 154 152 86 -70 -119 30 -30 63
8134 63 -43 -37 -292 -24 -91 -122 329 -43 62 -3 -30 -150 -99 -52 89 -282 92 -205 -69 123 22 -211 -189
8157 -189 -56 -81 -135 188 61 -87 153 -9 20 33 -217 -227 -46 -77 -141 -34 -37 -40 -104 -172 -79 -83 -119 170 -118 -7
8183 -7 4 -34 -78 -88 -53 -284 151 -101
8191a01
$$ Imaginary data points
##PAGE= N=2
##DATA TABLE= (X++(I..I)), XYDATA
0 0 0 0 0 0 0 0 0 0 0 0 0 0 0 0 0 0 0 0 0 0 7 -8 8 -8 8 -8 8 -14 16 -16 17 -23 24 -29 31 -35 39 -45 49 -53 61 -68
42 -68 75 -83 92 -101 110 -123 135 -149 163 -179 198 -221 244 -268 298 -333 376 -423 482 -556 649
63 649 -772 945 -1206 1637 -2476 4717 -21693 -54673 15709 43705 31788 43498 53606 32619
77 32619 29611 32175 17195 6433 2987 -19891 -34283 -26404 -26576 -32235 -21323 -16460 -19334 -8537
91 -8537 7526 9694 7386 15871 22928 15153 9619 12911 8849 3842 3897 -1937 -8497 -4593 -2866 -9716
107 -9716 -8314 -430 -5305 -9469 -1521 -2220 -5400 2837 2573 -5937 1145 9434 3881 3232 10836 8246
123 8246 3498 7491 6749 388 2060 36 -8031 -8468 -6532 -11537 -12355 -8784 -9482 -9253 -2743 2510
139 2510 1385 4384 11737 11955 10031 14302 14541 8997 6080 4035 -1214 -4401 -4418 -9337 -14221 -11185
155 -11185 -11298 -13676 -6760 -2137 -4631 -526 5189 5155 6406 11314 9671 5117 6552 6697 550 -339
171 -339 1388 -3322 -5996 -3989 -4742 -5060 -2090 -634 -1974 -1232 1878 1349 888 4033 2863 -739 1119
188 1119 2088 -864 -719 1277 -1214 -4415 -1548 597 -2063 -1401 369 -1723 -755 1415 -108 372
204 372 3623 1595 -919 2732 4177 845 758 3175 483 -1296 911 -717 -2874 -1393 -1694 -3834
220 -3834 -2685 -1273 -2292 -2260 771 -499 -1971 1672 2773 -283 662 2863 1569 518 1810 1806 1149
237 1149 2009 1194 -1085 1140 2578 -1265 -1376 950 -1238 -2939 -1125 -412 -2347 -2313 -619 -1462 -1446
254 -1446 807 147 -281 1244 353 -554 1752 1852 -851 80 2267 658 -1454 1340 2274 -379 294
271 294 1831 593 435 1346 -120 -461 23 -666 -1599 -679 -206 -2282 -2197 -584 -2059 -2071 671 -30 -1483
290 -1483 298 1812 753 713 2316 1938 627 1959 1997 551 1157 1253 -211 -6 254 -1118 -1165 -81
308 -81 -591 -1668 -590 -224 -2376 -1197 1108 -996 -1547 325 13 -917 -49 623 -211 -219 822 501 354
327 354 2134 1291 104 1888 1352 -118 587 1077 -149 -634 185 -12 -1467 -265 651 -1825 -947 281
345 281 -799 -1239 -263 -807 -1384 -816 -534 -960 -596 502 -129 589 2343 1508 1408 3253 2571 990 1902
364 1902 2235 276 -1603 -366 -706 -2831 -2072 -1240 -1949 -1326 -1203 -964 550 399 -163 450 1581 833
382 833 -923 622 1474 -935 -1309 690 342 -717 -85 770 679 522 822 933 1051 1155 173 298 1348
401 1348 -104 -1522 -153 57 -1656 -1499 -343 -880 -2109 -1075 -596 -1422 -930 -21 -653 17 1039
418 1039 521 540 1579 1851 1283 1864 2303 874 852 1473 52 -396 244 -923 -1708 -1088 -1330 -2211 -1927
437 -1927 -1004 -1117 -1699 -531 -20 -580 238 881 481 1227 1363 782 1249 1723 691 211 1243 571 -1080
456 -1080 -217 451 -1155 -944 250 -355 -844 -35 38 167 414 461 -25 -163 299 -412 -847 -37 -385 -1226
476 -1226 -301 -172 -478 -491 507 470 -175 663 1139 8 810 1345 627 429 1481 734 347 1015 707 315
496 315 123 -39 -1520 -1389 -675 -2375 -2514 -1051 -2025 -2253 -543 -67 -148 383 1665 2071 2151 2734 2364
515 2364 1864 2251 1248 211 330 -77 -1296 -1704 -1197 -1101 -2181 -1330 -244 -717 -477 387 209 165 606
534 606 326 -90 578 195 -788 -846 547 -256 -990 480 814 -14 783 980 1115 1411 792 367 349 409 21
555 21 -1165 -241 -276 -1904 -906 36 -917 -1109 118 563 -159 -326 513 299 231 385 -244 3 236 -845
575 -845 -775 659 166 -591 35 1195 1050 628 1659 1809 656 1089 1133 384 130 -295 -1100 -1375 -1928 -2434
595 -2434 -2245 -1451 -1496 -1875 -675 453 -91 359 1886 1912 1634 1593 2050 952 1107 1239 359 -467 255 8
615 8 -1037 -667 -814 -1209 -366 -548 -1180 -189 116 -977 -1043 446 -51 -797 274 558 -316 72 1055 241
635 241 38 323 244 132 -40 37 -127 -114 175 -501 30 1607 336 -505 1010 564 -242 -6 576 -160
655 -160 -749 -520 -1325 -1471 -460 -421 -1443 -720 -503 -314 298 623 454 630 708 704 491 1501 1580 577 502
676 502 1373 408 -3 218 47 -952 -849 -815 -1226 -1735 -1051 -959 -1477 -757 -798 -258 1090 761 99 799 1901
697 1901 965 172 1423 1063 -297 -261 291 -220 116 -29 -898 -336 240 -53 -26 509 269 -625 -241 373
717 373 -90 -390 -129 -752 -1200 -448 -210 -458 -440 -195 -244 -88 600 425 621 1371 920 293 486 1525 945
738 945 301 355 336 -62 -75 -45 -422 -334 -383 -1335 -1059 -204 -608 -902 -442 -239 -502 -235 543 -116 -35 714 207
761 207 325 486 671 849 941 445 483 541 1000 196 -342 -176 259 -934 -513 -4 -448 -733 -680 -403 -205
782 -205 -141 159 -75 123 106 -315 -101 126 -454 -198 281 -318 -4 757 1015 623 371 1074 977 684 1076
803 1076 536 -171 -217 -360 -1117 -996 -830 -885 -996 -823 -579 -282 131 -17 -238 417 972 20 161 517 229
824 229 56 65 410 239 197 360 227 408 648 502 198 407 207 -25 -384 -252 -636 -687 -158 -861 -1238 -449
846 -449 -284 -497 -114 -164 -51 192 762 478 560 474 667 357 484 883 657 338 246 -42 451 253 -225 -318
868 -318 -154 -142 -596 -895 63 -313 -910 -357 -270 -367 -512 -318 291 49 -269 -19 348 536 269 221 1068 477
890 477 -21 681 816 322 -211 18 420 -118 -255 -108 -112 -334 -525 -581 -290 -173 -681 -431 -88 -467 -609
911 -609 -501 -152 -167 -375 291 514 342 639 861 430 475 468 517 345 214 -136 -178 -249 -165 -213 -278 -222 -541 -219
935 -219 -215 -511 -435 -73 -431 -346 -446 -116 -167 -587 -65 255 141 397 564 575 531 771 664 884 461 392 391 -146
959 -146 -93 -234 -403 -201 -757 -465 -177 -600 -330 -478 -390 -242 -523 136 -186 -337 -262 -217 -36 15 180 197
981 197 845 268 367 547 642 655 192 480 235 -212 -197 -202 -236 -570 -595 -544 -431 -472 -613 -353 -356 -283 -311 -141 106
1006 106 -321 -53 171 207 2 226 498 339 237 539 570 575 92 448 583 227 -64 24 -282 -384 -404 -404 -595
1029 -595 -389 -763 -531 107 -429 -169 -65 -7 47 20 308 540 424 744 417 355 535 75 211 611 365
1050 365 -140 134 -27 -17 -383 -82 210 -330 -382 -277 -268 -216 -665 -616 -324 -267 -571 -162 190 365 144 24
1072 24 774 491 265 176 446 446 156 -140 481 -3 -44 13 123 295 -20 -181 253 -121 -552 -196 -253 -822
1094 -822 -868 -703 -597 -365 -707 -154 -116 83 688 732 738 904 643 603 681 393 276 345 124 -368 -558 277 -325
1117 -325 -365 -323 -104 -320 -59 260 2 -171 -266 134 -331 -170 -547 -410 57 -112 -306 162 289 96 358
1138 358 753 415 521 525 639 222 9 491 185 -69 -25 -305 -203 -349 -504 -425 -503 -470 -504 -737 -256 -367
1160 -367 -390 151 279 -304 80 317 -25 583 405 516 233 390 588 293 376 33 124 57 259 -418 54
1181 54 172 -481 -349 20 -193 -525 -488 101 -294 -549 -95 4 -387 -232 -65 270 200 -215 170 344 547
1202 547 186 303 758 467 -326 306 644 -254 -405 -2 -27 -445 -482 -335 -510 -608 -624 -593 -48 81 -318 -56
1224 -56 335 -61 -304 328 219 -58 -222 620 211 49 296 199 610 304 228 372 409 100 206 -247 -306 -171
1246 -171 -511 -565 -611 -740 -581 -299 -368 -414 -89 84 129 396 270 222 167 418 37 -39 365 -94 -171 113 187
1269 187 175 359 483 244 -166 103 -28 -225 -114 -254 -821 -546 -451 -517 -455 -35 -62 -287 280 163 172 338
1291 338 514 495 274 327 165 249 323 261 -50 -1 60 24 -169 4 -146 -279 -97 -395 -6 -126 -199 -167 -283
1314 -283 -56 -75 -369 -1 89 84 116 97 69 487 494 -16 95 340 432 416 205 550 86 82 195 -198 -107 -201 -62
1339 -62 -313 -257 -246 -316 -201 -119 -153 -298 32 54 -443 -39 -80 -129 107 278 273 461 614 336 461 708 769 194
1363 194 139 261 -245 -169 -139 -206 -289 -319 -861 -281 -328 -319 -164 -107 135 -351 -251 66 -185 76 -153 216 228 127
1387 127 281 372 224 339 393 418 526 34 152 216 -173 -537 -307 -273 -28 -508 -424 18 -209 -532 255 -127
1409 -127 29 44 196 466 190 -21 103 188 -126 175 -136 284 59 22 495 598 -19 385 375 98 -45
1430 -45 -417 -80 -263 -202 -305 -543 -322 -160 -462 -106 -228 -407 -21 -210 -138 -57 330 522 262 159 364
1451 364 378 330 365 367 354 352 23 136 -266 -203 -130 -541 -234 -97 -241 -330 -418 -442 -280 197 -277 -82 -23 -61 -173
1476 -173 -63 431 206 332 290 121 138 215 308 332 200 117 190 -37 -483 -6 -198 -87 -400 -334 -75 -167 -368
1499 -368 -221 -36 -59 -383 -338 -286 -179 -171 -86 213 295 350 268 202 305 303 418 202 213 -16 68 416 -55 -13 162
1524 162 98 7 -214 -82 -51 -101 -356 -338 -146 -335 -562 -428 -165 183 -254 230 379 157 437 491 397 402 370
1547 370 378 -91 -176 -66 -186 -126 -265 -145 -220 -77 -74 -14 -118 26 -21 -126 -166 -189 -52 58 -416 -208 23 -279
1571 -279 -95 464 546 184 373 279 501 324 162 57 309 195 -128 -19 -310 -390 -312 40 -462 -338 -145
1592 -145 -318 -353 -301 55 -122 62 -36 22 176 -89 -185 80 382 65 294 321 -111 472 298 138 69 293
1614 293 300 113 109 -32 -283 -50 -365 -205 -308 -302 -291 -274 -320 -85 123 -260 -35 86 -76 137 203 98 420
1637 420 97 -30 206 353 458 92 161 -50 25 24 103 -21 -73 -134 -384 -206 -67 -317 -76 -524 -295 -124
1659 -124 15 102 -5 49 327 285 95 440 158 215 245 229 -134 59 229 29 105 -106 229 90 103 184 -70
1682 -70 -370 -106 75 -248 -424 -560 -314 -329 -312 -295 15 192 51 200 407 552 354 297 441 127 152 24
1704 24 180 -19 -405 -166 -155 89 18 -96 54 108 39 -59 108 -125 -501 -210 -144 -483 -483 -90 -33 59 272 49
1728 49 127 80 387 269 331 572 231 357 46 34 -121 -25 61 -171 62 -263 -254 -363 -225 -206 -236 -255 -166 -103 -6
1753 -6 -330 -233 -3 -51 -274 93 120 67 -15 4 628 90 319 526 230 246 147 52 -159 -62 123 -265 -323 -429
1777 -429 -393 -510 -275 -54 -249 -69 -57 59 38 29 16 495 112 113 152 -67 145 10 -74 106 130 166 3 227
1801 227 200 316 215 -57 89 -57 -218 -27 -464 40 -522 -232 -38 -171 -29 44 -114 -16 67 221 245 110
1823 110 19 232 460 193 360 26 71 158 299 -74 50 123 66 -158 -412 -221 25 -371 -350 -312 -181 -176 -186
1846 -186 -13 65 -177 127 133 -80 65 63 151 348 348 380 503 130 500 232 16 -133 -127 14 -259 -529 -171 -320
1870 -320 -513 -131 -72 111 -12 -242 -151 174 -250 278 43 -90 -139 -104 62 403 152 498 310 133 125 118 272
1893 272 280 123 188 165 -259 -121 89 -276 -116 -301 -245 -313 -368 -366 -317 -43 -17 -258 58 294 -193 -115 254 323
1917 323 69 -10 13 85 65 103 292 434 119 150 120 266 -74 -86 419 -165 -159 -400 -181 -164 -274 -370 -70 -350
1941 -350 -318 -68 51 217 75 202 87 329 100 321 356 284 -100 -47 117 6 -66 -53 -16 -256 74 -203
1963 -203 -94 -60 92 50 -113 -336 -49 -231 -132 -399 -103 59 -163 -146 156 68 -59 -21 321 598 267 498
1985 498 414 152 101 123 51 -143 -133 -229 -274 -350 57 -171 156 -125 -266 -185 -17 -150 -199 92 -377 -9 -135
2008 -135 141 358 117 163 91 124 -26 89 257 252 86 256 181 -116 -197 -142 -265 -186 -477 -312 0 -207 -327
2031 -327 -29 -140 -167 33 162 23 195 49 -144 -73 278 139 -80 144 172 62 226 -58 91 235 -61
2052 -61 102 209 -334 -21 -261 -125 -188 -119 30 -110 -91 -126 -158 -174 27 152 -80 201 22 138 0 -58 354
2075 354 52 284 427 140 299 129 -239 -132 205 257 -183 -142 -310 8 -117 8 -423 -277 -242 -345 -95
2096 -95 7 -76 -43 101 241 311 370 134 258 237 124 321 -26 429 -125 -6 -49 -185 -20 -129 -207 117 -405
2119 -405 27 -40 162 -188 -6 -91 -213 82 -36 -41 -234 -57 -187 -268 101 85 202 386 181 232 233 531 -9
2142 -9 292 122 146 160 82 261 -102 -37 75 105 57 -87 -169 -250 -316 -214 -416 -77 -115 -182 -41 68 -82 244
2166 244 164 358 142 209 364 388 240 158 -5 51 -123 -84 -181 -200 43 -250 54 78 45 -241 -264 -121 13 165
2190 165 -164 -111 81 -185 10 -110 77 -3 382 215 310 195 101 -189 94 235 -130 -35 -65 -83 -426 -168
2212 -168 -31 15 -39 72 144 204 -171 -9 117 -26 -166 -8 27 -2 68 -103 -200 267 102 285 -138 -116 26
2235 26 160 195 281 221 -70 -62 -4 21 -235 -262 -54 -220 -65 -301 -239 -191 23 61 -452 136 54 -22 65 219 82
2260 82 82 88 79 126 192 -22 78 155 481 236 18 88 8 -87 -69 140 96 -322 -353 -228 -266 -257 -519 -190 49 -163
2286 -163 70 90 25 366 203 -65 120 209 179 127 216 169 -102 -56 -39 125 43 -160 -89 -51 262 -87 58 -290
2310 -290 -468 -102 -276 -152 -33 -161 -79 128 -59 242 190 16 74 69 146 265 -133 -29 304 1 151 -115
2332 -115 111 224 60 -71 47 -236 55 -206 -183 -136 -262 -144 -30 -157 -343 -134 -73 -78 -113 -76 259 22
2354 22 196 63 104 206 143 75 110 6 3 200 -147 -216 -104 72 119 -128 -38 9 -121 -135 -191 -81 -61 -29 -23 16
2380 16 260 -143 -139 128 317 67 -16 165 106 439 -24 -196 154 107 95 12 -245 44 -116 -73 -266 56 -13
2403 -13 109 77 -164 62 124 64 84 9 -133 102 -2 2 -30 -33 -14 -46 14 113 212 487 240 518 191 73 24 92
2429 92 -200 -64 -147 -194 -147 -107 -269 -233 -158 -2 -26 287 -178 -125 244 211 301 48 -39 -2 76 75 203 79 399
2454 399 308 307 310 382 4 44 -51 -91 52 3 -311 -81 -222 -52 3 -205 214 -205 -190 97 -14 89 183 46
2478 46 212 54 308 -7 -51 186 126 -38 107 25 -192 -87 -92 -249 20 -156 -48 -46 -148 -220 -146 54 107 23
2502 23 -31 -374 37 -137 -70 -130 144 -29 -106 238 33 232 -133 -30 179 141 157 145 225 53 -227 -68 -67 -186
2526 -186 -60 56 -87 -65 -216 -237 -32 -31 -103 -75 176 -193 80 128 307 285 201 375 244 -53 -84 38 -97
2549 -97 -34 107 18 -68 -145 -119 25 -26 -269 -307 -178 295 13 -29 160 -181 -334 -217 -39 333 -32 66 53 408
2573 408 177 186 36 164 182 67 36 -26 57 -132 -113 10 -242 -111 -133 -73 -222 47 -6 -67 -71 -142 -186 -222 -1
2598 -1 -143 -15 -44 65 89 100 53 220 200 -52 -58 64 250 -27 218 51 141 -73 53 -15 -186 -9 45 -100
2622 -100 -50 -189 -149 -138 -4 -265 4 -217 -121 75 123 258 181 32 -40 87 322 168 114 259 -116 237 146
2645 146 262 -85 16 -122 -20 -70 -317 -36 218 -36 53 -137 -150 -78 142 62 -114 190 -57 46 -19 35
2667 35 -109 -25 97 90 82 100 121 14 134 455 -74 74 38 26 68 -94 -72 -95 -376 -252 -161 -42 -86 -121 52
2692 52 -94 -170 -91 83 378 156 -82 72 164 202 -131 27 -82 -9 242 -251 20 201 -63 -27 18 -94 -19
2715 -19 -169 59 23 112 134 16 -125 -120 -161 222 156 299 -70 20 154 203 190 -14 -16 283 -108 -128 81 45 -57
2740 -57 12 135 -26 128 -128 16 -125 10 217 223 -18 85 -223 -217 13 112 -226 81 41 34 151 304 -7
2763 -7 94 214 164 24 81 40 -14 -124 -80 -99 -145 -237 -35 -188 -289 69 -200 40 -73 -145 -82 -24 48 -41 -23
2788 -23 233 128 335 27 334 97 -93 101 -113 44 -280 -52 18 9 43 -276 17 -165 -217 -207 77 -363
2810 -363 -189 44 -241 145 -109 -48 24 -36 -20 64 -27 34 179 246 -6 252 126 167 197 117 183 16 136 206
2834 206 -126 48 -138 -51 -91 -206 -204 -7 -248 25 -32 -181 134 -58 139 55 153 22 9 156 290 -145 211
2857 211 43 -102 209 280 141 55 56 -88 171 -361 -68 64 -195 -431 -124 -201 -282 -51 -128 -310 25 54 -72
2880 -72 70 25 18 261 277 204 316 64 116 -50 -66 -24 -106 104 -175 -100 -218 -162 -125 16 -64 -280 43 -36 -135
2905 -135 30 -205 -218 -209 -143 -97 298 -124 49 53 -20 105 28 123 -33 139 142 74 -74 25 -55 83 -308 -237 38
2930 38 -41 -209 250 -45 -120 134 40 -145 -165 21 -94 10 -84 -31 51 165 70 18 -73 8 92 118 298 43 77
2955 77 3 249 277 82 144 54 -92 21 -133 435 -141 -152 -270 -218 -59 25 -29 -5 191 -12 -48 -114 30 123
2979 123 -55 141 4 156 111 2 -96 3 -130 -186 -128 78 -58 -188 -131 -131 171 -260 -24 -119 -6 250 14
3002 14 48 33 20 -67 -139 -12 -56 180 -277 -49 203 277 307 308 266 -24 20 -6 88 443 -165 -80 -193 101 -23
3027 -23 -313 111 -120 -303 -115 -228 25 -114 -14 -425 83 -88 8 259 18 202 90 77 232 52 60 193
3049 193 188 166 15 -163 -78 -303 -46 -252 -240 -66 9 -27 -141 101 43 -163 111 8 23 355 143 13 165
3072 165 298 61 -42 267 -200 37 57 108 51 195 145 92 22 69 157 146 5 240 -50 -266 52 -51 -42 -51
3096 -51 -237 -9 -204 -323 199 -6 202 -80 144 92 334 238 -31 -212 -86 43 -61 178 28 -239 21
3117 21 14 -133 -53 -187 -61 -259 -324 -277 -214 -115 -200 -44 -495 -140 -35 -199 65 109 163 94 239 191 159 -41 -93
3142 -93 -58 135 68 125 -218 -155 -63 6 -72 -7 38 -107 30 -214 -90 -271 -142 -33 4 -83 116 -132 101 303
3166 303 126 -191 8 27 18 89 -28 100 81 19 -3 -70 -245 -460 51 53 -116 -79 29 -160 -78 26 6 -90 -62
3191 -62 -218 -162 165 -73 -7 369 87 -218 69 98 254 -6 298 168 167 97 77 183 134 -131 -268 -201 -36
3214 -36 -268 -89 -58 45 -215 -103 215 20 -16 72 -208 19 80 231 3 -13 92 -224 22 -48 66 -132
3236 -132 227 165 37 -97 204 -117 9 -217 -170 152 -10 -77 -15 29 -137 -83 -76 -56 -16 170 34 -24 214 -24
3260 -24 59 -64 10 121 296 29 -88 26 147 186 165 -14 -153 -1 36 -66 4 -172 -105 80 49 -49 -24 8
3284 8 -215 -11 2 162 -74 -20 -31 179 214 103 -60 320 194 69 -141 132 21 134 -87 17 90 120 -106
3307 -106 -155 -214 59 -106 13 2 -155 -77 -70 38 85 190 -128 36 142 -152 69 65 68 129 -46 158 110 -11
3331 -11 -31 84 27 92 -362 154 -26 -136 -66 31 13 -94 -67 179 -86 79 -154 127 47 199 -50 117 67
3354 67 -95 85 22 -201 -70 -37 99 177 53 1 102 -19 -41 -20 -149 72 195 -333 12 -17 -177 21 176
3377 176 -174 98 196 -2 -193 -144 -131 12 -33 31 -5 -153 -164 196 -2 168 7 149 153 340 -39 -69 -135 -153
3401 -153 -76 -265 -361 35 -5 95 131 19 -23 10 -31 79 -13 -179 93 222 285 1 140 171 202 -21 108 72
3425 72 191 -31 -291 117 116 -353 71 -226 -158 -344 -141 -58 -85 72 -33 -86 203 40 -89 -140 131 107 -97
3448 -97 16 -73 207 164 230 169 103 264 -39 69 -46 -13 -9 -112 -8 70 -14 -177 82 -10 13 98 217 67 -29
3473 -29 20 -52 246 94 1 161 336 83 0 -51 65 252 69 -186 55 179 161 153 -145 60 13 -60 -257 105
3497 105 -208 -132 -15 179 216 -32 -125 -10 85 14 -106 32 -105 107 132 -89 178 10 -95 -76 137 150 57
3520 57 161 23 -144 -51 -38 -68 -93 215 -171 -35 119 -279 -39 -8 50 -253 24 -128 104 137 362 -96 -26
3543 -26 112 -15 101 242 30 251 92 23 213 -78 -344 40 -51 1 -18 -261 -123 60 -84 -6 -77 -42 109
3566 109 -164 154 7 228 1 119 232 200 31 60 21 -193 -32 107 -85 -86 -145 175 -29 -85 231 32
3588 32 -42 -185 46 27 188 -122 -217 -208 204 91 -96 114 -8 -69 -122 103 469 109 130 16 118 -11 -50
3611 -50 -71 58 -110 73 -31 -86 8 -119 313 -23 81 -6 -36 107 -69 -218 -43 153 -93 -76 -111 92 8
3634 8 186 -36 17 91 129 313 -120 96 -55 71 103 350 -104 -79 17 163 -342 -167 -31 28 -87 12 86 -137
3658 -137 -262 -29 -124 87 39 232 -51 98 130 -80 264 -174 107 131 -48 0 26 -39 216 73 154 258 -5
3681 -5 -2 -93 -75 128 61 169 -96 -299 -50 -121 -171 -125 228 -252 279 48 -97 33 106 189 8 130 -82 37
3705 37 222 -221 45 84 185 -6 -67 -176 -87 -84 23 -6 -65 -1 8 57 -132 -203 -97 58 221 205 37 25 -255
3730 -255 130 30 -239 -143 -165 255 119 190 145 -7 11 73 95 -48 -157 -34 -166 -86 -76 132 -44 -15 -150
3753 -150 -78 2 -9 166 84 -6 7 9 -3 31 70 37 126 -26 -55 120 -64 67 187 148 -185 45 228 222 273 -228
3779 -228 -92 -136 98 -184 -208 -317 -12 -78 282 -122 110 -58 -34 425 113 -132 323 212 -220 41 40 -130
3801 -130 -90 72 -263 -53 -54 -288 -130 -133 -83 -164 -31 -16 -114 213 -44 169 -127 -3 -51 -116 109 84 33 80 -43
3826 -43 -230 162 -97 -168 -55 57 211 30 110 -38 42 99 -35 -171 -100 138 -114 -55 -40 -293 30 -66 -26
3849 -26 4 -147 134 260 7 210 271 -86 48 -36 3 212 235 -3 -112 154 357 34 -124 36 122 -173
3871 -173 -107 -6 -76 5 123 -92 118 131 176 -83 -359 -81 -85 68 -99 -103 -98 111 -62 258 -104 202 10 150
3895 150 106 -29 55 88 -298 171 280 -51 -93 -186 -101 14 92 205 102 -189 96 -119 74 260 3 129
3917 129 146 -53 34 37 -97 36 15 105 183 107 118 -126 -144 -46 -203 -94 71 24 23 -64 -140 -18 148 128 55 -138
3943 -138 170 -23 185 56 -245 77 166 -132 167 143 -67 144 -3 -93 100 -175 -113 12 -141 71 137 148
3965 148 25 128 5 -14 51 193 93 -153 -9 64 61 35 -74 82 -99 145 242 16 -20 -125 91 256 -129
3988 -129 -99 -40 36 96 3 80 -162 -26 -83 -63 95 -74 93 106 -190 55 330 120 13 -105 -8 14 15 -148
4012 -148 148 -94 80 3 72 -78 25 -278 -100 98 -213 38 177 -245 -2 -89 159 176 -63 -14 -135 -109
4034 -109 -63 -98 -181 8 157 130 160 -68 -206 -84 89 102 58 -6 146 39 23 56 72 -137 267 76 -285 -127
4058 -127 -146 -107 -38 2 54 -24 92 111 -134 71 -172 194 384 -49 211 26 37 -184 50 168 -221 4 -140
4081 -140 24 -2 -128 -133 240 139 14 -142 9 -42 -126 49 -95 39 13 -125 308 -41 -38 120 20 90 -85
4104 -85 -13 2 173 -113 -215 -83 92 89 75 -81 -207 -62 158 75 -29 -70 18 -70 -150 -115 -157 -67 -121 173 69
4129 69 136 -159 99 -143 -251 167 64 -83 -13 121 -9 135 -104 495 90 138 -142 -98 -103 -141 -11 -48 -212
4152 -212 8 -144 100 -71 79 108 101 18 61 -76 -96 -18 83 53 33 8 -203 114 142 108 103 -139 274 -43 154
4177 154 108 40 99 134 29 -119 -62 -200 -238 -82 -170 44 -140 157 -165 86 60 36 74 -209 53 71 22 164
4201 164 -46 169 -179 59 -28 -105 -42 1 191 6 38 -240 -35 -154 87 -131 270 2 19 -172 -1 153
4223 153 -167 69 -106 -2 28 -144 174 -47 -45 196 -3 1 52 106 -100 -53 36 246 -163 1 33 30 195 -15
4247 -15 -249 -88 -67 -135 -125 110 225 -42 68 128 -50 -39 84 -38 96 -86 -11 211 -21 124 -130 4
4269 4 98 150 141 193 -192 43 -124 -30 -130 8 -131 237 163 315 3 -12 -229 -11 -70 76 201 -48 114 119
4293 119 206 -91 16 -86 53 138 123 6 227 -21 -168 -74 84 -203 -53 -104 29 -178 -167 -156 -118 -132 99
4316 99 20 92 -16 42 139 61 94 -14 247 -74 1 55 120 -197 41 19 -125 -64 -12 -134 -216 -174 -33 -94 -200
4341 -200 -235 -119 -5 -138 -255 -106 73 123 131 193 -322 -108 193 -8 -21 -37 91 151 -18 -20 241 220 -133 2
4365 2 34 -36 12 -123 106 44 -180 -138 -27 -12 -19 27 -49 66 -129 18 98 29 -266 -28 -59 67 -34 54 192
4390 192 120 15 163 251 -14 56 -90 -33 142 -4 -122 -19 -58 -32 165 93 55 35 60 -69 34 64 35 123
4414 123 204 -75 -33 66 -109 246 88 -69 -53 100 -256 -90 -77 -165 -51 1 69 -61 21 228 56 2 34 -54
4438 -54 -81 32 -92 -202 -201 20 155 193 81 -34 -87 -51 -206 122 63 102 -137 -20 -41 43 140 41 -210 42
4462 42 -11 -49 43 -2 -77 -289 16 -117 -56 260 -43 -152 107 304 145 19 -39 125 73 31 27 -172 -18 129
4486 129 307 -41 235 41 180 -130 -143 -38 -114 -45 -13 14 20 32 94 150 43 180 110 81 -254 168 104 -38
4510 -38 96 -108 25 126 -75 41 190 -356 90 194 -253 -155 -43 134 -183 -224 12 2 210 -91 -41 29
4532 29 65 43 125 -190 134 114 -40 229 40 -45 -3 -2 -102 -60 -114 -48 265 -122 23 -76 37 -34 -110 73 63
4557 63 -164 -5 123 -43 95 9 158 -20 -207 -42 13 -53 -97 113 4 68 -104 -178 37 -62 -127 27 -110
4580 -110 204 -5 40 -98 136 -37 -140 -124 49 -106 3 -215 -51 -59 0 -125 -254 -111 -118 41 33 70 -100
4603 -100 -89 9 91 48 86 9 -45 -36 -73 57 -54 -79 46 -10 60 -164 -54 -151 20 -8 103 39 149 15 212
4628 212 249 -4 18 0 73 -125 118 -21 249 190 -77 32 -153 -158 -102 -115 -142 169 -70 -87 245 -89 -268 161
4652 161 -62 143 84 -36 -13 155 -16 -93 31 -63 -63 -269 156 -29 -27 107 -7 87 -109 177 39 174 -194
4675 -194 145 12 -83 263 -46 81 294 -44 62 -143 -66 -195 39 83 -91 95 -184 319 -19 45 -162
4696 -162 -9 46 100 -64 -171 101 255 416 -169 -195 13 150 -21 -135 -201 99 -136 -186 -124 34 -43 -89 -128
4719 -128 -173 -175 -66 -42 110 156 169 -143 -152 89 -36 39 88 12 29 133 37 63 28 -77 183 99 147 320 -71 98
4745 98 -148 -127 -33 252 -118 -5 -107 30 -3 24 -106 194 -166 -75 -197 56 37 -66 -116 -11 -71 -137 29
4768 29 70 11 -26 135 29 41 -169 -5 166 -110 212 74 -96 -217 -50 -353 -77 -63 -138 -8 -23 141 15
4791 15 44 -107 127 57 -19 -19 16 -237 -8 -66 -52 274 -135 -61 -122 29 -123 -119 -114 3 -128 -173 -253 -143 -193 -64
4817 -64 277 -287 -112 156 20 234 47 63 95 236 157 -22 46 125 -163 63 -32 27 -226 -173 -55 -174 -139
4840 -139 -229 -60 -63 -125 67 -261 97 109 -160 -41 -223 -240 12 -25 195 -116 158 -4 276 1 -147 -26
4862 -26 7 -105 -122 -118 -81 -19 103 -104 110 -86 -240 -2 73 -100 6 -119 -120 -164 -201 -99 98 90 10 215 -137
4887 -137 543 -3 221 -233 97 96 106 0 -294 35 -28 -108 51 -44 15 -41 11 -80 1 -128 -51 -132 19 53 6
4912 6 112 12 -92 -9 -87 -223 206 75 163 180 -91 36 319 -13 131 -49 33 39 43 122 -186 -149 -74 -43 70
4937 70 0 -120 197 156 115 -93 136 161 -217 106 -1 11 113 183 -260 -51 -86 315 -134 -300 301 -2 301
4960 301 13 -38 -25 -148 -18 -1 -67 335 25 -189 -23 -140 202 -61 27 -70 -105 -171 -173 -157 -185 78 69 -29 160
4985 160 -17 -21 -56 56 -148 -132 -13 180 373 -188 -30 -187 -10 30 -93 -90 -39 -17 -217 91 -69 148 15
5008 15 -49 -77 120 -104 -189 40 210 44 -108 -82 83 240 -58 -370 -4 -11 -56 212 -113 -104 80 74 -286 140
5032 140 38 -245 -191 -40 -11 -36 156 -69 -4 -111 92 148 8 242 112 184 -45 146 -63 82 26 -137
5054 -137 -63 -35 49 18 96 26 -164 -29 -286 -25 57 -155 -149 -81 69 -8 14 -65 147 97 129 123 -129 -167 -68 9 -21
5081 -21 -201 66 172 -6 -56 121 -35 -136 -7 103 139 62 -7 26 -78 135 62 -227 -8 267 -18 -25 -56
5104 -56 57 -119 81 243 36 -149 149 40 39 -84 5 -195 -11 86 16 57 -15 121 170 -74 -59 -176 157
5127 157 -44 -194 -83 -97 98 17 -40 62 -105 -33 10 -186 262 327 -58 -16 14 18 125 116 -255 -62 44 21
5151 21 -213 -206 -147 -125 -94 -64 52 50 -138 23 -36 -18 85 -172 -13 -244 134 86 47 304 99 136 -4 -103 -39
5176 -39 205 -47 -98 0 -89 24 -243 -10 72 97 -113 -133 -76 -46 -169 -9 -216 231 109 -51 47 -42 1 172
5200 172 48 20 -156 195 -144 -52 -348 -69 -181 247 1 47 -84 50 -6 58 10 -43 -60 -176 -266 -146 199
5223 199 80 68 -123 117 -168 150 -8 -31 -52 201 -130 -26 -147 191 31 -190 107 -88 -5 369 178
5244 178 -3 -214 -22 111 99 -3 -160 27 -46 -72 -36 162 30 -67 135 201 -31 169 105 21 -200 -119 7
5267 7 -3 -173 124 90 37 -23 -151 132 44 -127 183 -123 51 40 25 198 79 92 -20 -150 -22 22 -5 -331
5291 -331 -96 -108 41 53 100 247 172 32 127 -119 77 396 -52 139 -159 153 94 -182 -196 -43 -326 -180
5313 -180 -52 22 -337 -85 137 135 161 68 119 -93 -124 251 343 176 44 -6 -120 -77 -6 75 -3 -11 -23 0 41 -62
5339 -62 6 3 -193 -101 -263 -12 221 134 -63 -107 -247 -118 55 91 24 -98 -96 74 -99 255 -101 218 183 29
5363 29 -36 122 54 50 175 34 -149 -229 19 -32 61 -148 -71 59 -101 -159 -89 86 -3 -183 8 -26 -269 -123
5387 -123 103 156 48 31 -42 -204 -22 -146 -261 -12 -84 -25 126 -80 141 41 -54 21 -203 23 -137 -30
5409 -30 97 -124 -12 94 88 -173 -169 280 -36 227 36 127 -48 90 -173 -99 14 -226 263 21 54 -77 -187
5432 -187 -32 -155 -136 -6 -187 44 -108 -110 54 123 17 -45 -161 -203 79 -193 59 26 -4 92 185 -5 -166
5455 -166 -126 -168 21 100 106 323 -42 30 -56 -94 188 -293 -173 147 -279 -156 163 -101 -38 25 -440 147 51 -8
5479 -8 52 52 242 -130 -30 63 -5 -23 -97 169 -206 -53 -178 -1 -129 -97 127 17 20 -91 342 127 -109 119
5503 119 40 162 49 7 148 164 86 72 -142 90 183 91 78 41 -147 -94 65 -247 -97 99 -18 -287 -93
5526 -93 18 -301 -110 112 -154 -121 -349 7 -32 87 105 193 -217 38 -14 -25 167 36 52 -32 126 56 286
5549 286 125 15 -22 172 76 -35 9 5 -37 -57 -2 -183 59 186 -123 -27 128 -87 -46 163 -5 -23 121 145
5573 145 50 198 141 -104 286 -233 -47 11 102 104 -137 64 32 48 -73 -249 85 -98 -217 -99 -58 129 -107
5596 -107 -201 -103 228 -1 -135 192 78 -316 121 104 180 139 -235 48 -52 187 110 113 109 -174 -15 -11 -152 -137
5620 -137 14 354 -173 -94 -25 -293 -128 61 198 -15 -111 -8 -174 155 9 -77 79 8 96 99 -159 290 -57
5643 -57 70 75 33 3 -12 -128 72 -63 -31 -67 262 -138 -8 -54 -14 -53 108 -130 -108 -225 71 14 -62 -42 78
5668 78 -72 15 -184 -261 41 11 263 66 216 -85 112 93 62 -117 27 132 244 -50 -250 -77 -39 -39 -8
5691 -8 99 -92 -110 -35 115 340 -226 -80 -3 221 -35 188 -137 85 -130 118 156 30 201 -102 -167 -121 11
5714 11 -82 -210 -79 8 -69 -125 37 -162 -58 -16 -84 -118 -247 140 112 -8 139 -230 161 -15 -104 -16 66 77
5738 77 145 137 -164 163 32 238 -98 35 49 -189 -60 45 150 -249 -62 -10 89 90 -118 31 89 41 -253 -74
5762 -74 151 -94 234 32 -137 50 -97 25 105 -102 -25 -45 -76 -73 -11 12 131 -156 125 169 -188 70 -138
5785 -138 84 -42 80 -72 75 28 15 192 205 -85 -149 -38 6 8 -9 -21 -212 158 159 32 -61 16 -66 74 -8
5810 -8 -136 89 -143 -80 -10 184 -116 -154 92 104 -137 172 227 106 -118 194 47 -24 -66 -99 56 -41 162 -51
5834 -51 93 13 -31 165 -58 77 -243 40 -92 151 2 -237 212 -5 -16 -70 114 19 -29 142 38 -128
5856 -128 -74 73 -54 9 90 -183 61 -29 82 -71 -314 -18 -64 -208 -55 -79 -157 96 0 -67 -222 -214 -78 -4
5880 -4 5 141 -42 37 -190 49 77 127 252 -14 -180 -72 59 243 -120 -38 -480 -3 -448 17 261 85 251
5903 251 26 82 -207 187 218 51 158 -87 40 168 58 -76 -136 142 200 -62 -68 83 78 -53 67 -117 19
5926 19 82 -230 65 7 -66 -129 213 -215 154 194 -66 -47 -94 -162 11 179 2 -122 37 -219 -92 148 36
5949 36 32 140 23 67 76 28 103 -210 -21 145 338 -77 -130 213 -11 -74 -83 -183 -109 105 114 212 -147 -65 94 114
5975 114 -77 84 129 383 -39 282 -184 -52 -36 -49 -62 -45 -150 62 12 56 60 27 -57 -127 -25 -150 -108 -94 140
6000 140 -9 209 96 139 -98 29 4 4 76 322 53 -97 81 44 -43 154 131 44 35 -90 118 -177 57 -136
6024 -136 104 -52 -23 -101 -84 125 -31 59 -125 57 49 -13 17 -224 134 -117 226 175 127 -150 69 97 32 -28
6048 -28 -17 -70 -71 -215 110 51 -127 -165 72 -29 -161 -33 -31 -7 227 -176 137 56 -144 187 156 246 -61 -161
6072 -161 -37 -8 75 -152 -20 47 65 56 201 11 -22 138 41 -112 -29 41 21 332 123 -97 -146 95 13 -125
6096 -125 -119 -183 -118 252 -6 245 -78 -48 43 -46 -37 -41 -59 -67 114 75 -115 250 108 -109 -14 71 -134 -40 16 -129
6122 -129 -25 37 -35 50 90 -9 128 36 74 154 267 -128 -202 187 -112 -11 -178 -36 -28 -80 -70 -56 -52 133 -107
6147 -107 13 7 -81 30 84 -98 115 148 45 178 -329 150 -19 73 60 86 -190 -246 279 38 -24 73 57 229
6171 229 52 28 11 12 6 61 -245 118 -72 -202 22 114 -70 -132 -8 9 -90 115 -66 -47 208 -22 -91 277
6195 277 -77 -184 -91 137 -64 184 31 -284 -82 -92 175 -172 86 -60 -104 -170 95 0 -131 128 -49 66
6217 66 202 -7 44 -45 -72 63 -172 92 -129 28 252 -12 136 50 -296 113 -132 99 83 -118 -34 -70 -12
6240 -12 19 -120 -168 -30 51 137 -100 72 309 30 336 16 63 93 -196 -140 66 -105 179 21 -8 -5 162 -33
6264 -33 -37 -15 134 11 -152 204 -158 98 -115 -133 -20 14 -147 -155 -104 -152 -293 -142 -192 -212 -5 21 -84 -15 329
6289 329 -272 109 -103 13 98 -157 84 21 -185 188 -168 93 33 -9 -278 -114 22 -39 66 115 -189 -37
6311 -37 290 -367 -53 91 -146 77 -73 54 226 -129 104 -102 -28 108 -21 206 70 -3 236 -188 -54
6332 -54 53 -21 -88 -46 -201 46 85 137 -6 -242 -6 87 -146 79 -50 97 21 39 -116 -275 -157 -44 241
6355 241 -55 17 36 110 44 -49 87 -102 11 -35 -150 91 8 -40 -177 18 36 110 -42 8 -42 -310 -179 -148
6379 -148 -7 -215 -169 -119 -143 -83 -230 -124 -158 23 3 -168 105 -107 -132 24 -83 -124 332 70 -177 -203 106
6402 106 -183 70 -240 -95 -170 -17 140 132 -39 -16 -21 -198 283 23 115 -81 -213 -105 94 -14 134 -85
6424 -85 -12 102 -214 63 55 -186 1 -55 -173 -107 -88 -59 -73 12 -114 -162 -47 82 -15 34 -40 33 10 -7 32 -123
6450 -123 -25 -184 80 123 -182 -44 -81 209 55 42 -94 -35 -216 -123 -111 81 -143 -149 12 62 -105 -159 -119 6
6474 6 -168 -48 92 69 102 -147 368 178 140 122 -53 -161 -345 -61 -92 -20 -25 -169 8 171 -272 153 -3
6497 -3 25 1 315 -145 -13 98 207 180 -109 72 56 -230 -90 334 -27 30 253 67 -8 103 -17 116 -36
6520 -36 -20 22 94 27 -4 -56 -121 49 -47 -100 -1 -170 127 16 -76 147 31 76 -172 226 140 57 89 130 36 -59
6546 -59 -85 -125 33 251 -56 -104 -111 -33 -38 -134 -56 -152 -60 -162 -112 -72 -306 -36 -107 80 -132 -71 87 -96 162 25
6572 25 -24 191 -79 172 45 143 -105 53 191 56 -49 -58 -162 151 -22 -4 134 -248 -146 -86 17 -219
6594 -219 29 -295 116 9 204 98 160 12 156 -153 140 73 124 -105 34 -126 -46 -17 118 -47 -173 -35
6616 -35 123 40 -8 -33 -53 234 140 -13 103 107 22 96 -61 152 11 -142 -92 -52 -94 -202 79 29 -128 -296 15
6641 15 235 134 229 50 151 -65 -161 -28 82 254 -5 305 -180 65 64 -6 55 181 -133 60 38 170 1
6664 1 82 95 6 -89 86 54 36 -86 -135 -182 54 16 -192 119 -74 107 38 46 -26 32 -36 -74 -83 142 46 157 81
6691 81 -192 103 87 350 -127 -85 -144 -27 62 -142 50 14 -50 -331 -86 -29 63 203 -167 -309 220 51 151
6714 151 124 -39 -82 -236 165 117 94 65 34 18 -6 22 -89 -220 216 -157 -33 -28 -3 25 141 -70 -125 41 87
6739 87 61 318 106 71 -151 -193 -180 -214 -60 -57 14 -20 28 -29 -121 108 -169 218 -235 148 -248 27 -265 57
6763 57 195 -234 10 129 -4 134 -134 -152 -46 -137 14 -127 51 -43 226 170 -132 14 -196 121 6 -223
6785 -223 238 -96 69 -163 -119 -39 -92 295 89 124 95 -40 25 97 -20 268 168 66 64 -42 -151 -133 -128 -125 -153
6810 -153 92 116 -68 47 18 -17 -71 -73 90 105 -68 -77 85 51 13 -13 39 -242 -247 114 -31 301 -310 181 -102
6835 -102 159 183 43 -123 229 -63 81 106 -150 165 23 -88 -133 -20 131 -252 -52 -31 -38 11 244 148 213
6858 213 77 48 5 -16 -26 -97 25 150 -165 -174 -151 -186 -4 120 79 306 -221 -71 -86 85 83 -9 -84 100 -275
6883 -275 177 226 -109 -1 61 157 -49 -41 182 120 -41 -267 2 128 -76 -11 -35 -145 3 133 -192 -96 -48
6906 -48 -106 255 -169 34 56 105 87 88 -111 10 189 120 -95 -118 100 -51 4 8 247 18 138 108 9 47 30
6931 30 188 -121 -127 -206 14 32 21 -29 -216 -337 -290 -248 33 -81 -40 63 -65 -94 52 280 -296 52 38 86
6955 86 242 -97 -225 54 -228 22 18 72 -44 13 36 12 145 73 337 48 -144 -185 71 2 -11 -53 -257 120
6979 120 65 235 -25 80 -155 -81 -103 52 81 -235 53 -15 -56 133 13 -210 73 -149 -9 13 -42 -77 137
7002 137 -16 -91 113 -51 0 147 -20 -54 155 67 36 56 289 -73 -291 -53 -41 -33 -7 -89 -118 113 247 15
7026 15 -139 27 66 52 60 58 -27 -164 -209 20 -47 260 425 78 -131 -102 58 -78 -153 -135 -184 -51 60 -32 263
7051 263 -48 -167 -88 -51 -64 -96 -2 -183 205 -5 137 -32 132 117 135 103 -24 198 -126 171 -87 6 -13
7074 -13 -65 107 -87 58 -36 -26 71 -64 -269 -41 -17 -52 -173 161 27 -156 -111 18 102 -249 201 -154 22
7097 22 -11 253 -174 -14 144 -98 -65 58 -132 -58 -5 -211 -120 -117 -31 -77 -11 -12 127 -113 177 125 197 -224 -92
7122 -92 -36 76 -38 -17 127 133 -46 -24 -42 -8 -198 -140 92 12 -177 78 -190 53 219 379 -30 -80 186 61
7146 61 -39 33 -144 -56 -102 -241 188 155 1 144 -233 -137 -130 -230 57 -162 -113 251 -28 322 -207 -195 189
7169 189 290 -112 166 -164 -278 -118 37 -194 29 168 55 -211 -15 -48 51 -102 -8 41 -200 -99 151
7190 151 -66 50 109 -57 54 -94 188 128 165 84 5 -9 59 -42 -98 -52 -17 91 88 -9 -402 -67 -94 33 165
7215 165 95 100 6 -148 5 125 -91 -51 -62 -7 45 -217 -177 -129 -80 -113 17 102 209 -1 121 -116 99 83 -73
7240 -73 -87 0 113 244 -14 220 -110 -186 50 104 -165 92 -263 -11 -108 -14 -37 83 135 151 482 136 29
7263 29 -60 -187 -226 -111 106 30 -196 47 -100 -102 -166 98 -19 116 -114 -210 150 11 -54 -327 62 -144 3
7286 3 176 -27 -55 -79 126 6 55 117 15 16 -114 18 195 -90 -63 81 -21 10 -1 148 -126 -287 -4 105
7310 105 -80 -117 85 -82 81 -61 -111 111 -158 -45 102 33 -24 -49 -52 11 46 278 -52 51 5 -45 22 40
7334 40 -173 -90 -37 76 -20 5 -156 -16 -40 34 46 52 165 -295 -132 -12 -102 -188 -41 -157 262 -265 129 264
7358 264 -14 -69 -50 114 -169 -107 -203 -120 -101 67 -25 203 133 83 382 -30 -52 53 51 50 -113 -41 -131 204 -109
7383 -109 -4 96 -10 221 -93 48 23 -14 83 -4 89 134 -88 9 -1 -96 -166 0 23 60 46 -210 -169 143 20
7408 20 99 60 -7 -180 -52 125 -52 -121 -75 14 -35 71 94 220 -102 5 87 -106 -106 -13 172 -59 -158 -91 17
7433 17 -98 129 -49 97 -6 18 288 -47 -166 -42 -169 19 52 259 -49 185 21 -101 78 31 -58 -94
7455 -94 -114 -105 -120 52 -185 -290 -225 -195 -161 86 -55 -86 152 28 -27 -136 -222 118 54 -109 56 200 35 -194
7479 -194 293 -3 93 143 96 39 -51 15 49 68 4 56 -387 -156 -206 -144 103 -74 -293 -209 -51 48 102 -9 96
7504 96 -124 -176 -207 57 -153 66 86 -188 -200 18 -7 180 99 -115 -138 24 -49 290 -66 -89 18 -68 -32 183
7528 183 -322 -277 132 -166 114 -117 -43 -42 64 -206 11 -27 -179 -12 90 -219 -52 73 -139 -74 -103 40
7550 40 -97 -55 53 -37 -88 -8 -168 -85 -14 17 23 -109 -126 -233 166 146 -88 235 13 206 -102 -1 214 54
7574 54 202 -106 -200 133 -62 45 90 9 20 -33 123 13 -9 4 -126 -177 -83 13 -149 -104 146 -79 -39 115
7598 115 121 91 -30 30 94 66 -27 -29 -33 200 83 -147 -153 73 81 -92 -86 -109 39 78 -41 89 175 43 20 34 -278
7625 -278 14 -59 94 26 90 70 -170 -246 -16 170 107 -1 4 27 72 -217 -202 -91 77 1 13 89 -55 -8 -17 -173
7651 -173 -22 -122 43 -280 -223 -87 162 -6 -74 -38 -65 -350 -156 -242 -153 -80 -93 -209 129 196 299 123 -46
7674 -46 132 -290 170 -33 95 -117 15 -64 -40 132 86 119 39 102 -143 -203 -192 -15 -184 -104 -50 158 4 -97
7698 -97 77 -131 -54 25 -36 190 156 -31 -123 212 -100 -13 -115 34 98 -433 18 102 27 -114 25 138 161 240
7722 240 17 -71 160 -27 70 -82 46 -167 27 15 31 -231 21 124 -61 -112 80 -46 -162 -58 -22 171
7744 171 234 129 -331 -130 -45 -54 16 94 197 142 -114 -78 -41 -49 -126 -41 -203 -228 34 -37 -7 251 -76 -92 76 -45
7770 -45 293 29 72 140 -204 -178 12 5 -12 196 58 10 -100 -8 -230 236 -14 -42 -184 -74 127 36 191 -121
7794 -121 -7 -26 -89 60 -88 -245 19 -414 -90 -50 1 45 -322 44 -191 70 -127 91 109 39 52 -94 32
7817 32 -111 94 -42 36 -257 11 128 -98 198 110 -20 19 37 120 213 -33 -56 -9 134 102 -151 52 37 136
7841 136 189 91 -35 -65 -23 -47 -83 -33 61 -79 -36 48 -123 68 -74 -66 -20 -72 161 61 -190 87 187 46 134
7866 134 123 -189 -53 4 -29 199 -11 -152 84 88 183 -111 137 -75 4 -217 -108 -105 179 171 128 52 -85 -116 44
7891 44 8 -70 90 -121 93 -193 -152 101 279 -147 -208 42 -32 -34 -135 -179 155 44 64 110 -113 34 -57 -27
7915 -27 84 109 75 166 181 -41 -208 129 -79 30 -126 -147 110 80 49 -64 203 -46 -180 -242 -35 30 6 43
7939 43 -76 -75 -72 -190 -32 70 -252 161 -202 57 -359 12 -116 27 110 39 -11 2 -400 268 273 73 90 46
7963 46 -10 216 12 -28 180 312 -15 219 -202 19 175 -7 238 -31 -61 -33 -302 47 -48 -339 17 3
7985 3 -3 62 -88 -302 12 -32 -35 -54 -116 -50 78 -51 -9 94 65 -131 59 130 -35 132 -5 38 -15 66 -69 -146
8011 -146 -2 -299 135 -19 271 13 -176 90 -47 95 48 -59 162 105 149 17 -268 -95 -5 -1 -13 77 -143
8034 -143 56 -201 2 -100 -91 -100 -22 82 -38 -257 146 -103 62 -168 -60 339 -75 30 53 150 -51 -22 -38
8057 -38 21 -101 -89 105 -148 59 157 -49 -96 -87 42 39 -33 -299 -112 -42 -143 14 180 149 -76 -93 -21 -234 174
8082 174 218 25 -147 61 21 2 -125 -107 -87 168 150 -41 -38 70 163 -5 -24 -90 -31 -140 34 -245 278 326
8106 326 53 68 97 -61 70 55 -113 -104 58 -207 -81 -16 190 2 52 -102 -96 207 47 -208 63 -12 -143
8129 -143 39 79 199 199 32 -2 -140 -55 -72 -129 -88 37 -86 -41 56 161 -168 102 -138 -135 80 30 -7 -289 -15
8154 -15 -91 -155 100 194 -19 136 27 203 -92 12 147 -11 -53 118 -3 -177 190 -60 -233 133 -200 122
8176 122 -93 -118 186 183 -29 64 -157 13 136 58 -177 -110 45 287 -52
8191e2
##END NTUPLES=NMR FID
##END=
