##TITLE=1H_DPAH1702-12
 CDCl3
 8 sc, 
 11.03.2022
##JCAMPDX= 6.0         $$ Bruker NMR JCAMP-DX V2.0
##DATA TYPE= NMR FID
##DATA CLASS= NTUPLES
##ORIGIN= UXNMR, Bruker Analytische Messtechnik GmbH
##OWNER= root
$$ XWIN-NMR		Version 3.5
$$ Fri Mar 11 11:03:14 2022 Russian Standard Time (UT+4h)  she@DPX200
##.OBSERVE FREQUENCY= 200.131346
##.OBSERVE NUCLEUS= ^1H
##.DELAY= (6, 6)
##.ACQUISITION MODE= SIMULTANEOUS
##.ACQUISITION SCHEME= undefined
##.AVERAGES= 8
##.DIGITISER RES= 18
##SPECTROMETER/DATA SYSTEM= spect
##.PULSE SEQUENCE= zg30
##.SOLVENT NAME= CDCl3
##.SHIFT REFERENCE= (INTERNAL, CDCl3, 0, 15.7039)
##AUDIT TRAIL= $$ (NUMBER, WHEN, WHO, WHERE, WHAT)
$$ ##TITLE= Audit trail, XWIN-NMR		Version 3.5
$$ ##JCAMPDX= 5.01
$$ ##ORIGIN= Bruker BioSpin GmbH
$$ ##OWNER= she
$$ F:/spectra/data/she/nmr/H-F/1/audita.txt
$$ ##AUDIT TRAIL=  $$ (NUMBER, WHEN, WHO, WHERE, WHAT)
(   1,<2022-03-11 11:02:00.21 +0400>,<she>,<DPX200>,
      <created by zg, POWCHK disabled, PULCHK disabled
       configuration hash MD5:
       00 E9 B6 7A A2 85 ED C7 34 08 36 98 17 FE 4E 26
       data hash MD5: 16K
       B6 92 71 D0 86 C2 44 83 FB 95 A5 23 2C 82 68 D6>)
$$ ##END=
$$ 
$$ hash MD5
$$ 48 65 91 1C 91 ED 87 14 BD D6 E5 39 D4 A6 A6 79
##$RELAX= 
##$RELAX= 
##$RELAX= 
##$RELAX= 
##$RELAX= 
##$RELAX= 
$$ Bruker specific parameters
$$ --------------------------
##$DU= <F:/spectra>
##$EXPNO= 1
##$NAME= <H-F>
##$PROCNO= 1
##$TYPE= <nmr>
##$USER= <she>
##$AMP= (0..31)
100 100 100 100 100 100 100 100 100 100 100 100 100 100 100 100 100 100 
100 100 100 100 100 100 100 100 100 100 100 100 100 100 
##$AQSEQ= 0
##$AQ_mod= 1
##$AUNM= <au_zg>
##$AUTOPOS= <>
##$BF1= 200.13
##$BF2= 200.13
##$BF3= 200.13
##$BF4= 200.13
##$BF5= 200.13
##$BF6= 200.13
##$BF7= 200.13
##$BF8= 200.13
##$BYTORDA= 1
##$CFDGTYP= 0
##$CFRGTYP= 5
##$CHEMSTR= <none>
##$CNST= (0..31)
1 1 145 1 1 1 1 1 1 1 1 1 1 1 1 1 1 1 1 1 1 1 1 1 1 1 1 1 1 1 1 1 
##$CPDPRG= <>
##$CPDPRG1= <>
##$CPDPRG2= <>
##$CPDPRG3= <>
##$CPDPRG4= <mlev>
##$CPDPRG5= <mlev>
##$CPDPRG6= <mlev>
##$CPDPRG7= <mlev>
##$CPDPRG8= <mlev>
##$CPDPRGB= <>
##$CPDPRGT= <>
##$D= (0..31)
0 1.2 0 0 0 0 0 0 0 0.06 0 0.03 0 0 0 0 0.0002 0 0 0 0 0 0 0 0 0 0 0 0 
0 0 0 
##$DATE= 1646982119
##$DBL= (0..7)
120 120 120 120 120 120 120 120 
##$DBP= (0..7)
150 150 150 150 150 150 150 150 
##$DBP07= 0
##$DBPNAM0= <>
##$DBPNAM1= <>
##$DBPNAM2= <>
##$DBPNAM3= <>
##$DBPNAM4= <>
##$DBPNAM5= <>
##$DBPNAM6= <>
##$DBPNAM7= <>
##$DBPOAL= (0..7)
0.5 0.5 0.5 0.5 0.5 0.5 0.5 0.5 
##$DBPOFFS= (0..7)
0 0 0 0 0 0 0 0 
##$DE= 6
##$DECBNUC= <off>
##$DECIM= 32
##$DECNUC= <off>
##$DECSTAT= 4
##$DIGMOD= 1
##$DIGTYP= 9
##$DL= (0..7)
0 120 120 120 120 120 120 120 
##$DP= (0..7)
150 150 150 150 150 150 150 150 
##$DP07= 0
##$DPNAME0= <>
##$DPNAME1= <>
##$DPNAME2= <>
##$DPNAME3= <>
##$DPNAME4= <>
##$DPNAME5= <>
##$DPNAME6= <>
##$DPNAME7= <>
##$DPOAL= (0..7)
0.5 0.5 0.5 0.5 0.5 0.5 0.5 0.5 
##$DPOFFS= (0..7)
0 0 0 0 0 0 0 0 
##$DQDMODE= 0
##$DR= 18
##$DS= 0
##$DSLIST= <SSSSSSSSSSSSSSS>
$$ [...]
##$SUBNAM2= <"">
##$SUBNAM3= <"">
##$SUBNAM4= <"">
##$SUBNAM5= <"">
##$SUBNAM6= <"">
##$SUBNAM7= <"">
##$SUBNAM8= <"">
##$SUBNAM9= <"">
##$SW= 18.0517287032376
##$SWIBOX= (0..15)
0 0 2 0 0 0 0 0 0 0 0 0 0 0 0 0 
##$SW_h= 3612.71676300578
##$TD= 16384
##$TD0= 1
##$TE= 0
##$TE2= 300
##$TE3= 300
##$TEG= 300
##$TL= (0..7)
0 120 120 120 120 120 120 120 
##$TP= (0..7)
150 150 150 150 150 150 150 150 
##$TP07= 0
##$TPNAME0= <>
##$TPNAME1= <>
##$TPNAME2= <>
##$TPNAME3= <>
##$TPNAME4= <>
##$TPNAME5= <>
##$TPNAME6= <>
##$TPNAME7= <>
##$TPOAL= (0..7)
0.5 0.5 0.5 0.5 0.5 0.5 0.5 0.5 
##$TPOFFS= (0..7)
0 0 0 0 0 0 0 0 
##$TUNHIN= 0
##$TUNHOUT= 0
##$TUNXOUT= 0
##$USERA1= <user>
##$USERA2= <user>
##$USERA3= <user>
##$USERA4= <user>
##$USERA5= <user>
##$V9= 5
##$VALIST= <valist>
##$VCLIST= <CCCCCCCCCCCCCCC>
##$VD= 0
##$VDLIST= <DDDDDDDDDDDDDDD>
##$VPLIST= <PPPPPPPPPPPPPPP>
##$VTLIST= <TTTTTTTTTTTTTTT>
##$WBST= 1024
##$WBSW= 4
##$XGAIN= (0..3)
0 0 0 0 
##$XL= 0
##$YL= 0
##$YMAX_a= 537055
##$YMIN_a= -426504
##$ZGOPTNS= <>
##$ZL1= 120
##$ZL2= 120
##$ZL3= 120
##$ZL4= 120
##$ABSF1= 10
##$ABSF2= 0
##$ABSG= 5
##$ABSL= 3
##$ALPHA= 0
##$AQORDER= 0
##$ASSFAC= 0
##$ASSFACI= 0
##$ASSFACX= 0
##$ASSWID= 0
##$AUNMP= <proc_1d>
##$AZFE= 0.1
##$AZFW= 0.1
##$BCFW= 1
##$BC_mod= 2
##$BYTORDP= 1
##$COROFFS= 0
##$CY= 11.3945322036743
##$DATMOD= 1
##$DC= 2
##$DFILT= <>
##$DTYPP= 0
##$F1P= 2.36226072786647
##$F2P= -0.459571619588291
##$FCOR= 0.5
##$FTSIZE= 0
##$FT_mod= 4
##$GAMMA= 1
##$GB= 0.15
##$INTBC= 1
##$INTSCL= 1
##$ISEN= 128
##$LB= 0.24
##$LEV0= 0
##$LPBIN= 0
##$MAXI= 10000
##$MC2= 0
##$MEAN= 0
##$ME_mod= 0
##$MI= 1.114404
##$NCOEF= 0
##$NC_proc= 0
##$NLEV= 6
##$NOISF1= 3.799351
##$NOISF2= 2.8
##$NSP= 1
##$NTH_PI= 0
##$NZP= 0
##$OFFSET= 15.70392
##$PC= 1
##$PHC0= -16586.64
##$PHC1= 9.60078
##$PH_mod= 1
##$PKNL= yes
##$PPARMOD= 0
##$PSCAL= 0
##$PSIGN= 0
##$REVERSE= no
##$SF= 200.130013532006
##$SI= 16384
##$SIGF1= 3
##$SIGF2= 2
##$SINO= 400
##$SIOLD= 16384
##$SREGLST= <1H.CDCl3>
##$SSB= 0
##$STSI= 0
##$STSR= 0
##$SW_p= 3612.71676300578
##$SYMM= 0
##$S_DEV= 0
##$TDeff= 0
##$TDoff= 0
##$TI= <>
##$TILT= no
##$TM1= 0
##$TM2= 0
##$TOPLEV= 0
##$USERP1= <user>
##$USERP2= <user>
##$USERP3= <user>
##$USERP4= <user>
##$USERP5= <user>
##$WDW= 1
##$XDIM= 8192
##$YMAX_p= 0
##$YMIN_p= 0
$$ End of Bruker specific parameters
$$ ---------------------------------
##NTUPLES= NMR FID
##VAR_NAME=  TIME,          FID/REAL,        FID/IMAG
##SYMBOL=    X,             R,               I
##VAR_TYPE=  INDEPENDENT,   DEPENDENT,       DEPENDENT
##VAR_FORM=  AFFN,          ASDF,            ASDF
##VAR_DIM=   8192,          8192,            8192
##UNITS=     SECONDS,       ARBITRARY UNITS, ARBITRARY UNITS
##FACTOR=    0.0002768,     1,               1
##FIRST=     0,             0,               0
##LAST=      2.2672688,     0,               0
##MIN=       0,             -426504,         0
##MAX=       2.2672688,     537055,          0
$$ Real data points
##PAGE= N=1
##DATA TABLE= (X++(R..R)), XYDATA
0@%%%%%%%%qJ6j6J6k4L2m0N6o4Q0j04J20j44J76k08K41k82L30l85M49n19N95o82
$$ 0 0 0 0 0 0 0 0 0 -8 8 -8 8 -16 16 -24 32 -32 48 -56 64 -80 96 -112 129 -153 177 -208 241 -278 317 -365
31c65P80q86J005j136J280j438J615j807K015k247K502k779L082l411L768m159
$$ -365 415 -471 534 -602 678 -760 855 -952 1063 -1184 1318 -1461 1621 -1790 1978 -2181
47b181M586n056N574o142O764p451Q219r078J0039j1129J2377j3821J5511j7521
$$ -2181 2405 -2651 2923 -3219 3545 -3906 4313 -4765 5274 -5855 6522 -7299 8212 -9309
61i309J9966k3011K6923l2165L9601n1061P1243j17381M20964J91285l00729K20580
$$ -9309 10657 -12354 14569 -17596 22005 -29056 42187 -75194 345770 537055 236326 456906
73D56906k00412p4409K8308k73768l29400J10469m6382r7816J48486L3236j66706
$$ 456906 256494 182085 210393 -63375 -392775 -282306 -328688 -426504 -278018 -244782 -411488
84d11488J62867J98584L9298J55580J17083j49191K2281J70469k3949j05743m4948
$$ -411488 -248621 -50037 -10739 144841 261924 112733 135014 305483 281534 175791 130843
95A30843j07199m1730L0134m2987l8193K2026m5978k1154N8866K9206J8138P149
$$ 130843 23644 -18086 12048 -30939 -69132 -47106 -93084 -114238 -55372 -26166 -8028 -879
107h79q8778k6300R1286K2300k7233j0008p1395J0323J43677J9069n0041Q0203
$$ -879 -89657 -115957 -24671 -2371 -29604 -39612 -111007 -100684 42993 62062 12021 92224
119I2224J8361o0492R0701O9921r1566k9397k2390j27919J583P1500j09188r2542
$$ 92224 110585 50093 140794 210715 119149 89752 67362 -60557 -58974 12526 -96662 -189204
131a89204K9001l4575K0888J35412p220n2075J13910P0578j8000Q9118N3918q0061
$$ -189204 -160203 -194778 -173890 -38478 -45698 -97773 16137 86715 68715 157833 211751 131690
143A31690j6164Q815o6662m365K771j16622o4110L2481k2560p047M9060k7155
$$ 131690 115526 124341 57679 53314 56085 -60537 -124647 -92166 -114726 -121773 -72713 -99868
155i9868k2965Q2977M7247o059N0801K9351l1213Q892J9675j6390L84j7388n6404
$$ -99868 -122833 -39856 7391 1332 52133 81484 50271 59163 78838 62448 62832 45444 -10960
168a0960o853K1705j6182m444Q252k9199r200L6112Q862j3916L148m169m417J4269
$$ -10960 -17813 3892 -12290 -16734 -8482 -37681 -46881 -10769 -1907 -15823 -12675 -16844 -21261 -6992
182f992R977O744j365k8602m937L7279J0543j4164L823k974n510K2528J1117j5450
$$ -6992 2985 9729 8364 -20238 -25175 12104 22647 8483 12306 9332 3822 26350 37467 22017
196B2017p772j7266j7517K2026P095l0425M277J2105k6852Q876L8605j3659j7598
$$ 22017 14245 -3021 -20538 1488 8583 -21842 -17565 -5460 -32312 -23436 15169 1510 -16088
209a6088J7603n734m560K8361l039k0793J3094p068k1753K9454J4528l6620J296
$$ -16088 1515 -4219 -8779 19582 16543 -4250 8844 1776 -19977 9477 24005 -12615 -11319
222a1319K0126j9806N447L2125j5487k2113J0351k594k0K1370j0950k5029J1915
$$ -11319 8807 -10999 -5552 26573 11086 -11027 -676 -3270 -3290 18080 7130 -17899 -5984
235e984N158r989K1155O919l2972m314K3663O51j63P722j4228j4754Q944J1290
$$ -5984 -826 -10815 10340 17259 -15713 -20027 3636 4287 4124 11846 -2382 -17136 -8192 3098
249C098L600j415j6128r584J7574J5331j398N01m569j3127K863J8828O082j4565
$$ 3098 6698 5283 -10845 -20429 -2855 12476 11078 11579 7010 -6117 -3254 15574 21656 7091
263G091j6753l361M950P974P840n167j7750n625J4409J5620M518o394j2026l316
$$ 7091 -9662 -13023 -8073 -99 7741 2574 -15176 -20801 -6392 9228 13746 7352 -4674 -7990
277g990J0336P759K311k670j9917j5477J6555J8072n224p228n487p954J1286K4559
$$ -7990 2346 10105 12416 9746 -10171 -25648 -9093 8979 3755 -3473 -8960 -16914 -5628 18931
291A8931L375j4188o646J78O812J3603j730j6753j1334q270k083J5740P523k1311
$$ 18931 22306 8118 1472 1650 8462 22065 20335 3582 -7752 -16022 -18105 -2365 5158 -16153
305a6153j7619R796J5699P834O122l337j3380J648J9234J2145k660r908p849N51
$$ -16153 -33772 -23976 -8277 -443 5679 2342 -11038 -9390 9844 21989 19329 9421 1572 2123
319B123P701O664p69j0395j7095q465J5207J5683j2168j7735J394O645N060J2583
$$ 2123 9824 16488 15719 5324 -11771 -20236 -5029 10654 -1514 -19249 -17855 -11210 -6150 6433
333F433O774j2146r616R761J3148K837l943r190q838j162M980Q703J024j7591
$$ 6433 13207 1061 -8555 1206 14354 17191 13248 4058 -4780 -5942 -962 7741 8765 -8826
347h826j4559J2347J8364k544q241K093r45l081J1941J3265o892j4245k192N975
$$ -8826 -23385 -11038 7326 4782 -3459 -1366 -2311 -5392 6549 19814 12922 -1323 -3515 2460
361B460L312o66l790q211q257K62J1202R704p768j3792N124J3658p2k574N218
$$ 2460 5772 5106 1316 -6895 -15152 -14890 -3688 6016 -1752 -15544 -10420 3238 3166 592 5810
376E810m610j2456M945J3964j706q862q37J583L395P165L757q08m179n309M256
$$ 5810 1200 -11256 -6311 7653 5947 -2915 -3752 -2169 1226 8391 12148 11340 7161 1852 6108
391F108J0510n196j4378j866P60q839k105P093n294j0765M007J1368N863L005
$$ 6108 16618 11422 -2956 -4822 -4062 -12901 -15006 -7913 -13207 -23972 -19965 -8597 -2734 271
405B71N087N345J842K689P739L126p797q793k883k163n167o977n686j906l444
$$ 271 5358 10703 12545 15234 22973 26099 18302 9509 6626 4463 -704 -7681 -13367 -15273 -18717
420a8717k955Q761Q615o869J409J6966R19n519J2871L254j4321J380O867r529
$$ -18717 -21672 -12911 -4296 -11165 -9756 7210 8129 2610 15481 18735 4414 5794 12661 3132
434C132m577J696r695m08Q469q113j911J3690o414o265J9093N96j5838J2180Q830
$$ 3132 -1445 251 -9444 -9852 -1383 -9496 -11407 2283 -4131 -10396 8697 9293 -6545 5635 14465
449A4465j7947k99J2949p581m586O511o491q33R183n469N3J0450j1384q865J6304
$$ 14465 -3482 -3781 9168 1587 -2999 3512 -2979 -3812 5371 -98 -45 10405 -979 -9844 6460
464F460L95j5015L303Q85j0915M112Q858l495j805p98K523J5675L604j2155P445
$$ 6460 6855 -8160 -4857 -3972 -14887 -10775 -1917 -5412 -7217 -8015 -5492 10183 13787 1632 9077
479I077J0539r646R22P230j2874p890N744m742m396j082j2047J493J4401q654
$$ 9077 19616 9970 10892 18122 5248 -2642 3102 -1640 -6036 -7118 -19165 -17672 -3271 -11925
493a1925n326J5074m771o605K4467M432j8994Q559Q200p826J0926N01k0409P771
$$ -11925 -17251 -2177 -6948 -13553 10914 15346 -3648 4911 13111 5285 16211 16712 -3697 4074
507D074Q975j8449O711J2685k6848l233K6607j5650j4395K2104q162j5082K4025
$$ 4074 13049 -5400 1311 13996 -12852 -16085 10522 -5128 -19523 2581 -5581 -20663 3362
520C362L64j7998J9271L852j8438K0909Q831k9684R960K1773k4853l403K1998
$$ 3362 3726 -14272 4999 8851 -9587 11322 20153 -9531 429 22202 -2651 -6054 15944
533A5944k1011j2376K3558p388j3548J7167m886j3058K0625M073j3996J4422M926
$$ 15944 -5067 -17443 6115 -1273 -14821 2346 -2540 -15598 5027 9100 -4896 9526 14452
546A4452j8602P819J1596j5325j319O218j4114k752Q872n216P06M758q642M994
$$ 14452 -4150 3669 15265 -60 -1379 4839 -9275 -12027 -3155 -8371 -7665 -2907 -11549 -6555
560f555J2746m706L769J0437j2808m282J5492p629r443J0137j0587j1555J7677
$$ -6555 6191 1485 5254 15691 2883 -1399 14093 6464 -2979 7158 -3429 -14984 2693
573B693k135j4889J5462J172j5836K0287Q691k6010R838K0697k0515j862J8353
$$ 2693 558 -14331 1131 2303 -13533 6754 15445 -10565 -727 19970 -545 -2407 15946
586A5946k1483j0197K3282r693j4196J7228j0352j4759K8963P373k1153J3564
$$ 15946 -5537 -15734 7548 -2145 -16341 887 -9465 -24224 4739 12112 -9041 4523
598D523Q969j8719J3257J7898k1815o202J3080j1754l302J0328j3502n137J4685
$$ 4523 13492 -5227 8030 25928 4113 -2089 10991 -763 -4065 6263 -7239 -12376 2309
611B309q855o685J7492l416r974J5606K465j3007M826J756p531Q220J787j2880
$$ 2309 -6546 -13231 4261 845 -9129 6477 8942 -4065 761 2517 -5014 3206 4993 -7887
625g887K964K889o859J1970N996j7593L351J5836o661j061J0597o911m961M782
$$ -7887 -4923 -2034 -8893 3077 9073 -8520 -5169 10667 4006 2945 13542 6631 1670 6452
639F452p466j401P211j3485p150J3952m208q251J4891q95j1130J4199O055j1210
$$ 6452 -1014 -2415 4796 -8689 -15839 -1887 -6095 -14346 545 -350 -11480 2719 8774 -2436
653b436O899M592q152Q121k1j6478R510R608k1901M34J8357j4116o823J9039n804
$$ -2436 4463 9055 903 9024 9003 -7475 2035 11643 -10258 -9824 8533 -5583 -12406 6633 829
668H29p838J7275m939j3351J6297J056j6195J1425K778j8429J0426J0869k3129
$$ 829 -7009 10266 5327 -8024 8273 9329 -6866 4559 7337 -11092 -666 10203 -12926
681a2926N70K0582j3090r764J7454j656p805J3401n83r847J0565J476j2565O348
$$ -12926 -12356 8226 -4864 -14628 2826 1170 -6635 6766 6183 -3664 6901 8377 -4188 2160
695B160O478r690J278N645r096J74J0399n976r111N033M357l120k135J623K856
$$ 2160 8638 -1052 226 5871 -3225 -3051 7348 1372 -7739 -2706 1651 -1469 -3604 -1981 875
710H75j318l624J219K040k025O24J525k982K188N895j511j282K236k517R81L765
$$ 875 -443 -4067 -2848 -808 -2833 -2209 -684 -3666 -1478 4417 2906 1624 3860 1343 2324 6089
726F089o918j796J0511m062j1364Q269O684j0805k139O006n190n39P806l336m625
$$ 6089 -829 -2625 7886 3824 -7540 729 7413 -3392 -5531 475 -4715 -5254 2552 -784 -5409
741e409O148N44k654M392k856n110O926J224q816N447R752r600p135J0108K764
$$ -5409 739 1283 -1371 3021 165 -4945 1981 3205 -5611 -164 9588 -12 -7147 2961 5725
756E725p194J230J933l076K304L096k107M3q2l766R96L137m540j664O330l056
$$ 5725 -1469 -239 1694 -1382 922 4018 1911 1954 1872 -1894 -898 2239 -2301 -3965 2365 -691
772f91p225P262O664q366n099O001K364k003J184J251j123P52R17J86K706j614
$$ -691 -7916 -654 6010 -2356 -7455 -1454 910 -1093 91 1342 219 971 1888 2074 4780 3166
788C166m819K207L312l074P21L510n315n973N746M819n965m067K568J069%J764
$$ 3166 -1653 554 3866 792 1513 5023 -292 -6265 -519 4300 -1665 -5732 -3164 -2095 -2095 -331
804c31J8o96j552k034K571M106j239l225K082J966j139K939K919n294m745M119
$$ -331 -313 -1009 -2561 -4595 -2024 2082 843 -2382 -300 1666 527 3466 6385 1091 -3654 465
820D65L060k131j021J50q71j0J413J217l30k456l134J313L764r85j985J000j845
$$ 465 3525 1394 373 523 -348 -358 1055 2272 1942 -514 -3648 -2335 1429 444 -1541 -541 -2386
837b386j835M426L006m195k679K391J201K70K056J53k203n51J022K326K019k445
$$ -2386 -4221 205 3211 -984 -3663 -1272 -71 199 2255 2408 205 -346 676 3002 5021 2576
853B576k900J576R12j455J203K72m848k819L702K202k164j137L96k68J43J846
$$ 2576 -324 1252 2164 709 1912 2184 -2664 -5483 -1781 421 -1743 -2880 -2484 -2752 -2609 -763
869g63J473p91k563O0L431J798j000p72P31n50r96K695K232k874l678J621L263
$$ -763 710 -81 -2644 -2584 847 2645 1645 873 1604 1054 58 2753 4985 2111 -1567 54 3317
886C317q80j959R61j770k624J206J610q16j553j492N3K795M71j247J508J22k979
$$ 3317 2437 478 1439 -331 -2955 -1749 -139 -955 -2508 -4000 -3947 -1152 -681 -1928 -420 -298 -3277
903c277K568O035k407l848K563J124j890J238j08k214j01q58r5L219o03l825J620
$$ -3277 -709 5326 2919 -929 1634 2758 868 2106 1998 -216 -317 -1175 -1270 1949 1346 -2479 -859
920h59L026k941k8L756k991k852L211Q51j805j95j470J66K260k434j813M654L30
$$ -859 2167 -774 -802 2954 -37 -2889 322 1173 -632 -827 -2297 -2131 129 -2305 -4118 536 866
937H66l881L130L961l053J80K454j923j99J359j993M08J284l465k60L177l386
$$ 866 -3015 115 4076 1023 1203 3657 1734 1535 2894 901 1309 2593 -872 -1132 2045 -1341
953a341j835M412j363l880K837K018k061N75J2j918K077L92k523K569J006l700
$$ -1341 -3176 1236 -127 -4007 -1170 848 -1213 -638 -626 -2544 -467 -75 -2598 -29 977 -2723
969b723J951L409k441J030L183l587p98L577j444q54K099l693j949M279k653k724
$$ -2723 -772 2637 196 1226 4409 822 24 3601 2157 1303 3402 -291 -2240 2039 -614 -3338
985c338M765k352o405N422L429m871K058K445n443J778O374k923j140K255m354
$$ -3338 1427 -925 -7330 -1908 1521 -3350 -1292 1153 -4290 -2512 3862 939 -201 2054 -2300
1000b300J067O692m239l672N253k785m077P439J404p176J250L279k145K119J297
$$ -2300 -1233 5459 1220 -2452 2801 16 -4061 3378 4782 -2394 -1144 2135 -10 2109 3406
1015C406m990P25J991l355L031J271p669R10O506l821j579M649l575k316O130
$$ 3406 -1584 -859 1132 -2223 808 2079 -5590 -4680 1826 -1995 -3574 1075 -2500 -4816 1314
1030A314L12j193L539m345k339Q696j348o418P132m0j0716N695P341q779j212
$$ 1314 1626 433 3972 -373 -2712 5984 4636 -1782 5350 5310 -5406 289 7630 -1149 -2361
1045b361N452o632j618O587l114j481M803n794k978J0155j081p121P318J406r047
$$ -2361 3091 -3541 -5159 1428 -1686 -3167 1636 -4158 -7136 3019 1938 -5183 2135 3541 -5506
1060e506M772O843n050j243K437k779J672K752l785J49J939n243R84O356m347
$$ -5506 -734 6109 1059 -184 2253 -526 1146 3898 113 262 2201 -3042 -2058 4298 -49
1075d9m308L694l80o34L607j862k345K326k327J144O607n018o963P255K173o436
$$ -49 -4357 -663 -1043 -1677 1930 68 -2277 49 -2278 -1134 5473 455 -6508 747 2920 -3516
1091c516N636K583r935J832P604m359N79L449p520P25R167m297l016O816n630
$$ -3516 2120 4703 -5232 -3400 4204 -155 424 3873 -3647 -2922 6245 1948 -1068 5748 118
1106A18n492J1368P53j0949L777K879p798L662N691p346j096L697l915J895N844
$$ 118 -5374 5994 6747 -4202 -425 2454 -5344 -1682 4009 -3337 -4433 -736 -4651 -2756 3088
1121C088n627j755O460k948k158P730j436n845N787J389n419K710K312l908J306
$$ 3088 -2539 -4294 2166 -782 -2940 4790 3354 -2491 3296 4685 -734 1976 4288 380 1686
1136A686K5m222K982J425n618K104L017o192K91O200l885l040N802q07k743L995
$$ 1686 1711 -2511 471 1896 -3722 -1618 1399 -4793 -4502 1698 -2187 -5227 575 -232 -2975 1020
1152A020n32j618M082o99k358M762j359n539M776L153o562K67L405m351q21L270
$$ 1020 488 -1130 2952 2253 -105 4657 3298 -2241 2535 5688 -874 -607 2798 -1553 -2374 896
1168H96k425p64K126k909P14M315l816q63O415k592m935N233J626m514K551J280
$$ 896 -1529 -2293 -167 -3076 -2362 1953 -1863 -2726 3689 1097 -3838 1395 3021 -1493 1058 2338
1184B338n220J265K163k593L191R97o414K500O321m302j190N907l925m342O623
$$ 2338 -2882 -1617 546 -2047 1144 2141 -4273 -1773 4548 246 -944 4963 1038 -3304 3319
1199C319J440n664J080J46l450L609J152m791J378J705l913K768M535m797k785
$$ 3319 4759 -905 175 321 -3129 480 1632 -3159 -1781 -76 -3989 -1221 3314 -1483 -4268
1214d268N668k75k884K875L60l350J440J482m48J386p72j727J840J129j521O74
$$ -4268 1400 1125 -1759 1116 1476 -1874 -434 1048 600 1986 1214 -513 1327 2456 935 1609
1230A609M51j810m47N60o06m59k02p24j15q43r04K163R46k471Q01J916n19J124
$$ 1609 2060 250 -197 363 -243 -702 -904 -1628 -1743 -2586 -3490 -1327 -381 -2852 -2051 -135 -654 470
1248D70K264j731l89K141q48p16K086j414k694J663k2j617J903p66l920K396K852
$$ 470 2734 1003 614 2755 1907 1191 3277 1863 -831 832 810 -807 1096 330 -3590 -1194 1658
1265A658k299l70J544k259K21K977j653j288J602j643j401L512L27k740J658K67
$$ 1658 -641 -1011 533 -1726 -1505 1472 -181 -1469 133 -1510 -2911 601 928 -1812 -154 113
1281A13j738L133K524l415j150K268l53K00J166j763j567Q55j188o42K488o63
$$ 113 -1625 1508 4032 617 -533 1735 1382 1582 2748 985 -582 273 -915 -1557 931 268
1297B68l437P20K158p31J79J348j892q93K157J697q30r44l8N46M83m35LN07n03
$$ 268 -3169 -2449 -291 -1022 -843 505 -1387 -2280 -123 1574 744 -200 -238 308 791 356 359 866 363
1316C63j632J031K393qk160q36J794L58r36L07k81k267Q5K707n02k003L73q2n82
$$ 363 -1269 -238 2155 2147 -13 -849 945 1303 367 674 393 -1874 -1789 918 416 -1587 -1214 -1296 -1878
1335a878O47R95k09L94j095j194L347K401l513j002K780p39j187K357M18l049
$$ -1878 -1231 -236 -445 -51 -1146 -2340 1007 3408 -105 -1107 1673 934 -253 2104 2522 -527
1351e27M21J256r85M14N72j730k05Q97p86Q59J510l336k139L711R45l215N27J982
$$ -527 -106 1150 165 579 1151 -579 -784 113 -673 186 1696 -1640 -3779 -68 877 -2338 -1811 171
1369A71j516Q1K297j15m98L70n16J22J408k64o35M02o12q09J931N13l104j097
$$ 171 -1345 -1264 1033 918 420 790 274 396 1804 1540 905 1307 695 -114 1817 2330 -774 -1871
1387a871K055l95j452N49J038r82q52J304M27o37L6J34m14Q59R37j16j83l81J18
$$ -1871 184 -211 -1663 -1114 -76 -1058 -1910 -606 -179 -816 -780 -646 -1060 -201 736 620 437 56 174
1406A74R12O45j478q01J724j85k086J760J276k267o57J673m17q24J303o34j202
$$ 174 1086 1731 253 -548 1176 991 -1095 665 1941 -326 -983 690 273 -551 752 118 -1084
1423a084J050N59n88L09j318j070K049J6k800K000J903k732k12K914l30j098J089
$$ -1084 -34 525 -63 246 -1072 -2142 -93 -77 -2877 -877 1026 -1706 -1918 996 666 -432 657
1440F57M89K69N54p32J05J350j902j084K265j127l492J810J512k912m0J635m24
$$ 657 1146 1415 1969 1237 1342 2692 790 -294 1971 844 -2648 -838 674 -2238 -2278 -643 -1067
1457a067n42N36N2J260M81k181J253K821k510j322L135r13k536K055P68j856M83
$$ -1067 -1609 -1073 -1021 239 720 -1461 -208 2613 103 -1219 1916 1003 -1533 522 1290 -566 -83
1474h3J003K56L06o22p45J928o61k819J396J234l375k69K497j728j100J620k52
$$ -83 920 1176 1482 860 115 2043 1382 -1437 -41 1193 -2182 -2451 46 -1682 -2782 -1162 -1414
1491a414J61J516j133R98K343j837m88L463j773l380L272N24l842J060J367k836
$$ -1414 -1253 263 -870 128 2471 634 146 3609 1836 -1544 1728 2252 -1590 -530 837 -1999
1507a999R98J756k092J142J653k790J288L532l116j211L826j905l249L029p33
$$ -1999 -1001 755 -1337 -195 1458 -1332 -44 3488 372 -839 2987 1082 -2167 862 129
1522A29l538K199Q13k517J512O25j889K861J889k433J182J856k745J304L407l361
$$ 129 -3409 -1210 -397 -2914 -1402 -777 -2666 195 2084 -349 833 2689 -56 1248 4655 1294
1538A294k115K693j656j465K837j950k502K453l43j356L422r17l126L398J019
$$ 1294 -821 1872 216 -1249 1588 -362 -2864 -411 -754 -2110 1312 395 -2731 667 1686
1553A686m132K369K155m806Q64L976l000j141L009j587j21L632k379j637M519
$$ 1686 -2446 -77 2078 -2728 -1864 2112 -888 -2029 980 -607 -728 2904 525 -1112 3407
1568C407j443k476L853m69m554J702J598l503O25J744l014L80J008j603K027J837
$$ 3407 1964 -512 3341 2872 -1682 20 1618 -1885 -1260 484 -2530 -2150 -1142 -2745 -718 1119
1584A119k689O57K946k429l7L686j902k404K138q63q35K492k231k359L835p78
$$ 1119 -1570 -913 2033 -396 -433 3253 1351 -1053 1085 222 -613 1879 -352 -2711 1124 346
1600C46k222L936m50m733L690K820m298N23K567l694L90L875l755j550L366k755
$$ 346 -1876 2060 1610 -3123 567 3387 -911 -388 2179 -1515 -1125 2750 -1005 -2555 811 -1944
1616a944j004N191k426m386M674J523l431K931J109m285J866L653k749k11J489
$$ -1944 -2948 2243 -183 -4569 105 1628 -1803 1128 2237 -2048 -182 3471 722 511 2000
1631B000l155R88L904l158j972K467j636q67L220j245k807J308J04l98J866j091
$$ 2000 -1155 -167 3737 579 -1393 1074 -562 -1429 1791 546 -2261 -953 -849 -1247 619 -472
1647d72k299K237J146k043K035M23k851J992K633k396n5J164k006J099K444k654
$$ -472 -2771 -534 612 -1431 604 1027 -1824 168 2801 405 350 1514 -492 607 3051 397
1663C97j393K091j734p18L571j630l153K179N53j870K239N21k950J071J275j548
$$ 397 -996 1095 -639 -1357 2214 584 -2569 -390 163 -1707 532 1053 -1897 -826 449 -1099
1679a099R88P84k035Q33J382j679L87K051j831n92K322j250o34J915p83j262J470
$$ -1099 -111 673 -1362 -529 853 -826 -439 1612 -219 -811 1511 261 -373 1542 759 -503 967
1696I67n46p99J917j327j701K311J95k803J695J081l148P60K831k175j041J904
$$ 967 421 -378 1539 212 -1489 822 1017 -1786 -91 990 -2158 -1398 1433 -742 -1783 121
1712A21j233m21K606j141j343K553q60j311K991K32l263J421K279k276r7J885
$$ 121 -1112 -1533 1073 -68 -1411 1142 282 -1029 1962 2194 -1069 352 2631 355 258 2143
1728B143j522j034J133o04n23M28j279m30J648r56j375J573N13j468R42J654q35
$$ 2143 621 -413 720 116 -407 21 -1258 -1688 -40 -996 -2371 -798 -285 -1753 -811 843 8
1745Hk43P19L16J78o79l92J366l70j576R13O69j308m9J293m21q18L48J88N10l4
$$ 8 -235 484 800 978 299 -93 1273 903 -673 240 909 -399 -448 845 424 -394 -46 142 652 618
1765F18j423N23J374k036l65K251j158k483J998J151j755N27J297p50K39J033
$$ 618 -805 -282 1092 -944 -1309 942 -216 -2699 -701 450 -1305 -778 519 -231 8 1041
1781A041p07O48P52j623L57J884k087j281K210m89k453J484R65j947K29J256p85
$$ 1041 334 982 1734 111 468 2352 265 -1016 1194 705 -1748 -264 701 -1246 -1017 239 -546
1798e46m4P70o43L86N69j017j10J123j279o19J488J98j303O98J126o26l42J315
$$ -546 -590 180 -463 -77 492 -525 -635 488 -791 -1410 78 276 -1027 -329 797 171 -171 1144
1816A144K89p88J93L38k30m11j67j86k54o24k59L40O9o07j00R92K68r08P33J149
$$ 1144 1433 645 838 1176 946 535 368 182 -72 -696 -955 -615 -546 -1153 -1253 -261 7 -901 -168 981
1836I81r24n66J301Q4j507K72O36n50m40M10J15M12j61j74J338N27j142r3J715
$$ 981 57 -509 792 876 -631 -359 277 -273 -713 -303 -188 224 63 -111 1227 1754 612 519 2234
1855B234q47j709R66L25k078m50R13m95p46K77K33N48q5J37J189N20r77R4J674
$$ 2234 1387 -322 644 969 -1109 -1559 -646 -1141 -1887 -1610 -1377 -829 -914 -777 412 932 -45 49 1723
1874A723m1j366M53Q40j206q22Q65J68q96k57M39K24j62k23N67P3p23k37Q43M
$$ 1723 1682 316 769 1609 403 -419 446 614 -282 -539 -100 124 -38 -261 306 379 -344 -581 262 266
1894B66j249p7J122m03q03L43J098k36p38Q57R90o05m97Q10J46k73l58K02k55
$$ 266 -983 -1060 62 -341 -1144 -801 297 61 -677 180 1170 565 68 878 1024 751 393 595 340
1913C40m09j89K48Nj49m29O19K61o82R5J117n53q38M55M21q65KJ16n33K55N14
$$ 340 -69 -258 -10 -5 -154 -583 36 297 -385 -290 827 274 -564 -109 312 -553 -551 -435 -968 -713 -199
1934a99p30K83Q60l44qJ126m17k38J254l39j265O71O21j384M7N63j065L3N64r04
$$ -199 -929 -646 214 -130 -138 988 571 333 1587 1248 -17 654 1275 -109 -62 501 -564 -531 33 -871
1954h71J8O30n56k35J004l79o76R35k02p30R75Q25j207r3J237l7L5M81m89J90
$$ -871 -853 -223 -779 -1014 -10 -389 -1065 -130 -332 -1062 -87 738 -469 -562 675 638 673 1154 665 855
1974H55L52n77k21P25p60r91Q01j68j020M20M3q49L70Q15k79j86Q8J95R36j3j039
$$ 855 1207 630 409 1134 374 -617 184 16 -1004 -584 -541 -1390 -1020 -205 -484 -670 -582 -387 549 536 -503
1995e03P04O87j085Q2R31j45o20K03l66K94N02o27o4Q64j188j20J733q09j808
$$ -503 201 888 -197 -115 816 671 51 254 -112 182 684 57 -7 857 -331 -451 1282 473 -1335
2014a335J020M16j244N22Q30j097Q1L90m37J271Q30k306J50K296j155o33J509
$$ -1335 -315 101 -1143 -621 209 -888 -807 -417 -854 417 1247 -1059 -909 1387 232 -401 1108
2031A108p93j791K013P94j412K89j30p46J441L70j274Q78N77k263Q62J855k123
$$ 1108 315 -1476 537 1331 -81 208 78 -668 773 1143 -131 747 1324 -939 -77 1778 -345
2048c45j283J507m25j40O19j149k89J362n11j52J854j385j141K718K85j888J209
$$ -345 -1628 -121 -546 -686 -67 -1216 -1505 -143 -654 -806 1048 -337 -1478 1240 1525 -363 846
2065H46O04j707Q58J058j534R8L76j601Q76J619k524p4K179j469j106K319j022
$$ 846 1450 -257 601 1659 125 223 599 -1002 -126 1493 -1031 -1105 1074 -395 -1501 818 -204
2082b04j831K141K85j873J138M14j067J308K72j265Q78J070j639R68J563k065
$$ -204 -2035 106 391 -1482 -344 70 -997 311 583 -682 196 1266 -373 595 2158 93
2098I3k69J663o56q58R05q58p02J055q09k78J075j137q41K095p56j689K060L86
$$ 93 -176 1487 831 -27 878 20 -682 373 -436 -714 361 -776 -1617 478 -278 -1967 93 479
2116D79j886J092J268j536N28J275j520M15R67j590Q27J616k253n07K647j333
$$ 479 -1407 -315 953 -583 -55 1220 -300 115 1082 -508 319 1935 -318 -825 1822 489
2132D89j910K117q2j959J465Q80j592K92K26o39J170J53k189J085J350k001M68
$$ 489 -1421 696 614 -1345 120 1000 -592 -300 -74 -713 457 610 -1579 -494 856 -1145 -677
2149f77K249j868j782K464L79j038M91k45m06J184k46l91J472j060j615J938J187
$$ -677 1572 -296 -2078 386 765 -273 218 -27 -433 751 505 114 1586 526 -1089 849 2036
2166B036k781J73J578j194n84J279j022n58P20o83O99Q74j645l55K291p49j529
$$ 2036 -745 -572 1006 -188 -772 507 -515 -1073 -353 -1036 -337 537 -1108 -1463 828 79 -1450
2183a450K255j01j933J204J302r79j53M15n19Q69R2j235R03L60j803M77J420j435
$$ -1450 805 704 -1229 -25 1277 298 145 560 41 910 1002 -233 670 1030 -773 -296 1124 -311
2201c11j020J365l64o83P12J2o65P25j52m32J354l20j289J748J48j666J126J168
$$ -311 -1331 34 -330 -1013 -301 -289 -954 -229 -381 -813 541 221 -1068 680 828 -838 288 1456
2219A456j567J35J156j048n0O21o98l21J330j151n11J387q37j162J624j74j425
$$ 1456 -111 24 1180 132 82 703 5 -316 1014 -137 -648 739 -98 -1260 364 190 -1235
2236a235J090N95j377J61J105p55k7L51j14r0O79p67J93J070j014k08J228k28
$$ -1235 -145 450 -927 -766 339 -416 -443 -92 -206 -296 383 -384 -191 879 -135 -343 885 657
2254F57r10N40M99n58k1L42M2j84n75K02M82m39r90N69M42j048o5R16m53j90J38
$$ 657 -253 287 786 228 207 549 591 407 -168 34 516 77 -913 -344 98 -950 -1015 -99 -552 -742 -604
2275f04O43Mj19m7M43M17p18K27R36o74o58R14K94r20j00L18j89l74j08R6K28
$$ -604 39 43 -76 -123 320 737 19 246 1182 508 -150 764 1058 138 38 356 167 -207 -315 -219 9
2296Im03m90O95K79q92nQ00k06o47O15N00m01j9K38K90K01j83k59P41l84m52L03
$$ 9 -394 -884 -189 90 -802 -807 -7 -213 -860 -245 255 -146 -165 73 363 564 381 122 863 479 27 330
2318C30M37n45o66P00r4n24Q7J48k75P6k6K89K56m37l94M49L94m11j43M85j26
$$ 330 767 222 -444 256 162 -362 -275 -127 -402 -326 -352 -63 193 -244 -638 -189 205 -206 -349 136 10
2339A0m35L13N38k00k70L36K12j99K88J91k02q6r8q1J19k74m10O7J25l67k87O73
$$ 10 -425 -112 426 226 -44 292 504 305 593 784 582 496 398 317 436 162 -248 -181 -56 -423 -710 -37
2361c7k58o45N58M60n20J17M03j61k54L34K32j10J05j03j65M38J96l90J45M07
$$ -37 -295 -940 -382 78 -442 -325 78 -83 -337 -3 229 119 224 121 -44 394 590 200 345 752
2381G52o87r7R68l81p25K66K79o43l3L73m11n19M33O1j02J49L0j24M04p7k13P88
$$ 752 65 -32 936 555 -170 96 375 -268 -301 72 -339 -858 -425 -364 -466 -317 -287 -411 -7 -84 -297 491
2403D91M2q47N55P21o36k52O01m3o92J74K45k09k72o6K04N1k08l73N61K33q15
$$ 491 533 -314 241 962 326 74 675 632 -60 114 359 150 -122 -188 16 67 -141 -514 47 280 -535
2424e35k7P72k94p20M14P29n03m14M23N93o58j98O34M59p32J37M46K20m04k64
$$ -535 -562 210 -84 -804 -390 339 -164 -578 -155 438 -220 -418 216 675 -57 80 526 746 342 78
2444G8M04P7q32lP52k43p83OP76l99p97P97M19o54l57M79L31k90q6L93K23l55
$$ 78 482 559 -273 -276 476 233 -550 -544 232 -167 -964 -167 252 -402 -759 -280 51 -239 -325 68 291 -64
2466f4l45O91N05r95K9Q17j55p43Q28L15q14NM30J3l82k11p4K46j70o65L76K50
$$ -64 -409 282 787 -208 -179 638 483 -260 568 883 69 74 504 517 135 -76 -150 96 -74 -739 -363 -113
2488a13r32N4J157j3p78L07M26k30J07L48Pj82k48L69P55n17n62O55j9n95l9O37
$$ -113 -1045 -991 166 153 -625 -318 108 -122 -15 333 340 158 -90 279 1034 517 -45 610 591 -4 -43 594
2510E94n07l33KJ16K40m13l17N10o6n89L43O52q92j98J147j28o64Q47N0l36M60
$$ 594 87 -246 -244 -128 112 -301 -618 -108 -174 -763 -420 232 -660 -858 289 161 -503 344 394 58 518
2531E18J31j05K11l32p95R59K50j115J33R95j312k98J500m90j280O02M42n53L15
$$ 518 649 544 755 423 -372 587 837 -278 -145 850 -462 -760 740 250 -1030 -428 14 -539 -224
2550b24J98k48J32l73j95J108K62j569O41J223r66m15J032k69n76M53K24p0j01
$$ -224 -26 -274 -142 -515 -710 398 660 -909 -268 955 -11 -426 606 337 -239 214 438 368 267
2569B67p03L73P53o04p74J199k13j306J057M15q67j07M47j98P2N0n78O86L64j157
$$ 267 -436 -63 690 86 -688 511 298 -1008 49 464 -403 -510 -63 -261 -189 -139 -717 -31 333 -824
2589h24M83J058j036l70J631m00r64P60J56n35L86L32o24N43l31o22N84L72j549
$$ -824 -341 717 -319 -689 942 542 -422 338 494 -41 345 677 53 596 265 -357 227 599 -950
2608i50N06R05r41k92P77k48m00O51k57j66M81n23J59J000n73n55J141k87r51
$$ -950 -444 461 -480 -772 5 -243 -643 8 -249 -415 66 -457 -298 702 129 -426 715 428 -523
2627e23J090L11j092K61M62m86L27K64j078N09N04r42jJ050j108n68J505p60r74
$$ -523 567 878 -214 47 509 23 350 614 -464 45 549 -393 -394 656 -452 -1020 485 -275 -1249
2646a249J290m5j011J236k2q34P32J00l83O12N99j311L42J000j037K8Q14o79n85
$$ -1249 41 -4 -1015 221 199 -635 97 197 -186 426 1025 -286 56 1056 19 47 861 182 -403
2665d03Q12l00l64L50k36j77K59j57l63Q49j97r41R35K62r07M44L00m65O2M12
$$ -403 409 109 -255 95 -141 -318 -59 -216 -579 270 73 -868 67 329 -578 -134 166 -299 -237 175
2685A75n18L49N18o34J05P35o52j09J067n94o91Q70r9q99L62K75o07J12l2l73
$$ 175 -343 6 524 -110 -5 730 78 -31 1036 442 -249 621 522 -377 -15 260 -347 -235 -267 -640
2705f40M03J86r05L55R92r09j2R80k47o65P78J99n44L29k10J22J77l75l00Q36
$$ -640 -237 -51 -956 -601 391 -518 -530 450 203 -462 316 515 -29 300 90 212 389 14 -286 550
2725E50r2r32Q31L87q49k4O38m57k79J33l67J80J36p35M06P04r06p7J083j72q70
$$ 550 458 -474 357 744 -105 -129 509 52 -227 -94 -461 -281 -145 -880 -474 230 -676 -753 330 158 -712
2746g12R87N69q69J09M03J7k2l98l45N60Jq46P43L36q46l16J029k13o65N36j31
$$ -712 275 844 -25 84 487 504 482 84 -261 299 300 -546 197 533 -313 -629 400 187 -478 58 -73
2767g3r3M9l0j04J94l57l03P23l5o51M66O42l52m7N30l15j60M12j07K25p7n15
$$ -73 -166 -117 -147 -251 -57 -414 -717 6 -29 -680 -214 428 76 29 559 244 84 496 389 614 537 22
2789B2J27K52n40l9L52l38n04O75O5l84J02p4O9J64J25m9J65l79k57M06K82m19
$$ 22 149 401 -139 -178 174 -164 -668 7 72 -312 -210 -284 -215 -51 74 25 190 -189 -446 -40 242 -177
2811a77Q2N21k85m51O39J51l34N9R5J39l92j56L29p0m18l62P84r0r00M67K74k89
$$ -177 -95 426 141 -310 329 480 146 205 300 439 47 -109 220 150 -268 -630 154 64 -836 -369 -95 -384
2833c84k96N57J00j57k59M71L01r1l69Q7O81m43m92Q06J54q46J07O93k30o72L22
$$ -384 -680 -123 -23 -180 -439 32 333 242 -127 -40 641 198 -294 512 666 -180 -73 620 390 -282 40
2854D0L77k10l84K75P7k94m69L74L86m73k29K51J53l93j5O58P0n56J96O96j86
$$ 40 417 207 -177 98 175 -119 -588 -214 172 -301 -530 -279 -126 -519 -534 124 194 -362 -166 530 344
2875C44n42K87N26j74k92L13K09n61k28K25J34p8m19L06k9j98l37L06M31o72q5
$$ 344 -198 89 615 441 149 462 671 110 -118 107 241 163 -256 50 21 -177 -514 -208 223 -449 -534
2896e34M56P3m17K11M35l74j1L70L4k7r9o0J76K10l47J21K72m54o0K57J15n67
$$ -534 -78 -5 -422 -211 224 -150 -161 209 243 216 117 57 233 443 96 217 489 35 -25 232 347 -220
2918b20J01L67n10k9J44M1k79p3L78N7k51j62K25K72k51r3M42P0l65J01L65l8
$$ -220 -119 248 -262 -291 -147 -106 -385 -458 -80 -23 -274 -436 -211 61 -190 -283 159 229 -136 -35 330 292
2940B92n5N8J02o3k42K91L7l10j18N1J01k89k9J60q5k84N9J71R5l26P3J93J39
$$ 292 237 295 397 334 92 383 420 110 -8 43 144 -145 -174 -14 -99 -383 -324 -153 -58 -384 -311 -118 21
2963B1l06J37N12l29l13N56N4k62M3L15j29n0j33J41Q8m43j24M61o0p13K55M42
$$ 21 -285 -148 364 35 -278 278 332 70 113 428 299 249 116 257 345 -98 -222 239 179 -534 -279 163
2985A63n40j57M32K36m54J67l52K10N86m70k6O13j85n87O83J93n30J7P15m76l4
$$ 163 -377 -534 -102 134 -320 -153 -505 -295 291 -179 -205 408 223 -364 319 512 -18 -1 714 238 204
3006B04J17j53p0J16m01K59J15m43j62N70m7n32J97L36m51q5L90Jo0j17m9K63
$$ 204 321 168 98 214 -187 72 187 -256 -418 152 105 -427 -230 106 -345 -430 -40 -39 -99 -216 -265 -2
3028bl4j16K23L64o87K93O16l22j87R3j48P4j67L9n2J92k85l63O35j26p73L67
$$ -2 -36 -152 71 435 -252 41 657 335 148 241 93 167 0 39 -13 179 -106 -469 166 40 -733 -366
3050c66N44p00K06L83l31J3L04k16N2L35o02K83P25n92k43Q49j91m54L19L92p82
$$ -366 178 -522 -316 67 -264 -251 53 -163 -111 224 -378 -95 630 38 -205 644 453 -1 318 710 -72
3071g2K81M0l46J50om44K51O2n48J72L01l30N0N87n15j07M96R6l25L03L1k87M95
$$ -72 209 249 -97 53 47 -397 -146 -84 -632 -460 -159 -489 -439 148 -367 -474 22 118 -207 96 127 -160 335
3094C35Nl46K75q5n08P64J6m93J7N85q13K0O20k15l66J20j54R0L04p77K47L55
$$ 335 340 -6 269 184 -324 440 456 -37 -20 565 -248 -228 392 177 -189 -69 -223 -133 171 -606 -359 -4
3116dk18k53M50L16p99L81N75l84j44J93J31P1o1j61L65q2p11M02O68o84n24O73
$$ -4 -222 -475 -25 291 -508 -127 448 64 -80 113 244 315 254 93 458 376 -335 67 735 51 -473 200
3138B00k29m16L89J49k72jj68j31N64j93p19Q65K39q70M54Q62n84m06O21l6k78
$$ 200 -29 -445 -56 93 -179 -180 -348 -479 85 -108 -827 38 277 -593 -139 723 139 -267 354 318 40
3159D0L66k31j52M30n86k7P78m49o92O99K87q60k01R22o28k66O25j48l07K73k62
$$ 40 406 175 23 453 -133 -160 618 169 -523 176 463 -397 -598 324 -304 -570 55 -93 -400 -127 -389
3180c89L02K39k97j67N49k16l17P39O7p75K09N35j41j57J19k57M25m21j79L37
$$ -389 -87 152 -145 -312 237 21 -296 443 510 -265 -56 479 338 181 300 43 468 47 -132 205
3200B05M3p49K71N19p03j39P07l18k99M33L3j59O4J10p2M00m28m10P54L18q51
$$ 205 248 -501 -230 289 -414 -553 154 -164 -463 -30 3 -156 -92 18 -54 346 -82 -492 262 580 -271
3221b71O75J63p23K34O00m71l10J68N2j18K69l88p9K51l64j71O47j83q30N84M07
$$ -271 404 567 -156 78 678 207 -103 65 117 -1 268 -120 -199 52 -312 -483 164 -19 -849 -265 142
3242A42l44kM71l58J02J7K1J87J7l84L92K88m79j25O22k55m52L72Rl37N0J66j39
$$ 142 -202 -204 267 -91 11 28 49 236 253 -131 261 549 70 -55 567 312 -140 232 241 -96 -46 120 -19
3265a9N5n5j48J38j37m15N66J91n93J70M56k04j47L79j01m8j55O9K96J41l62j30
$$ -19 36 -19 -167 -29 -166 -581 -15 176 -417 -247 209 5 -142 237 136 88 -67 2 298 439 77 -53
3287e3L95j46k94M52K4o49J26K49l1j23k34j3K86j21n5m8K35m58J48N31k70k80
$$ -53 342 196 -98 354 378 -271 -145 104 73 -50 -284 -297 -11 -132 -187 -235 0 -458 -310 221 -49 -329
3309c29L55J08m5J10J36p5n3j9j46M01j18l64nL56k89j91L97k54j41q2J64j3M
$$ -329 26 134 89 199 335 260 207 188 42 443 325 -39 -44 312 23 -168 229 -25 -166 -248 -84 -97 -93
3332i3m5%o1p5O0J57l8j14K22J78j19J24J36j73p5K17p0k2J7k38J20J54j77j49
$$ -93 -138 -138 -199 -274 -214 -57 -95 -209 13 191 72 196 332 159 84 301 231 209 226 -12 108 262 85 -64
3356f4P1j70j66m2M71k77r1R7k07K98J9k7j30K46j13K02k6pj18J45R5q0J41Mj97
$$ -64 7 -163 -329 -371 100 -177 -268 -171 -378 -80 -61 -88 -218 28 -85 117 91 84 -34 111 206 126 267 271 74
3381G4KK22k8j54j42N9J47k34j96J95N5k51l5O4J16r3K1K11q8j68J48K15m2k94
$$ 74 76 298 270 116 -26 33 180 -54 -250 -55 0 -251 -286 -222 -106 -199 -178 33 -55 -223 -75 140 98 -196
3405a96L01K07k15Q2P9J07k13r7K09J22m26k03L75o7j38m8M0o8j25k55N03R0n71
$$ -196 105 312 97 179 258 365 152 55 264 386 -40 -243 132 65 -73 -121 -81 -149 -274 -529 -26 64 -507
3428e07L15J19j68R4J70N7Q6k23J3N16k79k30K32J44k95P3L91j68n20J23K32p7
$$ -507 -192 -73 -241 -147 23 80 166 -57 -44 472 193 -37 195 339 44 117 508 340 -180 -57 175 98
3450I8k34N0J45k73o7r6N07l27k44L05K77k14k73M60j53q6J96mK05k19kJ49K24
$$ 98 -136 -86 59 -214 -281 -377 130 -197 -441 -136 141 -73 -346 114 -39 -125 71 67 272 53 51 200 424
3473D24k85l4K45j59k14l5J92j47j27J3J09k20MP2Qj01r1L63L6l95K87N0m8PJ69
$$ 424 139 105 350 191 -23 -58 134 -13 -140 -127 -18 -238 -234 -162 -154 -255 -346 17 53 -342 -55 -5 -53 -46 123
3498A23j05m7J31j06L15j19k34O2K44p8k48L31j9m35K60J98l78j11K03j96M6j59
$$ 123 18 -29 102 -4 311 192 -42 20 264 186 -62 269 250 -185 75 273 -105 -216 -13 -209 -163 -322
3520c22L1K14k08j0J94K11j45j29O25k73l09L45J67k01p9J67R8j26l08K4L58k13
$$ -322 -291 -77 -285 -295 -101 110 -35 -164 461 188 -121 224 391 190 111 278 376 250 -58 -34 324 111
3542A11m68L54J69m36Q2K92j47k21J71j0j08q2J95J01J88k67j89N97k10m39M49
$$ 111 -357 -3 166 -270 -188 104 -43 -264 -93 -103 -211 -293 -98 3 191 -76 -265 332 122 -317 132
3563A32M30n67n5M50M9l89r3K06l7p9j62K22N3m81k5L38q9m04M15J65l31J27N0
$$ 132 562 -5 -60 390 439 50 -43 163 126 47 -115 107 160 -321 -346 -8 -97 -501 -86 79 -252 -125 -75
3586g5JJ36l62J62M26q2m07M82J03p62L13M98k57l13M36k73p4K41J9k33K15k66
$$ -75 -74 62 -300 -138 288 206 -201 281 384 -378 -65 433 176 -137 299 26 -48 193 212 -21 194 -72
3608g2j55O04l00n96M07J82n03K28M64o96Q3L05Q6j5K04k03j61N70k18NJ91j95
$$ -72 -227 377 77 -519 -112 70 -433 -205 259 -437 -354 -49 37 22 226 23 -138 432 214 219 410 215
3630B15l21L89J57m54JQ7k12M3J38l05P0n4j6J79Ol64J66K46r0O6L02l10j76O12
$$ 215 -106 283 440 -14 -13 74 -138 -95 43 -262 -192 -246 -262 -83 -77 -441 -275 -29 -119 -53 249 -61 -237 375
3654C75l11L4Q0j88J19J84m6k21K96j53l49L63J53n20r3M57l85r9M25l16K0J35
$$ 375 64 98 178 -10 109 293 247 26 322 169 -180 183 336 -184 -277 180 -205 -304 121 -195 -175 -40
3676d0j29k11N96k43k44L65nl73M13L87n01k20M19Qr5K61k28j09Q6j02J0K90k29
$$ -40 -169 -380 216 -27 -271 94 89 -284 129 516 15 -205 214 222 127 388 160 51 137 35 45 335 106
3699A06m64N42j49k41J33M7j66J28n2k07L14l19Q8L71K7l93J84J23j95R7L11j94
$$ 106 -358 184 35 -206 -73 -26 -192 -64 -116 -323 -9 -328 -240 131 158 -235 -51 72 -123 -26 285 91
3721I1O4J00p7J3J80k70k9K75l55l58K91R7k11N7J06k32J04P6j46J92L8l60J34
$$ 91 155 255 178 191 371 101 72 347 -8 -366 -75 22 -189 -132 -26 -258 -154 -78 -224 -32 6 -354 -220
3744b20L25l1k67M03r5l40M59J84l81J37r8N0J77q8j60M9m1l93L78J39m99jK22
$$ -220 105 74 -193 210 115 -225 234 418 37 174 76 126 303 215 55 104 63 -330 48 187 -312 -313 -91
3767i1j29n1J78j1j59Q4M4J97m7Q5j45K58k03J19K7m1k39P2M24l35J4J55k41R6
$$ -91 -220 -271 -93 -104 -263 -179 -135 62 15 100 -45 213 10 129 156 115 -124 -52 372 37 51 206 -35 61
3791F1m8o6m7J66l32R5J95j02q9K6J85m02K89l1j8k5J2J64J65l77J55J72N0k30
$$ 61 13 -53 -100 66 -266 -171 24 -78 -167 -141 44 -358 -69 -100 -118 -143 -131 33 198 -179 -24 148 198 -32
3815c2K79J32k29j20K42m3k78K24%l7j16j32J83r5o1j37K31k3k11L4J99j99j91
$$ -32 247 379 150 30 272 229 -49 175 175 138 22 -110 73 -22 -83 -220 11 -12 -223 -189 10 -189 -380
3838c80L28K17k05N4L4R1K7m4J09J21l72l1M62j70l97L06M1p2k71J22K43k61j92
$$ -380 -52 165 -40 14 48 139 166 122 231 352 -20 -51 411 241 -156 150 191 119 -152 -30 213 -48 -240
3861b40j59L99n4k78K33K19k27j95N35j50k31J13J19J05j03j03L14r7k09J69J26
$$ -240 -399 0 -54 -332 -99 120 -107 -302 233 83 -148 -35 84 189 86 -17 297 200 -9 160 286
3882B86J6n61J70L68l53R8M1k1k40N7J04j51j62K11r5L0K26pr4J60j48N6J11k1
$$ 286 302 -259 -89 279 -74 24 65 44 -196 -139 -35 -186 -348 -137 -232 -202 24 17 -77 83 -65 -9 102 81
3906H1m4J91Q3j59J6K9j6j68J46J8o1k9L0p7n2j63L29j1l79J42o7RK1n1j7K57
$$ 81 37 228 311 152 168 197 181 13 159 177 116 87 117 40 -12 -175 154 143 -236 -94 -161 -152 -131 -182 -199 58
3932E8j91K8L11n6j16N8J96j40p7K88k00k59OK61J23j58k09O0Mj27nJ56l60K85
$$ 58 -133 -105 206 150 34 92 288 148 71 359 159 -100 -94 167 290 132 -77 -17 -13 -140 -145 11 -349 -64
3956f4q7J80j52q4J97o8R2k27M16j0j50o2J58L69l38k43L62k26R8j57L32j62k18
$$ -64 -151 29 -123 -207 -10 -78 14 -213 203 193 43 -19 139 508 170 -73 289 63 161 4 336 174 -44
3979d4O5J37j77r6P5O7o0k57J65K25k10q1J12M2j47J15K25m3j26J42k3J43j20
$$ -44 21 158 -19 -115 -40 27 -33 -290 -125 100 -110 -191 -79 -37 -184 -69 156 113 -13 129 106 249 129
4002A29j45L76j98n9J1P9j63j24J11J41k52M4j58o0K57m22J61J91m3j56K77kr0
$$ 129 -16 360 162 103 114 193 30 -94 17 158 -94 -50 -208 -268 -11 -433 -272 -81 -124 -280 -3 -5 -95
4025i5p3K79n3M5N5M4PM0j43L1J67l28L8L06k96p8OJ22k72K45j35j18J19j17o6
$$ -95 -168 111 58 103 158 202 209 249 106 137 304 -24 14 320 24 -54 -48 74 -198 47 -88 -206 -87 -204 -270
4050b70J02J84l34J36J69j11O6J8j22J54J75k31R9M05k84j3J31j1l32L80l2m06
$$ -270 -168 16 -318 -182 -13 -124 -58 -40 -162 -8 167 -64 35 440 156 143 274 263 -69 311 279 -127
4072a27K35n1l86L23j0l35L41J39k21j24K39j58KR3j81L5K59k13M6L42l27j25
$$ -127 108 57 -329 -6 -16 -351 -10 129 -92 -216 23 -135 -133 -40 -221 -186 73 -140 -94 248 -79 -204
4094b04M39l0k29J92p1J95j2L2k75K07j68k26J60K30l39k02L31j32k7J44j90K8
$$ -204 235 205 -24 168 97 292 280 312 37 244 76 -150 10 240 -99 -301 30 -102 -129 15 -175 -147
4116a47J53j08J7L80l05j21L16M8l43L04J87m90K15J06j59P5n5k37K95J91m87
$$ -147 6 -102 -85 295 -10 -131 185 233 -110 194 381 -109 106 212 53 128 73 -164 131 322 -165
4137a65J26J38k36j16L59o0n39J66K59n0j18J80j09J94j11J08K21L4l84K7L65
$$ -165 -39 99 -137 -253 106 46 -493 -327 -68 -118 -236 -56 -165 29 -82 26 247 281 -103 -76 289
4158B89j37j15K05j35p6J81o8Pj38k45J06K09j87j19K38p1k94L58j38oK1J25q4
$$ 289 152 37 242 107 31 212 144 151 13 -232 -126 83 -104 -223 15 -56 -350 8 -130 -136 -115 10 -74
4181g4j2K57m61L03J65l82J30M74k65k78N66k20k82L76j39j59J3K7j87J36k6k32
$$ -74 -86 171 -290 13 178 -204 -74 400 135 -143 423 203 -79 297 158 -1 12 39 -148 -12 -38 -270
4203b70K04K21n33J92J83k86J43J99j79j48M34j14J4k8J80j65Q8j10n0J93k19
$$ -270 -66 155 -378 -186 -3 -289 -146 53 -126 -274 160 46 60 32 212 47 135 25 -25 168 -51
4224e1OJ93J80l42P7J10j96l4J45k04j0Q3m5LQ8j97j10L81k74p6L50%k85K25J30
$$ -51 -45 148 328 -14 63 173 -23 -57 88 -116 -126 -43 -88 -85 3 -194 -304 77 -197 -273 77 77 -208 17 147
4249A47K6j86N9K54j74O1l50L75nk56J77J96m28k93M90o4j72Q6j28J16q2o0J45
$$ 147 173 -13 46 300 126 187 -163 212 207 -49 128 324 -104 -397 93 29 -143 -57 -185 -69 -151 -211 -66
4272f6K83m14j75M14Mk25J29L57j90k34L36j30j5N9p8k8J35j88K4J70q6k20J73
$$ -66 217 -197 -372 42 46 -179 -50 307 117 -117 219 89 74 133 55 27 162 -26 -2 168 82 -138 35
4295C5q1j76j4K19j33l2OJ21J1j49J71K8Q8k04R7Q3n2M5J58J7j17j88J02J59m2
$$ 35 -46 -222 -236 -17 -150 -182 -176 -55 -44 -193 -22 6 94 -110 -13 70 18 63 221 238 121 -67 35 194 152
4320A52j34L1J01j74p3n1N2k27K36q3o4Q3J24q4p2J58Q1l6J17l0j31M0r1P6K45
$$ 152 18 49 150 -24 -97 -148 -96 -323 -87 -170 -234 -151 -27 -111 -183 -25 56 20 137 107 -24 16 -75 1 246
4345B46j32l4J07J7j23M3R1j78K4J66j17l4j62K7J07q6j37R9O4j13q5J67K8r0
$$ 246 114 80 187 204 81 124 215 37 61 227 110 76 -86 -59 48 -38 -175 -76 -12 -125 -210 -43 -15 -105
4369a05K45j8q3N7K7l6O2j03j7J47M3j78K9Q3j64J37k93K09mk20J95j2r6k4k72
$$ -105 140 122 39 96 123 87 149 46 29 176 219 41 70 153 -11 126 -167 42 38 -182 13 1 -95 -119 -391
4394c91L96k9r9J10J71k54O6mK42j56k4M8K9K16k20J45p5q5n0L3M3r2r4M7K2q5
$$ -391 5 -24 -123 -13 158 -96 -30 -34 208 52 28 76 105 321 101 246 171 86 36 69 112 20 -74 -27 -5 -90
4420i0pJ58j30r3n8J50j21j01J14K44K5j49m2L9P1L7J08q9N3j7Jl1J7j90L80j21
$$ -90 -97 61 -69 -162 -220 -70 -191 -292 -178 66 91 -58 -100 -61 10 47 155 66 119 102 103 72 89 -101 279 158
4446A58k46P0M8Q7j46j19J11j72Q2R8j00J1Q7r5P3m3J46k1R6j98J13P1J24q5j40
$$ 158 -88 -18 30 117 -29 -148 -37 -209 -127 -29 -129 -118 -31 -126 -53 -96 50 29 125 -73 40 111 235 150 10
4471A0J15Nl0k2j7J22j59l4J04j67k9l9M8m2%P0j69J2j7K10J2q5k0J72O0l49L17
$$ 10 125 130 100 78 61 183 24 -10 94 -73 -102 -141 -93 -135 -135 -65 -234 -222 -239 -29 -17 -102 -122 50 110 -239 78
4498G8Q7o1j59L14j69o5J05p9J68k27J46j4J3l51J93J85k01j65J66J13k16j19
$$ 78 165 104 -55 259 90 25 130 51 219 -8 138 124 137 -214 -21 164 -37 -202 -36 77 -139 -258
4520b58J51J76l03K15j20J71q3J6K16jl13J47K54r9k48K49M3j41n5J22k4k80R2
$$ -258 -107 69 -234 -19 -139 32 -51 -35 181 180 -133 14 268 169 -79 170 213 72 17 139 115 -165 -73
4543g3j0J30l26J8K89M9l20J2K18L8l80J60K58j50n6J42Q3o0J33j48J82j31j19
$$ -73 -83 47 -279 -261 28 77 -243 -231 -13 25 -355 -195 63 -87 -143 -1 82 22 155 7 189 58 -61
4566f1K97o1r8k7J39n8j64l2J79j63L9k27J59R1k49M8K87l33m6K64J65k31J21
$$ -61 236 175 77 50 189 131 -33 -65 114 -49 -10 -237 -78 13 -236 -188 99 -234 -280 -16 149 -82 39
4589C9M8j09J48o9l1J33R5k75P0J02o2O9R1k82l6oK79l84p2K80j00q7J59k24N9
$$ 39 87 -22 126 57 26 159 254 -21 49 151 89 158 249 -33 -69 -75 204 -180 -252 28 -72 -159 0 -224 -165
4614a65Jj80P7L38j73N6L07j27k77K05j6K6J34q3j00J11j03Q5K5j40j90K60q7
$$ -165 -164 -344 -267 71 -102 -46 261 134 -143 62 46 72 206 123 23 134 31 116 141 1 -189 71 -16
4637a6l19L11O7k47r2O9K05o8j99K07o1J32j76P1J84L0k11L07j14l2OK43j33j11
$$ -16 -335 -24 43 -204 -296 -227 -22 -90 -289 -82 -143 -11 -187 -116 68 98 -113 194 80 48 54 297 164 53
4661E3m7N0P6r0p8K51k16j44K08M8j13k46L65k46j16J44J0mM1j6L5J01Lj2N3j5
$$ 53 6 56 132 42 -36 215 -1 -145 63 111 -2 -248 117 -129 -245 -101 -91 -95 -54 -70 -35 66 69 57 110 95
4687I5j19J14J02j22K5J80j24n2j75J6M3K5j51n2K96l18Q8O3j32kJ76J05k48o3
$$ 95 -24 90 192 70 95 275 151 99 -76 -60 -17 8 -143 -195 101 -217 -129 -66 -198 -200 -24 81 -167 -230
4711b30K86j83L31p6k82M23p7k80R3P2l8m3L22j78j71K64j32o8lJ2k75J85K09
$$ -230 56 -127 204 128 -154 269 192 -88 5 77 39 -4 318 140 -31 233 101 33 30 42 -233 -48 161
4734A61l47nK19l80J77L09k90n6J57J7n4L32k90J62Q8k44K07j10jJ5K6N6j08r5
$$ 161 -186 -191 28 -352 -175 134 -156 -212 -55 -38 -92 240 -50 112 200 -44 163 53 52 67 93 149 41 -54
4758e4P6j50J60kr1O4r4j30O5N4m7M7j15n0K37J75j69j14J92P8j70Q7J4Q6l9j95
$$ -54 22 -128 32 30 -61 3 -91 -221 -156 -102 -149 -102 -217 -267 -30 145 -24 -138 54 132 -38 49 63 149 110 -85
4784h5OL79k51q3K61k9k15k0J57K2j82m9L2j33k5J39Q1j0l60K40K2J84l15J78
$$ -85 -79 300 49 -34 227 198 -17 -37 120 142 -40 -89 -57 -190 -215 -76 5 -5 -365 -125 -103 81 -234 -56
4808e6R1KR4L1P1p2j27O5j3k9k1K23P4l33p7K13j20k71P6J75p2p1l4J93q3K9j96
$$ -56 35 37 131 162 233 161 34 99 86 57 36 259 333 0 -77 136 16 -255 -179 -4 -76 -147 -181 12 -71 -42 -238
4835b38J90J57l74L05J04j49m8J41o0M3m4k1P8m9n4R4J58k12j54J78N3j14j78
$$ -238 -48 109 -265 40 144 -5 -53 88 28 71 27 6 84 35 -19 75 233 21 -133 45 98 -16 -194
4858a94L75j66k19RJ73q4m7O0l4j78K60P2P1mk49L38j10Nk9P0QJ32j85N2Q7q8
$$ -194 181 15 -204 -195 -22 -106 -153 -93 -127 -305 -45 27 98 94 -155 183 73 78 49 119 127 259 74 126 213 125
4884A25j37o5K0k37K71Mj83QR7J14k16M4J59q0j39K67L8q8j96K45P5m2J0P3r4
$$ 125 -12 -77 -57 -294 -23 -19 -202 -194 -97 17 -199 -155 4 -76 -215 52 90 2 -194 51 126 84 94 167 73
4909G3n2%M2O9r9l4N3q2kn4J63j50k20K81M0j87o9L03q6r7N7K83j87q6J19R0j73
$$ 73 21 21 63 132 33 -1 52 -30 -32 -86 77 -73 -293 -12 28 -159 -228 75 -11 -108 -51 232 45 -41 78 168 -5
4936em4K0J03J50k75kL24k05j5M9j9j89J5K49j58k01J23J60r6j19j63K79o0q1
$$ -5 -49 -29 74 224 -51 -53 271 66 51 100 81 -108 -93 156 -2 -203 -80 80 -16 -135 -298 -19 -79 -160
4960a60M0L04j84j31J40K24k64J6O6K09k58J6K93j14r5K7J00p8k26J08m9M9k02
$$ -160 -120 184 0 -131 9 233 -31 -15 51 260 2 18 311 197 102 129 229 151 -75 33 -16 33 -169
4983a69R0P0l6k31R5R1Q0j42N1J25R6l3R2J1j91j6O6J85r9j02J87j27j9l0L2K4
$$ -169 -79 -9 -45 -276 -181 -90 -10 -152 -101 24 120 87 179 190 -1 -17 49 234 135 33 220 93 74 44 76 100
5009A00l97L88K5j87j25J04Nk34N13k33o1N2k0M9P1j82J02P2Q2q5K0P1o0O4kr7
$$ 100 -297 91 116 -71 -196 -92 -87 -321 192 -41 -102 -50 -70 -21 50 -132 -30 42 124 39 59 130 70 134 132 35
5035C5N8j20K55l27L05k03k6J55j98k01K06J17j64J32j24q3K42o0n1j35M3J06
$$ 35 93 -27 228 -99 206 3 -23 132 -66 -267 -61 56 -108 24 -100 -183 59 -1 -52 -187 -144 -38
5057c8%J96j53J51kM7j95J89k02j0K48j39l4j9q4l9J83k69J57L5r4k02J47J93
$$ -38 -38 158 5 156 154 201 6 195 -7 -17 231 92 58 39 -45 -84 99 -170 -13 22 -72 -274 -127 66
5081F6l57K23J09r8p8P4j18J98N9m0J30p2k13J33J14o9l5l3K24m9q2r1n8J17k25
$$ 66 -291 -68 41 -57 -135 -61 -179 19 78 38 168 96 -117 16 130 61 26 -7 217 168 86 -5 -63 54 -171
5106a71n1L17k74J2n4R7j28R2J74l0L2j28O2J72r7n7J59J95k25j32J82r3o6J40
$$ -171 -222 95 -179 -167 -221 -124 -252 -160 14 -16 16 -112 -50 122 25 -32 127 322 97 -35 147 54 -12 128
5130A28L6m9n6o0M4M0j48K2J6J08k34J93j20J4j55K45N6l09K67k9m3J3J21l0J42
$$ 128 164 115 59 -1 43 83 -65 -43 -27 81 -153 40 -80 -66 -221 24 80 -229 38 9 -34 -21 100 70 212
5155B12j73K4oO7j92J01K69j69k84J06k2Q1P2k1j63J13n2j46K28k13J16P2r1J9
$$ 212 39 63 57 124 -68 33 302 133 -151 -45 -67 14 86 65 -98 15 -37 -183 45 -168 -52 20 -71 -52
5179e2J32j3o1%R9J4J1N8q3R3k14M2J52q5j86K01l9j18J45o5p7J15j07J3o3q6
$$ -52 80 67 6 6 105 119 130 188 105 198 -16 26 178 93 -93 108 69 -49 96 31 -46 69 -38 -25 -88 -174
5205a74l8M9K87j45P3Q1o2l13K63K13j91j36L06j07j10O8p5j7R1m3lJ88k02j10
$$ -174 -212 -163 124 -21 52 133 71 -242 21 234 43 -93 213 106 -4 64 -11 -28 63 20 17 205 3 -107
5229a07R9J52l40O3K78k34k04K55m2ko0l4J60R5m2o2j21K75k58J65K85n64L64
$$ -107 -8 144 -196 -133 145 -89 -293 -38 -80 -82 -142 -176 -16 79 37 -25 -146 129 -129 36 321 -243 121
5252A21lJ58k12j7nQ7j72L8j5N1j93r0L57k30l6J44Kk23K05J3J88j07j99J20P3
$$ 121 118 276 64 47 42 129 -43 -5 -20 31 -162 -252 105 -125 -161 -17 -15 -238 -33 -20 168 61 -138 -18 55
5277E5M0j56K48j48j71L21J20j39k09P3n1j54K58k19P6K12j90OL4R2j09l6K7k53
$$ 55 95 -61 187 39 -132 189 309 170 -39 34 -17 -171 87 -132 -56 156 -34 -28 6 98 -11 -47 -20 -273
5301b73P2J45m5p2K10q3J75j56M2p5J28j02Q5K15j69Qj11J17q9L8J22l65Q3M5
$$ -273 -201 -56 -101 -173 37 -46 129 -27 15 -60 68 -34 51 266 97 105 -6 111 22 60 182 -183 -100 -55
5325e5O1L6j46j0R6k51J60J21j0n1M3J65j65O1n6N3J6p2J2J47l6k55K23R6M1k92
$$ -55 6 42 -104 -114 -18 -269 -109 12 2 -49 -6 159 -6 55 -1 52 68 -4 8 155 119 -136 87 183 224 -68
5351f8P4J45k07l6J96m4l14P0J68J13j72P1k9J04k56P4J63p0j92L28J26k93J23
$$ -68 6 151 -56 -92 104 60 -254 -184 -16 97 -75 -4 -33 71 -185 -111 52 -18 -210 118 244 -49 74
5374G4L9J96k73K6rr4P7J00j46or4J02l6p7j80L20n1q2N2Q4k84L31L7k72J62R7
$$ 74 113 309 36 62 53 -41 36 136 -10 -16 -110 -8 -44 -121 -301 19 -32 -114 -62 22 -262 69 106 -166 -4 93
5400I3j54Q5K96l14K8N6l9O8k24K19J03j18o1K2o6l8J04m5l5o8J0P3j26J5m4N3
$$ 93 -61 24 320 6 34 90 51 119 -105 114 217 99 38 60 -6 -44 60 15 -20 -88 -78 -5 -131 -116 -160 -107
5426a07J46k7k3j4j1n8Q4N0J78k12n4K45k5k0j63J83j20j56J39J69k93m1J15P
$$ -107 39 12 -11 -25 -36 -94 -10 40 218 6 -48 197 172 152 -11 172 52 -104 35 204 -89 -130 -15 -8
5450hJ0P3k58N6J56O7j20n5l3k3O1J51q1J58Kj47J92k10J46p7l4J37j49O5O9k05
$$ -8 2 75 -183 -127 29 96 -24 -79 -112 -135 -74 77 -4 154 156 9 201 -9 137 60 26 163 14 79 148 -57
5476e7J80j32l7n2J13j37P8L1k88J03J19k9N9j1J91L7M2k04l9L9p0K01j2N6k65
$$ -57 123 -9 -46 -98 15 -122 -44 -13 -301 -198 -79 -108 -49 -60 131 168 210 6 -33 6 -64 137 125 181 -84
5501h4K27L4m2k6r0l9j86K65R7k16L3o4L06k81o2K4J91j89k41J13L53k40K23j05
$$ -84 143 177 135 109 19 -20 -206 59 156 -60 -27 -91 215 -66 -128 -104 87 -102 -343 -230 123 -117 106 1
5525Am9P1p4R5O5r1o0J49O6r1o2J74j44Nm0K66m83J9Q5J78j99J38j98R5Q6k13
$$ 1 -48 23 -51 44 109 18 -42 107 173 82 20 194 50 55 15 281 -202 -183 -98 80 -119 19 -179 -84 2 -211
5551b11J27J70j77k02L81J72k27qJ80k55J8j7K24j4k61R8rN7kM4j56J00q8O4O0
$$ -211 -84 86 -91 -293 88 260 33 25 205 -50 -32 -49 175 161 -100 -2 -11 46 44 88 -68 32 -56 8 68
5576F8j74o5k4J70M4j79N3J89k06J05p4J97p5O7m0l6O1N6j26R2j28J22j26M4k1
$$ 68 -106 -171 -195 -25 19 -160 -107 82 -124 -19 -93 104 29 96 56 20 81 137 11 103 -25 97 -29 15 -6
5601fM1R0l16jJ20R0k81K56Qj55O1l1J39k06J97n6O0l9N5qM9j13P2K1m4j83L33
$$ -6 35 125 -191 -192 -72 18 -263 -7 1 -154 -93 -124 15 -191 6 -50 10 -29 26 18 67 -46 26 47 3 -180 153
5628A53ll33k7M02j87Kl4RP6j23k77L72K1j99J01Q7p0lJ95k42K6j31K15J74j65
$$ 153 150 -183 -210 192 5 7 -27 -18 58 -65 -342 30 51 -148 -47 40 -30 -33 162 -80 -54 -185 30 204 39
5653C9j8J33N5j74J02m5Mk22N8J62K8j51oJ30j29J11j88J30O9k86J76Q5j48j06
$$ 39 21 154 209 35 137 92 96 -126 -68 94 122 -29 -35 95 -34 77 -111 19 88 -198 -22 63 -85 -191
5677a91J71Q8j44R0J60j02n1p9J03J05J19l40J63J63k04j76J79m1k6N4n7k1qo1
$$ -191 -20 68 -76 14 174 72 21 -58 45 150 269 -71 92 255 51 -125 54 13 -13 41 -16 -37 -45 -106
5701a06J46k1j53O3n5J26k50L69j14P0pM2j39K0J64n7l3J55l24J44J4q5J98j58
$$ -106 40 19 -134 -71 -126 0 -250 119 5 75 68 110 -29 -9 155 98 65 220 -104 40 54 -31 167 9
5725In7J27j12J47k07l9N8M4r0l4M4J84j63lJ16n0q8J71k8j32J36k1m4P7K0J97
$$ 9 -48 79 -33 114 -93 -132 -74 -30 -120 -154 -110 74 -89 -92 24 -26 -114 57 29 -103 33 12 -32 45 65 262
5751B62k05%J99k48K15l32J11J2j8J30q2kj86P7K1NO6j56K80jj73O6l3j86J16
$$ 262 57 57 256 8 223 -109 2 14 -4 126 44 42 -144 -67 -46 -41 25 -131 149 148 -25 41 8 -178 -62
5776f2k9J88j06j16L38k7k87J75j98J95j0j76O4J99j49q9N4L1N6k00J31M8j59
$$ -62 -91 97 -9 -125 213 186 -101 74 -124 71 61 -115 -51 148 -1 -90 -36 -5 51 -149 -18 30 -129
5799a29n4J36Q3o2N9N6m4j30P6P2n1J01j15J60j47N2r8J13j9n9m3J09l8q0lJ23
$$ -129 -183 -47 36 -26 33 89 45 -85 -9 63 12 113 -2 158 11 63 -35 78 59 0 -43 66 28 -52 -55 68
5825F8j71J8J3j0K2j0PO0j85NJ50Q1n6j1R1o1k7J8o4Q4p4L6J47j56P3m1p0O3q
$$ 68 -103 -85 -72 -82 -60 -70 -63 -3 -188 -183 -33 48 -8 -19 72 11 -16 2 -62 22 -52 -16 131 -25 48 7 -63 0 -8
5854hp3k3o6JO8J75r8Rl9mK17j93J13j8p5RR7J66k57J28j20J03o2OL7j7N5j17
$$ -8 -81 -104 -170 -169 -101 74 -24 -15 -54 -58 159 -34 79 61 -14 -5 92 258 1 129 9 112 50 56 93 76 131 14
5882A4Q6k01J65J2j23j07N9P5j46J10k0K3k7j7R6L1m2R0j06J70k17K07l3j08J2
$$ 14 100 -101 64 76 -47 -154 -95 -20 -166 -56 -76 -53 -80 -97 -1 30 -12 78 -28 142 -75 132 99 -9 3
5907CJ41mr4j39R8J83j67p3N6r4n0J61j00K4k32K43J03l7l52K96P1Rn7N4L2j06
$$ 3 144 140 46 -93 5 188 21 -52 4 -90 -140 21 -79 -55 -287 -44 59 22 -330 -34 37 46 -11 43 75 -31
5933c1l5J44j6OOJ64p4k6j13K57l59M6p3J34n5q6M0J46n6j18M4K15l41J05M8J29
$$ -31 -66 78 62 68 74 238 164 138 25 282 -77 -31 -104 30 -25 -111 -71 75 19 -99 -55 160 -181 -76 -28 101
5959A01j37O0j0j21J07J2o8N3M3j49L24j06j54k4K07M3k50J06P7j56l9L5J83k14
$$ 101 -36 24 14 -107 0 12 -56 -3 40 -109 215 109 -45 -69 138 181 -69 37 114 -42 -81 -46 137 -77
5983g7K0M9p2K4oP9Jj83L3K93j11k11L01j17J13p5j18J3j30J83O4j04J33L4k2
$$ -77 -57 -8 -80 -56 -62 17 18 -165 -132 161 50 -161 140 23 136 61 -57 -44 -174 9 73 -31 102 136 114
6008A14r8j27l4J43j34J15L4o6n9P6q5n0J89o5J24o1M5J2J82k95p9J99Q9J6k88
$$ 114 16 -111 -145 -2 -136 -21 13 -53 -112 -36 -121 -171 18 -47 77 16 61 73 255 -40 -119 80 169 185 -103
6033a03J80j00qR2J41j65j72J80k0J04j43n7Q6q1n2K4K20k2j90K8O5j32K49O2
$$ -103 77 -23 -31 61 202 37 -135 45 25 129 -14 -71 15 -66 -118 -94 126 104 -86 -58 7 -125 124 186
6057A86j67k2R1k38L04M7p5j58J94L1l77J99k6j59K86o1m8l2L9K2j06P7j47J67
$$ 186 19 -3 88 -150 154 201 126 -32 162 193 -184 15 -11 -170 116 55 7 -25 14 36 -70 7 -140 27
6081B7r7J33m2n0j6Q2n2o4K65k89J65J8k8K6QO4j75M6j11J22l3o5J68k06M4L6
$$ 27 -70 63 21 -29 -45 37 -15 -79 186 -103 62 80 52 78 86 150 -25 21 -90 32 -1 -66 102 -104 -60 -24
6107b4j30J74j02m4l4J71j27Q5l7K01j14J34n6j5o1NP0J25j97J81j59r4J41K1
$$ -24 -154 20 -82 -126 -160 11 -116 -31 -68 133 19 153 97 82 21 26 96 221 24 205 46 -48 93 114
6131A14J40m80R3K00j08R2j3k65K00m1J3P1N7o7k14L14k96P2J92j76J86n1J25
$$ 114 254 -226 -133 67 -41 51 38 -227 -27 -68 -55 16 73 6 -208 106 -190 -118 74 -102 84 33 158
6154A58k31J48no8p3J78r2J14n0l6pm8k2K6k3n7j73J41m2nJ74pO1j01j5J0Q4j13
$$ 158 -73 75 70 2 -71 107 15 129 79 43 36 -12 -34 -8 -31 -88 -261 -120 -162 -167 7 0 61 -40 -55 -45 39 -74
6182g4N6J80p7j40J50NN5k07J57j52K5O3j4K1j42q6K6R2o9J00m1J5j50M2J0J00
$$ -74 -18 162 85 -55 95 100 155 -52 105 -47 -22 41 27 48 -94 -180 -154 -62 -131 -31 -72 -57 -207 -165 -155 -55
6208e5Q5k15L00j88M4K66k45m7k0J04J61l7k10J71l5n9qM1r0J55k37J21r3K52
$$ -55 30 -185 115 -73 -29 237 -8 -55 -75 29 190 153 -57 114 79 20 12 53 -37 118 -119 2 -91 161
6232A61k30K2Lj15PJ81M7l8j48K44q4p7J23N1P6k20k9J19Q8j33j03J69j69N8P
$$ 161 -69 -47 -44 -159 -152 29 76 38 -110 134 50 -27 96 147 223 3 -26 93 181 48 -55 114 -55 3 10
6257A0k13J65o9J22oo9q8J53M6q1r2J35L0j31J50q0J49r9L9q6j24J45j29K83n5
$$ 10 -203 -38 -107 15 9 -60 -148 5 51 -30 -122 13 43 -88 62 -18 131 32 71 -15 -139 6 -123 160 105
6282A05n9j91K61j41M3N8j15L4n4R2j49N3J17j80N2o4J04Q0k70q7K91L0p1J20
$$ 105 46 -145 116 -25 18 76 -39 -5 -59 33 -116 -63 54 -126 -74 -138 -34 46 -224 -311 -20 10 -61 59
6306E9Mj22J89j85L5M1Q7j67K03N2j15J9K6q4j39J85j13j46J33l4M9j2k4M7R9
$$ 59 63 -59 130 -55 -20 21 108 -59 144 196 81 100 126 42 -97 88 -25 -171 -38 -72 -23 -35 -59 -12 87
6331H7j75J05k7q5K21j31oj27J70L9m8P6m1O2r7j13J46J44k04J16j8l1n4M5n1
$$ 87 -88 17 -10 -95 126 -5 -11 -138 32 71 23 99 58 120 23 -90 56 200 -4 112 94 63 9 54 3
6356CP1n7q7Q6j11O9j14KJ78j57Q0J12o7L6r0J95o8o8N0J49k0k47P6J55j04l7
$$ 3 74 17 -70 16 -95 -26 -140 -138 40 -117 -37 75 8 44 -46 149 81 13 63 212 192 -55 21 176 72 35
6382C5j9O3jk2p4Q6j45l5p4J35r3l5J54q4KM9J37j53O6j7O6m6L9jJ34o4j50J91
$$ 35 16 79 78 56 -18 68 -77 -112 -186 -51 -144 -179 -25 -109 -107 -58 79 -74 -8 -25 41 -5 34 33 167 103 -47 144
6410A44n1r6P2m3J53p2k48J53q9jl2R2o2j1N8K00j40lp4J13j4j83J97K6j05QK9
$$ 144 93 -3 69 26 179 107 -141 12 -77 -78 -110 -18 -80 -91 -33 167 27 24 -50 63 49 -134 63 89 -16 -8 21
6437B1P5J0l6k5m6J0m4Q7r4l2j09K26k17J8J22n7R2j03K61k17O1Qj00L5J06Nm8
$$ 21 96 106 70 45 -1 9 -35 52 -42 -74 -183 43 -174 -156 -34 -91 1 -102 159 -58 3 11 -89 -54 52 57 9
6464Im7J9lok9J86n4r5J96m2l25J76q0K9k5O4J1N7j07J75n5r7J87k69M2l0P7k
$$ 9 -38 -19 -22 -28 -57 129 75 -20 176 134 -191 -15 -95 -66 -91 -27 -16 41 -66 109 54 -43 144 -125 -83 -113 -36 -38
6492c8J02o0J72k27m5P2Q4L5j76K19n9r2L0J06j39j87J12J44p3j9J5K2K6q6J36
$$ -38 64 4 176 -51 -96 -24 60 95 -81 138 79 -13 17 123 -16 -203 -91 53 -20 -39 -24 -2 24 -62 74
6517G4j33J63j04J19j53r9J43n9J58k41J04J16J25k27kJ36l6K7j27N0J35k04J03
$$ 74 -59 104 0 119 -34 -133 10 -49 109 -132 -28 88 213 -14 -16 120 84 111 -16 34 169 -35 68
6540F8N5j12j35J51n3K9J05k21J04q7j0N8k9J15n9J8J10p3N9m7j89K43M2R9j90
$$ 68 123 11 -124 27 -26 3 108 -113 -9 -96 -106 -48 -77 38 -21 -3 107 34 93 46 -143 100 142 241 51
6565E1kN8j05R8j2j68N4l4l5O9r3P6j60K38L2k18J03J6M5K9lp0P2j10K61j02q3
$$ 51 49 107 2 100 88 -80 -26 -60 -95 -26 -119 -43 -203 35 67 -151 -48 -32 13 42 39 -31 41 -69 192 90 7
6592Gj8lQ0j50K41k17N6m8m3N1O7j7p9K2J28j96K3R9J8j67O3P9o7j20J58L1J4
$$ 7 -11 -14 66 -84 157 -60 -4 -52 -95 -44 23 6 -73 -51 77 -119 -96 3 21 -146 -83 -4 -71 -191 -33 -2 12
6619A2J6O8J5k73J54M5m3m1O1R7j5J3q8l7M9M9j21J4r8R3J24O4j23j06j14J18
$$ 12 28 96 111 -162 -8 37 -6 -47 14 111 96 109 21 -16 33 82 -39 -25 -123 -30 94 158 35 -71 -185 -67
6645f7JJ94o5j48l8K36k5q8jK7J33j05n8m6K05j77m1m2J4j9R4K6o1J36m7j24m6
$$ -67 -66 128 63 -85 -123 113 88 0 -1 26 159 54 -4 -50 155 -22 -63 -105 -91 -110 -16 10 -51 85 38 -86 -132
6672a32J35j46K56j59J10r3q4J77o9j6P3j56J60p0o7J63r6K82k65j38J24J44k01
$$ -132 3 -143 113 -46 64 -29 -113 64 -5 -21 52 -104 56 -14 -81 82 -14 268 3 -135 -11 133 -68
6695f8m9P5M0m3Q1j88J66k75K19M9K2k6K3O4Jp0J5q7Q9j93K51K1o9k0L9n2r8L4
$$ -68 -117 -42 -2 -45 36 -152 14 -261 -42 7 29 3 26 90 91 21 36 -51 38 -155 96 117 48 28 67 15 -83 -49
6723d9J80j95j21J73M2J6q6j37R6J68Pj01Q5n1m3k28L29j31J06j04J05M1j26J58
$$ -49 131 -64 -185 -12 30 46 -40 -177 -81 87 94 -7 78 27 -16 -244 85 -46 60 -44 61 102 -24 134
6747A34l5j22K17k01M8j05J65l7j1q4n5J93k26J05p4k5q0R8RJ09pj12J26j11m6
$$ 134 99 -23 194 -7 41 -64 101 64 53 -31 -86 107 -119 -14 -88 -113 -193 -95 -86 23 16 -96 30 -81 -127
6772a27M8J53p3J35k60K09J08j17k8Q5j82k7J81j18o1L5J27j97J22j72R1r0j6
$$ -127 -79 74 1 136 -124 85 193 76 48 133 -49 -76 105 -13 -74 -39 88 -109 13 -159 -68 -158 -174
6795a74J0J74j1j0o8P3J25j54J35j62K19j13j73K21k30K87k92J15J32k55O0J60
$$ -174 -164 10 -1 -11 -79 -6 119 -35 100 -62 157 44 -129 92 -138 149 -143 -28 104 -151 -91 69
6817F9j20N8k0j64K54j50M7j9P8m9Q3m6M4j17N0N8L8j25q7M0J05J04j72O6J16
$$ 69 -51 7 -13 -177 77 -73 -26 -45 33 -16 67 21 65 -52 -2 56 94 -31 -118 -78 27 131 -41 25 141
6842A41j11m8K18k20J93q6m2J88J3j56j49J3nj0P7o3K4j1M8j14j1l7J33R2j21
$$ 141 30 -18 200 -20 173 87 45 233 246 90 -59 -46 -51 -61 16 -47 -23 -34 14 -100 -111 -148 -15 77 -44
6867d4Q9K2l5J39nr8k08J69O7J27r5k36J55k4P8k13l5O8Q1l7O3o4j77K81j82J27
$$ -44 45 67 32 171 166 68 -140 29 96 223 128 -108 47 23 101 -112 -147 -79 2 -35 28 -36 -213 68 -114 13
6893A3k75K60nO5k5j26K35j14Kj16J97l6L3M5p8J26k10J3M8J1M2j67J69j37Q7
$$ 13 -262 -2 -7 58 33 -93 142 28 30 -86 111 75 108 153 75 201 -9 4 52 63 105 -62 107 -30 57
6918E7j91nJ52p1rK00j90l4J07m9J18j35O1Pm6Q5o5K01j9j18n5m7j25K06j10K23
$$ 57 -134 -139 13 -58 -67 133 -57 -91 16 -33 85 -50 11 18 -28 57 -8 193 174 56 1 -46 -171 35 -75 148
6944A48l19J94j7j7o9P3j21rJ43n0L2j24O5qL6R4p6M6Q1j04q9J46p3p7J95j98
$$ 148 -171 23 6 -11 -80 -7 -128 -137 6 -44 -12 -136 -71 -79 -43 51 -25 21 102 -2 -91 55 -18 -95 100 -98
6970i8J71l1o8n6J75n1j14OLl1MJ53j15OJ5N0J9MM8j59j9q7R6p7K52P2k2k64J48
$$ -98 73 42 -26 -82 93 42 -72 -66 -63 -94 -90 63 -52 -46 -31 19 38 42 90 -69 -88 -175 -79 -156 96 168 146 -118 30
6999C0J00j75J77j33J15j22K6n5Q6K2j10j3j6L9j04O2k0Q6m3l9J11k5J4j75K71
$$ 30 130 -45 132 -1 114 -8 18 -37 49 71 -39 -52 -68 -29 -133 -71 -91 -5 -48 -87 24 -1 13 -162 109
7024A09j26k0N3J33j79j3M7R9j29J94j64P2p4PP9j75L7J89j78P9j9j9k07J08J3
$$ 109 -17 -37 16 149 -30 -43 4 103 -26 168 4 76 2 9 88 -87 -50 139 -39 40 21 2 -205 -97 -84
7049h4J41O4j03n9J32j45j28K41J02m1j69K31j30j33J33PM6j38J19k7j64J1J06
$$ -84 57 121 18 -41 91 -54 -182 59 161 120 -49 182 52 -81 52 59 105 -33 86 59 -105 -94 12
7072A2j33J27O3j90O1J57k32J16J89k39q1J57q1J43M5j66R7j9Mj95J11j15K07
$$ 12 -121 6 69 -121 -60 97 -135 -19 170 -69 -150 7 -74 69 114 -52 45 26 30 -165 -54 -169 38
7095C8j29K80q6j33P6o1R9k43J63j7J4l0M5P9j48N8r9l7K15j43J81j89k6J46r2
$$ 38 -91 189 103 -30 46 -15 84 -159 4 -13 1 -29 16 95 -53 5 -94 -131 84 -59 122 -67 -93 53 -39
7120c9Q4M2j42J16l1j8Q1n6M0j57J43mLj40K62j44p8m2K17k45L7M2JK1n4P3L4
$$ -39 45 87 -55 61 30 12 93 37 77 -80 63 59 62 -78 184 40 -38 -80 137 -108 -71 -29 -28 -7 -61 12 46
7147D6n6Q0r0J21j23P2K4j87K48r5J1j10N2K22j06r8R9j53J3j01K04n3n9j95K54
$$ 46 -10 70 -20 101 -22 50 74 -113 135 40 51 -59 -7 215 109 11 110 -43 -30 -131 73 20 -39 -234 20
7172B0P9j47O5k0j2l8%O1L6k16J85N8p5O3j23K30%j73k9J34j83M9K7M1p8M4K2
$$ 20 99 -48 17 -3 -15 -53 -53 8 44 -172 13 71 -4 59 -64 166 166 -7 -36 98 -85 -36 -9 32 -46 -2 20
7199B0NM2j96K71j14q3l4J01j17K3l6P8R2p6p4Q9L4N6J5m6j11J29j1o0J60k15
$$ 20 25 67 -129 142 28 -55 -89 12 -105 -82 -118 -40 52 -24 -98 -9 25 81 96 50 -61 68 57 -3 157 -58
7225e8P8l8R2j41O9k12J90K35k80j3K07k35NJ38q6Pq6J21K13j32P3p3Nj03qK54
$$ -58 20 -18 74 -67 2 -210 -20 215 -65 -78 129 -106 -101 37 -49 -42 -128 -7 206 74 147 74 79 -24 -32 222
7251B22l46J35Oj8p9P7J7J41j85R0o1n7N6k8Nj37J73k6j23kQ0J02j32J31q2JL9
$$ 222 -124 11 17 -1 -80 -3 14 155 -30 60 -1 -58 -2 -30 -25 -162 11 -15 -138 -140 -60 42 -90 41 -41 -40 -1
7278aL7lr7J39K9k41K12j47J34j44kN7J1J6J0r6n3K64j22J07q6m4pp7J30m6j13
$$ -1 36 33 -64 75 104 -137 75 -72 62 -82 -84 -27 -16 0 10 -86 -139 125 3 110 24 -20 -27 -104 26 -20 -133
7305a33Q9P1l5J29j35o0N3P2P0O9k32o0R6l1n8n6P3N6PJ7j22J68m4l6P8k61J40
$$ -133 -44 27 -8 121 -14 -74 -21 51 121 190 -42 -102 -6 -37 -95 -151 -78 -22 -15 2 -120 48 4 -32 46 -215 -75
7332g5J24n5r9N1r8K46j96m3J25J16L8m7j7n9J9k2K8M3J88k84R8k98J32J76l9
$$ -75 49 -6 -105 -54 -152 94 -102 -145 -20 96 134 87 70 11 30 8 36 79 267 -17 81 -217 -85 91 52
7357E2J16l05J34L1Mq7J97p1l3N0J06j34o7K2m3M3p4jmJ28L6J8P9k19j10K17k9
$$ 52 168 -137 -3 28 32 -55 142 71 38 88 194 60 -7 15 -28 15 -59 -60 -64 64 100 118 197 -22 -132 85 56
7384E6j52P4R6k90K83p9J7j74J48ML7K63m18K62j70r5J73Kj42M0J32r1R2K3qK7
$$ 56 -96 -22 74 -216 67 -12 5 -169 -21 -17 20 283 -135 127 -43 -138 35 37 -105 -65 67 -24 68 91 83 110
7410A10j23L3%j88K33j7k26P0K71j10qJ0L1r7j14J13r8K14j58MJ4j44L37j56O8
$$ 110 -13 20 20 -168 65 48 -178 -108 163 53 45 55 86 -11 -125 -12 -110 104 -54 -50 -36 -180 157 1 69
7435F9j0j23L4k2NJ3n5J99j46l2k5J37j39P6oO0j49N9m8jjN8r5L54j42k3J7j8
$$ 69 59 -64 -30 -52 -47 -34 -89 110 -36 -68 -93 44 -95 -19 -25 35 -114 -55 -103 -104 -105 -47 -142 212 70 47 64 46
7463D6mn0J56j41r5mN2N9O9q6J56j65Q1k0l7j05N0j7K0n9N9K2r4K17q6o4p8J22
$$ 46 42 -8 148 7 -88 -92 -40 19 88 2 158 -7 74 54 17 -88 -38 -55 -35 -94 -35 -13 -107 110 24 -40 -118 4
7491DK8j86R0o1K05q2M2q6P1r3K26j29k3O9j85J51k4r1k7Q7n5JM9Q5j32JJ33j40
$$ 4 32 -154 -64 -125 80 -2 40 -46 25 -68 158 29 6 75 -110 41 17 -74 -101 -14 -69 -68 -19 66 -66 -65 68 -72
7519g2P5J02k25J41r2j7J33j06P1J85k25L3j6K7o8P1j2k4L3J37j07m8j1j22J47
$$ -72 3 105 -120 21 -71 -88 45 -61 10 195 -30 3 -13 14 -54 17 5 -19 14 151 44 -4 -15 -137 10
7544A0j13J56j68J78j15L8J81l45R5L0L1p9J67N9j75J71j43J55m8r3J56j50r3
$$ 10 -103 53 -115 63 -52 -14 167 -178 -83 -53 -22 -101 66 125 -50 121 -22 133 85 -8 148 -2 -95
7567i5o6J72P3j0j48J31L2l2k24J72j32Q3l9K5L0NQL1J58m7k20Q0J97j37j22J32
$$ -95 -161 11 84 74 -74 57 89 57 -167 5 -127 -44 -83 -58 -28 -23 -15 16 174 127 -93 -13 184 47 -75 57
7593E7pj58J34M7q5J15k9k6J5j24j5J30j6o7j05J05o3J29j58K45k91J95j20J24
$$ 57 50 -108 26 73 -12 103 74 48 63 -61 -76 54 38 -29 -134 -29 -92 37 -121 124 -167 28 -92 32
7617C2K9j9L7q1qn0J17Q7j61J42j8k88K42k56L60j95p3K90k16n2J50j56N9K8l1
$$ 32 61 42 79 -2 -10 -60 57 144 -17 125 107 -181 61 -195 165 -30 -103 187 -29 -81 69 -87 -28 0 -31
7642c1j2n9PP9L9oK0j14K1l6n1oJ95j9J1j5J5K5K0j38J65j2L1p1k77J76J56k69
$$ -31 -43 -102 -95 -16 23 17 37 -77 -56 -92 -143 -149 46 27 38 23 38 63 83 -55 110 98 129 58 -219 -43 113 -156
7670a56J70rr5J10J35q8j15K9l7K09l4j14O6NNL4L4k83J96j34J44j02k1J53j22
$$ -156 14 5 -90 20 155 67 -48 -19 -56 153 119 5 71 76 81 115 149 -134 62 -72 72 -30 -51 102 -20
7695b0P2j91R5Q8q2K09l11l8K49r1R2Q9k70J25jo2l1N3J14J03j86K1O4j66J54
$$ -20 52 -139 -44 44 -38 171 -140 -178 71 -20 72 161 -109 16 15 -47 -78 -25 89 192 6 27 91 -75 79
7720G9r0k9J63k75O7oJ13j20N2q4k3J98j40M1m1P0L6M2j16O7J5o8Q5l1K4O1j38
$$ 79 -11 -40 123 -152 -85 -91 22 -98 -46 -130 -153 45 -95 -54 -95 -25 11 53 -63 4 19 -49 36 5 29 90 -48
7747d8JJ37j65J62j30J03j58N6k6J23J3n8N7r3P3N5j83N5J74j8j30j27K11r3M
$$ -48 -47 90 -75 87 -43 60 -98 -42 -68 55 68 10 67 -26 47 102 -81 -26 148 130 0 -127 84 -9 -5
7772eK1j61Q6J47q9M1j43J04J83j51J5mkj67P9J32J9j94K5J0J40m7j50Q4L4j95
$$ -5 16 -145 -59 88 -1 40 -103 1 184 33 48 44 42 -125 -46 86 105 -89 -64 -54 86 39 -111 -27 7 -188
7798a88K23k08J08L10j34j25J11m9O7j02q2l0M1R4j4k6n4Q3o4K1K1o1J32m8R7
$$ -188 35 -173 -65 245 111 -14 97 48 115 13 -69 -99 -58 36 22 -4 -58 25 -39 -18 3 -58 74 26 123
7823A23j70j7L4n3M0M8k0j00J08J20j24j44K28p8lR0m2L5j87J70j45q2J96L9j13
$$ 123 -47 -64 -30 -83 -43 5 -15 -115 -7 113 -11 -155 73 -5 -8 82 40 75 -112 58 -87 -169 27 66 -47
7848d7L5J42k13P5P5N2Qj02j5j75K55k50K74N9k70J31j8k0J08l7m3j37J92j47
$$ -47 -12 130 -83 -8 67 119 127 25 10 -165 90 -160 114 173 -97 34 16 -4 104 67 24 -113 79 -68
7872f8K45j08L5j3qJ1j50J7R3k03K73j32p6NL4J06o4J17j26p9j0J20K1j40k7R5
$$ -68 177 69 104 91 83 94 -56 -39 54 -149 124 -8 -84 -79 -45 61 -3 114 -12 -91 -101 19 40 -100 -127 -32
7898c2J48k94J83qj61L99k06j29P8O4p5l3J17J9%rk06K10j6lp0r8J32P5j44J19
$$ -32 116 -178 5 -3 -164 235 29 -100 -22 42 -33 -66 51 70 70 61 -145 65 49 46 -24 -122 10 85 -59 60
7924F0j69L8R9j40J49J41j06K2n3q8J42j00j5l6J71J4j59J45j22MJ54k32OOJ03
$$ 60 -109 -71 28 -112 37 178 72 94 41 -47 95 -5 -20 -56 115 129 -30 115 -7 -3 151 -81 -75 -69 34
7949C4j01Q7n5l3N8J41q9o0m5L5R0j66K08j54O1m7J72k24J58l5L2p3j48J95l1
$$ 34 -67 20 -35 -68 -10 131 42 -18 -63 -28 62 -104 104 -50 11 -36 136 -88 70 35 67 -6 -154 41 10
7974A0j27J15M8r2Q0j2m5lM4N8r4J61j61M4P1j76J23p5oJ90k42P0J25j29O3j93
$$ 10 -117 -2 46 -46 34 22 -23 -26 18 76 -18 143 -18 26 97 -79 44 -31 -37 153 -89 -19 106 -23 40 -153
8000a53J26J00l2J6N1q5p8J83j47j7M4J58l49N6J86o0j08L4m9J19j26J77n9M1
$$ -153 -27 73 41 57 108 23 -55 128 -19 -36 8 166 -183 -127 59 -1 -109 -75 -124 -5 -131 46 -13 28
8024B8J00j08O3l0L4%n0J22k48Q9K34k37m7j34K02j14J10q2L8j0o%R4q3j59K52
$$ 28 128 20 83 53 87 87 37 159 -89 0 234 -3 -50 -184 18 -96 14 -68 -30 -40 -46 -46 48 -35 -194 58
8050E8n7kJ3l4j03P1O3j63J80o6O5J4q4LK14k34J8J70r7K3j30J2J8L0J09l9m1
$$ 58 1 -1 12 -22 -125 -54 9 -154 26 -40 25 39 -45 -42 172 -62 -44 126 29 52 -78 -66 -48 -18 91 52 11
8077A1j11P1qJ48j98j3K0R6j56k57L37r1K1J17O0j00j10O8J87n2J63k44m2J10
$$ 11 -100 -29 -37 111 -87 -100 -80 16 -140 -397 -60 -151 -130 -13 47 -53 -163 -95 92 40 203 -41 -83 27
8101B7j22Q6j8J1M5J11k12P8K7OQ3j62L4j02J78rp1PL1j3m1P3J86k72P5m1L2P1
$$ 27 -95 -9 -27 -16 29 140 -72 6 33 39 122 -40 -6 -108 70 61 -10 -3 28 15 -26 47 233 -39 36 -5 27 98
8129I8J6k58N6O3J29m8j6o1l4J68k24J46r4J6oK2J4j8K1J32j10p2Q3J02k01J39
$$ 98 114 -144 -88 -25 104 56 40 -21 -55 113 -111 35 -59 -43 -49 -27 -13 -31 -10 122 12 -60 23 125 -76 63
8155F3P2j23p3M2P9k3j1j10J82k54K11R0j74L5K2j06P9k9l1O7P2j6n7l4j4J10
$$ 63 135 12 -61 -19 60 37 26 -84 98 -156 55 145 -29 6 28 -78 1 -28 -59 8 80 64 7 -27 -41 69
8181F9q9K2Q1kl1n2R2k27LQ2
$$ 69 -20 2 83 81 50 -2 90 -137 -134 -52
8191e2
$$ Imaginary data points
##PAGE= N=2
##DATA TABLE= (X++(I..I)), XYDATA
0@%%%%%%%%%%%qJ6j6J6j6K4l2L8m6N6o4P2q8J04j20J40j62J86k16K48k80L14l55
$$ 0 0 0 0 0 0 0 0 0 0 0 0 -8 8 -8 8 -8 16 -16 22 -24 32 -32 40 -48 56 -64 76 -86 100 -116 132 -148 166 -189
34a89M01m54N12n72O39p11P92q83R80j083J198j324J459j607J771j950K149k371
$$ -189 212 -242 270 -302 337 -374 418 -465 515 -568 630 -694 765 -842 929 -1021 1128 -1243
52a243K613k881L184l526L914m362M883n495O232p141Q284r775J1814j4782J9502
$$ -1243 1370 -1511 1673 -1853 2061 -2301 2582 -2913 3319 -3822 4462 -5313 6501 -8281 11221
67A1221k8154M8965j86496j61578N04853J46872j6319J87995l3954j94515J60371
$$ 11221 -16933 32032 -154464 -316042 188811 335683 319364 507359 473405 278890 439261
78D39261L784k86319p2413o5228k89791k2775J01284j25436k1619J16694o1815
$$ 439261 443045 156726 84313 19085 -270706 -293481 -192197 -317633 -339252 -222558 -284373
89b84373N7375K48069L7002p3206Q0252O3987K7839N1048n2806q1788J9350j7788
$$ -284373 -226998 21071 58073 -15133 65119 129106 156945 207993 155187 73399 92749 74961
101G4961n2727Q830j9545l7630J6078k0942m646Q1601j963q0427r762k0385j5441
$$ 74961 22234 31064 11519 -26111 -10033 -30975 -35621 45980 44017 -36410 -46172 -66557 -81998
114h1998O6850m1124j23794N1744P5901m3446N9301R5922m8691K1923J11706j5087
$$ -81998 -15148 -56272 -180066 -128322 -52421 -95867 -36566 59356 10665 32588 144294 129207
126A29207R963Q5146q2216j05860M5360l2328r4118P055o9120j20253O5560O5486
$$ 129207 139170 224316 142100 36240 81600 49272 -44846 -37791 -106911 -227164 -161604 -96118
138i6118p1563K9027Q9988j2273M6657J08205J081J0294O0314l8109l1576N0030
$$ -96118 -167681 -138654 -48666 -60939 -14282 93923 95004 105298 165612 127503 95927 145957
150A45957m0812q8311q293l7790o0773K8835J879o7832J4678N6884k988J6699
$$ 145957 105145 16834 8541 -29249 -90022 -61187 -59308 -127140 -112462 -55578 -58566 -41867
162d1867L8547l677J6655L6658n296N516K0880k8251k1475J9237j1645k4704P630
$$ -41867 -3320 -6997 9658 46316 41020 46536 67416 39165 17690 36927 25282 578 8208
175H208j0994k5202J5795J9678p288n473n577k353J0475q213j1013J4854n905
$$ 8208 -2786 -27988 -12193 7485 197 -5276 -10853 -13206 -2731 -10944 -21957 -7103 -13008
188a3008k2245J6210K2078n393L638M070r385J2759J5806q268M889K795k5491
$$ -13008 -35253 -19043 3035 -2358 1280 5350 -4035 8724 24530 16262 21151 23946 -1545
201a545Q524K7305k8547k4212J9556j0667j6564K6564J097k4670J3355J0738q580
$$ -1545 6979 34284 5737 -18475 1081 -9586 -26150 414 1511 -23159 -9804 934 -7646
214g646J9709L106l3582J0510K5202k2066l76K2429k6885j5343L5273L522k0221
$$ -7646 12063 15169 -18413 -7903 17299 -4767 -5143 17286 -9599 -24942 10331 13853 -6368
227f368R029k500j1696K1489Q657j9212L949J747j9701J4001K0931k3943j2641
$$ -6368 2661 161 -11535 9954 18611 -601 3348 5095 -14606 -605 20326 -3617 -16258
240a6258J7822k358l403J7638k403j8686J96P400K451L693p475j3685M829Q187
$$ -16258 1564 -794 -4197 13441 11038 -7648 -7452 -52 2399 6092 -1383 -15068 -10239 -2052
254b052k612M350L778j2333l839J5575J1817m044o752j082O10J252O533L88j3545
$$ -2052 -4664 -314 3464 -8869 -12708 2867 14684 10640 3888 2806 3416 4668 11201 11589 -1956
269a956j0371M323O886J619r96m842l563N023O580M661N351q376j3998Q703J3705
$$ -1956 -12327 -8004 -1118 501 -495 -5337 -8900 -3877 2703 7364 12715 4339 -9659 -956 12749
284A2749p762q028j675r987j736J4654L326j0173k92M888L278J0723O501m996
$$ 12749 4987 -3041 -4716 -14703 -16439 -1785 1541 -8632 -8924 -4036 -758 9965 16466 11470
298A1470j378p20l479R890Q175j5996j6824M606M783o682k459j739j1363k970
$$ 11470 10092 9372 5893 15783 23958 7962 -8862 -4256 527 -6155 -8614 -10353 -21716 -24686
312b4686J1603P591j182l65K262L888O258O139L455j674q034n897R192R566j1342
$$ -24686 -13083 -5492 -6674 -7039 -4777 -889 5369 11508 14963 13289 5255 -642 8550 18116 6774
327F774j5119L681M176n831J211N175p911q111P586Q396o37k79J608m6J779L856
$$ 6774 -8345 -4664 -488 -6319 -5108 67 -7844 -15955 -8369 27 -610 -889 719 673 2452 6308
343F308N463K463j0133j0920P700R340j0374j1080M842K661p012L931J1285k527
$$ 6308 11771 14234 4101 -6819 881 10221 -153 -11233 -6391 -3730 -10742 -6811 4474 1947
357A947o929N233Q045R71j793O42r13m361j886L681K593p726j0401M520R584o259
$$ 1947 -4982 251 8296 9267 7474 8116 7203 2842 956 4637 7230 -496 -10897 -6377 3207 -3052
373c052p197Q030L542q604J590J0365l050q491K643K160k986n33N33j5J124L06
$$ -3052 -10249 -2219 1323 -7281 -5691 4674 1624 -6867 -4224 -2064 -5050 -5583 -5050 -5065 -3941 -3635
389c635M181R855P34n324O950Q274p963o415N099m079j3433k774J066o976o873
$$ -3635 546 10401 11135 5811 12761 21035 13072 6657 11756 7677 -5756 -8530 -7464 -14440 -21313
404b1313J118L971L80J51P520Q917L068L721P518M373r83j537L40n93o098j0478
$$ -21313 -20195 -16224 -15844 -15693 -8173 744 3812 7533 15051 19424 18441 16904 17244 16651 10553 75
420G5l374O78j0036n719R774k282j1058J1764J2792p098L394J2825m508k942R248
$$ 75 -3299 -2621 -12657 -18376 -8602 -10884 -21942 -10178 2614 -4484 -1090 11735 7227 4285 13533
435A3533k893n633M046r270q451J1145l068j3315J1081L352j5714J0775J6065
$$ 13533 10640 5007 9053 -217 -8668 2477 -591 -13906 -2825 527 -15187 -4412 11653
448A1653j5214n203J6415k564p427Q138l722p208P227j388l297J0296n979j0748
$$ 11653 -3561 -8764 7651 5087 -2340 5798 2076 -5132 2095 707 -2590 7706 1727 -9021
462i021J6057P402j3808K820O109j1442p79Q648o827q675k293k772P034K066j1751
$$ -9021 7036 14438 630 3450 9559 -1883 -2662 5986 -841 -9516 -11809 -14581 -7547 -5481 -17232
477a7232M912J4926o464K9J5467k095m422J2633l73o428J986p233k613Q627j0314
$$ -17232 -12320 2606 -3858 -3829 11638 9543 5121 17754 17381 10953 12939 5706 3093 11720 1406
492A406j6344J0115j215j3550J4213N285k2782N765J8809o124M163O787j5006
$$ 1406 -14938 -4823 -6038 -19588 -5375 -90 -22872 -17107 1702 -4422 -259 6528 -8478
505h478O819J9882j2580j823J6355j8572q841K8600p852k5008J7387P94k1856
$$ -8478 -1659 18223 5643 3820 20175 1603 -7238 21362 13510 -11498 5889 6683 -15173
518a5173J6591O559k5414Q737J1657j9675J0888J7078k5773K142L0987j5627j0726
$$ -15173 1418 7977 -17437 -8700 2957 -16718 -5830 11248 -14525 -12383 18604 2977 -7749
531g749K6524j0076j9499K3196O24k2101J0838R71j9615J2872R247j8052O761
$$ -7749 18775 8699 -10800 12396 13020 -9081 1757 2728 -16887 -4015 5232 -12820 -6059
544f059J1694j5571M979K0238r657m915J2220p994n541J1258m437q199J929r087
$$ -6059 5635 -9936 -4957 15281 5624 709 12929 4935 -606 10652 6215 -1984 -55 -9142
558i142k635J1042n085m805R849o844n009J9522J849j1144J1319j34j2717J4586
$$ -9142 -11777 -735 -5820 -10625 -776 -7620 -12629 6893 8742 -2402 8917 8783 -3934 10652
572A0652L443k1282O038N862j9556R051J3909k3976K033K8174j3161q748K3863
$$ 10652 14095 -7187 -1149 4713 -14843 -5792 8117 -15859 -13826 14348 1187 -7561 16302
585A6302r009j4699K4151j434k3102J1406j536k1154J8458R776k8685L342J7395
$$ 16302 7293 -7406 16745 15311 -7791 3615 2079 -19075 -617 9159 -19526 -16184 1211
598A211j5704N847K3634j5714r332K1872j621q110J2394p065j0794J2835m855
$$ 1211 -14493 -8646 14988 -726 -10058 11814 10193 2083 14477 7412 -3382 9453 4598
611D598j4266J2287M59j5293J0511P126j4296L326J0204n428M866N629j2651n25
$$ 4598 -9668 2619 3078 -12215 -1704 5422 -8874 -5548 4656 -772 4094 9723 -2928 -3453
625c453P689p645K428N153j7671k175J8795l979o642J1745j242n744R420P69k833
$$ -3453 4236 -3409 -981 4172 -13499 -15674 3121 -858 -7500 4245 3003 -2741 6679 7448 4615
640D615Q313o819r775J2666r44j5327P231R81j6110P467Q965j3257K588J0948
$$ 4615 12928 6109 -3666 9000 8056 -7271 -40 941 -15169 -7702 1263 -11994 -9406 1542
654A542o138M741P252j1829N749J4863j7003o226K0194r545j5561J6449o84j5713
$$ 1542 -4596 145 7397 -4432 1317 16180 -823 -7049 13145 3600 -11961 4488 3804 -11909
668a1909J2702J900j5887J3031R796j5671P295J1610j5729L832J5610j8737p472
$$ -11909 793 2693 -13194 -163 9633 -6038 1257 12867 -2862 970 16580 -2157 -9629
681i629K1707r205j7803J5454L222j4062Q301L428j2197P395O909j0619L902J1203
$$ -9629 12078 2873 -14930 524 3746 -10316 -2015 1413 -10784 -3389 3520 -7099 -3197 8006
695H006p562j729Q802n649l315R967m135j0562O044O371m465k786J944K349j319
$$ 8006 444 -1285 7517 1868 -1447 8520 4385 -6177 -133 6238 1773 -1013 931 3280 1961
710A961l716K53K220k421q96J480k148k29M307j865l958K790n9n60M574k734k021
$$ 1961 -1755 -1502 718 -1703 -2599 -1119 -3267 -3496 811 -1054 -5012 -2222 -2281 -2841 1733 -1001 -3022
727c022J0427n7j1467O002R223j0236n048P909k253m582O603j690o874M980J989
$$ -3022 7405 7348 -4119 1883 11106 870 -4178 3731 1478 -3104 3499 1809 -5065 -85 1904
742A904n282K091N72m845N467L758q314K256R896p930q836R990M597r147J14N002
$$ 1904 -3378 -1287 -715 -5560 -93 3665 -4649 -2393 7503 -427 -9263 727 5324 -3823 -3709 1293
758A293j975N75L562k461r75J691j990K16L638k492k195N569q53p588M348O740
$$ 1293 -682 -107 3455 994 19 1710 -280 -64 3574 1082 -1113 4456 3603 -3985 363 7103
774G103q417o417O565L437m645n84K014j166K4R90l67J225J45l005K687M496k558
$$ 7103 -1314 -7731 -1166 2271 -2374 -2958 -944 -2110 -2086 -1096 -1463 -238 -93 -3098 -411 4085 1527
791A527r28M094k747m770N618M981o379m404M688J804k063m94p17j860q43j073
$$ 1527 599 4693 1946 -2824 2794 7775 1396 -3008 1680 3484 1421 927 210 -1650 -2493 -3566
807c566J349K869j937l126K476K635j767J17K475l799l450N536L960l379j511
$$ -3566 -2217 652 -1285 -4411 -1935 700 -1067 -950 1525 -2274 -5724 -188 3772 393 -1118
822a118J938O89j66R01M2j132j317j309J723L194j579l021J279N28j762K240J476
$$ -1118 820 1509 1343 2244 2286 1154 -163 -1472 251 3445 1866 -1155 124 652 -1110 1130 2606
839B606m378k637L396J663j983n0n1j624L44J686J236Q76j609j073L148K338j705
$$ 2606 -1772 -4409 -1013 650 -1333 -1383 -1434 -3058 -2714 -1028 208 1084 -525 -1598 1550 3888 2183
856B183m8J058k260j149L571J558l972j808J259k52p97j2p40j023j347N85K883
$$ 2183 2135 3193 933 -216 3355 4913 941 -867 392 140 -657 -669 -1409 -2432 -3779 -3194 -311
873c11M69k361n39J431O65q20J182J422j781j909L018L519j259k637J460J206
$$ -311 158 -2203 -2742 -1311 -646 -1466 -284 1138 -643 -2552 466 3985 2726 89 1549 2755
889B755j378R77J457j963j680j03K76Q91j102l209L42J086k090R37M214k468l973
$$ 2755 1377 2354 3811 1848 168 65 341 1232 130 -3079 -2737 -1651 -3741 -2804 1410 -1058 -5031
906e031L995L535k425k20J097j166J181P95q70O68l76l538J593L769l112k088
$$ -5031 -1036 2499 74 -146 951 -215 966 1761 891 1559 1183 -2355 -762 3007 -105 -2193
922b193L292m82k155M039J007l307q48O13M22J814k592l618L081J242l842J421
$$ -2193 1099 617 -1538 2501 3508 201 -647 -34 388 2202 -390 -4008 -927 315 -3527 -2106
938b106L348m176j685M262K34o22J885j262M3L023r19p09K490k596k714M356O10
$$ -2106 1242 -2934 -4619 -357 -123 -745 1140 -122 -79 2944 2025 1316 3806 1210 -1504 2852 3462
955C462m537J117K090k915k5J982j910K58M58k899J786K706l783o87K946k538
$$ 3462 -1075 42 2132 -783 -808 1174 -736 -478 -20 -2919 -1133 1573 -2210 -2897 49 -2489
971b489k77M060k450k555L766Q76j276L613p71k878L684J23l102M318n34p643
$$ -2489 -2766 1294 -1156 -3711 55 931 -345 3268 2497 -381 3303 3426 324 4642 4108 -3535
987c535K688M868n503p58L421n265p67O618j711l012L006k333j021O545j578n012
$$ -3535 -847 4021 -1482 -2240 1181 -4084 -4851 1767 56 -2956 50 -2283 -3304 3241 1663 -3349
1003c349M795n86n899N993L610p164j07M750k366K89L218l127j77L351k657N42
$$ -3349 1446 860 -5039 954 4564 -2600 -2707 2043 -323 -34 3184 57 -120 3231 574 1116
1019A116L406n255j075O225l906m441M995j362m552M124M49l831K621n90l410
$$ 1116 4522 -733 -1808 4417 511 -3930 1065 -297 -4849 -725 -276 -4107 -1486 -2076 -5486
1034e486O398J294p396N993M988r443K698R460p136l485Q012l299n113O483j008
$$ -5486 912 2206 -5190 803 5791 -3652 -954 8506 1370 -2115 5897 2598 -2515 3968 2960
1049B960m352M450l063o053P858J230q927M802L724r629J824R379m285l231L953
$$ 2960 -1392 3058 -5 -6058 1800 3030 -5897 -1095 2629 -7000 -5176 4203 -82 -3313 640
1064F40j523l42M103j815q02K739l753j119O841k333n783L989R91l211K939k20
$$ 640 -883 -1225 2878 1063 261 3000 -753 -1872 4969 2636 -3147 842 1833 -1378 1561 1341
1080A341l399J799p15j432N264k040o858O284M063p746K466N660q226r74Q523
$$ 1341 -2058 -259 -974 -2406 2858 818 -6040 244 4307 -3439 -973 4687 -3539 -4513 4010
1095D010l901l406M964m219k103Q442k665n885P241q07o549Q524L561j1185K903
$$ 4010 109 -3297 1667 -2552 -4655 3787 1122 -4763 2478 1671 -4878 3646 7207 -3978 -1075
1110a075P918o654j73O840o106l330O078l065k771M671m292l839O345j282n531
$$ -1075 6843 189 16 6856 750 -2580 3498 433 -2338 2333 -1959 -5798 547 -735 -6266
1125f266N649J473o368M552L872o099J331N371k765M01K012l664J682L846l968
$$ -6266 -617 856 -5512 -960 2912 -3187 -1856 3515 750 1151 3163 -501 1181 5027 1059
1140A059m8L759n470k314O888k107n641M268l37n215L290J582l261K154J19l187
$$ 1059 1011 4770 -700 -3014 3874 1767 -3874 394 57 -5158 -1868 -286 -3547 -1393 -1274 -4461
1156d461M076J990m639L417M516n336n98O277k584k673L294j736k416K715j750
$$ -4461 -385 1605 -3034 383 4899 -437 -1035 5242 2658 -15 3279 1543 -873 1842 92
1171I2j939L039k740k322N956p33o194L869L710m195J511L132n138m75M067j882
$$ 92 -1847 1192 -1548 -3870 2086 1353 -4841 -972 2738 -1457 54 3186 -1952 -2427 1640 -242
1187b42P38J843o368o3O924k844l582N674j844n424O414M204n778K77K507k871
$$ -242 496 2339 -4029 -4092 2832 -12 -3594 2080 236 -5188 1226 5430 -348 -71 2436 -435
1203d35K236K776m417n78K695l831K83M709l953m257N001N91l892K261J990l397
$$ -435 1801 4577 160 -418 2277 -1554 -1271 3438 -515 -4772 229 820 -3072 -811 1179 -2218
1219b218J63K336p22N04M31k278R03J546j466Q12J952j247m42J341L48J14P82
$$ -2218 -2055 281 -441 63 494 -1784 -881 665 -801 11 1963 716 274 1615 1963 2077 2859
1236B859n97r86q56r92J397N17l372j420J690q36K86J822j283j664K424O73k08
$$ 2859 2262 1276 420 -572 825 1342 -2030 -3450 -1760 -2596 -2310 -488 -1771 -3435 -1011 -338 -546
1253e46K529l10k605J739J608j407J170j97l605Q95L870k490j394J840j721p99
$$ -546 1983 1673 -932 807 2415 1008 2178 1981 -1624 -729 3141 651 -743 1097 -624 -1423
1269a423L142n35k215J467o34k134K771J111l352o3J138k258J688K881l107j827
$$ -1423 1719 1184 -1031 436 -198 -2332 439 1550 -1802 -1865 -727 -2985 -1297 1584 -1523 -3350
1285c350L087O32k35J778n02j314J163K96q02K038M3l643j83K458j075p98O52
$$ -3350 -263 369 134 1912 1410 96 1259 1555 753 2791 2834 -809 -992 1466 391 -407 245
1302B45j597j453K173J477r79j164J19N80K66N3j86P57n42j426J143K174k13k215
$$ 245 -1352 -2805 -632 845 -134 -1298 -1179 -599 -333 -280 -466 291 -251 -1677 -534 1640 1427 -788
1320g88o17J918P84r41P27L85j714K77K611n78j923p3O33j204j87J055o80n57
$$ -788 -1405 513 1297 356 1083 1468 -246 31 2642 2064 141 68 701 -503 -690 365 -315 -872
1338h72r28j098K497J907l118j736L323J87j854K084J179k646J20K212q51M2J065
$$ -872 -1800 -2898 -401 1506 -1612 -3348 -25 162 -1692 392 1571 -1075 -955 1257 406 448 1513
1355A513j160m71J455n12J74J518k331k422L228J340l610l10K383j391j423J897
$$ 1513 353 -118 1337 825 999 2517 186 -2236 992 2332 -1278 -1588 795 -596 -2019 -122
1371a22j58j414K43l52N5J453M06n58N58M97n47J633J010k491p22K385J87j899
$$ -122 -280 -1694 -1451 -1803 -1748 -295 111 -447 111 608 61 1694 2704 213 -509 1876 2063 164
1389A64M63J149j217j366P26N50q79m70R4m77K71Q52j54p16MJ72M43Q16j121o09
$$ 164 627 1776 559 -807 -81 469 -410 -880 -786 -1263 -992 -140 -294 -1010 -1006 -834 -391 425 -696 -1305
1409a305K165L10k251J193J940k025j184K232j95j321J075P2j183Q24P28o51J54
$$ -1305 860 1170 -1081 112 2052 27 -1157 1075 880 -441 634 706 -477 347 1075 424 578
1426E78m59q09J678L76k675Q13K118k662j588K303l19k077N71J093k64O45L34
$$ 578 119 -690 988 1364 -1311 -498 1620 -1042 -2630 -327 -646 -2723 -2152 -1059 -1323 -678 -344
1443c44J02J675l39j194K410L27l048J708K299l002j292J932o97j238J12k53p6
$$ -344 -242 1433 1094 -100 2310 2637 -411 1297 3596 594 -698 1234 537 -701 -589 -842 -918
1460i18N17j429M91K891j840j883L021J62l075J591J502k210J85J372k07rj84
$$ -918 -401 -1830 -1339 1552 -288 -2171 850 1012 -2063 -472 1030 -1180 -995 377 170 161 -23
1477b3o01J812Q44k311J079K471k460r36K804j155k639J111m16j289P62j044n02
$$ -23 -624 1188 2032 -279 800 3271 811 -125 2679 1524 -1115 -4 -420 -1709 -947 -1991 -2493
1494b493J989j033j039L169L18l368L276K491l395K08K863k776o85K007k234p65
$$ -2493 -504 -1537 -2576 593 911 -2457 819 3310 -85 123 2986 210 -475 1532 -702 -1467
1510a467J776k100r8L541j779j889M137K13l247K596J568l811J414J900l408l18
$$ -1467 309 -1791 -1889 1652 -127 -2016 2121 2334 -913 1683 3251 -560 854 2754 -654 -972
1526i72R20k522Q29J790l054k14K927j638N45M155k093k503L901K22j876K486
$$ -972 -52 -2574 -1745 45 -3009 -3223 -296 -1934 -1389 2766 673 -1830 2071 2293 417 2903
1542B903q29l357K100R98k485J652j8m028K816K323l922Q10L540l635q73M610
$$ 2903 2074 -1283 817 1815 -670 982 964 -3064 -248 2075 -1847 -1037 2503 -1132 -2005 2605
1558B605k595l041L278o33k189K906j372k531M036N61l120L326J970m245J517
$$ 2605 10 -3031 247 -386 -2575 331 -1041 -3572 464 1025 -2095 1231 3201 -1044 473
1573D73L432k616n91K521k481j507J762j642j31J696l174q09L250j304j215L477
$$ 473 3905 1289 698 3219 738 -769 993 -649 -780 916 -2258 -3067 183 -1121 -2336 1141
1589A141n29k917K542J043j403J732o10k977K874Q64l604K434P75m741K220M562
$$ 1141 612 -2305 237 1280 -123 1609 999 -1978 896 1760 -1844 590 1365 -3376 -1156 3406
1605C406m170j145M204k181p45M417k332l273L629r24k956M276q89n824L659L195
$$ 3406 -764 -1909 2295 114 -631 3786 1454 -1819 1810 886 -2070 2206 1317 -4507 -848 2347
1621B347m840Q68K680m119P83M466k236j800K455j396pM198k184k936K816M43
$$ 2347 -2493 -1625 1055 -3064 -2281 2185 -51 -1851 604 -792 -799 3399 1215 -1721 1095 1538
1637A538j821K694k65l517J319J527j173O43n39k832J751J749k433L04J276k928
$$ 1538 -283 2411 2146 -1371 -52 1475 302 945 406 -2426 -675 1074 -1359 -1055 221 -2707
1653b707J069L231k231j205K152r47Q0K738j639k037K637j57j535K905o01l742
$$ -2707 -1638 1593 -638 -1843 309 -638 -558 2180 541 -1496 1141 984 -551 2354 1753 -1989
1669a989K009K014k385Q72J100l112M52K146j533MJ293j725n23K109j290n88J952
$$ -1989 20 2034 -351 521 1621 -1491 -1039 1107 -426 -422 871 -854 -1377 732 -558 -1146 806
1686H06j200j436K108k05j542J787J97j670J631L26j411J502K53j930J801J043
$$ 806 -394 -1830 278 73 -1469 318 515 -1155 476 802 -609 893 1146 -784 1017 2060
1702B060k751P42J870k582n14L396j889k187K141j94j566K236n13k350J751K72
$$ 2060 -691 51 1921 -661 -1175 2221 332 -1855 286 92 -1474 762 249 -2101 -350 -78
1718g8j982J955R89l470J053L272j681j173K543n04j305J952K70j074O32m77j005
$$ -78 -2060 -105 884 -2586 -1533 1739 58 -1115 1428 924 -381 1571 1841 767 1399 922 -83
1735h3J472o14j909J106O88k118J71J430r81q51Q46N49j28l97k5J277K33j400
$$ -83 1389 775 -1134 -28 660 -1458 -1287 143 -838 -1689 -843 -294 -422 -819 -844 433 666 -734
1753g34P45J327j273m36J414m04j176N29L39r3K23q82M16J643j185j033K017k30
$$ -734 11 1338 65 -371 1043 639 -537 -8 331 238 461 -421 -5 1638 453 -580 1437 1207
1771A207k770J454J515k170q07J422q83l95Q13m22N2J095q05J36K185q94j453
$$ 1207 -1563 -109 1406 -764 -1571 -149 -1032 -1427 -614 -1036 -984 111 -694 -558 1627 733 -720
1788g20K410J91k203P54J266j696p09J569p32r42R20m14q5P94m38m66J225n94
$$ -720 1690 1881 -322 432 1698 2 -707 862 130 -812 108 -306 -391 403 -35 -501 724 130
1806A30j012J173K83j648m9J188r00p98J137K84p41M13R10K80q4J98L55Q8l53
$$ 130 -882 291 574 -1074 -1123 65 -835 -1633 -496 -212 -953 -540 370 650 566 764 1119 1207 854
1825H54n4J06n7r60l84N22l0j415P01R68q00o24J462N82j286P9J032l39j012N40
$$ 854 800 906 849 -111 -495 27 -3 -1418 -717 251 -549 -1173 289 871 -415 -336 696 357 -655 -115
1845a15j13l07j99l62N09O06q87j27J902K42j276J424J107j395l11J129k44j222
$$ -115 -228 -535 -734 -1096 -587 19 -868 -995 907 1149 -127 1297 2404 1009 698 1827 1583 361
1863C61k45k21l19o89m88L75L88q27j09J413O55j402P57J499n74p97J151L77r97
$$ 361 116 -105 -424 -1113 -1601 -1226 -838 -1665 -1774 -361 294 -1108 -351 1148 574 -223 928 1305 308
1882C08m26M11M09o69l42O34L18o81K8P83J71r99n9R13k66j216P2N40k51j090
$$ 308 -118 293 702 33 -309 325 643 -38 -10 773 944 -55 -114 799 533 -683 -611 -71 -322 -1412
1902a412L37R32m32p74Q00R21l70m0P58j23l92K72K47j23k58m91K70M55r05k35
$$ -1412 -1075 -143 -575 -1349 -549 372 2 -38 720 597 205 477 724 601 343 -148 122 577 -328 -563
1922e63J268k46r36N97Q11n91j90N41n78k24K09n10n05N37l21o51R50k93l73Q71
$$ -563 705 459 -477 120 931 340 150 691 113 -111 98 -412 -917 -380 -701 -1352 -402 -695 -1068 -197
1942a97L69r43R78J070r62r8J091m85l56N16o38j89M48k76o43O10k02r88N43L3
$$ -197 172 -771 207 1277 315 217 1308 823 467 983 345 156 604 328 -315 295 93 -895 -352 -319
1962c19q04O44P08j261m80J335j53m66L06k6J32Q18l29J47P86k99m98J061K55
$$ -319 -1123 -479 229 -1032 -1512 -177 -330 -796 -490 -516 -384 434 105 252 1038 739 241 1302 1557
1981A557j003jL95r53l63P84o26n15l4J44L82Q9q31L62Q19o51k65J249k41q07
$$ 1557 554 553 948 -5 -368 416 -210 -725 -759 -615 -233 -144 -975 -613 206 -445 -710 539 298 -509
2001e09K92L6j5M24k58k97Q48k47m54J362q5j665Q87R76j225j13Q57q94o07P42
$$ -509 -217 -181 -196 228 -30 -327 521 274 -180 1182 1097 -568 319 1295 70 -43 814 -80 -687 55
2021E5m27K33P21j929l72K585n72j492J485j32j549J382J350j885n5M63o89R96
$$ 55 -372 -139 582 -1347 -1719 866 294 -1198 287 155 -1394 -12 1338 -547 -602 -139 -828 168
2039A68O68j394L38J087j195M44K091j570j557J866M39p85K17q23j029J077l8
$$ 168 836 -558 -220 867 -328 116 2207 637 -920 946 1385 600 817 -6 -1035 42 4
2056Dr94Q50n61j692K141J227k456O57J473j419N41J706j441k97J213q29L29J456
$$ 4 -990 -140 -701 -2393 -252 975 -1481 -824 649 -770 -229 1477 36 -261 952 123 452 1908
2074A908j861r46K554p58j838J896K38k559J471J242k375K87J094j162P0Q68j615
$$ 1908 47 -899 1655 897 -941 955 1193 -1366 105 1347 -1028 -741 353 -809 -739 129 -1486
2091a486M37J416j406J95J617j262p33K351k41j129J118L0r49J047o1o85P87o55
$$ -1486 -1049 367 -1039 -844 773 -489 -1222 1129 888 -241 877 907 -42 1005 944 259 1046 391
2109C91j104J462K9k153J224J155k383J79J963j633k88J466j026k24J449j002
$$ 391 -713 749 778 -1375 -151 1004 -1379 -1200 763 -870 -1158 308 -718 -942 507 -495
2125d95j89J884j279j088K582m50k408J937J104k360O88J657j731m13J314q47
$$ -495 -684 1200 -79 -1167 1415 965 -1443 494 1598 -762 -74 1583 -148 -561 753 -94
2141i4L21P83k015L79J891j448p13K180j140k219K193R73j877L9L35m02R44P8
$$ -94 227 1010 -1005 -626 1265 -183 -896 1284 144 -2075 118 1091 -786 -747 -412 -814 130 208
2159B08j108J173j49j397J717J355k313k05K176q24q29J557p45r71P72k90o4P26
$$ 208 -900 273 124 -1273 444 1799 -514 -719 1457 633 -196 1361 616 -355 417 127 63 789
2177G89j325j086K312k18k139J531M92k017Q80J465j120m99Q26k80M18O75j123
$$ 789 -536 -1622 690 472 -1667 -136 356 -1661 -781 684 -436 -935 -109 -389 29 704 -419
2194d19M75J079j164j55K056j139j397J437O7j018N46J73j054N18j61o55R75k43
$$ -419 56 1135 -29 -184 1872 733 -664 773 840 -178 368 541 -513 5 -156 -811 164 -79
2212g9j341J123O85j749O29J473j228m23J568n69n53J357n72n88J108n90p73J516
$$ -79 -1420 -297 388 -1361 -732 741 -487 -910 658 89 -464 893 321 -267 841 251 -522 994
2230I94j87j389J172M56j600M55J242j381n60J581q12n90N36P4m51M52m60j96
$$ 994 807 -582 590 1046 -554 -99 1143 -238 -798 783 -29 -619 -83 -9 -460 -8 -468 -664
2248f64Q87o36n52J045N5j105O75N82m26j77P65K7k38l6J46O96l00r59O05O33
$$ -664 223 -413 -965 80 135 -970 -295 287 -139 -316 449 476 238 202 348 1044 744 -215 390 1023
2268A023j138J9P49m65r51K59K32j80k46j46K66L08n50J14Q69k21o69R49O18q46
$$ 1023 -115 -96 653 188 -763 -504 -272 -452 -698 -844 -578 -270 -820 -706 163 -58 -727 222 840 -6
2288fJ44O49k32k41J39k5K12k12n08L29M10q94k62P92j82q04K01M93n13j07K9
$$ -6 138 787 555 314 453 428 640 428 -80 249 659 -235 -497 295 113 -691 -490 3 -510 -617 -588
2309e88K15K07k63m5N14R4l79N30N47o14l75O82L76o66j30J33k4j19j18J20J87
$$ -588 -373 -166 -429 -474 40 134 -245 285 832 218 -157 525 901 235 105 238 214 95 -23 97 284
2330B84m47q7K44K92k76k54L52q8o14K02O24n20m56J98L61k45LL51M5j58L28K61
$$ 284 -163 -250 -6 286 10 -244 108 20 -594 -392 232 -288 -744 -546 -185 -430 -427 -76 -31 -189 139 400
2352D00K51o9l52J81K02j64m08M60j3o43p2P00o29m07M30P5n22J88M41l44j88
$$ 400 651 582 230 411 613 449 41 501 488 -155 -227 473 -156 -563 -133 -58 -580 -392 49 -295 -483
2373d83J77M8RK63l39j75P35l54j59P43j40m62L21N59n15j47P63m05n06L65O6
$$ -483 -306 -258 -249 14 -325 -500 235 -119 -278 465 325 -137 184 743 228 81 844 439 -67 298 364
2394C64l79j41j11k59L94l80k46L78K60o48K45Q44l00n27Q82J62p74K34N93j23
$$ 364 -15 -156 -267 -526 -132 -512 -758 -380 -120 -768 -523 321 21 -506 376 538 -236 -2 591 468
2414D68l68P9Q8J98l31k63L73K39o24n7P93j66r83N37O56q74n41O61O7m03m78
$$ 468 100 179 267 465 134 -129 244 483 -141 -198 595 429 -554 -17 639 -235 -776 -115 -48 -451 -929
2435i29P66K52o63o6N91K23l19m3O11J8m57N1Q60j88q84J43Q17l95q69P70L87
$$ -929 -163 89 -574 -640 -49 174 -145 -188 423 441 -16 35 895 707 -177 -34 783 388 -481 289 676
2456F76r29n44R03J17l36m31M75K56m87l65N33L83q79j48R19J62r69M02P59n60
$$ 676 -253 -797 106 223 -113 -544 -69 187 -300 -665 -132 251 -628 -776 143 305 -664 -262 497 -63
2476f3l33P83K89m54j21K39L35m1m77j9N27p11k88R60l09j252K65P36n48PP9J69
$$ -63 -396 387 676 222 101 340 675 634 157 138 665 -46 -334 626 317 -935 -670 66 -482 -475 -396 -227
2498b27j98j3J85N64l40n40M86M12k80P7O51k30n27L47L50j32k88l03L10R8o02
$$ -227 -425 -438 -253 311 -29 -569 -83 329 49 126 777 547 20 367 717 585 297 -6 304 402 -200
2519b00J3O18p72m96Q35p2p74K51N31o43J36N80j62J36P9o66J093M10j017m5J351
$$ -200 -187 431 -341 -837 -2 -74 -848 -597 -66 -709 -573 7 -155 -19 60 -606 487 897 -120 -165 1186
2540A186q19p39J481J1j572L69P35p72J95Q7m37L11k19n39Q46K21j404K85J297
$$ 1186 367 -372 1109 1120 -452 -83 652 -120 75 162 -275 36 -183 -722 124 345 -1059 -774 523
2559E23q00o83J045L8r01P36L82l12Kj58j07R81l58q28Q95L15j351P50R76j149
$$ 523 -277 -960 85 123 -778 -42 340 28 30 -128 -235 746 388 -440 455 770 -581 169 1145 -4
2579dn02Q78j17k94K01l79J4N74q44J0J003p34r24J270J98j395M84J022q50L41
$$ -4 -506 372 255 -39 162 -217 -203 371 -473 -463 540 -194 -1118 152 350 -1045 -561 461 -389 -48
2599d8K31l47K83M24q26Q83M65j345J18J164p95o26R21k43n11L39n6n51L50j58
$$ -48 183 -164 119 543 -283 600 1065 -280 -162 1002 207 -419 502 259 -252 87 31 -520 -170 -328
2619c28k19Q25n36q31J086K92r71P02O04j128P4J053m19l3M60q40J43J045q93
$$ -328 -547 278 -258 -1089 -3 289 -682 20 624 -504 -430 623 204 171 631 -209 -66 979 86
2638H6l43J233r07o39J540k86j382Q94K55j291N89M65q18K5P59q17J85O59r16
$$ 86 -257 976 69 -570 970 684 -698 196 451 -840 -251 214 -604 -579 180 -637 -452 207 -709
2657g09K44Q63n62k61J172m92o86R13J09n65M16K3n46M32j06n46O37m5q19N47
$$ -709 -465 398 -164 -425 747 255 -431 482 591 26 442 465 -81 351 245 -301 336 291 -528 19
2677A9K91q50M21M52o30j70N05l91k50N32k29k60O68o04j70J235k16r89R93N48
$$ 19 310 -540 -119 333 -297 -467 38 -353 -603 -71 -300 -560 108 -496 -666 569 353 -636 357 905
2697I05q42K66N71n74l4K99o21L84pq46n8J039o72p30R32j53o61P20L62p01K28
$$ 905 63 329 900 326 292 591 -30 354 347 -499 -557 482 -190 -920 12 -141 -802 -82 280 -421 -193
2718a93K81j68M75n77j93N86K04j010L66R64p99j90P76j72l70K58N9L1K50o41
$$ -193 88 -80 395 -182 -375 211 415 -595 -229 735 -64 -254 522 350 -20 238 297 328 578 -63
2738f3o3P24q47o30J185l39j014P41L89n97j20O22P2lJ07k95L73M39q35J90O38
$$ -63 -126 598 -249 -879 306 -33 -1047 -306 83 -514 -634 -12 60 57 164 -131 242 681 -154 36 674
2759F74q59l4Q38p7r18L82M82k65j8P3j41m1j02l01M03Q5r67L26N95p38q0N27
$$ 674 -185 -219 619 542 -376 6 488 223 205 278 137 96 -6 -307 96 181 -786 -460 135 -603 -683 -156
2781a56j2m35L00L07J17J61l90J83N42j53m00L38j16l77L69K86o70k10L75j61
$$ -156 -168 -603 -303 4 121 282 -108 75 617 464 64 402 286 -91 278 564 -106 -316 59 -102
2801a02j7Q1j69K76j59k36M33l2o33J54N33m24k44N84Q6m10O8K16J99k46Q9J71
$$ -102 -119 -38 -207 69 -90 -326 107 75 -558 -404 129 -295 -539 45 131 -279 -211 5 204 -42 47 218
2823B18M50m29l35O95L34j167K75L98n63o3J00J43l38k31L83P9j06l40K51K85
$$ 218 668 239 -96 599 933 -234 41 439 -124 -187 -87 56 -282 -513 -130 -51 -157 -497 -246 39
2843C9j09l54M68K86p19K78N80j17n80M46K01k98j08L44R1k74k11K69L89m65o09
$$ 39 -70 -424 44 330 -389 -111 469 352 -228 218 419 121 13 357 448 174 -37 232 621 156 -453
2864d53N55J7m34l37N00K73p89P3N55J06p25K89M93j98k73L29O14k48n09L22M01
$$ -453 102 119 -315 -652 -152 121 -668 -595 -40 66 -659 -370 123 -75 -348 -19 595 347 -162 160 561
2885E61l17r3J59K31l94l41L32M47o59k33L82M7o25K51L79m01k42K74K57j99j53
$$ 561 244 151 310 541 147 -194 138 585 -74 -307 75 122 -503 -252 127 -274 -516 -242 15 -184 -337
2906c37n2L91k0j73O4K98k09m7N20J17m25k4L55k03l51N11l2k98j65J77j5P7m13
$$ -337 -389 2 -18 -191 -127 171 -38 -85 435 552 127 103 458 255 -96 415 383 85 -80 97 82 159 -254
2929b54J23J15k29j20K44N9l55q2N00k32Q0R4Q7r2k0L11K27j65l19K33K08k96
$$ -254 -131 -16 -245 -365 -121 -62 -417 -499 1 -231 -151 -57 30 -62 -82 229 456 291 -28 205 413 117
2951A17r7L17j6l31J00J43r2k75j7P1m3l00o2M13k83p9L43R9l19J27J93L9M3J86
$$ 117 20 337 321 -10 90 233 141 -134 -151 -80 -123 -423 -485 -72 -355 -434 -91 8 -311 -184 9 48 91 277
2975B77M0N2k66j60K80K06m41J3N99m07l32N38n0l25n1n8j69K29l18j37L06k5
$$ 277 317 369 103 -57 223 429 -12 1 600 193 -139 399 349 24 -27 -85 -254 -25 -343 -480 -174 -199
2997a99n58M35N45m87k53R20k79k65L23J63j84q3j15J98K61k60l63N97J10p04
$$ -199 -757 -322 223 -264 -517 403 124 -141 182 345 161 78 -37 161 422 162 -201 396 506 -198
3017a98J73L67m13k42N28n9k89j84N7R6J64l22k0L66l18j30O26j2m84K72L07j91
$$ -198 -25 342 -71 -313 215 156 -133 -317 -260 -164 0 -322 -342 24 -294 -424 202 190 -294 -22 285 94
$$ [...]
8191C3
##END NTUPLES=NMR FID
##END=
