##TITLE=1H_DPAH1603
 CDCl3
 8 sc, 
 17.03.2022
##JCAMPDX= 6.0         $$ Bruker NMR JCAMP-DX V2.0
##DATA TYPE= NMR FID
##DATA CLASS= NTUPLES
##ORIGIN= UXNMR, Bruker Analytische Messtechnik GmbH
##OWNER= root
$$ XWIN-NMR		Version 3.5
$$ Thu Mar 17 10:09:27 2022 Russian Standard Time (UT+4h)  she@DPX200
##.OBSERVE FREQUENCY= 200.131346
##.OBSERVE NUCLEUS= ^1H
##.DELAY= (6, 6)
##.ACQUISITION MODE= SIMULTANEOUS
##.ACQUISITION SCHEME= undefined
##.AVERAGES= 8
##.DIGITISER RES= 18
##SPECTROMETER/DATA SYSTEM= spect
##.PULSE SEQUENCE= zg30
##.SOLVENT NAME= D2O
##.SHIFT REFERENCE= (INTERNAL, D2O, 0, 15.7039)
##AUDIT TRAIL= $$ (NUMBER, WHEN, WHO, WHERE, WHAT)
$$ ##TITLE= Audit trail, XWIN-NMR		Version 3.5
$$ ##JCAMPDX= 5.01
$$ ##ORIGIN= Bruker BioSpin GmbH
$$ ##OWNER= she
$$ F:/spectra/data/she/nmr/H-F/1/audita.txt
$$ ##AUDIT TRAIL=  $$ (NUMBER, WHEN, WHO, WHERE, WHAT)
(   1,<2022-03-17 10:08:11.78 +0400>,<she>,<DPX200>,
      <created by zg, POWCHK disabled, PULCHK disabled
       configuration hash MD5:
       00 E9 B6 7A A2 85 ED C7 34 08 36 98 17 FE 4E 26
       data hash MD5: 16K
       2F 15 AC 2C E5 9A AC 79 6A 6A 44 B2 E8 A2 31 D1>)
$$ ##END=
$$ 
$$ hash MD5
$$ F8 62 84 1E 9B B8 D3 33 A2 BD 25 47 82 A9 B5 D1
##$RELAX= 
##$RELAX= 
##$RELAX= 
##$RELAX= 
##$RELAX= 
##$RELAX= 
$$ Bruker specific parameters
$$ --------------------------
##$DU= <F:/spectra>
##$EXPNO= 1
##$NAME= <H-F>
##$PROCNO= 1
##$TYPE= <nmr>
##$USER= <she>
##$AMP= (0..31)
100 100 100 100 100 100 100 100 100 100 100 100 100 100 100 100 100 100 
100 100 100 100 100 100 100 100 100 100 100 100 100 100 
##$AQSEQ= 0
##$AQ_mod= 1
##$AUNM= <au_zg>
##$AUTOPOS= <>
##$BF1= 200.13
##$BF2= 200.13
##$BF3= 200.13
##$BF4= 200.13
##$BF5= 200.13
##$BF6= 200.13
##$BF7= 200.13
##$BF8= 200.13
##$BYTORDA= 1
##$CFDGTYP= 0
##$CFRGTYP= 5
##$CHEMSTR= <none>
##$CNST= (0..31)
1 1 145 1 1 1 1 1 1 1 1 1 1 1 1 1 1 1 1 1 1 1 1 1 1 1 1 1 1 1 1 1 
##$CPDPRG= <>
##$CPDPRG1= <>
##$CPDPRG2= <>
##$CPDPRG3= <>
##$CPDPRG4= <mlev>
##$CPDPRG5= <mlev>
##$CPDPRG6= <mlev>
##$CPDPRG7= <mlev>
##$CPDPRG8= <mlev>
##$CPDPRGB= <>
##$CPDPRGT= <>
##$D= (0..31)
0 1.2 0 0 0 0 0 0 0 0.06 0 0.03 0 0 0 0 0.0002 0 0 0 0 0 0 0 0 0 0 0 0 
0 0 0 
##$DATE= 1647497291
##$DBL= (0..7)
120 120 120 120 120 120 120 120 
##$DBP= (0..7)
150 150 150 150 150 150 150 150 
##$DBP07= 0
##$DBPNAM0= <>
##$DBPNAM1= <>
##$DBPNAM2= <>
##$DBPNAM3= <>
##$DBPNAM4= <>
##$DBPNAM5= <>
##$DBPNAM6= <>
##$DBPNAM7= <>
##$DBPOAL= (0..7)
0.5 0.5 0.5 0.5 0.5 0.5 0.5 0.5 
##$DBPOFFS= (0..7)
0 0 0 0 0 0 0 0 
##$DE= 6
##$DECBNUC= <off>
##$DECIM= 32
##$DECNUC= <off>
##$DECSTAT= 4
##$DIGMOD= 1
##$DIGTYP= 9
##$DL= (0..7)
0 120 120 120 120 120 120 120 
##$DP= (0..7)
150 150 150 150 150 150 150 150 
##$DP07= 0
##$DPNAME0= <>
##$DPNAME1= <>
##$DPNAME2= <>
##$DPNAME3= <>
##$DPNAME4= <>
##$DPNAME5= <>
##$DPNAME6= <>
##$DPNAME7= <>
##$DPOAL= (0..7)
0.5 0.5 0.5 0.5 0.5 0.5 0.5 0.5 
##$DPOFFS= (0..7)
0 0 0 0 0 0 0 0 
##$DQDMODE= 0
##$DR= 18
##$DS= 0
##$DSLIST= <SSSSSSSSSSSSSSS>
$$ [...]
##$SUBNAM2= <"">
##$SUBNAM3= <"">
##$SUBNAM4= <"">
##$SUBNAM5= <"">
##$SUBNAM6= <"">
##$SUBNAM7= <"">
##$SUBNAM8= <"">
##$SUBNAM9= <"">
##$SW= 18.0517287032376
##$SWIBOX= (0..15)
0 0 2 0 0 0 0 0 0 0 0 0 0 0 0 0 
##$SW_h= 3612.71676300578
##$TD= 16384
##$TD0= 1
##$TE= 0
##$TE2= 300
##$TE3= 300
##$TEG= 300
##$TL= (0..7)
0 120 120 120 120 120 120 120 
##$TP= (0..7)
150 150 150 150 150 150 150 150 
##$TP07= 0
##$TPNAME0= <>
##$TPNAME1= <>
##$TPNAME2= <>
##$TPNAME3= <>
##$TPNAME4= <>
##$TPNAME5= <>
##$TPNAME6= <>
##$TPNAME7= <>
##$TPOAL= (0..7)
0.5 0.5 0.5 0.5 0.5 0.5 0.5 0.5 
##$TPOFFS= (0..7)
0 0 0 0 0 0 0 0 
##$TUNHIN= 0
##$TUNHOUT= 0
##$TUNXOUT= 0
##$USERA1= <user>
##$USERA2= <user>
##$USERA3= <user>
##$USERA4= <user>
##$USERA5= <user>
##$V9= 5
##$VALIST= <valist>
##$VCLIST= <CCCCCCCCCCCCCCC>
##$VD= 0
##$VDLIST= <DDDDDDDDDDDDDDD>
##$VPLIST= <PPPPPPPPPPPPPPP>
##$VTLIST= <TTTTTTTTTTTTTTT>
##$WBST= 1024
##$WBSW= 4
##$XGAIN= (0..3)
0 0 0 0 
##$XL= 0
##$YL= 0
##$YMAX_a= 334256
##$YMIN_a= -191763
##$ZGOPTNS= <>
##$ZL1= 120
##$ZL2= 120
##$ZL3= 120
##$ZL4= 120
##$ABSF1= 10
##$ABSF2= 0
##$ABSG= 5
##$ABSL= 3
##$ALPHA= 0
##$AQORDER= 0
##$ASSFAC= 0
##$ASSFACI= 0
##$ASSFACX= 0
##$ASSWID= 0
##$AUNMP= <proc_1d>
##$AZFE= 0.1
##$AZFW= 0.1
##$BCFW= 1
##$BC_mod= 2
##$BYTORDP= 1
##$COROFFS= 0
##$CY= 11.3945322036743
##$DATMOD= 1
##$DC= 2
##$DFILT= <>
##$DTYPP= 0
##$F1P= 2.36226072786647
##$F2P= -0.459571619588291
##$FCOR= 0.5
##$FTSIZE= 0
##$FT_mod= 4
##$GAMMA= 1
##$GB= 0.15
##$INTBC= 1
##$INTSCL= 1
##$ISEN= 128
##$LB= 0.24
##$LEV0= 0
##$LPBIN= 0
##$MAXI= 10000
##$MC2= 0
##$MEAN= 0
##$ME_mod= 0
##$MI= 1.114404
##$NCOEF= 0
##$NC_proc= 0
##$NLEV= 6
##$NOISF1= 3.799351
##$NOISF2= 2.8
##$NSP= 1
##$NTH_PI= 0
##$NZP= 0
##$OFFSET= 15.70392
##$PC= 1
##$PHC0= -16947.34
##$PHC1= 9.20078
##$PH_mod= 1
##$PKNL= yes
##$PPARMOD= 0
##$PSCAL= 0
##$PSIGN= 0
##$REVERSE= no
##$SF= 200.130013532006
##$SI= 16384
##$SIGF1= 3
##$SIGF2= 2
##$SINO= 400
##$SIOLD= 16384
##$SREGLST= <1H.CDCl3>
##$SSB= 0
##$STSI= 0
##$STSR= 0
##$SW_p= 3612.71676300578
##$SYMM= 0
##$S_DEV= 0
##$TDeff= 0
##$TDoff= 0
##$TI= <>
##$TILT= no
##$TM1= 0
##$TM2= 0
##$TOPLEV= 0
##$USERP1= <user>
##$USERP2= <user>
##$USERP3= <user>
##$USERP4= <user>
##$USERP5= <user>
##$WDW= 1
##$XDIM= 8192
##$YMAX_p= 0
##$YMIN_p= 0
$$ End of Bruker specific parameters
$$ ---------------------------------
##NTUPLES= NMR FID
##VAR_NAME=  TIME,          FID/REAL,        FID/IMAG
##SYMBOL=    X,             R,               I
##VAR_TYPE=  INDEPENDENT,   DEPENDENT,       DEPENDENT
##VAR_FORM=  AFFN,          ASDF,            ASDF
##VAR_DIM=   8192,          8192,            8192
##UNITS=     SECONDS,       ARBITRARY UNITS, ARBITRARY UNITS
##FACTOR=    0.0002768,     1,               1
##FIRST=     0,             0,               0
##LAST=      2.2672688,     0,               0
##MIN=       0,             -191763,         0
##MAX=       2.2672688,     334256,          0
$$ Real data points
##PAGE= N=1
##DATA TABLE= (X++(R..R)), XYDATA
0@%%%%%%%%%%jRj6J6j6K4l2L3m1N2o0P2q8J04j20J37j62J89k16K50k87L27l72
33a98M22m77N39o05O77p59Q47r45J052j166J293j431J581j747J928k126K343k580
51a352K840l129L454l817M222m679N203n811O524p375Q409r696J1358j3597J6788
66I342k1743L0582n1281J94612J72744j02303L3878p0172m7484n4981p4352j09720
78i0878l1589l3947l3008k341K4773j9555J7853O1983M9438K1665M1007J8296
90B3697N889K8460L5137o670j1233J965p168j4318P157p208l0453j5765K309j1343
104D56r743k473k0973k9958K672J0965j1508l779R529m523J1571L5591J2582k355
118a946J5791J0288R83J9833J6744j4666j6798k829q955m800O597j1283k1361
$$ y = [0, 0, 0, 0, 0, 0, 0, 0, 0, 0, 0, -1, 8, -8, 8, -8, 16, -16, 17, -24, 28, -32, 40, -48, 56, -64, 73, -89, 100, -116, 134, -153, 174, -198, 224, -253, 286, -319, 358, -401, 446, -499, 553, -613, 680, -751, 830, -917, 1011, -1115, 1228, -1352, 1488, -1641, 1813, -2004, 2218, -2461, 2742, -3069, 3455, -3920, 4489, -5207, 6151, -7446, 9342, -12401, 18181, -33100, 161512, 334256, 231953, 265831, 195659, 148175, 93194, 18842, -90878, -122467, -156414, -189422, -191763, -166990, -186545, -168692, -106709, -57271, -35606, 5401, 23697, 29586, 58046, 93183, 86513, 75280, 77245, 70077, 55759, 62916, 55708, 25255, 9490, 11799, 456, -9287, -11760, -32733, -62691, -60019, -49054, -60562, -64341, -54812, -59335, -47764, -12173, 409, -1946, 13845, 24133, 25116, 44949, 61693, 47027, 30229, 27400, 18445, 13645, 20242, 8959, -12402]
131a2402k104N230l49M187J224r492j782J2156O188o98J465o137r911J267L813
146g345k819l780m377j706O532R784P229L530M519P488N811N341K648m687p341
161B0827n603p041p575q647j0832p958k451J783R55J835L125L842R474J1814O080
176I628M349M673J035J554K917j597o005n980m589n268l233j148o426p037k4k04
192a7355m30L554O70j512K528M910M020M726N650L172Q45M035L867j51P57n94
208A8692m620l905l244n046n978l869l342n018k454k37k183q6L318J310K461N007
224i194M210L677N510O016M782L752L917K005LJ123m53l197l808o154o814n921
240e46n642m876n117n352l345j475M59K641K728K373K453N174O854N671O211N112
$$ y = [-12402, -14506, -9276, -9625, -5438, -4214, -13706, -15488, -3332, 2856, 2158, 3623, -2514, -12425, -11158, -7345, -10164, -13944, -18321, -20027, -13495, -3711, 3518, 7048, 11567, 19055, 24866, 30207, 32855, 28168, 20827, 15224, 8183, 608, -8039, -18871, -26829, -29280, -27497, -26542, -24707, -21582, -17740, -8266, 3548, 9628, 13977, 18650, 19685, 21239, 24156, 22559, 16554, 10574, 5985, 717, -2516, -3664, -10090, -17127, -17151, -17355, -17785, -14231, -13561, -15073, -12545, -7635, -3615, 1111, 6761, 9933, 10778, 14813, 18680, 18529, 19286, 18692, 14072, 10167, 6923, 1877, -4101, -7970, -11312, -16330, -18784, -19021, -21204, -21290, -17972, -16662, -14201, -9194, -4984, -1307, 4203, 10219, 15001, 18753, 22670, 24675, 24678, 25801, 25348, 22151, 18343, 12189, 5375, -546, -6188, -11064, -16181, -21533, -24878, -26353, -25894, -23253, -20525, -18152, -15699, -10525, -3671, 2000, 8211, 13323]
256A3323K322L176M379J855O40p00k820l561l591m036n781o431m632n834n394
271a7085j980l393m391j56J489J467K968M099L609M594Q068P512M622N031M040
286B0494J016K926L921o35l439l453m694m761k856l709p913p663l824m476k660
301b1726O42j832k122J820M096M197M594M966L048L251O462M957J783K564J235
316A7935k78K001J144l334m130k514k991m522l354m608p560m641n35j875j190
331b0452r6j513P72M730N919L794L534M531L765N000O929K829j16R63o67j979
347A7943q03k272n971o230l908l852m347j950k083l033Q59K424L08J773K809J411
363f922K240M424L689J476K555L440r2R76K526j822l074n08k131l992k525k185
$$ y = [13323, 15645, 18821, 23200, 25055, 25695, 24995, 22175, 18614, 15023, 10987, 5206, -1225, -5857, -11691, -17085, -19065, -22458, -26849, -27005, -25516, -24049, -21081, -16982, -13373, -8779, -711, 6801, 11423, 16454, 20494, 21510, 24436, 28357, 27722, 24283, 20830, 16136, 11375, 8519, 4810, -3103, -10766, -14590, -19066, -21726, -21084, -22916, -25038, -23218, -19122, -14925, -10331, -5365, -2317, 934, 7396, 12353, 14136, 16700, 17935, 17657, 19658, 20802, 17468, 13338, 10824, 7833, 3311, -43, -4651, -12211, -16852, -17387, -19262, -20452, -20548, -22061, -21289, -16559, -10640, -6846, -3312, 1219, 4984, 9984, 16913, 19742, 19626, 20589, 19922, 17943, 17140, 14868, 8897, 2667, -1241, -5093, -9440, -11390, -13473, -16506, -15647, -13223, -12915, -11142, -8333, -6922, -4682, -258, 3431, 4907, 7462, 10902, 10810, 11786, 14312, 12490, 9416, 8908, 6777, 2785, 260, -1925]
379a925m375l058N1j435j776J984Q39r02L614L523O88K895L519J235J483L745
395A0105J384k046R9K72l487j293l16m204l427r08k482k016Q3l39j901O64L156
412f656J189J494L343J185M74L167K618R97R87J326q98j061J031J08k058r02j112
429E232l724j762r54l639k881k010k843k421l36L61k54J968L702K439L981N732
445B591L876L793M612K210J414J085r83j887k207l752n065m095m069n431k645
460a0553j445l500j427L98j351J606L798J666J637M059K768K546N660N064Q75
475A1801J741L507o4Q05K646k679n316k671l163n385l134l599o619m650M99j067
491a7348j758J731Q79m87M384O621K838K082M434K731J657M911L479k385K65K763
$$ y = [-1925, -6300, -9358, -9307, -10742, -12518, -10534, -9695, -10597, -6983, -3460, -2772, 123, 3642, 4877, 6360, 10105, 11489, 9443, 9542, 9814, 6327, 5034, 4718, 514, -2913, -3821, -6303, -8319, -8236, -8575, -10476, -9812, -6656, -5467, -3973, -630, 555, 1029, 4196, 6814, 7811, 8798, 10124, 9226, 8165, 9196, 9304, 7246, 6344, 5232, 1508, -254, -1208, -4847, -7728, -9738, -12581, -15002, -15338, -14977, -15231, -13263, -9561, -7122, -3141, 2591, 6467, 10260, 14872, 17082, 18496, 19581, 18598, 16711, 14504, 10752, 5687, 1592, -2477, -7908, -10553, -11998, -15498, -16925, -16527, -17878, -16272, -12474, -10808, -9171, -5112, -2344, 202, 5862, 10926, 11801, 13542, 17049, 16985, 17790, 20436, 17757, 12441, 9770, 6607, 1222, -1912, -5511, -12130, -16780, -16281, -17348, -19106, -17375, -16496, -16983, -12599, -5978, -3140, -1058, 3376, 6107, 7764, 12675, 16154, 13769, 14034, 16797]
507A6797k281j612J502m698o976j254j589n649k731j237o173l388L961j63k394
522a7885M123K347j64O544O988p7J637N605J025J267N673k0m661N74M00l744p64
539H868j840o963m427N94p52k574j108k306m129R91M153O61l6J139n23J838N796
556f18L845J332J430K021K428L259K938r33l127k152k780k550j765l890n205l491
572i258k429j186J3n22n34J474L739K938K914M029J267J429M664K203p80O96n06
589A0151k280L54J80l568l643p82k372k021K187j225n398j007J363k142J349L789
605e065j821j494M801K955J006N286L202l231J732M923j438j011J830l993o443
620A239Q94o2n583k352N8n850k557N181n08l181M496K582j355N669P133j185R08
$$ y = [16797, 14516, 12904, 14406, 9708, 2732, 1478, -111, -5760, -8491, -9728, -15901, -19289, -15328, -15491, -17885, -13762, -11415, -11579, -5035, 1953, 1876, 3513, 9118, 10143, 11410, 17083, 17063, 12402, 12976, 13376, 9632, 8868, 7028, 65, -4362, -3768, -4520, -7094, -8202, -10508, -14637, -13646, -9493, -8832, -8868, -7729, -8252, -6414, -618, 3227, 4559, 5989, 8010, 10438, 13697, 16635, 15702, 12575, 10423, 7643, 5093, 3328, -562, -5767, -9258, -11687, -12873, -12860, -13382, -13916, -12442, -8703, -5765, -2851, 1178, 2445, 3874, 8538, 10741, 9961, 10657, 10151, 7871, 8225, 8405, 4837, 1194, 412, -1960, -3981, -1794, -3019, -8417, -9424, -8061, -10203, -8854, -5065, -6886, -8380, -3579, -624, 382, 5668, 8870, 5639, 7371, 12294, 10856, 9845, 11675, 7682, 1239, 2133, 2071, -3512, -5864, -5806, -11656, -14213, -9032, -9540, -12721, -8225, -5643, -6998, -1329, 5804, 4619, 5527]
637E527N660L21j627M803l64o310J23J196o066k388Q71n881n265K292j165n446
653a3719J283K002l717J685N934n38L02N939K260N89N433L356j698P75L840j309
669A2417j961J756k866n717Qo81n176k173j102m563k472K212k70k527J686J594
685i835j134L549M969L61J419M290J761J137M683K511j488R95J084k461r31L13
701A1223m023m592j653l741m124j561k006l419j365K67l00J137L175K259J828
716f895L872L673K569L938L193J291J502J245l92o60q69j603l026k624k914l706
732a406k590k409l019j832j201j083j40P10J559J692K367K976K257L071L551K109
748F612K571K282Q15m4Jq10j180j680k242l220l381j763j951j901j529j953j644
$$ y = [5527, 11187, 11508, 9881, 14684, 14320, 8010, 8133, 9329, 3263, 875, 1746, -4135, -9400, -7108, -8273, -13719, -12436, -10434, -14151, -12466, -6532, -7070, -6768, -829, 1431, 2020, 7453, 10809, 9111, 9886, 13726, 12417, 10456, 12212, 9346, 3629, 3637, 2956, -2220, -4393, -5495, -10058, -12530, -10318, -10588, -13115, -11429, -9835, -10969, -7420, -2451, -2090, -671, 3619, 5380, 6517, 11200, 13711, 12223, 13218, 14302, 11841, 10910, 11223, 7200, 2608, 955, -2786, -6910, -8471, -10477, -13896, -15261, -14994, -15294, -14157, -10982, -8723, -6895, -3023, 650, 3219, 7157, 10350, 11641, 13143, 14388, 13996, 13336, 12467, 10864, 7838, 5214, 2300, -1406, -3996, -6405, -9424, -11256, -12457, -13540, -13680, -12970, -11411, -9719, -7352, -4376, -2119, 952, 4503, 6612, 9183, 11465, 12280, 12236, 12237, 11427, 10247, 8567, 6325, 3105, -276, -2039, -3990, -5891, -7420, -9373, -11017]
765a1017L25R70R75J055J066J431K006K935K913J411J365J590Q93J475Q20p95
781I418j360j556j147j291j891k230k784k335o99p51j062p61m45M16J524K185
797d769J839J217J412J877K106J990J334m33m04O9j44l97j015j810j907j586k97
814i18q34j900j416j464q33R42N67K02M61J165J945K444K547J093J79J232J596
831G008M88O84p47k007j568p15q38j539k280k202k347k80K53o21r55J69L42J739
849e416K530J562R48J108K236K187J390J090J44p71N31K90j064j419k148k032
865A166j553j191j396k717k111j160k10L74Q73m69M41J900K169K607K436J638
881B797Q21J653K425J931J24M39j037j111j18r81k415k483k532k713k037j479
$$ y = [-11017, -10692, -9722, -8747, -7692, -6626, -5195, -3189, -254, 2659, 4070, 5435, 7025, 7918, 9393, 10213, 9418, 8058, 6502, 5355, 4064, 2173, -57, -2841, -5176, -5875, -6626, -7688, -8449, -8894, -8478, -6954, -4769, -2930, -1713, -301, 1576, 3682, 5672, 7006, 6573, 6169, 6238, 6094, 5697, 4682, 2872, 965, -621, -918, -1752, -3652, -5068, -6532, -7365, -6423, -5856, -5654, -5193, -4028, -2083, 361, 2908, 4001, 4180, 5412, 7008, 7496, 8180, 7433, 5426, 3858, 3143, 2305, 766, -1514, -3716, -6063, -6343, -6090, -6711, -7666, -7497, -7155, -5416, -2886, -1324, -376, 732, 2968, 5155, 6545, 7635, 7779, 7008, 7539, 7829, 6765, 5346, 3198, 1166, -387, -1578, -2974, -5691, -7802, -8962, -9172, -8798, -7925, -8394, -7953, -6053, -3884, -1277, 1159, 2797, 3618, 5271, 7696, 9627, 9751, 10190, 9153, 8042, 7924, 6943, 4528, 2045, -487, -3200, -5237, -6716]
897f716j715k147n29L51k39J217J690J002K130L497K716K176K178K534J300J726
913A1171J844q55j310m82k034k718j173k445m297k787j270k212j775j52p06j139
929a2340J980J984M24K544L192J350K418L600J547L93K283J616r57L56K18l038
945G570j679j99k442l025j595k952l331m60K03j874j109R94K98Q04L834K104K77
962b582K379K755J220K455K332l67j035J630j10j850k37j039l665j424K6k498
978b010k126p79j658j320J038O24j296N73K314N99J809K942L00L20K550J846O29
995F355R53j49j364o44Q91r81k236j281k346k260K52l04k067j406l37m10J084
1012f250K183N56l8J485J637J453K826J172q19R59Q99k93J80j36k039j847n68
$$ y = [-6716, -8431, -10578, -11107, -10756, -10995, -9778, -8088, -7086, -4956, -1459, 1257, 3433, 5611, 8145, 9445, 11171, 13015, 12160, 10850, 10368, 8334, 5616, 4443, 1998, -2299, -5086, -6356, -8568, -10343, -10495, -11201, -12340, -10360, -8376, -7952, -5408, -2216, -866, 1552, 5152, 6699, 7092, 9375, 10991, 10034, 10390, 10608, 7570, 5891, 5692, 3250, 225, -1370, -4322, -7653, -8113, -7910, -9784, -10893, -9899, -9601, -8797, -4963, -2859, -2582, -203, 2552, 3772, 6227, 8559, 8192, 7157, 8787, 8677, 6827, 6590, 5551, 1886, 462, 488, -2010, -4136, -4915, -6573, -7893, -6855, -6231, -7527, -6954, -4640, -4041, -2232, 710, 1010, 1330, 3880, 5726, 6355, 7308, 7159, 5795, 5151, 6042, 5061, 2825, 1544, -802, -3062, -2810, -3114, -5181, -6587, -6924, -7334, -6250, -4067, -3511, -3549, -2064, -427, 1026, 3852, 5024, 4205, 5164, 6063, 5770, 5950, 5814, 3775, 1928, 1360]
1029A360q52j901q56j293k211J60N62j273J39J561j03Q39K861J035N4K035K170
1046D287R1J318J430j552k18J736j267k209j83k079l260l54J04k816k037K92j239
1063g956o85K867J109j001K282K401L16K340L495J65n87K645Q42j875J308N41
1079H207l389j414N94l317k803P31j981l090M16m1l164L62L111j090j6L503j91
1096c572kM586K880n20J906K329j040J338L106j305l030j5j607l298K48r95m511
1113c502k108l29j798q37J157o27j201J317K141M41K280K608M92J521L052J661
1129F268O31J322R86n62J88q9k005j905r87j863k484j421k330k856j086j21o00
1146h914l56L38K04Q63K887K484J272K360J637J136K677K106K99M2l57j215n32
$$ y = [1360, 508, -1393, -2249, -3542, -5753, -5593, -5031, -6304, -6165, -4604, -4707, -3868, -1007, 28, 82, 2117, 4287, 4378, 5696, 7126, 5574, 5356, 7092, 5825, 3616, 3433, 1354, -1906, -2260, -2156, -4972, -7009, -6717, -7956, -8641, -5774, -4665, -5666, -3384, -983, -667, 1673, 5168, 5333, 4746, 7391, 8233, 6358, 7666, 8207, 4818, 3404, 3998, 681, -2122, -1391, -3372, -6462, -6046, -6087, -9251, -8889, -5778, -6868, -6884, -3381, -3572, -3574, 1012, 3892, 3372, 5278, 7607, 6567, 7905, 11011, 9706, 6676, 6661, 5054, 1756, 2004, 1009, -3502, -5610, -5939, -7737, -8574, -7417, -8044, -9245, -7928, -5787, -5346, -3066, -458, 34, 1555, 4607, 6268, 6899, 8221, 9207, 8645, 8833, 8744, 6739, 4834, 3847, 1984, -500, -1921, -4251, -7107, -8193, -8314, -8914, -9270, -8932, -8728, -7865, -4978, -2494, -1222, 1138, 2775, 3911, 6588, 8694, 8993, 9035, 8678, 7463, 6931]
1163F931j38j914k445j844k314k084k61j170k216m84k06l69J492J812L4P99K502
1180a875J556J080K864J520m42J408J649p90K03K22k171j696j74j616k446r85
1196a693j250k470o57P21j356l48J498K02K25K497J600J51J597K101M56P41J684
1213E699j45j322R75k20j494k20o42k117j172N2j017j530j39p74j733O75J094
1230d030m66L48J479k1J074K521J626J01J141J119l79P45J145j336j739m88j246
1247A594j605k50j452k363r66q5l98J84R30q8j41J934J905P74J467Q73J75J321
1265C809J716J60l33k92n25n19k75q10j939j973r61j137p43n22j230j283K03R06
1283e748J034R47P26M60J444K287J894J067R23M13M69Q87P16p25j268j459j496
$$ y = [6931, 6793, 4879, 2434, 590, -1724, -3808, -4069, -5239, -7455, -7939, -8145, -8514, -7022, -5210, -5176, -4377, -1875, -319, 761, 3625, 5145, 4703, 6111, 7760, 6970, 7173, 7395, 5224, 3528, 3354, 1738, -708, -1693, -2943, -5413, -6070, -5349, -6705, -7053, -5555, -5353, -5128, -2631, -1031, -880, 717, 2818, 3274, 4015, 5699, 5554, 4232, 5207, 4987, 3493, 3273, 2631, 514, -658, -606, -1623, -3153, -3292, -4066, -5799, -5124, -4030, -4496, -4148, -2669, -2690, -1616, 905, 2531, 2632, 3773, 4892, 4513, 5258, 6403, 5067, 3328, 2840, 1594, -11, -261, -1713, -4076, -5042, -5127, -5525, -5341, -4411, -4499, -4640, -2706, -801, -27, 1440, 2313, 2488, 3809, 5525, 5685, 5352, 5060, 4535, 4016, 3741, 2931, 992, -981, -1942, -3079, -3822, -4344, -5574, -6857, -6654, -5748, -4714, -3767, -3041, -2581, -1137, 1150, 3044, 4111, 5034, 5447, 5916, 6803, 7519, 6794, 5526, 4067, 2571]
1300B571j128r08j846k473j429r41o99j38j72k16K49J482J726J654J351J314J438
1317A835J926K136R69L60M6l29K4l22j019j761j880j768j191j165j257j614j853
1334f863m47m1K84M11M86O49J210J999K182J556J447J281R39J485J027k1m40n46
1352F598q20p77j060j417k229j739r15j382j164r09j172p41P54M88P65P64R76
1369c980J256J840J965J564R91R73Q27P72P89j15r06p32q41r32j339j221j605
1386f94j696j218p05r88n01j60j89O47R57P42J095R89J164J355J382J186O42Q69
1404D877N73K57J29l66p00j134p81j154j366j439j496r45r62m70m09l32K91O21
1422d806Q74J317J024J059J179J323J020J104K98K13Q4j85n9p73j046j230j135
$$ y = [2571, 1443, 535, -1311, -3784, -5213, -6154, -6853, -6991, -7163, -7379, -7130, -5648, -3922, -2268, -917, 397, 1835, 3761, 5897, 6866, 7226, 7272, 6943, 6967, 6645, 5626, 3865, 1985, 217, -974, -2139, -3396, -5010, -6863, -7310, -7351, -7067, -6656, -6170, -5521, -4311, -2312, -130, 1426, 2873, 4154, 5093, 6578, 7605, 7584, 7144, 6598, 5778, 5001, 3941, 2524, 295, -1444, -2359, -3741, -4905, -5814, -6986, -7727, -6973, -6485, -5720, -4956, -3980, -2724, -884, 1081, 2645, 3636, 4609, 5436, 6208, 6997, 6882, 5976, 5244, 4403, 3471, 2132, 911, -694, -2390, -3608, -4313, -5301, -5802, -5962, -6151, -5504, -4547, -3805, -2710, -1721, -557, 798, 2180, 3366, 4008, 4877, 5450, 5707, 5836, 5470, 4770, 3636, 2855, 1701, 335, -1104, -2600, -3545, -4507, -4977, -5386, -5718, -5427, -4806, -3932, -2615, -1591, -532, 647, 1970, 2990, 4094, 4392, 4605, 4689, 4504, 4445, 3672, 2626, 1396, 261]
1439B61r62j007q21o99r57m72L93Q8L57N42P22R12J252J065R89Q35Q02M78L22
1458D100M09q7n93m42p75q14p89j208j520j021l78p39n75o6j05l27J081J625M87
1477a737Q98J349O39R47J839R01m97J39L11p28l52L12j629j715k53j129j569n41
1495b815l04j580l44O48n71j67J534M15j34K200J552k1J543J887L54P83J339l9
1513F280j113N94n48j867q03n55k719j578j78j706j547j42m1j077O55J587N9P32
1531c967K587O42P08K555J343m1J225J353o87J03Q18r46j818O5j107k608m89n53
1549h17k549j326q9j525r82J266on30J471J489M03K079K490M63J195K171O38J91
1567F032J333j71j410l04k44j979j285q41k698j730l68j169r82k4n53m35J113
$$ y = [261, -701, -1708, -2529, -3228, -4185, -4657, -4264, -4176, -3819, -3277, -2555, -1643, -391, 674, 1663, 2498, 3300, 3778, 4100, 4509, 4422, 3829, 3387, 2612, 1798, 1009, -199, -1719, -2740, -3118, -3857, -4432, -4498, -4603, -4930, -3849, -2224, -1737, -839, 510, 1149, 2096, 3935, 4836, 4339, 4478, 4789, 4061, 3709, 4021, 2392, 677, 424, -705, -2274, -2815, -3119, -4699, -5043, -4395, -4966, -5133, -3599, -3184, -3318, -1118, 434, 413, 1956, 3843, 4197, 4980, 6319, 6280, 5167, 5761, 5213, 3346, 2543, 1988, -731, -2309, -2487, -4193, -5740, -5882, -5923, -7000, -6345, -4758, -4699, -3967, -1380, -738, -30, 2525, 3868, 3827, 5052, 6405, 5718, 5821, 6639, 5693, 3875, 3940, 2833, 225, -264, -817, -3366, -4692, -4781, -6306, -7288, -6022, -6028, -6558, -5087, -3598, -3195, -1116, 1374, 1837, 3032, 5203, 5841, 6032, 7365, 7194, 5784, 5480, 5236, 3257, 1972, 1131, -1567, -3297, -3665, -4834, -5816, -5840, -6393, -6828, -5715]
1584e715J254P38R37J564R47Q67K134J151L03Q16J74k35N43j01r82j051o47j186
1602A511j307n03j336k027r6l61q01J9J39m52O60J712Q72M78J458Q86L28K084
1620C264J574o00j53Q80r71l20P24j282k249m78m66j661pj50j916j119J322k61
1638c869m26J596K31o34J505J995J16R00J578k16k83J877O7j521O65k59j981l56
1656I85K71k032j366K24q53j244R40K28j172M55J639l1N70J896K7J3J843Q72k81
1675B984L06P87j059k33Q41j123j508l93p58j741p1k35j446n41J68J07L3J281
1693b601O73m04J617J648J77J285J225l35J65J056r1p26l59n41j538p81l3j504
1711a067j054l48j087n85K42km31K83Q09K50J141J322O10P49J158P05M50J216
$$ y = [-5715, -4461, -3723, -2786, -1222, -275, 592, 2726, 3877, 4180, 4996, 5170, 4935, 5478, 5377, 4395, 3344, 2697, 1511, 204, -299, -1635, -3662, -3758, -4119, -4920, -4901, -4762, -5214, -4554, -2842, -1970, -1492, -34, 852, 1180, 3264, 4838, 4238, 4085, 4965, 3994, 3674, 4398, 3116, 867, 389, -77, -1738, -1745, -1895, -3811, -4930, -3608, -3869, -4295, -2699, -2468, -3102, -1597, 398, 514, 1414, 2992, 2776, 2493, 4370, 4437, 2916, 3581, 3322, 1341, 985, 1256, -776, -2142, -1918, -2771, -4015, -3075, -2847, -4019, -3564, -1925, -1956, -1386, 510, 537, 550, 2393, 3265, 2984, 3290, 4077, 3018, 2785, 3626, 2503, 995, 602, -156, -1897, -1968, -2203, -3649, -4190, -4022, -3915, -3882, -2601, -1928, -2332, -715, 933, 1110, 2395, 3620, 3285, 3450, 4506, 4415, 3689, 3330, 2789, 1251, 470, 437, -1067, -2121, -2469, -3556, -4141, -3899, -3901, -4332, -4049, -3240, -2990, -1849, -527, 83, 832, 1990, 2695, 3145, 4361]
1729D361L58l84K2m5o77m44p82j279j178q28q32j108q11p49p68J43M6QO48O42
1749c657R48J285J283J160R64J342R92Q59P40J37p34j51n58j192r13r76j986j609
1767b066r61q13r95m66j96o41M64R92O14J129J265J011J208J514R28O04O46O67
1785D904K10j65j22o37r23n18p17j137j146j108r80r69k45n62p38o0R4K82R78
1804c559P72O49R07J370J000J174J020N94L82M28K13j37p35n38j085j095r07q82
1822d29j072p93r69n16j15o2N6j18M86N46R60J137O10N72R13R15Q10O67J87P4
1842C859j10k21k30r34p13p39j204q48n30q39p34l68l30J54M44N36N16O01J106
1861e84R12Q30Q60K94L98M56Q3J42l53o07o69o69m98o35r83n62p61m13K8J9k07
$$ y = [4361, 4719, 4335, 4357, 4312, 3635, 3191, 2409, 1130, -48, -876, -1708, -2816, -3627, -4376, -5144, -5001, -4955, -4947, -4299, -3657, -2709, -1424, -141, 1019, 1983, 3325, 4317, 5176, 5916, 6053, 5319, 5168, 4610, 3418, 2505, 1529, -457, -2066, -3027, -3840, -4835, -5301, -5497, -6138, -5674, -4682, -4068, -2939, -1674, -663, 545, 2059, 2987, 3591, 4237, 4904, 5114, 4949, 4827, 4190, 3267, 2749, 2032, 895, -251, -1359, -2339, -3308, -3553, -4115, -4853, -4913, -4819, -4537, -3559, -2787, -2138, -1231, 139, 1139, 2313, 3333, 3927, 4309, 4737, 4950, 4813, 4078, 3540, 2455, 1360, 453, -429, -1501, -2294, -3263, -3779, -3894, -3956, -3900, -4018, -3532, -2986, -2026, -889, -279, 293, 1206, 2121, 2931, 3598, 3785, 3859, 3749, 3528, 3298, 2364, 1651, 912, -292, -1140, -1670, -2509, -3243, -3611, -3941, -3787, -3343, -2807, -2291, -1690, -584, 328, 1158, 2018, 2312, 2710, 3166, 3249, 3391, 3038, 2431, 1762, 1093, 595, -40, -1023, -1585, -2346, -2759, -2731, -2712, -2919]
1882b919L49J30M96O62P78P26O23M75P45M94M76qj3l96j39m32o15n23r45p27n39
1903a302l50q74m42k23l3J98M79L38J90R09N00Q97J038N18M95J96Q42N7j22O5
1923C376l88p85l08o44j027p49p33r19p04k94n17m07L42J41L0P81Q95N14J289
1942a07J201O64P58J029N10J18L52M2q92k45l65j321r10o35j461j237k77j059
1960c835p78O0J06m0K12J036L57P81J701J102O63J191Q49M02N45M27j2p02j02
1979C963p92j036m95n77j521q84q63j055o42R1m64l68K40N70K71J139J093L50
1997i80R25J321P76Q36R03K07k6J02K24k44q10n02j286p40m32j227j180r54o91
2016c778l60L09m04k3L16R22O75J138J082O76M76R35J051L99Q75l19o52j18m0
$$ y = [-2919, -2570, -2440, -1944, -1282, -504, 222, 845, 1320, 2065, 2559, 3035, 3027, 3014, 2618, 2479, 2047, 1432, 909, -36, -763, -1302, -1652, -2526, -2968, -3191, -3224, -3026, -2547, -2209, -2019, -1110, -610, 287, 1325, 1843, 2338, 2534, 3376, 3433, 3311, 3376, 2988, 2203, 1895, 1251, 224, -525, -1258, -2177, -2881, -3175, -3692, -4099, -3757, -3616, -3586, -2805, -1910, -1396, -107, 1094, 1758, 2516, 3545, 4055, 4173, 4525, 4567, 3675, 3430, 3065, 1744, 834, 199, -1262, -2499, -2776, -3835, -4613, -4553, -4447, -4487, -4275, -3239, -2882, -2101, -400, 702, 1365, 2556, 3405, 3807, 4352, 4779, 4767, 4065, 3963, 3171, 2135, 1640, 1063, -458, -1342, -2205, -3260, -3902, -3811, -4275, -4643, -4403, -3833, -3562, -2423, -1330, -980, -55, 1266, 2042, 2878, 3781, 3988, 3962, 4064, 4288, 4044, 3234, 2732, 1446, 706, 274, -953, -2133, -3087, -3778, -4138, -3829, -4233, -4256, -3940, -3018, -2343, -1205, -123, 553, 1029, 1964, 3015, 3414, 4289, 3970, 3318, 3200, 3160]
2035C160n81o95p44j443p65k79m70o93l99n21l77N88Q78j65M21N94M12R00J393
2054A214N38QM09O84r4O83R2j322n73j12o57o76m17q34j266j42M26o06m4O14m43
2075b518J38J588O14l18Q27O69j42Q06J007n14n19M85m8q23N13k18j675k29K82
2094g5r13l99R5p03q15O20O62n47M15R10p02N53J761M45k86J000M9k46P40Q27
2114C391j162p17R1o31j019L26p11j677j44M5q58L7O10l51k69J216N07J09J484
2133B77R26j87Q40J330p6K95M03l27o28J27o45j457n14o41j543n66j11j009o30
2152d136K51Q6J64R58N48K27R11J454Q18P29J071n3J0Q50K58l73m15p34j051m32
2172A141l73p76j125p09r42p33K62L7m33k8K61K18J073J089K56N45J199Q70N06
$$ y = [3160, 2579, 1884, 1140, -303, -1068, -1347, -1817, -2510, -2909, -3430, -3807, -3219, -2341, -2506, -2085, -1491, -1079, -179, 1214, 1752, 1760, 2169, 2853, 2759, 3442, 3534, 2212, 1639, 1527, 870, 194, -223, -1057, -2323, -2465, -2039, -2645, -2689, -2075, -2518, -2380, -792, -178, -496, 331, 1000, 858, 1664, 2671, 2157, 1638, 2123, 2075, 1252, 1765, 1547, -128, -357, -75, -988, -1387, -1292, -1995, -2810, -2190, -1528, -2075, -1660, -750, -1452, -899, 862, 1307, 1021, 2021, 2070, 1824, 2564, 3391, 2229, 1512, 1603, 972, -47, 279, -432, -2109, -2253, -2208, -3066, -3029, -2419, -2770, -3039, -1823, -1316, -1207, 277, 1203, 1016, 1856, 3186, 3110, 3405, 3808, 3481, 2853, 2980, 2335, 878, 364, -277, -1820, -2386, -2497, -3506, -4136, -3885, -3799, -3635, -2677, -2129, -1902, -991, 463, 1281, 2010, 3081, 3028, 3038, 3888, 4146, 3773, 3358, 2624, 1573, 1141, 768, -8, -1133, -1842, -2784, -3517, -3255, -3218, -3651, -3679, -3418, -3200, -2127, -1038, -782, -237, 962, 1832, 2338]
2191B338J142M92m29K07P6n01k23n43j308j098r4q59r94m43p89j068K21P10m60
2210c623J35Q28R6O24J531P29J89O79J064L32Q68P12l34p40M72l96p40o09p19
2229A098j626p23n8r70o90m18l08m18Q05O85j41N71R08M31J237J195L98J04N34
2248B614O35j46J78j3r03p18J48p13r88m34r67p20j80J33o20l60K82O8K81J082
2268a341M76j47Q48Q51N16P20M34j12o4L23q7k09k74o41r88l82O2p75m53m79n82
2289b304O7J66J97o3J6M80O47O40N93K91M2N16N06M20J84l66m33k5r8k33p15q02
2311b74l87o10J6l40m94k26j10K37M04N61L26K53N88P14O22M69L79o2N7K11M0
2332B374j10n60o96m68o09k75n58p10n29m26K3L5j3P6K80L94P07Q68N33O45M28
$$ y = [2338, 3480, 3972, 3543, 3750, 3826, 3325, 3102, 2559, 1251, 153, 59, -800, -1794, -2237, -3026, -4094, -3873, -3163, -3623, -3488, -2660, -2564, -1940, -409, 320, 509, 1188, 2252, 2584, 3452, 4164, 3830, 3090, 3562, 3166, 2426, 1817, 1098, -528, -1251, -1309, -2279, -2969, -3387, -3695, -4113, -3308, -2623, -2764, -2193, -1285, -854, 383, 1578, 1976, 2080, 2614, 3249, 3103, 3281, 3268, 2365, 1647, 1795, 1082, 94, -340, -1307, -2027, -2207, -2074, -2694, -3054, -2772, -2704, -2423, -1341, -865, -1012, -164, 687, 1203, 1923, 2357, 2245, 2181, 2504, 2417, 2208, 1934, 1293, 305, -77, -15, -790, -1243, -1722, -2304, -2237, -2071, -1874, -1937, -1921, -1441, -794, -154, 439, 730, 772, 1288, 1794, 2214, 2398, 2032, 1599, 1574, 1476, 1243, 528, -274, -661, -1271, -1255, -1595, -2089, -2315, -2425, -2188, -1784, -1223, -897, -644, -56, 658, 1280, 1749, 2128, 2066, 2123, 2334, 2374, 2264, 1704, 1008, 540, -69, -344, -902, -1612, -2141, -2567, -2544, -2509, -2522, -2446, -2166, -1772, -1065, -197, 336, 981, 1409]
2353A409O48N04M10J44j51k46k21m17n81o66j096n92n65n61l46m34l53j31J71
2372c074N50K81L65N20N42P63Q32O04N13N29J93M02J70j61j52l16m35m92o76n51
2392D07r57q40o98n22n19j53l62J2K23M40N59N08Q99R88P26R79R25M39L79J63
2412C596P8j07l46m91o18j008p00r88n62p23p68l85k21o6kL01j4O60N61O76P22
2433d05M78Q20O58M38M42O37J6R2k42l3n16p25m70q46q81m87o99n38l08l11j59
2454c039K37k3O68L65M55O50M67P86M01N64M78K72j35J66j24j28j88m04l95o94
2474C79l25l54m58m85l33m74QR7p7J11K73R3O30O09M17L55M12M58L18M60N1l13
2496A852j80Kl50l30k03n64p89l45L4o53k86K5m94K45P61J11o4O63L87L09Q73
$$ y = [1409, 2057, 2561, 2971, 3115, 2964, 2718, 2497, 2080, 1499, 833, -263, -855, -1420, -1981, -2327, -2761, -3114, -3245, -3074, -2524, -2243, -1878, -1358, -816, -53, 779, 1383, 1896, 2425, 2618, 3020, 3190, 3029, 2877, 2561, 2126, 1634, 958, 407, -550, -1390, -2088, -2610, -3129, -3282, -3644, -3632, -3409, -2969, -2410, -1902, -1003, -15, 711, 1690, 2615, 3054, 3433, 3596, 3674, 3567, 3221, 2730, 2112, 1104, 404, -584, -1146, -1869, -2637, -3022, -3243, -3309, -3311, -3010, -3024, -2364, -1803, -1127, -405, 73, 893, 1551, 1989, 2431, 3068, 3084, 3176, 2934, 2901, 2385, 1660, 1190, 344, -537, -1024, -1723, -2261, -2569, -2880, -3039, -2802, -2825, -2157, -1792, -1337, -687, -220, 566, 967, 1531, 2009, 2281, 2146, 2312, 2188, 2060, 1872, 1468, 1073, 379, 54, -300, -758, -1243, -1576, -2050, -2042, -1945, -2022, -1911, -1638, -1545, -915, -306, 111, 466, 878, 1336, 1654, 2114, 2165, 1852, 1672, 1674, 1324, 994, 791, 227, -562, -907, -873, -1526, -1812, -1787, -2281, -2036, -1275, -1164, -1228, -565, -178, 131, 1004]
2517A004M56j46N3N65K4l19L70m57q76r8l63n29n08j75p41n55L32J19l72L19L60
2538a537QO71J028M33k2Q12K85K22N87K33n83j67j23n01m80k71r84q82j73r1o73
2559b208p1j35m16L50P53L31J44O32M87K09J091Q89r6K70M28l44k1M04m55p09
2579A533o08k01q62l21k36j151n80Kr6r8K27q8J50O52Q11K85O96N68L24M86R43
2600B436J90mK70l68k42J21l78p41o74o60n99m80m20n82p41lP8o6L29K68k3O94
2622a595R16O19O39P77K13M71O83K35l5J75j52p75l13k88p14p77n62q73p35j92
2642b283j8q85L4L74l7K83J041L15K57R45P14L58J009M87j39L6N85k87n19R5p42
2663A623j115j02j97j011m73j65r43l22N57j9n68O81K96kR02R21J00M36R91j6
$$ y = [1004, 1460, 1314, 1367, 1932, 1956, 1637, 2007, 1550, 674, 576, 213, -316, -824, -999, -1740, -2295, -1963, -1844, -2216, -1897, -1537, -1529, -858, 170, 603, 581, 1393, 1678, 1900, 2487, 2720, 2137, 1970, 1847, 1346, 866, 595, -389, -1271, -1444, -1535, -2208, -2279, -2414, -2830, -2480, -1727, -1396, -1252, -620, -133, 76, 1167, 2056, 1960, 2230, 2658, 2314, 2293, 2697, 2242, 1533, 925, 724, -138, -459, -695, -1846, -2426, -2424, -2520, -2618, -2391, -2479, -2329, -1677, -866, -581, 115, 683, 1007, 1493, 2436, 2626, 2622, 2892, 2524, 2282, 2403, 2025, 1284, 610, -50, -649, -1129, -1549, -2131, -2872, -2875, -2797, -2863, -2534, -2266, -2289, -1595, -679, -60, 579, 1356, 1569, 2040, 2723, 2958, 2923, 3098, 2946, 2171, 1858, 1570, 856, 79, -483, -1356, -2091, -2283, -2301, -3186, -3152, -2778, -2815, -2532, -1491, -1176, -919, 26, 740, 1098, 2107, 2594, 2455, 2491, 3076, 2789, 2270, 2365, 1623, 508, 406, 209, -802, -1275, -1440, -2383, -2705, -2148, -2167, -2735, -2054, -1758, -1760, -858, 63, 163, 599, 1590, 1574]
2683A574L41O24j8n61K29k5p90m22k86q56p51l6l61o79P7j73k13M34M40K93J63
2704i96O12L35k7Q41O46j94Q9L70o4j26L50m20m51k89j75n88l23k6q77k27N4l04
2726a790QL27m9K35M41N55J74N25M28K42L34O94k04J5j43n53j40k06l86o52m46
2747e91k90n39j02l7o5k11K19K38J11N13L34L06M55K53L52M11L68J24j08K90j46
2768A885l89j90l95o27j97k94p40n45k60l37l96L30J26j38L87L03M88P82O86M56
2788I35L96N16K37M04J69L9m18n30r7m38p14l49n59p97l01l70l82k08Q1j75K58
2809b303L41L26M05O76O03L09O79N88L91K92L79j21j9p9j44o21l97n72n80o66
2829e13m26p22m89l14j97q0L9L84o3N24O96N06O62O89N42M12M05L99J31J22l0
$$ y = [1574, 1915, 2539, 2521, 1960, 2189, 2164, 1374, 952, 666, -190, -941, -977, -1338, -2017, -1940, -2113, -2326, -1892, -1452, -1159, -996, -384, -49, -76, 765, 1411, 1217, 1306, 1676, 1612, 1486, 1836, 1416, 965, 676, 501, -87, -410, -436, -1313, -1540, -1486, -1790, -1782, -1455, -1504, -1269, -828, -273, -99, 426, 854, 1096, 1430, 2124, 1920, 1935, 1792, 1239, 1099, 893, 507, -145, -591, -881, -1420, -1522, -1559, -1624, -1835, -1616, -1378, -1267, -754, -420, -114, 341, 594, 946, 1357, 1725, 1849, 1741, 2031, 1885, 1496, 1306, 911, 284, 87, -207, -947, -1492, -1752, -2089, -2485, -2155, -2029, -2167, -1780, -1477, -989, -207, 479, 935, 1331, 1847, 2084, 2488, 2657, 2696, 2278, 1748, 1651, 1213, 499, 150, -409, -1206, -1507, -1877, -2259, -2467, -2386, -2561, -2303, -1962, -1636, -1231, -555, 48, 357, 1036, 1624, 2015, 2307, 2686, 2565, 2546, 2467, 2323, 1702, 1305, 733, 153, -513, -939, -1661, -2150, -2464, -2661, -2741, -2702, -2318, -2381, -1857, -1161, -655, 7, 696, 1238, 1650, 2055, 2454, 2585, 2707, 2677]
2850B677k78l10m26m71n61q03n02l59o11m38l97n3j11J89J90K81N65K97O86N65
2870A30N17N28M19K58L21J92j49Q2l82j22k99p95l56m70n65n17l79j86k01m4o8
2891b086J22K77K32L63M23N73M18N21K98K72L01O6J23qj99m05l14k50k25o09l78
2912d85m21q8m01k70q6nL70k2K32L21L99L38L66L68L54J67K15J20o6K08l80k8
2934A206l87k19m34m15m08n1l30l24n9l8J8J34NL97L07M34M57K31K78L22K87m3
2956A368J87j05K0k74k59j58o41k44l38m34l95j66l88K00L9J02J03J08M45L00
2976e30N54L70K10L89N52q2J90K19j59r7j87l09n31l98l75l01p67k2l57l05K7
2997a909j74L6L21L43K79L79O01N16N75K46M82P0J93L16k21j73j86k85o21j08
$$ y = [2677, 2399, 2089, 1663, 1192, 631, -172, -674, -1033, -1644, -2082, -2479, -2532, -2643, -2454, -2264, -1983, -1418, -1121, -435, 130, 647, 1175, 1594, 1852, 2173, 2365, 2216, 2298, 1916, 1794, 1495, 700, 344, -126, -691, -1208, -1587, -1773, -1974, -2018, -2086, -1964, -1687, -1455, -1092, -669, -96, 322, 843, 1141, 1413, 1714, 1780, 1903, 1895, 1696, 1291, 977, 727, 502, -107, -485, -906, -994, -1395, -1665, -1751, -1756, -1386, -1408, -1176, -855, -456, -118, 248, 616, 970, 1137, 1352, 1472, 1406, 1614, 1234, 1206, 819, 600, 166, -249, -657, -708, -1038, -1362, -1421, -1459, -1441, -1307, -1302, -905, -598, -164, 293, 524, 802, 1124, 1411, 1368, 1555, 1450, 1470, 1196, 937, 779, 138, -106, -444, -878, -1273, -1439, -1827, -1627, -1588, -1486, -1383, -1275, -830, -530, 24, 394, 604, 993, 1545, 1463, 1653, 1872, 1713, 1616, 1429, 1120, 589, 191, -184, -485, -1252, -1274, -1631, -1936, -1909, -2083, -2047, -1726, -1383, -1104, -725, -124, 392, 967, 1213, 1695, 1765, 1958, 2274, 2053, 1880, 1694, 1409, 788, 680]
3017F80q15k81n66j71o93j73J2k18QJ34L07J02O32L93N34M10O21M82M43K77J94
3038B312j29M8n0l31k36m56q81l29l77l62n29m34m30l8N6N5j14L65K86K42Q29
3059e03N70K22K40Q38K72L98L69R3n47K30l03n58k51k91r00m83k44l81o91O1l48
3080b207k94L59N52j46M61N73L04M18R17J98J15K00L97Q3j7K00m54m96r9k44n71
3101B49k72l32r66O6n0l66k00J6Q4J25O96M32j85N04P10j28M17P61M8l00L13n6
3123A566l48j0j87o52l10m2m33k79j16l12n59L19K07j36N9L68m3L13Q22K85j73
3144C39L80K72j2M50j25j04l80%J10n74j54k65o34k45Q0n22K08M6l31K40M18J97
3166f06Q0L76L98J62M72L89o1o6K63q7j41J04m09m78k45j07o44k29k30k55k67
$$ y = [680, -135, -416, -982, -1153, -1846, -2019, -2007, -2225, -2217, -2083, -1776, -1674, -1042, -649, -115, 295, 916, 1398, 1841, 2118, 2312, 2183, 2231, 2181, 1850, 1614, 1158, 277, -52, -429, -791, -1320, -1754, -2184, -2222, -2166, -2111, -2225, -1860, -1574, -1332, -503, 67, 289, 529, 1367, 1639, 2037, 2406, 2499, 1952, 2182, 1879, 1321, 1070, 779, -121, -604, -848, -1229, -1920, -1859, -2207, -2501, -2142, -1590, -1736, -1275, -702, -398, 20, 937, 1135, 1250, 1450, 1847, 1930, 1913, 2113, 1659, 1163, 1064, 820, 249, -23, -355, -1321, -1255, -1305, -1671, -1871, -1855, -1771, -1646, -950, -518, -703, -199, 511, 383, 800, 1561, 1609, 1309, 1622, 1566, 1218, 1208, 1021, 369, 59, 17, -416, -695, -811, -1123, -1682, -1363, -1156, -1292, -1233, -865, -908, -595, 227, 512, 339, 719, 991, 979, 1429, 1304, 1200, 820, 820, 930, 356, 202, -63, -697, -942, -862, -1384, -1176, -1130, -1461, -1221, -803, -606, -526, -150, 248, 410, 882, 1271, 1210, 1144, 1407, 1320, 1179, 1283, 874, 396, 151, 44, -600, -829, -1059, -1314, -1581]
3187a581J59m8R0K96K4J86O84M10M62K71J62J53J76K24J09l14j46q1m10l44j71
3208C11n92m22k78k35j87k71N8k72R9K68Q5N79M87K52L05N99J35N01K20J29r9
3229A672J05Lm4o99J4o70l51j53n35k35m26l81l89L51J19k00K63K00M37K70O88
3250C9N95K8M70L11L82J73Q0l7l36m5j67p23j77l25o87o15l6k27m42rk04o0L78
3273a634J40J23N40K35M04M66P47J3K08L18J30J05J81p8m23l79k73l83l39k80
3293a79m40o04j75r1k46N9O1j17L43M54L50M9M05L63K64N53N12j41J47L3K1N7
3315A678m42k10k99n01m58k47j73m96k84j23K6Q8j4K52J26K18N60L12K51L38L50
3336I52J03J37J78k4l3k90p1j18j64m25m33k83k31q2k29j74rkK32K16l0J48M82
$$ y = [-1581, -1422, -1470, -1380, -1084, -1060, -874, -190, 220, 682, 953, 1115, 1268, 1444, 1668, 1777, 1463, 1317, 1236, 826, 482, 311, -281, -703, -981, -1216, -1403, -1674, -1616, -1888, -1789, -1521, -1436, -857, -370, -118, 187, 786, 921, 1422, 1642, 1771, 1672, 1777, 1780, 1736, 1037, 1051, 381, 30, -123, -658, -893, -1319, -1700, -2089, -1738, -1619, -1819, -1556, -1356, -919, -649, 39, 634, 662, 1132, 1443, 1825, 1998, 2078, 2041, 1705, 1660, 1493, 770, 593, 268, -419, -1034, -1070, -1297, -1739, -1748, -1952, -2012, -1634, -1494, -1371, -831, -596, -192, 274, 1021, 1034, 1242, 1560, 1690, 1795, 1976, 1898, 1475, 1096, 823, 440, 101, -179, -619, -1223, -1398, -1489, -1735, -1676, -1615, -1732, -1389, -935, -585, -536, -131, 232, 496, 1049, 1561, 1420, 1567, 1600, 1621, 1678, 1236, 1026, 727, 226, -232, -479, -652, -1148, -1432, -1555, -1529, -1441, -1455, -1203, -1077, -859, -299, 13, 264, 602, 952, 1055, 1192, 1370, 1346, 1313, 1023, 952, 834, 670, 245, -188, -471, -702, -784, -1013, -1187, -1196, -1198, -966, -750, -780, -632, -150]
3359a50Q2M85K48L27l2p8J63n4mm2k43l04m5m93J8k93m17j57P8j31q3P2P6O8M31
3384d78L50P8L17L40R4K64K75O1j80k7k32q1j37j89l53l56k18k25j10k87P3k27
3406a248J20p8L6M34Q2M67P1L77K80L14J40K59K26j93P6j83j54l5k94m05l40k79
3428c27n63k94K0j72k92J60N7O6K09L03J92L23L65P04R4L89K68P7k9PJ03k40k44
3451A176l40k67l81l04o13j11n04j07M5j85k23J74K56L33J65M51M11K55L99M11
3471A041J05K56K33Q4j19J51k82l84l95j05n09l45k31n37k01j34k79JR7k8J91
3492a390K51L91K88L42M33K79K75M51M2Q3N3N2o4k24l35j86k23l22m66j75k66
3513g11l57k26j71L19l22J00J43R9L39L19M42K82L31J69K51J70J95J5j68P8j75
$$ y = [-150, -68, 417, 665, 992, 960, 882, 1045, 991, 987, 945, 702, 398, 353, -140, -122, -415, -832, -989, -911, -1042, -1125, -1053, -977, -909, -478, -128, -50, 267, 607, 701, 965, 1240, 1301, 1121, 1094, 862, 781, 644, 455, 102, -254, -472, -697, -807, -1094, -1021, -1248, -1128, -1206, -1170, -736, -654, -187, -116, 261, 541, 855, 995, 1254, 1480, 1287, 1363, 1180, 1026, 991, 697, 292, -48, -327, -890, -1184, -1164, -1336, -1628, -1468, -1411, -1345, -1136, -833, -641, -318, 47, 751, 845, 1234, 1502, 1579, 1550, 1557, 1660, 1420, 1176, 836, 569, 188, -116, -729, -840, -1344, -1451, -1406, -1591, -1814, -1640, -1384, -1051, -886, -435, -24, 231, 630, 1041, 1146, 1402, 1635, 1719, 1600, 1751, 1469, 1085, 690, 585, 76, -269, -500, -1037, -1238, -1372, -1651, -1650, -1553, -1581, -1390, -1139, -748, -460, -118, 315, 594, 869, 1320, 1362, 1445, 1498, 1550, 1486, 1262, 927, 741, 518, 196, -270, -445, -711, -1068, -1294, -1465, -1146, -1468, -1368, -1225, -1126, -787, -468, -26, 256, 587, 756, 1007, 1177, 1372, 1387, 1219, 1297, 1122]
3534A122l21j49k61m93j44l38l47l6k43j52OK77N0O4M28K63N3M18O03P2J9K88
3556A179j92J49R1j79k07k04j88l08m08k4m14k55R1r4j70K15M0p1K10L55K73J00
3578a1N15q8J56N50p6J9r6k1j67q8j96m71l22j19P2m77k8j08k18Q8K00J31J66
3601e89J58L08J04M10K52k3K67J13k16J94o3J2m34O1m1m28j09j75n08k5k06j26
3623a064r7J13j56N1L23L74p3M61L36R6M02N05k5O8o4m7m7J07l33n82k01l29k92
3646d74j81j73l20k03O3J88l45K64L42m8K62O95M5L61K60L79j20L89R3L1k67J34
3668A375l64k71j09n25n09r4k31n28N5k3k66r8L65j03L38L08M10m3M88O12r8M33
3690A122K78k92O0K95r1l60N2l66m66o6k74l63m27j02k28k74L57o3k66L55L40
$$ y = [1122, 801, 652, 391, -102, -246, -584, -931, -967, -1210, -1362, -1356, -1079, -1029, -965, -537, -274, -221, 197, 800, 872, 891, 1179, 987, 1136, 1227, 1048, 841, 637, 449, 141, -267, -291, -705, -960, -869, -963, -1133, -918, -878, -949, -739, -384, -111, -11, 504, 416, 572, 1122, 1046, 1065, 969, 948, 781, 693, 497, 26, -296, -415, -343, -820, -848, -956, -1174, -1086, -886, -755, -589, -431, -123, -19, 391, 643, 620, 887, 1000, 784, 978, 915, 927, 493, 554, 513, 85, -24, -199, -707, -732, -938, -1064, -1161, -1048, -1204, -1153, -830, -456, -529, -68, 268, 364, 766, 1271, 1246, 1314, 1250, 1203, 1156, 1263, 930, 348, 147, -182, -474, -655, -828, -1148, -1351, -1288, -1100, -1445, -1181, -839, -887, -625, 70, 115, 476, 736, 1115, 995, 1384, 1477, 1508, 1241, 1375, 1011, 740, 631, 106, -403, -497, -728, -1256, -1201, -1224, -1490, -1588, -1223, -1326, -988, -680, -270, -313, 175, 787, 689, 1122, 1400, 1108, 1168, 1463, 1372, 1012, 1064, 698, 232, 166, -108, -471, -898, -1000, -1228, -1502, -1145, -1208, -1474, -1119, -779]
3711g79l27Q14L34N8K10N03K01R1K54l8j85R1j10k83j86k94l26m45n9k76j93j47
3733a092j64k9r4L72j4K22J77N19Q9L57K58P3K51R6J81p4p3n5k82j03k73j85l08
3756a51n4l90j93j5j49j44J14Q7J41J21J93K91K06nL67K36J85L8K6N3j66l4q2
3779F75j27l98j21p6j36m77R9j61o5n3J50k4K51rP3J43M05r8L34K84l8P6L54k58
3803H03mj26j86q7l68R4l06m13J07l52O1r1O5J46k26L11L02J10P5M02J87j5K72
3826G61K05r0m9J7n5j02j41l10mm27k64j60kl53j64N0n3K80O6J24R4L79K05K12
3850B19L01K63J68J51k3M6Kq1j86k92k16j00l24m07k52j54j88K0j14n6OL00O0
3873h57K65L42K44K49J68J93J91K17K05M4l3o8o7k27l15k4l31k26p6m03k95R6
$$ y = [-779, -1106, -292, 42, 100, 310, 813, 1014, 1105, 1359, 1321, 1136, 1227, 1117, 834, 648, 354, 28, -417, -476, -752, -945, -1092, -1256, -1285, -1379, -1007, -1021, -799, -622, -103, -14, 343, 601, 674, 925, 1021, 1202, 1128, 1055, 1000, 718, 615, 342, 157, -151, -205, -595, -788, -803, -952, -1096, -982, -895, -754, -633, -440, -149, 57, 52, 419, 655, 840, 878, 904, 957, 791, 757, 675, 548, 150, 29, -47, -183, -660, -561, -722, -787, -840, -690, -714, -463, -472, -399, -256, 149, 51, 385, 669, 631, 707, 1061, 803, 799, 673, 487, 400, 32, 126, -180, -593, -486, -838, -777, -868, -803, -657, -883, -572, -270, -160, -85, 317, 504, 489, 761, 966, 876, 827, 844, 789, 687, 546, 236, 232, -195, -459, -619, -621, -974, -1138, -1088, -1141, -861, -795, -671, -577, -198, 7, 219, 520, 783, 951, 1102, 1079, 1125, 1127, 1046, 860, 568, 352, 252, -72, -479, -731, -885, -1073, -1053, -1167, -1223, -1217, -917, -857, -592, -250, -6, 243, 411, 604, 795, 1012, 1217, 1261, 1228, 1160, 1093, 866, 551, 527, 196, -30, -106, -509, -804, -708]
3895g08k09m04J91K8L6L37Q8L35J16J90N64M7L01kJ84M9N4Pj16j04l63n0n50j47
3919a26l39j87k12p6k35QJ3P3Q1J67K12L37J52L86K29J99K85N8K29o0j60r5Mp0
3943H73n06l2l80k75j87k10m0k22j58J62L1Q0J01J60J49K43L16J77J74K16R2M5
3965H09K1J11j59j48l8j32k66o1k27j72l08m7o1j61J01r5j6K57J22J56K06J32
3987B4J69J54O0J24K7K05j57R5j57J09j39k62r5m11k4j32Lk37J31j44J02L7J01
4010d17Q3p7K68K55N7L34n1m1L80LK1j70J0l93M1j56j97k86q3p7j42n4J06j97
4034g83J72o8J48K37J64K93J08P2K52J54L9J11j26p9K33l52k19r1m91L0r6k42
4056e34j23r2j92n0K17J45q2K69n3K45L01R2J80J66J36J71K46q1j07r9j33p5j96
$$ y = [-708, -917, -1321, -1130, -1102, -1066, -729, -641, -306, -190, 0, 564, 611, 912, 910, 1094, 1143, 1197, 1204, 1088, 984, 621, 571, 21, -126, -465, -652, -864, -940, -1175, -1167, -1154, -1081, -1000, -833, -621, -284, -132, 254, 483, 682, 967, 1025, 1254, 1194, 1034, 939, 943, 873, 367, 335, -45, -320, -507, -717, -757, -979, -1137, -975, -944, -864, -763, -603, -454, -211, 105, 282, 456, 672, 764, 809, 830, 941, 782, 634, 596, 464, 198, 137, -90, -262, -570, -617, -678, -839, -738, -833, -849, -592, -470, -314, -108, 24, 193, 347, 407, 531, 558, 763, 606, 701, 544, 653, 514, 252, 157, -254, -278, -410, -407, -644, -513, -657, -555, -518, -417, -334, -411, -143, 112, 169, 503, 452, 411, 791, 794, 815, 645, 655, 262, 303, 147, -50, -336, -419, -496, -638, -692, -586, -783, -611, -679, -531, -294, -130, 163, 271, 343, 595, 749, 788, 899, 773, 694, 927, 575, 356, 265, -226, -196, -292, -534, -657, -749, -941, -991, -774, -629, -711, -442, -495, -250, 51, 143, 323, 489, 625, 796, 1042, 961, 854, 755, 622, 547, 351]
4079C51l03k8k07l68L9k48j76J05lj25j4L23J93q5L00L43n6K39L39Q4L26J80k66
4102I43Qj16L5j77l94j72k30j43p4k18l00l0k81R7Q2O6P7R6L60J40M56N4K62r8
4126D43L54K40J5k0j19j04j65J68m06l55j83N2m76j86k41k1j83R1K55j6L27q7
4148f17J49K93K47K35K97J81r6J08K8kk6o5k18j74o7m6l84j11j84r5j73l3J45
4171f08k69N3J70N3J51K68K31p2L40K30J47j10K49k28J09j03l5o5k80K6l84K2
4193a05l07j56j99n6Q3K28Q5l1l8K48K00K2L64J24j34Q9M02q3K2j08k04j81J00
4216C65j01j61j67m7m23M5J26m7k53O6J51r2L48JJ9L65R3K50j11O3J37m6RN6k6
4241F20l19J27l90k39j05Qk37j82k8L6J84J28k39L16n3K00J54M99j49NM7K51N1
$$ y = [351, 48, 20, -187, -555, -516, -764, -940, -835, -838, -963, -977, -654, -461, -546, -246, 97, 41, 280, 619, 703, 1029, 1209, 943, 951, 835, 870, 693, 299, 127, -103, -246, -320, -538, -838, -868, -1149, -1052, -970, -904, -827, -731, -371, -231, 225, 279, 541, 443, 797, 1037, 1052, 1032, 913, 809, 644, 812, 406, 51, -132, -80, -556, -742, -983, -1004, -1187, -1096, -841, -857, -530, -617, -468, -175, 72, 307, 604, 785, 689, 797, 825, 823, 797, 732, 514, 340, 273, 227, -157, -268, -452, -547, -720, -753, -608, -877, -824, -654, -601, -450, -182, 49, -23, 317, 547, 694, 584, 833, 605, 714, 611, 576, 511, 231, 257, -127, -105, -412, -568, -767, -823, -740, -512, -427, -458, -496, -248, -48, -26, 338, 462, 328, 417, 819, 736, 758, 650, 446, 265, 365, 264, 103, -64, -111, -534, -489, -363, -410, -663, -597, -446, -538, -190, -189, -170, 195, 288, 538, 427, 490, 627, 581, 590, 646, 620, 301, 428, 38, -201, -306, -298, -535, -717, -745, -709, -525, -397, -636, -320, -373, -173, -19, 480, 331, 336, 383, 634, 685]
4264F85P2p3j45Q4l19lk33J1l41l15k4m2j55p2J02j10J25L38J60oL42J0K68J40
4288D99J35K44j02R2o4j18p8K8l69p9j79l23j98J70m29k1m8p3J56Q1R1K4L21o
4312b46K52J40M66N1j19K17K02r2l3lk48j07M2k55k31m7l11k15r4o8K8j44K0Q
4336g87M5K71m7J81K24K57J88J98J60J58m4k0j97J54r3j97j2j34l16j85j63r7
4358d56j91j40q3J27j1Q0J77J7K08J56J59R0J43K13J98KK5N5k6m8j72k22j39j10
4382E2k40O4m07J40r8r1j58l8Q0J02J94J10O3J05J94J46L43L3Rj53J63L4j08k45
4406B94M7j17n9k96p4j44m9Nr9R3k39J34M0J47J28J35J82m1J27J25J46k2N7J6
4430E36o4l4j50j90o1o9p0j16k19M7o3j23K6J14K04j46J53O5O9K34J44P7L9J34
$$ y = [685, 757, 684, 539, 623, 304, 301, 68, 79, -262, -577, -601, -643, -798, -870, -768, -878, -753, -415, -255, -261, 81, 91, 359, 499, 634, 878, 776, 868, 804, 686, 608, 636, 267, 188, 9, -314, -512, -342, -771, -792, -840, -913, -757, -676, -585, -561, -240, -246, 6, 146, 612, 663, 544, 761, 963, 871, 838, 835, 587, 480, 522, 267, 36, -11, -322, -537, -631, -699, -671, -815, -795, -787, -742, -471, -518, -337, -113, 144, 332, 530, 690, 848, 804, 784, 587, 741, 648, 451, 439, 305, -11, -196, -359, -456, -647, -787, -870, -743, -754, -674, -497, -480, -272, -116, 43, 133, 276, 489, 687, 689, 714, 769, 743, 695, 523, 301, 162, 52, -188, -124, -531, -391, -489, -580, -738, -776, -696, -594, -400, -290, -227, -122, 72, 218, 561, 594, 603, 450, 613, 647, 539, 294, 341, 224, 165, -131, -205, -349, -398, -393, -492, -399, -638, -504, -464, -317, -189, -54, 128, 87, 214, 339, 485, 463, 520, 536, 472, 438, 288, 98, 37, -32, -102, -218, -437, -390, -453, -576, -550, -436, -232, -378, -225, -160, -91, 143, 287, 364, 403, 537]
4454E37k19K19o8l5r9q9j74j00Kk0j46k07j37m6o0J66q5R0M9K7O3J55K20P9K72
4479C94P7R8o8o2J04jK2k76N2k93n0k15Jk93k00j5J34j20K9K29pJ48J88P9K04
4504A59L6K48P4m3K27j03R7p1j6k97M7n9l63j45J5k10j48r0j92N7k10L14R6N8
4528e19M0K67K46K94j52L31J1j9Q3J98K0j49nk58J07l52P3k25j19k00j75M8p6
4551e31j81Mq1J29J53J56J72J07J46K02Q8R9J01J00RM0N9k66o5o2j63l4l72K2
4575a68k09j09n9l3j08N8o8J89L9J96J08J16J32K77p6Q8P7J9J75j7j53j1n5k21
4599A87j61Q5l41J02j35k47j38J9J2M8j4K47j33M36J28Q7Pm8K71l3J74k3k00J32
4623D62j75j43J9p8j23l44K14j03j03p5j2P3l5J17M7J10O7J56K3M9J48K91k92
$$ y = [537, 318, 537, 469, 434, 335, 246, 72, -28, -26, -46, -192, -399, -536, -582, -642, -476, -561, -471, -422, -395, -332, -177, 43, 122, 394, 471, 569, 501, 439, 543, 542, 564, 288, 340, 47, -3, -218, -217, -510, -710, -725, -591, -711, -682, -453, -460, -312, -124, -45, 159, 195, 443, 517, 474, 701, 598, 695, 624, 608, 311, 358, 299, -64, -209, -194, -404, -552, -642, -834, -777, -987, -673, -577, -519, -479, -212, 34, 328, 176, 507, 518, 499, 582, 780, 800, 651, 646, 388, 495, 143, 216, -9, -128, -328, -503, -455, -531, -712, -708, -789, -660, -507, -351, -179, -72, 74, 276, 364, 463, 564, 664, 673, 713, 772, 506, 441, 379, 216, 182, -190, -168, -377, -486, -545, -578, -686, -628, -696, -507, -468, -272, -164, -48, 84, 361, 285, 373, 450, 469, 644, 627, 474, 463, 408, 187, 26, 111, -230, -128, -263, -510, -648, -629, -617, -569, -583, -336, -469, -33, 95, 182, 189, 141, 412, 379, 553, 530, 330, 462, 287, 144, 163, 85, -38, -382, -168, -271, -374, -449, -461, -388, -423, -306, -259, -149, -82, 74, 97, 146, 294, 585, 293]
4646B93m5K17q1m1M3m29J70n7k00j15J56j31l08J22k46L29J7N3J3J0L43j76J20
4669E7K77j10%J85m6K21k69J60m39K34j84j29j30J0j64j68N9j08k8Q3O2K8m5K45
4693a99J58R1Q9P0J73J79p4m4J05J84l06J6j25j09j26l02R3m78J82p9p6j21J92
4716e07r1J18Q2j6J39L11K79o7J22K36j07J24Q2j47q5J9j29l2k77k23j25n3J2
4739c35j11j70M4Q8j91K79q5R3K24lQ7L54J58K0J07j4L9L3J18q1k46J8q5k37q2
4764B2j22j01j50K1j77j48N4P2j63J33L09J35j1K25Q8K5P5K16J20Jj32m8R9j37
4788D06q4l9p1j75l05q3L4m1k29J41j3q8J28R4qJ87LJ18M9J82R8J45lJ06k56R9
4814C95P1j82j41Q3k55m3j74q3l8J3N5j74L9J07m0J77J52M0J2L9J97j48J86J04
$$ y = [293, 248, 465, 384, 343, 386, -43, 127, 70, -130, -245, -89, -220, -528, -406, -652, -323, -306, -253, -240, -230, 113, -63, 57, 334, 224, 224, 409, 363, 584, 315, 475, 36, 270, 86, -43, -173, -163, -327, -495, -436, -544, -572, -489, -427, -399, -444, -199, -41, 50, 139, 209, 382, 561, 487, 443, 548, 732, 426, 442, 317, 208, 82, -220, -127, -605, -423, -502, -578, -699, -507, -598, -480, -398, -414, -275, 36, 315, 248, 370, 606, 499, 623, 705, 558, 473, 492, 363, 331, 54, -169, -294, -347, -335, -446, -616, -572, -484, -675, -396, -481, -388, -164, -167, -80, 274, 432, 452, 559, 545, 584, 617, 735, 654, 408, 426, 341, 104, 22, -100, -201, -351, -330, -507, -655, -601, -529, -692, -559, -250, -115, -126, 99, 187, 212, 287, 503, 623, 624, 492, 444, 543, 406, 322, 283, 212, 37, -268, -351, -317, -358, -587, -446, -459, -547, -419, -325, -333, -146, -143, -25, 24, 206, 304, 449, 446, 552, 296, 395, 466, 284, 143, 226, -29, -72, -246, -329, -367, -354, -299, -473, -434, -327, -367, -190, -38, 2, 14, 53, 250, 102, 288, 392]
4838C92R2q5LL0J7l58Ol4k08J73j59q2j31j26M8L62l29K14j34J1K20M2K63qL4
4863B53J34j5j30M1J46r8k1k65j04J20l16Q9p1j39j0R2r0K7k0J12J14P4R3M8P9
4888A43n7K71o7K69o6j79k5M6Qk01m1k52l4k55J44p7j96q7K70j26J28L7R4K14
4912c9N8J55m3K67o7J95kN0j73n1N1r8p9j38k76L5r4j53Ml7j09J73k84K14M6j37
4938e32M05n5K57K8J85L5P1R3J92k44K38j57l07O0j9k06j25K7k47j2m21J38Kk6
4962f20k9J18L1J28K35J89QN9R1J34J76k2Pkj4pO4k89j0j38k27j06pk36j23N8
4988e32j52J32J14P2r2K90k04L96J8J66rJ25J92J9Lr2Mr7k1mj48n8l27q0J09o
5014a82k42J06j45kj24K45K10j23J53K74j69L5J7L14L4n0K52j38k77J41r6jl07
$$ y = [392, 484, 399, 402, 432, 449, 91, 97, 63, -145, 28, -131, -213, -344, -470, -422, -60, -389, -175, -309, -298, -78, -36, 227, 219, 253, 387, 372, 242, 283, 429, 331, 310, 45, -59, 61, -255, -166, -237, -376, -386, -294, -384, -357, -377, -265, -151, -77, 16, 64, 143, 86, 357, 290, 559, 493, 314, 289, 335, 343, 142, 101, -151, -185, -440, -296, -373, -569, -656, -386, -512, -384, -347, -253, -39, 19, 174, 131, 398, 331, 526, 524, 574, 401, 350, 401, 303, 224, 86, -190, -155, -249, -402, -398, -435, -544, -371, -655, -441, -395, -532, -127, -182, 75, 103, 288, 323, 394, 487, 679, 435, 673, 516, 209, 269, 250, 44, -81, -54, -301, -313, -734, -596, -594, -620, -649, -531, -500, -372, -137, 52, 60, 119, 210, 344, 520, 498, 505, 503, 489, 482, 546, 257, 247, 109, -118, -224, -231, -467, -590, -532, -684, -552, -438, -366, -458, -168, -372, 24, 42, 208, 199, 324, 516, 535, 538, 446, 450, 353, 332, 328, 180, 122, -205, -285, -176, -182, -424, -318, -463, -465, -589, -344, -134, -257, -104, 170, 1, 36, 53, 367, 401, 351, 603, 465, 188, 329, 233, 232, -75]
5037g5o6P5j80J1j89J65k6j48J18m5K3L15j15J32R7J45N5p0J06J07k21P8J00l14
5061G8K4jl0k5j54m0j35o2J05j03N5m5N5Q3m1L33L7Q4p4J15J57k02O5J07j31K8
5087B83j05N0j72J8n1k04j86M3l6l1j2j07K84j64J57K53n8J57kP3J08k0OK8P6
5112C88j1j70J03j79m6p9l1j97o2q9k31K15j17N8J35N2o4K07l3J80J66j4K4J01
5136C06J45p6O1m7j33J11r6j04l00J36j46k13O0j73j81J84O1l8J01N3J91n0J91
5159D3K03q1J94J44m8O4oo3J76k73j29ok8k56p5j8o3k00q0R3Q3j87k3L01J02k13
5185c46K40J3K24Q3N2k3K07L3J20p6j15m3J66k32j96k52M8K6k38P1j78P2q8o6
5209d98j47L75r9p0L62P5J13L6n0J51K26k7R9m6j81N3k65Rrj64j21k06J45k09
$$ y = [-75, -141, -66, -246, -235, -424, -259, -285, -433, -315, -360, -337, -22, -137, -5, 92, 237, 292, 222, 328, 435, 214, 292, 392, 78, 102, 101, 71, 46, -108, -148, -283, -345, -240, -343, -288, -333, -278, -195, -236, 97, 134, 218, 144, 259, 416, 214, 279, 386, 255, 283, 178, 228, 56, 74, 23, -181, -367, -324, -360, -391, -403, -510, -226, -390, -233, 20, -38, 119, 117, 190, 298, 278, 284, 312, 388, 377, 207, 310, 131, 85, 6, -25, -222, -284, -373, -604, -389, -506, -448, -313, -261, -325, -118, -151, 29, 195, 181, 205, 306, 451, 375, 436, 389, 256, 367, 271, 167, -133, 3, -143, -356, -296, -469, -650, -466, -405, -443, -342, -289, -98, -148, 43, 246, 165, 359, 503, 455, 519, 513, 450, 626, 353, 224, 218, 190, -66, -141, -159, -222, -422, -502, -409, -326, -513, -536, -235, -133, -346, -106, -93, 131, 214, 266, 243, 450, 483, 603, 527, 412, 369, 535, 303, 107, -145, -97, -71, -309, -238, -416, -344, -432, -498, -645, -270, -369, -439, -77, -2, 111, 147, 97, 248, 474, 447, 546, 500, 319, 372, 107, 116, 107, -57, -178, -384, -239, -448]
5233d48R5J64l46K9K88j23MK38M3M0R3J65J05j1j15Q3k7J03n9o8j78O9j84oj81
5258b27j13J53o3q4J4M9qj35K20J50N6rK89k13J23R1j88K31J6kq5j46k6j75J91
5283A09j52k67M2J79k32Q7j33K7q6K17J10K1K8o7J76J4J47Q5R6j46m7J33j12j42
5307H7mj82O6k44nj51K07k61N2J94m6m3K34j2J02J25n8K07j13J61J57j25J29n1
5331D26m2k39J65m20Rr7n2%kr1rl9R4j32pJ20J59j4N1J71j3R4K62P5k3K1j8m6
5359D03Lp8q3j49k3j91q4k27K06o7p1p4l7J28N2K6P8r6L66m2K03J63o6O5k7N8
5385D36R6j98p7kr5r4j35p5q6j56L5j56j3K09k52K07M7j53K86N7J20Q3l7K48J26
5410D21L9l8J58j42L4m3q2p1k53K6k89j09qj33NO4J54j85O5nJ86P2Q2J24R2J41
$$ y = [-448, -353, -189, -535, -506, -218, -341, -337, -99, -56, -16, 77, 242, 347, 336, 221, 304, 277, 380, 321, 253, 75, 144, -40, -46, -227, -340, -187, -250, -334, -320, -271, -279, -414, -194, -44, 12, 3, 292, 79, 202, 293, 105, 336, 352, 350, 265, 119, 93, -82, 109, -43, -310, -268, -89, -321, -234, -367, -340, -426, -209, -99, -78, -50, -117, 59, 73, 220, 305, 401, 255, 208, 341, 229, 87, 83, -99, -33, -277, -282, -433, -226, -487, -435, -241, -287, -330, -96, -108, -6, 119, 61, 268, 155, 316, 473, 348, 477, 426, 384, 145, 310, -110, -101, -198, -250, -250, -252, -343, -352, -391, -297, -429, -436, -316, -157, -171, -120, 51, 38, 132, 394, 469, 446, 467, 449, 403, 406, 328, 245, 96, 73, -118, -202, -429, -223, -290, -361, -435, -472, -344, -292, -266, -188, -284, 82, 40, 243, 406, 340, 405, 378, 436, 532, 334, 257, 255, 160, 66, -69, -144, -230, -386, -351, -507, -520, -311, -563, -356, -309, -462, -176, -119, 1, 84, 47, 295, 421, 460, 422, 580, 438, 472, 429, 347, 276, 23, 49, -240, -349, -357, -490, -485, -421, -267, -452, -387, -392, -206, -134, -52, 72, 164, 305]
5436C05l9L1L4K75l4j36M9j53k85K0p0j31kj74J26k15lM1k06L54j51J20oJ02K20
5461G2OR1P5Q2J00j04Q9m4o3j16O8j05j76Rn9p6j6j45L1rj99K0L88j34O8j0J37
5488b0J43L5m6J85o3o1J34j02n1on6j24NK7j32q8n2J44q0L9j54K21j60QJ61J21
5514B8mL8J22o8O7P3q8Q0O5l6n7l4j59q9j41n2K4r2n7j29K31j19N0J22K47k1o7
5541f6J65J67N3Q2r0J40j9m7j83%j34K0o3O0j04j55l06J29n6P4L4p1N6Q6k3N5
5567a96R2K41J03k8J38l4R5k4N4k6L3k51J77k29l31J68k58J5o3j30P6j96J50P1
5591c53P6j66L21N4J80qJ15K04m4M5mJ34j68J0k09Q1n7j16o1l05L3j55N7Oj42
5616d72R1l1P0P3j3J48O7P0N9J67J68j46J23N6J28k06J08K0k01o2l7l47J35J23
$$ y = [305, 266, 297, 331, 606, 572, 436, 485, 332, 47, 67, -3, -134, -136, -310, -184, -399, -402, -361, -567, -213, -364, -244, -250, -148, 72, 78, 169, 244, 326, 426, 322, 411, 367, 304, 188, 256, 151, -25, -16, -75, -151, -167, -312, -281, -290, -489, -469, -81, -215, -147, -157, -20, 123, 158, 112, 297, 234, 173, 307, 205, 154, 148, 92, -32, -27, 0, -132, -220, -272, -128, -208, -169, -323, -102, -262, -254, -93, 28, 24, 62, 184, 116, 183, 256, 168, 248, 313, 277, 220, 186, 27, -62, -203, -255, -231, -323, -380, -509, -278, -397, -347, -225, 22, 1, -66, 99, 266, 319, 401, 311, 451, 432, 385, 202, 202, 68, 88, 25, 85, -19, -174, -480, -351, -407, -333, -299, -370, -314, -228, -251, -196, -104, 137, 240, 212, 350, 316, 411, 387, 441, 415, 448, 197, 374, 145, -186, -18, -276, -261, -324, -454, -378, -574, -424, -353, -277, -443, -122, -68, 112, 104, 219, 423, 379, 424, 420, 554, 386, 396, 187, 268, 211, 95, 34, -271, -238, -393, -336, -330, -472, -381, -412, -342, -269, -282, -134, -67, 3, 62, 229, 397, 251, 374, 430, 558, 352, 460, 480, 279, 217, 180, -167, -32, 91]
5640I1l60K8L3k18L4R6k53K92l4j8K01O9J78k7K19J09o1n9J84j96n3Q2j48o3q3
5665D3j23N7k21K09l53K25j97q9O5K76j07R6M3J03K33n4J1k8oJ03pk3N1k60J96
5690B43k17R4k20m1j15np1K1mj94L18j8J5nK02Q5k04K75J35r5n6J45k0K71j46
5715C93l42M0k5o2l0j43N4o8j12m9R3p5K42k25J17K35j12J34O9L9J01k04M35k41
5739B64J82l19J7m3M0j08k8j14p4l8n8J76j18k76KK30j7K17R6o2L7K68o1K20j58
5764B75M8M5k6j4j24Q7j03p4r3j46j95qJ4l4J4j17L5J2J04p0L40q5J61O8K33O
5790C53R5j39P5M4j66m6J09K6j29J9l75o5R1k13n6k5%j33%K25j3J63J29j41Q8
5815h4L06n0MR8M8P5M2L2j79N9j12j08o8r8k54J11o0q0j2n9Q8o0j5l0L13J5O6
$$ y = [91, -269, -241, -208, -426, -392, -296, -549, -257, -291, -309, -108, -39, 139, 112, 331, 440, 379, 320, 504, 308, 255, 337, 189, 126, 43, -80, -23, -244, -35, -388, -163, -360, -449, -384, -108, -215, -119, -76, 27, 260, 206, 217, 189, 183, 286, 279, 256, 307, 47, 243, 26, 120, -100, -141, -256, -261, -332, -311, -315, -509, -191, -209, -194, -199, 3, 88, -116, 159, 294, 199, 143, 288, 268, 539, 393, 51, 91, 66, 4, -26, -169, -115, -183, -295, -344, -251, -326, -84, -309, -192, 43, -69, 65, 134, 173, 274, 70, 505, 264, 446, 127, 144, 101, 141, 33, 5, -109, -183, -221, -279, -103, -221, -497, -495, -265, -282, -65, 31, -31, 6, 274, 213, 433, 275, 323, 368, 342, 328, 204, 291, 188, 114, 21, -125, -320, -328, -314, -348, -334, -451, -416, -404, -300, -370, -30, -115, 46, 114, 347, 353, 448, 309, 384, 428, 262, 216, 325, 351, 222, 241, -134, -199, -108, -321, -377, -402, -402, -535, -535, -310, -323, -160, -31, -172, -84, 222, 172, 176, 274, 322, 397, 439, 471, 292, 351, 239, 131, 63, -35, -289, -178, -238, -318, -330, -389, -301, -361, -376, -406, -93, -78, -12]
5842a2J89l3J3K68j02m3M0J01O4j11o8l11R5p5o3ok28o7J7O1J8l4j45L09j50l
5868b76K10K5J04J17r2K77J14j25m4J9o6k2j00k8k5j75m2j01o0P4j25l7P4Rl9
5893c34L91j80R3q4J80j38J67M1J28K40l97R0Q0J4j84j87J51j81Km2O1l18R4Q7
5917b26l8J6O2j41J24J79O9k4J09k25K96K2K7j0j13R4p0P9%k93J75l33qO4j00
5942b65lM7p2J73o8J73j81K23J43o4P3p3Q4J02R9J90k76m6pn0k10kj29n7o6j0
5968b72k7Kp5q6K85n7m6NL11m1L41j81pJ70j3r0L6R9j79jn4m8p7q0lj86K4p0j28
5997d48M7K1J59j18N0K06j91K89K8L20j01L7J40j67O3k8J04j73P7k30J5j01j61
6020a62M6j24j89O2K2o0J18n0k5K94L9K6mJ0J26J54OJ33k6Q1j35r8L6j6j93m7
$$ y = [-12, 177, 144, 157, 425, 323, 280, 320, 421, 485, 374, 306, -5, 90, 15, -48, -54, -282, -349, -332, -271, -253, -287, -432, -123, -273, -276, -66, -41, 63, 180, 88, 365, 479, 354, 310, 329, 263, 241, 141, 113, 88, -87, -129, -230, -290, -216, -341, -378, -304, -295, -334, 57, -123, -30, -114, 66, -72, 95, 136, 264, 504, 107, 197, 277, 291, 107, -80, 71, -110, -108, -150, -89, -407, -313, -226, -264, -248, -186, -327, -203, -24, 45, 21, 130, -95, 201, 223, 250, 240, 127, 221, 151, 230, 230, -63, 112, -221, -229, -165, -265, -268, -221, -293, -120, -188, -15, -196, 27, 170, 106, 179, 106, 190, 292, 391, 581, 305, 259, 252, 202, -8, -10, -139, -196, -262, -272, -299, -297, -372, -458, -173, -230, -276, -271, 40, -1, 340, 159, 152, 322, 309, 219, 255, 354, 175, 174, 120, 72, -5, -85, -88, -274, -250, -320, -448, -401, -380, -221, -339, -289, -83, -274, 15, 43, 363, 262, 299, 439, 272, 335, 307, 411, 238, 315, 85, 100, -1, -162, -116, -240, -429, -367, -345, -405, -287, -337, -362, -68, -29, -3, -7, 3, 129, 283, 289, 422, 396, 477, 342, 244, 280, 264, 71, 24]
6046B4Kj20j69p3l0qmO1m15N26J2Om4J41J54N4R0J74q5l0j9n7K09j64p0j03J70
6073B32k19Pr0j88O8j61o5j9J17M8mO0L6R4J47q3k0J14J04J79j28J24p9Q3j46
6098B11r7o0N4q5k79O8N5o7N2k14J3P5n1J68J40N1K4l6nK81j45L3j41K33k00K31
6124C09j03J74l54j3j4j46j2l4p9J7k6P0j03J67J6qO5J8Q7M9K51r3J25k34l2J76
6150B73l4j94K7p0j6k7q8K8k5n0j27k9m6P3J36K9M1K9K0N8Q9PP5J51k53K41r9
6177B19J5j7j45nj91k8j50J74j87Rr1PMJ65kLJ01k8J35R9J17N7%R8%k5q5j1L6
6206B74j29j22pK2r2k72Q1j06J06p9n2K32k35J31J43n4J46J02n7J25Q3k0k3J66
6230C63o5J6j80k0lN5j32r4j51lr1q4Q8q8M7p7M7J51K8K05J46l5J71o9M1J20R
$$ y = [24, 26, -94, -263, -336, -366, -374, -378, -317, -732, -206, -194, -188, -232, -91, 63, 117, 207, 381, 296, 266, 247, 190, 399, 235, 165, 62, 232, 13, 20, -70, -258, -190, -351, -416, -435, -318, -270, -274, -214, -178, -84, 63, -20, -40, 74, 178, 357, 229, 353, 274, 357, 211, 114, 54, 108, 23, -256, -188, -133, -200, -148, -362, -349, -274, -325, -157, -17, 34, 58, 22, 17, 298, 153, 186, 45, 278, 78, 309, 206, 380, 26, 13, -1, -147, -159, -193, -272, -255, -281, -211, -314, -147, -131, -139, -74, -56, 31, 80, 331, 238, 363, 129, 97, 273, 239, 45, 72, 2, -14, -41, -129, -101, -126, -176, -303, -332, -378, -305, -169, -140, -99, -70, -50, 8, 97, 104, 179, 330, 77, 318, 219, 234, 217, 72, 67, -124, -152, -302, -128, -315, -306, -397, -390, -386, -221, -223, -220, -119, -147, -12, 87, 204, 261, 261, 359, 359, 334, 249, 238, 274, 145, 23, 16, 38, -54, -326, -245, -351, -245, -324, -376, -144, -379, -248, -105, -159, -13, 89, 32, 157, 240, 220, 197, 363, 298, 314, 134, 114, 111, 166, 34, -60, -211, -214, -305, -389, -301, -389, -342, -419, -372, -221, -193, 12, 158, 123, 294, 225, 266, 386, 395]
6257C95n7j2O1p6q2j32J9Rk09j59K8k11m9J65L5j3k8rJ93j9Q5J78R4l5K66l3j71
6284B33N7R5n4j75R3q9l3l02L13mk01j83K7j49L4J24j03J25mJ1Q9O7J66n3L74
6309D58l79O8J52k28K74j34l3Q3r2j30j23j13J29j15Or0J2Q2m0J73j80j56K99
6332g7Q9j24J93P9l7J53M9N8j51J02k11k12K87k50J55j4k99o4J91j91N7k1L0o1
6356b69L5J73J35j1k2o1K05M7O4q5k1J59m7j51q5m7k03M1Q7q4k38J09k9L3N6j73
6382c82J3J04J29l8K15j7r3L17j24K28k68K88q3q7n6N5j91k9k40J98l8j17j15
6405c31K1J4J4M6m3k3R8J10N9P9J50nn3K75j09j4N9J2j86k7M6n9q8j99L6j20n
6432b43m7k28M3K17k8R4j2L43k67N9O4K03l6J74q1OK04j61j56J19j10J7j77k50
$$ y = [395, 338, 326, 387, 311, 229, 97, 116, 125, -84, -243, -215, -426, -475, -310, -275, -288, -316, -325, -132, -151, -66, 112, 206, 171, 437, 404, 233, 290, 385, 331, 156, 249, 160, 127, -175, 138, 134, -67, -250, -223, -372, -338, -214, -317, -192, -196, -185, -96, -29, 137, 84, 458, 79, 147, 299, 71, 345, 211, 178, 261, 169, 39, -84, -197, -68, -183, -177, -267, -255, -173, -213, -40, -220, -376, -77, 12, -112, 81, 160, 123, 276, 325, 383, 232, 334, 123, -89, 198, -52, 103, 89, -210, -274, -83, -274, -217, -238, -208, -269, -234, -61, 74, 63, 41, -20, 185, 232, 296, 211, 190, 349, 302, 151, 66, 19, -184, -143, -56, -140, -378, -269, -298, -265, -209, -382, -369, -265, -136, -174, 41, 24, -69, 248, 124, 352, 84, 372, 289, 202, 146, 201, 10, -19, -259, -61, -99, -216, -331, -310, -296, -282, -236, -279, -302, -204, -94, -35, 44, 194, 189, 136, 411, 302, 288, 347, 359, 173, 146, 192, 133, 45, -154, -118, -238, -243, -290, -518, -475, -258, -286, -192, -204, 139, -128, -69, -5, 198, 162, 336, 255, 261, 465, 304, 148, 267, 157, 174, -3, -253]
6456b53M7J6K7j52R4j79N7k3L0J16L9R7P9K32j49J30N0L8o1J74j16P9k3q3j05
6481A61lj53pk33J23k42J13j83J09R1j26R6O9J32r0m5K6M22q4j10J23M0p2K01
6505C58j32Nn5j57Q3p8k9p2r9p0J07j51P6O0j62N5p4J32K52J2J3M4J22p8N4M8
6531B64J85j59q3J3j05k70L59l05m9K8k05M9qR7r2Q7r5K39j11J07P3J3J82N3m5
6556B22j40J05N4Q6j87J67j72j96r0j4m2Q9o0n3j10J14j3M4K27k17J81o7K52j82
6580bK96q5j15%r5J72N6j01m4J39j78Lk28J66j09j56n6M0K2J4O5L7K57j24N5J61
6606A90O7j25N9O4J8J30k32K09m5l05k1j5n8j09KO5j26j08j71J46R2l4J39N7l6
6631a47J91N2k94L48J18N8M0j82n8J70J07l40K20k57N0q5k00p7j9J18j10J7j41
$$ y = [-253, -206, -190, -163, -315, -221, -400, -343, -366, -336, -220, -181, -84, -5, 227, 78, 208, 258, 296, 235, 409, 293, 372, 349, 266, 161, 158, 5, -2, -235, -112, -354, -241, -424, -315, -224, -350, -254, -185, -53, -143, -188, -162, 260, 176, 66, 189, 229, 157, 358, 226, 231, 176, 19, 102, 24, -5, -77, -176, -246, -139, -290, -214, -154, -316, -261, -335, -203, 49, 61, 74, 118, 240, 162, 216, 264, 449, 290, 207, 220, 115, -155, 204, -101, -150, -122, -327, -278, -286, -189, -281, -194, -289, -50, -161, -54, 19, 32, 214, 267, 222, 82, 187, 241, 327, 140, 307, 135, -61, -151, -165, -207, -118, -178, -231, -341, -227, -240, -196, 31, -186, -5, -72, 180, -2, 294, 209, 94, 94, -1, 171, 227, 126, 82, 221, 43, 46, -182, -16, -125, -281, -337, -297, -275, -261, -196, -159, 98, -26, 29, 190, 257, 132, 191, 255, 273, 403, 171, 380, 335, 30, 9, -6, -64, -173, -171, -106, -232, -340, -511, -365, -273, -307, -168, -111, -147, 44, 96, -198, 150, 268, 326, 366, 184, 126, 296, 403, 63, 283, 26, 76, -9, -209, -286, -305, -187, -297, -280, -421]
6654d21J00l9J79k2J01l0J94J50l7M3K33j83J68r8j49J9k5Q4k58Q6k76N2K2j31
6678b38J2n6r2K04J0Kr1K8J86p9J57K45N7%J7r3N9K1j69L8J34j94p2n1p5o1j24
6705b25mn2nO7j8j14J6L04J9j7J26P5j00K79q6p8L29j49j11K2o3n4j38j30L4r8
6731a71L1j44l6J7J46n2K3L1j0M1n6N2K14n0J62o5J2k1O0k3m7J95l6l82J75j52
6757h6l3j37J74k24O6P4j46o3K45n1J61O6k58K20N7J04Q5N6K5p1%l9k34J85k47
6782g1j07pN5k6r5J31j42k8l9j29K79n0K66J54j21K4Q1J06n1M7J20L5j30j7j25
6807A60k35K5nl6j03K3M7q5j02K7pMJ35r3J92J42m7J01Q2Nk5K41k56R7p7O6l12
6834c6K46j46k1%k30K3l1k0k26K35j63J9Q2J23K08k97K49R4J22r2J73R5PM7k70
$$ y = [-421, -321, -360, -181, -203, -102, -132, 62, 212, 175, 218, 451, 268, 436, 338, 189, 208, 183, 267, 9, 95, -181, -129, -107, -238, -226, -282, -374, -170, -160, -158, -249, -221, -35, -114, 43, 288, 345, 345, 362, 269, 328, 349, 180, 218, 352, 158, 86, 35, -40, -101, -225, -229, -281, -286, -219, -237, -351, -335, -31, -12, -29, 97, 172, 72, 351, 265, 187, 516, 367, 256, 278, 215, 161, 23, -107, -73, -171, -140, -284, -320, -303, -157, -209, -186, -155, -165, -124, -180, -128, 86, 36, 198, 133, 145, 124, 184, 161, 114, 309, 273, -109, 66, -86, -119, -256, -82, -306, -240, -166, -312, -375, -130, -181, -20, 46, -212, 8, 65, 169, 254, 310, 335, 264, 264, 225, -9, 176, -71, -178, -185, -130, -156, -251, -120, -262, -290, -329, -458, -179, -229, 37, 191, 70, 94, 175, 281, 230, 277, 397, 432, 302, 285, 160, -75, -50, -55, -91, -194, -171, -124, -209, -311, -284, -291, -287, -152, -245, -53, 89, 42, 143, 225, 230, 205, 446, 190, 287, 210, 276, -36, 210, 64, 43, 43, -187, -164, -195, -215, -441, -206, -369, -350, -268, -145, 63, -234, 15, 109, 231, 139, 312, 407, 414, 461, 191]
6859A91J21k19K35k42o7J3j31l4k24o4J24o2J72j48K0J5J99R3M6k46K09J91N0
6882B42l3K56j54K6p3M8j8j55J6r5j52M0o7q3j19M3j46L8J78m8o0L61k46K75l5
6907C9MK26J2Q1o8N5RJ3n4j53j47J10j34j24K1q4k60Q7L7R5j1j8L5J10N0QP1k3
6935a3K20J27j22Q3q5K19k5j65K4j55L8j10j60J49j72j52M9j89K52rr8J67j07
6958b34RJ67J31J3PJ08mJ67j52j39J79l8r4Kp6n3j46N6k01L24k19k12J12O1N0
6983a82J05o6j9N5M4L90L1k34l6J36r0Q6J03j64L9J4j33j99R4k71R6p4Q5j78p4
7008d42J63K64k17N3J21L9l8J38J49j68K85j90k1J66n6j14P0Kj86k19K3J2P3k47
7032c40J00J31k13q5J05L9Q5Q6jJ56N6r3K21N7j1j19OP3k4j61J28j95R6k95O7
$$ y = [191, 312, 93, 328, 86, 19, 32, -99, -133, -357, -421, -297, -359, -187, -335, -315, -300, -101, -8, 38, -208, 1, 192, 242, 209, 465, 311, 337, 264, 312, 294, 139, 155, 60, -92, -52, -119, -202, -321, -278, -424, -386, -208, -256, -316, 45, -201, 74, 39, 43, 269, 281, 362, 294, 349, 358, 371, 317, 164, 17, 127, -7, -131, -110, -194, -454, -367, -330, -235, -246, -264, -229, -119, -69, -61, 10, -13, 207, 334, 212, 295, 210, 429, 404, 239, 263, 108, 146, 36, -124, 25, -147, -299, -250, -439, -187, -196, -294, -127, -234, -225, -58, 73, 86, 93, 201, 197, 364, 212, 73, 252, 214, 120, 122, 46, -7, -153, -97, -298, 26, -193, -405, -293, -232, -182, -77, -143, -162, -107, -63, 327, 358, 124, 88, 224, 134, 220, 323, 159, 198, 212, 79, -120, -26, -297, -201, -275, -190, -368, -442, -279, -15, -232, -179, -58, -19, -57, 81, 230, 62, 347, 157, 136, 302, 246, 132, 202, 204, 18, -201, -178, -166, -93, -340, -240, -109, -322, -407, -302, -263, -178, -92, -93, 63, 119, 26, 247, 304, 293, 174, 180, 253, 229, 68, 196, 1, 97, -198, -131]
7057a31m2k0j06nJ62j54J30k42K70J13j71J96J62J40l8n0K03k12K39j13j8k00
7079A13J64Pk30j38j12J47k10nM0j86M2OJ89n2L5P8k4J69K61j18j3j8J94K6j1
7104C54mk50P9N0m3o9k23J00k56J63k79j9J51k15K33MJ21o5J19P8j25K21J26M8
7128B99j6n0J09J6N6j12j7k20p1Nj43N5j53K0j21j58J74L8n1J81j16J9R9J05K21
7153A69P0%k85K35R4n0P4L5j20Kj74lM1j40j34k3jK7N1n1j96K43r8o9M21j14J34
7180A38J52j47J42q7J17j78J46n0j02K5l62K17O2k11K3L1j36j08R8J8Kl8Q9J53
7204fj47J43Q0K11k35J21J81j88O6Pq9m6j19J94k67K3J33l77K1m4k2J29J16j24
7228b39N1p5R1J42%L0M6K30j45J06p6K14k20M1M6j94j32M1j62o8O4l1j64R9Q3
$$ y = [-131, -173, -193, -299, -304, -142, -296, -166, -408, -138, -25, -196, 0, 162, 302, 264, 214, 417, 205, 444, 331, 313, 113, 277, 284, 54, -84, -196, -49, -259, -264, -224, -410, -368, -362, -173, -225, -190, -112, -136, 33, 294, 176, 163, 145, 339, 365, 354, 350, 100, 179, 229, 186, 117, -106, -6, -262, -99, -378, -397, -246, -461, -228, -224, -103, -168, -49, 29, -96, 125, 251, 299, 283, 233, 342, 358, 414, 302, 285, 65, -6, -1, -144, -89, -242, -222, -343, -501, -327, -289, -340, -159, -275, -256, -157, -52, 169, 239, 239, -46, 189, 283, 233, 307, 342, 222, 224, 50, 47, 88, -52, -186, -209, -210, -183, -132, -183, -379, -136, -234, -303, 118, 4, 138, 290, 143, 285, 198, 315, 137, 283, 233, 131, 156, -206, 11, 73, -138, -115, -84, -220, -328, -230, -212, -210, -248, -159, -6, -153, -10, 70, 281, 46, 167, 348, 160, 226, 233, 144, 98, -21, 173, -94, -71, 62, -315, -294, -338, -360, -231, -115, -239, -188, -263, -172, -30, -30, 0, 46, 276, 131, 237, 161, 375, 155, 196, 242, 48, -84, -43, -205, -273, -209, -240, -404, -305, -222]
7253b22k09J56J09J1N1Q7J73n1J61kl9N2K0j80K53j04q1L8j01j03l19L54k77L5
7277a88k55Q4O7K1j60J39K16K4K9Q0J65n4l7K41k39K36L3j47P0R4k90m5Jj5r7
7302b7p0j91Oj42J34l6J4j8P3J93k0L5J50K0j38L78Qj46J22n6J34M5k02j7o7L1
7328B13k42J20m15J3lmO2j58J38noJ90o3J78n6J98k4O3O6O1n4q3k1N9%k03N3l5
7356D2j47Pj04J11k03r6J84J8j40J84j24K23O0k1K2P0J48q1R6J45k2k20N5j92
7380A5K24k57n5J87k79L8j22O3k1j37K31l32K35J19Kp1K89m5J4P1J11r2L9Q3j95
7405A15K4L8o5r9k5r1j07J0R8K0j71l4j06J17M3K61jk01J55p4J32J41L8N1M1n2
7431B58j39J51m8l9j30j41n8m8l9J40q3n9m4J15q2J07J82j47J90J0O7J15j40J91
$$ y = [-222, -431, -275, -166, -155, -104, -17, 156, 105, 266, 264, 225, 277, 297, 117, 370, 266, 185, 223, 122, 19, -300, 54, -223, -188, -443, -359, -292, -271, -431, -292, -76, -52, -23, 57, 222, 168, 131, 372, 133, 369, 402, 255, 325, 419, 129, 84, 85, 70, -27, -97, -288, -282, -424, -290, -326, -312, -330, -257, -64, -84, -49, 101, 121, -17, 361, 369, 223, 345, 289, 423, 468, 266, 249, 182, 213, -29, 91, -324, -311, -314, -318, -256, -414, -276, -281, -287, -97, -160, 18, -38, 160, 136, 199, 265, 326, 272, 189, 168, 227, 227, 24, 77, 42, -105, -98, -202, -91, -294, -390, -206, -188, -328, -144, -268, -45, 15, -6, 16, 86, 234, 153, 249, 394, 372, 152, 207, 15, 239, -18, -73, 114, -165, -127, -249, -186, -207, -344, -113, -445, -210, -91, -89, -160, 129, 84, 98, 169, 280, 188, 227, 310, 115, 139, 177, 112, 13, -12, -103, -210, -200, -102, -82, -253, -287, -393, -276, -233, 28, 27, -174, -19, -93, 39, 180, 218, 269, 310, 258, 119, 270, 222, 183, 53, -88, -146, -194, -233, -93, -176, -235, -279, -164, -246, -139, 43, -104, 86, 96, 163, 278, 138, 329]
7455C29k14K50P6j39j24M9p3j89jL1j20j26n5J13l1q8J47k4MK1Q6J1J39K8J45
7480B45J32p2R3j28PJ07j54M0l9j12k31L3p4K01l29k6Q7o9o7P2M0Q5J18J2J61
7505A32o3l1R0L13k45J26K1j02pO8m8L4l53n8k2k5P4k64P3l6L0k66K76j15J7K14
7531a67J41L3O8J26K09j68K8lP8O7k11k1RJ41l30n3m2j4m9q1k02m3N0J75J00k0
7557a79L9l6O1L0J29P7O9J52o2J11j08oO3q0k1n6j97q4p0o0m9N6j86M4J38n4j5
7584b94J76MJ02N6Q2R2q0J12r3N9R6Q8j91r2j1j0k2m7n5j85q7q1J77O3j42K2q
7611b69K04o9j35M05R3Mo1J18j4l6p2L5m7P2j99Q8j46Qm5j70q2J37p6k2J40o9
7637b08n4K11j11K54r8M4Q0J23j41R5R8j05Pk84K27p3M6o9j76M3k18J40j13O1
$$ y = [329, 115, 365, 441, 302, 178, 227, 154, -35, -36, -5, -125, -251, -306, -193, -224, -312, -165, -189, -185, -164, -78, -67, 72, 100, 245, 377, 305, 398, 270, 277, 384, 230, 270, 231, 119, -112, -79, -153, 48, -281, -307, -220, -289, -356, -284, -244, -159, -41, -29, 132, 69, 38, 128, 441, 196, 322, 343, 241, 234, 302, 254, 288, -65, -123, -145, -170, -96, -360, -287, -323, -293, -559, -283, -398, -381, -167, -26, 7, 75, 201, 410, 242, 270, 267, 345, 412, 201, 180, 189, 330, 0, -53, -95, -109, -158, -239, -441, -484, -434, -259, -159, -179, -140, -176, -115, -85, 44, 121, 190, 342, 280, 391, 283, 277, 340, 260, 239, 183, -14, -98, -168, -228, -277, -221, -407, -363, -225, -279, -294, -118, -114, -12, 44, 126, 218, 138, 250, 157, 216, 312, 400, 209, 117, 106, 96, 74, 27, -28, -213, -300, -381, -204, -141, -283, -261, -269, -65, -134, -269, 136, 229, 233, 172, 290, 276, 240, 168, 203, 156, 228, 29, 117, -29, -21, -66, -236, -318, -181, -257, -279, -139, -208, -262, -51, -162, 92, -6, 38, 118, 241, 100, 195, 293, 188, 195, -89, 138, 65, 111, 42, -134, -91, -309, -169, -282, -221]
7661b21n5J05J36j74J54P4j7J41j3L9k7K09j76J61m8O2j77O0jk75l1Ok4p2rj59
7687c32J9p5O5K14k75K02K7Q4J98P8j06j8L26PR0j72P6o2r1o4k0j32k09O5q0j38
7713c23J91k43JN3j54K38p1J89J88j1m8J95l7J76p0J76k42L9J06r6j19q1N5q0
7737C2q9j7r0o0n4q7LK4KJ11J2k2K15N0k1L3L3K18K3m2M9p7J44j95qR2k97pj59
7766a84M4k8m5j27m6j2J75l9L9J69j24J92n1J62J40Pk3O3O0j03L1M7j66j84K12
7791B09j20m4p4j42m0O3p4rj28J17Q9k2J34j11K23qJ75j93K70k52K52L0r5k4k76
7816e0J28r3J82j77j02j45m5J33j17M7J33j92J47P4l9Q1N6N8K43k64K19j16M2
7839B03J92k29qj15Q2qj16j63P5r3q4L3k3M4n7J51k9J58j55P7J35K0j6P9mJ29
$$ y = [-221, -276, -171, -35, -209, -55, 19, 2, 143, 130, 169, 142, 351, 175, 336, 288, 350, 173, 233, 232, -43, -74, -68, -92, -164, -173, -332, -313, -388, -323, -109, -384, -182, -155, -71, 127, 205, 99, 81, 407, 414, 504, 332, 408, 346, 255, 191, 171, 39, -170, -105, -185, -323, -132, -375, -374, -321, -475, -237, -308, -119, 69, 58, 10, 205, 168, 344, 274, 450, 208, 247, 353, 257, 138, 57, 112, 32, -57, -74, -164, -224, -278, -365, -362, -338, -336, -225, -213, -235, -20, 30, 9, 42, 75, 293, 316, 274, 323, 246, 390, 195, 187, 279, -18, -25, -184, -140, -168, -213, -340, -386, -398, -223, -262, -223, -54, -178, 14, -37, 125, 265, 272, 249, 312, 372, 269, 300, 347, 181, -3, 209, 89, 45, -29, -171, -211, -148, -222, -231, -359, -242, -153, -175, -41, -152, 71, 63, 238, 45, 315, 63, 315, 345, 250, 226, -50, 78, -15, 167, -10, -112, -257, -302, -169, -286, -239, -106, -298, -151, -77, -116, -35, 21, 79, 322, 58, 277, 161, 203, 395, 166, 158, 43, 125, 117, 1, -162, -87, -180, -264, -231, -254, -210, -267, -116, -145, 13, -142, -65, 70, 90, 74, 153, 149, 278]
7865B78q3R7k8j42N8j08N1j29J34k38j17M8j88L4OJ78o6J31R8n3N2N3N1J52q8
7890A81P7Op0J67o5M2j00o8k49J50j49j19J56j25j09m6j7J42j63N9J57J56K7K6
7914F6J22l9N5J36p8l5J4K02j09m8k28K3r6j1r7K9r2j10j61K6K03j65J48p6J94
7939a27j23J81O2K41n2J4O5p9J77j17J15l2k6n4p9k52N4j21N9j12j87R2q1j1j02
7964d95J87J81q2R6M7R6K41n6J2N6J71j19L1l2N2r0k0j40m3j30j30p1qn1J03o8
7990b62n7L8L3J1J72J7K76j42l2ML25j36L8P4n3j07qn1K8k73K4j13J04n9k56J19
8016b86L5m5J97n7J06l0N7L4J85m7J26l8Q1OP3l22O3K35k21m8j05k54K30q5k55
8041c65J33j02O0mP1N4l0K2J63m7Q5J66j52K9K02O9j07j5ok73J72j43o7j00J44
$$ y = [278, 195, 292, 264, 122, 180, 72, 123, -6, 128, -110, -227, -179, -367, -333, -327, -149, -215, -84, 14, -39, 13, 66, 117, 269, 181, 258, 264, 194, 361, 296, 338, 238, 170, -79, 71, -78, -197, -41, -166, -275, -321, -338, -196, -359, -300, -143, 13, 40, 66, 188, 149, 204, 340, 262, 227, 241, 443, 334, 286, 58, 81, -15, -26, -123, -94, -186, -296, -457, -431, -228, -393, -245, -321, -127, -250, -69, -7, 234, 182, 196, 261, 182, 359, 242, 357, 325, 299, 245, 166, -86, -32, -153, -94, -206, -393, -301, -382, -393, -495, -308, -127, -209, -113, -66, 30, 271, 215, 227, 283, 454, 335, 366, 334, 386, 296, 276, 136, 93, -37, -167, -238, -246, -297, -194, -262, -319, -281, -248, -237, -65, -48, 228, 86, 54, 58, 383, 247, 285, 359, 306, 199, 191, 140, 168, -105, -81, -194, -90, -149, -405, -286, -251, -296, -99, -156, -50, -80, -23, 11, 196, 149, 275, 237, 318, 324, 397, 75, 138, 373, 152, 104, -1, -255, -25, -110, -365, -232, -334, -274, -278, -207, -153, -183, -161, 2, -45, 40, 206, 54, 83, 285, 354, 247, 232, 226, -47, 125, -18, -85, -185, -41]
8066d1j73j05R4k09K35p8j1J27J48k8J5J38J68k59K28RK1q9l2J87l73J10J1j18
8090b5j76P6p0k33K16K4q3j79K18k5Q6L9l2J51l8J66J24K0L5J06j1l22O6J28l5
8115B26j16j3j27j85J46k77J55j24O2j45O4J13O9j44K76J6J64o7N1J28OLL8Q7
8139D06j71K4j76K12k82m6p3j3j33Q5l9j71N4l9p5J3K67PK4Q3L0J59J53m8O3o6
8165B48P6O5o8q3J16k20l7o3q9j81K8j6j05p1j1J42m4N9j03L84m6R0j8N4P4J25
$$ y = [-41, -214, -319, -225, -434, -199, -277, -288, -161, -13, -41, -26, 112, 280, 21, 249, 258, 279, 190, 158, 345, -28, 82, 93, -25, -201, -125, -195, -428, -212, -188, -271, -450, -232, -257, -171, -132, -164, -13, -51, 115, 239, 259, 294, 400, 389, 67, 133, 261, 226, 110, 97, -30, -215, -69, -346, -191, -315, -253, -398, -334, -221, -152, -296, -20, -4, 160, 93, 144, 272, 278, 281, 319, 406, 235, 259, 83, 295, 13, -33, -106, -119, -252, -167, -206, -377, -323, -362, -437, -424, -157, -150, -126, -43, -13, 146, 299, 251, 314, 248, 324, 389, 321, 238, 354, 134, 97, 34, -55, -236, -208, -224, -329, -400, -411, -269, -313, -254, -357, 27, -19, 71, 53, 107, 181, 306]
8191C06
$$ Imaginary data points
##PAGE= N=2
##DATA TABLE= (X++(I..I)), XYDATA
0@%%%%%%%%%%%%%%%qJ6j6J6j6K1k9L2l4M2m8N6o8P6q8J04j20J36j52J71j92K16
37A15k45K73l03L39l78M20m65N14n68O28o93P62q38R23j017J120j236J366j511
56g94J677j866K083k339K646l021L487m090M905o071P892j1153J8775o8741l3371
71h9981J50806Q0900M7189M8222K5141k7524L764j5562o6601o0693l6172p4752
83a5263n8385p747j7232m0063j914Q566K02K5555M1797J0341O871K9426K1294
96C448M399K1411J8021o269L051J8780N84n129O997n291k1096k088L792k3345
110A7265k0570j013j6836j8971L516r688k0567Q018J3788n47J3981K1485j213
123a1352j81J9286J1170K436J1406p81j4519J031O078q108o528k504r750n104
$$ y = [0, 0, 0, 0, 0, 0, 0, 0, 0, 0, 0, 0, 0, 0, 0, 0, -8, 8, -8, 8, -8, 13, -16, 16, -18, 24, -24, 32, -36, 40, -48, 56, -64, 72, -80, 91, -101, 115, -130, 143, -160, 179, -199, 221, -244, 270, -298, 330, -363, 399, -439, 484, -533, 587, -649, 717, -794, 883, -983, 1100, -1239, 1407, -1614, 1873, -2217, 2688, -3383, 4509, -6644, 12131, -56610, -89981, 60825, 141725, 188914, 237136, 262277, 234753, 238517, 222955, 156354, 95661, 59489, -15263, -73648, -81395, -98627, -138690, -140604, -132038, -131836, -106281, -64484, -54143, -47272, -17846, 3448, 7847, 29258, 47279, 41010, 44061, 62841, 63425, 58296, 65293, 60002, 38906, 36818, 40610, 17265, -3305, -4318, -21154, -40125, -36609, -46297, -66864, -58846, -45058, -45605, -31624, -10139, -11352, -11533, 7753, 18923, 21359, 32765, 31984, 17465, 18496, 24574, 16466, 9938, 7434, -2316, -7420]
137g420Q008L106l883K390J169n197K826O305j586l797m677p773m757k004k385
152a9675k982j451J389K416N984J1257R228O755O970L981L062L988L7m064o140
167B0755q065r312p597o039p438n967j818j909J868O642M098L087O833P643O311
182I092O157M046n00j144K815q20m599k656m712o698j138j268n935m757l065k759
198a7941K87L234M45k586J395N687N307O478N844N77J277N734M462J861k94k480
214A9287n123k690R16l560p278o187o600m123R92j164m458m161j252K755M705
229a7941N335L248P21M294Q081Q017P017K745p9J608K815K185j129n911o958n369
245H679n002l840n915q445p109k863J196M81j030n50l05M202Q492O215K806K719
$$ y = [-7420, 588, 3694, -189, 2201, 3370, -1827, 999, 7304, 5718, 1921, -2756, -10529, -15286, -17290, -19675, -22657, -24108, -22719, -20303, -14319, -3062, 6166, 12921, 19891, 23872, 26934, 30922, 30959, 26895, 20755, 12690, 3378, -4219, -10258, -17696, -23663, -25481, -27390, -25522, -18880, -14782, -11695, -4862, 2781, 9092, 15249, 19295, 18795, 17651, 20466, 19646, 15047, 12391, 7679, 981, -157, -1425, -7360, -12117, -15182, -17941, -17654, -14420, -13975, -16561, -15166, -9479, -4172, 2306, 8150, 8727, 10004, 15738, 20200, 22061, 21767, 19287, 14164, 11474, 12390, 8830, 1552, -4635, -11235, -15358, -14366, -15530, -19988, -24149, -25401, -22646, -17941, -12606, -9358, -8637, -4343, 3738, 11755, 18772, 21517, 21438, 23046, 25861, 28046, 26917, 21006, 14048, 8679, 3677, -163, -6078, -14523, -21632, -24495, -23299, -22818, -23848, -24398, -24703, -20501, -12009, -5794, -2988, -269]
261b69L570O214Q352O080P16k450PJ905Q47j3n660j0634o094k295l247m335o273
278a3579p982n413M22K942o94r66J425K107O747R867N974K914M497N808N723N401
294B5193K347l364l793P58r64m037l930p139p943k864o65l704n664m891l332k50
310b4242M214L179j413N75L658M756Q100P001J624J91M067M598L461K586n5m197
326A8103k985J392r93m321m979p419o480k216j426m514m922k106n49K443N492
341a5480L409N43M120O210N597O682M059l84o58K397K539o25k466l691n959k250
357D043O3m009n490l953l911j474K203J391j629j032K678K295L645N371J395p79
373H07M071M476J721J338L22k423j803J668p52m849k853l376m785k55P31l533
$$ y = [-269, 3301, 9515, 17867, 23947, 24663, 22213, 22220, 24125, 24972, 24959, 19299, 8665, 2571, 276, -2971, -7306, -13579, -21561, -26974, -26552, -23610, -24304, -25270, -23845, -21738, -14991, -5124, 850, 3764, 8261, 14069, 19792, 25193, 27540, 24176, 20383, 21141, 20177, 16140, 12210, 5071, -2872, -5736, -6401, -10105, -15769, -20660, -23992, -24242, -20028, -16849, -18262, -17687, -14029, -9273, -1173, 5828, 7452, 7643, 11710, 16308, 19769, 22355, 22300, 18103, 15118, 16510, 15517, 11196, 6217, -1202, -7682, -9898, -11324, -15838, -20760, -22866, -23415, -20972, -15480, -12071, -11528, -7408, -1198, 4399, 11081, 15140, 14756, 14098, 16495, 19034, 18409, 15943, 12252, 6293, 4043, 4106, 97, -5393, -9346, -13257, -14731, -12528, -11137, -12766, -13798, -11120, -8825, -5180, 191, 1586, 807, 4878, 9354, 11075, 12413, 12735, 10312, 8509, 10177, 9425, 4576, 1723, -1653, -6438, -6693, -5962, -9495]
389i495k610Q91O91J816M000J833p62K005N018J847J762L114r11j244K071M6k424
406G648j718k348l586j985Qk758l900q46n23j005J977J823n58J144K507K223J653
423b44K594J907p3J834L242N86J123J342j011j045N73j156k526k879l234m667
439c634l763k095l539l058r04j184j48K916L048L488M805N044L973M721L876K369
455A5915K106J619j488j556j023m408m085j860m423m562k271m218m009n33n33
470a5329k102J68J318r06J199N846L637K541N651L327J295N521N272R82Q35L65
486A9620l146k999M74k676o822m310m125n825j905J120k987l802K5N28m1L802
502a3069M732J17J706O472K629K001O413K329j412L243L669k121j407J328m114
$$ y = [-9495, -12105, -11214, -10523, -8707, -4707, -2874, -3636, -1631, 3387, 5234, 6996, 10110, 9199, 7955, 10026, 10072, 7648, 5930, 3582, -4, -1989, -1981, -4739, -8639, -9485, -10008, -11013, -9036, -7213, -7771, -6627, -4120, -1897, -244, 2350, 4257, 4184, 6018, 9260, 9846, 10969, 12311, 11300, 10255, 10828, 9672, 7146, 4267, 1033, -3634, -7397, -9492, -13031, -16089, -16993, -18177, -18325, -15409, -12361, -8873, -4068, 976, 4949, 9670, 13546, 15915, 18021, 19640, 18152, 16596, 15573, 11165, 7080, 5220, 797, -3765, -6036, -10254, -14263, -14796, -15329, -17431, -17263, -15945, -16851, -15652, -9806, -6169, -3628, 2023, 5350, 6645, 12166, 17438, 18420, 19255, 19620, 16474, 13475, 13949, 11273, 4451, 141, -3984, -9809, -11714, -10594, -13581, -17383, -17358, -16830, -16871, -13069, -8337, -8220, -6514, -42, 2587, 4588, 11001, 13330, 11918, 15161, 18830, 16709, 15302, 16630, 12516]
517A2516n171N40l608q289j783j036o114q69J374m967k363M794K432J021N642
532e881K921j642M540P137J023J896K775k283r95M215J280k979k368k563m714
547B362j126J793k847m792k485l248j973J734M79k480m43J373J990L557M120K146
563A60Q41L385M158L171L283J072j605j202j094k284k813m107n032l766j665j898
579i396k297m84m84n44L757L235K11K287K892P22L326L626l43q81K043J494m80
596H684K006k93n834j684J695k753k256N86m754n481J818J487k650N88J467l470
612a0844J524P490K006j16M669J390j394N117N067l196j986J390m362m032K397
627E120k577q155q23j88o017L60L752l112k524N187J894j051O213M879k141L135
$$ y = [12516, 7345, 7885, 4277, -4012, -5795, -6831, -12945, -13814, -12440, -17407, -19770, -14976, -12544, -11523, -5881, -2960, -4602, -62, 7075, 8098, 9994, 12769, 10486, 9491, 13706, 14986, 12007, 9639, 7076, 2362, 1236, 3029, 182, -4610, -7095, -10343, -12316, -10582, -10103, -12583, -13026, -11653, -9663, -6106, -1986, 160, 1001, 4386, 8544, 11715, 14998, 16070, 14465, 13263, 12169, 9885, 7072, 2965, -2067, -5833, -7498, -9396, -11693, -12177, -12661, -13205, -9448, -6213, -6002, -3715, -823, -101, 3225, 6851, 6508, 5627, 7670, 9164, 8684, 10690, 10397, 4563, 2879, 4574, 1821, -435, 151, -4603, -10084, -8266, -6779, -9429, -8841, -7374, -10844, -9320, -1830, 176, 60, 4729, 6119, 4725, 9842, 14909, 11713, 9727, 11117, 6755, 2723, 5120, 2543, -5612, -6435, -6623, -12640, -12280, -8528, -11640, -14164, -8977, -7083, -8134, -1921, 2958, 817, 3952]
643C952O166j171J60N340j334m069K555k80o632j637R15n622l787J473l940n500
659a3411K043K42k494K348K783k132J283O557K719Q27N125K273k231L874M702
674A4508j639r57P87l619l000J407j241n202k553j568m643j449J540l076l087
689a3792J427J08o69L176K934m23K450N015J994J986N270J454L83L198J148j806
705A3853m38p31l705k822j909m225m560k410k535l223p29l30j742P53K309J283
721a1161K796L514K655K777L483L271J945K484J672J97M5O5j572j917j857k858
737E539l422k886l063k870k187j490j775j248K83P07J049K840K196J995L040K712
753A420K866K432K511Q62N30P05J39j241r65j947l011j916j994k233k417j818
$$ y = [3952, 10118, 8947, 9107, 14447, 13113, 9044, 11599, 11319, 4687, 3050, 3965, -1657, -5444, -3971, -7911, -13411, -11368, -11126, -13620, -11272, -8489, -10621, -9338, -2781, -62, 765, 5890, 8163, 5932, 9806, 14508, 12869, 11912, 12699, 9080, 6080, 7487, 6246, 1044, -1509, -3077, -7720, -9169, -7629, -10705, -13792, -12365, -12257, -12926, -9750, -6816, -7239, -4789, 226, 2220, 4206, 9476, 10930, 11313, 14511, 15659, 13853, 13415, 12684, 8979, 6157, 4248, 23, -4537, -6947, -9482, -12705, -13434, -13764, -15506, -14753, -12444, -11161, -8365, -4851, -2196, 581, 4064, 7335, 9280, 11764, 13436, 13633, 13678, 13743, 12171, 10254, 8397, 5539, 2117, -769, -3832, -6702, -8889, -10379, -12154, -13402, -13119, -12412, -11363, -8523, -6327, -4332, -1292, 1420, 4286, 6718, 9229, 10091, 10621, 11326, 11465, 10224, 9259, 7312, 4301, 2385, 391, -1842, -4259, -6077]
769f077j938j159k50M63o44M63J391J300K202K634J439J296K158K334J839J130
785H581O98k47j014or53k040k165k546k293j249r63j476j360j035L30O61J185
802e892J347N17Q66K144J929K047J376O57N90M87Q18L13j034j331j509j740n16
819A069r56k187j880j616o62k57K25k8o16P82J956J492J964K155J022J153K127
836E743J344Q14l12n82r62p89n20j956k490j723j605j322o61j054j350q79L94
853g910R32J000J197J100M67K280K968J983J663J070M73O05P89K89r38j678j652
870D638j936j283j112k263k530j499j767r60k40j16l09K79J581J992J544K403
886a578K233J528K511K589J130J008P50M5r7k6j217k358k488j633k912k231j696
$$ y = [-6077, -8015, -9174, -9424, -8961, -9605, -9142, -7751, -6451, -4249, -1615, -176, 1120, 3278, 5612, 7451, 8581, 9279, 9032, 8018, 8012, 7059, 5019, 2854, 308, -1985, -3234, -4197, -5673, -7033, -8068, -7738, -7077, -5892, -4545, -4028, -3162, -1018, 911, 2958, 4334, 4991, 5581, 6068, 6886, 7199, 6165, 4834, 3325, 1585, 1069, 113, -2074, -3954, -5570, -6232, -6489, -6264, -6292, -6908, -6126, -4170, -2678, -714, 1441, 2463, 3616, 5743, 7087, 7901, 7589, 7007, 6045, 5256, 4736, 2780, 290, -1433, -3038, -4360, -5021, -6075, -7425, -8304, -7910, -6978, -5978, -4781, -3681, -3214, -934, 2034, 4017, 5680, 6750, 7223, 7828, 8617, 8906, 7968, 6290, 4638, 2702, 1419, 307, -1956, -4486, -5985, -7752, -8712, -8952, -9068, -9377, -9098, -7517, -5525, -3981, -1578, 655, 2183, 4694, 7283, 8413, 9421, 10171, 10216, 10119, 10093, 8876, 6518, 4030, 2397, -515, -2746, -4442]
903d442l078k664p14m29k59P64J084O97J619L601K990J896L519J959Q70K660J981
920A2054k52m7k80j970k366j114k138l700k099j962l523j626j6j578q81J052O11
937i835K71K503K887R67K238L517J420J538L349R04n09J296K55j764p07p82l191
954D357k886q07k116l619r47j375k584K49J139n10K21K390J166J136L561K219
970A594n2K197K751%P82J750j399j535P35m13k352j442j240k966j550L88j836
987d588k318N3n18q19K022J579n10J120K126J247J911K603O78k79J539Q89k24
1004F511M90n05k327j122m00j690j779r33j768j799l16J79j097M15J165j83J499
1021c660K154N13J204K294J069O73J358L67j013O03M49j669j024p40k608j245
$$ y = [-4442, -7520, -10184, -10898, -11327, -11586, -10822, -9738, -9041, -7422, -3821, -831, 1065, 4584, 6543, 7413, 10073, 12054, 11802, 11755, 11475, 9505, 7139, 6025, 3887, 187, -1912, -3874, -7397, -9023, -9039, -10617, -11498, -10446, -9835, -9564, -7061, -4174, -3207, -969, 2548, 3968, 5506, 8855, 9759, 9250, 10546, 10801, 9037, 8330, 7548, 4357, 1471, 664, -1452, -5071, -6018, -7393, -9977, -9728, -8589, -9099, -8878, -6488, -5322, -4186, -625, 1594, 1542, 3739, 6490, 6490, 7272, 9022, 7623, 6088, 6823, 6410, 4058, 2616, 1376, -1590, -3140, -2752, -4588, -6906, -6853, -7371, -8190, -6168, -4589, -5099, -3979, -1853, -606, 1305, 3908, 4586, 4307, 5846, 6735, 6511, 7001, 6496, 4169, 3047, 2647, 957, -822, -1755, -3523, -5322, -5638, -5459, -6556, -6141, -4976, -5159, -3660, -1506, -993, 211, 2505, 3574, 4247, 5605, 5972, 4959, 5562, 6011, 4342, 3318, 2578, -30, -1275]
1037a275M58j685k308j52j054j267J019J811r61J64K322P41J369L757P51q22K342
1054E210J591o40J012P91k435j803M48j258l078o10j568l467l26R66k561j040
1070h768J749K71K8L306J913r22K126M093L95J000K654j082j412K664R20k673
1086F262n50o42l904j003J798k918m282J63j724k585K378Q23l141K81K887P08
1102e449J978M191M20j054L627L298J55J695J210k816m64K049j334k637j379k668
1118H22l137k80k13l060k194j44j002l2K246J49p17J392K818J897K117K351O59
1135C672P89L173J887r7L28q61j757j58k64k323l226k561k106j555m09j218k580
1152i266j015N33P22K095J715o0J188K864K465K616K302J83k12J482J338j84j52
$$ y = [-1275, -817, -2502, -4810, -4962, -6016, -7283, -6264, -4453, -5414, -5250, -2928, -2187, -818, 2939, 3690, 2868, 5210, 6801, 6161, 7173, 7964, 5529, 3726, 4174, 2916, -162, -772, -2340, -5807, -6133, -5167, -7728, -8768, -7019, -6748, -6720, -3414, -1501, -2423, -297, 3796, 4191, 5191, 7845, 6763, 5351, 8015, 8935, 6262, 5712, 5070, 1166, 163, 1961, -957, -5239, -5076, -6800, -9385, -7007, -6184, -9325, -9044, -6157, -5449, -3471, 720, 1140, 86, 3713, 7011, 7166, 8861, 10071, 7255, 6791, 8840, 7506, 4869, 3490, 822, -2315, -2595, -2808, -5868, -8062, -8206, -9208, -9240, -6994, -6845, -7562, -6170, -3352, -1455, 662, 3013, 3672, 4461, 7634, 9521, 9424, 9752, 8891, 7134, 6976, 6712, 4389, 1163, -1398, -3504, -5059, -5468, -6686, -9266, -10281, -9748, -9026, -6931, -5216, -5276, -4088, -1224, 1241, 3857, 6159, 6342, 6130, 7612, 8950, 8766, 8614]
1169H614j359l092q64j76k156j968j678k413j666O73l51j522L88J073j10J646
1185d961K863O7R09L094J242R48K074N51q82P37R45j272j432o46k357k023J99
1202E6j596k691o57l43j233P36J071o26n3J908J482N02J921J312m53J255K140
1219D731j31k17P50m20p56J38j50k183j254J3j825j231J20j583j998Q71N75l26
1237d876L10J298Q0J225K909Q79L62J664Q26n1J460L82j851q68o22r42j467o35
1255H3j622k523l43K74r74l1Jm65N98K027J255P32J052Q26J042J804J876k04n8
1274E350J73k00j57o8j372j969j637q44r51j213j217j527j297L46O91J09O21O12
1292d550P52K050K212J433R14Q19J427J335J185M31j220q87o90q18j021j233k844
$$ y = [8614, 7255, 4163, 3299, 3123, 967, -1001, -2679, -5092, -6758, -6085, -6436, -7958, -7570, -6497, -6607, -4961, -2098, -2031, -1122, 1972, 3214, 4162, 6236, 6787, 5905, 6642, 7587, 6315, 4883, 4237, 1880, -143, 56, -1540, -4231, -4888, -5231, -6464, -5728, -4657, -5283, -5336, -3428, -1946, -1444, 477, 1789, 1336, 2591, 4731, 4600, 4383, 5133, 4713, 3957, 4095, 3945, 1762, 508, 521, -1304, -2535, -2415, -3998, -5996, -5125, -4550, -4876, -4566, -3268, -3188, -1963, 946, 1825, 2187, 3851, 4677, 4626, 6086, 6468, 4617, 3749, 3127, 2185, 718, 83, -1539, -4062, -4405, -4131, -5105, -5136, -5135, -5600, -5002, -2975, -1720, -988, 64, 890, 1932, 3736, 5612, 5408, 5350, 5523, 5323, 5166, 5098, 3726, 1757, 120, -724, -1675, -2888, -4105, -5632, -6929, -6583, -5892, -5783, -5162, -4550, -3798, -1748, 464, 1897, 2811, 3630, 5057, 6392, 7577, 8008, 6788, 5901, 5211, 4393, 3372, 2139, -705]
1309g05k336j146o87p46j021j022p03O39J779J409P75J021J072J959K465J869
1325D622R37L74N89Q30K39o0q52j848j558j024j303j464k073j838j319o61j93
1342f602m06n30K77N99J446K038J259J180J420J625J920J757P38L71l81J49J01
1359F961p24p64k074j692j251j045j370j373j824j156n05M0L67m1K91Q20J299
1376d041J913J995Q96J384J224J367J062O64j3m16o36k36p86j251j331j713j250
1393a168q08j171r43q73j018j26M58N84L08O66J129J058J314J569J370R45R17
1410D211P60N37M71k58o64p53q48j016j142j469j320j568o53o94p35m7J37J30
1428d921P48J016J063J084J050J220J187P95P93L53J29p3l69k94p14r93r81j253
$$ y = [-705, -3041, -4187, -4874, -5620, -6641, -7663, -8366, -7727, -5948, -4539, -3764, -2743, -1671, 288, 2753, 4622, 5559, 5933, 6522, 7352, 7591, 7531, 6679, 4831, 3273, 2249, 946, -518, -2591, -4429, -5748, -6409, -6602, -7008, -7538, -7261, -6662, -5216, -3178, -1919, -739, 681, 2306, 4226, 5983, 6721, 7092, 6711, 6860, 6961, 6237, 5473, 3399, 1707, 456, -589, -1959, -3332, -5156, -6312, -6817, -6777, -6410, -6451, -6160, -5340, -4041, -2128, -133, 763, 2147, 3371, 4738, 5800, 6464, 6451, 6035, 5399, 5163, 4377, 3126, 1795, 82, -1168, -1976, -3147, -4090, -4963, -5981, -6107, -5649, -5065, -4757, -4091, -2962, -1904, -590, 979, 2349, 3294, 4211, 4971, 5508, 5979, 5721, 5057, 4304, 3456, 2440, 1298, -171, -1491, -3059, -3712, -4406, -5141, -5188, -5051, -4921, -4173, -3157, -2094, -1010, 40, 1260, 2447, 3242, 4035, 4388, 4517, 4444, 4075, 3781, 3067, 2074, 1093, -160]
1446a60j086p13j025n11k94l72k63L66M08O48Q10J122R98Q13J523Q15M46N08M99
1465D532N8l58k76n28j289r22q85j499q20o50j318p10K21l56n2Q99R27K4J105
1484a897K019O88P86J772M51l16J301M47r48L7M6j569q74j92j348j771k75j003
1502b646k099K11L62j533R5J038l53M63K174J275L99J976J827K00J179J933l08
1519F193l94R07q46j693l57r56k361j282o02k105j606M00q27j450Q64O83o59J334
1537d757K000L77J086K501J178k09J853J734n50J181R54j498q64L29j471j723
1553B121k90j538k961j131j43j875o22M77j170m82J759J151P27K176J416L43K086
1570B044K382R13O33J129o99p57P27k42j823j001j725k039q54o39j399j445n02
$$ y = [-160, -1246, -1959, -2984, -3495, -3789, -4161, -4424, -4058, -3650, -3002, -2192, -1070, -72, 741, 2264, 3079, 3525, 4033, 4532, 4590, 4232, 3956, 3428, 2139, 1217, 332, -1167, -1987, -2637, -3955, -4665, -4444, -4800, -4852, -3953, -3026, -3002, -1897, 122, 810, 1596, 3368, 3819, 3503, 4804, 5251, 4303, 4340, 4386, 2817, 1943, 1751, 403, -1368, -1643, -2646, -4745, -4534, -4172, -5705, -5610, -4572, -4925, -4462, -2288, -1013, -614, 1362, 3189, 3389, 4568, 6501, 6193, 5799, 6706, 5860, 4167, 3810, 2854, 493, -789, -1391, -3496, -5102, -4702, -5529, -6979, -6115, -5432, -6091, -4757, -2757, -2380, -1294, 1207, 2385, 2176, 4029, 5763, 5213, 6394, 7348, 5850, 4986, 5315, 3844, 2121, 1831, 293, -2668, -3799, -3942, -5817, -6439, -5962, -7132, -7614, -5855, -4704, -3977, -1801, -385, -42, 2044, 4426, 5339, 5972, 7101, 6402, 5645, 6372, 6130, 4307, 3306, 1581, -458, -1312, -1951, -3350, -4795, -5297]
1587e297q23j5R04N35j64J019J403Q16J360J650N43O88J407P30J66L82K1j111
1605D214Q0o2j535j326p54j702j192N2r60j626l73J28j81Q95J596m71L75K126
1623g16R20O21K010M96q55J152J184m28l66N58j886j402O71p16j901l46q27k115
1641c946J51J008r59n76R43K03k64K261J459q68J309J588k99Q56J465n78q43N90
1659C500j83j473k34m16j883q65O70j454j163N13l84r87J186J089o02N56J545
1676e85L98N99J997L79m68R73R94p27L87J22j684j237Km67j787l41q80j675j97
1695d197Q46o75QR62j35N02J610J614L14R49Q36K08N93R42J72p78J60o70r97k31
1715B033p75j451j064n15j146o35k17n18m72O09K34J88R12Q76O49J209R62J012
$$ y = [-5297, -6120, -6135, -5231, -4696, -4860, -3841, -2438, -1622, -262, 1388, 1931, 2619, 4026, 4756, 4922, 5304, 5325, 4214, 4294, 4232, 2697, 1371, 617, -1085, -2277, -2225, -3185, -4811, -5184, -5056, -5237, -4342, -2746, -3217, -2842, -716, 204, 825, 2835, 3331, 2476, 3628, 4812, 4384, 4018, 4576, 2690, 1288, 1959, 1243, -658, -1004, -1831, -3946, -3795, -2787, -3746, -4322, -3379, -3176, -3440, -1179, 280, -588, 721, 2309, 2010, 2866, 4331, 3753, 2910, 3500, 3317, 1844, 1610, 1194, -689, -1554, -884, -2338, -3501, -2988, -3372, -4359, -3173, -2084, -2686, -2130, -585, -187, 412, 2409, 2788, 2320, 3293, 4287, 3560, 3947, 4069, 2385, 1148, 1150, 683, -1104, -1445, -2325, -4000, -4197, -3351, -4026, -4018, -3056, -3191, -2689, -1079, 535, 849, 1798, 2634, 2842, 3435, 4377, 4549, 3771, 3931, 3261, 2264, 2033, 1258, -193, -1257, -1772, -2918, -3553, -3770, -4288, -4760, -4151, -3917, -3729, -2817, -1941, -1292, -83, 879, 1891]
1733A891P11R69L16O21M18J78n56o13o10j123o73p32j718j285r62j050m17j65
1751d800o16l54M88P95O32J367J347P90J678J263R98J069Q27L29j91J12m71j058
1769D205j035j011j568j325q43j499j019o27m74l73J83L41L80P46J263R06J172
1786e78J265R75O73J077R33J23K62J53l57k75m28q80j197p89j001j108r85q01
1804b938r47o54k15j96L35L76O66O59J126J241Q89Q93J076P84O75N08L04k63p2
1823D247o53n44o92q41q95j453p03o69n81o38l11m45K90M35L47M83P39N53J113
1842b18Q61J065N84O06O76K22R8k1n36n47p89j022o51p37j005p36q77j80k04k7
1862c438J73K70N64P67P39P24R80O74O17N01M29K53j88j28k69n94m99n91j146
$$ y = [1891, 2602, 3571, 3887, 4508, 4926, 5104, 4548, 3935, 3325, 2202, 1529, 797, -921, -2206, -3168, -4218, -4635, -4800, -5416, -5770, -5282, -4487, -3855, -2488, -1141, -351, 1327, 2590, 3588, 4657, 5484, 5813, 5622, 5734, 5263, 4205, 3170, 2159, 591, -734, -1577, -3076, -4095, -4722, -5196, -5569, -5386, -5045, -4665, -3919, -2656, -1750, -578, 687, 1662, 2335, 3412, 4345, 4468, 4730, 4883, 4526, 4251, 3823, 2943, 1746, 957, -44, -1152, -2137, -2938, -3885, -4539, -4754, -4950, -4615, -4239, -3573, -2914, -1788, -547, 342, 1235, 2311, 3095, 3770, 4278, 4582, 4319, 4247, 3594, 3050, 2358, 1517, 622, -831, -1534, -2203, -2784, -3422, -3733, -4178, -3888, -3453, -3106, -2623, -1884, -1331, -218, 643, 1708, 2292, 2898, 3574, 3796, 3894, 3873, 3337, 2790, 2001, 979, 328, -409, -1414, -2150, -3027, -3207, -3411, -3438, -3265, -2995, -2431, -1664, -925, -201, 779, 1453, 2070, 2571, 3000, 3253, 3065, 2937, 2668, 2074, 1575, 984, -162]
1881a62l77q27l93n29l21l41m8K64L72L06M70P18M42R53P70N60M12M33K84J07
1901C093p2k59l04o32n48p02q60n76p01p65l33l29l80J74J44K05M74N94O04O27
1921e46J033R39N43O51O06J13K93N2j94l59m15o51r41p97o76j393q35l07q67k78
1941d029j27m6M3P90P46O30J075Q90R52J010J320L55M33P32n3k53j36n81j102
1960B649j162o32j104j119o54j207j026k92M7k66N98J96J87R51J336J117Q11J149
1978A579P94N20J030R26k83k26j29l89n38m84j032j435p38q29p85p37m21j090
1996d267n13N77L98L6M40O10N78J290J376R30N27P72N98M75P01J18q46j86m19
2015C195p37m11j030j520j208o11n55m84k61p31l73O15J035N13Q41M82N75J116
$$ y = [-162, -539, -1366, -1759, -2288, -2609, -2950, -2998, -2734, -2362, -2056, -1586, -868, -426, 527, 1297, 1857, 2269, 2702, 2986, 3093, 3021, 2762, 2458, 1826, 1278, 576, -284, -860, -1561, -2326, -2659, -2988, -3368, -3194, -3050, -2845, -2371, -1777, -1173, -546, 487, 1426, 1969, 2620, 3226, 3339, 3632, 3684, 3490, 3131, 2716, 2065, 1124, 327, -349, -1742, -2577, -2884, -3751, -4029, -4156, -4202, -4159, -3369, -2623, -1993, -918, -28, 924, 1934, 3254, 3609, 4042, 4774, 4721, 4468, 4332, 3751, 2649, 1487, 855, -249, -1368, -2022, -3229, -4255, -4547, -4500, -4766, -4168, -3972, -3785, -2834, -1498, -381, 430, 1579, 2373, 2893, 3923, 4849, 4566, 4340, 4211, 3822, 3284, 2800, 1768, 333, -405, -1234, -2019, -2756, -3177, -4267, -4780, -4203, -3805, -3769, -3329, -2719, -2141, -851, 525, 1455, 1982, 2754, 3352, 3827, 4528, 4646, 3800, 3614, 3195, 2458, 2047, 1017, -503, -1711, -2322, -2877, -3361, -3622, -4353, -4726, -4111, -3076, -2563, -1722, -1240, -665, 451]
2033D51J480Q36L21J37k80L49N35m1r31p83q29p41k36k10j426j029l93l80O9N61
2053b540k25n52N27R94O64P63J016k2L57J223O81j27K11j27o97p1M04j190j247
2072D2j81r26p09N88l10j267q1Q03j31N00R82m25k90J132J064J74O43M65j004
2091A069M75J128m33o60K03m57j190J69N23j478r66K78r04m28J056j88j095O70
2109b228P63K03P90J034j12k8J583L49j04P45Q4r52K6L22r25q27k79r30j222L08
2129a400n10j202j94K41n12M74R94J4K98J190Q27N30J175Q95J23L78R08n25k74
2148C430l0p86j256j91r98j150q34p73r99m51L26j04j49O59N00L06J270J067N10
2167C47Q03Q97L76P04P68Ol55j48k56n99r7o19j349q10m63j138l77l00p82o10
$$ y = [451, 1931, 2767, 3088, 3225, 2945, 3294, 3829, 3788, 2857, 2074, 1245, 504, 268, 58, -1368, -2397, -2790, -3170, -3101, -2540, -2765, -3317, -2790, -1796, -1132, -369, 647, 625, 982, 2205, 2886, 2759, 2970, 2843, 2146, 2075, 2479, 1289, 42, -139, -1065, -1774, -1186, -1496, -2763, -2844, -2041, -2172, -1672, -690, -1115, -1405, -273, 791, 965, 1608, 2073, 1069, 1544, 2672, 2239, 1579, 1782, 1325, 135, 304, 827, -651, -1617, -1339, -2243, -2671, -1615, -1803, -2898, -2228, -1465, -1262, -472, 562, 450, 422, 2005, 2354, 2250, 2995, 3079, 2127, 2153, 2475, 1550, 723, 444, -486, -1708, -1400, -1910, -3112, -3306, -3065, -3577, -3103, -2109, -2095, -1797, -607, 220, 750, 1925, 2820, 2943, 3321, 4229, 3704, 3430, 3400, 2614, 1358, 1167, 169, -981, -1815, -2588, -3587, -4038, -3712, -3816, -3965, -3306, -2806, -2500, -1230, -163, 347, 1150, 2047, 2423, 3127, 3895, 3901, 3546, 3398, 3142, 2543, 2446, 1827, 478, -332, -795, -1933, -2310, -2610, -3392, -4002]
2187d002N0L83J01Q14N39K63Q73J323N61J067R44J08N7Q13K62o11j57n02r60n33
2207A393p3j194j272m90p41r57J75j53o78J28N40J95O32J160L93N27J159J199
2225A943K23Q84M70l12K20O92m56q69m88p98j341j68m41j606p17j64n73J6L43
2244c142J10j20O35J002M91Q19R25K05K52J330L65o1L81k30m34q4j20o95j030
2263E99n03n98q28j71l93q87j00M94n7K86O17n2M75P11Q99J61P50L30ML52N65
2284B654k13l77k4p53l40k89n24p86m28l15k69k41L9l03m8L81N47J57N58L54L79
2305A59O27N96M40R2K10n2n9l3j87m64q49l88m10m97m85n17k84l35K5L13J97J24
2327a777M22M93N41P79O05L41L32L44N75qkm32l64j72n30l19q77q55n91n96j83
$$ y = [-4002, -3952, -3569, -3468, -2654, -2115, -1852, -979, 344, 905, 1972, 2916, 3024, 3081, 3894, 4156, 3545, 3388, 2886, 1926, 1393, 1320, 126, -1146, -1636, -2377, -3334, -3159, -3312, -3990, -3862, -3322, -3127, -2495, -1335, -942, -415, 744, 1943, 2166, 3050, 3520, 3208, 3428, 4120, 3664, 2795, 2307, 1509, 168, 0, -441, -2047, -2764, -2928, -3501, -3485, -3142, -3032, -3152, -2517, -1515, -1024, -205, 720, 925, 1177, 2507, 2872, 2811, 3192, 2962, 2528, 2444, 2324, 1629, 599, 96, -502, -1330, -1501, -1894, -2781, -2881, -2387, -2444, -2158, -1541, -1593, -1118, -407, 492, 653, 1403, 1733, 1737, 2089, 2654, 2441, 2064, 2040, 1287, 947, 658, 134, -652, -1080, -1395, -1664, -1905, -1866, -2169, -2217, -1836, -1289, -1132, -574, -220, 159, 786, 1382, 1822, 1914, 2124, 2072, 2013, 1980, 1793, 1329, 480, 92, -318, -815, -1300, -1817, -2101, -2436, -2411, -2098, -1901, -1777, -1355, -862, -321, 458, 1063, 1404, 1736, 2080, 2655, 2647, 2645, 2213, 1849, 1677, 1147, 828, -49, -904, -1495, -2091, -2274]
2348b274p0m85k65J83L02P35O71K93O29O30J017P02N08K69J76O6j16j18m22m81
2368A950q49o98n25p81m44o41m77l60j96J00Q6j2M22L92O15O40O52P71O42N74
2388A861N19O08J33K51K5k65k23m30o24q30r42n96q70q11o21l89l98k42J61K74
2408c409N14O04R10O47R30R76O13P47O12J21K92q4j33k55n75o00p14p19r37n46
2428a006q35n17l20k85j60j79K98J00M42O17O58O41P71O88O59N98N81K31J41k97
2448B826J65k95l14p63q31n42r66m91m20m39n16k01k2L84K31J88M96L76M69Q03
2468A38L80N67L95J51L53K24K17j81j07l10n54k04k51p38o57k78m78l00N5m36
2488b014k13J63K93K65N00M15K94J43P99O41Q6L84Q7j16L0K78o40l45l25m75n42
$$ y = [-2274, -2344, -2829, -3094, -2911, -2609, -1874, -1203, -910, -281, 349, 1366, 2068, 2576, 2845, 3021, 3087, 2971, 2853, 2431, 1950, 1101, 403, -122, -903, -1347, -1988, -2465, -2825, -3021, -2921, -2835, -2847, -2425, -2033, -1418, -778, -126, 645, 1287, 1861, 2380, 2988, 3121, 3372, 3397, 3132, 2909, 2479, 1855, 1025, 83, -513, -1383, -2194, -2815, -3204, -3602, -3844, -3683, -3409, -2895, -2291, -1381, -734, 196, 1172, 1785, 2532, 3144, 3265, 3557, 3473, 3340, 3085, 2510, 1910, 1196, 477, -460, -1006, -1841, -2358, -2678, -2963, -3123, -3302, -3004, -2904, -2462, -1845, -1187, -546, 225, 913, 1572, 2170, 2751, 2982, 3123, 2826, 2991, 2696, 2382, 1619, 788, 246, -720, -1211, -1631, -2070, -2586, -2787, -2809, -2425, -2194, -2006, -1510, -1134, -665, 138, 518, 1085, 1480, 1631, 1984, 2208, 2425, 2244, 2137, 1827, 1273, 1069, 818, 80, -577, -855, -1333, -1633, -1578, -2014, -2227, -2064, -1771, -1506, -1006, -591, -297, -154, 645, 1286, 1372, 1756, 1843, 1727, 1757, 2035, 1395, 1050, 725, 250, -292]
2509b92N9n12q17qj01k67K98K95k19J20O98L75L68P24L38qN16P75k40o9p7m28
$$ y = [-292, -233, -745, -1562, -1570, -1671, -1938, -1640, -1345, -1564, -1444, -746, -371, -3, 721, 1059, 1051, 1567, 2342, 2102, 2033, 1956, 1528]
$$ [...]
8191a55
##END NTUPLES=NMR FID
##END=
