##TITLE=1H_DPAH1403
 CDCl3
 8 sc, 
 15.03.2022
##JCAMPDX= 6.0         $$ Bruker NMR JCAMP-DX V2.0
##DATA TYPE= NMR FID
##DATA CLASS= NTUPLES
##ORIGIN= UXNMR, Bruker Analytische Messtechnik GmbH
##OWNER= root
$$ XWIN-NMR		Version 3.5
$$ Tue Mar 15 11:13:10 2022 Russian Standard Time (UT+4h)  she@DPX200
##.OBSERVE FREQUENCY= 200.131346
##.OBSERVE NUCLEUS= ^1H
##.DELAY= (6, 6)
##.ACQUISITION MODE= SIMULTANEOUS
##.ACQUISITION SCHEME= undefined
##.AVERAGES= 8
##.DIGITISER RES= 18
##SPECTROMETER/DATA SYSTEM= spect
##.PULSE SEQUENCE= zg30
##.SOLVENT NAME= CDCl3
##.SHIFT REFERENCE= (INTERNAL, CDCl3, 0, 15.7039)
##AUDIT TRAIL= $$ (NUMBER, WHEN, WHO, WHERE, WHAT)
$$ ##TITLE= Audit trail, XWIN-NMR		Version 3.5
$$ ##JCAMPDX= 5.01
$$ ##ORIGIN= Bruker BioSpin GmbH
$$ ##OWNER= she
$$ F:/spectra/data/she/nmr/H-F/1/audita.txt
$$ ##AUDIT TRAIL=  $$ (NUMBER, WHEN, WHO, WHERE, WHAT)
(   1,<2022-03-15 11:11:46.54 +0400>,<she>,<DPX200>,
      <created by zg, POWCHK disabled, PULCHK disabled
       configuration hash MD5:
       00 E9 B6 7A A2 85 ED C7 34 08 36 98 17 FE 4E 26
       data hash MD5: 16K
       4C CA 74 B8 09 F6 E6 A9 1F F9 98 83 24 F7 D7 29>)
$$ ##END=
$$ 
$$ hash MD5
$$ 28 35 07 C4 D9 D4 E9 9E FD 44 F2 F9 46 E5 1E 97
##$RELAX= 
##$RELAX= 
##$RELAX= 
##$RELAX= 
##$RELAX= 
##$RELAX= 
$$ Bruker specific parameters
$$ --------------------------
##$DU= <F:/spectra>
##$EXPNO= 1
##$NAME= <H-F>
##$PROCNO= 1
##$TYPE= <nmr>
##$USER= <she>
##$AMP= (0..31)
100 100 100 100 100 100 100 100 100 100 100 100 100 100 100 100 100 100 
100 100 100 100 100 100 100 100 100 100 100 100 100 100 
##$AQSEQ= 0
##$AQ_mod= 1
##$AUNM= <au_zg>
##$AUTOPOS= <>
##$BF1= 200.13
##$BF2= 200.13
##$BF3= 200.13
##$BF4= 200.13
##$BF5= 200.13
##$BF6= 200.13
##$BF7= 200.13
##$BF8= 200.13
##$BYTORDA= 1
##$CFDGTYP= 0
##$CFRGTYP= 5
##$CHEMSTR= <none>
##$CNST= (0..31)
1 1 145 1 1 1 1 1 1 1 1 1 1 1 1 1 1 1 1 1 1 1 1 1 1 1 1 1 1 1 1 1 
##$CPDPRG= <>
##$CPDPRG1= <>
##$CPDPRG2= <>
##$CPDPRG3= <>
##$CPDPRG4= <mlev>
##$CPDPRG5= <mlev>
##$CPDPRG6= <mlev>
##$CPDPRG7= <mlev>
##$CPDPRG8= <mlev>
##$CPDPRGB= <>
##$CPDPRGT= <>
##$D= (0..31)
0 1.2 0 0 0 0 0 0 0 0.06 0 0.03 0 0 0 0 0.0002 0 0 0 0 0 0 0 0 0 0 0 0 
0 0 0 
##$DATE= 1647328305
##$DBL= (0..7)
120 120 120 120 120 120 120 120 
##$DBP= (0..7)
150 150 150 150 150 150 150 150 
##$DBP07= 0
##$DBPNAM0= <>
##$DBPNAM1= <>
##$DBPNAM2= <>
##$DBPNAM3= <>
##$DBPNAM4= <>
##$DBPNAM5= <>
##$DBPNAM6= <>
##$DBPNAM7= <>
##$DBPOAL= (0..7)
0.5 0.5 0.5 0.5 0.5 0.5 0.5 0.5 
##$DBPOFFS= (0..7)
0 0 0 0 0 0 0 0 
##$DE= 6
##$DECBNUC= <off>
##$DECIM= 32
##$DECNUC= <off>
##$DECSTAT= 4
##$DIGMOD= 1
##$DIGTYP= 9
##$DL= (0..7)
0 120 120 120 120 120 120 120 
##$DP= (0..7)
150 150 150 150 150 150 150 150 
##$DP07= 0
##$DPNAME0= <>
##$DPNAME1= <>
##$DPNAME2= <>
##$DPNAME3= <>
##$DPNAME4= <>
##$DPNAME5= <>
##$DPNAME6= <>
##$DPNAME7= <>
##$DPOAL= (0..7)
0.5 0.5 0.5 0.5 0.5 0.5 0.5 0.5 
##$DPOFFS= (0..7)
0 0 0 0 0 0 0 0 
##$DQDMODE= 0
##$DR= 18
##$DS= 0
##$DSLIST= <SSSSSSSSSSSSSSS>
$$ [...]
##$SUBNAM2= <"">
##$SUBNAM3= <"">
##$SUBNAM4= <"">
##$SUBNAM5= <"">
##$SUBNAM6= <"">
##$SUBNAM7= <"">
##$SUBNAM8= <"">
##$SUBNAM9= <"">
##$SW= 18.0517287032376
##$SWIBOX= (0..15)
0 0 2 0 0 0 0 0 0 0 0 0 0 0 0 0 
##$SW_h= 3612.71676300578
##$TD= 16384
##$TD0= 1
##$TE= 0
##$TE2= 300
##$TE3= 300
##$TEG= 300
##$TL= (0..7)
0 120 120 120 120 120 120 120 
##$TP= (0..7)
150 150 150 150 150 150 150 150 
##$TP07= 0
##$TPNAME0= <>
##$TPNAME1= <>
##$TPNAME2= <>
##$TPNAME3= <>
##$TPNAME4= <>
##$TPNAME5= <>
##$TPNAME6= <>
##$TPNAME7= <>
##$TPOAL= (0..7)
0.5 0.5 0.5 0.5 0.5 0.5 0.5 0.5 
##$TPOFFS= (0..7)
0 0 0 0 0 0 0 0 
##$TUNHIN= 0
##$TUNHOUT= 0
##$TUNXOUT= 0
##$USERA1= <user>
##$USERA2= <user>
##$USERA3= <user>
##$USERA4= <user>
##$USERA5= <user>
##$V9= 5
##$VALIST= <valist>
##$VCLIST= <CCCCCCCCCCCCCCC>
##$VD= 0
##$VDLIST= <DDDDDDDDDDDDDDD>
##$VPLIST= <PPPPPPPPPPPPPPP>
##$VTLIST= <TTTTTTTTTTTTTTT>
##$WBST= 1024
##$WBSW= 4
##$XGAIN= (0..3)
0 0 0 0 
##$XL= 0
##$YL= 0
##$YMAX_a= 1092187
##$YMIN_a= -741351
##$ZGOPTNS= <>
##$ZL1= 120
##$ZL2= 120
##$ZL3= 120
##$ZL4= 120
##$ABSF1= 10
##$ABSF2= 0
##$ABSG= 5
##$ABSL= 3
##$ALPHA= 0
##$AQORDER= 0
##$ASSFAC= 0
##$ASSFACI= 0
##$ASSFACX= 0
##$ASSWID= 0
##$AUNMP= <proc_1d>
##$AZFE= 0.1
##$AZFW= 0.1
##$BCFW= 1
##$BC_mod= 2
##$BYTORDP= 1
##$COROFFS= 0
##$CY= 11.3945322036743
##$DATMOD= 1
##$DC= 2
##$DFILT= <>
##$DTYPP= 0
##$F1P= 2.36226072786647
##$F2P= -0.459571619588291
##$FCOR= 0.5
##$FTSIZE= 0
##$FT_mod= 4
##$GAMMA= 1
##$GB= 0.15
##$INTBC= 1
##$INTSCL= 1
##$ISEN= 128
##$LB= 0.24
##$LEV0= 0
##$LPBIN= 0
##$MAXI= 10000
##$MC2= 0
##$MEAN= 0
##$ME_mod= 0
##$MI= 1.114404
##$NCOEF= 0
##$NC_proc= 0
##$NLEV= 6
##$NOISF1= 3.799351
##$NOISF2= 2.8
##$NSP= 1
##$NTH_PI= 0
##$NZP= 0
##$OFFSET= 15.70392
##$PC= 1
##$PHC0= -16948.53
##$PHC1= 11.80078
##$PH_mod= 1
##$PKNL= yes
##$PPARMOD= 0
##$PSCAL= 0
##$PSIGN= 0
##$REVERSE= no
##$SF= 200.130013532006
##$SI= 16384
##$SIGF1= 3
##$SIGF2= 2
##$SINO= 400
##$SIOLD= 16384
##$SREGLST= <1H.CDCl3>
##$SSB= 0
##$STSI= 0
##$STSR= 0
##$SW_p= 3612.71676300578
##$SYMM= 0
##$S_DEV= 0
##$TDeff= 0
##$TDoff= 0
##$TI= <>
##$TILT= no
##$TM1= 0
##$TM2= 0
##$TOPLEV= 0
##$USERP1= <user>
##$USERP2= <user>
##$USERP3= <user>
##$USERP4= <user>
##$USERP5= <user>
##$WDW= 1
##$XDIM= 8192
##$YMAX_p= 0
##$YMIN_p= 0
$$ End of Bruker specific parameters
$$ ---------------------------------
##NTUPLES= NMR FID
##VAR_NAME=  TIME,          FID/REAL,        FID/IMAG
##SYMBOL=    X,             R,               I
##VAR_TYPE=  INDEPENDENT,   DEPENDENT,       DEPENDENT
##VAR_FORM=  AFFN,          ASDF,            ASDF
##VAR_DIM=   8192,          8192,            8192
##UNITS=     SECONDS,       ARBITRARY UNITS, ARBITRARY UNITS
##FACTOR=    0.0002768,     1,               1
##FIRST=     0,             0,               0
##LAST=      2.2672688,     0,               0
##MIN=       0,             -741351,         0
##MAX=       2.2672688,     1092187,         0
$$ Real data points
##PAGE= N=1
##DATA TABLE= (X++(R..R)), XYDATA
0 0 0 0 0 0 0 0 -8 0 -8 8 -8 8 -16 24 -24 32 -40 56 -64 80 -90 112 -128 159 -184 215 -248 287 -329 377 -432
31 -432 490 -559 631 -714 802 -900 1008 -1128 1256 -1397 1553 -1722 1907 -2107 2327 -2567
47 -2567 2832 -3120 3439 -3786 4172 -4601 5077 -5613 6216 -6904 7694 -8617 9704 -11018
61 -11018 12633 -14679 17365 -21067 26512 -35349 52156 -95823 468006 1092187 802803
72 802803 1054179 871942 575145 390801 213315 -135790 -289267 -423262 -519212 -580604
82 -580604 -665843 -741351 -561804 -443843 -484285 -389199 -161081 -135043 -94723 114645 222713
93 222713 146248 210199 358454 346523 268678 310769 317222 233901 196704 195756 128632 60524
105 60524 9465 -50961 -80717 -112620 -203355 -229974 -197996 -255824 -295322 -205242 -177298 -211348
117 -211348 -116977 -16532 -30781 20580 136673 144547 122310 166196 172702 129360 111910 94231
129 94231 53227 12474 -22795 -30378 -24208 -50197 -68688 -42939 -26858 -32859 -15826 10585 6731
142 6731 -8973 4440 32063 15437 -21840 -6391 11595 -33306 -45442 1990 -17792 -69108
154 -69108 -29786 11606 -21617 -25559 16767 20868 9228 26350 43772 45214 33343 18762 32900
167 32900 47923 12306 -9501 23369 16979 -32615 -15188 25192 -17014 -55343 -7097 10169
179 10169 -45153 -43774 2441 -20172 -52092 -16744 5814 -16110 -16780 1239 12445 23581 16819
192 16819 14023 44395 38747 -2378 28119 63839 4415 -19088 38083 20419 -37609 -4058
204 -4058 21841 -30975 -41083 -2400 -11970 -33017 -22268 -18119 -17625 -11584 -19171 -9229 12690 -6482
218 -6482 -18458 22753 30863 -9316 5086 43956 15192 -8266 31895 36384 -7758 -2609 26919
231 26919 6931 -14663 157 1715 -16007 -16574 -10562 -9933 -11272 -23177 -22547 -3 -5103 -26184
245 -26184 -4039 13751 -15961 -14453 25926 15528 -14977 10429 31447 5386 2327 26741
257 26741 19785 106 6276 17574 10893 -2745 -5942 1017 -980 -14999 -14468 -1406 -10045 -27795
271 -27795 -12414 6863 -11092 -23729 529 8879 -14371 -9585 18244 6976 -16532 3833
283 3833 24002 4826 -3459 16051 17963 2200 4731 17369 14105 -427 -4055 7486 10132
296 10132 -8013 -12347 4986 -1657 -24458 -10847 8580 -15299 -31517 -3834 4547 -20507 -14319
309 -14319 11439 1181 -12697 7229 21038 7230 1085 10881 15172 8801 3092 6876 12483
322 12483 2443 -8053 8212 17402 -7089 -12516 11510 3513 -21365 -6290 7963 -18256 -26763
335 -26763 -444 378 -18536 -10289 3745 -2134 -5196 3643 9156 6612 -610 1011 14509 13943
349 13943 -1321 5332 20421 5704 -4821 16765 17216 -11147 -8031 11988 -2495 -18968 -4118
362 -4118 556 -17194 -15884 481 -1493 -11299 -9268 -1648 688 -3819 -5551 3256 4969 -6090
376 -6090 -949 17682 11249 -5073 9338 22237 3917 -1503 17541 10892 -11587 -3186 11376
389 11376 -2578 -13978 -2952 553 -9391 -9541 -1806 -1007 -8761 -13548 -3962 3625 -7253 -12551
403 -12551 3570 6931 -8113 101 19933 7532 -7316 11221 20671 1518 -1801 13045 7079
416 7079 -7271 -62 9241 496 -8351 -4034 1719 -1198 -8343 -7628 -497 -6167 -15611 -4358 6138
431 6138 -8473 -14267 5436 8504 -7675 563 15541 2435 -6224 9707 13751 560 -465
444 -465 7858 6272 1330 2198 5492 4273 -3290 -5912 2916 2860 -11330 -10349 1640 -5412 -14809 -1687
460 -1687 4585 -10664 -10797 6470 4668 -6913 22 8253 509 -2270 7350 9348 2322 268 5510
475 5510 8897 4989 74 3405 6005 -3074 -5657 5152 2923 -12211 -7700 4375 -4460 -12365
489 -12365 -738 1703 -10634 -7995 4722 1282 -6954 -2143 4349 2303 -228 3737 7573 3892
503 3892 -595 4640 11188 4485 -3452 3409 8225 -2143 -4649 6443 2562 -11462 -5508 6001
517 6001 -3620 -12021 -1822 751 -9269 -6557 2637 -51 -5978 -3276 2520 4241 488 -701 5749
532 5749 6743 -1114 2014 12622 4491 -6048 4728 10891 -2484 -4327 6527 1494 -9019 -2142
546 -2142 4446 -3961 -8884 -3280 -1517 -4481 -5062 -2941 -949 -2994 -5729 731 6599 -969 -4625
561 -4625 6200 7624 -2590 2449 11647 1742 -4425 7483 8726 -2474 -1373 5051 -119 -3806
575 -3806 -162 293 -2883 -5198 -5013 -634 -306 -6782 -5191 1858 -2836 -6935 2243 4537 -5809 -3947
591 -3947 7154 3816 -3021 3638 7341 298 126 7205 6239 -46 -349 3032 2629 -681 -1859 2
607 2 -657 -5808 -4677 1969 -1304 -8950 -3711 2522 -4189 -6416 2304 1940 -6059 -2163 6554 2495
623 2495 -2899 2235 5832 2250 579 4815 5857 456 -1678 3798 5189 -1083 -3201 1816 1610
638 1610 -4567 -2939 2620 -2108 -8634 -3270 2696 -3426 -7365 136 1458 -5404 -2246 5578 1999
653 1999 -3364 1318 5574 2625 563 2770 3964 1507 -305 2700 5536 201 -3767 2346 4294
668 4294 -3681 -3278 2818 -1989 -8043 -1343 2726 -5088 -6684 239 134 -3701 -860 2070 -79 -2009
684 -2009 396 3426 3199 -166 -241 4483 3799 -518 2668 6612 -563 -3422 4959 4045 -4636 -2398
700 -2398 2565 -2983 -5351 731 532 -4981 -3880 -501 -520 -1480 -2309 -1319 656 -1057 -1821 3462 3518
717 3518 -2830 -245 6807 2782 -1632 4231 5087 -2124 -811 5142 1715 -3662 -1120 1681 -1191
732 -1191 -2558 -669 -336 -2653 -4037 -1283 1460 -1916 -4985 -444 2327 -2273 -2164 3910 1900 -3604
748 -3604 1174 6633 1475 -2069 3186 3734 -325 341 3742 2045 -2004 -1227 2059 1197 -2645 -2576 141
765 141 -1245 -4273 -1482 1437 -2770 -5244 39 2252 -1994 -2540 2175 1445 -2431 831 5013 1199
781 1199 -1869 1990 4342 1050 -7 2631 1972 -747 -394 2036 1397 -2051 -2823 361 573 -3261
797 -3261 -2046 945 -2248 -4848 196 2479 -2603 -3250 1968 1060 -1873 1098 3157 82 -1132 2191
813 2191 3259 1363 138 1139 1893 1011 -438 1441 2115 -2154 -2784 1989 1292 -3908 -2007 1246
829 1246 -2532 -4018 1127 1108 -3645 -2244 1522 242 -1067 308 1103 296 127 1138 3155 2073
845 2073 -1345 159 3977 1215 -1776 2012 2507 -2990 -1416 3295 143 -3939 -1180 1017 -1985
860 -1985 -2561 282 -320 -2629 -2032 345 1065 -975 -1838 835 1988 -423 -227 3029 1539 -2146 1076
877 1076 4629 554 -1731 2015 2025 -1642 -445 2366 -138 -3106 -1075 900 -626 -2159 -1287 -269
893 -269 -1197 -2178 -212 1428 -1338 -2694 1014 2355 -760 -848 2519 1027 -1670 1568 3596 99
909 99 -1408 1817 2130 -268 -200 1178 2 -1636 -626 616 -37 -2040 -1883 46 -346 -1874 -604
926 -604 808 -1551 -2350 1282 2021 -1545 -1049 1979 522 -857 1815 2461 -343 -479 1757 1970 -109
943 -109 -189 494 303 -740 -616 662 100 -2407 -1596 1053 -36 -2306 -708 716 -1881 -1962 1556 1145
961 1145 -2108 -746 2126 705 -528 1182 1502 -5 -247 1415 1872 196 -761 362 1482 -207
977 -207 -1116 945 265 -2454 -1160 1696 -374 -2866 -624 848 -1389 -1584 1171 215 -1827 -333
993 -333 1676 935 -408 155 1077 823 122 741 1629 445 -1005 562 2118 -292 -1447 679 557
1010 557 -1857 -709 1377 -910 -2784 -248 743 -1039 -1112 220 -272 -913 -126 870 911 -379 -681 1118
1028 1118 1436 134 248 1599 510 -855 1348 2054 -871 -1172 991 536 -1289 -42 580 -1344
1044 -1344 -1679 29 231 -824 -946 -565 -56 -186 -606 435 725 -777 -639 1774 1384 -863 111 1811
1062 1811 248 -566 1722 1306 -1226 -546 1336 211 -834 -38 260 -769 -911 -278 261 -650 -1718
1079 -1718 -678 892 -333 -1268 345 603 -1161 -497 1974 897 -1256 401 1741 301 -171 1307
1095 1307 1184 -593 -294 1149 934 -661 -828 213 321 -834 -510 329 -421 -1775 -323 1114 -456
1112 -456 -1662 128 634 -660 -213 1406 458 -1045 273 1685 538 -184 485 885 -8 -37 940 734
1130 734 -486 -715 408 664 -612 -899 304 -206 -1317 -172 591 -853 -1780 72 670 -689 -412
1147 -412 751 120 -644 594 1449 332 -231 425 708 543 187 338 501 -204 -794 678 1047 -897
1165 -897 -1302 453 -143 -1249 -50 494 -1220 -1247 650 407 -815 -444 567 -104 -191 353 649 230
1183 230 -229 -207 1241 945 -502 32 1314 -83 -635 1107 723 -1537 -885 961 -94 -1192 -172
1200 -172 120 -958 -728 230 253 -663 -902 -140 854 63 -588 458 728 -604 -42 1688 592 -1114
1218 -1114 419 1032 -255 -311 980 300 -953 -341 709 182 -809 -623 -266 -213 -644 -341 391 -445 -1200
1237 -1200 170 905 -168 -773 563 635 -451 120 1311 260 -616 521 1138 191 -130 219 237 -341
1255 -341 26 392 91 -721 -594 122 223 -593 -577 84 -454 -857 186 476 -373 -850 501 697 -38 69
1275 69 813 119 -331 454 1065 196 -192 325 396 8 50 328 150 -512 -587 309 201 -773 -730 277 -138
1296 -138 -773 53 477 -885 -764 753 678 -316 -27 519 -3 -35 631 633 105 -335 294 659 337 -376 8
1317 8 256 -296 -565 645 324 -1211 -425 659 -285 -823 197 173 -785 -353 599 84 -274 -142 84 330
1337 330 117 -12 375 435 -224 62 788 502 -758 204 782 -366 -367 457 -63 -931 -20 500 -341 -686
1357 -686 -81 -30 -327 -66 44 146 -261 -275 245 582 -78 -287 407 368 -194 335 804 -105 -571 343 470
1378 470 -124 -153 110 -233 -498 96 292 -165 -455 -396 118 104 -407 -17 139 -322 -315 397 464 -116 -77 432
1400 432 311 -180 342 458 -301 -195 422 493 -97 -162 215 -14 -204 60 37 -443 -481 -133 149 -47 -367
1421 -367 -382 185 -252 -375 345 305 -558 -401 572 378 -276 287 448 -64 -81 562 509 -315 -144 249 290 -345
1443 -345 -105 29 -8 -302 -152 386 -96 -779 -250 335 -56 -573 222 211 -583 -91 662 222 -335 148 251
1464 251 2 77 277 132 -189 -80 201 502 1 -485 84 385 -323 -212 535 -117 -754 65 429 -273
1484 -273 -339 98 34 -270 92 558 -37 -235 87 249 347 25 -20 281 110 -150 137 389 -237 -408 201
1505 201 288 -273 -160 293 -198 -305 160 93 -271 -475 60 -64 -40 -157 108 25 -167 59 255 195 -161 -40
1527 -40 381 153 -210 205 307 -259 -263 421 170 -337 -139 143 -231 -263 82 85 -336 -241 212 290 -30 -152 -14
1550 -14 120 -88 63 460 171 -348 -160 651 176 -243 94 307 -247 -118 356 61 -244 -116 153 -74
1570 -74 -215 -175 -56 -39 -284 -60 272 -53 -337 47 323 -158 -60 266 181 -278 68 521 125 -353 15 225
1592 225 -98 54 204 25 -289 -52 97 141 -161 -168 17 179 -239 -44 206 -178 -506 68 479 -151 -195
1613 -195 317 139 -225 269 263 100 -8 42 73 264 -73 -22 65 94 -26 134 168 -183 -221 175 76 -185 -27
1636 -27 150 -251 -236 381 271 -289 -361 194 -15 -27 199 148 14 -146 16 386 39 -183 -41 209 120 -106
1658 -106 107 63 -247 -340 201 -77 -277 -199 125 -277 -135 139 30 -299 -317 153 185 47 -16 16 42 219 69
1681 69 241 123 -189 87 353 27 -219 177 -11 -472 18 230 32 -353 -158 25 14 -32 -8 -8 -100 -315
1703 -315 -58 25 -114 -158 4 353 -152 -107 242 -68 -190 -38 297 -40 -368 -25 109 -124 -155 133 -215
1724 -215 -247 33 106 -132 -75 -298 -43 -99 -3 63 158 -111 -152 355 304 -30 -92 157 -109 -139 228 240 -112 -82
1748 -82 43 144 140 1 -17 -66 -115 -48 197 133 -237 -114 3 -70 -132 -6 24 -213 -60 188 -5 -79 -94 183
1772 183 172 -70 201 63 -185 -25 96 264 94 -184 -130 108 53 -233 -29 -69 -259 -79 229 -49 -130 -32
1794 -32 136 -220 91 381 16 -70 -22 162 116 25 -87 150 -139 164 210 72 46 -187 -46 310 -72 -140 27
1817 27 2 -359 -80 128 5 -229 -189 3 -10 -68 87 -157 -172 -8 69 168 -77 -13 -1 94 -33 110 -90 75
1841 75 -206 99 146 -110 -45 127 18 -108 170 24 -92 -11 43 -5 -47 -53 -140 -107 67 19 2 76 -174 -131 236
1866 236 34 -92 111 92 -24 -147 214 187 -144 -93 -132 -4 -87 -65 -38 -143 -127 128 109 -2 -90 -17 116 85
1890 85 -83 79 127 -85 -37 229 141 -159 21 352 89 11 52 206 -200 -143 345 264 -65 -41 19 25 -57 134
1914 134 -40 -54 45 -39 125 -50 37 199 88 -93 -59 236 71 -217 -17 234 95 77 -48 -3 -115 -105 44
1937 44 43 -76 62 77 135 28 -63 153 -50 -95 30 172 30 -95 -49 67 -112 108 102 3 -25 -132 -23 73
1961 73 -14 53 77 -97 37 153 -45 5 -92 31 242 -98 -252 -17 9 -60 58 177 -148 -10 120 183 68
1984 68 -29 -21 0 155 -14 166 -9 -20 43 173 40 55 31 15 131 176 80 194 -188 -89 132 90 -199 157 29
2009 29 -180 -220 69 -103 17 20 -58 -48 -162 -125 84 107 -163 13 214 72 -104 15 149 -57 -65 85 48 -193
2033 -193 -42 148 197 2 -67 9 -177 25 25 54 -42 -130 -48 116 -55 -94 129 82 -52 -14 122 155 -117 136
2057 136 126 -18 -62 -36 23 -80 -66 66 27 5 -163 -65 -148 -82 -29 -11 -105 -175 -107 87 11 -177 -16 66 -76 -56
2083 -56 132 27 118 69 -18 -35 177 182 85 160 240 -24 37 -28 42 91 92 55 -134 -3 -62 44 71 0 -131 -125 52
2110 52 5 -107 138 -83 -68 69 -20 -3 -127 -39 80 -32 82 -95 -27 128 4 -13 9 15 -49 50 124 -24 -45
2135 -45 79 10 -106 -12 141 -120 -78 -178 -156 167 17 94 -16 58 -136 -15 67 -63 42 60 117 16 40 157
2159 157 70 -51 206 127 24 50 -14 58 65 53 62 150 -27 23 43 40 -143 -70 -65 -43 -6 87 -75 -35 -53 32 -54 -84 -40
2188 -40 -54 -29 -260 47 84 3 5 68 66 -42 109 30 -25 -38 -10 -51 104 116 -38 263 -53 -30 16 -97 -29 -69 72
2215 72 -11 14 30 -121 53 109 -39 298 -96 0 -1 32 17 -157 32 5 -21 1 109 37 -252 -117 103 2 14
2240 14 171 -28 -99 -52 30 145 -94 30 143 -6 -102 -99 -83 44 13 96 73 -40 63 53 86 -14 -35 118 -33
2265 -33 -149 35 -54 -91 -78 22 -27 -42 27 33 -152 -7 2 17 131 -53 -115 112 124 53 41 75 -221 92 109 85
2291 85 20 61 89 -145 37 128 42 -26 99 105 39 135 -138 12 -87 77 1 199 -48 -88 51 68 51 30 -15 33
2317 33 27 105 -17 72 -70 -111 122 -16 -13 -59 3 5 68 79 22 50 -134 -56 -32 -53 64 -45 2 -177 -6 122 35
2344 35 76 -152 41 -71 134 104 29 42 -187 43 -19 -11 -61 16 95 107 15 9 -45 -3 30 36 43 44 209 42 -77 -72 148
2373 148 146 -54 -78 71 -103 43 -40 -41 -5 53 19 141 30 -114 45 75 152 -163 12 -27 2 37 39 -35 55 69
2399 69 -54 -122 -132 -65 -18 88 -249 103 85 -46 -76 -68 -72 -90 85 109 -27 50 -52 137 183 -118 6 -86 38
2424 38 94 81 61 97 13 -53 28 18 109 0 13 -84 8 4 -86 -79 -68 58 77 4 -35 -94 -65 66 10 82 6 87 42 8
2454 8 88 27 -66 3 18 70 -43 -68 -54 54 -119 25 156 41 16 35 143 -148 -116 24 28 28 -87 -31 -115 13
2480 13 -4 -134 -3 146 -113 128 -151 96 64 11 62 -32 78 -11 61 76 98 66 -10 -30 2 -170 -43 -79 -68
2505 -68 -106 38 57 -195 -52 48 1 -22 -23 87 26 -64 4 -191 47 36 -205 50 24 -17 -5 -112 -2 159 78
2530 78 31 213 -25 117 -83 94 -2 122 -22 -123 -7 -80 87 -176 123 -114 88 -5 53 43 25 -3 110
2553 110 50 34 33 -27 -81 193 127 -8 -65 -5 61 120 -42 32 -105 4 -40 150 -64 111 -3 -181 250 24
2577 24 142 -21 53 -148 215 -12 -38 -102 11 226 -159 -102 -130 -46 63 132 -169 -130 35 -31 128 114 -2 5
2601 5 -299 149 45 133 25 -118 37 112 74 -37 160 -84 30 80 -80 -64 105 -50 -87 60 -123 -9 2
2624 2 21 -132 -77 -3 126 178 88 2 7 -49 -44 248 10 59 -9 21 -29 61 -25 -54 95 -6 20 61 29 -16 4 64 -197
2653 -197 35 -32 124 -56 118 -63 -107 49 -38 25 -19 64 -92 -2 -196 2 -93 -94 123 109 61 -69 -27 -19 34
2678 34 174 216 99 111 -22 -3 19 -44 60 -126 -86 11 69 88 3 122 126 -27 -108 271 8 19 118 -115 40
2703 40 20 66 35 -35 -19 -32 -111 16 50 48 36 129 -148 -37 -55 155 -127 -23 -30 -154 45 -32 36 25 -50 -13 60
2730 60 -52 41 60 118 40 27 19 29 -48 -105 -124 -87 -169 90 86 -80 -13 23 -100 -22 -33 -95 -82 45 -163 30 95 189
2758 189 120 -59 3 132 -15 -33 -86 68 -12 -197 -53 30 -113 47 43 120 -6 -79 -93 -9 41 -60 29 90 66
2783 66 -100 -44 -65 33 11 35 -33 5 -136 -67 -118 -115 -101 14 41 24 -30 77 37 -37 205 21 94 11 4 140 46 -118
2811 -118 0 -85 73 -22 75 28 -110 -3 48 92 -76 -97 -17 -32 59 -26 28 -93 11 69 -81 162 102 -13 -28
2836 -28 -2 16 124 28 0 -159 94 58 3 190 14 -75 -15 148 -99 -29 -52 21 28 80 -146 -94 -151 56 -91 -107
2862 -107 90 -5 18 6 -99 -33 -93 -127 67 -29 -113 40 50 -54 -173 42 -85 -129 -187 -156 -120 195 35 21 -69
2887 -69 172 15 87 28 0 63 -113 -68 -58 31 -31 -80 -44 -155 44 10 -152 30 2 -79 48 -114 -45 -20 12 17
2913 17 -2 8 1 -106 -9 172 69 -8 -58 -95 -163 -82 -38 26 -36 40 63 105 118 116 -110 79 25 24 22 -193 54 60 13
2942 13 -94 102 138 16 64 28 38 79 -190 -87 66 -105 33 148 -70 -74 145 49 -14 7 -121 12 14 -152
2966 -152 -82 -129 64 -49 -84 135 82 -12 80 66 -102 -52 92 -22 -19 56 57 40 26 74 40 30 -58 49 92 61 -71
2993 -71 -40 -59 77 122 -101 -24 -28 -116 -31 -28 50 -91 36 19 -153 41 38 -147 -92 15 2 67 24 -14 -22 -35 93 5
3021 5 83 84 111 89 80 -105 40 68 184 71 -54 -76 62 -149 -84 104 66 72 50 -61 94 0 0 -222 64 60 -93
3048 -93 24 118 75 -79 11 10 27 -30 39 -64 243 74 45 6 47 -114 35 128 121 -13 111 183 38 -53 12 -109
3074 -109 -1 132 -68 38 -64 -175 -102 79 -48 -46 -18 61 123 42 -39 54 -81 36 8 77 40 64 -54 67
3098 67 -42 -97 -32 26 120 -7 57 34 -13 54 -98 21 -45 104 22 22 70 -15 -8 -129 163 -41 -58 -129 -113 139 18
3125 18 36 -32 80 144 -200 9 -66 101 12 13 -85 -38 193 33 -10 101 -72 20 85 25 141 154 141 -30 2 -31
3151 -31 161 82 -86 -156 -95 -63 -24 -10 -50 33 -111 38 -54 63 1 31 4 -130 -155 -129 -126 20 118 -102 -20 -118 45
3178 45 -211 114 -13 -176 -27 57 -55 36 45 -43 64 36 -76 54 70 13 -12 54 95 73 154 1 -42 -12 -127
3203 -127 -47 74 56 -197 65 -89 78 91 -183 -26 -1 -74 31 -233 -150 241 66 -7 -195 22 44 100 43
3226 43 140 -17 -82 87 -45 63 141 -164 123 -65 43 106 46 -21 152 -78 -100 -134 2 -2 -170 -195 70 146
3250 146 -39 -3 21 96 -41 -36 -46 62 23 -23 -46 -28 7 -225 -36 61 -126 -41 -37 32 -190 60 -75 46 -21 44
3276 44 43 -10 -9 0 73 -177 28 -135 15 1 -22 57 -58 -17 -97 -71 215 -29 36 27 -63 -73 58 36 -118 41 -72
3303 -72 -28 192 -162 -23 25 114 -86 55 -54 69 -117 -35 -14 -107 91 -91 -1 -85 17 28 -71 -40 -9 57 -86
3328 -86 -99 -6 -90 42 -56 -108 -91 79 49 29 105 60 50 -39 103 52 -11 -11 1 79 -43 -63 60 -54 45 29 -12 -20
3356 -20 -50 80 -139 23 -27 -50 6 -146 -152 -114 35 13 -138 -68 93 -31 87 -48 -81 -76 13 133 -36 -140 80
3381 80 92 28 -95 -115 -16 21 -19 7 95 -52 69 -21 56 136 87 -59 177 -99 -93 91 40 -29 102 66 -12 71 -9
3408 -9 183 117 -73 -8 -65 -97 69 75 -6 -9 -12 -54 -72 38 -112 -99 19 52 148 3 17 -21 -64 123 162 -76 -31 -37
3436 -37 244 -119 157 138 -1 -33 -37 39 -116 64 -79 -28 29 -40 34 -112 256 -28 54 -34 -111 -34 -100 135 107
3461 107 -113 31 1 61 -102 -124 -66 95 62 160 -63 21 -1 -66 194 10 3 -96 50 28 -84 -116 156 -170 -95
3486 -95 122 -139 32 32 -36 47 -139 86 74 38 19 -18 77 153 -8 0 133 -111 -145 -53 45 -89 9 0 -54 -20 171
3513 171 -26 -64 -86 30 -31 105 31 36 -103 50 -44 -11 -41 31 96 59 4 -103 113 -68 62 -68 -20 72 -183
3538 -183 -79 -71 -158 -82 -140 152 62 120 -1 119 -121 193 102 21 -29 -4 -101 -60 -49 -31 5 -45 -174 143 -39 -46
3564 -46 36 -37 -28 -185 -53 58 -39 -34 -29 55 28 49 23 91 21 -65 144 -38 -155 74 -116 38 -76 -8 20 -125
3590 -125 36 -60 92 -116 -93 59 81 14 -55 -154 182 52 -133 66 12 -204 65 -17 74 -106 6 -99 53
3613 53 -55 -12 -84 0 37 91 -85 47 -91 -83 -65 10 55 -38 14 86 -231 3 -5 -80 41 -31 2 78 112 30 -58 54
3641 54 -26 55 72 45 69 90 -24 -37 -154 -164 89 -4 86 65 203 -58 48 -111 -59 -53 -26 53 36 52 -78 -110 11
3668 11 74 146 -149 -26 7 183 -53 -78 49 75 -107 -59 125 -81 143 -143 -42 42 52 46 36 33 132 40 14 -9
3694 -9 41 51 54 -71 -35 -70 101 21 35 -32 63 95 -111 61 -53 97 -46 -17 -109 -111 -148 -168 -156 128 112 -47 6
3721 6 49 -158 213 183 -119 86 -94 -71 90 -15 -77 97 -5 -20 89 -176 1 -42 108 52 4 126 -31
3744 -31 -96 9 -7 -11 142 -9 96 75 35 -50 107 22 151 160 80 -67 -101 76 74 -69 -18 60 43 -130 118 13
3770 13 -55 90 99 42 -112 132 74 -35 -171 74 68 180 94 -19 -91 -39 -62 67 170 6 -8 -7 120 -5 75
3795 75 -71 -31 44 194 70 -96 -39 32 46 14 1 4 31 21 88 -72 -93 85 17 -12 -96 69 85 -16 -103 98
3821 98 44 3 60 -80 -160 -39 -72 112 156 113 -40 30 -32 118 -80 -121 80 70 -90 -49 55 170 -71 16 31
3846 31 45 -3 -110 -113 -60 -44 -48 25 -31 -78 -16 -37 40 8 89 -110 -159 -42 6 2 89 45 -84 7 -118 14 102 -13
3874 -13 37 107 -94 -145 1 56 15 64 -107 62 64 96 1 18 124 23 -69 -93 26 56 113 22 -24 60 -24 22 -18
3901 -18 150 -66 41 -14 -49 -1 15 49 15 62 53 -22 -13 -76 93 37 26 147 54 -111 79 -25 -44 -80 -141 50 -15
3928 -15 -137 19 -11 112 87 -19 -60 -36 -115 6 72 -20 -62 66 -10 -62 -91 180 15 -147 -123 -6 -75 -126 117
3953 117 74 -57 79 59 116 68 123 -13 155 -53 -5 161 56 53 -10 -124 96 8 40 91 -122 -81 26 79 -67
3978 -67 1 -109 116 1 -103 -70 -114 0 -54 32 17 -143 0 -8 64 -253 94 138 -203 -46 -174 -31 121 31
4002 31 37 3 -27 129 -105 -62 70 24 99 18 -66 -39 -2 -36 3 119 -40 -37 140 -16 -120 59 -19 8 -42 -84 162
4029 162 45 50 -27 -60 -110 53 -156 -106 22 81 -196 -10 16 -87 -31 73 87 15 -90 -48 120 -15 71 203
4053 203 -12 -50 107 -95 -52 -77 -27 159 -48 43 -87 87 -42 -67 15 12 62 -66 55 -68 -115 119 -30 87
4077 87 32 -18 28 107 -209 -57 15 27 46 -65 -73 -39 -98 81 -128 -125 -84 147 20 50 -40 20 29 14 55 4 -51 239
4105 239 48 -27 142 61 34 -109 37 80 -132 69 4 -148 57 62 -105 -13 -86 102 80 -82 106 76 -43 -112
4129 -112 -174 86 54 147 39 103 239 -158 -40 90 13 -23 13 83 -160 -227 58 -61 -97 -91 -54 -41 -59 -155 -77 -77
4155 -77 49 11 4 -14 -189 70 -72 -19 -137 -24 77 0 23 49 -107 -89 -7 51 -7 148 26 83 169 -77 -10
4180 -10 -84 -54 25 114 59 91 90 0 -50 -130 86 -45 -267 59 24 -52 84 -191 17 77 105 -22 -124 -98 8 -74
4206 -74 115 66 -25 -122 -97 -35 -23 37 261 20 0 -30 -26 -56 171 -158 140 -59 -92 55 40 64 -68 57 -7 -16
4232 -16 -104 94 -123 122 17 -4 -16 -31 -27 40 -153 6 79 29 -174 -45 6 -47 50 -8 -9 -75 8 -16 -35 -76 -49
4259 -49 -94 49 106 192 9 54 97 60 105 -58 59 42 -45 -77 -138 -44 135 16 153 -180 54 66 61 175 46
4284 46 -130 -125 -87 13 4 -77 36 -61 -27 6 -17 -49 -100 56 -55 88 50 -112 127 -43 -4 184 -6 -43 22 -30
4310 -30 33 8 -63 64 -6 -10 29 107 10 14 -158 105 -49 102 192 43 -39 -46 -27 -5 100 -44 -55 -70 -88 123 -42
4337 -42 -28 -24 21 67 30 102 -137 66 -18 -17 -22 -94 -224 -37 54 -84 14 -18 15 -106 -32 104 20 -103 -37 101 -6
4364 -6 -67 -61 -87 -86 69 32 -95 -125 16 -62 15 57 41 36 -238 70 -1 -156 -32 -52 -42 -48 63 137 118 31 20 15 19 71
4394 71 54 -7 -34 16 105 -45 17 37 -47 -101 -77 4 7 -101 52 -60 -172 -76 -12 144 31 127 -31 -87 34 -66
4420 -66 -47 45 -19 90 58 49 -58 2 159 -36 175 162 -101 5 -71 -147 6 -20 15 105 21 -96 -20 33 38 58 -13
4447 -13 123 3 -19 159 -81 -17 -184 -76 78 -79 3 -80 -81 -100 1 8 32 50 106 -17 12 194 -126 -67 52
4472 52 126 -181 15 45 -139 -29 17 -98 97 -29 -58 82 70 -44 -40 54 4 -34 -130 172 -105 -130 5 85 8
4497 8 -127 -3 79 -25 60 -3 -60 -82 -72 -12 -40 83 76 36 -4 73 31 -117 76 31 59 37 54 1 34 92 214 -100
4525 -100 -109 -71 -46 43 -16 208 -9 -1 25 156 -24 196 59 35 -131 -23 104 -17 -6 19 75 78 15 -47 -26 10
4551 10 146 19 40 -88 22 10 103 97 92 106 74 128 -9 -114 -103 117 34 7 -31 -75 7 -130 83 11 -126 34
4577 34 -12 141 22 20 120 -42 56 87 -58 -41 194 51 144 181 -56 -23 37 -21 100 13 -75 37 -69 26 85
4602 85 -3 -199 -34 110 -60 83 -41 158 -18 40 44 -86 -100 8 36 14 75 -197 -145 -31 10 -102 -126 -52
4626 -52 -4 -12 83 1 96 26 -69 23 -15 -93 -44 49 49 37 -31 95 112 -137 -7 -133 114 87 -47 89 -101 -121 79
4653 79 154 88 87 53 72 21 51 -50 61 89 -43 25 84 -76 173 127 194 57 -24 23 12 51 30 5 -45 22 -53 19
4681 19 -20 -167 -28 -26 162 17 47 -24 21 -87 -73 77 13 61 -100 34 -97 21 -50 112 25 32 74 105 144 18
4707 18 -7 -11 -184 25 74 80 89 68 35 -171 -77 -115 241 -40 -46 -36 111 -90 22 -26 21 -18 -61 -58 30 67 47 -22 -26
4736 -26 125 -121 -160 103 -102 26 94 83 51 -51 0 75 123 80 -87 2 -4 -198 -88 151 7 12 -32 -48 119
4761 119 -15 1 -82 -108 87 -77 37 -134 7 6 1 16 32 94 -49 -60 -93 -4 -192 -152 29 -9 -158 72 -129
4786 -129 108 99 42 57 -37 46 115 145 28 180 -125 -88 -49 53 13 -55 115 104 18 -155 -29 -227 -3 -69 -86
4811 -86 -35 -147 41 -5 34 1 66 20 102 -134 5 -89 -7 30 6 -38 -103 88 77 152 -49 152 -52 79 120 -132
4837 -132 126 -25 -20 -123 -136 -7 3 14 66 -36 -38 -14 -69 57 -42 67 -38 61 8 -91 -144 18 -22 -49 55 0
4863 0 5 -24 80 -206 10 6 -15 -19 -18 -97 66 -17 11 -70 -28 -32 161 -124 -50 22 -85 147 7 50 -44 -97 65 77
4891 77 -115 93 35 109 57 -150 -13 103 121 47 79 -98 -4 -24 -160 36 -79 -80 -94 7 -75 -136 -31 -1 87
4916 87 -52 -15 39 -5 123 -98 -3 -19 60 -54 47 77 -77 -119 -11 -73 234 67 -11 48 99 -10 -34 12 150
4941 150 42 -22 -124 -8 -31 60 -84 73 15 -24 165 -122 85 147 -24 -26 8 36 55 39 76 -107 -71 37 138
4966 138 39 47 6 9 27 74 -83 -52 -14 49 91 62 -97 24 -35 62 189 62 83 -92 -169 -69 -91 -54 -68 -121 -97
4993 -97 56 45 5 -25 -55 112 18 160 68 -60 -36 -67 118 124 -182 -32 -5 -138 -82 -23 -42 136 111 -110 -56 -94
5019 -94 3 -103 -53 12 -60 48 -25 64 -25 116 140 -36 24 -34 255 135 10 -76 -165 -40 8 -132 82 -133 27
5044 27 15 -87 34 30 57 35 35 126 94 54 -78 -37 68 51 122 -50 126 42 -22 169 41 71 -40 -13 -20 -22 40 212
5072 212 105 33 39 -51 -40 80 180 72 -20 -43 161 -38 46 -133 58 -120 -52 -22 -12 -47 78 64 1 -131 61
5097 61 43 -6 4 -33 91 -37 20 40 5 0 98 134 59 -16 -5 -1 -27 52 21 -79 -129 -119 78 108 12 -87 -36 219 144
5126 144 -121 10 -123 50 -11 134 78 138 -63 172 56 -55 27 -32 -36 16 16 -7 -10 -40 -2 -36 -32 -111 -105 111 -27
5153 -27 -53 3 -129 34 -50 291 34 -152 138 85 140 45 1 -35 -211 -80 54 73 -48 -38 -56 -82 17 18 -1 -24
5179 -24 48 91 85 179 181 97 8 -89 79 123 15 -26 -60 -49 -112 197 -100 164 -19 87 12 58 -17 -28 -55 -48 43 -106
5207 -106 166 -68 -37 -4 -66 -172 -65 2 55 -47 -2 -85 -88 113 -72 -167 12 42 90 82 28 -108 25 -15 -36 54
5233 54 33 -5 -36 -25 40 123 -98 -65 5 -108 51 -22 -2 19 187 -16 -49 -4 -118 58 2 -99 40 -8 194
5258 194 -50 -2 28 -23 84 35 176 3 8 27 -183 -19 -20 -24 -28 -35 32 144 122 36 56 110 -88 -11 65 -55 -16 -44
5286 -44 77 -178 -11 -89 -30 102 42 -100 -31 21 166 7 -158 121 56 -14 -57 72 -3 80 -23 20 -51 32 152
5311 152 -14 -20 -116 -26 -90 141 -67 68 21 -27 213 63 187 69 -95 -226 -145 131 64 -50 -4 -8 -74 88
5335 88 175 -144 142 47 -103 -25 -4 40 103 -21 116 -13 54 -77 -67 -50 52 -37 -27 102 8 184 -84 40
5359 40 -26 5 75 71 78 3 62 -129 -159 14 14 16 -81 50 -42 138 102 74 66 101 46 -57 -43 -71 -81 -65 -85 146 25
5388 25 18 56 10 -25 117 135 60 25 40 -32 59 -82 -79 -173 12 -74 10 163 -56 -70 136 3 56 -66 141 -91
5414 -91 135 17 145 -41 -8 51 77 22 -12 83 30 -62 -102 -85 -3 123 204 -98 -42 10 82 115 186 49 -12 27 -24
5441 -24 -111 45 -134 53 -126 19 -2 -75 137 -74 -128 47 46 106 -25 81 -7 5 67 -24 128 -201 56 87
5465 87 -27 -28 84 -69 -86 107 -13 68 0 38 81 -59 82 72 41 -117 -72 -96 -57 112 25 89 49 28 -93 27
5491 27 97 75 -105 -26 -146 -22 43 120 -268 192 0 -35 39 -73 65 -1 142 122 4 -141 -35 -82 40 -44
5515 -44 8 24 -132 -40 -18 -5 6 105 -5 -124 210 -182 10 -96 -88 48 -44 245 -111 113 23 -153 -88 1 72
5540 72 50 -38 -195 -141 80 -145 48 0 31 149 15 101 -106 -126 74 -45 -99 14 38 -166 -55 4 36 205
5564 205 -38 -150 -56 7 -47 -97 2 -13 134 31 35 32 -110 -39 -166 9 -32 24 -117 -69 -114 -19 155 9 100 83
5590 83 85 5 29 -112 116 -39 103 -85 50 161 83 175 -42 97 -10 -47 -46 0 -101 15 37 -35 -76 -65 -14
5615 -14 -107 13 32 -13 -133 -73 3 -39 -25 76 -142 -40 -59 30 28 -62 -138 -44 179 -109 -12 -73 172 -66 -45 154
5641 154 64 -38 -42 22 -49 93 40 4 45 -74 -16 44 -84 -80 154 27 171 -27 70 -53 -14 -35 55 11 148 -21
5667 -21 181 -113 82 43 28 136 -24 78 -168 -73 -29 98 -107 84 -103 61 -8 40 -16 68 -36 74 -70
5690 -70 61 128 2 -223 28 130 -149 -47 -38 13 73 358 -119 186 -84 -113 69 -228 4 -55 30 -94 38
5713 38 -41 -30 118 -122 -3 31 42 59 52 104 25 -33 -82 -88 148 -2 -58 126 153 -51 -97 92 -128 47 52 -121
5739 -121 -74 -33 82 123 36 1 4 29 50 91 -43 -8 27 53 -74 126 50 -36 -76 36 -32 -74 67 -17 21 -97 -111
5766 -111 -6 -26 4 -21 21 -77 -25 127 67 -84 -124 -44 -144 38 12 51 -65 -112 29 -92 74 -51 -63 14 -162
5791 -162 188 -6 149 -14 -102 -71 10 4 142 166 -77 195 -138 -184 -87 -61 28 -161 -36 27 52 75 -124 -78 6
5816 6 -20 -66 57 -46 -94 -103 -79 -78 -11 11 35 77 40 39 -104 30 52 71 49 140 142 0 -45 -30 -114 -104 -95 -3 22 96 234
5847 234 27 14 45 96 -35 -137 -26 55 -98 -37 -96 -51 59 -136 -160 66 60 39 -20 -37 9 -32 -47 -87 80 -54
5873 -54 -30 -64 74 -59 16 3 -152 -68 -106 -114 13 2 24 -142 78 100 50 32 -51 -8 107 47 61 -18 -54 64 -38
5900 -38 6 -108 -40 179 110 -83 -15 -33 -48 159 -17 2 46 -51 -11 -195 -222 129 -12 -37 79 2 51 27 -91
5925 -91 177 9 5 -51 -127 -147 7 -56 15 -85 117 -36 9 66 104 33 157 39 -67 14 17 43 1 39 192 -12
5951 -12 7 -132 72 -230 -6 -172 -23 163 -177 -87 -40 -81 34 -19 27 206 -211 107 -151 87 -80 60
5973 60 8 -162 86 26 -6 14 -25 -123 43 -40 -83 -26 -147 -87 31 -49 -6 -123 -139 -54 -22 -11 3 7 -155 253 -69
6000 -69 -9 109 87 -97 -92 57 195 144 -18 -35 -43 -41 -9 36 185 -88 -24 -32 54 -80 83 -79 -164 91 103 -88
6026 -88 72 40 0 -31 7 91 -189 -13 -106 36 -143 -159 -102 -235 -30 -48 -137 -71 -127 -6 -113 -102 -96 53 52 -49
6052 -49 -138 -50 14 -3 61 4 3 -71 10 31 102 75 -33 110 -65 60 -14 43 11 -104 -97 -16 -47 -49 -156 15 -14 -39
6080 -39 -83 -136 9 -140 26 39 21 32 -231 -111 -52 -46 57 -28 -13 28 67 -220 -29 50 12 34 -19 -114 32 152
6106 152 -39 94 46 -141 44 -83 47 140 47 21 42 -64 119 -31 -150 117 -68 36 -190 -74 -110 -52
6128 -52 -36 -90 -5 64 115 -25 52 -172 73 180 101 -23 -130 70 -52 156 48 -39 98 -198 5 -184 -10
6151 -10 -142 12 -19 -72 -58 54 22 -49 -121 52 7 13 -38 -78 -84 -76 -89 46 131 83 -163 -72 -17 -97 161 1 110
6178 110 50 1 -7 -32 90 36 34 57 25 -86 91 61 14 -82 -44 86 -16 92 -78 -37 -48 -46 4 69 -117 52 -109
6205 -109 46 86 -2 34 -39 -46 7 -76 -56 -40 35 177 91 25 62 123 76 -74 -26 8 -114 -105 18 65 -18 51 -19 64
6233 64 6 45 63 -61 -19 -189 -177 118 67 38 -145 152 -53 35 -9 74 -9 -1 121 53 138 104 -28 26 205 70
6259 70 163 -106 7 -61 -8 95 136 -123 30 -13 64 -66 89 219 -164 -48 104 69 -82 35 28 87 -13 -14
6283 -14 45 49 14 1 -16 108 -64 16 126 -27 107 -64 -68 45 33 -41 -64 -23 -8 -14 -2 98 -74 -66 -80 -155 -29
6310 -29 -102 91 105 87 17 3 -9 89 38 -127 -68 -28 55 109 23 -71 -19 -20 7 8 103 134 -53 -120 75 140 -137 75
6338 75 8 -99 -56 -153 -193 -89 -29 175 116 -8 -146 -17 -71 -80 -17 56 34 76 100 110 17 5 68 -21 52 51 -156 -2
6366 -2 -21 -9 149 158 0 29 -117 -18 59 130 46 85 -275 -9 10 -223 -10 -98 -16 56 -45 -4 -33 -49 -26 141 39
6393 39 9 86 -143 -22 19 -41 26 100 1 -46 89 15 -38 30 -57 7 91 89 -21 162 -8 108 44 23 -17 67 -67
6420 -67 -101 -214 -85 10 133 -21 -41 100 25 24 -51 -110 151 -82 49 -26 -35 66 -36 63 -3 -2 54 -53 -107 -1
6446 -1 94 -88 -16 -106 -162 147 -24 -98 -38 182 43 26 -11 20 -101 227 18 78 -84 88 202 -67 175 -116
6470 -116 -102 -35 150 -49 11 43 -36 163 -27 -113 -28 20 -122 57 -99 40 27 -53 -95 -19 -6 -75 40 -62 -62
6495 -62 -9 -62 223 -102 -112 80 1 -48 -35 43 -85 -19 -43 26 -132 -93 36 36 -68 -100 111 -85 91 31 -145
6520 -145 -84 -59 33 -62 21 41 14 22 26 37 40 317 -77 27 -44 -67 46 152 52 -85 -9 -31 -53 -42 142 11 129
6547 129 14 -208 55 20 59 31 120 109 109 -139 -5 107 8 -73 60 -108 205 79 149 -12 4 77 -23 -15 -81
6572 -81 40 41 13 -19 119 55 62 155 45 63 42 170 1 -190 21 71 -92 -104 -51 149 87 50 82 -137 -51 42
6598 42 -72 -40 34 -12 -4 -63 -8 117 151 113 53 95 -59 -91 53 182 -68 20 -70 -66 49 -17 -85 -92 -71 -60 -39 29
6626 29 -6 -99 83 97 15 139 -56 16 11 73 102 -30 87 24 7 47 36 73 46 19 -7 129 -162 -59 162 -60
6652 -60 77 94 -13 -6 -59 148 25 -96 102 86 2 -5 -20 6 -129 67 26 69 102 41 -17 2 -10 -167 103 57
6678 57 -32 -52 -93 228 -84 -166 66 103 -70 18 -40 -113 -20 128 -39 -99 85 116 79 224 124 -1 -6 46 83 -22
6704 -22 37 -12 -36 48 -52 25 -44 8 -20 45 24 3 12 -60 -35 94 -161 27 -97 -8 14 37 -48 -69 -32 103 59 -129
6732 -129 -118 62 -139 84 96 -121 56 51 -183 -89 -88 64 53 32 100 -93 154 33 9 86 -37 -81 -49 -140 62
6757 62 17 58 -17 -102 -23 -107 17 -118 -8 49 -95 93 26 23 -114 -29 3 -17 -185 49 -153 -75 38 -110 -19
6782 -19 -74 -34 -21 -51 74 -74 -6 -49 43 -140 218 34 48 -37 121 -45 -264 -144 110 33 13 -53 16 -77 -48
6807 -48 -93 42 -43 -140 41 -40 83 -77 4 10 15 -7 -50 20 60 72 82 70 76 48 87 89 127 -44 31 5 -173 0 -48
6836 -48 106 -41 -127 63 40 -19 126 19 1 61 34 -92 83 -48 -99 -38 -148 -21 -53 112 -62 78 -31
6859 -31 -129 122 -45 84 -178 92 144 -67 19 34 22 -17 108 -72 151 69 118 14 -43 35 -87 -165 56 105
6883 105 -80 75 169 -63 -47 16 35 -71 -179 -128 71 140 36 -70 6 13 -26 -69 -7 15 -34 -97 -125 103 75 -71
6909 -71 170 168 71 130 39 92 183 -68 20 -50 -79 -169 -54 -4 -18 8 -70 -164 4 -127 -11 -119 191 138 -125 30
6935 30 -143 -174 2 -63 6 84 -54 21 65 147 165 43 92 76 162 -61 -35 98 104 11 -38 -63 108 -61 20 46 31
6962 31 157 -22 131 153 -25 -55 76 -69 28 -67 -54 79 0 20 36 -57 -6 -61 -74 -64 -76 4 -18 31 -75 46
6988 46 -56 -22 -10 -39 -115 127 -21 162 98 -46 -14 7 41 95 97 25 -2 -2 -40 -85 -71 107 107 86 -22 -62 64 59
7016 59 25 34 117 -62 -41 -78 12 13 2 -2 6 62 -28 -88 0 -15 -2 30 70 -41 -23 65 89 113 120 -71 50 39 54 -128
7046 -128 -19 147 91 185 -56 53 -83 35 118 100 84 40 118 87 -55 -31 66 140 58 83 -48 -76 82 -47 -68
7071 -68 -108 -59 -79 92 -79 14 72 -5 70 -44 0 16 -64 95 53 10 -78 -46 19 -6 -20 -130 -48 -190 -70 70
7097 70 77 41 -51 -10 7 -27 71 -121 -50 73 -11 -4 -45 64 138 -69 73 -207 -76 -107 105 -100 -118 -148 23 -84
7123 -84 70 82 -20 91 139 156 91 -209 108 -78 -29 -140 24 -34 -101 6 -52 -2 -115 41 -8 -7 -159 -24
7147 -24 -20 28 -42 101 -13 -16 -90 -36 -147 -104 -103 -25 -105 -18 87 -144 47 25 -118 -71 -30 12 139 24 0 76 -82
7174 -82 -10 1 47 49 170 52 -157 -149 47 -135 102 -91 110 21 -30 -50 -38 115 105 66 33 -10 -135 10 -67 -64
7200 -64 10 153 17 153 69 -9 67 -6 73 -126 -35 44 29 11 -44 -77 -121 -32 68 81 -101 53 5 60 -57 -109
7226 -109 -114 -82 -108 40 27 20 -27 37 -108 87 68 54 137 -55 -3 4 -79 -6 68 86 -35 52 -92 77 22 173 41
7253 41 62 113 46 66 12 85 19 30 5 119 -7 96 -107 70 -40 -130 -128 -178 127 9 9 82 -36 15 63 65 3
7280 3 73 119 40 188 95 -102 93 60 35 129 -79 -93 55 176 -45 60 106 -79 -78 54 2 113 -21 27 -17
7305 -17 -9 129 -90 -129 -58 -37 -2 -104 -148 -12 96 93 54 4 -66 -46 23 -8 -161 56 12 -30 -103 74 -18 -142 49
7332 49 -128 35 130 -61 34 -92 132 18 -77 68 -89 -107 19 75 -33 54 -26 43 18 58 -72 35 7 -2 -103
7357 -103 -73 155 134 -52 42 -32 -40 -107 29 -44 -47 -160 -67 -9 -16 98 34 -25 -67 -4 138 9 22 -38 189 -109 -33
7384 -33 -8 71 -16 -119 58 12 32 164 8 -86 -99 -15 142 -9 53 -71 -137 2 58 -5 -41 74 -88 116 -79
7409 -79 -73 -43 24 -71 159 -19 -8 104 17 -95 -157 -146 -35 -82 119 -89 85 6 74 -29 149 251 -47 132
7433 132 -51 -209 -58 23 209 -5 -62 8 20 11 61 118 15 23 184 -24 158 -126 40 -2 76 25 14 129 -154
7458 -154 9 145 44 -90 61 -63 -152 76 8 172 -48 -5 -145 51 60 43 -36 110 126 -120 1 -83 -32
7481 -32 -83 91 -41 -29 49 -88 31 116 23 12 28 73 -131 -20 149 -14 59 42 -52 47 40 55 62 11 50 97 -20
7508 -20 163 -3 -8 29 20 79 43 -126 15 -27 -109 90 76 103 16 5 -302 12 126 -8 -56 -54 109 -66 -117 -93
7534 -93 10 -33 -51 14 -33 64 -22 -30 -97 144 142 -59 30 -97 103 89 39 -87 -55 -22 243 44 6 -91 9 121
7560 121 -38 -66 22 166 -46 24 53 -45 18 -117 50 -13 -58 -8 -128 -101 -147 -33 44 -52 137 21 41 -81 59
7585 59 49 -84 51 88 36 120 35 91 19 -5 143 70 -48 -42 14 187 -34 76 -11 162 -7 -67 -42 33 116 85
7611 85 6 34 -169 -41 -16 192 -29 55 -26 39 212 -56 -46 -107 -14 65 -32 8 -87 75 -19 -103 23 -162 -176 150
7637 150 -40 -41 -45 -37 18 -7 200 11 -77 -27 29 156 -73 25 54 -42 -16 -59 165 -40 98 34 -196 29 -81 66
7663 66 77 43 13 100 112 63 2 -51 49 -63 99 47 43 59 4 -67 17 -12 -18 57 18 8 8 -43 -27 -49 -1 -78 67 -70
7693 -70 -84 -17 0 5 -7 8 23 -45 -46 -49 -4 160 -22 -69 -31 118 11 31 -32 114 -7 -19 95 -115 -55 81 -117
7720 -117 64 -4 -249 95 52 166 134 -65 8 93 38 147 94 -25 86 27 40 -28 4 -40 123 -161 -14 -143
7744 -143 -87 85 -29 94 -44 49 67 63 108 -11 -105 34 57 135 21 -56 91 196 68 -63 153 51 -13 100
7768 100 -108 12 30 65 -2 6 -62 39 -135 -55 91 -61 -31 -42 136 -91 39 46 -18 47 -53 -2 65 138 31
7793 31 -23 -167 145 111 -28 22 21 -104 120 -34 -54 -24 24 -17 86 39 173 60 -89 148 -32 36 88 123 16
7818 16 89 76 -35 20 -43 64 10 -9 -183 -82 39 146 79 -15 -119 66 -52 -182 139 -38 38 -125 -9
7841 -9 136 -82 -107 -30 72 177 -20 -9 202 -40 48 -9 -43 69 56 26 -145 -44 -5 53 111 -17 -251 74
7865 74 167 -34 -133 -193 26 108 -137 -44 -6 71 -61 -84 45 3 135 83 102 43 92 -138 -87 134 49 99 77 195
7891 195 92 51 47 -30 86 -2 -54 101 191 38 59 7 48 53 51 -47 73 128 72 63 52 239 -47 -101 -57 16 139 -35
7919 -35 70 -41 93 178 29 -56 -3 73 10 16 82 -89 -67 -15 121 124 154 22 24 7 68 -66 -173 -158 -67 -54 59
7946 59 28 10 -47 -40 -21 25 67 -97 208 -67 -77 -102 141 56 -4 -17 134 -38 261 -35 -94 -147 4 -64 15 -139
7972 -139 223 -25 -30 -50 -102 -15 278 121 -34 53 -134 -81 59 32 108 -66 40 145 46 -150 -52 23 -171 -75
7996 -75 68 43 26 -2 66 -73 65 -8 71 31 -7 -11 99 277 73 177 -35 -48 -58 -107 -57 81 14 6 51 -5 105
8023 105 25 -85 -68 -21 -153 -24 -28 167 5 99 -138 -55 -3 -69 7 -72 3 -21 -122 -31 4 -204 -67 90 6
8048 6 -132 -35 -124 -95 -106 98 4 -96 117 -6 49 -19 83 78 128 -118 -47 -206 16 103 72 129 -6 131 164 75
8074 75 20 -33 18 88 82 -182 38 110 32 -94 144 14 89 -149 -86 1 2 -28 -78 15 -2 -175 -50 43 20 10 -93
8101 -93 42 -84 -39 13 -65 27 56 -198 -88 -31 57 19 59 93 -6 -41 -92 177 -125 -55 106 20 39 24 -12 83 40
8128 40 -52 30 -184 -60 143 82 -61 75 -82 -16 -14 113 98 -93 -1 -119 48 57 24 3 32 93 -4 78 11 -44
8154 -44 -43 -85 -53 -97 11 -166 -69 -16 99 -51 25 -178 115 104 25 -66 -31 -11 131 84 11 -42 -49 -43 -86 24 -53 -5
8182 -5 -87 157 -85 -11 127 5 23 56 90
8191I0
$$ Imaginary data points
##PAGE= N=2
##DATA TABLE= (X++(I..I)), XYDATA
0 0 0 0 0 0 0 0 0 0 0 -8 0 -8 8 -16 9 -17 20 -26 32 -40 48 -56 66 -76 92 -105 124 -140 165 -188 216 -245 278
33 278 -315 356 -400 449 -505 561 -626 696 -776 859 -950 1052 -1162 1281 -1412 1557 -1717
50 -1717 1890 -2082 2295 -2533 2801 -3103 3447 -3842 4304 -4849 5508 -6319 7348 -8703
64 -8703 10572 -13328 17809 -26327 48299 -228322 -365503 242553 446837 530755 777583
75 777583 889159 726153 797436 851794 643363 427088 322349 132958 -2524 -103442
85 -103442 -268710 -381651 -395108 -480933 -502224 -399625 -401107 -481237 -355943 -181621 -196292
96 -196292 -197500 -23707 63034 21012 102442 245165 225340 182467 253790 295349 254059 231676
108 231676 217775 194760 160338 73402 12428 23902 -55454 -185687 -162338 -134663 -250709
119 -250709 -264133 -138266 -139000 -193387 -96134 9932 3778 17952 90079 121888 97273 78329
131 78329 104161 117991 55345 1844 28182 33497 -22627 -34410 3242 -4371 -41140 -20566
143 -20566 34440 25220 -21571 5381 56809 18678 -18368 32519 35031 -38515 -32388 17503 -18702
156 -18702 -62613 -38065 -23351 -40998 -40651 -23536 -8036 -6905 -17346 4066 42732 24764 -3620
169 -3620 34478 55041 8558 7153 54654 31364 -17565 16073 47730 -406 -19220 20891
181 20891 9468 -31092 -14603 1520 -26869 -38701 -29042 -27976 -21670 -24448 -35490 -11052 4737
194 4737 -24154 -5590 44077 11239 -17041 41526 49315 -4287 19134 55256 10082 -7283
206 -7283 32013 21996 -9663 28 2247 -11087 -8624 -14548 -20980 -8443 -19267 -37145 -9801
219 -9801 2717 -32832 -27058 13840 -3236 -27173 11706 26971 -10630 -3174 35780 21782 -1226
232 -1226 19412 27792 7395 7678 17964 11621 3410 -3486 -6263 5719 238 -23250 -12172 4304
246 4304 -22906 -29837 5888 -1910 -36976 -14188 13556 -12219 -19918 10626 10181 -9782 2192
259 2192 21872 16191 4750 8839 20031 19187 6929 6578 17670 8338 -10877 -539 14945 -5855
273 -5855 -24186 -3247 6582 -18534 -20432 6362 -2235 -29078 -11656 12125 -7748 -21801 20
286 20 7509 -8386 -5411 12025 11474 -839 938 15554 20050 4706 27 18037 16829 -5523
300 -5523 3298 23570 1891 -19951 3702 13733 -16722 -21325 2315 -7688 -28472 -12206 3482
313 3482 -10988 -18161 -3189 5602 537 -2335 3592 10179 3833 -4570 9010 20207 134 -7310
327 -7310 18720 19147 -5547 5294 24009 830 -13722 9673 10703 -15383 -14329 -256 -8591
340 -8591 -16526 -8467 -3739 -7794 -12434 -9620 1687 2538 -11108 -7037 10339 2096 -8744 11991
354 11991 20171 -3116 -162 25154 15724 -3767 8743 16560 -2726 -6642 8094 3851 -10477
367 -10477 -8855 -1009 -1264 -7034 -9756 -4057 -2988 -13221 -12062 3065 -2100 -18718 -6051 11732
381 11732 -1736 -8136 13908 14825 -4722 3919 22571 9877 -4684 6664 12415 375 -1971
394 -1971 5674 4694 -3524 -6821 407 5336 -6470 -14955 -3054 262 -15901 -13657 4556 -4336
408 -4336 -19918 -1686 13370 -3351 -7728 11157 10553 -3379 3677 15528 6464 -2841 3914 10702
422 10702 7104 675 1315 7146 2842 -7181 -576 7669 -7436 -17717 -1020 3427 -14948 -11741
436 -11741 5257 -4447 -15166 1454 8907 -5311 -6822 4728 5030 -322 1990 6536 6379 2051
450 2051 1886 10414 12007 -682 -1792 10383 4639 -8125 316 6687 -9109 -13322 3015 2049
464 2049 -12939 -8307 2407 -5016 -9599 -84 2529 -5201 -6066 1218 5204 2167 -735 3619 8333
479 8333 3098 383 10613 10528 -3700 -1027 11887 4056 -7215 2191 6134 -7112 -7832 4307
493 4307 65 -10685 -7094 3 -3304 -7378 -3942 -207 -3213 -6107 -445 6228 1511 -4802 2764
508 2764 10001 2047 -1223 9668 8701 -4170 514 13025 4263 -7057 2050 6598 -4746 -5552
522 -5552 3112 -757 -8907 -6484 -1010 -1419 -5866 -7206 -1648 565 -5708 -3918 6299 1966 -7960
537 -7960 2583 12157 455 -3288 9357 7733 -2943 3053 11134 2423 -3972 2376 4814 -443
551 -443 -2423 -1315 -1083 -3477 -6471 -2730 1280 -5749 -10636 -709 2701 -7201 -4641 6254 -667
566 -667 -7593 4603 9231 -1952 -1322 7730 4763 240 4494 5957 2098 175 1254 3584 3260
581 3260 -3210 -3688 2727 -807 -7099 -623 2377 -7900 -8294 2885 399 -8611 -3052 2686 -3572
596 -3572 -4409 3837 4182 -1775 -590 4766 5291 2551 2071 4535 4439 390 672 6071 3137 -5129 -1494
613 -1494 5185 -1558 -6703 601 1181 -7768 -5652 2699 -1392 -8239 -3132 1666 -1914 -3817 1085
628 1085 2979 -1159 -1893 4196 6306 558 -1144 4606 5666 -12 779 6319 2590 -4043 666 6301
644 6301 -464 -6489 -316 1691 -5977 -5401 1780 -1776 -8078 -3293 2120 -1251 -3559 -379 1594
659 1594 -138 -1057 1974 4518 656 -2500 3592 6997 -17 -797 6321 3665 -3429 2107 6382 -1809
675 -1809 -5610 1401 1566 -4443 -3099 274 -2676 -4671 -2241 337 -745 -3564 -3451 993 1281 -2744
691 -2744 -392 4482 -124 -3011 5614 6910 -1652 -375 6638 2073 -1903 3444 3821 -2835 -2220 1728
707 1728 627 -1639 -2355 -2120 -772 -2036 -3652 -363 -32 -5686 -4086 3271 441 -4815 884 4293
723 4293 -1807 -987 6026 3546 -2127 1024 5020 2118 6 1782 2389 -188 -1336 824 2735 -995
739 -995 -4511 -736 1762 -3025 -4665 694 -506 -6085 -2306 3729 -1014 -4945 668 3050 -990
754 -990 -757 3564 2402 -1130 388 4206 3449 -116 -282 2950 2297 -1050 444 3095 -1225 -4302
770 -4302 176 2336 -2914 -4578 -123 -155 -4282 -2239 2203 -1143 -4628 -418 2928 -375 -1566 1676
786 1676 1889 -314 679 3626 2959 54 -298 2774 3281 -558 -397 2691 142 -3278 588 2845 -2745
803 -2745 -4457 678 422 -3820 -1549 1069 -2156 -3373 350 1555 -676 -1476 299 1644 1161 161
819 161 1726 2952 -87 -836 3708 3725 -1667 -573 3427 286 -2583 1679 2135 -3432 -2995 1513 -98
836 -98 -2792 -1452 -652 -1606 -1796 -897 695 30 -2261 -845 2968 1163 -1909 1756 3468 -1057 -239
853 -239 4649 2371 -2327 569 3623 257 -1456 1261 836 -1966 -1470 526 413 -1863 -2937 -650
869 -650 400 -1972 -2246 909 96 -3383 -378 3560 -52 -2678 1665 2963 -717 162 3626 1567
885 1567 -1317 627 2997 1011 -925 -135 972 6 -1248 -253 980 -1662 -3339 -66 1473 -2093
901 -2093 -2765 632 232 -2746 -47 2518 -871 -2223 1137 2620 91 0 1957 1226 -482 887
917 887 2302 1135 -680 -507 1293 1119 -1083 -604 723 -1249 -2338 413 1184 -2515 -2605 804 -190
934 -190 -2257 -47 1166 -1235 -1434 1382 1753 4 -276 1135 1437 548 574 1521 1095 -972 -401 2103
952 2103 1013 -1858 -594 1375 -1152 -2030 1062 638 -3073 -1961 1208 -324 -2142 -343 604 -858
968 -858 -768 832 1197 -147 -926 852 2097 668 -340 1172 1436 -909 30 2730 799 -2114 -136
985 -136 1718 -789 -1700 560 -15 -2562 -1337 817 -149 -1702 -1138 216 156 -772 159 912 -107 -1024
1003 -1024 617 2584 275 -935 1490 1868 -415 340 2439 329 -1813 409 1784 -562 -1462 0
1019 0 -208 -1195 -711 105 -303 -1478 -1217 216 600 -910 -935 856 195 -1131 914 2241 -340 -1059
1037 -1059 1705 1568 -398 319 1507 -88 -934 932 1108 -597 -778 -267 46 -225 -826 -315 -153 -1179
1055 -1179 -1281 540 567 -1644 -963 1091 57 -1159 1022 1356 -1035 -280 1896 1308 -552 356 1145
1072 1145 257 -70 667 559 -211 -908 -327 934 -239 -1423 -343 442 -1454 -1113 876 -7 -2127
1089 -2127 -614 1155 -258 -933 601 809 -497 -119 1397 1322 -448 -103 1225 1187 -4 -134 983
1106 983 326 -1035 204 1429 -501 -1868 -163 727 -1118 -1028 500 -169 -1691 -551 1049 -42
1122 -42 -1080 9 793 96 -141 951 842 -477 -72 1035 1295 85 -496 792 591 -518 174 1039
1140 1039 -319 -1374 235 788 -1065 -1327 186 -307 -1200 -72 731 -391 -1119 -248 540 266 -254
1157 -254 52 394 151 -164 973 1471 -271 -683 1136 950 -712 29 1203 -529 -1171 779 649 -1258
1175 -1258 -941 143 -183 -720 -223 -21 -359 -856 -411 780 540 -743 -250 1144 372 -549 1148 1361
1193 1361 -805 -460 1735 568 -801 229 891 -506 -523 513 232 -813 -884 -292 294 -318 -1013 -162
1211 -162 248 -813 -750 1011 273 -1408 -37 1184 -63 -540 867 676 -494 -58 1232 520 -385
1228 -385 -147 624 460 -335 -157 225 -269 -1081 -129 747 -332 -1379 10 503 -853 -451 537 -146 -1053
1247 -1053 126 1088 -27 -461 396 644 151 95 671 588 -397 -267 705 711 -326 -119 234 -34 -727 100
1267 100 372 -699 -1301 -8 483 -728 -636 291 -247 -808 246 726 -85 -529 258 579 102 138 432
1286 432 391 -179 8 706 665 -499 -579 396 357 -679 -51 397 -588 -985 386 297 -840 -684 350 -113
1306 -113 -575 276 339 -275 -440 272 661 438 -176 152 571 25 -123 909 735 -666 -320 1032 151
1325 151 -729 -34 437 -625 -465 456 -26 -963 -513 -80 -108 -81 -216 -51 104 -366 -50 759 347 -642
1345 -642 -113 922 8 -214 832 381 -313 193 753 155 -581 259 292 -65 -137 2 -5 -339 -599 11 245
1366 245 -353 -610 21 199 -392 -67 539 -104 -580 420 840 -190 -88 466 239 -88 345 520 89
1385 89 -360 16 369 75 -287 -361 -71 -258 -273 56 182 -514 -547 193 160 -648 -92 313 -435 -313 598 562
1407 562 -234 -400 516 259 187 306 402 -138 -232 209 387 139 -483 -50 113 -146 -295 162 141 -556 -517 573
1429 573 123 -647 -165 216 -410 -295 449 286 -462 -93 585 379 175 -70 259 139 12 -62 322 107
1449 107 -385 30 619 -186 -638 -73 145 -465 -325 458 -103 -589 -162 232 -77 -72 104 166 -60 -78 178
1470 178 422 93 -389 152 480 132 -55 553 109 -478 81 515 10 -562 202 24 -287 -31 95 -299
1490 -299 -537 -133 307 150 -215 -110 175 56 -134 270 299 -196 -336 523 594 -150 -150 427 90 -109 278
1511 278 314 -255 -594 156 79 -295 -215 -66 -151 -380 -152 224 56 -413 -260 180 58 -209 128 309 -196
1532 -196 -132 490 384 -265 -55 377 82 -96 212 140 -382 -254 259 152 -132 -368 -47 36 -172 -227 176
1553 176 -34 -510 -229 456 60 -369 -151 151 -63 80 465 235 -428 -53 532 292 -173 107 84 -47
1573 -47 -126 31 215 -41 -529 -9 429 19 -468 195 256 -379 -113 293 -291 -560 -48 292 -111 52 11
1594 11 72 35 44 295 15 21 -212 142 292 43 -57 178 -12 -431 64 329 -80 -307 149 -82 -178 121 190
1617 190 -192 -237 55 242 102 -11 -76 -42 55 124 174 249 -102 -72 146 373 -12 -105 292 -87 -195 313 131
1640 131 -286 -319 160 160 -124 -48 -12 -228 -134 20 126 44 -138 -60 257 175 -125 268 122 -126 -140 363 194
1663 194 -223 -27 178 1 -132 125 -144 -395 -171 263 11 -93 -339 -18 -77 -134 12 42 -36 -402 23
1684 23 396 207 -232 164 78 -25 124 416 11 -314 -125 198 -10 -111 -55 -245 -47 -9 79 217 -203 -203
1706 -203 -95 54 -62 -178 79 -82 -219 84 354 -34 -237 27 126 211 85 101 -98 -107 -3 50 53 -69 93
1729 93 73 115 -95 154 -134 -274 -266 73 39 -233 -115 107 -55 -97 272 337 -172 -80 182 325 -1 151 28
1752 28 -102 -87 116 89 15 -100 -235 104 94 -60 259 93 -168 -149 216 14 -377 -111 77 98 -42 24 71
1775 71 7 -261 215 43 134 121 -196 176 1 -19 112 162 -48 -39 253 3 -242 -121 204 -207 -186 194 64
1798 64 -525 -114 59 -16 -100 -8 -60 -154 94 49 66 -68 -43 -36 289 62 8 -42 177 -64 -24 114 91 -246 -24
1823 -24 160 -58 -50 191 -184 -213 119 -23 15 -142 -249 49 32 18 90 52 117 -104 186 239 -45 -84 133 -101
1847 -101 -59 111 42 -86 -311 92 30 -52 -95 -240 12 19 5 13 -41 -139 -144 248 119 -75 55 228 -6 -211 61
1872 61 141 -304 7 54 -7 -102 70 104 -204 64 97 35 -134 -135 30 22 -178 -17 -19 -211 -128 -33 78 113 -154 15
1898 15 94 10 34 108 -18 -99 127 326 341 -257 -159 166 63 -32 -41 82 -96 -146 -118 161 -111 -238 -104 33
1922 33 -161 -57 150 43 -224 -18 258 21 -80 118 183 -147 8 176 24 -154 44 109 142 36 -229
1943 -229 -82 -116 -46 -57 153 -6 -261 -56 280 -37 -198 124 41 -192 66 191 -9 -261 -26 -26 105 -3
1965 -3 -106 95 125 -92 80 200 -72 -254 83 -72 -195 15 -24 -186 -135 34 96 -77 -186 91 -158 -14
1987 -14 -11 127 -94 -83 -19 -4 124 181 26 36 38 -8 106 218 -87 -172 208 20 -17 -70 262 7 -77 125 66
2012 66 -11 -37 -155 -102 -22 -116 23 -175 -201 -27 156 -53 -143 126 319 -24 -30 39 29 -45 -92 251 143 -196 26
2037 26 97 8 44 66 -19 52 6 20 63 117 -110 21 123 -30 14 160 136 -217 50 141 -14 -234 63 60 -13 -69
2063 -69 111 34 -9 84 22 35 -68 -42 46 -2 -147 -5 134 -65 -204 46 3 -2 -51 65 -194 22 182 126 85
2088 85 -50 -1 -81 -24 162 -118 -168 46 160 52 -5 -21 -110 12 -111 178 17 21 -389 -119 271 -10 -232
2111 -232 36 40 -181 -34 94 14 -42 -30 -164 -5 98 89 -90 9 8 13 8 57 -182 -118 61 -39 -55 -90 -7 59 40
2138 40 173 35 -135 75 -38 74 32 25 41 0 -85 40 40 11 -48 35 66 96 -77 83 -47 -160 66 107 -27
2163 -27 15 -40 171 -4 42 -45 -25 -210 -34 32 41 154 -110 -99 215 -161 126 -40 77 41 120 -71 -61 72
2187 72 12 -32 70 78 -72 -13 -161 -80 -27 31 -174 -7 -34 -24 7 7 107 -58 -51 63 -10 -74 32 -117 -55 216
2213 216 -5 143 -75 -2 11 -100 1 81 152 32 -95 -68 50 -38 -23 -14 -39 -33 172 -53 24 -84 234 134
2237 134 -34 137 61 -52 -13 130 54 53 -12 125 0 4 -147 143 -27 10 -48 101 52 -25 -172 67 -13 -40 -14
2262 -14 36 -168 -68 47 23 89 -77 42 2 -56 18 -86 183 58 -1 105 -26 1 -27 -51 89 -152 115 134
2286 134 39 -96 54 170 -135 36 -26 118 32 163 131 1 19 31 84 50 -68 -98 61 -27 -5 -53 174 73
2310 73 62 94 -74 -15 61 172 -105 -93 77 132 -89 73 -55 -63 1 103 -61 -106 -23 -151 95 -22 166 37
2334 37 -3 14 -55 -7 -49 37 -72 95 1 -24 -2 -19 101 -27 -17 -65 -46 -54 -12 69 46 43 -3 98 -51 -85 40 -42
2362 -42 -108 225 27 31 21 139 17 -175 74 120 -34 58 -8 22 -13 -13 26 -94 201 -22 -48 3 -93 -77 121 -143
2388 -143 20 124 23 -107 -193 49 10 -83 -52 -12 37 37 50 16 -110 77 -148 60 47 17 80 -50 95 -18
2412 -18 -144 67 100 50 26 -1 108 -51 192 -150 107 71 40 -68 -75 -6 42 -57 -67 -54 -15 14 16 91 54 41 -37
2439 -37 0 69 68 -61 140 -115 14 5 66 -168 -70 -24 -15 23 -176 -38 -51 79 114 31 -141 110 -3 13 87 4
2465 4 48 42 -138 87 15 14 -192 13 55 -124 -34 -77 7 -16 143 23 -56 -29 -93 -176 2 46 43 -82 112 56 -32
2492 -32 51 -41 -53 -125 -88 -44 183 39 -4 -101 -35 -37 40 1 44 100 -100 55 -17 -3 -76 -79 16 124 -156 -27 17 -30
2520 -30 -14 -65 -60 93 87 43 -54 77 129 191 -29 -12 -82 22 30 102 37 176 74 51 66 56 -65 81 68 144 -17
2547 -17 -54 29 29 -111 57 72 -90 89 17 -15 -73 105 85 -137 -62 -8 -8 -79 -66 24 -139 87 32 35 -105 28 -26
2574 -26 -172 62 35 41 23 -52 118 -34 82 -52 -139 0 46 10 34 117 187 22 40 88 50 65 46 -86 7 38
2600 38 -30 51 30 -7 67 -36 -123 36 166 0 46 -2 16 37 -103 -45 -33 40 -173 -15 -24 81 0 73 106 -30
2626 -30 79 96 38 -15 -6 41 -167 7 2 -14 72 -30 -2 41 -39 -148 128 56 63 212 -75 -82 86 -60 -58 -112 -20 70
2654 70 163 108 33 -36 -89 1 -13 87 88 -31 -60 -139 38 -22 -93 -77 87 -7 62 -3 93 -113 71 12 -22 40 23 3
2682 3 -193 -40 12 3 -151 35 -57 29 59 -25 166 -48 41 104 -9 -23 4 -72 21 -89 -57 87 96 61 -167 -30
2708 -30 38 -189 -87 -30 -87 188 100 8 -36 -52 148 68 17 -69 -49 -65 -7 51 -2 36 26 11 18 -10 86 61 67 130 45
2737 45 44 -35 -153 91 -75 -15 72 -101 -110 -18 62 -37 -134 -6 1 19 -27 44 46 147 -118 -119 115 42 -48 -62 -166 -29
2765 -29 24 9 46 -49 -64 -42 102 185 27 53 3 -113 -91 46 -41 -72 -128 -9 -168 -92 168 -30 -14 51 -131 -45
2791 -45 -78 -157 58 -9 -36 99 -79 -77 -3 65 52 33 46 72 0 -12 12 -45 -54 131 7 42 -141 32 -195 -116 129
2818 129 114 -49 40 19 33 22 66 -43 -21 119 -49 -48 22 -77 166 62 -148 75 73 83 -20 93 55 -13 -86 109
2844 109 146 -174 149 13 29 22 93 -182 -51 -24 -76 29 -48 58 -60 18 108 -31 42 8 -10 36 -62 11 85 -43
2870 -43 -102 -112 -29 -10 -60 -71 30 -60 -52 138 67 113 -91 -6 -73 -220 -17 -66 58 179 -23 -39 18 91 6 27 82
2897 82 -7 -1 24 169 4 97 -7 30 129 200 -135 -125 -166 -71 43 11 19 -87 -81 42 -87 62 -3 -16 -122 -167 2
2924 2 0 -18 -99 27 -37 50 -40 -78 35 19 32 -108 115 -90 -32 -61 -96 -23 116 8 -44 -15 61 28 16 35 110 62
2952 62 -85 126 -81 9 56 -20 -12 -23 -104 -45 30 -130 -152 19 17 -20 -14 -94 -43 175 -96 -36 34 80 64 83 -50 -113
2980 -113 -93 16 -37 -93 -6 -28 -54 44 123 -163 -83 36 58 79 -25 -43 117 -47 33 -74 -39 -137 -117 -115 -150 -29
3006 -29 -53 12 55 -20 125 -89 -6 -24 48 -59 94 92 109 4 113 16 -23 126 171 82 -10 -112 61 -26 -42 10
3032 10 -76 -78 179 -115 92 -25 36 -43 -115 56 -32 -8 -52 5 -50 61 18 55 14 143 -9 8 -69 -144 37 -62
3058 -62 -73 -35 -24 67 -11 103 -132 91 -79 100 -32 -88 -2 -15 -61 -153 107 56 -36 9 -130 -56 71 -29 66
3083 66 118 -46 72 6 -1 -5 -111 -92 -70 -1 -90 23 -159 -91 18 29 36 88 -118 64 95 -41 9 -66 -11 -111 19
3110 19 -2 -131 -53 -162 80 -72 -78 -24 80 21 15 122 -21 52 109 -49 11 -96 -49 162 134 -14 34 -78 128
3135 128 -7 -20 -58 -2 179 -122 -65 -30 12 114 14 -90 -20 -3 19 -247 127 -49 13 -152 5 132 -49
3158 -49 31 105 50 158 59 -81 104 -20 -157 57 -11 126 -22 58 -63 -73 63 -45 -86 -47 131 15 -62 -80
3182 -80 -139 -58 7 35 52 -33 -36 -63 -74 -72 99 129 -55 30 -117 72 -49 55 -31 17 92 16 -7 -97 -171 177 15
3209 15 109 61 -117 -30 -17 -146 -120 -26 147 -111 80 -75 67 66 -70 -33 102 -33 115 -111 -188 -183 27 -12 -35
3234 -35 109 39 -26 25 -95 -193 -38 203 -22 30 186 -2 -114 -40 19 4 78 -5 -40 -15 32 89 147 -103 -122 -37
3260 -37 34 72 80 -10 67 40 -7 85 -94 56 -181 72 -28 -57 -112 21 -75 134 38 -168 -45 -36 106 -4 155
3285 155 -33 -55 71 -54 -8 4 -7 -74 46 19 -15 -64 122 -134 41 -14 -53 -12 -216 115 -39 80 76 -104
3309 -104 42 -140 58 94 -24 58 -51 -131 1 122 36 -41 90 134 60 63 -71 -42 -112 75 -21 -1 13 -40 -44 -84
3335 -84 -25 99 89 39 -62 -9 -20 31 17 26 -38 -57 53 29 101 -89 37 -14 -118 -44 130 -75 -184 145 27
3360 27 -101 -70 66 -37 44 118 193 -51 -47 74 -16 70 -103 -52 -43 20 -114 32 -119 -9 98 -32 89 -65
3384 -65 27 30 159 -59 100 46 -32 -49 113 13 45 -7 60 -125 -51 -44 6 29 38 8 -62 136 -81 126 127 25 86
3411 86 -59 51 -158 68 -46 -140 90 -101 -127 -30 -22 -7 68 -19 2 97 -115 39 96 -79 -74 21 -136 217 49
3436 49 -18 -59 27 -81 3 16 -23 56 32 -33 -67 86 114 -9 -144 67 -38 56 -1 -60 60 -11 12 -58 -27 -197
3462 -197 -3 -48 6 -154 -53 -175 55 -63 81 -100 -70 -51 -13 0 -73 -215 0 12 1 97 -36 -157 -7
3485 -7 -71 49 127 109 -22 -78 162 -75 -59 30 99 59 -66 80 -37 118 -29 161 33 94 9 -1 -134 8
3509 8 3 7 17 -94 35 168 28 -44 10 -67 47 -10 -36 -180 -89 133 -39 -89 -114 40 44 -204 100 -77 41 -65
3535 -65 27 40 -39 39 56 99 33 -1 -104 99 80 63 -37 -122 -155 -113 -171 32 157 55 -27 14 45 86 -57 10 -150
3562 -150 51 18 13 -109 41 129 200 19 38 31 76 70 -10 -85 -122 72 -133 229 77 -83 -181 174 -59 -16 -27 -155
3588 -155 -72 -85 -119 76 -15 161 -100 -79 39 42 20 -70 -57 -87 73 -207 -21 55 31 193 40 21 -95 -67 -13
3613 -13 1 -10 -62 102 102 66 68 -55 -23 62 -57 -87 30 -105 -109 -104 -22 20 -43 65 47 -89 109 39 20 -36 89 -139
3641 -139 -70 7 -1 43 -108 64 89 -105 22 -9 -56 -24 91 -98 126 -7 1 39 11 -184 106 -204 -38 -78 111
3666 111 105 27 -143 -58 -109 -38 -156 -85 218 16 -96 45 -141 91 -72 -66 -54 41 8 -32 -66 93 81 59 -100
3691 -100 -34 8 -3 -75 32 146 1 -204 -19 7 -63 -34 19 15 193 66 71 28 -28 -47 34 -153 69 3 14 39
3717 39 -115 -67 -30 41 -77 40 140 -32 59 61 -19 80 -116 -8 -35 -18 92 47 11 -56 -101 14 -77 -1 -139 -89
3743 -89 97 -75 71 -140 4 -187 -26 32 67 22 -19 120 4 -150 -142 37 38 -7 54 87 -45 186 -64 42
3767 42 -43 -210 26 26 -76 -19 61 24 -122 -66 -29 75 32 -144 -46 114 -63 98 -152 69 14 32 175 -4
3791 -4 -88 -159 -67 98 -95 -109 139 -62 65 172 -97 -51 58 1 -80 -10 113 -13 17 102 -54 91 -107 17
3815 17 6 118 142 0 -129 -229 30 8 -77 -77 113 -62 8 61 8 -18 -20 30 80 0 -12 -36 -55 -60 104 0 -43
3842 -43 -5 140 5 -39 -104 159 -28 56 -41 -27 -20 -31 39 -41 -13 -126 19 -118 46 -114 150 69 -20 74 34 22
3868 22 -146 -292 -164 -81 -12 103 -124 107 119 -14 50 162 93 -58 -27 -5 56 40 30 -48 -109 -49 -74 -13 -30 -184
3894 -184 111 -19 -55 -2 -129 -292 -77 -46 0 -163 -9 -86 69 -76 -59 -54 66 98 40 20 14 -102 -54 -53 -5 26
3920 26 -14 -43 -74 -10 -187 -133 83 -120 44 -59 58 -75 40 71 -82 -124 -8 163 -58 80 -157 -28 -125
3943 -125 -17 -54 23 108 87 -118 -108 63 186 7 11 -37 -91 1 11 175 28 21 89 -50 -45 70 -1 -3 60 135 -40
3970 -40 24 -4 52 63 41 -17 -63 -25 160 23 17 -14 -115 -76 35 43 -112 154 3 -71 63 -18 1 134 13 -14
3996 -14 24 -69 -58 61 -61 223 -16 -33 -62 -96 67 4 31 -17 153 1 -9 0 -7 -46 213 -42 8 37 -20 -50 141
4023 141 47 -11 -52 65 43 -42 -2 -109 78 -167 108 148 23 72 37 17 61 -80 41 119 -19 -5 49 17 92
4048 92 -89 48 16 35 -9 -41 -71 12 -18 181 6 57 -53 -25 130 -24 177 -33 -62 57 -140 -83 19 -7
4072 -7 40 -16 87 -52 84 -73 -42 32 208 -34 33 35 -46 -91 -46 -34 154 16 3 -32 188 8 27 -19 25 61
4098 61 17 68 31 4 -137 72 21 120 66 -49 49 -41 -14 -97 -109 -91 89 -30 1 3 61 25 -77 -25 171 36 2
4125 2 -48 -80 34 -168 29 -26 -18 -31 -59 66 -46 -90 125 -50 -47 -101 138 34 48 32 39 -136 -12 -151 -125 -102
4151 -102 -4 -26 -78 4 -66 22 77 66 -67 -147 -22 147 34 9 -63 -42 -36 -50 -98 -157 -43 40 33 9 -31 18 22 -62 27
4180 27 -82 11 104 -57 114 -63 100 1 -51 37 -104 226 80 58 -123 -72 -10 34 7 -41 25 -92 74 175
4204 175 -94 72 90 -39 -52 -10 25 72 59 -101 25 -30 100 72 127 -121 -57 -64 -6 -42 49 -74 -46 118 -25
4229 -25 -113 20 -135 -195 -26 57 -81 75 56 -7 27 -115 14 -133 -45 -152 62 -100 67 135 84 -114 -8
4252 -8 -146 -33 106 57 65 -3 -128 -113 -13 -233 19 -67 -21 -36 -166 95 45 80 37 -89 59 -68 11 76 29
4277 29 -49 -71 7 -12 121 -23 10 -219 5 -50 39 -101 -27 -37 -60 45 70 124 34 -62 60 31 54 134 63 13 -93
4304 -93 124 -68 -187 114 -20 -22 87 38 -101 -1 -38 99 -19 40 -55 78 51 63 -138 83 -159 40 53
4327 53 -119 105 -83 25 2 101 -104 -26 -130 -28 -75 63 151 42 38 46 -19 22 -76 -39 -15 -193 -42 -74 77
4352 77 -53 133 70 37 76 -36 43 -10 44 -22 -72 -79 73 79 -18 -59 -4 -21 60 -65 -24 -77 97 -183 22 -49 -17
4379 -17 90 -48 -59 30 79 79 41 109 63 -8 -6 -48 83 -81 -67 146 -7 -60 104 -47 -35 93 -64 119 1
4404 1 41 36 37 -59 21 -110 90 111 -99 -39 20 87 -94 19 175 107 90 -111 -124 134 -57 0 -61 29 8 43 -20
4431 -20 -121 -5 -2 -85 44 7 -54 -18 -21 -29 -95 147 -135 35 72 -173 -104 83 -50 -2 115 56 114 48 74 -10 -42
4458 -42 -52 62 114 40 -4 -1 -10 -11 110 -27 -41 -45 225 22 90 123 41 -9 -52 -107 195 -157 58 -69 51 -18 -223
4485 -223 162 41 51 10 -77 -8 15 87 -21 -97 134 -56 75 12 -218 7 -111 -170 -40 -72 57 -50 -64 -11
4509 -11 -67 106 35 3 103 -26 16 202 107 55 11 51 -28 -5 -75 -92 18 210 91 72 -96 33 81 10 -59 -37
4535 -37 9 -9 -119 2 50 126 -69 26 -41 63 -17 73 -4 49 -130 -12 140 -20 74 51 -44 -62 -29 -2 -83 -85 8
4562 8 48 57 70 -51 69 8 -16 -168 37 80 -109 -42 -201 -93 -118 -17 -27 -25 14 -6 126 -108 64 -16 -114 -58
4588 -58 -8 -58 -10 -51 105 60 -38 -92 -37 -78 -1 67 1 -6 139 -41 148 -171 1 -13 -83 7 66 87 7 -9 -80 78
4616 78 161 120 -190 -18 -26 135 -209 -96 -110 -72 22 84 -68 6 44 -86 41 -73 -47 -28 134 78 -136 103 -63
4641 -63 -94 48 13 95 119 27 -132 146 79 -17 72 27 83 154 -91 91 17 28 59 -8 -40 -74 -37 75 177 6
4667 6 84 -15 108 -72 49 56 -13 -84 -98 -77 -102 36 -16 -11 -109 -47 -77 118 8 -43 -109 136 -55 -12 60 -67 -60 97
4695 97 66 109 -12 -71 24 121 -42 75 -31 -53 -87 30 -9 2 19 83 110 -61 172 -93 -140 -36 29 -30 55 79
4721 79 69 -127 -1 84 7 8 -9 -91 23 63 -241 80 -20 -56 -28 -68 23 -85 -4 29 -104 -31 53 44 -171 100
4747 100 51 18 -41 -68 -55 33 -135 -86 198 -14 -70 30 1 5 128 -98 -106 -206 -86 -61 48 -48 84 89 39 -80
4773 -80 -53 -15 -9 -42 120 -105 -142 2 -22 209 5 78 -62 58 -110 -13 82 12 45 -132 52 -56 147 49 -123
4798 -123 11 25 126 182 -32 -8 -55 -17 -36 -27 4 -144 51 38 21 -88 -128 56 -18 98 -104 -63 -123 -5 -63
4823 -63 -68 -17 77 -27 -141 -24 133 -20 -21 -7 35 77 -5 69 132 -18 -58 119 -109 72 122 93 28 148 -149 45
4849 45 75 -41 20 2 33 27 10 33 41 -37 261 -17 7 4 24 -14 60 -120 167 133 17 29 -11 -7 176 -49 -73 20
4877 20 0 -76 -13 47 58 -105 -220 -15 77 -110 48 150 -4 19 8 78 76 82 121 39 -41 68 -31 -43 -93 9 -11
4904 -11 -161 -22 33 54 13 -79 -56 95 -10 -70 -132 65 -8 36 30 -113 -3 4 -44 62 -47 -5 31 -62 -52 -225
4930 -225 93 66 156 -91 -71 27 65 -48 -13 26 -37 85 -89 -25 -87 -39 66 -46 33 -57 93 60 -35 214 -117
4955 -117 18 -11 213 12 60 111 -51 -6 -28 -39 18 20 -94 -237 -111 -38 -192 49 -37 2 17 -43 -22 68 5 35
4981 35 7 15 51 42 -27 -11 -60 -64 -68 73 -13 -16 -109 -34 44 -171 -86 -18 144 -21 -22 -38 -39 27 -19 -72 -33 127 -26 -105 -70
5012 -70 105 101 62 -8 -15 -91 59 47 -36 189 -67 2 -99 -31 -73 8 -5 -4 -82 185 63 58 -69 78 -17 19 154
5039 154 74 -157 34 23 -84 146 -3 34 -100 44 52 -21 -111 45 133 87 57 -140 127 52 32 -6 1 101 -64
5064 -64 51 31 73 21 107 23 74 -58 11 -46 -18 9 239 30 -20 -5 -16 76 -102 -80 11 -67 138 -16 97 29
5090 29 25 -82 -108 -202 -37 -24 3 115 41 -49 -80 103 -42 -98 -67 -192 22 196 -83 68 81 96 -99 -82 -9
5115 -9 3 11 144 -7 8 -155 90 11 -80 -54 4 -30 -64 -62 43 94 -100 32 -46 118 127 -85 114 152 131 -46 28
5142 28 105 8 -100 -65 -158 -131 48 93 43 -59 12 -26 -96 97 40 67 -42 9 146 -83 -183 91 -66 0 -7 -41
5168 -41 -139 36 -125 51 -141 93 11 155 -28 66 151 -28 21 9 113 -10 -99 199 -73 -90 25 42 -35 7
5192 7 32 -123 127 64 114 13 158 13 66 35 34 113 -72 -78 -38 108 45 65 48 -56 -69 154 -31 -64 64 -39
5218 -39 26 60 -66 0 92 97 60 -79 -142 95 33 -32 133 39 95 51 41 -48 156 -143 -64 -46 0 46 -108 28 -12
5245 -12 -35 23 3 -24 7 -70 103 123 -117 -27 60 57 58 54 -97 3 191 -45 -12 1 49 -75 93 -24 116 32 23
5272 23 34 -42 -27 -59 -87 -169 113 65 34 -142 125 -94 -37 52 6 17 -28 -55 -3 39 -183 7 -104 131 76 -13
5298 -13 1 -20 -14 7 -129 72 14 -103 34 96 -70 -14 -14 13 42 33 6 -18 226 124 109 52 42 -20 -58 -102 -41 0
5326 0 -89 54 125 47 38 -55 6 -81 -78 4 25 39 58 120 133 -51 87 -25 -111 -152 39 35 111 -267 -22 -189 58 -132
5354 -132 -71 126 -159 -97 19 -13 -33 -62 -9 93 -30 42 0 -189 -48 -55 -156 -5 -179 -65 76 -50 -133 145
5378 145 62 12 55 -74 0 -72 102 77 -112 17 43 -98 -154 90 -15 -98 155 133 30 -61 -41 25 7 30 41
5403 41 22 -18 46 -18 54 103 74 229 37 87 -10 56 84 36 -89 -90 36 42 -41 -52 -58 -114 10 -20 1 -15 172 -61
5431 -61 15 9 -45 50 -112 68 32 24 89 -230 -40 49 -92 -59 203 -159 -56 121 -18 -17 -3 98 -25 59 29 165
5457 165 0 78 10 -25 34 12 -73 -143 -90 -105 98 -96 -33 157 21 -129 -75 -156 14 48 66 -55 -85 89 92 91
5483 91 112 -71 -266 -51 39 136 56 -179 38 59 -15 101 -10 -103 14 44 -48 27 72 -3 -94 -17 23 -54 30 -67
5509 -67 -3 -58 49 55 -102 1 1 -89 -100 -129 -72 -35 -83 -9 16 110 -56 78 -82 -69 93 144 87 10 26 -144 6
5536 6 109 -25 -119 -21 -44 -3 26 60 -46 7 51 76 192 -53 -2 33 -47 -97 -86 64 127 -74 101 21 -99 -196
5562 -196 -3 -26 -12 -84 8 63 -12 -99 -55 134 133 -21 75 -236 101 -37 64 -21 33 -11 -15 43 5 47 69 -2 55
5589 55 22 -39 -36 -20 27 -20 41 31 35 -162 -9 67 88 -11 8 29 104 166 -41 -127 -274 59 -77 42 -30 -89 -160 -17
5617 -17 -68 -81 93 -2 37 -2 11 -44 -93 -29 51 -51 4 -131 -41 97 122 -47 -73 -97 53 -80 -60 -122 35 23
5643 23 4 -69 -40 -62 108 -49 78 42 -98 -155 -90 47 34 0 39 -81 -177 -25 13 113 -162 0 -24 53 41
5668 41 84 84 50 -10 -49 55 111 -62 -20 137 -192 26 27 118 -18 -42 168 -4 6 -49 77 -4 -60 -124 67 0
5694 0 53 5 -46 98 -4 163 177 44 -89 113 -34 31 47 79 -74 31 -62 -33 -27 -7 -56 -62 14 60 102 79 147
5721 147 -12 -40 -19 49 -79 41 19 -55 77 -27 34 21 78 141 13 36 74 59 45 16 44 19 -89 2 17 91
5747 91 51 -108 -127 20 -13 -49 -13 111 131 25 -76 188 119 25 40 56 91 126 17 -81 99 -142 66 22 83
5772 83 -123 41 107 -60 -70 35 -63 -139 -26 -40 -48 30 -176 -21 166 80 78 -32 78 43 -32 208 -51 -22 94
5797 94 138 -32 39 -12 54 17 -62 -103 68 115 1 89 22 -74 23 -40 33 48 -36 85 114 -45 53 27 118 -56 -275
5824 -275 104 -54 -35 22 56 -46 -142 28 65 25 84 -26 25 -18 3 -30 21 97 61 -71 146 135 43 -133 -7
5849 -7 34 -4 15 52 -103 -110 -44 36 -39 160 61 121 -276 -10 8 17 -114 -180 -23 118 -15 -73 117 -62 12 -15 -9
5876 -9 -21 -51 -49 90 33 21 43 -66 -63 7 110 64 48 -1 -179 132 -7 50 -91 -12 -127 56 181 11 -109 -76
5902 -76 -1 12 6 19 120 71 -55 -46 -177 64 161 -15 -33 42 148 -3 61 -77 37 -150 55 52 -155 -28 -19 -32
5928 -32 -140 -28 150 62 -9 134 61 62 74 -57 5 55 68 89 -67 -16 -148 -62 -2 91 -42 -136 -161 2 -1 -3 -70
5955 -70 41 194 -69 -130 92 -49 -55 19 25 -23 -94 68 18 62 -70 98 -109 173 -18 3 57 16 55 2 -28 12
5981 12 -49 3 -55 -67 -86 12 31 104 -13 71 -10 -106 -68 49 -55 -114 -12 65 28 47 -99 -125 -84 -8 -29 -121 111
6008 111 9 57 -117 57 4 23 49 35 -16 139 38 68 -122 50 -28 -116 127 -49 -64 6 58 -10 -18 56 69 -17
6034 -17 54 -148 -104 -47 32 -43 -46 105 87 33 181 -81 -41 77 -47 190 -125 109 -66 -122 -17 -82 -51 -186 -19
6059 -19 -19 -9 -214 88 -16 54 -90 -40 48 6 -66 -103 39 82 -52 146 -83 -23 65 20 115 -14 36 -10 -20 63
6085 63 51 -22 66 76 13 6 50 44 -32 37 -21 1 -37 -49 126 -14 -115 30 189 72 -63 -149 42 -148 -11 16
6111 16 112 49 114 -48 107 44 -27 43 19 52 49 49 59 -36 107 -13 -38 -126 21 -34 -60 68 -22 91 -7 103 75
6138 75 -24 -49 105 -33 104 -20 65 18 64 -4 -129 28 -169 -119 -77 97 -7 -69 -32 35 85 -24 64 101 68
6163 68 -109 -40 -18 -55 -4 42 25 109 72 236 -164 -117 110 89 -30 177 89 179 25 -89 3 -33 -17 -117 74
6188 74 14 43 14 37 110 0 -161 -66 -87 -58 -190 -76 -88 -18 76 129 -25 37 16 -113 104 -21 -64 -11 28 -57
6214 -57 49 52 -18 103 -7 17 -24 40 56 -20 -57 161 -16 12 -74 -54 -54 -78 -108 24 -100 155 -37 86 94 -41
6240 -41 -91 -1 145 173 -24 22 114 -17 -10 63 31 84 -20 84 91 -199 34 -32 -206 12 66 5 -36 133 -95 84
6266 84 -1 56 -42 -86 -16 -3 -129 -91 -46 -74 -200 -31 22 -16 -79 -48 83 23 -48 -107 -3 -80 -200 -136 40 -27 33
6293 33 -55 -99 -110 -48 -52 87 -47 90 151 -49 105 28 -95 -2 47 -41 131 69 66 82 2 -102 3 0 4 69 3 312
6321 312 -38 62 112 89 54 177 -157 5 82 122 -179 -147 -49 107 107 83 149 83 -16 22 -178 5 -68 22 0 128
6347 128 -16 169 112 -100 25 -40 -76 2 -114 -35 -83 -91 -29 137 73 -68 -65 -66 -63 -77 145 32 -17 1 41 27 166
6374 166 66 111 -103 -41 -149 -66 42 -10 -6 -76 73 -133 35 68 25 61 -62 -24 68 68 -4 8 50 -9 -100 -17 143
6401 143 22 -34 54 83 -89 0 16 -83 -61 -30 -76 -17 -72 -66 0 -183 -115 -39 -10 -3 111 -5 -56 4 -51 -76 -43 5
6429 5 15 -173 106 83 -65 12 35 -99 -112 -89 -64 85 77 109 146 8 -164 -17 57 -68 -83 -93 60 12 -113 -47
6455 -47 -124 -181 3 83 -8 -46 97 -53 -95 -28 -120 -5 18 -115 -40 -6 -4 -26 -45 25 8 -31 -58 -7 39 -37 31 -217
6483 -217 -103 117 -130 -48 -164 80 9 -64 53 50 -11 -16 -52 23 -56 13 96 -45 7 170 28 -54 44 -62 81
6508 81 119 76 -125 -48 -94 153 170 24 65 76 201 -26 -135 47 -120 -197 -22 108 -187 86 76 -114 -32 146
6532 146 79 0 -39 -77 129 21 -84 -173 -68 9 -114 -9 3 99 22 168 -110 -112 -26 -16 -82 -29 -102 12 -136
6557 -136 202 65 58 7 -34 -58 27 -132 -26 -85 35 94 12 62 78 105 -140 -163 -89 27 -167 -18 -45 62 -23
6582 -23 86 -12 37 1 38 -21 26 -103 28 -97 -27 30 -212 64 -38 168 -107 -31 121 28 -81 52 0 83
6606 83 -98 107 119 -50 34 -108 -17 35 -62 -229 41 -2 -150 -227 -45 -77 54 -7 -7 98 -6 89 -24 59 54
6631 54 27 -47 46 96 -37 -70 -22 -96 -27 30 -61 130 -72 -91 91 58 -35 -54 43 -118 -43 109 -100 33 -57 27
6657 27 50 -20 197 -63 207 3 -215 29 -88 52 -11 -5 89 -37 -161 -4 -21 38 -46 -248 -6 27 -45 -102
6681 -102 50 0 21 -8 40 -4 113 91 -60 46 39 57 22 53 2 34 73 12 154 -48 -135 -46 116 -24 70 175
6707 175 111 -85 93 -33 -88 105 -95 44 -57 -30 0 -17 22 62 -33 15 112 -65 -36 -16 -134 93 -17 -41
6731 -41 -95 24 -118 1 -123 -38 -77 31 -51 153 84 -74 -30 -70 -37 42 139 24 -12 -88 131 -46 -11 -133 -31
6756 -31 -35 -158 -53 -40 -131 -58 105 -30 62 -51 -143 -187 -82 -136 18 -70 38 126 103 143 117 -35 25 75 -106 8
6782 8 -91 -41 -169 -57 41 -32 186 -11 136 168 5 0 -80 15 -58 45 14 49 26 -114 39 18 -60 -19 -147 69
6808 69 -48 -67 -18 5 174 67 -101 -21 4 -58 -93 -29 106 31 -77 0 143 -33 -7 -102 44 -30 46 159 -159
6833 -159 18 -155 89 31 -123 -46 -102 66 -58 -6 4 17 -127 83 -149 16 -20 -45 -105 73 -61 159 -57
6856 -57 -90 -35 -136 47 18 -32 -83 -80 -78 36 -120 92 9 157 -91 55 30 -10 -34 145 25 -64 -75 4 21 -7
6882 -7 -137 -61 -31 31 103 63 -86 -102 -10 -154 -52 -107 11 49 80 -107 2 100 74 11 -22 -84 19 -17 40 -54 22
6909 22 108 167 46 -11 175 -28 -77 73 -129 71 65 -12 -36 73 57 -43 -71 12 72 -35 -92 -253 -79 127 -106
6934 -106 -45 -74 43 -11 71 28 11 145 -134 -147 13 111 -63 128 -66 -17 -44 -78 -95 13 73 147 -82 38 28
6959 28 -40 58 -37 -39 61 -122 12 14 68 -161 235 18 -32 -24 -39 -83 -3 -47 1 -29 -135 -21 -108 93 -75 75
6985 75 24 -100 108 39 -40 230 37 83 -115 82 -48 -67 -60 -112 9 -230 -98 52 -8 126 79 31 95 86 138
7010 138 6 -27 -94 -29 3 72 64 62 -24 -75 -31 37 46 -88 -50 97 -167 -66 92 -26 -45 71 275 4 158 169
7036 169 159 -87 191 104 -48 118 140 108 73 -42 73 -99 29 76 30 145 -32 80 15 26 56 116 -49 46
7060 46 169 -60 13 114 79 19 -73 -119 69 98 -50 24 187 0 132 13 13 105 -85 -57 62 -3 -78 3 -41
7085 -41 111 52 137 -104 -21 69 50 -92 146 -70 80 -101 48 26 -95 258 17 119 -155 81 90 69 5 -40
7109 -40 -47 211 -107 -33 -28 17 -189 -105 161 56 -66 -32 -26 39 86 -4 39 69 -91 7 -91 33 -37 -145 15 11 18 -107
7137 -107 -138 -13 0 -84 -59 -82 50 -99 -34 -30 -80 -42 -78 62 -9 -57 -19 127 47 -149 64 -52 -9 16 -94 -54
7163 -54 33 58 -94 125 52 5 -101 -19 28 1 -9 -121 30 110 -186 -68 44 53 78 -107 -141 -153 3 43 17 70
7189 70 65 -97 54 -29 -250 -89 -117 -98 -77 -44 -65 -86 151 -10 -8 11 -119 -47 -8 16 -123 14 55 122 38 108 -33
7216 -33 76 -2 28 -51 28 65 -8 -11 132 1 70 22 -77 -9 -28 -1 -12 -61 79 -3 -60 23 6 -41 -32 48 140 69 42
7245 42 182 -16 15 -77 74 -146 221 10 23 19 -132 13 -103 -144 95 -57 -101 -11 -76 76 -106 148 -98
7268 -98 20 -50 -57 133 30 60 -160 109 -36 -87 -107 -57 56 -35 106 16 72 100 -11 -59 -114 -42 101 -18 123
7293 123 -29 48 -10 -30 -69 -33 -28 -102 21 156 31 31 116 30 43 -44 8 17 97 -108 -28 17 -157 0 -65 -62 6 -23
7321 -23 -98 -111 65 -118 98 145 14 28 -18 75 -47 -3 -24 112 -35 -3 141 -40 141 129 207 51 -158 -70
7345 -70 47 -26 -12 -5 -69 -81 -69 315 -78 -11 49 -65 115 -89 -22 -125 29 -19 -14 139 31 38 45 -66 -145 -129 -51
7372 -51 -8 71 -192 -62 6 -59 56 96 46 35 45 58 83 42 -66 67 171 -70 -77 -132 15 -80 -22 61 -92 122
7398 122 117 -23 -24 -5 81 -40 75 49 -83 5 126 -63 6 40 -54 -158 47 65 -19 104 -39 27 119 50 -83
7423 -83 -4 14 44 99 81 -21 -122 -17 -54 -126 59 1 -28 -13 80 32 85 61 89 -74 -38 -19 49 -62 -106 51 -47
7450 -47 -53 99 -194 -47 -25 -67 80 -78 11 41 40 88 69 4 10 -12 -21 -7 81 -54 -54 -40 21 -67 54 102 -40 -107 -2
7479 -2 -25 132 81 63 7 14 -249 -91 -33 -30 -20 46 89 44 29 37 42 82 52 16 -50 -10 150 -99 -27 115 -11 175 -63
7508 -63 81 42 0 16 -69 -71 -28 -2 -70 -58 51 35 45 -15 56 70 -31 0 56 -16 29 -22 -123 -84 -64 -77 -58 23 -59
7537 -59 -135 -28 41 -106 -62 -52 30 4 12 -59 -113 -37 132 -24 -72 -143 68 13 -117 29 71 3 126 46 -36 -2 54
7564 54 -26 42 -42 -116 121 -83 -27 -219 -129 -221 3 -93 49 125 -1 -147 -79 41 0 26 -81 -3 173 75 -72
7589 -72 -3 -62 14 -57 17 43 286 -129 72 90 30 89 -94 90 3 5 24 -141 37 18 -92 -13 -101 -18 7 184
7615 184 -53 -86 -130 -101 -58 35 1 -77 92 142 90 -33 -12 -52 -65 -42 -53 101 30 -1 85 -38 101 -220 -64 193
7641 193 103 -9 45 -42 143 84 -39 -49 -82 121 38 -8 -6 93 4 48 -18 -149 160 -90 -93 56 10 -21 174 -9
7667 -9 -39 -139 52 -19 6 -10 72 -70 -51 -177 -177 7 81 30 -72 89 212 -15 74 55 -14 107 20 -59 -8 -123
7693 -123 60 -104 45 -72 -47 134 -90 83 -10 121 -87 50 149 -69 -46 75 -58 33 -58 -40 -62 -22 72
7716 72 -17 -7 -61 60 27 -103 -23 96 144 -13 81 -19 1 88 -27 -54 116 124 39 -64 -130 -17 -73 58 80 -158
7742 -158 -4 32 -39 -129 -47 13 6 74 49 42 -96 70 -27 -25 11 -135 -22 121 36 -39 -1 150 -130 57 1 -95 -106
7769 -106 -92 212 48 -11 22 -59 -275 26 32 33 -35 -188 -53 -72 -58 -28 137 70 31 -79 -59 -37 -36 -108 69 14 81
7796 81 40 149 -50 -30 -169 0 27 160 39 -281 -49 -75 57 107 35 -11 -10 53 143 38 24 164 100 37 55
7821 55 69 12 9 102 70 78 -13 -163 55 -47 -103 -45 -79 198 81 -39 49 127 21 -53 69 19 40 52 -38 -55 6
7848 6 -34 -53 -9 101 -63 75 -48 60 12 3 -138 -47 -138 9 34 -108 -186 -194 -42 -47 -59 -35 45 30 123 8 68
7875 68 8 6 91 45 -82 -59 61 80 -77 -13 26 49 65 -47 28 55 -100 -34 -72 87 -3 28 -9 -128 -78 22 9
7902 9 96 -57 -59 -116 -80 0 -97 154 29 -45 -10 -77 -168 -123 22 -31 -98 143 -59 -14 -169 64 -53 24 221 -268
7928 -268 -81 49 -15 4 -12 79 -46 -72 -72 -32 -150 -38 -216 -27 -44 -18 -19 -38 -64 41 66 -4 -73 -89 -180 -25
7954 -25 91 84 20 19 -28 82 51 9 66 191 48 80 104 121 -52 -4 8 -60 113 23 -29 20 -106 26 -8 -121 -22
7981 -22 -15 8 11 113 -39 -19 -64 12 -48 85 -148 48 -72 -103 41 90 -147 6 29 -150 -11 44 101 4 -10 -13
8007 -13 -53 1 39 223 162 134 106 34 -70 58 16 -5 69 167 144 -93 157 80 41 -27 83 -10 -33 97 21 51 -70
8034 -70 -148 138 -79 17 39 62 3 -109 14 1 -26 -145 -53 124 29 78 -132 -28 21 179 -34 19 26 23 -83 134
8060 134 82 17 -58 -54 41 -42 69 28 -16 -88 -35 -112 -87 130 114 -17 -15 -30 -49 -33 50 46 202 48 -72 -104 61 -68
8088 -68 -17 -103 36 8 32 152 82 124 -184 -159 36 -58 -27 -33 -62 -114 -57 175 -22 -67 -97 40 -43 -71 -27 80 -75
8115 -75 -24 21 -103 66 72 -81 51 183 -39 -121 5 27 -6 76 -112 -20 -124 15 -74 3 11 -74 -18 40 -85 -80
8141 -80 -29 94 -56 11 93 72 73 174 108 -31 137 -13 144 -103 -55 5 -33 -64 8 63 -5 -185 0 -119 -151
8166 -151 34 -95 64 -13 -7 152 -134 -23 69 67 85 -98 -25 -37 -74 -179 108 -28 -60 3 -74 -62 -33 -20 -32
8191c2
##END NTUPLES=NMR FID
##END=
