##TITLE=1H_DPABF0406
 CDCl3, 8 sc, 
 5.6.2019
##JCAMPDX= 6.0         $$ Bruker NMR JCAMP-DX V2.0
##DATA TYPE= NMR FID
##DATA CLASS= NTUPLES
##ORIGIN= UXNMR, Bruker Analytische Messtechnik GmbH
##OWNER= root
$$ XWIN-NMR		Version 3.5
$$ Wed Jun  5 14:26:08 2019 Russian Standard Time (UT+4h)  she@DPX200
##.OBSERVE FREQUENCY= 200.13155
##.OBSERVE NUCLEUS= ^1H
##.DELAY= (6, 6)
##.ACQUISITION MODE= SIMULTANEOUS
##.ACQUISITION SCHEME= undefined
##.AVERAGES= 8
##.DIGITISER RES= 18
##SPECTROMETER/DATA SYSTEM= spect
##.PULSE SEQUENCE= zg30
##.SOLVENT NAME= CDCl3
##.SHIFT REFERENCE= (INTERNAL, CDCl3, 0, 15.7039)
##AUDIT TRAIL= $$ (NUMBER, WHEN, WHO, WHERE, WHAT)
$$ ##TITLE= Audit trail, XWIN-NMR		Version 3.5
$$ ##JCAMPDX= 5.01
$$ ##ORIGIN= Bruker BioSpin GmbH
$$ ##OWNER= she
$$ F:/spectra/data/she/nmr/H-F/1/audita.txt
$$ ##AUDIT TRAIL=  $$ (NUMBER, WHEN, WHO, WHERE, WHAT)
(   1,<2019-06-05 14:24:27.93 +0400>,<she>,<DPX200>,
      <created by zg, POWCHK disabled, PULCHK disabled
       configuration hash MD5:
       00 E9 B6 7A A2 85 ED C7 34 08 36 98 17 FE 4E 26
       data hash MD5: 16K
       A2 69 4A BB 9A B6 45 A1 67 FE 93 2C 76 77 FE A4>)
$$ ##END=
$$ 
$$ hash MD5
$$ F3 F7 8C 5B 1B 0D AD C4 7F B0 67 ED E3 FF C2 43
##$RELAX= 
##$RELAX= 
##$RELAX= 
##$RELAX= 
##$RELAX= 
##$RELAX= 
$$ Bruker specific parameters
$$ --------------------------
##$DU= <F:/spectra>
##$EXPNO= 1
##$NAME= <H-F>
##$PROCNO= 1
##$TYPE= <nmr>
##$USER= <she>
##$AMP= (0..31)
100 100 100 100 100 100 100 100 100 100 100 100 100 100 100 100 100 100 
100 100 100 100 100 100 100 100 100 100 100 100 100 100 
##$AQSEQ= 0
##$AQ_mod= 1
##$AUNM= <au_zg>
##$AUTOPOS= <>
##$BF1= 200.13
##$BF2= 200.13
##$BF3= 200.13
##$BF4= 200.13
##$BF5= 200.13
##$BF6= 200.13
##$BF7= 200.13
##$BF8= 200.13
##$BYTORDA= 1
##$CFDGTYP= 0
##$CFRGTYP= 5
##$CHEMSTR= <none>
##$CNST= (0..31)
1 1 145 1 1 1 1 1 1 1 1 1 1 1 1 1 1 1 1 1 1 1 1 1 1 1 1 1 1 1 1 1 
##$CPDPRG= <>
##$CPDPRG1= <>
##$CPDPRG2= <>
##$CPDPRG3= <>
##$CPDPRG4= <mlev>
##$CPDPRG5= <mlev>
##$CPDPRG6= <mlev>
##$CPDPRG7= <mlev>
##$CPDPRG8= <mlev>
##$CPDPRGB= <>
##$CPDPRGT= <>
##$D= (0..31)
0 1.2 0 0 0 0 0 0 0 0 0 0.03 0 0 0 0 0 0 0 0 0 0 0 0 0 0 0 0 0 0 0 0 
##$DATE= 1559730267
##$DBL= (0..7)
120 120 120 120 120 120 120 120 
##$DBP= (0..7)
150 150 150 150 150 150 150 150 
##$DBP07= 0
##$DBPNAM0= <>
##$DBPNAM1= <>
##$DBPNAM2= <>
##$DBPNAM3= <>
##$DBPNAM4= <>
##$DBPNAM5= <>
##$DBPNAM6= <>
##$DBPNAM7= <>
##$DBPOAL= (0..7)
0.5 0.5 0.5 0.5 0.5 0.5 0.5 0.5 
##$DBPOFFS= (0..7)
0 0 0 0 0 0 0 0 
##$DE= 6
##$DECBNUC= <off>
##$DECIM= 24
##$DECNUC= <off>
##$DECSTAT= 4
##$DIGMOD= 1
##$DIGTYP= 9
##$DL= (0..7)
0 120 120 120 120 120 120 120 
##$DP= (0..7)
150 150 150 150 150 150 150 150 
##$DP07= 0
##$DPNAME0= <>
##$DPNAME1= <>
##$DPNAME2= <>
##$DPNAME3= <>
##$DPNAME4= <>
##$DPNAME5= <>
##$DPNAME6= <>
##$DPNAME7= <>
##$DPOAL= (0..7)
0.5 0.5 0.5 0.5 0.5 0.5 0.5 0.5 
##$DPOFFS= (0..7)
0 0 0 0 0 0 0 0 
##$DQDMODE= 0
##$DR= 18
##$DS= 0
##$DSLIST= <SSSSSSSSSSSSSSS>
##$DSPFIRM= 0
$$ [...]
##$SUBNAM2= <"">
##$SUBNAM3= <"">
##$SUBNAM4= <"">
##$SUBNAM5= <"">
##$SUBNAM6= <"">
##$SUBNAM7= <"">
##$SUBNAM8= <"">
##$SUBNAM9= <"">
##$SW= 24.9336996594482
##$SWIBOX= (0..15)
0 0 2 0 0 0 0 0 0 0 0 0 0 0 0 0 
##$SW_h= 4990.01996007984
##$TD= 16384
##$TD0= 1
##$TE= 0
##$TE2= 300
##$TE3= 300
##$TEG= 300
##$TL= (0..7)
0 120 120 120 120 120 120 120 
##$TP= (0..7)
150 150 150 150 150 150 150 150 
##$TP07= 0
##$TPNAME0= <>
##$TPNAME1= <>
##$TPNAME2= <>
##$TPNAME3= <>
##$TPNAME4= <>
##$TPNAME5= <>
##$TPNAME6= <>
##$TPNAME7= <>
##$TPOAL= (0..7)
0.5 0.5 0.5 0.5 0.5 0.5 0.5 0.5 
##$TPOFFS= (0..7)
0 0 0 0 0 0 0 0 
##$TUNHIN= 0
##$TUNHOUT= 0
##$TUNXOUT= 0
##$USERA1= <user>
##$USERA2= <user>
##$USERA3= <user>
##$USERA4= <user>
##$USERA5= <user>
##$V9= 5
##$VALIST= <valist>
##$VCLIST= <CCCCCCCCCCCCCCC>
##$VD= 0
##$VDLIST= <DDDDDDDDDDDDDDD>
##$VPLIST= <PPPPPPPPPPPPPPP>
##$VTLIST= <TTTTTTTTTTTTTTT>
##$WBST= 1024
##$WBSW= 4
##$XGAIN= (0..3)
0 0 0 0 
##$XL= 0
##$YL= 0
##$YMAX_a= 149715
##$YMIN_a= -336841
##$ZGOPTNS= <>
##$ZL1= 120
##$ZL2= 120
##$ZL3= 120
##$ZL4= 120
##$ABSF1= 10
##$ABSF2= 0
##$ABSG= 5
##$ABSL= 3
##$ALPHA= 0
##$AQORDER= 0
##$ASSFAC= 0
##$ASSFACI= 0
##$ASSFACX= 0
##$ASSWID= 0
##$AUNMP= <proc_1d>
##$AZFE= 0.1
##$AZFW= 0.1
##$BCFW= 1
##$BC_mod= 2
##$BYTORDP= 1
##$COROFFS= 0
##$CY= 11.3945322036743
##$DATMOD= 1
##$DC= 2
##$DFILT= <>
##$DTYPP= 0
##$F1P= 18.9103706918063
##$F2P= -1.10871071338519
##$FCOR= 0.5
##$FTSIZE= 0
##$FT_mod= 4
##$GAMMA= 1
##$GB= 0.15
##$INTBC= 1
##$INTSCL= 1
##$ISEN= 128
##$LB= 0.24
##$LEV0= 0
##$LPBIN= 0
##$MAXI= 10000
##$MC2= 0
##$MEAN= 0
##$ME_mod= 0
##$MI= 1.114404
##$NCOEF= 0
##$NC_proc= 0
##$NLEV= 6
##$NOISF1= 3.799351
##$NOISF2= 2.8
##$NSP= 1
##$NTH_PI= 0
##$NZP= 0
##$OFFSET= 15.70392
##$PC= 1
##$PHC0= -8656.518
##$PHC1= 11.40018
##$PH_mod= 1
##$PKNL= yes
##$PPARMOD= 0
##$PSCAL= 0
##$PSIGN= 0
##$REVERSE= no
##$SF= 200.130013532006
##$SI= 16384
##$SIGF1= 3
##$SIGF2= 2
##$SINO= 400
##$SIOLD= 16384
##$SREGLST= <1H.CDCl3>
##$SSB= 0
##$STSI= 0
##$STSR= 0
##$SW_p= 3612.71676300578
##$SYMM= 0
##$S_DEV= 0
##$TDeff= 0
##$TDoff= 0
##$TI= <>
##$TILT= no
##$TM1= 0
##$TM2= 0
##$TOPLEV= 0
##$USERP1= <user>
##$USERP2= <user>
##$USERP3= <user>
##$USERP4= <user>
##$USERP5= <user>
##$WDW= 1
##$XDIM= 8192
##$YMAX_p= 0
##$YMIN_p= 0
$$ End of Bruker specific parameters
$$ ---------------------------------
##NTUPLES= NMR FID
##VAR_NAME=  TIME,          FID/REAL,        FID/IMAG
##SYMBOL=    X,             R,               I
##VAR_TYPE=  INDEPENDENT,   DEPENDENT,       DEPENDENT
##VAR_FORM=  AFFN,          ASDF,            ASDF
##VAR_DIM=   8192,          8192,            8192
##UNITS=     SECONDS,       ARBITRARY UNITS, ARBITRARY UNITS
##FACTOR=    0.0002004,     1,               1
##FIRST=     0,             0,               0
##LAST=      1.6414764,     0,               0
##MIN=       0,             -336841,         0
##MAX=       1.6414764,     149715,          0
$$ Real data points
##PAGE= N=1
##DATA TABLE= (X++(R..R)), XYDATA
0@%%%%%%qJ6j7K5l2M0n1N9p2Q8j05J29j54J78k09K44k84L30l81M37n00N71o49
$$ 0 0 0 0 0 0 0 -8 8 -9 16 -16 24 -27 32 -40 48 -57 72 -82 96 -113 131 -153 177 -204 233 -267 304 -345
29c45P33q26R30j042J166j303J453j619J800j997K214k455K719l009L332l692
$$ -345 388 -438 492 -550 616 -687 766 -853 947 -1050 1164 -1291 1428 -1581 1751 -1941
45a941M093m544N057n643O320p114Q061r210J0643j2492J4977j8516K4008l3793
$$ -1941 2152 -2392 2665 -2978 3342 -3772 4289 -4921 5722 -6770 8207 -10309 13699 -20094
59b0094N6585k05471j67861J87771q3242r7723Q431J45845Q522q8788l8921J03156
$$ -20094 36491 -168980 -336841 -149070 -232312 -330035 -321604 -175759 -167237 -256025 -294946 -191790
71a91790N3811n9761p8985M6238Q2421M186p3096j0898O5941N3657k9025l1459
$$ -191790 -137979 -197740 -276725 -230487 -148066 -143880 -216976 -227874 -161933 -108276 -137301 -168760
83a68760L1888O0397k266m3032k359N5652K4099m4270m2886L1496N4120p348n1574
$$ -168760 -136872 -76475 -78741 -121773 -124132 -68480 -44381 -88651 -131537 -100041 -45921 -53269 -104843
96a04843k306N3431K5176l4835j9222M0907L7766k5725l9073J8334M5555m176
$$ -104843 -107149 -53718 -28542 -63377 -82599 -41692 -3926 -29651 -68724 -50390 -4835 -9011
108i011m3905r532L5435J5318k6497j3231K9403K3198j9219j9167K5644L5366
$$ -9011 -52916 -62448 -27013 -11695 -38192 -51423 -22020 1178 -18041 -37208 -11564 23802
120B3802r055l2670K268L2943Q589k6036j4670J7044J4564j2174j4860Q733J8082
$$ 23802 14747 -17923 -15655 17288 25877 -159 -14829 2215 16779 4605 -10255 -1522 16560
133A6560L66j4339m840J2480J2640k344j1678n686L764M211j285l828l164l081
$$ 16560 16926 2587 -2253 10227 22867 20523 8845 3159 6923 11134 9849 6021 2857 -224
147b24j834K413M098m54l537M49M617R60k916J903P877J636r105n282R738J1147
$$ -224 -2058 355 4453 3999 462 911 5528 6488 3572 5475 13352 14988 5883 601 10339 21486
163B1486n228j2576J747J3061K269j0378p80J3488M306j3676o777J6296J5937
$$ 21486 16258 3682 5429 18490 20759 10381 9601 23089 27395 13719 6942 23238 39175
176C9175j0686k0734L035K1963M562k1004j2856J4668J4617j3530k1441N977K3091
$$ 39175 28489 7755 10790 32753 37315 16311 3455 18123 32740 19210 -2231 3746 26837
189B6837l53k5849j0122K1332J6819j5303k1603N456J8678k418j9599m539J4145
$$ 26837 26484 635 -9487 11845 28664 13361 -8242 -2786 15892 13474 -6125 -10664 3481
202C481L472j7127j0466J3156J3051j0935j7702N091J9439J047j8425o015J6346
$$ 3481 6953 -10174 -20640 -7484 5567 -5368 -23070 -17979 1460 2507 -15918 -21933 -5587
215e587Q932j6181j5686J0687J8041p517k3816k810K2062J0934j7057j5855J1553
$$ -5587 3345 -12836 -28522 -17835 206 -7311 -31127 -33937 -11875 -941 -17998 -33853 -22300
228b2300J9064l925j7747L4J6857L514j6642r156J3000J1989r788j5252M599J6100
$$ -22300 -3236 -7161 -24908 -24874 -8017 -4503 -21145 -30301 -17301 -5312 -15100 -30352 -25753 -9653
242i653J775j2565k873J3028P582r217q079Q591J1806m576j3513o18J2723N999
$$ -9653 -7878 -20443 -23316 -10288 -2706 -11923 -20002 -11411 395 -4181 -17694 -18312 -5589 410
256D10q808p982M888R369Q13n441j051N102L498j916k904Q62L195J060k018k434
$$ 410 -8398 -16380 -11492 -2123 -1310 -6751 -7802 -2700 798 -1118 -4022 -3160 35 1095 -923 -3357
272c357l50K189K672N11k552k632J449N037K558l621m780J971O421J105o133l066
$$ -3357 -3707 -1518 1154 1665 -887 -3519 -2070 2967 5525 1904 -2876 -905 5516 6621 488 -2578
288b578N961M961n350o973M452R456k324j1352p41J1690L957j1074o226R957Q357
$$ -2578 3383 8344 2994 -3979 473 9929 7605 -3747 -4488 7202 11159 85 -6141 3816 12173
303A2173q945j0117P935J3284n445j6068P92J6570L651j6442r659J2284J2149
$$ 12173 3228 -6889 1046 14330 8885 -7183 -6391 10179 13830 -2612 -12271 13 12162
316A2162r028j4403M796J5500L1j4795l783J4080Q523j0859j2164N934J2846k689
$$ 12162 3134 -11269 -6473 9027 9058 -5737 -9520 4560 13083 2224 -9940 -4006 8840 6151
330F151j4160k551J2164N444j1219q715J0112J3814n474j5716J772J8680N257
$$ 6151 -8009 -10560 1604 7048 -4171 -12886 -2774 11040 5566 -10150 -8378 10302 15559
343A5559j8343j2207J4611J6496j1508k2265M270K4053K438k4336r275K3833J8296
$$ 15559 -2784 -14991 -380 16116 4608 -17657 -13387 10666 13104 -11232 -20507 3326 21622
356B1622j7379k2598J1617K6450l615k7384m883K3776R532k2094j6012J6484J9678
$$ 21622 4243 -18355 -6738 19712 16097 -11287 -16170 7606 17138 -4956 -20968 -4484 15194
369A5194j0401k1328N128K3585L725j9875q609J6860J3366j2341j7293N383J6982
$$ 15194 4793 -16535 -11407 12178 15903 -3972 -12581 4279 17645 5304 -11989 -6606 10376
382A0376j275j8230n582J6046J1351j0881j3854P022J7310M17j5460m607J3349
$$ 10376 9101 -9129 -14711 1335 12686 1805 -12049 -5027 12283 12700 -2760 -7367 5982
395E982P930j1510j1968O725J2495m371j3863M77J4176M247j1426n415J1158Q741
$$ 5982 13912 2402 -9566 -2841 9654 5283 -8580 -8103 6073 10320 -1106 -6521 4637 13378
409A3378q261r595O171J0391m858j2590Q27J1774J237j1309l802J0221O594o889
$$ 13378 5117 -4478 1693 12084 7226 -5364 -4537 7237 8474 -2835 -6637 3584 10178 3289
423C289o386O287P476m020p461J977O331j855o933k76N322J32n071k70N497J547
$$ 3289 -3097 3190 10666 6646 -815 1162 7493 5638 -1295 -1571 3751 3883 -1188 -1458 4039 5586
439E586m787j582N644L134n173n208L597N578l119p904J52P667J693p768l608
$$ 5586 799 -783 4861 7995 2822 -2386 1211 6789 3670 -4234 -4082 3585 5278 -2490 -6098
454f098P920O962n837q432M163J0696j493j2401k753J1273N024j1657r386R006
$$ -6098 1822 8784 2947 -5485 -1322 9374 7881 -4520 -7273 4000 9024 -2633 -12019 -3013
468c013J2243o191j4306K858J6618K663j5963p439J4007J1432j1773j6144N922
$$ -3013 9230 3039 -11267 -8409 8209 10872 -5091 -12530 1477 12909 1136 -15008 -9086
481i086J6767k259j8760l702J7337R123j4474j2979J1442J6961n897j8187N37
$$ -9086 7681 5422 -13338 -17040 297 9420 -5054 -18033 -6591 10370 4473 -13714 -13177
494a3177J7955L872j7725r929J4085J2943j0966j6671N909J8878K24j7746m538
$$ -13177 4778 8650 -9075 -19004 -4919 8024 -2942 -19613 -13704 5174 5398 -12348 -16886
507a6886J7366J0350j3651j4074R643J6510n131j8869j334J7743O043j5863j0651
$$ -16886 480 10830 -2821 -16895 -7252 9258 4127 -14742 -16076 1667 7710 -8153 -18804
520a8804J2808J4701p571j5523L988J7162J667j5847o212J3478R392j0858j2853
$$ -18804 -5996 8705 1134 -14389 -10401 6761 8428 -7419 -13631 -153 9239 -1619 -14472
533a4472O054J3453k332j3676j379J3185N670j0282p637Q385J0093m547j0946
$$ -14472 -8418 5035 2703 -10973 -12352 833 6503 -3779 -11416 -3031 7062 2515 -8431
546h431J124J0184J247r650m457P420N656n621o643L605P253j083o330q3N889
$$ -8431 -7307 2877 4124 -5526 -9983 -2563 3093 -2528 -9171 -5566 1687 604 -5726 -5809 80
561H0J529m821k133L279J985k971k507J804J853j790j896J545J956j233j698J376
$$ 80 1609 -3212 -5345 -2066 -81 -3052 -5559 -3755 -1902 -3692 -5588 -4043 -2087 -3320 -5018 -3642
577c642K583p48k650M86L251L25l647j437L569K854l408m326K333N806o98o325
$$ -3642 -1059 -1807 -4457 -3971 -720 -395 -4042 -5479 -1910 944 -2464 -6790 -4457 1349 651 -5674
593e674n65P305L155o840m898O498P549m827r360K585J0426k11j1093k735J0659
$$ -5674 -6239 1066 4221 -2619 -7517 -1019 6530 1703 -7657 -5072 5354 5143 -5950 -8685 1974
608A974N409r706p924Q178J0320n371j1670K580J2615R52j2298m301J0672P103
$$ 1974 7383 -2323 -10247 -2069 8251 2880 -8790 -6210 6405 7357 -4941 -9242 1430 8533
622H533q879r740N518J1040k409j1599j291J1128N407q841q014O285J0535k393
$$ 8533 -346 -10086 -4568 6472 4063 -7536 -8827 2301 7708 -1133 -9147 -2862 7673 5280
636E280j1162j370J0971N204j0065q772P459J1593l891j3406K33J4285M444j3008
$$ 5280 -5882 -7252 3719 8923 -1142 -9914 -2455 9138 5247 -8159 -7926 6359 10803 -2205
650b205p867J1730J1763q417j4185M545J5569k91j5694m259J4225Q049j1626j0892
$$ -2205 -10072 1658 13421 5004 -9181 -4636 10933 10642 -5052 -9311 4914 12963 1337 -9555
664i555Q276J3076l703j2994oJ2421L886j0170o571P464Q418m332r458P27R015
$$ -9555 -1279 11797 8094 -4900 -4906 7515 11401 1231 -5340 2124 10542 6210 -3248 -2521 6494
679F494K419p648m887N870O913l280p857R50Q456J855p939m312O627O144n068
$$ 6494 8913 1265 -3622 2248 9161 5881 -1976 -1026 7430 9285 1346 -2966 3661 9805 4737
694D737p730K700Q185n09q176j848P262L826n592m833L943N408k080n346M26M845
$$ 4737 -2993 -293 7892 7383 -793 -2641 4621 8447 2855 -1978 1965 7373 5293 -53 373 5218
710E218Q70l875j878K712K040j762j920J175J900o34j567L49J575N5j040R9R83
$$ 5218 6088 2213 335 3047 5087 3325 1405 2580 4480 3846 2279 2628 4203 4258 3218 3317 4300
727D300M8r40m5Q73P0j059r7J122J25j592m21J890R78j870j449J976K498j729
$$ 4300 4348 3408 3363 4236 4306 3247 3150 4272 4397 2805 2384 4274 5252 3382 1933 3909 6407 4678
745D678l359J119M561J47n329k254N080L998m096n721K706P032o17p398j457P684
$$ 4678 1319 2438 6999 7146 1817 -437 4643 8641 4545 -1176 1530 8562 7945 547 -910 6774
761F774M260o321o145M578P538k373q436l04Q322K452q053n165O512P103m505
$$ 6774 11034 4713 -1432 3146 10684 8311 -125 -429 7893 10345 2292 -2873 3639 10742 6237
776F237q763K062R591N87r906l935Q831O493p614r728M010J0450j490j1848k727
$$ 6237 -2526 -464 9127 9714 -192 -4127 4704 11197 3583 -6145 -2135 8315 6825 -5023 -7750
791g750J0804N915r441r007O541J1041l186j1923m84J1222L491j0557o785P969
$$ -7750 3054 8969 -472 -9479 -2938 8103 4917 -7006 -7490 3732 7223 -3334 -10119 -2150
805b150Q487n617j0239K533J0720O42j0156l221R806O380p577q568N204J0078
$$ -2150 6337 720 -9519 -6986 3734 4376 -5780 -9001 805 7185 -392 -8960 -3756 6322
819F322k300j0954j215J0284L984r370p025P172R141l851r853R54R859K192q296
$$ 6322 4022 -6932 -8147 2137 6121 -3249 -10274 -3102 6039 2188 -7665 -6711 3148 5340 -2956
834b956m310O495N785m716p113J883O752r9o466j795N380L260l935l684L219M815
$$ -2956 -7266 -771 5014 298 -6815 -4932 1820 1721 -4745 -6540 -1160 2100 -1835 -5519 -2300 2515
850B515j391m794L10M835R23m477k432L334L020k505l632J183L683J75k891n22
$$ 2515 1124 -3670 -3360 1475 2398 -2079 -4511 -1177 1843 -662 -4294 -3111 572 747 -2144 -2666
866b666K619J378j606j138Q35O33q24o29M61o05j691j12K070M98k614j355K822
$$ -2666 -47 1331 -275 -1413 -578 55 -769 -1398 -937 -1542 -3233 -3345 -1275 -777 -3391 -4746 -1924
883a924K766k262l491J491M346l51n220j498M534K404m347l973L173M858j982
$$ -1924 842 -1420 -4911 -3420 926 575 -4645 -6143 -1609 795 -3552 -7525 -4352 506 -1476
898a476n210J226O109Q46n742k007N936L997n111n710L738P104j971q237n51Q653
$$ -1476 -6686 -5460 649 1495 -4247 -6254 -318 3679 -1432 -7142 -3404 3700 1729 -6508 -7059 1594
914A594L585p478n705O352Q368l287r115O38R724K578q932n373P041P329m841
$$ 1594 5179 -2299 -8004 -1652 6716 3429 -5686 -5048 4676 7254 -1678 -7051 -10 7319 2478
929B478q670K324R107M53q714k586Q188N076o670o812M940Q197k601r189j21R252
$$ 2478 -6192 -3868 5239 5692 -3022 -5608 2580 7656 986 -5826 -886 7311 4710 -4479 -4600 4652
945D652K793q823n405P134P814m784r592J867J0055J586r690m662P840P101n313
$$ 4652 7445 -1378 -6783 351 8165 3381 -6211 -4344 5711 7297 -2393 -7055 785 7886 2573
960B573q500K507R014K54q628k805P307M730n915o270L606O834j736p075M8O918
$$ 2573 -5927 -3420 5594 5848 -2780 -5585 1722 6452 537 -5733 -2127 4707 2971 -4104 -4056 2862
976B862J892o212l203N444M891l859n978J876O123r2o153k187M923L352l371m278
$$ 2862 4754 -1458 -4661 783 5674 1815 -4163 -2287 3836 3744 -2409 -4596 327 3679 308 -3970
992c970J801M729K89l716j325K922K459j609k806O9J994K90j832j179P88R99l84
$$ -3970 -2169 2560 2849 -867 -2192 730 3189 1580 -1226 -1157 837 1127 -705 -1884 -1096 -97 -481
1009d81o07N10R28Lk28O06N69n88p66L29M56q21j271K06P86m02q38O25J510j81
$$ -481 -1088 -578 350 353 125 731 1300 712 -54 275 731 -90 -1361 -1155 -369 -771 -1609 -984 526 345
1029C45j009J062K092m75k561N6K963L77m018k439L222L220k700m579J551N690
$$ 345 -664 398 2490 2015 -546 -490 2473 2850 -1168 -3607 -385 2835 135 -4444 -2893 2797
1045B797Q92m984j978N022M101l420n428J455N228k22n939k321M525L260l670
$$ 2797 3689 -1295 -3273 1749 5850 2430 -2998 -1543 3685 3463 -2476 -4797 -272 2988 -682
1060f82m158K727N603p30n196j32N935K118n550m238M199N132l605p134Q23P430
$$ -682 -4840 -2113 3490 2760 -2436 -2568 3367 5485 -65 -4303 -104 5028 1423 -5711 -4888 2542
1076B542J255p323l405O957O512m197p452K330Q622O40q520l637O559N129n607
$$ 2542 3797 -3526 -6931 26 6538 2341 -5111 -2781 5841 6481 -2039 -5676 883 6012 405
1091D05p229K887P627n02p436j090P482L813n755m867M697O220l044p346L97P069
$$ 405 -6824 -3937 3690 3188 -4248 -5338 2144 5957 202 -4665 32 6252 3208 -4138 -3741 3328
1107C328R10p526l709O237N604m504o949K751Q290L93p571k691O743M730n155
$$ 3328 4238 -3288 -6997 -760 4844 340 -6609 -3858 4432 4825 -2746 -5437 1306 6036 881
1122H81o500K432O568q07o867j595N644L263m226l752L038M765j249m210M04M175
$$ 881 -5619 -3187 3381 2574 -4293 -5888 -244 3019 -1207 -4959 -1921 2844 1595 -2615 -2211 1964
1138A964N93l825j846L041K315k813l097J556L405n56l329k79L461J699k326j952
$$ 1964 2557 -1268 -3114 -73 2242 -571 -3668 -2112 1293 737 -2592 -2871 590 2289 -37 -1989
1154a989J680K574n18k423l69J563N60j122p98K07K97PK66K65m94k76J236J321
$$ -1989 -309 2265 1747 -676 -1045 518 1078 -44 -842 -635 -338 -331 -65 200 -294 -570 666 1987
1172A987p06j574L96K246M45k615j460K008J875j693k750Q06L078N5k883m47L372
$$ 1987 1281 -293 103 2349 2794 179 -1281 727 2602 909 -1841 -1035 2043 2098 -785 -1232 2140
1189B140J751k606k189K691L051j992m053Q47M275n3n295j822N007L493m118m876
$$ 2140 3891 1285 -904 1787 4838 2846 -1207 -360 3915 3862 -1433 -3255 1752 5245 1127 -3749
1205c749L229O494o58o549r57O534L286n829n419L734O095k250p222l42O804K368
$$ -3749 -520 5974 5316 -1233 -2190 4344 7630 1801 -3618 116 6211 3961 -3261 -3603 3201 5569
1221E569n894l671N185N505l130o012J706O744P7p002k619O025L817n354o041
$$ 5569 -325 -3996 1189 6694 3564 -2448 -742 6002 6079 -923 -3542 2483 6300 946 -5095
1236e095L513P038j352p392m62P699L577o189n251M797O706k612p679j27P042
$$ -5095 -1582 5456 4104 -3288 -3750 3949 7526 1337 -3914 883 7589 4977 -2702 -2829 4213
1251D213J927o457m096N143N408l033n714J700O354L56n488j718M937K792m074
$$ 4213 6140 -317 -4413 730 6138 3105 -2609 -909 5445 5801 313 -1405 3532 6324 2250
1266B250m314K784M495j623n164k4M995J577m330k760L678L763k307m505P01M391
$$ 2250 -2064 720 5215 3592 -1572 -1596 3399 4976 646 -2114 1564 5327 3020 -1485 -784 3607
1282C607M93m144j981K980K338k102k825R97K477k90k404l13J659M67j455o26
$$ 3607 4100 -44 -2025 955 3293 1191 -1634 -637 1840 1550 -854 -1167 492 959 -496 -1122
1298a122R81K71r07j77P54K21q84m16P86L71r26o81M90M39q31p37N73Q62n85j086
$$ -1122 -141 130 -777 -954 -200 21 -863 -1279 -493 -122 -1048 -1729 -1239 -800 -1631 -2368 -1795 -933 -1518 -2604
1318b604O78J540j18j690k29K036P87k405j894J693K483j482l490K34L954J277
$$ -2604 -1926 -386 -504 -2194 -2423 -387 400 -2005 -3899 -2206 277 -1205 -4695 -4461 -507 770
1334G70l530k209L471L979k020m525R77N103N26n274k385M327L429l650m505K536
$$ 770 -2760 -4969 -1498 2481 461 -4064 -3087 2016 2542 -2732 -5117 -790 2639 -1011 -5516 -2980
1350b980N457o96n232j64N845K399m795l407L993M443k953n825Q09N775N30n827
$$ -2980 2477 1781 -3451 -3615 2230 4629 -166 -3573 420 4863 1910 -3915 -3106 2669 3199 -2628
1366b628k559N070M616l072n065K020O241L88n824k332M919L585m190n441J800
$$ -2628 -5187 -117 4499 1427 -3638 -1618 4623 5011 -813 -3145 1774 5359 1169 -4272 -2472
1381b472N449n76n623j066N516L052m018l530L468M804j747n095L5M737P32n061
$$ -2472 2977 2401 -3222 -4288 1228 4280 262 -3268 200 5004 3257 -1838 -1803 2934 3666 -1395
1397a395k906L530L604k582m302J427N190O58m299j482M199L028k938m147J157
$$ -1395 -4301 -771 2833 251 -4051 -2624 2566 3224 -1075 -2557 1642 4670 1732 -2415 -1258
1412a258L749m80m294j245L316J943k454k272K074L387k92k624j03K569R04k229
$$ -1258 2491 2011 -2283 -3528 -212 1731 -723 -2995 -921 2466 2174 -450 -553 2016 2920 691
1428F91j714J264J543j215k092J91K031O43j411n45J657J497n36j188K95J169
$$ 691 -1023 241 1784 569 -1523 -1332 699 1342 -69 -614 1043 2540 2004 816 1111 2280
1444B280J03j173p63K47M80k00q28j27N03N63K24k74j96L13P51J34q09q16K48
$$ 2280 2383 1210 447 694 1174 974 146 19 522 1085 1309 1035 839 1152 1903 2037 1228 412 660
1463F60Q15l64j445n63J227R69j132j472R08K079n4k119m95K182J084k191j922
$$ 660 1475 1111 -334 -897 330 1299 167 -1305 -397 1682 1628 -491 -986 1196 2280 89 -1833
1480a833J555K219j223k871K32L094O15k944j462K756K531j940l238R60L588K10
$$ -1833 -278 1941 718 -2153 -1921 1173 1788 -1156 -2618 138 2669 729 -2509 -1549 2039 2249
1496B249l862j523L187K538k670l430J545M062j70m385j119M072K470l310l573
$$ 2249 -1613 -3136 51 2589 -81 -3511 -1966 2096 1926 -2459 -3578 494 2964 -346 -3919
1511c919K202M184j082m729k73M655J669m136k937L345M058k148m692Q23M957
$$ -3919 -1717 2467 1385 -3344 -3617 1038 2707 -1429 -4366 -1021 3037 889 -3803 -2980 1977
1526A977P14m806k123M158L484l141m204J812M817k91m734j086M348K515l375
$$ 1977 2691 -2115 -4238 -80 3404 263 -3941 -2129 2688 2397 -2337 -3423 925 3440 65
1541F5l504K276M084q41m268m86M109J748l435k836K487L633j367l886L4L958
$$ 65 -3439 -1163 2921 2080 -2188 -2674 1435 3183 -252 -3088 -601 3032 1665 -2221 -2187 1771
1557A771J063l663k149K991K921j988l554R20L774O3l614j194L127J951k576k614
$$ 1771 2834 -829 -2978 13 2934 946 -2608 -1688 2086 2149 -1465 -2659 468 2419 -157 -2771
1573b771J647K839q22k698M2K552P08k105j108J561J444j120j489M06J251j9j242
$$ -2771 -1124 1715 893 -1805 -1763 789 1497 -608 -1716 -155 1289 169 -1320 -914 337 318 -924
1590i24k75R66M79n95l08N26M22o6j54N9Q9j96j75R2j89l93o6M72K52m85k76N19
$$ -924 -1199 -233 246 -349 -657 -131 291 225 71 130 219 23 -152 -60 -249 -642 -708 -236 16 -469 -745 -226
1612b26J022j09r79j7J205L40j331j175Q60J454r78k086K27K393M67k384q92K723
$$ -226 796 687 -292 -309 896 1236 -95 -1270 -410 1044 66 -2020 -1793 600 1067 -1317 -2209 514
1630E14K008k067k512J610L142j152l800k28L555R40l702k088L123L122k120l389
$$ 514 2522 455 -2057 -447 2695 1543 -2257 -2485 1070 2010 -1692 -3780 -657 2465 345 -3044
1646c044J416M235K04l871j344L633K312l172l580J651L915p35m365o66M344K210
$$ -3044 -1628 2607 2811 -1060 -2404 1229 3541 369 -3211 -1560 2355 1620 -2745 -3411 933 3143
1662C143l483k863K971M121j463m523K53M382R72m596k577L482L298k603m299
$$ 3143 -340 -3203 -232 3889 2426 -2097 -1844 2538 3510 -1086 -3663 -181 3117 514 -3785
1677c785J420M867K28m433j238M386K648l314l668K111L873j118m499n21L981
$$ -3785 -2365 2502 2730 -1703 -2941 1445 4093 779 -2889 -778 3095 1977 -2522 -3043 938
1692I38J483l471k320K677L268j316l265N80L478N34l117j563K405K022j901k735
$$ 938 2421 -1050 -3370 -693 2575 1259 -2006 -1426 2052 2586 -531 -2094 311 2333 432 -2303
1708b303Q57K812l9k668o50K636J479j823j713J329K127p00k159k14J844M95j688
$$ -2303 -1446 1366 1327 -1341 -1991 645 2124 301 -1412 -83 2044 1344 -815 -1029 815 1310 -378
1725c78r31J160J082p58q86L56J032Kp24j50M85l8l45j29K42j54l65K18M21j27
$$ -378 -1309 -149 933 175 -711 -355 677 679 -45 -195 290 252 -93 -222 20 -134 -499 -281 140 13
1745A3m55Q0O27Lo84j81Q11L04r27o74O97J042o18j147L37J587J17j517n23J699
$$ 13 -442 -362 265 268 -416 -597 214 518 -409 -1083 -386 656 38 -1109 -772 815 932 -585 -1108 591
1765E91J035j422j826R07K111l94k465m62K529J232j945j834J643K547q01k786
$$ 591 1626 204 -1622 -715 1396 1002 -1463 -1925 604 1836 -109 -1943 -300 2247 1446 -1340
1781a340j32K853P69k777j866K038K421j558k918P88L200L41l043j052K975K183
$$ -1340 -1472 1381 2150 -627 -2493 -455 1966 408 -2510 -1722 1478 1819 -1224 -2276 699 2882
1797B882k370k992J473L199o24l754o78L311J744l041k587K394L414r00l658J31
$$ 2882 512 -2480 -1007 2192 1568 -2186 -2864 447 2191 -850 -3437 -1043 2371 1471 -2187 -2056
1813b056L738J210l246k387K414K828j667l519M24L392O26l161j405K930K424
$$ -2056 1682 2892 -354 -2741 -327 2501 834 -2685 -2261 1131 1757 -1404 -2809 121 2545
1828B545j800k726J195L103j82l295q40K734J415k484k407J584K758o17k928j76
$$ 2545 745 -1981 -786 2317 2135 -1160 -2000 734 2149 -335 -2742 -1158 1600 983 -1945 -2121
1844b121K994J379k335j864J741K396r01k672j24K257N21k168j356J527J701q39
$$ -2121 873 2252 -83 -1947 -206 2190 1289 -1383 -1507 750 1271 -897 -2253 -726 975 136
1860A36j685L99K038K43j492n57J398Q73j119j229N97J105m26j344p2J219N29
$$ 136 -1549 -1150 888 1131 -361 -918 480 1353 234 -995 -398 707 281 -1063 -1135 84 613
1877F13r56n63Q58R80l03p69J16P70J05p02k78K29K32k16k37p4NJ8L65J29k56
$$ 613 -343 -906 -48 932 629 -140 -24 746 851 149 -129 100 332 116 -121 -195 -190 -172 193 322 66
1898F6k62M40N86k05o94p5P13K78q39p30N18P85l67j101J31J187L20j056m69R76
$$ 66 -196 244 830 625 -69 -144 569 847 8 -722 -204 581 214 -887 -756 431 751 -305 -774 202
1918B02J092p44j243M34J519j41j749n60J618J013j530j631J117K133m49k278
$$ 202 1294 550 -693 -259 1260 1119 -630 -1190 428 1441 -89 -1720 -603 1530 1081 -1197
1934a197j48K513J111k143j770J749K409j039k824p2K786P62k726j561K057K355
$$ -1197 -1345 1168 2279 136 -1634 115 2524 1485 -1339 -1411 1375 2137 -589 -2150 -93 2262
1950B262j404k580P55K947K12k810r26K588J608k150k488J270K772p15l104l81
$$ 2262 858 -1722 -967 1980 2192 -618 -1544 1044 2652 502 -1986 -716 2056 1341 -1763 -2144
1966b144L063J310k626k006K124K965j102l265J99L259P69l035j858K324K401
$$ -2144 919 2229 -397 -2403 -279 2686 1584 -1681 -1482 1777 2546 -489 -2347 -23 2378
1981B378j659k955O48L098L69k819q68K595J774j866k143J364K337n98k689j76
$$ 2378 719 -2236 -1588 1510 1879 -940 -1808 787 2561 695 -1448 -84 2253 1655 -1034 -1210
1997a210K339P45k246j373J784K010j131k138N79K403K35k124q71J815J257j287
$$ -1210 1129 1874 -372 -1745 39 2049 918 -1220 -641 1762 1997 -127 -998 817 2074 787
2013G87j899N88J787j96j776m34J572Q19j240q21R26J031m74j026K14R87k12j047
$$ 787 -1112 -524 1263 1067 -709 -1143 429 1248 8 -813 113 1144 670 -356 -142 845 633 -414
2031d14j7Q78K8q68j95P13M92o14l34N47N52m01m53K34N81k22o94K16N47r3q29
$$ -414 -431 447 475 -393 -588 125 617 3 -331 216 768 367 -86 148 729 507 -187 29 576 483 -346
2052c46Q2R15J44j013l12J079P36r56j101P76J450m00j807j41J795O06j736j219
$$ -346 -264 651 795 -218 -530 549 1285 329 -772 4 1454 1054 -753 -894 901 1507 -229 -1448
2070a448J385J688r46k041L68K116L44k075q53J793J397j514j908J110K133m99
$$ -1448 -63 1625 679 -1362 -994 1122 1466 -609 -1462 331 1728 214 -1694 -584 1549 1050
2086A050k365j06K383R60k292j518J887K088j195k611O29K813L59k723j219K420
$$ 1050 -1315 -1421 962 1922 -370 -1888 -1 2087 892 -1719 -1090 1723 2082 -641 -1860 560
2102E60K040j830k489J068K814r9k961q11K704J534k063k156J525K520p85k727
$$ 560 2600 770 -1719 -651 2163 2064 -897 -1708 996 2530 467 -1689 -164 2356 1571 -1156
2118a156J32K664P57k560j364K056J768j452k365Q20K421j42k504o61K332J452
$$ -1156 -1024 1640 2397 -163 -1527 529 2297 845 -1520 -700 1721 1579 -925 -1586 746 2198
2134B198j889j830J167K231m18k315m17K173Q77j738j512J086J746n46j718k8
$$ 2198 309 -1521 -354 1877 1459 -856 -1273 900 1777 39 -1473 -387 1359 813 -905 -933
2150i33J779N23j397q06J213J148q16j254L66J308j49j387n9J123M48r59p23R05
$$ -933 846 1369 -28 -834 379 1527 711 -543 -177 1131 982 -405 -464 659 1107 148 -575 330
2168C30Q63m32q19K65R73o9q20k22O03J83m73k19J77J75j91p2K88O7k79N7L87
$$ 330 1193 761 -58 207 1180 1111 291 69 672 855 382 163 340 515 324 252 540 607 328 385 772
2189G72O7m23k89M39L96m52o82O5R05k5q28k52O74O19n26p31L84R80r4j033j89
$$ 772 839 416 127 566 962 510 -172 -107 798 773 -55 -307 367 986 460 -271 113 1093 999 -34 -223
2210b23R45M96j094p68Q05J019n82j362L07J557J21j519o62J627J199j426j543
$$ -223 722 1218 124 -644 161 1180 598 -764 -457 1100 1221 -298 -960 667 1866 440 -1103
2227a103Q18J918l81k152l10J916Q97j805j332J182J952p54j987R5K002N28j800
$$ -1103 -285 1633 1252 -900 -1210 706 1603 -202 -1534 -352 1600 846 -1141 -1046 956 1484 -316
2244c16j119J452J382j065j827M80K003K8j964o95J801J311j469j710R21K145
$$ -316 -1435 17 1399 334 -1493 -1013 990 1018 -946 -1641 160 1471 2 -1708 -787 1358
2260A358k96k221m83K102J144j886j678J324K153p55k318LK361O28j910j229J563
$$ 1358 1062 -1159 -1642 460 1604 -282 -1960 -636 1517 762 -1556 -1553 808 1436 -474 -1703 -140
2277a40J706j043j887M50J949O7j893n50J445J064j129j365P67J559k86j615k60
$$ -140 1566 523 -1364 -914 1035 1102 -791 -1341 104 1168 39 -1326 -559 1000 714 -901 -1161
2294a161J577P42j287j161Q91J430n42j469l7J395N56j197r24R71J107o22j200
$$ -1161 416 1158 -129 -1290 -399 1031 489 -980 -1017 378 934 -263 -1187 -216 891 269 -931
2311i31L39J199M3r95k85Q72O10o62n94M63P49l88o41J72O76j0o60p1O29K55m54
$$ -931 -592 607 650 -345 -630 242 852 190 -404 59 808 420 -221 -49 627 617 -43 -114 515 770 316
2332C16k34M91M16k97l53J58L79j71m37J52K37q8l54O4M30q0m27l1N89L45o64
$$ 316 82 573 989 692 339 497 876 705 268 420 657 569 215 279 709 629 202 171 760 1105 441
2353D41l99M73P33n34r74K05Q92N7j123m23R99P72r37r40P17J257k80j352m7J374
$$ 441 42 515 1248 714 -260 -55 837 894 -229 -652 347 1119 182 -758 -41 1216 936 -416 -463 911
2373I11L62j316q74J070J063q49j477M81J638kj607n55J784J081j371j403Q95
$$ 911 1273 -43 -917 153 1216 367 -1110 -629 1009 1007 -600 -1155 629 1710 339 -1064 -169
2390a69J830n24k113j58J949P17j920j325J472J918j046j918M61K181K95k084
$$ -169 1661 1137 -976 -1134 815 1532 -388 -1713 -241 1677 631 -1287 -826 1355 1650 -434
2406d34q79J820J332j497j825Q84J892m19k034k57K012R38j829j235J428J770
$$ -434 -1313 507 1839 342 -1483 -599 1293 874 -1160 -1417 595 1533 -296 -1531 -103 1667
2422A667q74j904K71K038L11j981r61J596J397j297j702O53J950m7j852l75J776
$$ 1667 793 -1111 -840 1198 1509 -472 -1433 163 1560 263 -1439 -786 1164 1117 -735 -1110 666
2439F66R54j351j277R56J442n84j652J13J516K19j435o11J146J038q37j057N68
$$ 666 1620 269 -1008 -52 1390 806 -846 -733 783 1002 -433 -1044 102 1140 303 -754 -186
2456a86J225j24j288j38J076L93j048o12O88P67m74r04K43R05k6o89k10P51K86
$$ -186 1039 915 -373 -511 565 958 -90 -702 -14 753 279 -625 -382 523 497 -192 -402 349 635
2475F35m56m18L65M53k85n43K14N53k09m93R7O09M4o26K4N02L42n45m20O22N43
$$ 635 179 -239 126 579 294 -249 -35 518 309 -184 -87 522 566 -60 -36 466 808 263 -157 465 1008
2496A008n20n69L89P73j94r09J02Q50K29q81m35R45O29p37q29O05J127k83j219
$$ 1008 488 -81 308 1081 887 -22 80 930 1159 278 -157 788 1417 680 -149 456 1583 1300 81
2515H1M4J162K77j127p57J007J012p38j292L35J542kj430n26J340R05j154j181
$$ 81 125 1287 1564 437 -320 687 1699 961 -331 4 1546 1544 114 -412 928 1833 679 -502
2533e02Q63J312m14j554j46J543M77j383j031J203J310p75j537L73J629J90j603
$$ -502 361 1673 1259 -295 -441 1102 1579 196 -835 368 1678 903 -634 -261 1368 1558 -45
2550d5o33J428J051j247j362P81J512l93j574k67J571O87j269j048J000J366o23
$$ -45 -678 750 1801 554 -808 -27 1485 1092 -482 -749 822 1509 240 -808 192 1558 935
2567I35j514J96J466K57j482o53J159Q92q99j255N82J347j04j299k88J214N67
$$ 935 -579 -383 1083 1340 -142 -795 364 1256 357 -898 -316 1031 927 -372 -660 554 1121
2584A121j034q68P17J034l89j177k0J087K65r82m73P76P61n27p75L47Q09L7q70
$$ 1121 87 -781 -64 970 581 -596 -616 471 736 -246 -719 57 818 291 -484 -137 672 709 -161
2603a61k48P10L47n56n07L72N57j62n41Q9N24J38m23k44L52K23k67l25J29K85
$$ -161 -409 301 648 92 -415 -43 514 352 -189 -100 424 562 139 -105 247 470 203 -122 7 292
2623B92j13l03M2K72L2k57J5K95r7k52nK38n3k87k27K54K51l20k11J92L76j37
$$ 292 179 -124 -82 190 222 -35 -20 275 178 -74 -79 159 106 -181 -408 -154 97 -223 -434 -242 134 -3
2645cl91N2M58Jm72k27M74K42m69m50K75O42j60o83l0Q14K99n86m64N96N77l42
$$ -3 -394 -342 116 117 -355 -582 -108 134 -335 -785 -510 132 -28 -711 -741 73 372 -214 -678 -82 495 153
2667A53p65L7P80P8p67l62P40N66m76p69M43J026j40r02k49R01M90p98q19N19
$$ 153 -612 -575 205 283 -484 -846 -106 460 -16 -785 -342 684 544 -358 -607 294 784 -14 -833 -314
2687c14R55l63j013K2J074L61r68n58R16Q86n01j051J97J129J6j146m57R03Q09
$$ -314 641 278 -735 -713 361 722 -246 -804 112 998 497 -554 -357 772 788 -358 -815 88 897
2706H97q61r60M97J252j20j074j68J165M71q22q56P46Q78m35j070m2J089K92r46
$$ 897 36 -924 -427 825 705 -369 -537 628 1099 277 -579 167 1045 610 -460 -502 587 879 -67
2725f7o04R09P78n61q29L44J044j6j094k90R42N11q67p66M81Q81k75r04o0R71
$$ -67 -671 238 1016 455 -374 -30 1014 998 -96 -386 556 1067 200 -566 -85 796 521 -383 -443 528
2745E28L26p79n08N17O94m77p29J02P68J4q00k17O68L68n58l51K78O14k64n65
$$ 528 854 75 -433 84 778 301 -428 -326 442 456 -344 -561 107 475 -83 -434 -156 458 194 -371
2765c71Q2O06p0m51j84M43K63l58k39K67L45j97k93N9L99q0k99o2K68Q6l00r8
$$ -371 -289 317 247 -204 -388 55 318 -40 -279 -12 333 136 -157 -98 301 221 -78 -140 128 214 -86 -184
2787a84K19K62k12k40J98L71j54l89J35L15J9n34j89M30K18m35l85M25N03k43
$$ -184 35 297 85 -155 43 414 260 -129 6 321 340 -194 -383 47 265 -170 -555 -130 373 130
2807A30n95J21P04P1p38k37O69L72o39o58L80O60k32q71J04R41K42q60l20P56
$$ 130 -465 -344 360 431 -307 -544 125 497 -142 -800 -420 240 8 -863 -759 182 424 -436 -756 0
2827@O14n01q40L11R69k53j002j61Q71M03p82p04O93R50k00r96M8J016L00r41
$$ 0 614 113 -727 -416 553 300 -702 -863 8 411 -371 -1075 -382 568 368 -628 -580 436 736 -205
2847b05n62P50P52p20r17K24J146l3j175k27J098N40p54q07N57J104l40j173J4
$$ -205 -767 -17 735 15 -902 -678 468 435 -740 -967 131 671 -83 -890 -333 771 431 -742 -728
2866g28J155J86j158n79R09P73o91q46L19J053m5q93k71R89M32p46n09L98P63
$$ -728 427 613 -545 -1124 -215 558 -133 -979 -660 393 348 -545 -816 173 605 -141 -650 -252 511
2885E11l12q53L6P44K76p71l82O42O36m01p21M25P34j10p08j90O94L44n68n02
$$ 511 199 -654 -618 126 402 -369 -751 -109 527 126 -595 -170 564 454 -254 -444 250 594 26 -476
2905d76L27N20k34n41K9O18J32n55k77N44L23l33l09K10M08k10l50J31K49k9m15
$$ -476 -149 371 137 -404 -375 243 375 -180 -457 87 410 77 -232 -22 386 176 -174 -43 206 177 -238
2926b38k2K68J61k95j81L32J85r7k10J99K77o9l28J12K09l3l24nK03J75k90j76
$$ -238 -260 8 169 -126 -307 25 210 113 -97 102 379 310 -18 94 303 270 -54 -59 144 319 29 -147
2948a47L26L17j23k85K14M76j32l97r8M34J23n02l12L37M38l09n09J24O49J13
$$ -147 179 496 373 88 302 778 646 249 151 585 708 206 -106 231 669 360 -149 -25 624 737
2968G37n61j14N64M00m33n43K36M94j58o93r5O78J90n94l84N74N30k09n82J69
$$ 737 176 62 626 1026 593 50 286 780 622 -71 -166 512 702 108 -276 298 828 619 37 206
2988B06P03J24q61k48O06M43o36o53L64P15r9q37L1P46M42o07m42N19N37k25p34
$$ 206 909 1033 172 -76 530 973 337 -316 48 763 664 -173 -142 604 1046 439 -3 516 1053 828 94
3009I4Q6N95P0p46k94M77N30l79n84K27O76L0o51o5N82K63m98n61K78N38k24o72
$$ 94 180 775 845 99 -195 282 812 433 -151 76 752 782 131 66 648 911 413 -148 130 668 444 -228
3031b28n4O12K73n18m06M37N61k66n48J12N83M5n77k46K98L75l72l14O8M22K2
$$ -228 -282 330 603 85 -321 116 677 411 -137 -25 558 603 26 -220 78 453 81 -233 -165 257 279
3052B79l86q5M45J29k59k19K05K32q2m17O5K28M4k72j57J94K71j34k48P5K04O1
$$ 279 -107 -192 253 382 123 -96 109 341 259 -158 -93 135 179 -93 -250 -56 215 81 -167 -92 112 173
3074A73k39j28J60J27j25j97R0J18o6n8k3M4j2k9qL9l4n0K5J7N7j95K2J48Nj15
$$ 173 -66 -194 -34 93 -32 -229 -139 -21 -87 -145 -168 -124 -136 -165 -173 -134 -168 -218 -193 -176 -119 -314 -292 -144 -139 -254
3100b54o7J42K6p6r3R0J25p6k38Q2K67n0k63J6L26Q7j89j90J80L12r4l69RK88
$$ -254 -321 -179 -153 -229 -322 -232 -107 -183 -421 -339 -72 -122 -385 -369 -43 44 -145 -335 -155 157 63 -306 -297 -9
3124iP4l21k14L42K66j56m02J70M40J26l87k08K71L14k66m66J55M40kn76n2N39
$$ -9 65 -256 -470 -128 138 -18 -420 -250 190 316 -71 -279 -8 306 40 -426 -271 169 167 -409 -461 78
3146G8K24m21l72L94N01j72m64o8O10J06o27k50M51L91l57n07J89O39l3n30j52
$$ 78 302 -119 -491 -97 404 232 -232 -300 310 416 -211 -461 -10 381 24 -483 -294 345 312 -218 -370
3167c70N82L27l27m98K32N08j07n72r1M83K34m49m19M19M91k14m98R2N33R9m98
$$ -370 212 539 212 -286 -54 454 347 -225 -316 167 401 -48 -467 -48 443 229 -269 -177 356 455 -43
3188d3l11M64L47l53n60J67M98k4n06j04M56K73l99l23K14N06j92m64k5M51J37
$$ -43 -354 110 457 104 -456 -289 209 185 -321 -425 31 304 -95 -418 -204 302 110 -354 -379 72 209
3209B09m15k96K79K68j55l12J42L50p2k17j08L17J07k28j46N9K60o5l02O0K85
$$ 209 -206 -502 -223 45 -110 -422 -280 70 -2 -219 -327 -10 97 -131 -277 -218 42 -23 -325 -265 20
3230B0K2k27p9J57J31j46r5J05J00Mo8o1J28l5p1JJ32q5o1j6J68q0j70Q0O0O9
$$ 20 42 -185 -264 -107 24 -122 -217 -112 -12 -8 -76 -137 -9 -44 -115 -114 18 -67 -128 -144 24 -56 -226 -146 -86 -17
3256a7j97r1J92P2l2k12J01K49l6l07n9K88P8j91k10K14K04j31k67L8L74J02m28
$$ -17 -214 -305 -113 -41 -73 -285 -184 65 29 -278 -337 -49 29 -162 -372 -158 46 -85 -352 -314 60 162 -266
3279b66j15L45K79l32l52K74L73j82m13J6M92J59l94k81L11M14j71n21J50M96
$$ -266 -381 -36 243 -89 -441 -167 206 24 -389 -373 119 278 -116 -397 -86 328 157 -364 -214 282
3299B82M6n87j75M73K71k80n51K85N74j04n84K2N19K06n07l58M08L94j92o19N3
$$ 282 328 -259 -434 39 310 30 -521 -236 338 234 -350 -328 191 397 -110 -468 -60 334 142 -477 -424
3320d24O07Q2m75l29M73M99m17m97J77O66Mo28k23N10L36l55l84J84M60r7m05
$$ -424 183 265 -210 -539 -66 433 16 -481 -304 362 366 -262 -485 25 361 6 -378 -194 266 169 -236
3341b36j02N32J69l48k74K05M42k11m42J08L95K2m06j67L09K85k42k73J07K87
$$ -236 -338 194 363 15 -259 -54 388 177 -265 -157 238 260 -146 -313 -4 281 39 -234 -127 160
3361A60K8m00l7K40K17k93j99N1K63m4k42JJ27K05j68j41j9K36p5j02PNJ03p4
$$ 160 188 -212 -249 -9 208 -85 -284 -233 30 -14 -256 -255 -128 77 -91 -232 -251 -15 -90 -192 -185 -180 -77 -151
3385a51k0l9M2P3q1N5r8J14K9kl5n2J95j28k3j8L8J40n7j25K0J52J00j24j87J79
$$ -151 -171 -210 -168 -95 -176 -121 -219 -105 -76 -78 -113 -165 30 -98 -121 -139 -101 39 -18 -143 -123 29 129 5 -182 -3
3411cK22j40k30N6K59O2k84k07K51L07j89k70N4L31Q8m29p3K93K22j84l60J34
$$ -3 219 79 -151 -95 164 226 -58 -265 -14 293 104 -166 -112 219 307 -122 -195 98 320 136 -224 -90
3433i0L12K5l68n0L06K06k66l17J73N15j20m62j25N38K08l63l24K09M59j52m95
$$ -90 222 247 -121 -171 135 341 75 -242 -69 446 326 -136 -261 277 485 122 -202 7 466 314 -181
3454a81kN32J29m11l24L19M49k61l84O8M57Q3n30j95L44M18k90m45K7N24K0m18
$$ -181 -183 349 478 67 -257 62 511 250 -134 -66 391 474 -56 -251 93 511 221 -224 -197 327 347 -71
3476g1j89L96K63l32l07J36M26o8n18o6M22J96l06l03K18M14j30m63lM13J52l10
$$ -71 -260 136 399 67 -240 -104 322 254 -264 -330 92 288 -18 -321 -103 311 181 -282 -285 128 280 -30
3498c0k75K24L50k12l38J21L28Q1l36j20J72K50n7k97N0K37K4j63p0J18J71j61
$$ -30 -305 -81 269 57 -281 -160 168 249 -87 -207 -35 215 158 -139 -89 148 172 9 -61 57 228 67
3520F7k02P0K19M5k74MJ57N7o4j70RJ70J7j01j42P2J92o0j65o8J60Q9p8j86L7
$$ 67 -135 -65 154 199 -75 -71 86 143 79 -91 -82 88 105 4 -138 -66 126 66 -99 -167 -7 82 4 -182 -145
3545a45O8J94k13r1M4J11N7j69r0J87J74j84j49N7K26J0k62p3K55K09j50l02J31
$$ -145 -77 117 -96 -187 -143 -32 25 -144 -234 -47 127 -57 -206 -149 77 87 -175 -248 7 216 66 -236 -105
3568a05L16K8l70j11L41J72k36k93K54K87m9l17j21L86K81l36l22J88M71j36m58
$$ -105 211 239 -131 -242 99 271 35 -258 -4 283 234 -83 -204 182 463 127 -195 -7 464 328 -130
3589a30n6M69K11l91l60K50M44j26n24j0O00J19n64k14L99L76j59n72R3O38n2
$$ -130 -186 283 494 103 -257 -7 437 311 -213 -223 377 496 -68 -282 117 493 334 -238 -145 493 441
3610D41m87k12M50L43k78o04K37N61q9m63o7L72K76l48l95K24M58n8m88j54N59
$$ 441 -46 -258 192 535 257 -347 -110 451 362 -101 -168 204 480 132 -263 -39 419 361 -127 -281 278
3631B78K57n02l38K61M16j07n05M8M44J40m16k92L61L05k47l93O2M19M8l54k35
$$ 278 535 33 -305 -44 372 265 -240 -192 252 392 -24 -316 45 350 103 -290 -228 191 239 -115 -350
3652c50K73K69k10k76J16L22L0l03j33K13K39j49k67Q0K25j7k04j18P8K36n4j28
$$ -350 -77 192 -18 -294 -178 144 174 -129 -262 -49 190 41 -226 -146 79 62 -142 -260 -182 54 0 -128
3674a28j4J83R3q9j90R1J19L3q9j33Q0J18p9j68nJ64J42j36j96J00K39Nk84j41
$$ -128 -142 41 134 45 -145 -54 65 98 9 -124 -44 74 -5 -173 -178 -14 128 -8 -204 -104 135 140 -144 -285
3698b85L57J30k24k74J07K61L3l64k7K50J76k24l51K16L33k8m20m7L31J79l61
$$ -285 72 202 -22 -296 -189 72 105 -259 -286 -36 140 -84 -435 -219 114 86 -334 -381 -50 129 -232
3719b32k03K23M47j57m35o9M63K84m16l61L10M59k11m68j8M53K00l81l57M53L52
$$ -232 -435 -212 235 78 -357 -426 37 321 -95 -456 -146 313 102 -366 -384 69 269 -112 -469 -16 336
3740C36j99n02L7O01Q0n87j78M09M09k74o12K46N33m9n76n4M41K60k94m23J25
$$ 336 137 -365 -328 273 353 -234 -412 -3 406 132 -480 -234 299 250 -326 -380 61 321 27 -396 -271
3761b71N35rn79n6L98K82l79k85J50M58q7n18n0N06K03l88k90K67L38q9m06n7
$$ -271 264 255 -324 -380 18 300 -79 -364 -214 244 157 -361 -411 95 298 -90 -380 -113 225 136 -270 -327
3783c27M01J48l43k59K79L56j58m60J51L70L8k72k54K93K09j14k87k3K90J41k48
$$ -327 74 222 -121 -380 -101 255 97 -363 -212 158 196 -76 -330 -37 172 58 -229 -252 38 179 -69
3804f9k04K42J97o4k44n5K55J36k17j86J28K14j0k32j90L45J44j57j61M7K24k0
$$ -69 -273 -31 166 102 -142 -197 58 194 -23 -209 -81 133 123 -109 -299 46 190 33 -128 -81 143 123
3826A23j58r0M2J91Nk25n7K10J71k63j43J43K91r8k56l0K87J42k86j92J63L56
$$ 123 -35 -125 -83 108 113 -112 -169 41 212 -51 -194 -51 240 142 -114 -144 143 285 -1 -193 -30 326
3848C26j58k75m0L57R6k81k52K82L74j80l68j33M53K07l91l12K62M18j78m23J2
$$ 326 168 -107 -147 210 306 25 -227 55 429 249 -119 -252 201 408 17 -295 -33 385 207 -216 -204
3869b04L84J84m06k46L53L29k34l99j2N16O8m52k39L75M20l32m92R1N73N5m52
$$ -204 180 364 -42 -288 65 394 160 -239 -251 265 333 -119 -358 17 437 105 -387 -296 277 332 -120
3890a20k38L65M03j59n67J15N30P7n79k15M76L83l48m44K08N05K5n31j46M37K91
$$ -120 -358 7 410 251 -316 -201 329 406 -173 -388 88 471 123 -321 -113 392 417 -114 -260 177 468
3911D68l69l49J66N07j26m60p5M24J96l83l51K68M33m7n46K7M38J25l31l53L00
$$ 468 99 -250 -84 423 297 -163 -238 186 382 -1 -352 -84 349 302 -244 -217 221 346 15 -338 -38
3932c8L18j34l17q4M30O4k59k72J40K82k4l00p9L89R5k87j65K15J82k3l37rL24
$$ -38 280 146 -171 -255 175 239 -20 -292 -152 130 106 -194 -273 116 211 -76 -241 -26 156 133 -204 -213 111
3955A11P4k24j84J18K82j34j65p4L36Q8j93j94J50J90j4j60k16K24K20r5l01j1
$$ 111 185 -39 -223 -105 177 43 -122 -196 140 228 35 -159 -9 181 167 7 -209 15 235 140 -161 -172
3977a72K70Q8j56k46J46K86Ll01j17L27M6j90j88J7L45o6l06q4M12J27k63l59
$$ -172 98 186 30 -216 -70 216 219 -82 -199 128 174 -16 -204 -187 158 92 -214 -298 114 241 -22 -381
3999c81K33M35p8m25l2M50J32l99k67K47M06j56m81M8M07K54m31l48L94M92k06
$$ -381 -148 287 209 -216 -248 202 334 -65 -332 -85 321 165 -316 -268 139 393 -38 -386 8 500 294
4020B94o34O8N26J97m59m73M52M62k06n17R9M85K17n73l18M33M08k86m84J09N56
$$ 294 -340 -272 254 451 -8 -481 -29 433 227 -290 -191 294 511 -62 -380 53 461 175 -309 -200 356
4041C56nn48k41N44L50l95l74J33N69j2o19j07M77L40m30l92K37M97q0n62j28
$$ 356 351 -197 -438 106 456 61 -313 -180 389 377 -242 -349 128 468 38 -354 -117 380 300 -262 -390
4062c90N73J89l79l24K90L49kn01J0L86K54m22k52K31K79n0l54m9M07J18l50k45
$$ -390 183 372 -7 -331 -41 308 306 -195 -185 201 455 33 -219 12 291 241 -113 -162 245 363 13 -232
4084b32K60L79j77l14J8L06J62l59j97K01K73p8l22m0K79J59k01k49J57K69j10
$$ -232 28 407 230 -84 -66 240 402 43 -154 47 320 242 -80 -120 159 318 117 -132 25 294 184
4105A84k08n3J31K33j84j70lK72R9k32j44J39J97j58j43NJ94J49k37k38J95L21
$$ 184 -24 -77 54 287 103 -67 -70 202 301 69 -75 64 261 103 -40 -35 159 308 71 -167 28 349
4127C49j65k80L6K88J68k74k01J02L38qm05j48L78K47l29l84K71M28k4m90j50
$$ 349 184 -96 -60 228 396 122 -79 23 361 353 -52 -200 178 425 96 -288 -17 411 387 -103 -253
4148b53M44L10m38l56J63M64j7n42j35N61J62m01m17L47N63k64n16pN28K16n36
$$ -253 191 501 63 -293 -130 334 317 -225 -360 201 363 -38 -455 -108 455 191 -325 -332 196 412 -124
4169a24l45M59M27l07o00J89N71J08n73l41M86N09l50n48J07O32Q7o54l09N71
$$ -124 -469 -10 417 110 -490 -301 270 378 -195 -536 -50 459 109 -439 -332 300 387 -267 -576 -5
4189eL28k79n50J54N87J2m88k63N58L20l78m47K23M43Pn14j46M82K52l87m26K68
$$ -5 323 44 -506 -352 235 247 -241 -504 54 374 -4 -451 -228 215 222 -292 -438 44 296 -91 -517 -249
4211b49N18j28n16KM58J63l55l57K80M25j69m37o5N09J40l41k51J82L57p8k94
$$ -249 269 141 -375 -373 85 248 -107 -464 -184 241 72 -365 -430 79 219 -122 -373 -191 166 88 -206
4232b06oK83J27k44k22J68K07j2k36p0K62J14j87j98J09K88k6k76o9K53K13k50
$$ -206 -212 71 198 -46 -268 -100 107 95 -141 -211 51 165 -22 -220 -111 177 151 -125 -194 59 272 22
4254B2k14J34K30K9k97q8J92K21m3m06K4L76P4k48k33K05L09q9m19R5K03J83k54
$$ 22 -192 -58 172 201 -96 -184 8 229 186 -220 -196 180 254 6 -227 -22 287 198 -221 -126 77 260 6
4277Fk68J66L15o0k98j43M14J53k98k14J36N07j75m42k2L81J65m00k02K27M07
$$ 6 -262 -96 219 159 -139 -282 132 285 -13 -227 -91 416 241 -201 -223 158 323 -77 -279 -52 355
4298C55j81m56m1N09K14n02k78L73M93k14o00L8M73J85m56l44L48N53k83n64P0
$$ 355 174 -282 -323 186 400 -102 -380 -7 486 272 -328 -290 183 368 -88 -432 -84 469 186 -378 -308
4319c08O03J17n02l69M40M72k82m77L6N67M5n44k29N24L35l58m73K00N61qn90
$$ -308 295 412 -90 -459 -19 453 171 -306 -270 297 342 -202 -431 93 428 70 -403 -203 358 350 -240
4340b40j55N49L33m25m67K04N96j28n67o9M26M76n33m04K64N08l7m84r1M45K77
$$ -240 -395 154 487 62 -405 -201 395 267 -300 -369 57 533 0 -404 -140 368 331 -153 -244 201 478
4361D78m38l72K17M39r8m94m0M64J44l40l25L25L87k13l76J6M36J19l35l47L36
$$ 478 40 -332 -115 324 226 -268 -308 156 300 -40 -365 -40 347 134 -242 -226 210 329 -6 -353 -17
4382a7K42o6l76RL42R9k40k02R2L48n9l16j9K49J86k24l13J47K78K0k61j16K49
$$ -17 225 159 -217 -208 134 233 -7 -209 -117 231 172 -144 -163 86 272 48 -265 -118 160 180 -81 -197 52
4405E2J98j23k62J9K66O0k69j49J52K66j32k20k8K92J76l43q9J15K87n5m07K2
$$ 52 250 127 -135 -116 150 210 -59 -208 -56 210 78 -142 -170 122 298 -45 -134 -19 268 213 -194 -172
4427a72K57J99k84k97J86L49M2m68j41M31K52l76k95K06M88r6n15q5N28J65m86
$$ -172 85 284 0 -297 -111 238 280 -188 -329 102 354 -22 -317 -111 377 281 -234 -319 209 374 -112
4448a12l19L13N23k06n16m9O08K21m64l68L24N62k44n82pO52J20n50l48M33N78
$$ -112 -431 -118 405 199 -317 -366 242 463 -1 -369 -45 517 273 -309 -316 336 456 -94 -442 -9 569
4469E69l53o12J71O43P0n79l84N46M19l60n71J87O17J9o77j66N48L69m43n25K96
$$ 569 216 -396 -225 418 488 -91 -475 71 490 130 -441 -254 363 382 -295 -461 87 456 13 -512 -216
4490b16O05j18n69r4N51L04m91m93K99N31j03m82j00M95K52m47l37L07M32j18
$$ -216 389 271 -298 -392 159 463 -28 -521 -222 309 206 -276 -376 119 371 -76 -413 -106 326 208
4510B08m80m5N13J81l33m03K69M12j68l54r4M28J73k72k79J80L30m8l53K5K22
$$ 208 -272 -317 196 377 44 -359 -90 322 154 -200 -294 134 307 35 -244 -64 266 218 -135 -110 112
4531A12J97k53k47J64K78n8l34P6K23N7j19k85J08K79K9k45r1J52J33n3k28j02
$$ 112 309 56 -191 -27 251 193 -141 -65 158 215 96 -189 -81 198 227 -18 -109 43 176 123 -105 -207
4553b07L25J10k67j67R3L49j15k38r7K38K41k58k25P7L83Pm41k2L34J97k69l79
$$ -207 118 228 -39 -206 -113 236 121 -117 -214 24 265 7 -218 -141 242 249 -192 -214 120 317 48 -331
4575c31K19M03j2m70j36M31K25k69m30K52M94j30n15p1M51K98m67m32L54N26j66
$$ -331 -112 291 279 -191 -327 104 329 60 -370 -118 376 246 -269 -340 111 409 -58 -490 -136 390 224
4596B24n62j37O85K12n08m00L39N87j93o38J4N07K81n67l68M04N80k83o40R6N80
$$ 224 -338 -475 210 422 -86 -486 -147 440 247 -391 -377 130 411 -156 -524 -120 460 177 -463 -367 213
4617B13J71n71l33M94M90l38n53J05O33k2n18k68N09M06l31n07K13N76O2o36k23
$$ 213 384 -187 -520 -26 464 126 -427 -322 311 289 -229 -497 12 418 87 -420 -207 369 431 -205 -428
4638d28N82K99l96m93K84M73m7m95j22M61L29m44l35K11M45m6m97r0L49L16l78
$$ -428 154 453 57 -436 -152 321 274 -221 -343 118 447 3 -332 -121 324 278 -219 -309 40 356 -22
4659b2l03K40L22o3m84J2L85K04l57k23J09M22q1l57r4L17K31k66k86J14L94k3
$$ -22 -325 -85 237 174 -310 -298 87 291 -66 -289 -180 242 161 -196 -290 27 258 -8 -294 -180 214 191
4681A91k82j28K41J56j50k45L8L06R4l03q0J84J68q3k68L6K57J14l00k52K58K06
$$ 191 -91 -219 22 178 28 -217 -179 127 221 -82 -162 22 190 107 -161 -125 132 246 -54 -306 -48 158
4703A58k6k78k6K93N4j65k55K03K69o2l50n6K77K23k51l12J11M13r8l57j23M50
$$ 158 132 -146 -172 121 175 10 -245 -42 227 165 -185 -241 36 259 8 -304 -193 220 122 -235 -358 92
4725I2K27k57m42J92M39n8l83j09L94K23l65l66J99N10j34m38j26N30K93m42l98
$$ 92 319 62 -380 -188 251 193 -190 -299 95 318 -47 -413 -214 296 162 -276 -402 128 421 -21 -419
4746d19K62N48j78n44n9N90K11m79l88L88M28r6o14M9N68K00n33l94M49M73k00
$$ -419 -157 391 213 -331 -390 200 411 -68 -456 -68 360 264 -350 -301 267 467 -66 -460 -11 462 262
4767B62o77Q3N72J62n83l76N25N04l03n83R2O38%m98l23N15L64l15m55M3O35R
$$ 262 -415 -332 240 402 -181 -557 -32 472 169 -414 -322 316 316 -182 -505 10 374 59 -396 -353 282 291
4789B91n78k15M80L50l61m26J68N18l9m42j53M21L42m25l98K15M62n4n27k4M47
$$ 291 -287 -502 -22 328 -33 -459 -291 227 188 -254 -407 14 356 -69 -467 -252 210 156 -371 -395 52
4810E2K59m04l29K35M36j58l18r2L91J38l22k75K25L19j02k91o5K75K14j89k56
$$ 52 311 -93 -422 -187 249 91 -227 -319 72 210 -112 -387 -162 157 55 -236 -301 -26 188 -1 -257
4831b57J08K65N9l02j42K52J64q8k16K0L00j2k47n8J19J89o0k43k2K66J76k66
$$ -257 -149 116 175 -127 -269 -17 147 59 -157 -137 163 151 -96 -154 -35 154 94 -149 -171 95 271 5
4853Ej58R2K67o2j90j63L15J44p7l59J04L48K6l33j79M11J94j72m87K10L98j1
$$ 5 -153 -61 206 144 -46 -209 106 250 173 -186 -82 266 292 -41 -220 191 385 213 -274 -64 334 323
4875C23m63r3L80L04l83l45J84N12o8m96k39N33L26l26n15J97N16N7o69p9M91
$$ 323 -140 -233 147 451 68 -277 -93 419 351 -145 -384 149 475 149 -366 -169 347 404 -265 -344 147
4896A47L03m77m05L49M74j32o02m3O04K17m83l56L26N31k45n13l1O06J87n29m13
$$ 147 450 -27 -432 -83 391 259 -343 -386 218 435 -48 -404 -78 453 208 -305 -336 270 457 -72 -485
4917d85M58M73k29n93M7O47J16n72k75M93L64l33n51J86N71J1m59k12M43L46l65
$$ -485 -27 446 217 -376 -329 318 434 -138 -413 80 444 111 -440 -254 317 328 -131 -343 100 446 81
4938H1m57J59N89k5n41j63M84L41m13l77K32M44j53m17p0M15K29l50l25K22M07
$$ 81 -376 -217 372 347 -194 -357 127 468 55 -322 -90 354 201 -216 -286 129 358 8 -317 -95 312
4959C12j10m24p9M10K30l71j97J28L23o9l12j09L51J31j39l21J31J75O3k36j22
$$ 312 202 -222 -301 109 339 -32 -229 -101 222 153 -159 -268 83 214 75 -246 -115 60 123 -113 -235
4980b35K37K16j92k49L3K42R1k38j70K13J94m7k55j04K95K05k67j97R3K56pl09
$$ -235 2 218 26 -223 -190 52 143 -95 -265 -52 142 95 -160 -264 31 236 -31 -228 -135 121 114 -195
5002a95k0J95K20k06k67Q6L24K5l32k02L07K29j86l30J08M35o7k78j19K34L70
$$ -195 -215 -20 200 -6 -273 -187 137 162 -170 -372 -65 164 -22 -352 -244 191 124 -154 -273 -39 331
5023C31k94l81J88M76l8n42j52N19K93m07m42K79N36p8n92q2O01K18m27m52K36
$$ 331 37 -344 -156 320 282 -260 -412 107 400 -7 -449 -170 366 288 -304 -386 215 433 6 -446 -210
5044b10O06q7n55j14N44K70n17l58L32N21j41o12o9O13K32n16l80M01N04j89o40
$$ -210 396 309 -246 -360 184 454 -63 -421 -89 432 291 -321 -390 223 455 -61 -441 -40 464 275 -365
5065c65M0O38J14n49l32M92M12k76n68J96M93P2n94j65M65M04l83m61J75N94j20
$$ -365 -325 313 427 -122 -454 38 450 174 -394 -198 295 367 -227 -392 73 477 94 -367 -192 402 282
5086B82m57j58M36L10l19m02J41M95l8m51j36M68K04l58l09J58M12o7m40QL61
$$ 282 -175 -333 103 413 94 -308 -167 328 290 -161 -297 171 375 17 -292 -134 278 211 -229 -221 140
5107A40K10l82k24J52L61l3l79j00L97J97l47j87J37L01p6k68j33K95J62q8k70
$$ 140 350 -32 -256 -104 257 224 -155 -255 142 339 -8 -195 -58 243 167 -101 -234 61 223 135 -135
5128a35QK98J18l16j10J67K21o8l08L5K68M6j23j69J42J95n5k41n5K28J35j97
$$ -135 -127 171 289 -27 -137 30 251 183 -125 -90 178 224 101 -68 74 269 214 -27 -82 146 281 84
5150H4k51R7L19l7l37n3K59K76k55l45J07M14p7k97j64L26K58k72l43J23M13K8
$$ 84 -167 -70 249 212 -125 -178 81 357 102 -243 -136 278 201 -96 -260 66 324 52 -291 -168 245 273
5172B73m27j72M06L55l97l85J44M37N4n26r4M58K71l70l77J70N79j74n07o3N63
$$ 273 -154 -326 80 435 38 -347 -203 234 288 -238 -332 126 397 27 -350 -180 399 225 -282 -345 218
5193B18J93l76m45L30M71j31m89j53N91K55n22l87L44N14k10o18K2N74K23m95
$$ 218 411 35 -410 -80 391 260 -229 -382 209 464 -58 -445 -101 413 203 -415 -393 181 404 -91
5213i1m18M87M08j51n78j0N77J23m96k98M44M10k75n05J84M79P7m99l17N13K85
$$ -91 -509 -22 386 235 -343 -353 224 347 -149 -447 -3 407 132 -373 -189 290 367 -132 -449 64 349
5234C49k78m36R6N73k4m15k26M68K80k96m29J76N30n4m59j09L66J90k87k32J46
$$ 349 71 -365 -269 304 280 -135 -361 107 387 91 -338 -162 368 314 -145 -254 112 302 15 -217 -71
5255g1L26J5l89j15L19J84j61l62J65L18n2k91q0L35R6j67k77J76J60Q1l15q9
$$ -71 255 270 -119 -234 85 269 108 -254 -89 229 177 -114 -194 141 237 70 -207 -31 129 210 -105 -194
5277a94J93J92j39k20L0K19J23l05j11J56J94%k81l3J95J89k37k23J14L11j3k61
$$ -194 -1 191 52 -168 -138 81 204 -101 -212 -56 138 138 -143 -176 19 208 -29 -252 -138 173 160 -101
5299a01j57K75K28j51l16P8L49q0k10j89L51J69j49l82J54L95j8l19k24L86K62
$$ -101 -258 17 245 94 -222 -144 205 125 -85 -274 77 246 97 -285 -131 264 246 -73 -297 89 351
5320C51l03l59J70M39N5n65r3M22K71l34m78J94N57q8m30j36M92K45l85n06L46
$$ 351 48 -311 -141 298 353 -212 -305 117 388 54 -424 -230 327 239 -191 -327 165 410 25 -481 -135
5341a35M53k5n70o1M72K94m26l87K80M63q2n84N6N14J70m45l76L18N30k61n34
$$ -135 318 293 -277 -338 134 428 2 -385 -105 358 276 -308 -252 262 432 -13 -389 -71 459 198 -336
5362c36L7N77J10m58l14L85M12j80n31L9N86J52n55l30M13L52j23n45J24M39J28
$$ -336 -299 278 388 -70 -384 1 413 233 -298 -259 327 479 -76 -406 7 359 236 -309 -185 254 382
5383C82n10k45M33L36l20k78O1L18J08m31k05L55L34k73l60J01L95L8m10j29L87
$$ 382 -128 -373 60 396 76 -202 -141 177 285 -146 -351 4 338 65 -295 -194 201 239 -171 -300 87
5404H7K38k36k78J01L32j5m05o4K40J69j39k57L2L59J2k28j72K12K15j36k29N9
$$ 87 325 89 -189 -88 244 229 -176 -240 0 169 30 -227 -195 164 176 -52 -224 -12 203 67 -162 -103
5426a03K30N1k39r7J33K65q6l24LK47J57k11j91O7K74j9k49j35L26J51k29l04
$$ -103 127 178 -61 -158 -25 240 154 -170 -167 80 237 26 -165 -98 176 157 -92 -227 99 250 21 -283
5448b83J13M20n9l18j67L26K01j81l25J01L55%m00n5K81L12k68l74J13M27K0l84
$$ -283 -170 250 191 -127 -294 32 233 52 -273 -172 183 183 -217 -272 9 321 53 -321 -208 219 239 -145
5470a45k51M01K80k46l30J17M36Jm74j11L41L32l08m71K39M53O1n77j55M97K56
$$ -145 -396 5 285 39 -291 -174 262 263 -211 -322 19 351 43 -428 -189 264 325 -252 -407 90 346
5491C46l50m08K30N66o9n68l9M38K44m02l59L17M56j98n06j1N18J50m60l52L40
$$ 346 -4 -412 -182 384 315 -253 -292 146 390 -12 -371 -54 402 204 -302 -313 205 355 -105 -457 -117
5512a17N44k24n40L7N00J15m03l39M27L86k35m63pN64J16m75k34L77L27k31m56
$$ -117 427 203 -337 -300 200 315 -88 -427 0 386 151 -312 -319 245 361 -114 -348 29 356 125 -331
5533c31L6N46N7m05k85L67L22k34l41R5M07J00m61j81L38K79j98l93O5M24k0l11
$$ -331 -295 251 308 -97 -382 -15 307 73 -268 -173 234 334 -127 -308 30 309 111 -282 -217 207 187 -124
5555a24j47L06K43k12k60O8L02M0l01j89K73J65j03k17m1L15J4j72k00J85K53
$$ -124 -271 35 278 66 -194 -126 176 216 -85 -274 -1 164 61 -156 -197 118 132 -40 -240 -55 198
5576A98r1k23o2K50J02j11k73J01K97ok60j46L19J11j45k08L8L47l0l25q9K34
$$ 198 107 -116 -178 72 174 63 -210 -109 188 182 -78 -224 95 206 61 -147 -109 238 208 -117 -206 28
5598B8K09j81k41mL53J1l06j86L64J87j27l22N2L97J5l49k31L80K20j64l88O9
$$ 28 237 56 -185 -189 164 175 -131 -317 47 234 107 -215 -163 234 249 -100 -331 49 269 105 -283 -214
5620b14M66R2n36j13L58L61l34m00J63M41qm67j99M15L95l18n22K84M73j9n20
$$ -214 252 344 -192 -305 53 414 80 -320 -157 284 276 -191 -390 25 420 102 -420 -136 337 318 -202
5641b02j86N07L10l59m12K31M87j67m78r6M64K46l30m10K86N10j33n43p2N47K22
$$ -202 -388 119 429 70 -342 -111 376 209 -269 -365 99 345 15 -395 -109 401 268 -275 -347 200 422
5662D22m98l50L79M67j82n81K8N00J61m26l85M43K69j02n05Q0N22J41m62k34L04
$$ 422 -76 -426 -47 420 238 -343 -315 185 346 -80 -465 -22 247 145 -360 -280 242 383 -79 -313 -9
5683iL42k36m21O3M85O6l46j88K84L48l02l38J31K90J11l08k73L28K20j81k79
$$ -9 333 97 -324 -261 224 290 -56 -244 40 388 86 -252 -121 169 280 -28 -301 27 247 66 -213
5704b13Q2L18N0l25j15K04K30j40k75J3K67J18k56j38J39J92k5l15Q0J67J96j88
$$ -213 -131 187 237 -88 -203 1 231 91 -184 -171 96 214 -42 -180 -41 151 126 -189 -109 58 254 66
5726F6l07J76K31kl58O5J35K18k63j39K6K86P6l11j12J68K95j25l64P3L33N8k67
$$ 66 -241 -65 166 164 -194 -129 6 224 -39 -178 -152 134 210 -101 -213 -45 250 125 -239 -166 167 225 -42
5749d2k35K74K76k95k76Q3M04Nk72k02K57M07k25m10K9M23J14m93j76L46L33k62
$$ -42 -277 -3 273 -22 -298 -215 189 194 -78 -280 -23 384 159 -251 -222 201 315 -178 -354 -8 325 63
5771F3l45J00L76J8m06j38L58K89l19l63J41N08p5m41j74M29M01m04m25K13M37
$$ 63 -282 -182 194 212 -194 -332 26 315 -4 -367 -226 282 207 -234 -408 21 422 18 -407 -194 243
5792B43J1m85j65M81L13m32l02K13M18q0n06o6N28J44k61m18K37M96o7n45j00
$$ 243 254 -231 -396 85 398 -34 -336 -123 295 215 -291 -357 171 315 54 -364 -127 369 302 -243 -343
5813c43N08K28l97l61L69L53j87m25O0L89J72m00l28L47L35j49l48n8M17J30l61
$$ -343 165 393 -4 -365 4 357 170 -255 -195 194 366 -34 -362 -15 320 171 -177 -235 182 312 -49
5834d9l23L59K99j45m50J08L81Q6l65j86J67L49j83l09P8K87P8k56k23K50J48
$$ -49 -372 -13 286 141 -309 -201 180 266 -99 -285 -118 231 48 -261 -183 104 182 -74 -297 -47 101
5855A01q4k31j6L33R1k21k09J69K17o8k04k9K64Q8k37j64J28K23Ml18nK31K01
$$ 101 17 -214 -230 103 194 -27 -236 -67 150 82 -122 -151 113 201 -36 -200 -72 151 155 -163 -168 63 264
5878B64k29k00J11K50L2l46p0K51K20j82k92J11K27j4k67o0K24K16j00l44L6L17
$$ 264 35 -165 -54 196 228 -118 -188 63 283 101 -191 -80 147 133 -134 -194 30 246 146 -198 -162 155
5900A55J42l28j93K12L20j42l77j5M82N1l84k32L30L99k91l87R5M08N9l81k04
$$ 155 297 -31 -224 -12 308 166 -211 -226 256 307 -77 -309 21 420 129 -258 -163 245 304 -77 -281
5921b81L68K58j90m80J64N02N3n19j10K76L48k34m75J05M69Q3n09j51L83K84l06
$$ -281 87 345 155 -325 -161 341 394 -125 -235 41 389 155 -320 -215 254 337 -172 -323 60 344 38
5942C8n03K99M14Mn04j72M73K90l57m16K77M25n3n19p8M74K88m13l96K85L97j10
$$ 38 -465 -166 248 252 -252 -424 49 339 -18 -434 -157 268 215 -304 -382 92 380 -33 -429 -144 253 143
5964A43m78o1N36J59m03l20K68M80k24l33k8M23J38l39l28K89K99j8m09L4K92
$$ 143 -335 -396 140 299 -104 -424 -156 324 100 -233 -261 162 300 -39 -367 -78 221 203 -206 -172 120
5985A20J52k66k69K54K85j15l40Q4K10P1j92l29L64K53k23j97k2K63Q3k46j66
$$ 120 272 6 -263 -9 276 161 -179 -95 115 186 -6 -335 29 282 59 -138 -160 103 186 -60 -226
6006b26J89K33r6k36o3K79J06j91k27Q2L42j6k96j43K88K07k19k21Q0K73O8l35
$$ -226 -37 196 100 -136 -199 80 186 -5 -232 -150 192 176 -120 -263 25 232 13 -208 -128 145 213 -122
6028a22q0J45K66j44k65O5K33J31k76j91K67J85j79k29K2K92J01k73k41K45L28
$$ -122 -202 -57 209 65 -200 -135 98 229 -47 -238 29 214 35 -194 -172 120 221 -52 -293 -48 280
6049B80q7l73j6M07Q0l09k80K54L14j21m44R6M36N0l10l79M30L55k97l53O5M28
$$ 280 193 -180 -196 211 291 -18 -298 -44 270 149 -295 -199 237 287 -23 -402 28 383 86 -267 -202 226
6071B26M0l89k27K92L75k47l82J15M51M7m53j44L74K66k06m83K07M63p8m14j47
$$ 226 266 -123 -350 -58 317 70 -312 -197 254 301 -152 -296 78 344 138 -345 -138 325 247 -167 -314
6092c14M27K50l19l57J87M88r1m64j50M89K42l65l55J42M98p8m64o3M02K36l51
$$ -314 113 363 44 -313 -126 362 271 -193 -343 146 388 23 -332 -190 308 230 -234 -297 105 341 -10
6113a0l12J99M21j15m17JL34J65k36k90J33L76j14l95L3L77J10k81k74K03L09
$$ -10 -322 -123 298 183 -234 -233 101 266 30 -260 -127 249 135 -260 -227 150 260 -21 -295 -92 217
6134B17k3m27JL00J13j68l48K38K56n3l24OL39Q3k58k59K07K34j7k69j10K45K02
$$ 217 194 -233 -232 68 181 13 -335 -97 159 106 -218 -212 127 210 -48 -307 -100 134 117 -152 -262 -17 185
6157A85k11k47K30J10O7k67kJ93Q7j31k51J19L46j19j58j90J89K36j23l20M2K80
$$ 185 -26 -273 -43 67 134 -133 -135 58 145 14 -237 -118 228 109 -49 -239 -50 186 63 -257 -215 65
6179F5J59l54j46K04K80p8m01R1K46J35k50j63J76K82j04m14R4K95Q9k82k29L21
$$ 65 224 -130 -276 -72 208 130 -271 -180 66 201 -49 -212 -36 246 142 -272 -178 117 206 -76 -305 16
6201A6K48r0m44P3L76J23l95j80L02K64j67m09N2M61Q1l78l03L82L58k64m37J15
$$ 16 264 174 -270 -197 179 302 -93 -273 29 293 126 -283 -231 230 311 -67 -370 12 370 106 -331 -216
6223b16M00R2m19j80L80K55j87m41J67L93J31m94j98L76L27k90m12J05N30o5l65
$$ -216 184 276 -143 -323 57 312 125 -316 -149 244 375 -119 -317 59 386 96 -316 -211 319 254 -111
6244a11j67L44L13l62k92J34M36q4l43j68L81K17k52l14K07L72r2m20j13M61J46
$$ -111 -278 66 379 17 -275 -141 295 211 -132 -300 81 298 46 -268 -61 311 219 -201 -314 147 293
6265B93j90m46K18M42j35m07o6L53J41k18k78K13L49p7l56j21L79K10l27k42K10
$$ 293 103 -343 -125 317 182 -225 -291 62 203 -15 -293 -80 269 192 -164 -285 94 304 -23 -265 -55
6286e5L10j11l35j5K36K20k57k41J93K73p7k80j08L29J34j69k32Q1K49j5k08j81
$$ -55 255 144 -191 -206 30 250 -7 -248 -55 218 141 -139 -247 82 216 47 -185 -104 145 130 -78 -259
6308b59L34J37j54k42J3K93J01l12j14J82K30j32k69M2L46k5j84j39K15J56j40
$$ -259 75 212 58 -184 -171 122 223 -89 -203 -21 209 77 -192 -150 196 171 -13 -152 63 219 79
6329G9k77L8K76K9j72k62K51K37o8l09k1L20J24l59j91K73K44j74l41J00L57O9
$$ 79 -198 -160 116 145 -27 -289 -38 199 131 -178 -199 121 245 -114 -305 -32 212 38 -303 -203 154 223
6351B23l14j61K14L03j51l93N4M15J38m06k13K52K79j18m09P8M11M5l64j94L17
$$ 223 -91 -252 -38 265 114 -279 -225 190 328 -78 -291 -39 240 122 -287 -209 202 247 -117 -311 6
6372FL56k52l80Q7M28M1l85k47L98L27k82l80R2M64j4m44j05K81K78k43l14J97
$$ 6 362 110 -270 -183 245 286 -99 -346 52 379 97 -283 -191 273 259 -185 -290 -9 269 26 -288 -91
6394i1L12Q2m65j34L84K59l15l00P5M68j3m69nL92J00k08l08J65L25k3l88n7L75
$$ -91 221 303 -162 -296 88 347 32 -268 -193 275 262 -207 -212 180 280 72 -236 -71 254 231 -157 -214 161
6417A61J41k80k57J32M09q6l74j8L13J89k02l97K23K98m2l54o7L39J35k57j94
$$ 161 302 22 -235 -103 306 220 -154 -172 141 330 128 -269 -46 252 210 -144 -211 128 263 6 -188
6438a88J60L39k8l83l7K42J73k18j83k0L30K8l19j10K17K69j95k24Q6J89M5l02
$$ -188 -28 311 283 -100 -137 105 278 60 -123 -143 187 215 -104 -214 3 272 77 -147 -61 128 173 -129
6460a29j32L07K13j56k51L2L10Kk20j17J20K40p2l29O6L41K6l31j09K02K21r5
$$ -129 -261 46 259 103 -148 -116 194 196 -24 -141 -21 219 147 -182 -116 225 251 -80 -189 13 234 139
6482A39l25L4K91J20l18j72K40K70n6m40n7M42J06k86k79L15K56j54l42n0M45
$$ 139 -186 -152 139 259 -59 -231 9 279 223 -217 -274 168 274 -12 -291 24 280 126 -216 -266 179
6503A79M6k99k52K51L79k16l97P6L59J79l72l19M11K48j72m30M5M15J28m01k62
$$ 179 225 -74 -326 -75 304 88 -309 -233 126 305 -67 -386 25 273 101 -329 -284 131 259 -142 -404
6524d04L96L20k60l56N8M27O3m45j96L92L43k36m21J33M13Nm05j61L72K97k64
$$ -404 -8 312 52 -304 -246 181 244 -201 -397 -5 338 102 -319 -186 227 232 -173 -334 38 335 71
6545G1l51J60L80m2l93j10L82J99k06l09J11K94n1l17q8L30J63k02k79J40L51
$$ 71 -280 -120 260 218 -175 -285 97 296 90 -219 -108 186 135 -182 -270 60 223 21 -258 -118 233
6566B33K4m53n7L93J66l01l11J90L29ml99j15L36J96j67l89K17K84n6k50r8K72
$$ 233 257 -196 -253 140 306 5 -306 -116 213 209 -190 -305 31 227 60 -329 -112 172 116 -134 -232 40
6588D0K32k71k13Q1K78kk28k08K90K76k37k33R5K52K0k52j99L06J77j93k53Q1
$$ 40 272 1 -212 -131 147 145 -83 -291 -1 275 38 -195 -100 152 172 -80 -279 27 204 11 -242 -161
6610a61K43P4k59r6J76J77j27k57J34J30J96k94k09J95K85j21l21J5K91N4j98
$$ -161 82 156 -103 -199 -23 154 27 -230 -96 34 230 -64 -273 -78 207 86 -235 -220 71 125 -73
6631g3j88J91L08j56l26M6K93J52l69k42K94K73n7m28R7L12Q2k81k21J95K56n8
$$ -73 -261 -70 238 82 -244 -198 95 247 -122 -364 -70 203 146 -282 -185 127 209 -72 -293 -98 158 100
6653A00l09k1L88R0l93j71K85K89j48l86N6L65J33m52k20L64L23j82l43l9M66
$$ 100 -209 -230 158 248 -145 -316 -31 258 110 -276 -220 145 278 -174 -394 -30 293 111 -232 -271 195
6674A95O2m11j57K79L31k49l37P4M19K5m14j75L41L49l56l17J74L49L3m05j67
$$ 195 257 -154 -311 -32 299 50 -287 -213 206 231 -183 -358 -17 332 -24 -341 -167 182 215 -190 -357
6695c57M32J83k23l55J33M14n2l63j16L76K35k32l85K38K76jl63o3K84L02l41
$$ -357 75 258 35 -320 -187 227 175 -188 -304 72 307 75 -310 -72 204 203 -160 -223 61 363 22
6716B2l04K24K98q7l15l6K33K22k11k60P6L34N7l84r7K64K39j86k96K12K26nk88
$$ 22 -282 -58 240 153 -162 -198 35 257 46 -214 -138 196 253 -131 -228 36 275 89 -207 5 231 226 -62
6739f2j41K32K39j85j90P0K04Q0l75j02K04K57j78k32L9L16L5k15j85K47J61j08
$$ -62 -203 29 268 83 -107 -37 167 247 -128 -230 -26 231 53 -179 -140 176 211 -4 -189 58 219 111
6761A11l11L3L54Kk36j91K62K01j11l09O8L20N6k25k30J71K62j20k34l5L34P6
$$ 111 -200 -167 187 189 -47 -238 24 225 114 -195 -127 193 249 24 -206 -35 227 107 -127 -162 172 248
6783B48k39k60K32K99p7m24j9L64J42l61j94J82M05j11l97j9M10Q3k89l39K78
$$ 248 9 -251 -19 280 203 -221 -240 124 266 -95 -289 -107 298 187 -210 -229 181 264 -25 -364 -86
6804h6L79j55m22K1L75J67l28k96L18L62k22m10K5M72N0l31k45K69L72k20l72
$$ -86 293 138 -284 -263 112 279 -49 -345 -27 335 113 -297 -272 200 250 -81 -326 -57 315 95 -277
6825b77j8M58N3k85k00K56L57k74m06J92M00q1l58j09L29K75j77l65L0M54n6l73
$$ -277 -295 163 216 -69 -269 -13 344 70 -336 -144 256 175 -183 -292 37 312 135 -230 -200 254 198 -175
6847a75o9K40K08q2l64J14L97o6l45q6K67K15j68k80J01L62j0m04j33L04L01k60
$$ -175 -244 -4 204 122 -242 -128 269 203 -142 -228 39 254 86 -194 -93 269 259 -145 -278 26 327 67
6869F7l00O1L20N2k64j76K62J89j25k86R0K90Q4l31q9J50K57k00j70M5K14J3j66
$$ 67 -233 -172 148 200 -64 -240 22 211 86 -200 -110 180 264 -67 -156 -6 251 51 -119 -74 140 153 -13
6892a3j58J96J50j13k26l0L33K4j97j70K50J47q8k80M4J93J32k23k22J77K61n2
$$ -13 -171 25 175 62 -164 -194 139 163 -34 -204 46 193 105 -175 -131 62 194 -29 -251 -74 187 135
6914A35l21OL26Q5j90l05K52K70q3k90JK10J24k22k89K26L01o2l39j3L40J45l61
$$ 135 -186 -180 146 231 41 -264 -12 258 175 -115 -114 96 220 -2 -291 -65 236 174 -165 -178 162 307 -54
6937e4k24J96L51j11l85P1K86J59l19k51K24L38m4m48k8L80J06k97k71L26L57
$$ -54 -278 -82 269 158 -227 -156 130 289 -30 -281 -57 281 237 -211 -239 141 247 -50 -321 5 362
6958C62k29l79KM29J34l75k76K90K94j16l55j3M36P7l52k45L02L39j97l82O0M30
$$ 362 133 -246 -244 185 319 -56 -332 -42 252 136 -219 -232 204 281 -71 -316 -14 325 128 -254 -194 236
6980B36M1l21k18L09K83k19l55R7L46O6l43j63K50K71j76l57J23L33J2l30j24
$$ 236 277 -44 -262 47 330 111 -244 -147 199 265 -78 -241 9 280 104 -253 -130 203 215 -115 -239
7001b39K72K66k44k26mL47N8l10j42K79J94k06k00P8K81k0k82j46K24K82k10j83
$$ -239 33 299 55 -171 -175 172 230 -80 -222 57 251 45 -155 -77 204 184 -98 -244 -20 262 52 -131
7023a31l9L42K3k42j86J44L40k73k11J30L13j6j76k02K01K45j37k58j1K79M3j96
$$ -131 -170 172 195 -47 -233 -89 251 -22 -233 -103 210 194 18 -184 17 262 125 -133 -144 135 178 -18
7045a8j43J02L39j02l18k9K69J24k36j89K64J82j10l07rK49J96k57j96J03K66
$$ -18 -161 -59 280 178 -140 -169 100 224 -12 -201 63 245 135 -172 -181 68 264 7 -189 -86 180
7066A80K6m41J7L34J20k99k08J99L18j53k13l6K83J50k93k60K44K44j75k48J1
$$ 180 206 -235 -218 116 236 -63 -271 -72 246 93 -120 -156 127 277 -16 -276 -32 212 37 -211 -200
7087b00L36P2k14k00J01L54o1l93n1M28P9k10k86J85L29j30l60m0L70J66l20j87
$$ -200 136 208 -6 -206 -105 249 188 -205 -256 172 251 41 -245 -60 269 139 -221 -261 109 275 -45 -232
7109b32J61L58j72l59K3L89O9k97k49K68K43j25l33RM36M0l60k17K68L18j54l49
$$ -232 -71 287 115 -244 -221 168 237 -60 -309 -41 202 77 -256 -247 189 229 -131 -348 -80 238 84 -265
7131b65Q6L14J51m02j86K60L42k46l43P7L50Q0k95j93K67K49j82k40PL60J9l14
$$ -265 -179 135 286 -116 -302 -42 300 54 -289 -212 138 218 -77 -270 -3 246 64 -176 -169 191 210 -104
7153a04j39K81K55j77l20R7L28J0k57j24J63K38j95k22J33K49K8k49j43J63K97
$$ -104 -243 38 293 116 -204 -107 221 231 -26 -150 13 251 56 -166 -33 216 244 -5 -148 15 312
7174C12j90l19J13K40P7l30n4K19J20q2k18O3J78J57k74j14P3K62j67k52OL15
$$ 312 122 -197 -84 156 233 -97 -151 68 188 106 -112 -49 129 286 12 -102 -29 233 66 -186 -180 135
7196A35R1k42j87J97K00n2k22p0K49J15j54k85J65K45k3k67j11K68K23k80j78
$$ 135 226 -16 -203 -6 194 142 -80 -150 99 214 60 -225 -60 185 162 -105 -216 52 275 -5 -183
7217a83Q5L05o1k66n8K72J56j07l59J21K71%k67r4K68J82k57k80J58L69J5l51
$$ -183 -98 207 146 -120 -178 94 250 143 -216 -95 176 176 -91 -185 83 265 8 -272 -114 255 270 -81
7239h1p8L05K26l37k75J87K76n5l32kK81J84k31l03J74L80q7m18qM13Q0k26k73
$$ -81 -159 146 372 35 -240 -53 223 168 -164 -166 115 299 68 -235 -61 319 232 -186 -194 219 299 73 -200
7262b00J87K82n4m26P2L53Q6k97k99L21L20j58l52K1L71R8l56k28L18K65j93l53
$$ -200 -13 269 215 -211 -139 214 300 3 -296 25 345 187 -165 -144 227 325 -31 -259 59 324 131 -222
7284b22O2K96J24k93j82J85L10r9l76NL58J20l86r5K08K93k09k70pL20J16k80
$$ -222 -160 136 260 -33 -215 -30 280 181 -195 -190 168 288 -98 -193 15 308 99 -171 -178 142 258 -22
7306b2k27K99K07j16l13N2K27J36k69j57J86K81j37l22R5K52J62l14j49J59J82
$$ -22 -249 50 257 141 -172 -120 107 243 -26 -183 3 284 147 -175 -80 172 334 20 -129 30 212
7327B12k6k74j9K50J17k75q2O7L36j35k03q9K70J47k00k20J27K19m8k75KJ93K05
$$ 212 186 -88 -107 143 260 -15 -97 -30 306 171 -32 -121 149 296 96 -124 3 222 174 -101 -99 94 299
7350B99k64j61J09K12k0k84j9K67J94l00k35J45L05m8k74j46L28J64k59j49P3
$$ 299 35 -126 -17 195 175 -109 -128 139 333 33 -202 -57 248 200 -74 -220 108 272 13 -136 -63
7371f3K48K1k54j76K65K15k31k18O9L29L2l16j00K75J57j68m03K27L32jm28l2
$$ -63 185 206 -48 -224 41 256 25 -193 -124 205 237 -79 -179 96 253 85 -318 -91 241 240 -188 -220
7393b20K68K30k94k08J40K95j8l62q9L62J46k54k90K62K75p0l47j24M14J55l26
$$ -220 48 278 -16 -224 -84 211 193 -169 -258 104 250 -4 -294 -32 243 173 -174 -298 116 271 -55
7414e5k20K19L03j19l71J8L65J02k91j64J58L11j21l15q5M13P7k83j86J65L31
$$ -55 -275 -56 247 128 -243 -225 140 242 -49 -213 -55 256 135 -180 -265 148 225 -58 -244 -79 252
7435B52k10k66l1L09J80k56k65K89J50o4k82L3L25k8j94k12K55K06r1k91M3K47
$$ 252 42 -224 -255 54 234 -22 -287 2 152 88 -194 -161 164 136 -58 -270 -15 191 100 -191 -148 99
7457I9J77m04j41K64J64k3l21N1K04Q9j25k04J31J77p6k49JK85O0j47j41J04K35
$$ 99 276 -128 -269 -5 159 136 -185 -134 70 159 34 -170 -39 138 62 -187 -186 99 159 12 -129 -25 210
7480B10o3k71KK56Q6j97k42K32J56o0k09p0K48O8r0k43J23K38l4k91l2K23J96
$$ 210 147 -124 -122 134 220 23 -219 13 169 109 -100 -170 78 146 56 -187 -64 174 140 -151 -183 40 236
7503B36k56j54O9K43k5k33o3K31J76k30k15J50K67k2l25k9K26K16j78l33R2L53
$$ 236 -20 -174 -105 138 113 -120 -183 48 224 -6 -221 -71 196 174 -151 -180 46 262 84 -249 -157 196
7525A96m4k78j61L36K31k62k82J51L65q6k88o4K50J62j61l30J92K97k9l71n4L42
$$ 196 152 -126 -287 49 280 18 -264 -113 252 166 -122 -186 64 226 65 -265 -73 224 195 -176 -230 112
7547A12J40k49k69J99K96r2l28RL32J01k86j60J32L44j55l05m8L31J65l03k23
$$ 112 252 3 -266 -67 229 137 -191 -182 150 251 -35 -195 -63 281 126 -179 -227 104 269 -34 -257
7568b57J85K63j8m01L3L64J05k88j71J28K92j36l18O5K70J49l25j73J63K86j16
$$ -257 -72 191 173 -228 -195 169 274 -14 -185 -57 235 99 -219 -154 116 265 -60 -233 -70 216 100
7589A00k79M6L03jj64j99J89K39k21j95N4K82Rj87j66J08L07j68k50P2K27M2j67
$$ 100 -179 -133 170 169 5 -194 -5 234 13 -182 -128 154 163 -24 -190 -82 225 57 -193 -121 106 148 -19
7612a9k01J94K09j35k41N9J96Q8k18j51J14K45q4j56n2J82J01j90j20J35K58r6
$$ -19 -220 -26 183 48 -193 -134 62 150 -68 -219 -105 140 56 -100 -152 30 131 -59 -179 -44 214 118
7634A18k75l5K08J37k28j21J25K05j4k20p3J90K07j65k58J32K48j9k93m0K09R1
$$ 118 -157 -192 16 153 -75 -196 -71 134 120 -100 -173 17 224 59 -199 -67 181 162 -131 -171 38 129
7656A29r2k46J07L15k0k88j51L07J80k40k11J46K89m7l80l8K69J51j87j99J38
$$ 129 37 -209 -102 213 193 -95 -246 61 241 1 -210 -64 225 178 -202 -240 29 180 -7 -206 -68
7677f8J92Rk99n9K68J96k14k83J72K74n5l31j13L68J30k17j96Q3L69j18l33J5
$$ -68 124 133 -166 -225 43 239 25 -258 -86 188 133 -198 -311 57 187 -30 -226 -143 226 108 -225 -210
7699b10K88J80l24k20K40K70j27k89k4K92J17j82k73J61K71M7m15O5K66J07k96
$$ -210 78 258 -66 -286 -46 224 97 -192 -216 76 193 11 -262 -101 170 217 -198 -133 133 240 -56
7720e6j61J82K88j20l25L1L22O3k58j92J95K63j79k50M7L03J04l01j61J79J86
$$ -56 -217 -35 253 133 -192 -161 161 224 -34 -226 -31 232 53 -197 -150 153 257 -44 -205 -26 160
7741A60ql51j7L27P7k85j47K22K07r0k44k5K22J69k48j85J58L05j80k38j8K68
$$ 160 152 -199 -216 111 188 -97 -244 -22 185 95 -149 -174 48 217 -31 -216 -58 247 67 -171 -189 79
7763G9J47k46j87K00K17j20k56OK47J60k40k05J90J62o6j58j53K98P4j54j31P1
$$ 79 226 -20 -207 -7 210 90 -166 -160 87 247 7 -198 -8 154 88 -70 -223 75 149 -5 -136 -65
7785f5K47m9k90l2K62N3j43k19J27K77ll41jK33J51j90k30J20K20j05j37r7K43
$$ -65 182 133 -157 -189 73 126 -17 -236 -109 168 165 -176 -177 56 207 17 -213 -93 127 22 -115 -212 31
7808C1J77j75k46P9L01jk70q1J51K58k02k68J54K81n9k88n9K51J90k04k49J46
$$ 31 208 33 -213 -134 167 166 -104 -185 -34 224 22 -246 -92 189 130 -158 -217 34 224 20 -229 -83
7830h3K37L4l25j26K80K22k18k25J81J89K9l36p4K82K10l03j98J82K10O3m39j6
$$ -83 154 188 -137 -263 17 239 21 -204 -23 166 195 -141 -215 67 277 -26 -224 -42 168 231 -208 -224
7852b24L25J27k62j85J51K56j3l78J8K80R7k78r5J05L12q7l53NL15J20l02j96
$$ -224 101 228 -34 -219 -68 188 175 -203 -185 95 192 -86 -181 -76 236 149 -204 -199 116 236 -66 -262
7874b62J87K43r0l10M8K20J20k39j46J77K24r4k61kK39J59k46k20J73L19j37k70
$$ -262 -75 168 78 -232 -184 36 156 -83 -229 -52 172 78 -183 -185 54 213 -33 -253 -80 239 102 -168
7896a68j8L18J49l16j21J17J93m4k10j01K56J45k81o9N1K51j07j62k0J48J49j80
$$ -168 -186 132 281 -35 -156 -39 154 110 -100 -201 55 200 -81 -150 -99 152 45 -117 -137 11 160 -20
7918b0j88J36K68q9k36m2L00M6k21j96J79K45j70j65O7J22Q8j71j64J47J82N5
$$ -20 -208 -72 196 107 -129 -171 129 175 -46 -242 -63 182 12 -153 -86 36 124 -47 -211 -64 118 173
7940A73k70o4J64J48j35j37O3K04q6k22m3K10K15j86j60oK69K6k13j17J76J40
$$ 173 -97 -161 3 151 16 -121 -58 146 60 -162 -205 5 220 34 -126 -132 137 163 -50 -167 9 149
7962A49j42k73J85K65l4k55q0K54J31j92k86J74K60%k90r6K79J49k09k37J72K54
$$ 149 7 -266 -81 184 150 -105 -185 69 200 8 -278 -104 156 156 -134 -230 49 198 -11 -248 -76 178
7984A78m3l22n3L19P7j99k00J18K31l9k33J3K49J47k68j98J18K74q8k83OK83J69
$$ 178 135 -187 -240 79 156 -43 -243 -125 106 67 -166 -153 96 243 -25 -223 -105 169 81 -202 -196 87 256
8007B56l31j46J66K32n9k79p7L75J30l06k21J38L60j15l44j9K66K17k86j79J31
$$ 256 -75 -221 -55 177 118 -161 -238 137 267 -39 -260 -122 238 123 -221 -240 26 243 -43 -222 -91
8028i1L05j17k98J5L08P5k38j35J16K12p2k71P1K70K5k25j60J39K26mk93l2K47
$$ -91 214 97 -201 -186 122 197 -41 -176 -60 152 80 -191 -120 150 175 -50 -210 -71 155 151 -142 -174 73
8051G3J16j90j85J39K92j53k64L4K55Nj91j09J68K06n5l03P1J60P9j75j66J39
$$ 73 189 -1 -186 -47 245 92 -172 -138 117 122 -69 -178 -10 196 141 -162 -91 69 148 -27 -193 -54
8073e4J81p5j78k2J74J78j96j59N9K09j3k15oJ59J85k68j42R4K59l7k17j15K15
$$ -54 127 52 -126 -148 26 204 8 -151 -92 117 104 -111 -117 42 227 -41 -183 -89 170 133 -84 -199 16
8096A6J85k15j46Q8K03Kk11q3K26J23j75j87R4K30Ql08K0J42J95j69k17J38K80
$$ 16 201 -14 -160 -72 131 133 -78 -161 65 188 13 -174 -80 150 158 -150 -130 12 207 38 -179 -41 239
8119B39j9k73q8K02J84k37j67PL70l6k76o2K83J58l23j99J49K57mk82m7K53J82
$$ 239 220 -53 -141 61 245 8 -159 -152 218 182 -94 -156 127 285 -38 -237 -88 169 165 -117 -164 89 271
8142B71l26j17P0K63ok59r3K27K10l16j05J32K33m3l02k1L49Q1k54k18J96J82
$$ 271 -55 -172 -102 161 155 -104 -197 30 240 -76 -181 -49 184 141 -161 -182 167 248 -6 -224 -28 154
8164A54j19j82q6L31J38k40k33K19J97n9l78J20K55J24k06k94J87K45r2k64n5
$$ 154 35 -147 -233 98 236 -4 -237 -18 179 120 -258 -138 117 241 35 -259 -72 173 81 -183 -238
8185b38L14R6k20j68J08K66
$$ -238 76 172 -48 -216 -108 158
8191A58
$$ Imaginary data points
##PAGE= N=2
##DATA TABLE= (X++(I..I)), XYDATA
0@%%%%%%%%%%%%%lJ1j6J6j6J6j8K4l0L2l7M5n2N8o5P3q3R4j02J14j28J42j60J79
$$ 0 0 0 0 0 0 0 0 0 0 0 0 0 0 -3 8 -8 8 -8 8 -10 14 -16 16 -21 24 -28 30 -35 38 -45 49 -53 61 -67 75 -85 94
37I4j98K19k45K71k98L31l65M05m50N01n60O26p04P98r13J052j229J468j803K305
$$ 94 -104 115 -130 141 -157 174 -191 214 -236 265 -295 331 -373 425 -488 564 -665 803 -1000 1305
57A305l136M751r009L9983J15821p7610j14662M9288J33543j0345j26464l2644
$$ 1305 -1831 2920 -6089 33894 149715 72105 -42557 6731 140274 129929 3465 -29179
69b9179J02916N3969p7482p4926M4289P6929j3145o6781J560O9088K6591n3340
$$ -29179 73737 127706 50224 -24702 19587 96516 83371 16590 18150 87238 113829 60489
81F0489l9828L8546N2200k2253o4736j2233M6787J7630m5554l5939K9935M0726
$$ 60489 20661 59207 111407 89154 24418 12185 58972 76602 31048 -4891 25044 65770
93F5770k0066m5788J1892N5791Q255n3292k6225M1453L4431l3700m7234J0077
$$ 65770 45704 -84 11808 67599 75854 22562 -3663 37790 72221 38521 -8713 1364
105A364L5368j0142l9539o5L5757M738l5636j1483L5755K3792k6299k9091J5224
$$ 1364 36732 26590 -12949 -13014 22743 27481 -8155 -19638 16117 39909 13610 -15481 -257
118b57K6120j3499l1113K643K4193n472l2679q022K7064J5693j9846k1413Q726
$$ -257 25863 12364 -18749 -16106 8087 2615 -30064 -38086 -11022 4671 -15175 -36588 -27862
131b7862K1511K403j4149o996O542N224n547p852mM311j596o886k718M590M864
$$ -27862 -6351 -3948 -18097 -25093 -18551 -13327 -18874 -26726 -26730 -22419 -24015 -30901 -33619 -29029 -24165
146b4165J64j763m89n2K114N805M416m203q495K31R773M479q010p324M720P113
$$ -24165 -24001 -25764 -26253 -26305 -24191 -18386 -13970 -18173 -26668 -26437 -16664 -12185 -20195 -27519 -22799 -15686
162a5686l953o689N736J0588l958j3432J560J7233N494j5253r753J2543J2735
$$ -15686 -19639 -26328 -20592 -10004 -13962 -27394 -25834 -8601 -3107 -18360 -28113 -15570 -2835
175b835r549j5656N743J7150l024k1649n257K1576J3762j7901k1670R890K6349
$$ -2835 -12384 -28040 -22297 -5147 -8171 -29820 -35077 -13501 261 -17640 -39310 -29420 -3071
188c071P43k3829p817K0267J2488j6207j6205J1227J7576q207k1672L36K0553
$$ -3071 -2328 -26157 -33974 -13707 -1219 -17426 -33631 -22404 -4828 -13035 -34707 -34371 -13818
201a3818O119j7017j0076J3655J3644p913j2384P991J5884m382j8780m53K0177
$$ -13818 -7699 -24716 -34792 -21137 -7493 -15406 -27790 -19799 -3915 -8297 -27077 -27530 -7353
214g353P367j9311j5255J3847K0185n557j9712J222K1795P425j6496r557J6482
$$ -7353 14 -19297 -34552 -20705 -520 -6077 -25789 -24567 -2772 4653 -11843 -21400 -4918
227d918J6719j0025j9591L655K0413L651j7858q876J3796J2193p926j0817P533
$$ -4918 11801 1776 -17815 -14160 6253 9904 -7954 -16830 -3034 9159 1233 -9584 -2051
240b051J4299k365j3248O00J5376N309j3400j0136Q490J1752m668j2708L5J1279
$$ -2051 12248 9883 -3365 -2765 12611 17920 4520 -5616 2874 14626 9958 -2750 -2715 8564
254H564K944r003m561P943P831m047q424J02P380L247m886n840l69L599J877j558
$$ 8564 11508 2505 -2056 5887 13718 9671 1247 1349 8729 11976 7090 1250 881 4480 6357 4799
270D799k570j078R34K016J017j083j757M35K285L92l075k277L029M134k224o987
$$ 4799 2229 1151 2085 4101 5118 4035 2278 2713 4998 5390 2315 38 3067 7201 4977 -2010
286b010q12P787M484o938p703M313R207j831r642O4J0131J555j0641l326J1667
$$ -2010 -2822 4965 9449 2511 -5192 -879 8328 6497 -3145 -3081 7050 8605 -2036 -5362 6305
301F305O834j0862j0260Q856J3055n921j5143J807J5087J387j5603n426J4798
$$ 6305 13139 2277 -7983 873 13928 8007 -7136 -5329 9758 11145 -4458 -9884 4914
314D914J0208j1806j3414Q192J6730j937j6256l245J3979O728j1773j0297P527
$$ 4914 15122 3316 -10098 -1906 14824 12887 -3369 -6614 7365 14093 2320 -7977 -450
327d50J1156n141j2988J295J4258M121j2479p347J1548J2653o958j4949K673J6289
$$ -450 10706 5565 -7423 -6128 8130 12251 -228 -7575 3973 16626 9668 -5281 -2608 13681
341A3681J381j8422q170J6483J3507j4124j9508R216K4957j64k4578o175K4563
$$ 13681 15062 -3360 -11530 4953 18460 4336 -15172 -5956 19001 18837 -5741 -11916 12647
354A2647J4767j9975k0572J3768K3442q742k7440l53K5973O894k3705j3206K0052
$$ 12647 27414 7439 -13133 635 24077 15335 -12105 -12458 13515 20409 -3296 -16502 3550
367C550J9352j2329k0396P279K2282p54k1754o135J7835R839j6025j6122R144
$$ 3550 22902 10573 -9823 -2544 19738 18984 -2770 -8905 8930 18769 2744 -13378 -4234
380d234J7902l048j8032k413J7710R596j2468j2301Q800J5210l787j6625k554
$$ -4234 13668 10620 -7412 -9825 7885 17481 5013 -7288 1512 16722 12935 -3690 -6244
393f244J4389N636j3441j0635R431J3169m803j3008K372J4325K489j2098m319
$$ -6244 8145 13781 340 -10295 -864 12305 7502 -5506 -3134 11191 13680 1582 -2737
406b737J1286O460j0565r622P178J0117n781j2092K589J2257R31j0769k006J0991
$$ -2737 8549 15009 4444 -5178 2000 12117 6336 -5756 -3167 9090 10021 -748 -2754 8237
420H237N115q683o137O887O852n677q441K270O753j668o465O57N911K82m663L67
$$ 8237 13352 4669 -1468 5419 12271 6594 -1847 423 7176 5508 -957 -300 5611 5893 1230 1597
436A597N947R44n518j829M999K233n548m532L941M900l535o385K221Q277R56p607
$$ 1597 7544 8488 2970 1141 6140 8373 2825 -1707 2234 7134 3599 -2786 -565 7712 8668 1061
452A061k381Q395N797o732q047M758R283l085j1520m29J1888L714j1452o749J1188
$$ 1061 -1320 7075 12872 6140 -1907 2851 12134 9049 -2471 -2900 8988 12702 1250 -5499 5689
467E689J1522p424j3191M724J5758Q8j6487n344J4691Q902j3530j4001Q855J6673
$$ 5689 17211 9787 -3404 1320 17078 17166 679 -4665 10026 18928 5398 -8603 252 16925
481A6925m259j7944o48J8567O993j6081j1251J2804J4671r024j8167K687J7605
$$ 16925 12666 -5278 -5926 12641 19634 3553 -7698 5106 19777 10753 -7414 -4727 12878
494A2878R28j8537p164J5994J1701j2677j4896Q612J8204k640j8232k442J7483
$$ 12878 13806 -4731 -11895 4099 15800 3123 -11773 -3161 15043 12403 -5829 -8271 9212
507I212P167j6104j2745J1403J5155p872j8355J838J8687L917j6602q176J4590
$$ 9212 16379 275 -12470 -1067 14088 6216 -12139 -10301 8386 12303 -4299 -12475 2115
520B115J2833j0173j5208N607J6178j625j7330m484J4316P530j2502j1592Q246
$$ 2115 14948 4775 -10433 -4826 11352 9727 -7603 -12087 2229 9759 -2743 -14335 -6089
533f089J3154m039j3612N81J3547L619j2035o939R143Q744o809j1164K485J0475
$$ -6089 7065 3026 -10586 -10005 3542 7161 -4874 -11813 -2670 6074 -735 -11899 -9414 1061
547A061q8j0135k876Q696N287o300n935M884P361k111o889N12O167Q14n365j950
$$ 1061 973 -9162 -12038 -3342 1945 -4355 -10290 -5406 1955 -156 -7045 -6533 -366 448 -4917 -6867
563f867L776K004l148k125K500K376j562j714J726K080j117j711J288K086j237
$$ -6867 -3091 -1087 -4235 -6360 -3860 -1484 -3046 -4760 -3034 -954 -2071 -3782 -2494 -408 -1645
578a645k658O03K748k38l555r96L564K182l546l457L032N179j585n950K66P091
$$ -1645 -4303 -3700 -952 -1190 -4745 -5741 -2177 5 -3541 -6998 -3966 1213 -372 -6322 -6056 1035
594A035J896p138l999O864O254n816q445L793R919j403j0578j127J1186M143j0149
$$ 1035 2931 -4207 -8206 -1342 4912 -904 -9349 -5556 4363 2960 -7618 -8745 2441 6584 -3565
609c565o404R357R453o704j0940L849J2215q53j2548k695J1508N681j0080q360
$$ -3565 -9969 -612 8841 2137 -8803 -4954 7261 6408 -6140 -8835 2673 8354 -1726 -10086
623a0086P390J0706l966j1348N20J1591L676r942o887P579R267m501j1075N77
$$ -10086 -2696 8010 4044 -7304 -6784 4807 8483 -1459 -8346 -767 8500 3999 -7076 -6499
637f499J1219L007j0706p069R016J0538n642j2550K118J4061K238j3608o124J2399
$$ -6499 4720 7727 -2979 -10048 -1032 9506 3864 -8686 -6568 7493 9731 -3877 -10001 2398
651B398R720j0322j3190O484J5033k513j6068k079J5124O281j2917r440J0016
$$ 2398 12118 1796 -11394 -4910 10123 7610 -8458 -10537 4587 10868 -2049 -11489 -1473
664a473J2114n986j3294J824J2840J777j1719n517Q728P500o108r162K333R301
$$ -1473 10641 4655 -8639 -6815 6025 7802 -3917 -9434 -706 6794 686 -8476 -6143 3158
678C158R35q384l710O812N825m784p539K080Q140K92q601l457P192N338o003p147
$$ 3158 4093 -4291 -8001 -1189 4636 -148 -7687 -5607 2533 2825 -5776 -9233 -2041 3297 -2706 -9853
694i853L817P915j656q291o38P861K872o604m499M717N309k962n576J160N119
$$ -9853 -6036 1879 223 -8068 -8706 -845 2027 -4577 -9076 -4359 950 -2012 -7588 -6428 -1309
709a309K57m345j263L338J954k113j814J733K144o40j607O24J732K48j123N9J137
$$ -1309 -1052 -5397 -6660 -3322 -1368 -3481 -5295 -3562 -1418 -2058 -3665 -3041 -1309 -1061 -2184 -2125 -988
726i88J24r24J63J176K45p94l9J227K51j060N3J787R21j897j215K185J926j880
$$ -988 -864 -1788 -1625 -449 -204 -998 -1037 190 441 -619 -566 1221 2142 245 -970 1215 3141 1261
744A261l076J435L948n31n024j250N230L091m665m885L575O415j764p283l73P670
$$ 1261 -1815 -380 3568 3037 -1987 -3237 1993 5084 419 -4466 -891 5524 3760 -3523 -3896 3774
760C774K886p167n347N229O874l559q074J028Q350J259q158l682P413O388n360
$$ 3774 6660 -507 -5854 -625 6249 2690 -5384 -4356 3994 5253 -2905 -6587 826 7214 1854
775A854p959L173R292p54r759k328R306N144q393q185N956J0333k718j1259m88
$$ 1854 -6105 -2932 6360 5606 -4153 -6481 2825 7969 -424 -8609 -2653 7680 4962 -6297 -6785
790f785J1757M462j0061p345Q098J0134m877j1497J229J1743J953j1023n074R358
$$ -6785 4972 9434 -627 -7972 126 10260 5383 -6114 -4885 6858 8811 -2212 -7286 2072
804B072Q006o701r331M301J0900o56j0361j710J0111M968q861p530O510R405l858
$$ 2072 10078 3377 -5954 -1653 9247 8591 -1770 -3480 6631 11599 2738 -4792 1718 11123 7265
819G265j0781N31J0868K718r938n347Q503Q267n500r619K464R936M68r351l699
$$ 7265 -3516 -2985 7883 10601 663 -4684 3819 12086 6586 -3033 -569 9367 9835 484 -3215
834c215P318M921n864o817L133O937r67o562r16N975K497m547l464L495M205k550
$$ -3215 4103 9024 3160 -3657 -524 6413 5446 -1116 -2032 3943 6440 1893 -1571 1924 6129 3579
850C579n067O11M653J94m833j942M010K713k838l292K050L871l23l251l50K824
$$ 3579 -1488 -877 3776 3970 -863 -2805 1205 3918 1080 -2212 -162 3709 3386 135 -215 2609
866B609Q81k171j428R71O78r16o93N01m4j000K88J984M46k243r19K859K048k612
$$ 2609 3490 1319 -109 862 1540 624 -69 432 388 -612 -324 1660 2106 -137 -1056 1803 3851 1239
884A239l407J767L816j295n098o80M779J978m517l216L931M555k509m899J691
$$ 1239 -2168 -401 3415 2120 -2978 -3658 1121 3099 -1418 -4634 -703 3852 1343 -3556 -1865
899a865N855k30o152j526N842K874n711m950M436O425k840p652R28Q714K196q068
$$ -1865 3990 3760 -2392 -3918 1924 4798 -913 -5863 -1427 4998 2158 -5494 -4566 4148 6344 -1724
915a724m517P106P138m908r058K035R405Q76r513m121Q044O398o026q037L596
$$ -1724 -6241 865 8003 3095 -5963 -3928 5477 6353 -3160 -7281 763 7161 1135 -6902 -3306
930c306R021q53r030j576Q464L848p595o023N796P408l815r004J255R349J349
$$ -3306 5715 4862 -4168 -5744 2720 6568 -1027 -7050 -1254 6154 2339 -6665 -5410 3939 5288
945E288r112m146Q028O744o011q753L423R891r0r996l162Q927N991o613p892L983
$$ 5288 -3824 -7970 58 6802 791 -7962 -4539 5352 5262 -4734 -7896 1031 7022 409 -7483 -3500
961c500Q894j163q865j632Q079L829o629n576M933O683k726o898J052P158R50
$$ -3500 5394 4231 -4634 -6266 1813 5642 -987 -6563 -1630 5053 2327 -4571 -3519 3639 4589
976D589o561k588N813M017m819n552K770O155j162o310r50N619K938m107l767
$$ 4589 -1972 -4560 1253 5270 451 -5101 -2331 3824 2662 -3648 -4598 1021 3959 -148 -3915
991c915K816M694p42m303r77L226J916k422k809N90K368J88j917p50J485J397
$$ -3915 -1099 3595 2853 -1450 -2427 799 2715 293 -2516 -1926 442 630 -1287 -2037 -552 845
1007H45l64o86O25Q55k19n71J75K33q08q48K66N63o47p74N11J206mo26O74J321
$$ 845 481 -205 420 1275 1056 485 660 893 85 -763 -497 66 -581 -1355 -844 362 358 -268 406 1727
1027A727l39j128O58J412j001k562N4K485l1l601j442L757L052k900l754K415
$$ 1727 1388 260 918 2330 1329 -1233 -1179 1306 1275 -2326 -3768 -11 3041 141 -3613 -1198
1043a198N472k62n428j431M993K824m614m984K199N086r24n759r58N499L084l919
$$ -1198 4274 4012 -1416 -2847 2146 4970 356 -4628 -2429 2657 1733 -4026 -4984 515 3599 -320
1059c20l510L533N156j789n389J56N483Q13o011l409M677M574l960o082K468P569
$$ -320 -3830 -297 4859 3070 -2319 -2163 3320 4133 -1878 -5287 -610 3964 4 -6078 -3610 3959
1075C959L69p016k217P474N131n623p180L103P952j169q868k487P477M390o094
$$ 3959 4328 -2688 -4905 2569 7700 2077 -5103 -2000 5952 4783 -4085 -6572 905 5295 -799
1090g99o175M446P834j601p399j43P659K525o700m597M979N287m179p029J559
$$ -799 -6974 -2528 5306 3705 -3694 -3837 3822 6347 -353 -4950 29 5316 1137 -5892 -4333
1105d333P279J12p432k153P227M886n305o121L773P784j228q062j707P027L548
$$ -4333 2946 3058 -4374 -6527 700 5586 281 -5840 -2067 5717 4489 -3573 -5280 1747 5295
1120E295o261n927L808O634j625o714l79O490K756m803l420L634M357k150m583
$$ 5295 -966 -6893 -3085 3549 1924 -4790 -5169 1321 4077 -726 -4146 -512 3845 1695 -2888
1135b888O28M020R3m297j343L410J966k863k652K241L511r62l216J12L553J061
$$ -2888 -2260 1760 1853 -2444 -3787 -377 1589 -1274 -3926 -1685 1826 864 -2352 -2240 1313 2374
1151B374k887j960K015K262j338k637M4J845M55j308p43P35P05Q6O4L05l31p9
$$ 2374 -513 -2473 -458 1804 466 -2171 -2127 -282 173 -1135 -1878 -1143 -438 -352 -288 17 -314 -393
1169c93Q51P68r39j640M36J871k81k518j036K227J714j781k242J321L113k39k777
$$ -393 458 1226 287 -1353 -917 954 673 -1845 -2881 -654 1060 -721 -2963 -1642 1471 1232 -1545
1186a545k45L182J164l087k058K502K558k617l754J346M179m24m859o97N373K854
$$ -1545 -1790 1392 2556 -531 -2589 -87 2471 -146 -3900 -2554 1625 1201 -3658 -4355 1018 3872
1202C872m395m014L876N754j961o630l14O557J970o472m535M732N768k971o609
$$ 3872 -523 -4537 -661 5093 3132 -3498 -3812 2745 4715 -1757 -6292 -1560 4208 1237 -5372
1217e372J144P296J562o170k866N704M762m228n932K288O355j075p001j514O540
$$ -5372 -4228 3068 4630 -1540 -4406 1298 6060 1832 -4100 -1812 4543 3468 -3533 -5047 1493
1232A493L230n624m756M804O769k245p024N89P769K167p126m523N489N927l823
$$ 1493 4723 -901 -5657 -853 5916 3671 -3353 -2764 5005 7172 46 -4477 1012 6939 3116
1247C116p441J179P465J134o716k907O025M977m072n511K513N949p10o129j367
$$ 3116 -4325 -3146 4319 5453 -1263 -4170 1855 6832 2760 -2751 -238 5711 5001 -1128 -2495
1262b495N186K038m859l663L404M334k292m896P73N122P89m775k268L979L206
$$ -2495 2691 4729 -130 -3793 -389 3945 1653 -3243 -2470 2652 3441 -1334 -3602 377 3583
1277C583l112m343J271M363j72m438j333L415K313k506k720J489K784n89k562
$$ 3583 471 -3872 -2601 1762 1590 -2848 -4181 -766 1547 -959 -3679 -2190 594 5 -2557
1292b557j6K027M70j466m96J111N04q17j85P75K83q48l15Q21M04r15m73P18M94
$$ -2557 -2573 -546 -76 -1542 -2038 -927 -423 -1240 -1425 -650 -367 -1215 -1530 -709 -305 -1220 -1693 -975 -481
1311d81m66n33P48J047n78q27O31J318l11j712m8J786L76k285j403K124K295j631
$$ -481 -947 -1480 -732 315 -263 -1090 -459 859 548 -1164 -1212 574 950 -1335 -2738 -614 1681 50
1329E0k800J038L986P22l671j645L616L139k836m348J382M767m01n313j557M952
$$ 50 -2750 -1712 2274 2996 -675 -2320 1296 4435 1599 -2749 -1367 3400 2999 -2314 -3871 1081
1345A081K985l928l816L334N104j431n234K84N595J087n544l174M290L725l726
$$ 1081 4066 138 -3678 -344 4760 3329 -1905 -1621 3974 5061 -483 -3657 633 4358 632
1360F32n294J863N795j5n654j517N763L775l972m944K567N640r50o299j785N195
$$ 632 -4662 -2799 2996 2981 -2673 -4190 1573 5348 1376 -3568 -1001 4639 3689 -2610 -4395 800
1376H00K864m680m628L010N718r60n336JN770K284m607l342L641M120k800n315
$$ 800 3664 -1016 -5644 -2634 3084 2124 -3212 -3211 2559 4843 236 -3106 535 4655 1855 -3460
1392c460O82M853K24n015j752M523L554k876l750K378M917k99m704j156M134K066
$$ -3460 -2778 2075 2299 -2716 -4468 55 3609 733 -3017 -639 4278 3979 -725 -1881 2253 4319
1408D319l831l894J901L973p83m056k04M043J923k603k062K560K987j126l151
$$ 4319 488 -3406 -1505 2468 1685 -2371 -2575 1468 3391 788 -1274 1286 4273 3147 -4
1423dn3K438L44k625j468J629J597j144j782Q91K302L34j567m96J567R37j189
$$ -4 -57 2381 2725 100 -1368 261 1858 714 -1068 -177 2125 2459 892 396 1963 2900 1711
1440A711j553J81J007k85j462p37O93P52l01n18J35O42N39j95m40k73K32L51k98
$$ 1711 158 339 1346 1061 -401 -1138 -445 307 6 -512 -377 265 804 609 169 -104 128 479 181
1459A81j040p10L76Q21m45j119r0J420Q01j035j254J093J889m50k261l72K121
$$ 181 -859 -1569 -1193 -372 -817 -1936 -2026 -606 195 -840 -2094 -1001 888 438 -1823 -2195 -74
1476g4P31k266j627J806K167j412k596Q46L073K35k992r66K797K004k376k890
$$ -74 657 -1609 -3236 -1430 737 -675 -3271 -2425 648 883 -2109 -3075 -278 1726 -650 -3540
1492c540J420L388m05l843p74L435K072k989k978K273L843q52m310l08M147J861
$$ -3540 -2120 1268 863 -2980 -3754 -319 1753 -1236 -4214 -1941 1902 1050 -3260 -3568 579 2440
1508B440l733k970K733L936j692m406M85M737J108m475k250L779L625k665m435
$$ 2440 -1293 -4263 -1530 2406 714 -3692 -3207 1530 2638 -1837 -4087 -308 3317 652 -3783
1523c783J495M844n1m888j359M566K814l590l826K562M619j087m846l42M592J888
$$ -3783 -2288 2556 2505 -2383 -3742 824 3638 48 -3778 -1216 3403 2316 -2530 -2872 1720 3608
1539C608l900l129K889L801j546m285K88M166J128l835k256K977L279j937l863
$$ 3608 -292 -3421 -532 3269 1723 -2562 -2274 1892 3020 -815 -3071 -94 3185 1248 -2615
1554b615O85L977N21l838j609L226K658k570l334J613L596m20l755n76L372J582
$$ -2615 -1930 2047 2568 -1270 -2879 347 3005 435 -2899 -1286 2310 1890 -1865 -2441 931 2513
1570B513k926k209K144K702j189k739M88K736L52k513q77J926J248j454j529P97
$$ 2513 -413 -2622 -478 2224 1035 -1704 -1216 1520 1872 -641 -1518 408 1656 202 -1327 -530
1586e30J442j87j252K7J154M30o81m08N21M05l50l85j9R7j70j85R4r4k10M7N18
$$ -530 912 725 -527 -500 654 1084 403 -5 516 921 571 186 167 264 94 -91 3 -91 -301 -254 264
1607B64J77l10k27N27O67m09j011j8R23R0j410q96J095J266r75j695Q01K418J47
$$ 264 441 131 -96 431 1098 689 -322 -340 583 673 -737 -1633 -538 728 -247 -1942 -1141 1277 1424
1626A424k341n96K641J434k499k360J726K758j535l626M68L722N18l467j312L576
$$ 1424 -917 -1513 1128 2562 63 -2297 -571 2187 652 -2974 -2506 1216 1734 -1733 -3045 531
1642E31K708k539l112J751L845o58m281r58L700J784l552l154K450L885j174m063
$$ 531 3239 700 -2412 -661 3184 2526 -1755 -2713 987 2771 -781 -3935 -1485 2400 1226 -2837
1658b837J38M546J541l827k582L303L375k375m560P58M464K24m602j939M116L127
$$ -2837 -2699 1847 3388 -439 -3021 282 3657 1282 -3278 -2520 1944 2168 -2434 -4373 -257 2870
1674B870k949l768K276M715n10m658p90M411J980m069l291K580L773j637m271
$$ 2870 -79 -3847 -1571 3144 2634 -2024 -2814 1597 3577 -492 -3783 -1203 2570 933 -3338
1689c338L35M299J191l677j736L184K912j940l281Q99L289Nl437j176K696J675
$$ -3338 -3003 1296 2487 -1190 -2926 258 3170 1230 -2051 -1152 2137 2142 -1295 -2471 225 1900
1705A900k140k365J467K837l37k725k37K696J092k212j635J425J905j104k188
$$ 1900 -240 -2605 -1138 1699 1362 -1363 -1600 1096 2188 -24 -1659 -234 1671 567 -1621
1720a621J39J967L38j774o71J396J147q21j009N97Q83k60q49o5N85j2m91j06L39
$$ -1621 -1482 485 823 -951 -1622 -226 921 100 -909 -312 571 311 -538 -603 -18 -30 -521 -627 -288
1739b88k5j34J62L37L2m30P0N60p8p36n5P33K29q78n18R16Q98o63j044N45J392
$$ -288 -313 -447 -285 52 84 -346 -276 284 206 -530 -585 148 377 -501 -1019 -103 795 132 -912 -367 1025
1760A025n3j737l23J497Q47j596j527J251J949o26k374J0K563R89k289j548J849
$$ 1025 972 -765 -1088 409 1256 -340 -1867 -616 1333 707 -1667 -1657 906 1895 -394 -1942 -93
1777i3K208j319k846L24K848K80k802j433K458K239j791k595J298L133j31l131
$$ -93 2115 796 -2050 -1726 1122 1402 -1400 -2833 -375 1864 73 -2522 -1224 1909 1778 -1353
1793a353o58K969J538k801k630J878L006j125l483rL638J295l118j907K717L179
$$ -1353 -2011 958 2496 -305 -2935 -1057 1949 824 -2659 -2668 970 2265 -853 -2760 -43 3136
1809C136j686l595N19L617O10l698j947K789K570k068l181J169L551K57l155j053
$$ 3136 1450 -2145 -1626 1991 2601 -1097 -3044 -255 2315 247 -2934 -1765 1786 2043 -1112 -2165
1825b165L194K012k446k612J452K842q95l259m18K947J102k571k001K140K784
$$ -2165 1029 3041 595 -2017 -565 2277 1382 -1877 -2295 652 1754 -817 -2818 -678 2106
1840B106j066k699K61L063P26k651j674J959J933j339k668L40K541L39k180j000
$$ 2106 1040 -1659 -1398 1665 2391 -260 -1934 25 1958 619 -2049 -1709 832 1171 -1009 -2009
1856b009K023J717j176j682P58J919j35j822m32J400O58j333j109Q11J200n42
$$ -2009 14 1731 555 -1127 -369 1550 1415 -407 -839 561 1219 -114 -1223 -412 788 246
1872B46j220J99J429L27j030m63R30P37n60r47J09P44j17q04l31M52K61k52j94
$$ 246 -974 -775 654 981 -49 -512 418 1155 595 -352 -243 501 384 -420 -751 -299 -38 -290 -484
1891d84R2K11O9J91Qk14j45L31L79m10p02l0O70L4p78m47O91Q24m61q80L49J127
$$ -484 -392 -181 -112 79 87 -127 -272 59 438 28 -674 -704 -34 0 -778 -1225 -534 290 -171 -1051 -702 425
1913D25J98j069m30R84P86q44j240N50J330l50j625j89J603P84j473j363J466
$$ 425 623 -446 -876 108 894 50 -1190 -640 690 340 -1285 -1474 129 913 -560 -1923 -457
1930d57J972p78k233K16K439N68k367j521J879K026j454k738M83K911L67k761
$$ -457 1515 737 -1496 -1280 1159 1727 -640 -2161 -282 1744 290 -2448 -1965 946 1313 -1448
1946a448j195K527K081j768k484J175K823m06k889n98K629J251k433k127J801
$$ -1448 -2643 -116 1965 197 -2287 -1112 1711 1305 -1584 -2182 447 1698 -735 -2862 -1061
1961a061K586r91k879K73L120R42k772j587K451K534j652l150O34L215K91l239
$$ -1061 1525 534 -2345 -2072 1048 1990 -782 -2369 82 2616 964 -2186 -1552 1663 1954 -1285
1977a285j376K730K234j944k623J287L139j30k879o36K778J347k281k009J546
$$ -1285 -2661 69 2303 359 -2264 -977 2162 2032 -847 -1483 1295 2642 361 -1648 -102
1992a02K204r89k605K69K486N05k311j072K202J633j408j958Q48K250k02k385
$$ -102 2102 1113 -1492 -1223 1263 1768 -543 -1615 587 2220 812 -1146 -298 1952 1750 -635
2008f35n97J931R94j570j633R75J853l97j769p7J711O65j268q48R34J072q09j047
$$ -635 -1232 699 1693 123 -1510 -535 1318 921 -848 -925 786 1451 183 -665 269 1341 532 -515
2026e15K87R14k71r56O2R19N5p54j42Q72K89n56m58N60M91m51o00K49N91l90o23
$$ -515 -228 686 415 -541 -479 440 495 -259 -401 471 760 204 -254 306 797 346 -254 -5 586 196 -427
2047d27J31O65j76n89J30P34N1r02k51J127M84j022r94Q96J176o22j612J80J751
$$ -427 -296 369 193 -396 -266 468 519 -383 -634 493 977 -45 -1039 -143 1033 411 -1201 -1021 730
2066G30L60j759r33J543J487j215j788O05K119l3k189n52J893J189j617j650J279
$$ 730 1090 -669 -1602 -59 1428 213 -1575 -970 1149 1116 -1073 -1625 268 1457 -160 -1810 -531
2083e31K020q28k289K12K398M83k253j158K054J765j523k362Q61K783o0k890q26
$$ -531 1489 661 -1628 -1416 982 1465 -788 -1946 108 1873 350 -2012 -1151 1632 1572 -1318 -2144
2100b144K640J639k159k324J489K635n78k977k90K863J106k368j883J867K328
$$ -2144 496 2135 -24 -2348 -859 1776 1198 -1779 -2069 794 1900 -468 -2351 -484 1844
2115A844j172k625M39K703K61k697r77K256J663j867k075J162K393m91k377k78
$$ 1844 672 -1953 -1514 1189 1450 -1247 -2224 32 1695 -172 -2247 -1085 1308 817 -1560 -1838
2131a838K523J071k067j719J556K047q13k225k7K267O18j892j232J542J579o28
$$ -1838 685 1756 -311 -2030 -474 1573 760 -1465 -1492 775 1393 -499 -1731 -189 1390 762
2147G62j770K89J852L39j618p01J306J036j011j308O74J242l58j212p7J327M14
$$ 762 -1008 -719 1133 1472 -146 -847 459 1495 484 -824 -150 1092 734 -478 -555 772 1186
2164A186j094n43R39Q52o75r45L71R16k22q53j94O77K21n36k92L65K82k38l8K19
$$ 1186 92 -451 488 1340 665 -280 91 1007 785 -68 -262 415 636 100 -192 173 455 217 179 398
2184C98P1k59J7K92Km76k23N54K34m49n50K78P28Jo86j85P66N21n20p28M25Q05
$$ 398 469 210 227 519 521 45 -178 376 610 161 -389 -111 617 618 -68 -253 513 1034 514 -214 211 1016
2206A016k40r55j08J027K72r89o22R02R52o60j220N33J498n2j712l23J587R03
$$ 1016 776 -179 -287 740 1012 23 -599 303 1255 595 -625 -92 1406 1354 -358 -681 906 1809
2224A809j508j580J136J728o74k016mK006P07j876j155J570J711r84j971M31J971
$$ 1809 301 -1279 -143 1585 911 -1105 -1109 897 1604 -272 -1427 143 1854 870 -1101 -670 1301
2241A301J08j910q77J673J260j310j689Q14J933j63j978l77J931J031j622j544
$$ 1301 1409 -501 -1378 295 1555 245 -1444 -630 1303 1140 -838 -1215 716 1747 125 -1419
2257a419J217J956o87k296j00K360N81j935j443J585K062j060k248L49K380K55
$$ -1419 -202 1754 1067 -1229 -1329 1031 1612 -323 -1766 -181 1881 821 -1427 -1078 1302 1557
2273A557k173r47J793J437j419j763P11J938k88j831l48J634Q64j344j137Q54
$$ 1557 -616 -1563 230 1667 248 -1515 -804 1134 846 -985 -1333 301 1165 -179 -1316 -462
2289d62J583n66j661JJ594N22j373j020J114J280p30j446K46J488K28j370o48
$$ -462 1121 555 -1106 -1105 489 1011 -362 -1382 -268 1012 282 -1164 -918 570 798 -572 -1220
2306a220J119R50o98j163N34J111mj087j66R56L97p31o42N45O81m49o33K48O34
$$ -1220 -101 849 151 -1012 -478 633 629 -458 -624 332 729 -2 -644 -99 582 133 -500 -252 382
2325C82n0o79QO25J78n49k15M30K64l98l20J90L48k38m47P3L42p7l49Q4L94o9
$$ 382 332 -347 -339 286 464 -85 -300 130 394 -4 -324 -134 214 -24 -471 -398 -56 -133 -482 -398 -4 -73
2347g3l77qN78N6o65l76N77N19o34q55M01Q97q0j030j81J210N00r28q14Q47J206
$$ -73 -450 -458 120 176 -489 -865 -288 231 -403 -1258 -857 40 -40 -1070 -1251 -41 459 -469 -1283 -436 770
$$ [...]
8191G7
##END NTUPLES=NMR FID
##END=
