##TITLE=1H_DPABC1702-12
 CDCl3
 8 sc, 
 18.02.2022
##JCAMPDX= 6.0         $$ Bruker NMR JCAMP-DX V2.0
##DATA TYPE= NMR FID
##DATA CLASS= NTUPLES
##ORIGIN= UXNMR, Bruker Analytische Messtechnik GmbH
##OWNER= root
$$ XWIN-NMR		Version 3.5
$$ Fri Feb 18 10:58:38 2022 Russian Standard Time (UT+4h)  she@DPX200
##.OBSERVE FREQUENCY= 200.131346
##.OBSERVE NUCLEUS= ^1H
##.DELAY= (6, 6)
##.ACQUISITION MODE= SIMULTANEOUS
##.ACQUISITION SCHEME= undefined
##.AVERAGES= 8
##.DIGITISER RES= 18
##SPECTROMETER/DATA SYSTEM= spect
##.PULSE SEQUENCE= zg30
##.SOLVENT NAME= CDCl3
##.SHIFT REFERENCE= (INTERNAL, CDCl3, 0, 15.7039)
##AUDIT TRAIL= $$ (NUMBER, WHEN, WHO, WHERE, WHAT)
$$ ##TITLE= Audit trail, XWIN-NMR		Version 3.5
$$ ##JCAMPDX= 5.01
$$ ##ORIGIN= Bruker BioSpin GmbH
$$ ##OWNER= she
$$ F:/spectra/data/she/nmr/H-F/1/audita.txt
$$ ##AUDIT TRAIL=  $$ (NUMBER, WHEN, WHO, WHERE, WHAT)
(   1,<2022-02-18 10:57:13.81 +0400>,<she>,<DPX200>,
      <created by zg, POWCHK disabled, PULCHK disabled
       configuration hash MD5:
       00 E9 B6 7A A2 85 ED C7 34 08 36 98 17 FE 4E 26
       data hash MD5: 16K
       68 DF 91 84 E6 23 BE 80 50 50 C1 0B AE 14 36 C1>)
$$ ##END=
$$ 
$$ hash MD5
$$ B3 A2 BF 62 0E 67 40 56 91 45 86 24 61 75 83 61
##$RELAX= 
##$RELAX= 
##$RELAX= 
##$RELAX= 
##$RELAX= 
##$RELAX= 
$$ Bruker specific parameters
$$ --------------------------
##$DU= <F:/spectra>
##$EXPNO= 1
##$NAME= <H-F>
##$PROCNO= 1
##$TYPE= <nmr>
##$USER= <she>
##$AMP= (0..31)
100 100 100 100 100 100 100 100 100 100 100 100 100 100 100 100 100 100 
100 100 100 100 100 100 100 100 100 100 100 100 100 100 
##$AQSEQ= 0
##$AQ_mod= 1
##$AUNM= <au_zg>
##$AUTOPOS= <>
##$BF1= 200.13
##$BF2= 200.13
##$BF3= 200.13
##$BF4= 200.13
##$BF5= 200.13
##$BF6= 200.13
##$BF7= 200.13
##$BF8= 200.13
##$BYTORDA= 1
##$CFDGTYP= 0
##$CFRGTYP= 5
##$CHEMSTR= <none>
##$CNST= (0..31)
1 1 145 1 1 1 1 1 1 1 1 1 1 1 1 1 1 1 1 1 1 1 1 1 1 1 1 1 1 1 1 1 
##$CPDPRG= <>
##$CPDPRG1= <>
##$CPDPRG2= <>
##$CPDPRG3= <>
##$CPDPRG4= <mlev>
##$CPDPRG5= <mlev>
##$CPDPRG6= <mlev>
##$CPDPRG7= <mlev>
##$CPDPRG8= <mlev>
##$CPDPRGB= <>
##$CPDPRGT= <>
##$D= (0..31)
0 1.2 0 0 0 0 0 0 0 0.06 0 0.03 0 0 0 0 0.0002 0 0 0 0 0 0 0 0 0 0 0 0 
0 0 0 
##$DATE= 1645167433
##$DBL= (0..7)
120 120 120 120 120 120 120 120 
##$DBP= (0..7)
150 150 150 150 150 150 150 150 
##$DBP07= 0
##$DBPNAM0= <>
##$DBPNAM1= <>
##$DBPNAM2= <>
##$DBPNAM3= <>
##$DBPNAM4= <>
##$DBPNAM5= <>
##$DBPNAM6= <>
##$DBPNAM7= <>
##$DBPOAL= (0..7)
0.5 0.5 0.5 0.5 0.5 0.5 0.5 0.5 
##$DBPOFFS= (0..7)
0 0 0 0 0 0 0 0 
##$DE= 6
##$DECBNUC= <off>
##$DECIM= 32
##$DECNUC= <off>
##$DECSTAT= 4
##$DIGMOD= 1
##$DIGTYP= 9
##$DL= (0..7)
0 120 120 120 120 120 120 120 
##$DP= (0..7)
150 150 150 150 150 150 150 150 
##$DP07= 0
##$DPNAME0= <>
##$DPNAME1= <>
##$DPNAME2= <>
##$DPNAME3= <>
##$DPNAME4= <>
##$DPNAME5= <>
##$DPNAME6= <>
##$DPNAME7= <>
##$DPOAL= (0..7)
0.5 0.5 0.5 0.5 0.5 0.5 0.5 0.5 
##$DPOFFS= (0..7)
0 0 0 0 0 0 0 0 
##$DQDMODE= 0
##$DR= 18
##$DS= 0
##$DSLIST= <SSSSSSSSSSSSSSS>
$$ [...]
##$SUBNAM2= <"">
##$SUBNAM3= <"">
##$SUBNAM4= <"">
##$SUBNAM5= <"">
##$SUBNAM6= <"">
##$SUBNAM7= <"">
##$SUBNAM8= <"">
##$SUBNAM9= <"">
##$SW= 18.0517287032376
##$SWIBOX= (0..15)
0 0 2 0 0 0 0 0 0 0 0 0 0 0 0 0 
##$SW_h= 3612.71676300578
##$TD= 16384
##$TD0= 1
##$TE= 0
##$TE2= 300
##$TE3= 300
##$TEG= 300
##$TL= (0..7)
0 120 120 120 120 120 120 120 
##$TP= (0..7)
150 150 150 150 150 150 150 150 
##$TP07= 0
##$TPNAME0= <>
##$TPNAME1= <>
##$TPNAME2= <>
##$TPNAME3= <>
##$TPNAME4= <>
##$TPNAME5= <>
##$TPNAME6= <>
##$TPNAME7= <>
##$TPOAL= (0..7)
0.5 0.5 0.5 0.5 0.5 0.5 0.5 0.5 
##$TPOFFS= (0..7)
0 0 0 0 0 0 0 0 
##$TUNHIN= 0
##$TUNHOUT= 0
##$TUNXOUT= 0
##$USERA1= <user>
##$USERA2= <user>
##$USERA3= <user>
##$USERA4= <user>
##$USERA5= <user>
##$V9= 5
##$VALIST= <valist>
##$VCLIST= <CCCCCCCCCCCCCCC>
##$VD= 0
##$VDLIST= <DDDDDDDDDDDDDDD>
##$VPLIST= <PPPPPPPPPPPPPPP>
##$VTLIST= <TTTTTTTTTTTTTTT>
##$WBST= 1024
##$WBSW= 4
##$XGAIN= (0..3)
0 0 0 0 
##$XL= 0
##$YL= 0
##$YMAX_a= 73189
##$YMIN_a= -90986
##$ZGOPTNS= <>
##$ZL1= 120
##$ZL2= 120
##$ZL3= 120
##$ZL4= 120
##$ABSF1= 10
##$ABSF2= 0
##$ABSG= 5
##$ABSL= 3
##$ALPHA= 0
##$AQORDER= 0
##$ASSFAC= 0
##$ASSFACI= 0
##$ASSFACX= 0
##$ASSWID= 0
##$AUNMP= <proc_1d>
##$AZFE= 0.1
##$AZFW= 0.1
##$BCFW= 1
##$BC_mod= 2
##$BYTORDP= 1
##$COROFFS= 0
##$CY= 11.3945322036743
##$DATMOD= 1
##$DC= 2
##$DFILT= <>
##$DTYPP= 0
##$F1P= 2.36226072786647
##$F2P= -0.459571619588291
##$FCOR= 0.5
##$FTSIZE= 0
##$FT_mod= 4
##$GAMMA= 1
##$GB= 0.15
##$INTBC= 1
##$INTSCL= 1
##$ISEN= 128
##$LB= 0.24
##$LEV0= 0
##$LPBIN= 0
##$MAXI= 10000
##$MC2= 0
##$MEAN= 0
##$ME_mod= 0
##$MI= 1.114404
##$NCOEF= 0
##$NC_proc= 0
##$NLEV= 6
##$NOISF1= 3.799351
##$NOISF2= 2.8
##$NSP= 1
##$NTH_PI= 0
##$NZP= 0
##$OFFSET= 15.70392
##$PC= 1
##$PHC0= -16592.07
##$PHC1= 17.20078
##$PH_mod= 1
##$PKNL= yes
##$PPARMOD= 0
##$PSCAL= 0
##$PSIGN= 0
##$REVERSE= no
##$SF= 200.130013532006
##$SI= 16384
##$SIGF1= 3
##$SIGF2= 2
##$SINO= 400
##$SIOLD= 16384
##$SREGLST= <1H.CDCl3>
##$SSB= 0
##$STSI= 0
##$STSR= 0
##$SW_p= 3612.71676300578
##$SYMM= 0
##$S_DEV= 0
##$TDeff= 0
##$TDoff= 0
##$TI= <>
##$TILT= no
##$TM1= 0
##$TM2= 0
##$TOPLEV= 0
##$USERP1= <user>
##$USERP2= <user>
##$USERP3= <user>
##$USERP4= <user>
##$USERP5= <user>
##$WDW= 1
##$XDIM= 8192
##$YMAX_p= 0
##$YMIN_p= 0
$$ End of Bruker specific parameters
$$ ---------------------------------
##NTUPLES= NMR FID
##VAR_NAME=  TIME,          FID/REAL,        FID/IMAG
##SYMBOL=    X,             R,               I
##VAR_TYPE=  INDEPENDENT,   DEPENDENT,       DEPENDENT
##VAR_FORM=  AFFN,          ASDF,            ASDF
##VAR_DIM=   8192,          8192,            8192
##UNITS=     SECONDS,       ARBITRARY UNITS, ARBITRARY UNITS
##FACTOR=    0.0002768,     1,               1
##FIRST=     0,             0,               0
##LAST=      2.2672688,     0,               0
##MIN=       0,             -90986,          0
##MAX=       2.2672688,     73189,           0
$$ Real data points
##PAGE= N=1
##DATA TABLE= (X++(R..R)), XYDATA
0@%%%%%%%%%%%%%%qJ6j6J6j6K4l2L2m0M8n6O5p3Q8j04J20j36J53j76K00k25K55
$$ 0 0 0 0 0 0 0 0 0 0 0 0 0 0 0 -8 8 -8 8 -8 16 -16 16 -24 24 -32 33 -40 48 -56 64 -72 81 -95 105 -120 135
36A35k86L21l60M01m46M97n52O12o77P50q30R14j005J108j221J345j484J635j805
$$ 135 -151 170 -190 211 -235 262 -290 322 -355 395 -435 479 -526 582 -639 706 -778 857 -948
55i48J996k213K461k746L080l477L958m555N320o339P774r962J3748k2151P7024
$$ -948 1048 -1165 1296 -1450 1630 -1847 2111 -2444 2876 -3463 4311 -5651 8097 -14054 62970
70F2970k1563o3828Q3796m6279j7096N1917l9244q1229M5174P274m0965L9144
$$ 62970 41407 -22421 61375 15096 -2000 49917 10673 -70556 -25382 -18108 -59073 -19929
82a9929K5753o2767J9714N6819k0624N42M2921k9117j8619M5686L541m2795n378
$$ -19929 5824 -56943 -37229 19590 -1034 -492 42429 13312 -5307 40379 43920 1125 -4253
95d253M471l966P093K12j3506L786L003p367N366P710l532m238j2201j555J7174
$$ -4253 218 -3748 3345 3557 -9949 -6163 -3160 -10527 -5161 2549 -983 -5221 -17422 -18977 -1803
110a803L92l845J3229j0572j1385L0612Q410k7239J6347K1299l1875p803K8375
$$ -1803 -1411 -5256 7973 -2599 -13984 16628 25038 -2201 14146 35445 3570 -4233 24142
123B4142j6015j8485J1322k5549j7132L9336m492l4697L0484K0043k7812K3278
$$ 24142 8127 -10358 964 -24585 -41717 -2381 -6873 -41570 -11086 8957 -18855 4423
135D423L3871l2164n316L7193j7968k2726K8586p410l2484J4591K35k5875J6132
$$ 4423 38294 6130 814 38007 20039 -2687 25899 18489 -13995 596 831 -25044 -8912
148h912O797l2056J2087L1687j9437r641L0389L29j5393J5223K396j6501Q840
$$ -8912 -2115 -34171 -22084 9603 -9834 -19475 10914 11243 -4150 11073 13469 -3032 5808
161E808Q205j2509m23M197o089L088M407q880k292O435l728n591N502M645o767
$$ 5808 14013 1504 1081 5278 -811 2277 6684 -2196 -4488 1947 -1781 -7372 -1870 2775 -3992
176c992o792M089R914k089j0222M498P102n031N635R756r307m299Q834k739l352
$$ -3992 -10784 -6695 3219 1130 -9092 -4594 2508 -2523 3112 12868 3561 -738 8096 5357 2005
191B005M825p807q123R615j049j0360J1800N334k0323L753K0767r667p873J3352
$$ 2005 6830 -977 -9100 515 -534 -10894 906 6240 -14083 -10330 10437 770 -7103 6249
205F249k799p285J0998Q83q863N483l56j1712P310P840j4873o17J3422j0118o819
$$ 6249 3450 -3835 7163 8046 -817 4666 4310 -7402 -92 7748 -7125 -7742 5680 -4438 -11257
220a1257J5556p02j2508N031O051m012K259M217l679J494L773m502J585O739q164
$$ -11257 4299 3597 -8911 -3880 2171 -1841 418 4635 956 2450 6223 1721 3306 10045 1881
235A881p378Q342R39q219J297M063m764m405M115M171k622k454J811L048K014
$$ 1881 -5497 2845 3784 -4435 -3138 925 -3839 -8244 -4129 42 -2580 -5034 -3223 -175 1839
250A839P7L58J616j485k076K101K827k116n485J143N407l505m145N068M82p123
$$ 1839 1916 2274 3890 2405 329 2430 5257 3141 -2344 -1201 4206 701 -3444 1624 2106 -5017
266e017J34O014j51l838j83J342J373J788j566m51L104k578k362O238J124p188
$$ -5017 -4883 1131 980 -2858 -3041 -1699 -326 1462 -104 -555 2549 -29 -2391 3847 4971 -2217
282b217Q82N188l321l423L940O06n655p31L810J272P24k233j714N273K357m408
$$ -2217 -1335 3853 532 -2891 1049 1655 -4000 -4731 -921 351 1075 -1158 -2872 2401 4758 350
298C50Q61M260l873m023M196K286n995j820L365k198k565K840J284j942j020Q42
$$ 350 1211 5471 1598 -2425 1771 4057 -1938 -3758 -393 -2591 -5156 -2316 -1032 -2974 -3994 -3152
314c152L813K623k432k252L771L367l903j581N611j784o005K550L141l275k832
$$ -3152 661 3284 852 -1400 2371 5738 1835 254 5865 4081 -1924 626 3767 492 -2340
329b340J040q5k002N17J916l62q56j048J826L990j320l713L029L326l756j648
$$ -2340 -1300 -1385 -3387 -2870 -954 -1316 -2172 -3220 -1394 2596 1276 -2437 592 3918 162 -1486
345a486L993J305m950j080M031n3l068R9J020j99o92j06K133j3k428L86L366p1
$$ -1486 2507 3812 -1138 -2218 1813 1760 -1308 -1209 -189 -388 -1080 -1186 947 934 -1494 -1108 2258 2187
363B187l616K76L763j905l595K749K347k527k108J651K015j199k280J136K031
$$ 2187 -1429 -1153 2610 705 -2890 -141 2206 -321 -2429 -778 1237 38 -2242 -1106 925
378I25j437j993J834K911k547j769M327Q24l157J123K342m19j663j103J090R93
$$ 925 -512 -2505 -671 2240 -307 -2076 2251 3075 -82 1041 3383 2964 1301 198 1288 2281
394B281l098k611K574P28m773J01N564k026l789M337K508k393R72J682m88J036
$$ 2281 -817 -3428 -854 -126 -4899 -4798 766 -1260 -5049 -712 1796 -597 375 2057 1569 2605
410B605q54j564K929K07n896M43N749m048m189O081M69n782K628L679k352m38
$$ 2605 1751 187 3116 3323 -2573 -2130 3619 -429 -4618 1463 1932 -3850 -1222 2457 105 -333
426c33R20j121O54O55k266J107K372m172k281N879J089m217P97K231j044m83J191
$$ -333 587 -534 120 775 -1491 -384 1988 -2184 -4465 1414 2503 -1714 -917 1314 270 -213 978
443I78J753j417l856J311L753j873k032J876o82k183L007K293k094l4j441j673
$$ 978 2731 1314 -2542 -1231 2522 649 -1383 493 -189 -2372 635 2928 834 800 -641 -2314
459b314O004R06r229K025O507p202j874R391m301p821P599L115o190M349K785
$$ -2314 3690 4596 -4633 -2608 3899 -3303 -5177 4214 -87 -7908 -309 2806 -3384 965 3750
474C750p490M486N961q799J769P891r636k426J2123n314j0120R917L201r880K965
$$ 3750 -3740 746 6707 -2092 -323 7568 -2068 -4494 7629 2315 -7805 2112 5313 -4567 -1602
489a602M506p041K516N317o836k55N936o501M43R525o102o526P758J596m382M745
$$ -1602 2904 -4137 -1621 3696 -3140 -3395 2541 -3960 -3517 6008 -94 -6620 1138 2734 -1648 3097
505C097J566o495J64M406J21J568l417o292M297M248n030J674J829o796M94O003
$$ 3097 4663 -1832 -1668 2738 2859 4427 1010 -5282 -985 3263 -1767 -93 1736 -5060 -4566 1437
521A437j065K36L20n675K893P499n288k140P958o622p397J2525J713j1600M749
$$ 1437 372 608 928 -4747 -1854 5645 357 -1783 6175 -447 -7844 4681 6394 -5206 -457
536d57L626r049M827O458q771J318O722r533K36J4092o940r654J1532k29j0999
$$ -457 3169 -5880 -1053 5405 -3366 -2048 4674 -4859 -4623 9469 2529 -7125 4407 4178 -6821
551f821J0142N659j3115K55O182n718K735O354q995l804P606k902r20R308m068
$$ -6821 3321 8980 -4135 -3880 2302 -3416 -681 5673 -3322 -7126 480 -2422 -3342 5966 1898
566A898j0435O974O357l889K436J171o281J25L592N48J989k885o662K976N510
$$ 1898 -8537 -1563 4794 905 3341 4512 -1769 -1644 1948 2496 4485 1600 -5062 -2086 3424
581C424l532j142K188m226j269M744m17n64J376m625J151P873m113m211P902k249
$$ 3424 -108 -1250 938 -3288 -4557 187 -230 -794 582 -4043 -2892 4981 868 -3343 4559 2310
597B310p748P783M473q892N10N366n314J41N257o311o85P544o925m430J1372j174
$$ 2310 -5438 2345 6818 -2074 -1564 3802 -1512 -1371 3886 -2425 -3110 4434 -2491 -6921 4451 3277
613C277q295O929J819r084M364P172o609k058M472m454o61P035l991k698N246
$$ 3277 -5018 1911 3730 -5354 -990 6182 -427 -2485 1987 -2467 -3128 3907 -84 -2782 2464
628B464m935l640J0093J566q537J697L491k855K059K932m546j118J745k627K677
$$ 2464 -2471 -6111 3982 5548 -2989 -1292 2199 -656 1403 4335 -211 -1329 416 -2211 466
643D66L455n715r92N086l668j701O704j987o338K529K873n21J375j938l683M245
$$ 466 3921 -1794 -2786 2300 -1368 -3069 3635 1648 -4690 -2161 712 191 1566 -372 -4055 190
659A90K176n054K735M322o485q48O775j378k239K952k321l496K827J284j613P83
$$ 190 2366 -2688 47 4369 -2116 -2964 3811 2433 194 3146 825 -2671 156 1440 -173 610
675F10k391k580N048J784n361J580M132m548j650M055Q63n60l93j890R03K454
$$ 610 -1781 -4361 687 2471 -2890 -1310 2822 -1726 -3376 679 1542 982 589 -1301 -398 2056
691B056k029p05K201k428j745M133Q34l962K400K483m098J13J725j195J375q85
$$ 2056 27 -678 1523 -905 -2650 1483 2317 -1645 755 3238 -860 -747 978 -217 1158 273
707B73m151L339M507n146k818N472l72m510L454J849m292J301K661k370Q18K391
$$ 273 -3878 -539 3968 -1178 -3996 1476 1104 -3406 48 1897 -2395 -1094 1567 -803 15 2406
723B406k904m68J901k003K46M429k478m692M348L933m863j351L532j529k413J145
$$ 2406 -498 -966 935 -1068 -822 3607 1129 -3563 785 4718 -145 -1496 2036 507 -1906 -761
739g61M96M79M62j574r42J428N36j204M42R57k001O2L424j7k870J075K622j751
$$ -761 -265 214 676 -898 -1840 -412 124 -1080 -638 319 -1682 -1620 1804 1787 -1083 -8 2614 863
757H63k662K001K157k411j333J534J064m3o93j551Q42J280j578p95J779m44k166
$$ 863 -1799 202 2359 -52 -1385 149 1213 1170 477 -1074 -232 1048 -530 -1325 454 10 -2156
774b156K595J930l438q49L458j611k533K341J527j441q15L75J067J467p28k410
$$ -2156 439 2369 -1069 -1918 1540 -71 -2604 -263 1264 -177 -992 -617 450 1917 1189 -1221
790a221P91K576j972j568L293j51l109J571J810j979j492J651j56j923O70J590
$$ -1221 -430 2146 174 -1394 1899 1748 -1361 210 2020 41 -1451 200 44 -1879 -1209 381
806C81m33o31m60K52J875l12k489P64K548j202j856K454J596k849p02K792o53
$$ 381 -52 -683 -1143 -891 984 672 -1817 -1053 1495 293 -1563 891 2487 -362 -1064 1728 1075
823A075j641P66N84q55k24O17L40l14j090m04J247O67k144n89K778l73k516J623
$$ 1075 -566 200 784 -71 -295 322 662 348 -742 -1146 101 768 -1376 -1965 813 440 -2076 -453
841d53K108j925j381J396J048j212m08J341J45l53k00M12P52o31j694J575J169
$$ -453 1655 -270 -1651 -255 793 -419 -827 514 659 306 106 518 1270 639 -1055 520 1689
858A689j643r98J830M90k379k96K344r32k075J173R72m69l52j9P27N54j358j87
$$ 1689 46 -952 878 1368 -1011 -1307 1037 105 -1970 -797 175 -294 -646 -665 62 616 -742 -929
876i29J664L80k400N13K631j145j949K102R07j944k40J040K08p71n94N70O67o87
$$ -929 735 1115 -1285 -772 1859 714 -1235 867 1774 -170 -410 630 838 67 -527 43 710 23
894B3j062N07J341j585j268K185O87k118K26J763J31j161k93J368k2j463K11J301
$$ 23 -1039 -532 809 -776 -2044 141 828 -1290 -1064 699 830 -331 -624 744 722 -741 -530 771
912G71k78j407N01J241n99q78R52Q51n55q28J50J929j022k178J774J294k719q76
$$ 771 493 -914 -413 828 229 -649 303 1154 599 -229 -79 1850 828 -1350 424 1718 -1001 -1877
930a877K045j17j471M01M54j58O35n77qJ969p91k513K955J692l618P82K889k505
$$ -1877 168 51 -1420 -1019 -565 -723 -88 -665 -673 1296 505 -2008 947 2639 -979 -197 2692 187
948A87j518K824K17k202M90n6o14J679m56k526K280P68l432J582K632k744j685
$$ 187 -1331 1493 1710 -492 -2 -58 -672 1007 551 -1975 305 1073 -2359 -777 1855 -889 -2574
965b574K790R6j150J074M50r16J36j12O79J595j745j866K591L83k600J314J088
$$ -2574 216 312 -838 236 686 -230 -94 -206 473 2068 323 -1543 1048 1431 -1169 145 1233
982A233j814j84O25r1J518p38k464J922J570k823O22L642l531k848M254R8k424
$$ 1233 -581 -765 -140 -231 1287 549 -1915 7 1577 -1246 -624 3018 -513 -3361 893 991 -1433
999a433K096n18k563K186J074j903K443L24m990K084N571l349k851M010j548l382
$$ -1433 663 145 -2418 -232 842 -1061 1382 1706 -3284 -1200 4371 1022 -1829 2181 633 -2749
1015b749M576J124l856L26K70j750K780J320l655J42J940k482L76M507k312l648
$$ -2749 1827 2951 -905 -579 -309 -2059 721 2041 -1614 -1472 468 -2014 -1638 2869 557 -3091
1031c091K442J596r98Q38q2j157M27n02Q80K328j929k712K137J343j719P09P75
$$ -3091 -649 947 -51 787 705 -452 -25 -527 353 2681 752 -1960 177 1520 -199 510 1285
1048A285k234J0J098j035J785N79m378R73M094l383j045N080k029m550M035J990
$$ 1285 -949 -939 159 -876 909 1488 -2890 -1917 2177 -1206 -2251 2829 800 -3750 285 2275
1064B275l601J642J807l800J070L057l468Q03L929n147k007O471j463m433M260
$$ 2275 -1326 316 2123 -1677 -607 2450 -1018 -215 3714 -1433 -3440 3031 1568 -2865 1395
1079A395P50n427J961M237l263o15K298l106k3L908k050j729L097k273k609M853
$$ 1395 2145 -3282 -1321 2916 -347 -962 1336 -1770 -1793 2115 65 -1664 1433 -840 -3449 1404
1095A404J699m473j55K120r20q4K010n36j520n17n3K638O73k532k3N13j030J177
$$ 1404 3103 -1370 -1525 595 -325 -409 1601 1065 -455 -972 -1025 1613 2286 -246 -269 244 -786 391
1113C91J529j689o08l08j334K549K042m362o75M022k213k729N549L02n907K630
$$ 391 1920 231 -377 -685 -2019 530 2572 -1790 -2465 1557 -656 -3385 2164 2466 -3441 -811
1129h11L325l719J495L232m732k80M269k960j340N404k935n585N810K021o552
$$ -811 2514 -1205 290 3522 -1210 -1490 2779 -181 -1521 3883 948 -4637 1173 3194 -3358
1144c358K851M107o573q17O294j990k548L366j735k511M139R39l702J646J929
$$ -3358 -507 3600 -2973 -3790 2504 514 -2034 1332 -403 -2914 1225 2164 -1538 108 2037
1159B037m445J678M640l264l059L056L22k346J306J813j899j708J548J264q54
$$ 2037 -2408 -730 3910 646 -2413 643 965 -1381 -75 1738 -161 -1869 -321 943 89
1174H9j00L07o44L56Q06q82l56J307m47k387J826J889l729l3M407k334l541M083
$$ 89 -11 296 -348 8 814 -68 -424 883 436 -1951 -125 1764 -1965 -1998 2409 75 -3466 617
1192F17J372l872J772K512l329L9L197k289p92L430k846k277N209p28n007L378
$$ 617 1989 -1883 -111 2401 -928 -889 2308 19 -773 2657 -189 -2466 2743 2015 -2992 386
1208C86J983m939Q08M952l515l223M103M8k511K571O0l369K545J725k775J359
$$ 386 2369 -2570 -1762 3190 -325 -3548 555 603 -1908 663 723 -2646 -101 1624 -1151 208
1224B08K297l617q27M368l72l306K050J240l421R8L050j219j810R47J04n63O53
$$ 208 2505 -1112 -1939 2429 2057 -1249 801 2041 -1380 -1282 1768 549 -1261 -314 -210 -773 -120
1241a20J88p63P87O65j797j07K850j159k296K134J278k951K42K800j252k295K333
$$ -120 68 -695 92 757 -1040 -1147 1703 544 -1752 382 1660 -1291 -1049 1751 499 -1796 537
1258E37Q59k468J005J362j733N72J145k076M31K282k285j399L321l38l643J913
$$ 537 1396 -1072 -67 1295 -438 134 1279 -797 -366 1916 -369 -1768 1553 1215 -2428 -515
1274e15K365l288q6L424j975j777K341j14j470J557K33j724J145R74k350P97K886
$$ -515 1850 -1438 -1524 1900 -75 -1852 489 375 -1095 462 695 -1029 116 1090 -1260 -463 2423
1291B423k737j774L663J00l321J691J869k102n82J527r24p73J670o08j515J403
$$ 2423 -314 -2088 1575 1675 -1646 45 1914 -188 -770 757 -167 -940 730 122 -1393 10
1307A0k13j268J792O06k665Q31K388j786j474K861N06k687N80J594q73k13O79
$$ 10 -203 -1471 321 927 -1738 -907 1481 -305 -1779 1082 1588 -1099 -519 1075 202 -11 668
1324F68r31l7J217q62p23J513l31j514J168J159k420j65K392j194j690J940P15
$$ 668 -263 -300 917 55 -668 845 514 -1000 168 1327 -1093 -1258 1134 -60 -1750 190 905
1341I05j793k18J222O3k58J79o50J67J341p19j034J768K00k237Q24J635j358q68
$$ 905 -888 -1106 116 179 -79 100 -550 -383 958 239 -795 973 1173 -1064 -240 1395 37 -831
1359h31J910k74j984J077J582j520p68Q36m12J69N25j209N4J431q17j350J761
$$ -831 1079 805 -1179 -102 1480 -40 -808 28 -384 -215 310 -899 -845 586 -231 -1581 180
1376A80Q82k130J38K228r09j200J755K14j471N14P46m39n93j00k00N11J56r98
$$ 180 1062 -1068 -930 1298 389 -811 944 1158 -313 201 947 508 -85 -185 -385 126 282 -716
1394g16j7J580o82j706J300J426j636q36J616K64j163M91R96j097m75Q26j04k45
$$ -716 -733 847 165 -1541 -241 1185 -451 -1287 329 593 -570 -79 917 -180 -655 171 67 -178
1412a78M64l82j01O55l50q79J443P30k386j7K649j357j654K179L24k022J112N11
$$ -178 286 -96 -197 458 108 -771 672 1402 -984 -1001 1648 291 -1363 816 1140 -882 230 741
1430G41j282K85P29j130JJ137j082m65J965r70j482J923M01j992P62J617q58o97
$$ 741 -541 -256 473 -657 -656 481 -601 -1066 899 -71 -1553 370 771 -1221 -459 1158 300 -397
1448c97R71L25l57K9l59r8M76l64r80J023J07j149J29Q09l55o04L7P06j99q34
$$ -397 574 899 542 571 212 114 590 226 -754 269 376 -773 -644 165 -190 -794 -757 -51 -250 -1084
1468a084R96J237j439o05J422N69j070R4M43o98K21M50n61L36M02j735M27J882
$$ -1084 -88 1149 -290 -895 527 1096 26 120 563 -135 86 536 -25 311 713 -1022 -595 1287
1486A287j521j085J806qj905J428J560k002l32J452p09n53J255q53m81Q57m57
$$ 1287 -234 -1319 487 479 -1426 2 1562 -440 -772 680 -29 -582 673 -180 -661 196 -261
1503b61o42J789k50k058R12J527j280l98J659k17j299M90N15K18m66l67L32M48
$$ -261 -903 886 636 -1422 -510 1017 -263 -661 998 781 -518 -28 487 705 239 -128 204 652
1521F52j116M7J031l98r78M02n6Q7M65n46j74P60p19p93K265L69k661Q80K069
$$ 652 -464 -417 614 216 -762 -360 -416 -329 136 -410 -584 176 -543 -1336 929 1298 -1363 -483 1586
1540A586j839nK094j316j559J805p6j210J716q16k430K031J189k914J167K110
$$ 1586 -253 -258 1836 520 -1039 766 690 -520 1196 380 -2050 -19 1170 -1744 -577 1533
1556A533l177n14L928j203k061K196R8j901J211J328j792N70O88k251Q16K283
$$ 1533 -1644 -2158 1770 567 -1494 702 800 -1101 110 1438 -354 216 904 -1347 -531 1752
1572A752j822r71J858p56j407J881J152j491r94N44L63jJ85K0m21q78q3J696M97
$$ 1752 -70 -1041 817 61 -1346 535 1687 196 -798 -254 109 108 293 313 -108 -986 -1069 627 1124
1591A124j287o17m09M34K012q06j055P78o70j315K765J434l483n68K661j023n55
$$ 1124 -163 -780 -1189 -755 1257 451 -604 174 -496 -1811 954 2388 -1095 -1663 998 -25 -580
1608e80K890j352k838K062P56j403J831m67l402J816K541k877j56K946k657k121
$$ -580 2310 958 -1880 182 938 -465 1366 899 -2503 -687 1854 -1023 -1179 1767 -890 -3011
1624c011M264M9l120J950P39k069J468J357k216O11J521k245oK613j640j753K579
$$ -3011 1253 1302 -1818 132 871 -1198 270 1627 -589 22 1543 -702 -708 1905 265 -1488 1091
1641A091Q6k927J433J801j661m60O71o09R3O33Ol48j17l66N6J015Q6o38l36M25
$$ 1091 1177 -1750 -317 1484 -177 -637 34 -575 -482 151 157 -191 -308 -674 -618 397 483 -155 -491 -66
1661f6M11Kk73P07n70j675J769J410k094m73J709j226o96J837Jj597R56J29j449
$$ -66 345 347 74 781 211 -1464 305 1715 -379 -852 857 -369 -1065 772 773 -824 132 261 -1188
1680a188J869L81k463R11J942k607k02L163j523k200K232M95k042J264J145j773
$$ -1188 681 1062 -1401 -490 1452 -1155 -1357 1806 283 -1917 315 810 -1232 32 1177 -596
1696e96L39J121j446P60J928k386q27K404p16j520J907M31k720L55J957q59o78
$$ -596 -257 864 -582 178 2106 -280 -1107 1297 581 -939 968 1399 -1321 -966 991 132 -546
1713e46M65n83l24R65Pk23N08q20n12J453P68j216l92P56j72j59K44P76q08p56
$$ -546 -81 -664 -988 -23 -16 -239 269 -551 -1063 390 1158 -58 -450 306 134 -25 219 995 187 -569
1733e69J71Q70o9q35K30L31m31K49L09j2N8o73n9R49l37j136R42O23j041m21J375
$$ -569 -398 472 403 -432 -202 129 -302 -53 256 244 302 -371 -430 519 182 -954 -12 611 -430 -851 524
1754E24k55j059N68N59m80J89J22l27N81J22q83P00P72j271m65J355l20j157Q98
$$ 524 269 -790 -222 337 -143 46 168 -159 422 544 -339 361 1133 -138 -603 752 432 -725 173
1773A73N60j522K74O63k26m6K41p64L52N10p07j91J466m33j501J152J054j433
$$ 173 733 -789 -515 148 -78 -124 117 -647 -295 215 -492 -683 783 350 -1151 1 1055 -378
1791c78K9J511p15p77P95J31m85J15l8m60K31k16n80N61Q35j189m25J527q5j136
$$ -378 -349 1162 447 -330 465 596 111 226 188 -272 -41 -257 -837 -276 559 -630 -1055 472 387 -749
1811g49Q15Q19p70n61Q91J77p14K34O5m61K78j95l11P01J61q59K56J112p83p96
$$ -749 66 885 115 -446 445 622 -92 142 207 -254 24 -171 -482 219 380 -479 -223 889 106 -690
1831f90J099O37j484Q3J167j029m90R40k31n52L53r8k91N65K03o44N53Q33j490
$$ -690 409 1046 -438 -355 812 -217 -707 233 2 -550 -197 -295 -586 -21 182 -462 91 924 -566
1850e66j12J919q00j347J120N07j476N22R33n45k48N62m61l21J022n68m98J136
$$ -566 -678 1241 441 -906 214 721 -755 -233 700 155 -93 469 8 -313 709 141 -357 779
1868G79n73j301R06Q68j385n59J391n7j270J060N32p14K35N86k06R1K69o40P2
$$ 779 206 -1095 -189 679 -706 -1265 126 69 -1201 -141 391 -323 -88 498 292 383 652 12 84
1887H4P58q56m21O21Q2j033M61J176j095p44J336J42r83K94N92m16j77j08J19
$$ 84 842 -14 -435 186 268 -765 -304 872 -223 -967 369 511 -472 -178 414 -2 -179 -287 -168
1906a68J28K32o46k02J186m17r51J211O29j354N9J218n83p71P35L31r85J52L20
$$ -168 -40 192 -454 -656 530 113 -838 373 1002 -352 -293 925 342 -429 306 637 -348 -196 124
1925A24m57P42l70o74Q25M59r59j38J234m98j178Q33P06j159J06N83n96k33O65
$$ 124 -333 409 39 -635 190 649 -310 -448 786 288 -890 -57 649 -510 -404 179 -417 -650 15
1944A5j95K5L34k63N3P76l47n91O35N58j116j40R79m91r21N47J9j60J49L0k27
$$ 15 -180 -155 179 -84 -31 745 398 -193 442 1000 -116 -256 723 232 -689 -142 -123 -283 -134 -104 -331
1965c31K06q2l12O40J26n85q0Q22l69n46P68M29r59j05P87L61o03j92L38n6k63
$$ -331 -125 -207 -519 121 247 -338 -418 404 35 -511 257 686 -273 -378 409 770 167 -25 313 257 -6
1986fK47j14j33Jm20K79N51k64o82M89M26p86j6J153n14j186R82O17j055K88M50
$$ -6 241 127 -6 -5 -425 -146 405 141 -541 -52 374 -412 -428 725 211 -975 7 624 -431 -143 307
2007C07p95L53L93n91J66J023r38n74J583k47j466J440L57j758N18R08r96k08
$$ 307 -488 -135 258 -333 -167 856 -82 -656 927 680 -786 654 1011 -747 -229 679 -317 -525
2025e25Q60l89n87O17j70k96J094o46j377J408R19j550M36J058j211k80J283J78
$$ -525 335 -54 -641 -24 -194 -490 604 -42 -1419 -11 908 -642 -206 852 -359 -639 644 822
2043H22q37j00K05r4L95j18l61J63k91m17O86N95n56p13K8O76L14o74L65K01p53
$$ 822 -15 -115 90 -4 391 273 -88 75 -216 -633 53 648 92 -621 -593 83 397 -277 88 289 -464
2064d64k30J378J19j395N22O17q93J34J089r78l04R90r64rJ830j207j338J847
$$ -464 -694 684 803 -592 -70 547 -346 -212 877 -101 -405 585 -379 -388 1442 235 -1103 744
2082G44qj888J349J415k293n23J640n41m67J404q07j240J324J28j019J490J40
$$ 744 736 -1152 197 1612 -681 -1204 436 -105 -572 832 25 -1215 109 237 -782 708 848
2099H48k279R37J831j229n97J455r50j163J651M36r46J82j70l85P47K44q21K42
$$ 848 -1431 -494 1337 108 -489 966 16 -1147 504 940 -6 176 6 -379 368 612 -209 33
2117C3J06n45p9R43l65o93J92M65K3k56q7P15l69q86P77O52r22J52O96p40KO22
$$ 33 139 -406 -485 458 93 -600 -408 57 80 -176 -263 452 83 -803 -26 626 -296 -144 552 -188 -186 436
2139D36l40j15O91q66m80J473j54j529J089O92k289P31J903j388q79J414p67m37
$$ 436 96 -19 672 -194 -674 799 645 -884 205 897 -1392 -661 1242 -146 -1025 389 -378 -815
2157h15J330j95q74P08pr17J346N68j855J35J384r84k09J321k83j465O50O29k15
$$ -815 515 320 -554 154 147 -770 576 1144 -711 -576 808 -176 -385 936 653 -812 -162 467 252
2176B52J53l93o27N87L34o40N75J86r80j44J105j55n06L7l3J07k61L70M27j23
$$ 252 405 12 -615 -28 306 -334 241 427 -553 -697 408 253 -253 -216 -249 -142 -403 -33 394 271
2196B71o24j4R42j44n85O12j01p47L72L44r4L9l47l78P44O1q70J52P25q87m10
$$ 271 -353 -367 575 431 -154 458 357 -390 -18 326 232 271 -76 -454 290 351 -519 -367 358 -529 -939
2217i39J242P8j138N86M55m33K63L44m05J40l7n97O63M29o78l41P91p6o73M70
$$ -939 303 381 -757 -171 284 -149 114 458 53 193 156 -441 222 651 -27 -368 423 347 -326 144
2237A44M57p02j83K71K01K6m43L0L15k37l50N11J99m83k03M35L0k63J75q3J64
$$ 144 601 -101 -284 -13 188 214 -229 -199 116 -121 -471 40 239 -244 -447 -12 18 -245 -70 -153 11
2258A1J50m47L32P63p71o77J118q6p75L46P02p97j03O14l02k23M88n96q2O38n99
$$ 11 161 -286 46 809 38 -639 479 393 -382 -36 666 -131 -234 380 78 -145 343 -253 -335 303 -296
2279b96l64J004j71r70M09R83o09m44R25j71o67P03N4k98J19j18k15N55Jo53J30
$$ -296 -660 344 173 -797 -388 595 -14 -458 467 296 -371 332 386 88 207 89 -126 429 430 -223 -93
2300i3N48m95n02P30K68p37k00J047m61m87K99K42l83O1K34n2q6Q2k15J36M61
$$ -93 455 -40 -542 188 456 -281 -481 566 105 -382 -83 159 -224 -163 71 19 -67 15 -200 -64 397
2321C97k46l79O40L0j020N77P72q27n02R99j25p18L34O68q06J13P0p5OK38m29
$$ 397 151 -228 412 442 -578 -1 771 -56 -558 441 316 -402 -68 600 -206 -93 -23 -98 -92 146 -283
2342b83k43Q72m88n45P61M69j287L49J142p72n26Q18J23o53L01M06m67O7L09m96
$$ -283 -526 346 -142 -687 74 543 -744 -395 747 -25 -551 267 390 -263 38 444 -23 44 353 -143
2362a43L3L66m29k02Q92l34q48P20K88p06j31Q08Lp53M00Q2m92K24L60m03N06
$$ -143 -110 256 -173 -375 517 183 -665 55 343 -363 -494 314 317 -436 -36 46 -446 -222 138 -265 241
2383B41n2n98L90N77l61o03Q79J53j006L43P50o75l84P62n15j71R8K07j90J38
$$ 241 189 -409 -19 558 197 -406 473 626 -380 -37 713 38 -346 416 -99 -270 -172 35 -155 -17
2403a7J11m78K50M53o69p8J182p45q22J145J59j047M74O89o51j81M46j80j30K93
$$ -17 94 -384 -134 319 -350 -428 754 9 -813 332 491 -556 -82 607 -44 -225 221 41 -89 204
2423B04J2m66M83K4p54P21L57j091K2R69l31q75Q25K95r43J11O24m50MO29m09
$$ 204 216 -250 233 257 -497 224 581 -510 -488 481 150 -725 100 395 -548 -437 187 -263 -259 370 -39
2444c9q5M38m02l00P90Q7q15K65O25o87m89J087P3r65M16L30m45J0M41l53j40
$$ -39 -124 314 -88 -388 402 489 -326 -61 564 -123 -612 475 548 -417 -1 329 -116 -106 335 -18 -158
2465a58J71l4k87N88k35o40O30N81r80j32J116m79n25O57M90j235M62P59p60j35
$$ -158 13 -21 -308 280 45 -595 35 616 -364 -496 620 141 -384 273 763 -472 -10 749 -11 -146
2485a46O32m13l79P93l78n86R91o4j244Q08O59j444J57J316n90j196J240K93j045
$$ -146 486 73 -306 487 109 -477 514 450 -794 14 673 -771 -614 702 112 -1084 156 449 -596
2504e96M56M54o82K54L91o85J85R61o26o69J127k28j034N73R22j049m9P55l28
$$ -596 -140 314 -368 -114 277 -408 -223 738 112 -557 570 342 -692 -119 803 -246 -295 460 132
2523A32n18M67J35m42K0K6r0L03K02m11j97N25l71l4M73M41j020k46J197k20p32
$$ 132 -386 81 216 -226 -206 -180 -270 33 235 -176 -373 152 -219 -253 220 661 -359 -605 592 372 -360
2544c60O00L62j090J92Q55l35n07M75l12m13R95j07j089Q45K38j080N71J338j445
$$ -360 240 602 -488 -296 559 224 -283 192 -120 -533 462 355 -734 111 349 -731 -160 1178 -267
2563b67o55J319r9p91O70K02j116M48P73q29M94O72j339L0J187l15p02P60J14
$$ -267 -922 397 298 -493 177 379 -737 -289 484 -345 149 821 -518 -488 699 384 -318 442 556
2582E56j292M80R04n59m86P03m27k41N19k1k06J19l09q5L29L62l34l63L07J40
$$ 556 -736 -256 648 89 -397 306 -121 -362 157 136 -70 49 -260 -345 -16 346 12 -351 -44 96
2602I6k72M12L46m97m79M81N27m40l45Q34p59n31J120np24L04r1l94N64M75j061
$$ 96 -176 236 582 85 -394 87 614 174 -171 663 -96 -627 493 488 -236 68 -23 -417 147 622 -439
2623d39J70O91r27j74J496m54j392J335J18r18N25P54q51l38O86l66n2Q92p58
$$ -439 -269 422 -505 -679 817 363 -1029 306 424 -494 31 785 -66 -404 282 -84 -136 756 -2
2642bm60R23n5r80P90M96j222j18J012j75m05L67j51l75K80J47j15P8k49l07N59
$$ -2 -462 461 406 -574 216 712 -510 -628 384 209 -196 171 20 -355 -75 72 -43 35 -214 -521 38
2663C8L09l08Lj9p1j50J07N61o5p45M3P65l40l87P20k29o71K54P84n44M7k7n52
$$ 38 347 39 42 23 -48 -198 -91 470 405 -340 -297 468 128 -259 461 232 -439 -185 599 55 102 75 -477
2686d77K49O12n64j86P74o54n24J126L16j039K24N30o30J7Q96m03l96K82j52l30
$$ -477 -228 384 -180 -366 408 -246 -770 356 672 -367 -143 387 -243 -226 670 267 -129 153 1 -329
2706c29P17j32o64N83J17o33L58O22p05l49N58J48n43P3K77k15o1O5K67l7j85
$$ -329 388 256 -408 175 292 -341 17 639 -66 -415 143 291 -252 -179 98 -117 -178 -113 154 117 -68
2727f8k17O3K92P5j82J52J19n15K16M65O2m53k53M82o0n36M38K39p25j06M95j8
$$ -68 -285 -222 70 145 -37 115 234 -281 -65 400 462 9 -244 238 178 -358 80 319 -406 -512 -17 -35
2749c5j2J86m70J29K91j65j67O48j81q57N92O50p28j85O68m09k91M82J93k86q0
$$ -35 -47 139 -331 -202 89 -76 -243 405 224 -633 -41 609 -119 -304 364 -45 -336 146 339 53 -27
2770b7O5k54L62K15q00L88L60n38m0N89k69n28L62J35j09o8K37J04j15j36J03
$$ -27 38 -216 146 361 -439 -51 309 -229 -269 320 51 -477 -115 20 -89 -157 80 184 69 -67 36
2791C6J67j51k70M4L69J9m16K83J00j81k53K90L88m66j80K80J03n06K88J77k98
$$ 36 203 52 -218 -174 195 214 -202 81 181 0 -253 37 425 -41 -221 59 162 -344 -56 121 -177
2812a77r2J04K36m5K5l57L74Q4k98nN12l88k69K00M43l73k18L88j42j12K05K7
$$ -177 -269 -165 71 26 51 -306 68 152 -146 -151 361 -27 -296 -96 347 -26 -244 144 2 -110 95 122
2834A22j5J59j60j71K41n5n13L11L49m19l66O43J2k51j22L40j52n6K70j36M9p9
$$ 122 107 266 106 -65 176 121 -392 -81 268 -151 -517 126 138 -113 -235 105 -47 -103 167 31 80 1
2856Am2K46rk00r3M64j85m39N3N44k58l95M41P8m22j3L70k55J04l7JQ9Rk13ML51
$$ 1 -41 205 196 -4 -97 367 182 -257 -204 340 82 -313 128 206 -216 -229 141 -114 -10 -47 -46 43 52 -161 -157 194
2882A94l19k17M33K23n49R0M00j52k34J18M33m42M2N8M0n5K38j82p4K82o37Q1
$$ 194 -125 -342 91 314 -235 -145 255 103 -131 -13 420 -22 20 78 118 63 301 119 45 327 -310 -229
2904b29N69o6n64L75K90n42j84N64L3n66K74L00k75r6J35k6M0J61j99k19N66k35
$$ -229 340 274 -290 85 375 -167 -351 213 246 -320 -46 254 -21 -117 18 -8 32 193 -6 -225 341 106
2926A06m74N32J72o46K12L24k17j64K25Nk12J59j44j8K54p6k51N8M56m06l5K94
$$ 106 -368 164 336 -310 -98 226 9 -155 70 75 -137 22 -122 -140 114 38 -213 -155 301 -105 -140 154
2948A54k86j09M75K13n71j32N37j15k23J88l2j11q7J48j88J82J05k84P7K49k19
$$ 154 -132 -241 234 447 -124 -256 281 166 -57 131 99 -12 -99 49 -139 43 148 -136 -59 190 -29
2969b9m31O27M8m59J83K28r0k02L15J20l89J97K2l59L05rr8J75O5l45J30K33k02
$$ -29 -460 167 215 -244 -61 167 77 -125 190 310 -79 118 140 -219 86 77 -21 154 219 -126 4 237 35
2992C5m31N00J91o89L16J22k03M0O6j5j0qj91L7M55k00k92L18K56l98J04N41n68
$$ 35 -396 104 295 -394 -78 44 -159 -119 -53 -68 -78 -86 -277 -240 215 15 -277 41 297 -101 3 544 -24
3015b4m7K25M0k77K10l0O4k68k05M40q2r0j70J43J75j81j51L59K1l51j2J72J58
$$ -24 -71 154 194 -83 127 97 161 -107 -312 128 46 -44 -214 -71 104 -77 -228 131 152 -199 -211 -39 119
3038A19j60j33K62j29j44L35Ol6k15J15P3R4l1l61K16J55k80q2N25k28n35M02
$$ 119 -41 -174 88 -41 -185 150 156 120 -95 20 93 187 156 -205 11 166 -114 -196 329 101 -434 -32
3060c2J69k10k9P8Rl73L71k9K11j88j93L6O24l46j99M91l52k79K74L30l43J60
$$ -32 137 -73 -102 -24 -15 -388 -17 -46 165 -23 -216 -180 444 98 -101 390 38 -241 33 363 20 180
3082A80l19j73L53J42k16J04N2n62M6P52p1o08K35O6l14M26J18j82o9j52N0K52
$$ 180 -139 -312 41 183 -33 71 123 -439 -393 359 288 -320 -85 -19 -333 93 211 29 -40 -192 -142 110
3104A10K97k89k49L37k41j13M55K50o02j61L62Kk1k10q5J0P5KL37q5m30OJ92L58
$$ 110 407 118 -131 206 -35 -148 307 557 -45 -206 156 158 137 -73 -158 -148 -73 -71 266 181 -249 -243 -51 307
3128C07k42l0n2Oj72j0M77J28r24L70L86j71j55M96k41m24K85J1j9O5K5m21L04
$$ 307 65 35 -17 -11 -183 -193 284 412 -512 -142 244 73 -82 414 173 -251 34 45 26 91 116 -305 -1
3151aJ95m35J8O49p82k02Q85N1p82M57j2l72J88L75k30j77L62k51j47N94m55k08
$$ -1 194 -241 -223 426 -356 -558 327 378 -404 53 41 -331 -143 232 2 -175 187 -64 -211 383 -72 -280
3173b80M60K2m40L10M32o08j76M21j20l09N50j23m49J67j22K75J50M1k73j70L68
$$ -280 180 202 -238 72 504 -104 -280 141 21 -288 262 139 -310 -143 -265 10 160 201 -72 -242 126
3194A26j30k0J44j9l73m7N12K69o75J72K86k89o6M17j06l95J73l6j0L04Kn63K73
$$ 126 -4 -24 120 101 -272 -319 193 462 -213 -41 245 -44 -110 307 201 -194 -21 -57 -67 237 239 -324 -51
3217e1Q4m43L57M90l65n70O81J15o25K26N27p74J45M54k65K68k5l46k02N32J17
$$ -51 33 -410 -53 437 72 -498 183 298 -327 -101 426 -348 -203 251 -14 254 229 -117 -319 213 330
3238C30n88N25Q1q06L06P33n00m11K61J69l26R0K46j76J8j52N9K15R3l26J42K47
$$ 330 -258 267 348 -458 -152 581 81 -330 -69 100 -226 -136 110 -66 -48 -200 -141 74 167 -159 -17 230
3260B30j93p8K75q9k14n4J91M48n04n3O1j24L5L17k98J56q3O0j70K84j76j26J11
$$ 230 37 -41 234 145 -69 -123 68 516 12 -41 20 -104 -69 248 -50 106 23 83 -87 197 21 -105 6
3283FJ93l46m9N22k34l30P6L03j97R2R7j77j66K89j33K78o5k23n6K12J7j77O5
$$ 6 199 -147 -196 326 92 -238 -162 141 -56 36 133 -44 -210 79 -54 224 159 -64 -120 92 109 -68 -3
3306cK38l42r6M84j33k17M9R0j66K1j49J69K33l03K16J55k29q2q9K71j16j49O7
$$ -3 235 -107 -203 281 148 -69 -20 70 -96 -75 -224 -55 178 -125 91 246 17 -65 -154 117 1 -148 -81
3329h1K34o1j37kK48K1k64J17L0k44Q3O2M2j01j96K05K15k64K9mR6n5j47K33N1
$$ -81 153 92 -45 -47 201 222 -42 75 105 -139 -56 6 48 -53 -249 -44 171 -93 -64 -68 28 -27 -174 59 110
3354A10n0r1R4J28l41Q6K35m1p8n9K59j48j74J72J34j84l18L37oJ8l01K08J3m5
$$ 110 60 -31 63 191 -150 -64 171 130 52 -7 252 104 -70 102 236 52 -266 71 65 83 -218 -10 3 -42
3378d2o2R0Q6l73J18K03J42j53q8J27j34L5K4J44j14J04L5k26K94k82q3K29J3
$$ -42 -104 -14 72 -301 -183 20 162 9 -79 48 -86 -51 -27 117 3 107 142 -84 210 -72 -155 74 87
3401H7p7j22M10k23k84K84j7j17j63K63m8N5l69K02k4J58o9l2J97p9j4m3L62l64
$$ 87 10 -112 298 75 -209 75 58 -59 -222 41 -7 48 -321 -119 -143 15 -54 -86 111 32 18 -25 337 -27
3425b7p3K17Qj63M5K13l19rJ67O4j25p4j42K32J52k74k6L09m4k25m9K11K9k50
$$ -27 -100 117 125 -38 7 220 -99 -108 59 123 -2 -76 -218 14 166 -108 -134 175 131 -94 -143 68 97 -153
3449a53K48K69n37O9L03k4k5r5m1j4Q4j34J27J03n2l37K02K02k56r8M23k47k04
$$ -153 95 364 -173 -104 199 175 150 55 14 0 84 -50 77 180 128 -209 -7 195 -61 -159 264 17 -187
3472a87K00R9k55Q9O5m1Q0j28N0O5J91l88J44L73k02m00K88K24k08k10M27j08
$$ -187 13 112 -143 -54 11 -30 50 -78 -28 37 228 -160 -16 357 155 -245 43 267 59 -151 276 168
3494A68k18J82k11J61k80K16j50K81r0l01J39J47j02r9M56k20l36J63L20l16K16
$$ 168 -50 132 -79 82 -198 18 -132 149 59 -242 -103 44 -58 -157 299 79 -257 -94 226 -90 126
3515A26J9j89K29j71m9O9K25k64q2J78J06l23L1M19l62j05J78K15m78J44K41j98
$$ 126 145 -44 185 14 -35 34 259 -5 -87 91 197 -126 -95 324 -38 -143 35 250 -228 -84 157 -41
3537d1j21K61P3k01L6j71J0L15J07o50M45R5l21J3N38l21l64K91J81l10J31K06
$$ -41 -162 99 172 -29 7 -164 -154 161 268 -382 63 158 -163 -150 388 67 -297 -6 175 -135 -4 202
3559B02l10NL02l26J20K86m36j63M52P7o46L78K23n10K09O61m33j26J14j33k20
$$ 202 -108 -103 199 -127 -7 279 -157 -320 132 209 -437 -59 164 -346 -137 524 91 -35 79 -54 -274
3580b74M66j15k99K38J56k24j4M56m74k78L92J95k74P4K03l87j82K57K83k34l0
$$ -274 192 77 -222 16 172 -52 -66 390 -84 -362 30 225 -49 25 228 -159 -341 -84 199 -35 -65
3601f5P6k71L51K5k56M4K53l55j54M99J21l63j02M33k16k66N83k89m96L04L06
$$ -65 11 -260 91 116 -140 -96 157 -198 -352 147 268 -95 -197 236 20 -246 337 48 -448 -144 162
3622A62l62K57K7m82M9O21l49m9M91n85l89Q16m8m77L00M29n80N2L78j01n10M94
$$ 162 -200 57 84 -398 -349 272 -77 -126 365 -220 -609 207 159 -318 -18 411 -169 -117 261 160 -350 144
3644A44j69l05O67M3m31Q9J28l93L2N32l00k29L54o0l13J03L55l51j81M16j99
$$ 144 -25 -330 337 380 -51 38 166 -227 -195 337 37 -192 162 102 -211 -108 247 -104 -285 131 -68
3665f8J07M2p9j97L05L3j37J34J34k52r8K63O8m02k3N20n08j62P04k10n16L66
$$ -68 39 81 2 -195 110 143 6 140 274 22 -76 187 255 -147 -170 350 -158 -320 384 174 -342 24
3687B4L4j81J25L44m24q1K96l03l7O64m05n58N15J79n10K77K91l88k06M46M9l49
$$ 24 58 -123 2 346 -78 -159 137 -166 -203 461 56 -502 13 192 -318 -41 250 -138 -344 102 151 -198
3709a98M63l4n16M36k4k99L70K54q35j18P33j12n50M18J32m63K97K84k14k59L59
$$ -198 265 231 -285 151 127 -172 198 452 -383 -501 232 120 -430 -12 120 -343 -46 238 24 -235 124
3730A24j17Q7J36k27k04J70K40j86L0L34m04j19J22P9k52K74R7k54k08N10p6k28
$$ 124 7 94 230 3 -201 -31 209 23 53 387 -17 -136 -14 65 -187 87 184 -70 -278 232 156 -72
3752g2O1j8k55J05J25N9j1K0k84R3L18Q3l47J46J74m67J18M15k25n5m0J97k35
$$ -72 -11 -29 -284 -179 -54 5 -6 14 -270 -177 141 224 -123 23 197 -270 -152 263 38 -17 -57 140 -95
3775i5K38J1k10J27J19k80L19L5m92j30M76M2l65N9M35m90O9K25l8p4L7K1o0J51
$$ -95 143 154 -56 71 190 -90 229 264 -228 -358 118 160 -205 -146 289 -201 -132 93 55 -19 18 39 -21 130
3799A30j07n9J28j7j99mL19r4j55Q7j8N4j9J14k11M9j91J04Q6n9K1Rr5J63m2q8
$$ 130 23 -36 92 75 -124 -128 191 97 -58 29 11 65 46 160 -51 -2 -193 -89 -3 -62 -41 -32 -127 36 -6 -94
3825i4L30k77J15J44j98L8n3K66k52j88J98O3l4j40J74l5k85K59r0K09j41j22
$$ -94 236 -41 74 218 20 58 5 271 19 -169 29 92 58 -82 92 57 -228 31 -59 150 9 -113
3847a13J07P3j57K1Q9j2j42j14L02L0j66N7L8O5j04r2L74J1j30k21L03j44k24
$$ -113 -6 67 -90 -69 20 8 -134 -248 54 84 -82 -25 13 78 -26 -118 256 267 137 -84 219 75 -149
3870a49j8L15Lk12N2K17k13j94J52K6j49K%K3K48k06n2K27Q5l82J82O7N5j73J58
$$ -149 -167 148 151 -61 -9 208 -5 -199 -47 -21 -170 -168 -168 -145 103 -103 -155 72 157 -225 -43 24 79 -94 64
3895F4R1k27J08Q4j02k1PM5r0j27K81Mk33j14K37j07o7m6J71J54m9j62J08J15
$$ 64 155 -72 36 120 18 -3 4 49 -41 -168 113 117 -116 -230 7 -100 -167 -213 -42 112 63 -99 9 124
3919A24j50j91K22Qm7oK7J58l4l09J68J07m4O1o0J6j42j3J35O8k51J22R0k75J49
$$ 124 -26 -217 5 13 -34 -40 -13 145 111 -198 -30 77 33 94 34 50 -92 -105 30 98 -153 -31 59 -216 -67
3944f7N0oM3r4J66l1j50O4mJ45Q7k63J52R0j42p8J51M7k07j75J40J47j78J59r0
$$ -67 -17 -23 20 -74 92 61 -89 -25 -29 116 203 -60 92 182 40 -38 113 160 -47 -222 -82 65 -113 46 -44
3969d4K52k09M3l1n3L1k20J89J12n0r2K6O7j95R1K59j04j2qp0L7P0k2l9J37k08
$$ -44 208 -1 42 11 -42 -11 -231 -42 70 20 -72 -46 21 -174 -83 176 72 60 52 -18 19 89 67 28 165 -43
3995d3l4J01J27j62o0L3J11k00J89M2k82J04K17q5l35J87J01j01J37kL5rr6o3
$$ -43 -77 24 151 -11 -71 -38 73 -127 62 104 -178 -74 143 58 -277 -90 11 -90 47 45 80 71 -25 -88
4019h8l7J54K3j01P2N6np7L13l73q5J56J09k12j9K90l96J39J90j15J7J80k13j50
$$ -88 -125 29 52 -49 23 79 74 -3 310 -63 -148 8 117 -95 -114 176 -220 -81 109 -6 11 191 -22 -172
4043a72L16Pj86J93J56l89j6K23q0l41K51O0n8J24J17j90M9n5q6J95O8k19j9J52
$$ -172 144 151 -35 158 314 -75 -91 132 52 -289 -38 22 -36 88 205 15 64 9 -77 118 186 -33 -52 100
4067A00k12K5m8L17l26j0K53K4j43J12k9k97K14l1Q7K06k99mJ8J40n5k76K93n3
$$ 100 -112 -87 -135 182 -144 -154 99 123 -20 92 63 -234 -20 -51 36 242 -57 -61 -43 97 42 -234 59 6
4091Fl5j00L25j80k22J86K11l16J75O9o1j13j0N7j1K04k39j51L32R2k08P0J74
$$ 6 -29 -129 196 16 -206 -20 191 -125 50 119 58 -55 -65 -8 -19 185 -54 -205 127 219 11 81 255
4114B55k72j41M27j75k06K07lk26J26p5o7J99j87k23J04M66k41j39J34J55k51
$$ 255 -17 -158 269 94 -112 95 92 -134 -8 -83 -150 49 -138 -361 -257 209 -32 -171 -37 118 -133
4135a33pK69l56J75J02m1l8J54j06j44j3J29L9j2R7r2k2J14k3j36J60p9j17j35
$$ -133 -140 129 -227 -52 50 9 -29 125 19 -125 -138 -9 30 18 115 23 1 115 92 -44 116 37 -80 -215
4159b15L02n3j29n8J36L1j42J12J2j00P5p8l5K11j17j94K33L4r0K8K19r1l12K65
$$ -215 87 34 -95 -153 -17 14 -128 -16 -4 -104 -29 -107 -142 69 -48 -242 -9 25 -65 -37 182 91 -221 44
4183D4J47r8j14J2p0K2L26k93p2J58k39R4K35k26j7R9l7j14o8K54j51k5J65j34
$$ 44 191 93 -21 -9 -79 -57 269 -24 -96 62 -177 -83 152 -74 -91 8 -29 -143 -211 43 -108 -133 32 -102
4207a02J92l8j23R0J33l27Q0N02m65j36J84q8J16r5R0l0oo8L6Q1K3j71K8J40O1
$$ -102 90 52 -71 19 152 -175 -95 407 -58 -194 -10 -98 18 -77 13 -17 -23 -91 -55 26 49 -122 -94 46 107
4232A07k35K18J1j96k5O8K06O0j32p8j27M0R7RJ11k34k8O2J47j98P0Q4m7q1J65
$$ 107 -128 90 101 -95 -120 -52 154 214 82 4 -123 -83 14 23 134 -100 -128 -66 81 -117 -47 37 -10 -91 74
4257G4J06k38O7q4K00q7r6J91k12m9J33J91j31N8j16j17K07M8k21L3R9k48m1L14
$$ 74 180 -58 9 -75 125 38 -58 133 -79 -128 5 196 65 123 7 -110 97 145 -76 -43 56 -192 -233 81
4281H1M2k17L2J17j33N8n5l3k6J40l17L38J22j67j31J53Q3l23L63q1m5m6J02j84
$$ 81 123 -94 -62 55 -78 -20 -75 -108 -134 6 -311 27 149 -18 -149 4 87 -236 127 46 1 -45 57 -127
4305a27K16K6j13O9J1j79P1J85j6k94J04N2N6j98J56N8k34P3J99j23j33J74j56
$$ -127 89 115 2 71 82 -97 -26 159 143 -151 -47 5 61 -137 19 77 -157 -84 115 -8 -141 33 -123
4328a23J50N4m9J5m1k9r8J55j6r6o5L46k10m3J46k35J09j36K02p2P3j45M3K3L
$$ -123 27 81 32 47 6 -23 -121 34 18 -78 -143 203 -7 -50 96 -139 -30 -166 36 -36 37 -108 -65 -42 -39
4353c9J41j12p9P0k23K13J61j27r5J18K9j2j72L50j65j92L42k05%o6k0L3J58j72
$$ -39 102 -10 -89 -19 -242 -29 132 5 -90 28 57 45 -127 223 58 -134 208 3 3 -63 -83 -50 108 -64
4377f4j2J27j39N8o1N6o0M5M0p6O9R0M3j94J01J25j9r0Rk03K04J17o1k16R0J40
$$ -64 -76 51 -88 -30 -91 -35 -95 -50 -10 -86 -17 73 116 -78 23 148 129 39 48 -155 49 166 105 -111 -21 119
4403A19j04J9J07qj45J13j44l4j79J78J13J4O0l17L06j45r4K27Km6j50N9J63R8
$$ 119 15 34 141 133 -12 101 -43 -77 -256 -78 35 49 109 -208 98 -47 -141 86 88 42 -108 -49 114 212
4427B12l93L75J03l62J19J42j74R2L7l41K83j43q2J92l4j46M5R3j7j31J17P3l9
$$ 212 -181 194 297 -65 54 196 22 114 151 -190 93 -50 -132 60 26 -120 -75 18 1 -130 -13 60 21
4450B1j20N2K25r9q0j02K28p0r8j7K32j48K7m3q9N0J97k56J29k15J32M9P2o4p8
$$ 21 -99 -47 178 79 -1 -103 125 55 -43 -60 172 24 51 8 -81 -31 166 -90 39 -176 -44 5 77 13 -65
4475f5j0RJ85l4j45P8m3q6K19j93O5L4n1p2O1J62p6K6o3Q8oj46O4k8j3J18l7m
$$ -65 -75 -66 119 85 -60 18 -25 -111 108 -85 -20 14 -37 -109 -48 114 38 64 1 89 83 -63 1 -27 -40 78 41 37
4503C7j5O8k55P8K45j88n8J78o5pj54K49L8q9J4j17J55j80p9N6L6j6m0J68J83
$$ 37 22 90 -165 -87 158 -30 -88 90 25 18 -136 113 151 62 76 -41 114 -66 -145 -89 -53 -69 -109 59 242
4528B42k23qK17j42k22J82pnn4j7J56k17J18P0p9j0mk0j6j20J22N5J36k20Q9J65
$$ 242 19 11 228 86 -136 46 39 34 -20 -37 119 -98 20 90 11 1 -3 -23 -39 -159 -37 18 154 -66 23 188
4554A88l1l03K24J07j66j87J76J40j12q6P9j2k5M0l0J7j27J70j81J4O6o2N6K15
$$ 188 157 -146 78 185 19 -168 8 148 36 -50 29 17 -8 32 2 19 -108 62 -119 -105 -39 -101 -45 170
4578A70k66l2K37k22J8J62o1o6K1NJ66N8j59r5J33K20l04jr5j7J55q5R6N3o2k23
$$ 170 -96 -128 109 -113 -95 67 6 -60 -39 -34 132 190 31 -64 69 289 -15 -16 -111 -128 27 -58 38 91 29 -194
4604a94K04j0O0j34K4j49K34j58K52p8J0o9JQ5o5M7o2j09N1LK08j80j82L49k02
$$ -194 10 0 60 -74 -50 -199 35 -123 129 51 61 -8 -7 78 13 60 -2 -111 -60 -57 151 -29 -211 138 -64
4629f4l1N0P0o1L3qj82L24p8j29M3K06k17j08K04k1l5P8k2j06J1L4k1J7l9KP0
$$ -64 -95 -45 25 -36 -3 -11 -193 131 53 -76 -33 173 -44 -152 52 31 -4 74 52 -54 -43 -9 -30 -13 -52 -50 20
4656B0p6L1j3K10K9k04J42j54k5j58K78M6k73K08R4k05J28J29j51j1K6Kj25K16
$$ 20 -56 -25 -38 172 201 -3 139 -15 -40 -198 80 126 -147 61 155 -50 78 207 56 45 71 73 -52 164
4680A64k49M9J69rp3O8oj50K1J50n4k05N1J44j41J57j61J79j29OLk20K84O0k37
$$ 164 -85 -36 133 124 51 119 113 -37 -16 134 80 -125 -74 70 -71 86 -75 104 -25 -19 -16 -236 48 108 -129
4705a29J33J85k63J09J74j42m1k0J11p7p8J58j15o5K17j56j32L82m48K65q2K3
$$ -129 4 189 -74 35 209 67 26 6 117 40 -38 120 5 -60 157 1 -131 251 -197 68 -14 9
4727IO3k21K95j80p7L46Ol65N9Q2n3j08J59P4J14j92r1J58K8M2l40J30J17j49
$$ 9 72 -149 146 -34 -111 235 241 -124 -65 17 -36 -144 15 89 203 11 -80 78 106 148 -192 -62 55 -94
4751i4j3K75q8k61R2L09k72M8J37j54J9Q0j04J18j15J23k39J91L02k27k35J32
$$ -94 -107 168 80 -181 -89 220 -52 -4 133 -21 -2 78 -26 92 -23 100 -139 52 354 127 -108 24
4773B4M2j88J70q6q4rK66k15P8R1j96J31O2k7j36K85j90j42J26Q9r7j26J65j80
$$ 24 66 -122 48 -38 -122 -131 135 -80 -2 89 -107 24 86 59 -77 208 18 -124 2 91 -6 -132 33 -147
4797a47L7oJ38j55J68O3k44K39j5Jr8O0R7j72J2J02m2J0O5k4j82K42n7j8j56K16
$$ -147 -110 -116 22 -133 35 98 -146 93 78 79 -19 41 138 -34 -22 80 38 48 113 89 -93 149 92 74 -82 134
4823A34j28p6K14k65j31J41J25j15Q5n9L5K04q6k28J41M8J21j89J67J48l18J17
$$ 134 6 -70 144 -121 -252 -111 14 -101 -16 -75 -40 164 78 -150 -9 39 160 -29 138 286 -32 85
4845H5R7k32MJ5N4m6l6R6k15L95j72j18jJ99o4p1P2Mr8q1K76k01R4j28R3M0p3
$$ 85 182 -50 -46 -31 23 -23 -59 37 -178 217 45 -73 -74 125 61 -10 62 66 -32 -113 163 -38 56 -72 21 61 -12
4872a2j7j9R5l02K95O4r6j37R6Q2M7j77K09O8k19q8J66j27Q9O0k20J7J33J7L5
$$ -12 -29 -48 47 -255 40 104 8 -129 -33 49 96 -81 128 196 -23 -111 55 -72 17 77 -143 -126 7 24 59
4897E9l9O4j63J1R1q3J01J00k19K04j31Q1j25oQm5O7O6j8M1q4J0K6J22j97r9J73
$$ 59 20 84 -79 -68 23 -60 41 141 -78 126 -5 76 -49 -55 -47 -92 -25 41 23 64 -20 -10 16 138 -59 -158 15
4924A5M2j50K7K46Oj06P7k5j58K52k64Q6K2P0j13j57N7K8J4K8Ok17K33o8Lp1K2
$$ 15 57 -93 -66 180 186 80 157 132 -26 226 -38 48 70 140 27 -130 -73 -45 -31 -3 3 -214 19 -49 -46 -117 -95
4951i5J21j74K80j58l7J13j94L32k93J31j33M8Q2j09k34K84P4j22J18q9J62j83
$$ -95 26 -148 132 -26 -63 50 -144 188 -105 26 -107 -59 23 -86 -320 -36 38 -84 34 -55 107 -76
4973g6jK69l26K04q5n6P9J02j62K1Q9j19k2M3J11k09J32Jj7j28J44k4J00R8j62
$$ -76 -77 192 -134 70 -15 -71 8 110 -52 -31 58 -61 -83 -40 71 -138 -6 -5 -22 -150 -6 -30 70 168 6
4998FqK10j00p2P0j09j48P1J91j1j39J59p2n5j78J43L4P8m7N5l9m4o3N5j4K6o1
$$ 6 -2 208 108 36 106 -3 -151 -80 111 100 -39 120 48 -7 -185 -42 -8 70 23 78 39 -5 -68 -13 -27 -1 -62
5025f2J25J22l14J70o9N9j19J49Jj43m4J07P6o0N0M1r7J56m7Lj7k75K23r5n6J63
$$ -62 63 185 -129 41 -28 31 -88 61 62 -81 -125 -18 58 -2 48 89 -8 148 101 104 87 -188 35 -60 -116 47
5051D7k9R8l7k7j38J02K3o5O2NP4j53O0p3J52n3r1Q3J1q1Lj31J64pk66L63l2P3
$$ 47 18 116 79 52 -86 16 39 -26 36 41 115 -38 22 -51 101 48 -43 40 51 -30 -27 -158 6 -1 -267 96 64 137
5079A37q4l1J5m1MJ98k70R4k5K7q9MQ2r7J73l0j61K22j79l0K8J96k04p8K97j53
$$ 137 53 22 37 -4 0 198 -72 22 -3 24 -65 -61 21 -76 97 67 -94 128 -51 -81 -53 143 -61 -139 158 5
5105EoJ14lj29N7p9pJ01J30k56J35j89k0J44J06r2k00R5J67q3NO3N5k03R5R3q8
$$ 5 -1 113 110 -19 38 -41 -48 53 183 -73 62 -127 -147 -3 103 11 -189 -94 73 -10 -5 58 113 -90 5 98 10
5132A0q8M5o8K55k18j11N9M8J32j91K14J5k19J29J8j89J40L1QKL3j02q0J93M0
$$ 10 -78 -33 -101 154 -64 -175 -116 -68 64 -127 87 102 -117 12 30 -159 -19 12 20 22 55 -47 -127 66 106
5157A06j49Q9Mn8M9j63Q1qq7K07j04R6L2j5j05R5P0l47K46K8l6j53J25M2n6J58
$$ 106 -43 46 50 -8 41 -122 -41 -49 -136 71 -33 63 95 80 -25 70 140 -207 39 67 31 -122 3 45 -11 147
5183A47j63j1k3L13k10j04K63l15JL40j05j37P8j99k2Q1J90j30N3j46N5p2J31
$$ 147 -16 -27 -50 263 53 -51 212 -103 -102 238 133 -4 74 -125 -147 -66 124 -6 47 -99 -44 -116 15
5206A5j69O2N3k3J0N7J43j92K2N2Q1k10n6K19j12J96O0l46J40J17k35lK48j2j84
$$ 15 -154 -92 -39 -62 -52 5 148 -44 -22 30 111 -99 -155 64 -48 148 208 -138 2 119 -116 -119 129 117 -67
5231f7K5J29r1p9J16J22j29o9jN7m4J51j44J16q2j4K00j27j20l1M9j12k8O6L2
$$ -67 -42 87 -4 -83 33 155 26 -43 -44 13 -31 120 -24 92 10 -4 196 69 -51 -82 -33 -145 -173 -107 -75
5256g5o7R1J27j62M5M5m1m0M3r2N9J41j3j83N4L3K11r1k1p1j19J18K0q1qJ58o3
$$ -75 -142 -51 76 -86 -41 4 -37 -77 -34 -126 -67 74 61 -122 -68 -35 176 85 64 -7 -126 -8 12 -69 -77 81 18
5283A8K9m1j14J49j9o8o6J70K2j05Q4j61K5R6R0j11Q1r5J24j15k4O3J3L8l4r3
$$ 18 47 6 -108 41 22 -46 -112 58 80 -25 59 -102 -77 19 109 -2 79 -16 108 -7 -31 32 45 83 49 -44
5309d4O1J03l6k18K40M1r5P9p1j01m4Q8N5q6J19l5m1J55j53M2j02J80k62K19j35
$$ -44 17 120 84 -134 106 147 52 131 60 -41 -85 3 58 -28 91 56 15 170 17 59 -43 137 -125 94 -41
5334d1l5J25J85j48J10k73k8J40o2Lo4J35L2j24O1r3K66p0j31J34j30O7j23J47
$$ -41 -76 49 234 86 196 -77 -105 35 -27 -24 -88 47 79 -45 16 -77 189 119 -12 122 -8 59 -64 83
5358H3j84O4J77j69j1L6R1q3qp3J9J42m8m8O5o1j03p1J45J32j99j4P0N1P5j57
$$ 83 -101 -37 140 -29 -40 -4 87 4 -4 -77 -58 84 36 -12 53 -8 -111 -182 -37 95 -104 -118 -48 3 78 -79
5384g9M5m2l7KP0j2j9Q1p2M1n6J64l6j40rK87q1j88P2J50p7j51J29o8l2R8l1o9
$$ -79 -34 -76 -113 -111 -41 -53 -72 9 -63 -22 -78 86 50 -90 -99 188 107 -81 -9 141 64 -87 42 -26 -58 40 9 -60
5412f0K28j34r9N2J91k51j12J29J13l2oJ10k05P9J23j13L1J70m16J75J21k13J26
$$ -60 168 34 -65 -13 178 -73 -185 -56 57 25 19 129 -76 3 126 13 44 214 -202 -27 94 -119 7
5435Gq4M2NM4J01j38L5l0Mp2k7K87k63p5L12j37k8Ll2n7L3J30j03K8M9p2qJ41
$$ 7 -77 -35 -30 14 115 -23 12 -18 -14 -86 -113 174 -89 -164 148 11 -17 -14 -46 -103 -70 60 -43 -15 34 -38 -46 95
5463I5j23n9M8J16j13P9K6J0pO8m8P6q1K1j29LK9k25K51N3o5j06J55r2l0n%J14
$$ 95 -28 -87 -39 77 -36 43 69 79 72 140 92 168 87 108 -21 -18 11 -214 37 90 25 -81 74 -18 -48 -53 -53 61
5491F1q5N4j02L8J2J8R7j06n2p5K15j91J47L4L9j34p2K87k12m7J39Kp7J55r8k1
$$ 61 -24 30 -72 -34 -22 -4 93 -13 -65 -140 75 -116 31 65 104 -30 -102 185 -27 -74 65 67 -10 145 47 26
5517B6j21K31k52J89M6l4q9K6l9j3Q1J30l40J64R6j28j78K32j11R0K7j62R8O4
$$ 26 -95 136 -116 73 119 85 -4 22 -17 -30 51 181 -159 5 101 -27 -205 27 -84 6 33 -129 -31 33
5541C3J17k33K02j86k2K3P8l0M5PM6Lj04L8n6P0N2j7p2nO3k96K74jN1j55L31k02
$$ 33 150 -83 119 -67 -89 -66 12 -18 27 34 80 83 -21 17 -39 31 83 66 -6 -11 52 -244 30 29 80 -75 256 54
5569E4j33kJ44k95J75oL6K3q8pl0J16J0J1j37K31n4j10Q1Q4j67M7R7M4j66J03
$$ 54 -79 -81 63 -232 -57 -63 -27 -4 -92 -99 -129 -13 -3 8 -129 102 48 -62 19 103 -64 -17 80 124 -42 61
5595F1N0nm1jk4j38J41R0j67J53j33O7q2L8p3n3L0J08j6r0K9o8K90j75j7r7J04
$$ 61 111 106 65 64 40 -98 43 133 -34 119 -14 53 -29 9 -64 -117 -87 21 5 -85 -56 -124 166 -9 -26 -123 -19
5622a9K0po9J58o9P4j11J75j70J03p1N1j91K8l3J48K3j64J24N8j5o0L2k3j5o1
$$ -19 1 -6 -75 83 14 88 -23 152 -18 85 14 65 -126 -98 -131 17 40 -124 0 58 43 -17 15 -8 -23 -84
5648h4N7J67k41Q5qM9j53J87j4m5R7j28o3O8J25j67o7jL01k40M4J4L6J02j53q
$$ -84 -27 140 -101 -16 -24 25 -128 59 45 0 97 -31 -94 -26 99 -68 -135 -136 165 -75 -31 -17 19 121 -32 -40
5674d0J14n6LO1j99K2O5R7O6k10K19J2k10m4K73k07n3M7K18j03j44J71j24r8J5
$$ -40 74 18 21 82 -117 -95 -30 67 133 -77 142 154 -56 -100 173 -34 -87 -40 178 75 -69 102 -22 -120 -105
5699a05M1J01j07QJ08o1M3M8j5q2k8K28Pj25K5j87N7j66K09j16N8J85k7j44K8
$$ -105 -64 37 -70 -62 46 -15 28 76 61 -21 -49 179 186 61 86 -101 -44 -210 -1 -117 -59 126 99 -45 -17
5724a7L1N2j19k3R0l0l9P3K5j05R6mj3Q0j27J46p7n5Q0j20Q0r2J37K8j00R5k7
$$ -17 14 66 -53 -76 14 -16 -55 18 43 -62 34 30 17 97 -30 116 39 -16 64 -56 24 -68 69 97 -3 92 65
5751F5l0Rj38MJ2J1k8J86j20J9m4OJ0J02p2l4j03J96k8P8p4r7J86j78P0j14M1
$$ 65 35 44 -94 -90 -78 -67 -95 91 -29 -10 -54 -48 -38 64 -8 -42 -145 51 23 101 27 -70 116 -62 8 -106 -65
5778f5j19J75m2O0l1oJ14j56K5J91k02M2p6k3l4O8Q0j36RJ81j6l6q1K03k43J82
$$ -65 -184 -9 -51 9 -22 -28 86 -70 -45 146 -56 -14 -90 -113 -147 -79 1 -135 -126 55 39 3 -78 125 -118 64
5804F4m7k4L2j1K9j1O3p6q7R0l5J7J40j62n3J36M7J4j15m8n7J35J9P4q8K2j10
$$ 64 17 -7 25 14 43 32 95 19 -68 22 -13 4 144 -18 -71 65 112 126 11 -37 -94 41 60 134 46 68 -42
5831d2l0K2L6P2N8j41L4R7j74K1P8n3J75N0j06l1O2l8NK5j47J4n9r3L30k51J07
$$ -42 -72 -50 -14 58 116 -25 9 106 -68 -47 31 -22 153 203 97 66 128 90 95 120 -27 -13 -72 -165 165 -86 21
5858B1n6m9J86j44Rp4K13j87J41o5P5j63MJ42o4M6N9Lq4K7N8r2L4j30LO6P3L2
$$ 21 -35 -84 102 -42 -33 -107 106 -81 60 -5 70 -93 -89 53 -11 35 94 97 13 40 98 6 40 -90 -87 -21 52 84
5886H4j90J92K4l3j62J26J53k40NK9K9n7J08r1Pl2J05n3pj00J00l6PL5l6Q5j50
$$ 84 -106 86 110 77 -85 41 194 -46 -41 -12 17 -40 68 -23 -16 -48 57 4 -3 -103 -3 -39 -32 3 -33 52 -98
5913i8o6J10QJ77j8p7j07R5k0o4R2N5o7K7J06mO2k09q6K5m4J66l3j44N8R3%J13
$$ -98 -164 -54 -46 131 113 36 -71 24 4 -60 32 87 20 47 153 149 211 2 -84 -59 -103 63 30 -114 -56 37 37 150
5941A50k04m4J20J15j52N7J00l6j21N3R6r8O3j77O4Q4L7n4j91R0R1m4J2J6Q5j09
$$ 150 -54 -98 22 137 -15 42 142 106 -15 38 134 36 99 -78 -14 70 107 53 -138 -48 43 -1 11 27 112 3
5967CN4n0J19j11m7j03K01K8n0p0K06l81J43J57k47P8J38J45j46n2n3n4P5j23
$$ 3 57 7 126 15 -32 -135 66 94 44 -26 180 -201 -58 99 -148 -70 68 213 67 15 -38 -92 -17 -140
5991a40p1K58q9J34j83J76l1j0jJ0j51R1J37j65j1R5p3j19J67l0R4q2k6Q7j38
$$ -140 -211 47 -42 92 -91 85 54 44 43 53 -98 -7 130 -35 -46 49 -24 -143 24 -6 88 6 -20 67 -71
6016g1L2K2L5m0J33j12j75K72j55n4J80n6j34l0J05O5J0Q1j05P6k26P3k7K38p0
$$ -71 -39 -17 18 -22 111 -1 -176 96 -59 -113 67 11 -123 -153 -48 17 27 108 3 79 -147 -74 -101 137 67
6041F7k18L3J18nr0K69J3l15K36j40J67j30j77J78J11j36m6J19rj19OJ23k6j47
$$ 67 -151 -118 0 -5 -95 174 187 -128 108 -32 135 5 -172 6 117 -19 -65 54 45 -74 -68 55 29 -118
6065a18J63rk32J35R9L8o3l0oR8j36J6J62qo3j40J15m3N0K9r8J5q1m4P8K69j56
$$ -118 45 36 -196 -61 38 76 13 -17 -23 75 -61 -45 117 109 46 -94 21 -22 28 57 -41 -26 -107 -151 -73 196 40
6092D0p0P9N0m9n4n7J20K9o7k5l5q9P1J59m9o2J8k6L6k5r1J52k2J26k01k6l1K51
$$ 40 -30 49 99 50 -4 -61 59 88 21 -4 -39 -128 -57 102 53 -9 9 -17 19 -6 -97 55 33 159 -42 -68 -99 152
6120A52k81jN3O4J09l2K11l21J32J9j99P0L6j53l6K34o2Np4N7ok0N0j14M1J01
$$ 152 -129 -130 -77 -13 96 64 275 -46 86 105 -94 -24 12 -141 -177 57 -5 0 -74 -17 -23 -43 7 -107 -66 35
6146C5j31O0L3J08n3j41J61m8p0n6Q3k8m9K13m1l0k90J98J9j16J60p7J72q0Lo2
$$ 35 -96 -36 -3 105 52 -89 72 24 -46 -102 -19 -47 -96 117 76 46 -244 -46 -27 -143 17 -60 112 32 35 -27
6172b7J50p5j01L4k2N5M3m6n6o2K5K20j85m1JJ33P6q3J23k85J9M1J05j21J4J49
$$ -27 123 48 -53 -19 -41 14 57 11 -45 -107 -82 138 -47 -88 -87 46 122 39 162 -123 -104 -63 42 -79 -65 84
6198H4p4l9OQ5O2j43J33j50J21M3k59JJ40k3j51J43j27M2M8R9Pj73J07J00J09
$$ 84 10 -29 -23 62 124 -19 114 -36 85 128 -131 -130 10 -13 -164 -21 -148 -106 -58 41 48 -125 -18 82 191
6223A91k23J37r8j01K18Pqj9j94J10kJ05r6K9Kr1R8j83J45p7J5J69k74J66o9r4
$$ 191 -32 105 7 -94 124 131 123 104 -90 20 18 123 27 56 58 -33 65 -118 27 -50 -35 134 -140 26 -43 -137
6249a37L03j68L4n7p2J9J48r5Lj0j24P8R4J2k3R0P7q2j99K01j20R3L1j20J45j29
$$ -137 166 -2 32 -25 -97 -78 70 -25 -22 -32 -156 -78 16 28 5 95 172 90 -109 92 -28 65 96 -24 121 -8
6275hj20K54l9pj44J58j17m5n6R6J28k54J89L9%j6jM6j78K73j63J8R1r8j19K61
$$ -8 -128 126 87 80 -64 94 -23 -68 -124 -28 100 -154 35 74 74 58 57 103 -75 198 35 53 144 46 -73 188
6301A88k26p2k4J53O7r3m7L0j18K34n0M0m7Rj4M9j44p2J27K9kn9N7J03j94J50
$$ 188 -38 -110 -134 19 86 -7 -54 -24 -142 92 42 82 35 44 30 79 -65 -137 -10 19 17 -42 15 118 -76 74
6327G4j96K08k25O5J13j71J88p7pO6P7n1l4j5oN2o7kJ03q0p6K15j05P9k8j72p7
$$ 74 -122 86 -139 -74 39 -132 56 -21 -28 38 115 64 30 15 9 61 -6 -8 95 15 -61 154 49 128 100 -72 -149
6354a49J03J80j85o2J09mn7N3J30o7j24J44j19K61k63M9M5p8k0K01j07J6kQ8l57
$$ -149 -46 134 -51 -113 -4 -8 -65 -12 118 51 -73 71 -48 213 -50 -1 44 -34 -54 147 40 56 54 142 -215
6379b15K29N8J1l1J02k40Q4j7K45n3j33O4j32J82j59K5j47K17p3O2o5mj2j1K28
$$ -215 14 72 83 52 154 -86 -2 -19 226 173 40 104 -28 154 -5 20 -127 90 17 79 14 10 -2 -13 215
6404B15k91LP1Nj66N3j7l3K0J36LM4J08j22Nr1K5j05J22r2J17n9P2NO9oj33O3
$$ 215 -76 -73 -2 3 -163 -110 -127 -160 -140 -4 -1 43 151 29 34 -57 -32 -137 -15 -107 10 -49 23 28 97 91 -42 21
6432B1j01k5J74l0M0k62J47O9O0j28R6o7K61k96Ml5P3q1J06l8L3J92k53j66J99
$$ 21 -80 -105 69 39 79 -183 -36 33 93 -35 61 -6 255 -41 -37 -72 1 -80 26 -12 21 213 -40 -206 -7
6457gl1j31J36R4j43J3P7n0K03j19q3L5R0j06K7o8J05J19p0j04K2R1j95J53k7
$$ -7 -38 -169 -33 61 -82 -69 8 -42 161 42 -41 -6 84 -22 5 -63 42 161 91 -13 9 100 -95 58 31
6482C1J01k38M3J4L6j7q7j6N1J15J9o0p3J16j27J84o5L3j64J60r0J42j6q3lj9
$$ 31 132 -106 -63 -49 -13 -30 -117 -133 -82 33 52 -8 -81 35 -92 92 27 60 -104 56 -34 108 92 9 6 -13
6508a3R8j02L3p1O3j8R6q4jJ1j2M7P6j76L6J24L3l01Q5J30l5m7j1ojJ05Jj7j23
$$ -13 85 -17 16 -55 8 -10 86 2 1 12 0 47 123 -53 -17 107 140 -161 -76 54 19 -28 -39 -45 -46 59 60 43 -80
6537h0L9J20j09R7r3J06L1j33j45K30j07M2L1j28k3k6L11k00R0j95L10k45N5L8
$$ -80 -41 79 -30 67 -26 80 111 -22 -167 63 -44 -2 29 -99 -122 -148 163 -37 53 -142 168 -77 -22 16
6561A6Q2L4j73R2N3o0o5j37J25n6N5k6lJ99l2j25N5J20r7K5J7j52J05lk2r2L8
$$ 16 98 132 -41 51 104 44 -21 -158 -33 -89 -34 -60 -63 136 104 -21 34 154 57 82 99 -53 52 49 27 -65 -27
6588b7q5J04J58j75J32J9j42JM4R5lj11j3j4NJ67j19R8j60R4j11J12N5j82nK48
$$ -27 -112 -8 150 -25 107 126 -16 -15 29 124 121 10 -3 -17 -12 155 36 134 -26 68 -43 69 124 -58 -63 185
6614A85j47j07N8k4k4lL5j25R3rN2O5k9R2j06o7P4J76j23j32J07oj8l0O6k4j64
$$ 185 38 -69 -11 -35 -59 -62 -27 -152 -59 -68 -16 49 20 112 6 -61 13 189 66 -66 41 35 17 -13 53 29 -135
6641a35J02R4N1n6n3j47J81r3J03o0M9p2R8j36J15K4j46N8J2n1R4om0j4J05j62
$$ -135 -33 61 112 56 3 -144 37 -56 47 -13 36 -36 62 -74 41 65 -81 -23 -11 -62 32 26 -14 -28 77 -85
6667h5P1Q7q4K9Mm7L0j50J41r2K67j9m1l9L1j23m1J68n6L2k42J04K0K7O1o3L1
$$ -85 -14 73 -11 18 22 -25 5 -145 -4 -96 171 152 111 72 103 -20 -61 107 51 83 -159 -55 -35 -8 53 -10 21
6694B1p6J50j29MJ12j77R3P6Ok2M8j08J03j29q5K20l4r3O8m5n6OJ3R3N0o2j07
$$ 21 -55 95 -34 -30 82 -95 -2 74 80 58 106 -2 101 -28 -113 107 73 -20 48 3 -53 -47 -34 59 109 47 -60
6721f0O3Q4n4l8L8Mp7j33J92K06k64L8j04P4J1j07J38j40K57k28L3L2N8j8j57
$$ -60 3 87 33 -5 33 37 -40 -173 19 225 -39 -1 -105 -31 -20 -127 11 -129 128 -100 -67 -35 23 5 -152
6746a52J56r4J84l1k0J80k48k3o0J03K5O4k4j96J32r6P5k2n4J53l6M1l2J3j63
$$ -152 4 -90 94 63 43 223 -25 -48 -108 -5 20 84 60 -136 -4 -100 -25 -47 -101 52 16 57 25 38 -125
6771a25o6J5L15m2o0r6%J73j57J20j63J20L1J3L5O6j85P4n1n0R5j41R8j61J87
$$ -125 -191 -176 139 97 37 -59 -59 114 -43 77 -86 34 65 78 113 179 -6 68 17 -33 62 -79 19 -142 45
6796D5J71j95o1n7O8Or6K88k87M7p1K73J6j01j76J81m2j5J29n4l8L2j34M7M9N7
$$ 45 216 21 -40 -97 -29 -23 -119 169 -118 -71 -142 131 147 46 -130 51 9 -6 123 69 31 63 -71 -24 25 82
6822H2Mj20j05J40L9rk02J32R1j65J89j15L3N9k02J30Q7j34L5NQO0j73N2J78n0
$$ 82 86 -34 -139 1 40 31 -171 -39 52 -113 76 -39 -6 53 -149 -19 68 -66 -31 -26 -18 42 -131 -79 99 49
6848D9lJ20j71j9j04Q7o6M6M1o5J20j38p6J5N1J64j55R7Q2j24j4J94k24j1Q8J29
$$ 49 46 166 -5 -24 -128 -41 -107 -61 -20 -85 35 -103 -179 -164 -113 51 -104 -7 75 -49 -63 131 -93 -104 -16 113
6874A13j27n6R4J08q5j26J49k3r0J64p8L6l5j37J03l2n3l8J47l8K7jJ36q0j12
$$ 113 -14 -70 24 132 47 -79 70 47 -43 121 43 79 44 -93 10 -22 -75 -113 34 -4 23 22 158 78 -34
6899c4j8N8N7lp3N0r5j4L9K41k51j3k4K07j84P1j5J41j90K32j18m5Mj1lM6j50
$$ -34 -52 6 63 60 -13 37 -58 -72 -33 208 -43 -56 -80 127 -57 14 -1 140 -50 182 64 19 23 12 9 55 -95
6926i5k3Q0k8R0l4lj16K35j04j52R7K97k26J18n4O7j06J1j39M4K9M4m9Ko6J01
$$ -95 -118 -38 -66 24 -10 -13 -129 106 2 -150 -53 244 18 136 82 149 43 54 -85 -41 -12 32 -17 -15 -81 20
6952B0%m3J62k8k24J49n5p2J62k1J17j84j10M6J92p3M8l1O3Nj34MJ32Pk17j27
$$ 20 20 -23 139 111 -113 36 -19 -91 71 50 167 -17 -127 -81 111 38 86 55 118 123 -11 -7 125 132 -85 -212
6978b12K53r5rL1J2L4n5l5J53r4k2K11j71O5n2r3J74l8n7R7j15q7K33j25K7j40
$$ -212 41 -54 -63 -32 -20 14 -41 -76 77 -17 -39 172 1 66 14 -79 95 57 0 97 -18 -105 128 3 30 -110
7004a10J74j36O1j10O5R9r4J80j73K05k72J14p5R9J2j7j50J74n0N5k08K13j35
$$ -110 64 -72 -11 -121 -56 43 -51 129 -44 161 -111 3 -72 27 39 22 -128 46 -4 51 -157 56 -79
7027g9K7J2N6J9mM4j2j48L8K03j51J57k87J71p3J47l25K66M1j62Q2l8J53J0k14
$$ -79 -52 -40 16 35 31 75 63 -85 -47 156 5 162 -125 46 -27 120 -205 61 102 -60 22 -16 137 147 -67
7052f7J36q6j5r7Q1K81k45j09J94j04M6n8J25j10K4q5O0P4q3n1P4J1L7j6n3j33
$$ -67 69 -17 -32 -129 -48 233 -12 -121 73 -31 15 -43 82 -28 -4 -89 -29 45 -38 -89 -15 -4 33 17 -36 -169
7078a69K44J31m0j47q5K9r8L06n4j25L5L3K0J9l0%k25K49M5j71O9k7K5k6K18r7
$$ -169 75 206 166 19 -66 -37 -135 171 117 -8 27 60 80 99 69 69 -156 93 138 -33 36 9 34 8 226 129
7104A29j76Q5pj35J39j24L9J7o8J87j19MJ4q4J25k5m5oJ42j31k9J16l2O1m0L8
$$ 129 -47 38 31 -104 35 -89 -50 -33 -101 86 -33 -29 -15 -99 26 1 -44 -50 92 -39 -68 48 16 77 37 75
7130G5j03J2J6R9j15J38j65O1Jm0L4j8K0Q4r1N4p4L4K2k1j55L82k31q4K02j9j50
$$ 75 -28 -16 0 99 -16 122 -43 18 19 -21 13 -5 15 99 8 62 -12 22 44 23 -132 250 19 -65 137 118 -32
7157c2o9K07rj39J01n8NJ68k76l8J49J15j10o4K8q2J58l2j5Q2r6Q2j24J20o1j11
$$ -32 -101 106 97 -42 59 1 6 174 -102 -140 9 124 14 -50 -22 -104 54 22 7 89 -7 75 -49 71 10 -101
7183a01J14k5j68J59q9Q8m8N5J09n2q8J77k13N5J5j28J79o3k2r1J64NJ9J28k69
$$ -101 13 -12 -180 -21 -110 -22 -70 -15 94 42 -46 131 -82 -27 -12 -140 39 -24 -46 -137 27 32 51 179 -90
7208i0J52j30J91r3j9O9o8J32j47k5J21r4M7k2OO1p8Q9j51J81j03L2M4j6m2l3
$$ -90 62 -68 123 30 11 80 12 144 -3 -28 93 -1 46 24 30 91 13 102 -49 132 29 61 105 89 47 14
7234A4j38K1Q3L9p8K6lJ5PK7M9o6j36R9K3R0P0k23J36j4N6p9J7J29j25K0j26J21
$$ 14 -124 -103 -20 19 -59 -33 -36 -21 -14 13 62 -4 -140 -41 -18 72 142 -81 55 41 97 18 35 164 39 59 -67 54
7262E4N4k8m3k07K08l10J78P5j5J30j34k8L9NP8j41j75M11j8k34J32Q8p2j91J76
$$ 54 108 80 37 -170 38 -272 -94 -19 -34 96 -38 -66 -27 -22 56 -85 -260 151 133 -101 31 119 47 -144 32
7287C2j56R9P5o3o1J48k1r0J2N0m4J99k14k8J69q8orj44J55L3j54J59p4O1Mr5
$$ 32 -124 -25 50 -13 -74 74 53 -37 -25 25 -19 180 -34 -62 107 19 13 4 -140 15 48 -106 53 -21 40 44 -51
7314e1L8M2qp0j75K75r8j8Q5r5Q3q2K5j3J34j29nM4J38p5r8P9L1r4n0J66j74O5
$$ -51 -13 29 21 -49 -224 51 -47 -65 20 -75 8 -74 -49 -62 72 -57 -62 -18 120 45 -53 26 57 -37 -87 79 -95 -30
7342c0MJ40k3j56Q8j2p8J29M4j27Nj3M3qM5j43J27j01k4J42j30L9K8J61o6j24
$$ -30 -26 114 91 -65 23 11 -67 62 106 -21 -16 -29 14 6 51 -92 35 -66 -90 52 -78 -39 -11 150 84 -40
7368d0J33j08j95J71r3K79q2m0q6Q5J14k61K14r3l2J59k14R8j48J66J54k6k07
$$ -40 93 -15 -210 -39 -132 147 65 25 -61 24 138 -123 91 -2 -34 125 -89 9 -139 27 181 155 -52
7391e2M9%jJ6k6M6J7j3P1j15j0j6K5JJ12j85J08K32l78O5L1M2k8j01M6L3kJ01
$$ -52 -3 -3 -4 12 -14 32 49 36 107 -8 -18 -34 -9 -8 104 -81 27 259 -119 -54 -23 19 -9 -110 -64 -31 -33 68
7419F8j59J71q8p0J91k6j36m7L24j13j16J20j35N0N9M7j33J76n7k31K15j95L1
$$ 68 -91 80 -8 -78 113 87 -49 -96 228 115 -1 119 -16 34 93 140 7 183 126 -105 110 -85 -54
7442e4J88j40k2m2K2OM5j29J99Ko7o0N2R4j66J85j30R5j47N2O5j24R8j14K46k17
$$ -54 134 -6 -28 -70 -48 -42 3 -126 73 75 8 -52 0 94 -72 113 -17 78 -69 -17 48 -76 22 -92 154 -63
7468f3J14M2j37K4J3L6o2j8R8%j31J64q7OJ23k37O0J89j43R1L8j58J96r3k33J08
$$ -63 51 93 -44 -20 -7 29 -33 -51 47 47 -84 80 -7 -1 122 -115 -55 134 -9 82 120 -38 158 65 -168 -60
7494f0j15J30JP9on3J41j30L4J9n8J77l38K71p4J22j20K7n1L9r7J31%k53K56N1
$$ -60 -175 -45 -44 35 29 -24 117 -13 21 40 -18 159 -179 92 18 140 20 47 -4 35 -62 69 69 -184 72 123
7520A23j26j33R4k3Q8N1Mn0Q2o4k25K14q3K7J0Rn5J00o2r2Q4p6J27k24K90l0j95
$$ 123 -3 -136 -42 -65 23 74 78 28 110 46 -179 35 -48 -21 -11 -2 -57 43 -19 -111 -27 -103 24 -200 90 60 -135
7547a35K09j74J41p8Q2k0N1q0J54j32o2O2R5k3j16M4j23J69n5O9j02P3p6m2J44
$$ -135 74 -100 41 -37 45 25 76 -4 150 18 -44 18 113 90 -26 18 -105 64 9 78 -24 49 -27 -69 75
7572G5Lj23J26R4k58R4K2j10Q0M9P0j13MJ4m8J25O7k50O1J05j98J54q9J19k0k52
$$ 75 78 -45 81 175 -83 11 33 -77 3 52 122 9 13 27 -21 104 171 -79 -18 87 -111 43 -46 73 53 -199
7598a99K19L5K6j02j98K31ko1K39j57K1j20L2K03j27J6J2m6R6j04j39Q6J30L3
$$ -199 20 55 81 -21 -219 12 10 -51 188 31 52 -68 -36 167 40 56 68 22 118 14 -125 -39 91 124
7622A24k82J96j04J32m5QKj1P6m6K4pj43OJ30q8j6r0J97p8m5M2K5K9j48J37p2
$$ 124 -158 38 -66 66 21 29 31 20 96 50 74 67 -76 -70 60 -28 -44 -134 63 -15 -60 -18 7 36 -112 25 -47
7649d7j5J18n0r1J05Pk08L46L0m18K50PN9r7J61l06L7L2J93j15k6O3J72k80K25
$$ -47 -62 56 6 -85 20 27 -181 165 195 -223 27 34 93 -4 157 -149 -112 -80 113 -2 -28 35 207 -73 152
7674A52k11J5Q8Rj4j67L35q9j55%o2n6J88nj12J15j1n7j77M00j36j2J56k92K8
$$ 152 -59 -44 44 53 39 -128 207 118 -37 -37 -99 -155 33 28 -84 31 20 -37 -214 186 50 38 194 -98 -70
7699g0K8K5K8j04J10J30j44k7p0nK6K1J4J10n8l8q7L02k91R5q1kJ11j83J07J99
$$ -70 -42 -17 11 -93 17 147 3 -24 -94 -99 -73 -52 -38 72 14 -24 -111 191 -100 -5 -86 -88 23 -160 -53 146
7725A46m4o8Oo9N5q6J07M6Jj70O8M3O6k15J26J5n4K0J02j21m2Q6nj5q7J35k9k3
$$ 146 102 34 40 -29 26 -60 47 93 94 -76 -8 35 101 -114 12 27 -27 -7 95 -26 -68 18 13 -2 -89 46 17 -6
7753fJ62j36l7J10j54O1l8q8N6J42k52N8K97k07O4K7j6J68l36J75Q0j83Q2kQ4
$$ -6 156 20 -17 93 -61 0 -38 -126 -70 72 -180 -122 175 -32 32 59 43 211 -125 50 130 -53 29 27 111
7778A11j21O9k40J62j5J6P8m9p3L2R5K0p5R8j46k2K19j89K7KP7J00p3K3%j08j01
$$ 111 -10 59 -181 -19 -34 -18 60 11 -62 -30 65 85 10 108 -38 -60 159 -30 -3 -1 76 176 103 126 126 18 -83
7805h3J35qj20J39K8q9l1j2k4O3m6K1J33j85J53l5p0M6k3M6N8j03O1m4NR2j08
$$ -83 52 44 -76 63 91 2 -29 -41 -65 -2 -48 -27 106 -79 74 39 -31 15 -8 38 96 -7 54 10 15 107 -1
7832aO4l9N3j78J61j38m0K51Rj38k8MM0Qj34J55k5R1L2j49K4J26k64R1Q5n6%N5
$$ -1 63 24 77 -101 60 -78 -118 133 142 4 -24 -20 20 28 -106 49 24 115 147 -2 22 148 -116 -25 60 4 4 59
7860E9k5j86K70Mj03n4J36q4j04J28J45k07l6J5M3q4K44k04M6J4P8l07K62P5p9
$$ 59 34 -152 118 122 19 -35 101 17 -87 41 186 -21 -57 -42 1 -83 161 -43 3 17 95 -212 50 125 46
7885D6n0J2jj03O2j37K84j07M6mm0M3q9K8llk9M0l9o0J13p9O0K7ql8J00j12n2
$$ 46 -4 8 7 -96 -34 -171 113 6 52 48 8 51 -38 -10 -13 -16 -45 -5 -44 -104 9 -70 -10 17 9 -29 71 -41 -93
7914i3J39k16J37M1j0k5M4J27j35l1pL4j24K09j66J56j09J4p9M2J42k51J54O2
$$ -93 46 -170 -33 8 -2 -27 17 144 9 -22 -29 5 -119 90 -76 80 -29 -15 -94 -52 90 -161 -7 55
7938E5R9k72L6J09J06j32j05J05J57o4ol0L5j41J02j80J31R5k57K77M5k84R9j43
$$ 55 154 -118 -82 27 133 1 -104 1 158 94 88 58 93 -48 54 -126 5 100 -157 120 165 -119 -20 -163
7962a63J55J11k42K19p8r2KJ45K2Jj61M1M2J8k8j8J4K0K02r8M9k42K2Q5O6j76
$$ -163 -8 103 -139 80 2 -90 -88 57 79 80 -81 -40 2 20 -8 -26 -12 8 210 112 161 -81 -59 26 92 -84
7988h4m8J49l8J18j73K28k91J08n6Oj6L16j52l2p6K00K4j36o3N2K54k64pJ48j40
$$ -84 -132 17 -21 97 -76 152 -139 -31 -87 -81 -97 219 67 35 -41 159 183 47 -16 36 290 26 19 167 27
8013B7Q8l21J99J01j83Q5r6J45j09L0j02J16J01j45N7k5n3J62q1Oj04R1J43k07
$$ 27 115 -206 -7 94 -89 -4 -100 45 -64 -34 -136 -20 81 -64 -7 -32 -85 77 -4 2 -102 -11 132 -75
8037g5J11j96L00l69J43P0l7P3r7J7O1o1L8K1K8j09J16l9o1J62n5R3k00J06r6
$$ -75 36 -160 140 -229 -86 -16 -53 20 -77 -60 1 -60 -22 -1 27 -82 34 -5 -66 96 41 134 -66 40 -56
8062e6o7J77j09J06O0mk44K15k20J8K29l3o2j68K52m4j01P8j16K0k3K19K9Pj84
$$ -56 -123 54 -55 51 111 107 -137 78 -142 -124 105 72 10 -158 94 50 -51 27 -89 -69 -92 127 156 163 -21
8087b1J20j22m0J10p1J23k50R1R4M4J7J9j62Q9m6K7P0k22L0K37j30Q1%m9n5O6
$$ -21 99 -23 -63 47 -24 99 -151 -60 34 78 95 114 -48 41 -5 22 92 -130 -100 137 7 88 88 39 -16 50
8113E0j1k5J35j23P5n8o4m6J12k13O2K5K3O9J77k27RK5K7k9q6P1QM6n1N8j57K14
$$ 50 39 14 149 26 101 43 -21 -67 45 -168 -106 -81 -58 11 188 -39 -30 -5 22 -7 -93 -22 -14 32 -19 39 -118 96
8141I6j26J37m9j75K50k11R8o8J08j14p5J58N5j86R7R7l0l9j41N0O5O6q6pO8j36
$$ 96 -30 107 58 -117 133 -78 20 -48 60 -54 -129 29 84 -102 -5 92 62 23 -118 -68 -3 63 -23 -30 38 -98
8167i8R4O6j17Q8l2p1J39j19J22r2j27J35PR5p8j11Q0o6J53q1o5n0J70j2
$$ -98 -4 62 -55 33 1 -70 69 -50 72 -20 -147 -12 -5 90 12 -99 -19 -85 68 -13 -78 -128 42 30
8191C0
$$ Imaginary data points
##PAGE= N=2
##DATA TABLE= (X++(I..I)), XYDATA
0@%%%%%%%%%%%%%%%%%%Qj6J6j6J6j6K1k9L2l2M0m8N3o1O9p7Q7r9J10j23J38j54
$$ 0 0 0 0 0 0 0 0 0 0 0 0 0 0 0 0 0 0 0 8 -8 8 -8 8 -8 13 -16 16 -16 24 -24 29 -32 37 -40 47 -52 58 -65 73 -81
40h1J71j90K10k31K56k84L13l46L80m19M62n06N59o17O82p58Q43r40J052j184
$$ -81 90 -100 110 -121 135 -149 164 -182 198 -221 241 -265 294 -323 359 -399 444 -496 556 -628
60f28J345j544J796k128K587l262M344o361J1304m3744n4695J22480J5171l2437
$$ -628 717 -827 969 -1159 1428 -1834 2510 -3851 7453 -36291 -90986 31494 46665 14228
74A4228N8961o159p6290M0606L2138o0998O8K2499o8874j1678N6621k3659k6712
$$ 14228 73189 67030 -9260 31346 63484 2486 2554 25053 -43821 -55499 1122 -22537 -49249
87d9249M3231p656k2846M7597J7156m0821L064K7549L68j94r06j5148N02P007
$$ -49249 -6018 -13674 -36520 11077 28233 -12588 -9524 18025 18393 18199 17293 2145 2647 9654
101I654q470j003O845n085m319l317j104J3127j003j4327M103o359j7669J9127
$$ 9654 1184 181 7026 1941 -2378 -5695 -6799 6328 5325 -9002 -4899 -11258 -28927 -9800
115i800J2627k5610J0181L2006j9904r345L9147J373k2568J4351p869k2227K8375
$$ -9800 2827 -22783 -12602 19404 -500 -9845 29302 30675 8107 22458 14589 -7638 20737
128B0737R35m7434R486K0969l6610N98L4933k5414j5817M2990J259k1738L4600
$$ 20737 21672 -25762 -16276 4693 -31917 -31319 3614 -21800 -37617 5373 6632 -15106 19494
141A9494J3987l0692J2171J6011k4803M688J1673l3327m804K8500j8751k2516
$$ 19494 33481 2789 14960 30971 6168 10856 22529 -10798 -15602 12898 -5853 -28369
153b8369K5305M279k3602J0658J3633j2947O837J4516j1126k343J1042k716j148
$$ -28369 -3064 1215 -22387 -11729 1904 -11043 -4206 10310 -816 -3159 7883 5167 4019
166D019L994q111l261R417J88o429L854M001o355n276M443N791n794j2661K551
$$ 4019 8013 -98 -3359 6058 6246 -183 3671 7672 1317 -3959 484 6275 481 -12180 -9629
181i629R944m861j379Q069p208m694J3091K813n793M685j643n569J0119L246j3232
$$ -9629 315 -4546 -5925 2144 -5064 -9758 3333 6146 353 5038 3395 -2174 7945 11191 -2041
196b041L778O964j8004j765K0231q990j5708J3237M289r408Q807M455j0131M087
$$ -2041 1737 8701 -9303 -11068 9163 173 -15535 -2298 1991 -7417 1390 5845 -4286 -199
210a99O446q352L861R675j2200m543J5424n412j2353J1607J757j5155L277Q905
$$ -199 6247 -2105 1756 11431 -769 -5312 10112 4700 -7653 3954 5711 -9444 -6167 2738
224B738o372k288M490k196j78N021l083r26P888k943n773R516M167r079O60O216
$$ 2738 -3634 -5922 -1432 -3628 -3806 1215 -1868 -2794 5094 2151 -3622 5894 10061 982 1642 7858
240G858l917o046K159K640m378l475J558J644o43j120r1K417n1j590K131L250
$$ 7858 3941 -2105 54 2694 -1684 -5159 -3601 -1957 -2600 -3720 -3811 -1394 -1445 -3035 -904 2346
256B346o98k690J733N119k790n013M900K236o570j015N544j85m590k45K299m91
$$ 2346 1648 -1042 691 5810 3020 -1993 2907 5143 -1427 -2442 3102 2917 -1673 -1918 381 -110
272a10m49j064j086K553r97l374N036K923n793P32O265k361m193M098K333n628
$$ -110 -559 -1623 -2709 -156 -1153 -4527 509 3432 -2361 -1629 4636 2275 -1918 2180 4513 -1115
288a115j781L772J29j753j446j845L022K135m607Q01N525j529l699M594M284m430
$$ -1115 -2896 876 1005 -748 -2194 -4039 -1017 1118 -3489 -2688 2837 1308 -2391 2203 6487 2057
304B057j883M360j532l926K250R15l512k166k22J671R95k501k210L030L216k996
$$ 2057 174 4534 3002 -924 1326 2241 -1271 -3437 -3659 -1988 -993 -3494 -5704 -2674 542 -2454
320b454r63O353P80n743K662N235k257k876J909M15k526m08J975q89k473j113
$$ -2454 -3417 2936 3716 -2027 635 5870 3613 737 2646 3061 535 127 2102 1213 -1260 -2373
336b373M20K274p54l949K092L439k933j538M772K101m283j539M528P95l370J73
$$ -2373 -1953 321 -433 -4382 -2290 1149 -1784 -3322 1450 3551 -732 -2271 2257 3052 -318 -145
352a45J063p57q27j75J737Q5k960J23L232K11k839J0L428j048l882K941L286l063
$$ -145 918 161 -666 -841 896 981 -1979 -1856 1376 1587 -1252 -1242 2186 1138 -2744 197 3483 420
370D20k424J928J931q77k147O81J573j487k077J635K358k775k793L245J553l203
$$ 420 -2004 -76 1855 978 -1169 -488 1085 -402 -2479 -844 1514 -1261 -4054 -809 744 -2459
386b459P44L062o51j328Q84K316J614j978j855K273J759m059j431M141k594n692
$$ -2459 -1715 1347 696 -632 252 2568 4182 2204 349 2622 4381 322 -1109 3032 438 -5254
402e254L228K710l956n37K054l26J037R01r21K592J425m091R8O353k584o043M588
$$ -5254 -2026 684 -3272 -3809 -1755 -2081 -1044 -143 -1064 1528 2953 -1138 -1040 5313 2729 -3314 1274
419A274K336o488R21M780k849j912J981j5J00J354j522J3K317k757k721M715J545
$$ 1274 3610 -2878 -1957 2823 -26 -1938 43 28 128 1482 -40 -27 2290 -467 -3188 1527 3072
436C072o032L8L681j200j096J572J355r61k507J400L976j813l271J652O13k158
$$ 3072 -2960 -2922 759 -441 -1537 35 1390 429 -2078 -678 3298 1485 -1786 -134 479 -1679
452a679J317K305k379j146J136n75L624K244p540M56Q443n057m596Q107j943r579
$$ -1679 -362 1943 -436 -1582 -446 -1021 2603 4847 -2693 -2237 6206 1149 -3447 4660 2717 -6862
468f862N764N205p818N30M914o389R75Q054o725k045R862n502n509J1822j325
$$ -6862 -1098 4107 -3711 -3181 1733 -4656 -3681 4373 -2352 -4397 5465 -37 -5546 6276 4951
483D951j1687Q083O986j0632k38P532n801p57O827n913l395P178l930k958Q266
$$ 4951 -6736 1347 8333 -2299 -2537 4995 -806 -1563 5264 -649 -4044 3134 -796 -3754 4512
498D512l983q965P418M285o405J920L180o157K71O731J71j187j052m289M102O308
$$ 4512 529 -8436 -1018 3267 -3138 -1218 1962 -4195 -3924 2807 2978 1791 739 -3550 552 6860
514F860n074j853K903n094j221P021j339l797N88l287J257P622l898n316P043
$$ 6860 1786 -67 2836 -2258 -3479 3542 2203 -1594 -1006 -4293 -3036 4586 688 -4628 2415
529B415j787p887J0609N290j2979J561P998p748O90Q455q082l199Q118n970l630
$$ 2415 628 -7259 3350 8640 -4339 -2778 5220 -2528 -1838 6617 -1465 -4664 3454 -2516 -6146
544f146J2641l733j2341R813N486j1519N956R311j2448k459J0844l301j610O107
$$ -6146 6495 2762 -9579 234 5720 -5799 157 9468 -2980 -5439 5405 2104 494 6601
558F601p265n871Q485L60n142N688j971j0985N952R315n582j629K889m790L57
$$ 6601 -664 -6535 1950 2310 -2832 2856 885 -10100 -4148 5167 -415 -2044 845 -3945 -3588
573c588N974N93l50j346m805L292O764l137m195K431k000k274M926j31l442J011
$$ -3588 2386 2979 2629 1283 -3522 -230 6534 3397 -798 1633 -367 -2641 2285 2154 -1288 -277
589b77k379p79O594k625o468O206J333p730N661O982q442j590P763l372k419N867
$$ -277 -2656 -3435 3159 534 -5934 272 1605 -6125 -464 6518 -1924 -3514 4249 877 -1542 4325
605D325l705l862P364l593o682R705J689j0894M315N252q446J893R008n828m758
$$ 4325 620 -3242 4122 529 -6153 3552 5241 -5653 -1338 3914 -4532 -2639 6369 541 -4217
620d217O405j443k762O428k397n901M543j353n099Q378K532r860K46O410k101
$$ -4217 2188 745 -2017 4411 2014 -3887 656 -697 -5796 2582 5114 -4746 -4500 1910 -191
635a91j94L473l694k154L824o18M90L681m895k904N733j359l707N439n02p030
$$ -191 -385 3088 -606 -2760 1064 446 936 4617 -278 -3182 2551 1192 -2515 2924 2422 -4608
651d608K840M890j740p52r06l299K966L330n146j14M933m789k601P442k4m510
$$ -4608 -1768 3122 1382 630 -276 -3575 -609 2721 -2425 -2539 2394 -2395 -4996 2446 2422 -2088
667b088K844J10l285L432K546k307l91l30k155L425K371o013o83M625l157l218
$$ -2088 756 866 -2419 1013 3559 1252 861 531 -1624 1801 4172 -1841 -2524 2101 -1056 -4274
683d274M853J611k572j97j018Q01K558j303j914J855q29k093L566J513m498R09
$$ -4274 579 2190 -382 -579 -1597 -796 1762 459 -1455 400 -429 -2522 1044 2557 -1941 -1032
699a032L307l304p54L256o50k00M16k492J700M520m337m173N037J148n343J953
$$ -1032 2275 -1029 -1783 1473 823 623 1039 -1453 247 4767 430 -3743 1294 2442 -2901 -948
715i48L364m123l42L920k220r75K674k185j516K634q81p27L468j235m684L473
$$ -948 2416 -1707 -2049 1871 -349 -1324 1350 -835 -2351 283 -598 -1325 2143 908 -3776 -303
731c03M778m652k772M510M1l040J881J225k67J1j151j144J054M73j518r6Q67j388
$$ -303 4475 -177 -2949 1561 1602 -1438 443 1668 1401 1412 261 -883 171 644 -874 -970 -103 -1491
749a491l45L004q5l210R39K659j643k340J936K763k126j730K311J158q21p88j026
$$ -1491 -1836 1168 1083 -2127 -1188 1471 -172 -2512 -576 2187 61 -1669 642 1800 979 191 -835
766h35O32J533j312j087J773K31j922J194K383l366j479L430m03l055J774K292
$$ -835 -203 1330 18 -1069 704 935 -987 207 2590 -776 -2255 1175 772 -2283 -509 1783
782A783k060r89P27O99M95p23k161O46K814j251j691K853Q52l284J058K550j962
$$ 1783 -277 -1266 -539 160 655 -68 -2229 -1583 1231 -20 -1711 1142 1994 -1290 -232 2318 356
799C56j483J970N71k078M55J804n05j299j86j26Q16j3k181M56K457j042j864J699
$$ 356 -1127 843 1414 -664 -209 1595 1090 -209 -395 -521 295 282 -1899 -1443 1014 -28 -1892 -193
817a93J991k584j381K901J30k060J059J281j100l42R96N53n34q83l09P61J092
$$ -193 1798 -786 -2167 734 864 -1196 -137 1144 44 -298 698 1251 717 -166 -475 286 1378
834A378j557r03K376j21k678J035K156k042j761J564J199j205o06J256K46j017
$$ 1378 -179 -1082 1294 1173 -1505 -470 1686 -356 -2117 -553 646 -559 -1165 91 337 -680
850f80q7N72O38m14j344J052J910j393q46J730O82k103l14K164k94k547J102J247
$$ -680 -767 -195 443 29 -1315 -263 1647 254 -592 1138 1820 -283 -597 1567 1273 -1274 -172 1075
868A075q10o51j5N90q3j085l69J744J10j890O3K380n29k133J613J229k077j56
$$ 1075 265 -386 -401 189 106 -979 -1348 396 506 -1384 -1321 1059 530 -1603 10 1239 -838 -994
886i94J552L96q77l72N77R29m70p03L63Q28j331j271K021P68k395l21J918l46
$$ -994 558 954 77 -295 282 1211 741 38 401 1229 -102 -1373 648 1416 -979 -1300 618 272
904B72r23j8R57J68j390K40J557k42j482J52J004l40j008Q30O68q12n96P17J509
$$ 272 -651 -669 288 456 -934 -694 863 621 -861 -709 295 -45 -1053 -223 445 -367 -963 -246 1263
923A263k83j904J155K183k088j211K462j69k002L17P04l82k33n24p26J365Q0k428
$$ 1263 980 -924 231 2414 326 -885 1577 1408 -594 -277 427 45 -188 -712 -1438 -73 7 -2421
941b421J802K335l391j60L869j423k475K785P99k370M21J066o11Q21K22k373J537
$$ -2421 -619 1716 -1675 -1835 2034 611 -1864 921 1720 -650 -229 837 226 1047 1269 -1104 433
958D33J935l177k18L381k293k377K822N05k220M10J060j035lK05J28J192o56j701
$$ 433 2368 -809 -1027 2354 61 -2316 506 1011 -1209 -799 261 -774 -777 -572 -444 748 92 -1609
976a609K166J182k511O22J692j391j172J139J38M95o0k097R01K135k390j43L447
$$ -1609 557 1739 -772 -150 1542 151 -1021 118 256 751 691 -1406 -505 1630 -760 -903 2544
993B544k186l266L694J888l761R81R05k692J176K079k341Q29Q87m017R95N663
$$ 2544 358 -2908 786 2674 -1087 -106 799 -1893 -717 1362 -979 -150 737 -3280 -2285 3378
1009C378k421m117L814L71l551L743K739m725n16J945r37J482J759l740o94K283
$$ 3378 957 -3160 654 1025 -2526 1217 3956 -769 -1285 660 -277 1205 2964 -776 -1470 813
1025H13j300m37L633j749m645K499K743j841K48L04j815N51M81O27J591j365k877
$$ 813 -487 -924 2709 960 -3685 -1186 1557 -284 -36 268 -1547 -996 -515 112 1703 338 -2539
1042b539K054K290j563M7R89j709n78K120j61n4P68l361j78M583k054l123M277
$$ -2539 -485 1805 242 289 1278 -431 -1009 1111 950 896 1664 -1697 -1875 2708 654 -2469 1808
1059A808p80n073L509L586m006n07K827k962n7L893k258j497L839k907k945O191
$$ 1808 1028 -4045 -536 3050 -956 -1463 1364 -1598 -1655 2238 -20 -1517 2322 -585 -3530 2661
1075B661M74o114K810K866m915J050M928l128k613L072j079j363L650j278l107
$$ 2661 3135 -2979 -169 2697 -2218 -1168 3760 632 -1981 1091 12 -1351 2299 1021 -2086
1090b086K533n8k990L679J894m782q15L307j22j281J338j87j814J8R96J679J95
$$ -2086 447 389 -2601 1078 2972 -1810 -2625 682 560 -721 617 430 -1384 -1366 -370 1309 1504
1107A504k488j71J699o62M84J473j547q29Q16n16J073J956l583j678M134r38l814
$$ 1504 -984 -1155 544 -118 366 1839 292 -537 279 -237 836 2792 -791 -2469 1665 727 -3087
1124c087M041J539o092J250M911l787o89M081l218j897N059j335k941M625n11
$$ -3087 954 2493 -3599 -2349 2562 -1225 -1914 2167 -1051 -2948 2111 776 -2165 2460 1949
1139A949n783M391M165o390M11N497n088k756O552q39m678K905J04l148L109J969
$$ 1949 -3834 557 4722 -1668 -1257 4240 -848 -3604 2948 2109 -2569 336 440 -2708 401 2370
1155B370m276M54K775l299L37M722k131m113L241J790k734Q37K201k006k063J674
$$ 2370 -1906 -1452 1323 -1976 -1639 3083 952 -3161 80 1870 -864 -27 2174 168 -1895 -221
1171b21J511q84o75L20o35K29P86L8n27R46J2k035J313K305k701j436L723j261
$$ -221 1290 406 -269 51 -584 -355 431 469 -58 888 900 -1135 178 2483 -218 -1654 2069 808
1189H08m029L238K587m604L36L151k565j039L961j599k372L432p75k953M464Q32
$$ 808 -3221 17 2604 -2000 -1664 1487 -1078 -2117 1844 245 -2127 1305 530 -2423 2041 2873
1205B873n648K363M047m457p50M937k780l897M158J589l804J158J244l424J453
$$ 2873 -2775 -412 3635 -822 -1572 3365 585 -3312 846 2435 -1369 -211 1033 -2391 -938
1220i38K888l054m92K866k796j083M315K42m196J655K663k577l43L171q11k909
$$ -938 1950 -1104 -1596 1270 -1526 -2609 1706 1948 -2248 -593 2070 -507 -850 2321 1510 -1399
1236a399J672O69r23K68J52j029K87J013j471l35K000l98k432J867J694k787l02
$$ -1399 273 942 19 287 439 -590 -303 710 -761 -1096 904 506 -1926 -59 1635 -1152 -1454
1253a454K978p24k517J724J432k700K76K247j429n94J551j526J79K338j349k077
$$ -1454 1524 800 -1717 7 1439 -1261 -985 1262 -167 -761 790 -736 -557 1781 432 -1645
1269a645K842P71l693J117L167k849j646L446p76k555K072Q05k376R97R83j402
$$ -1645 1197 1968 -1725 -608 2559 -290 -1936 1510 734 -1821 251 1056 -1320 -323 660 -742
1285g42L88J220k131L21K819j844k614L223Q15l221J235K701j989j381K081l11
$$ -742 -354 866 -1265 -944 1875 31 -2583 640 1455 -1766 -531 2170 181 -1200 881 570
1301E70q40J320j29j796Q92Q95j639J192P70k674m3K589r86j981K054J125k664
$$ 570 -270 1050 921 -875 17 912 -727 465 1235 -1439 -1482 1107 121 -1860 194 1319 -1345
1318a345M9K327n72j317J043l01l23J207n94p33J191Q6j394R49J201j801o96K459
$$ -1345 -1296 1031 459 -858 185 -116 -439 768 174 -559 632 718 -676 273 1474 -327 -1023 1436
1336A436m13k259J523J076j961m92J401Q8r61l7k45J21J183k46j407J318O53j779
$$ 1436 1023 -1236 287 1363 -598 -1090 311 399 -562 -599 -844 -723 460 214 -1193 125 778 -1001
1354a001L78K063j395j385J976M79j924N57K000j540j054J453O2n32M04p21j80
$$ -1001 -623 1440 45 -1340 636 1115 -809 -252 1748 208 -846 607 669 137 541 -180 -360
1371c60J192n96j476J078R86j860o26K458o47j807J606P70j341K26J089n20m01
$$ -360 832 236 -1240 -162 824 -1036 -1662 796 149 -1658 -52 718 -623 -397 692 172 -229
1388b29M50K66O5J03o51k41J224j84j844Q22J431j605r69J714O06j575J14J081
$$ -229 221 487 552 655 4 -237 987 803 -1041 -219 1212 -393 -1362 352 958 -617 -503 578
1406E78p20o35J149p6q20N48J0k96P39m28r55J072Q79k103k30K423n70j977J905
$$ 578 -142 -777 372 296 -524 24 34 -262 477 49 -906 166 1045 -1058 -1288 1135 565 -1412 493
1425D93J018k100L13J310j091o5R37r07k18J176n82j008J546n87j773J421R06
$$ 493 1511 -589 -276 1034 -57 -122 815 -92 -310 866 284 -724 822 235 -1538 -117 789
1442G89k008J17J797r21j006Q30O46l55l1L5M0O70j29o60Q86L54j074J66R28o92
$$ 789 -1219 -1102 695 -226 -1232 -402 244 -111 -142 -107 -67 603 474 -186 700 1054 -20 146 1074 382
1462C82p83K7N90k47p86L84Q71j057p55J219Q13j298M9J031m97j80P81l47K8O14
$$ 382 -401 -374 216 -31 -817 -433 438 -619 -1374 -155 658 -640 -591 440 -57 -237 544 197 225 839
1482H39j374K5J754q65j746J828N27k022O45J847j683j276J997l0j058J034q4
$$ 839 -535 -510 1244 379 -1367 461 988 -1034 -389 1458 -225 -1501 496 466 -592 442 358
1499C58j009J118k29r35J187J30j948N30J667j095j038J579Q8j195M45O30nj59
$$ 358 -651 467 238 -697 490 620 -1328 -798 869 -226 -1264 315 403 -792 -347 283 278 119
1517A19k62K09O12q45Q7R86j05j251M66M68j88m1j87m41O71m50j094J566P68k796
$$ 119 -143 66 678 -167 -80 906 801 -450 16 484 296 255 68 -373 298 -152 -1246 320 1088 -1708
1537a708l2K826j378j022K212p66j565J808Q83j365P33O05k532J515J973k687
$$ -1708 -1740 1086 -292 -1314 898 132 -1433 375 1258 -107 626 1231 -1301 214 2187 -500
1553e00l01K639k561j481L543j96l182J499J345j975P06J789j660n3J159j577
$$ -500 -801 1838 -723 -2204 1339 1143 -2039 -540 805 -1170 -464 1325 -335 -388 771 -806
1569h06J09K503j609j722J903K4j633J379J245j632j194J381N73p3j5k04l68m13
$$ -806 -697 1806 197 -1525 378 402 -1231 148 1393 -239 -1433 -52 521 448 433 229 -139 -552
1587e52K63J253K60j688o34N07O98J020m65j859R57K24r66J689J432l303j235
$$ -552 -289 964 1224 -464 -1098 -591 107 1127 662 -1197 -240 -16 -982 707 2139 -1164 -2399
1604b399L066k1j586K147o59k967K265J791j765Q33M48k908J441L206k675j513
$$ -2399 667 646 -940 1207 548 -2419 -154 1637 -128 705 1153 -1755 -314 2892 217 -1296
1620a296K849j386k793L508J015l950J012K025k241L41K162j906m01J999j454
$$ -1296 1553 167 -2626 882 1897 -2053 -1041 984 -1257 -916 1246 -660 -1061 938 -516
1635e16o51K629o17k393K142J072k744P28K148j715r01J333l02k69O64k50o50
$$ -516 -1167 1462 845 -1548 594 1666 -1078 -350 1798 83 -818 515 213 -56 608 358 -292
1652b92J80k77l9R67K5j305j38O48N01j59m72M90j48j147J136J914j949j215K165
$$ -292 -112 -389 -428 539 564 -741 -879 -231 270 111 -361 129 -19 -1166 -30 1884 -65 -1280 885
1671H85n10j371J724K85j796P53O42j188Q59J109k148l5K469j860j384L251o35
$$ 885 375 -996 728 1013 -783 -30 612 -576 283 1392 -756 -791 1678 -182 -1566 1685 1050
1688A050k987J857J479k616O10J697j737n68J687r51k88J919j332j679K566L12
$$ 1050 -1937 -80 1399 -1217 -607 1090 -647 -1215 472 -479 -767 1152 -180 -1859 707 1019
1704A019k064J483J046k345Q4K406n93j364M06l9m33Q24j18q14M77o26n70J443
$$ 1019 -1045 438 1484 -861 -777 1629 1036 -328 78 39 -394 430 312 -502 -25 -651 -1221 222
1722B22O00j507m07R88L18m47K86N34o87n60O59O17j64p05J93N40o41m7L62j7
$$ 222 822 -685 -1092 -104 214 -233 53 587 -100 -660 -1 616 452 -253 -60 480 -161 -208 154 137
1742A37j56l22R0P95pj120N53O86p30m37J039j9j279L77Q02o66l10M99l60K15
$$ 137 -19 -341 -251 544 537 -583 -30 656 -74 -511 528 509 -770 -393 409 -257 -567 -68 -428 -213
1762b13L69n78L77Q68j170l97J798j38j525P34J012j366j84J228o95k82M14n44
$$ -213 156 -422 -45 823 -347 -744 1054 916 -609 125 1137 -229 -413 815 120 -162 252 -292
1780b92Q2P34o90l88Q48m2j613Q93J255j325n40J515l25r29Q52N39m24J50J24
$$ -292 -210 524 -166 -554 294 252 -1361 -468 787 -538 -1078 437 112 -817 35 574 150 300 424
1799D24k34K44J72o04J56M89o29q68J048K92j684P94J006j046k75P00M45p17J80
$$ 424 190 434 606 2 158 647 18 -850 198 490 -1194 -400 606 -440 -715 -15 430 -287 -107
1818a07M85m45J74K6l64K39L78r15rR99l74r94P83J110j429KJ215l00j000J000
$$ -107 378 -67 107 133 -231 8 386 -529 -538 461 87 -907 -124 986 -443 -441 774 474 -526 474
1838D74L07j010J99O6j88K60L3p75J79J045j106n17K000k77j802J000J006j549
$$ 474 781 -229 -30 36 -152 108 141 -634 -455 590 -516 -1033 967 690 -1112 -112 894 -655
1856f55R4J242n47q37P08J06n64Q54J6q81J088J05j334P20J334j591n48J011K27
$$ -655 -561 681 134 -703 5 111 -453 401 417 -464 624 729 -605 115 1449 -142 -690 321 548
1875E48j465M42O73p90l31Q01j20k10N93l48%Q26o43l54R52L35j227K41J062q38
$$ 548 -917 -475 198 -592 -923 -122 -242 -452 141 -207 -207 619 -24 -378 574 909 -318 -77 985 147
1895A47j069J051L76r93L52O00l20m18M15ml9L8k75n40R08j10j119Q13P77j154
$$ 147 -922 129 505 -488 -136 464 144 -274 141 137 98 136 -139 -679 229 119 -1000 -187 590 -564
1915e64j88J261k44q38O04Q36j141nP41m06K63j3q53M00P44q32l72J560m13j214
$$ -564 -752 509 265 -573 31 867 -274 -279 462 56 319 306 -547 -147 597 -235 -607 953 540 -674
1935f74P09R28j009l00R26m55o64P60m03m21L52j86j56Q00j33q77Q04P57r09p2
$$ -674 35 963 -46 -346 580 125 -539 221 -182 -603 -251 -437 -593 207 74 -803 1 758 -151 -223
1955b23J094k79j035O06N15n81l1mm2L3k74j8K73J53m63l12Q19j25p51N99M72
$$ -223 871 592 -443 163 678 97 66 62 20 53 -221 -239 34 187 -276 -588 231 106 -645 -46 426
1976D26p96l64Q03N49p98k03M84K30k78K48j28j01Q3k60J82M45k11p77K15Q96
$$ 426 -370 -734 69 618 -180 -383 101 331 53 301 173 72 155 -105 77 522 311 -466 -251 645
1996F45p94k79J007l03j222R45Q79j119k37O65n57J32N55n61k65Q17n34p18J255
$$ 645 -149 -428 579 276 -946 -1 878 -241 -478 187 -370 -238 317 -244 -509 308 -226 -944 311
2015C11K38j611J049J359j788MJ564o01r80J079l02r18O26K82o03O00N3j455R38
$$ 311 549 -1062 -13 1346 -442 -438 1126 525 -455 624 322 -596 30 312 -291 309 362 -1093 -155
2034a55J123j234o82J326n86q01J013O78q62r7L28L0K74l3k87K8J76l42M44M40
$$ -155 968 -266 -948 378 -208 -1009 4 682 -180 -277 51 81 355 322 35 63 239 -103 341 781
2054G81o22q30K03P91P1p49J08Q23r03l37J316J04j448J4J098q32l6J145q23o26
$$ 781 159 -671 -468 323 394 -355 -247 576 -327 -664 652 756 -692 -678 420 -412 -448 697 -126 -752
2074g52J045n97j69J402n51j714J395R78j921Q38J663j862j008K089j18j284J174
$$ -752 293 -304 -473 929 378 -1336 59 1037 -884 -46 1617 -245 -1253 836 718 -566 608
2091F08l66j431J066R78j474Q62L04j843N49J998j047j236J340k16j355J382R35
$$ 608 242 -1189 -123 855 -619 243 547 -1296 -747 1251 204 -1032 308 92 -1263 119 1054
2108A054j471k7M78k25Q44K13q17k19N37m04l0Q96l96j057O9O94J38k31k78M06
$$ 1054 -417 -444 34 -191 653 866 49 -170 367 -37 -67 829 433 -624 -555 139 277 46 -232 174
2128A74k63p09R15O57j146l17J023n83k51Q14k52n53O61j28n99J182K31j502P45
$$ 174 -89 -798 117 774 -372 -689 334 -249 -500 314 62 -491 170 42 -557 625 856 -646 99
2147I9R72j731K00J947r56j686J446%r45R27K82j228K75N53q34P34J116j874j83
$$ 99 1071 -660 -460 1487 531 -1155 291 291 -654 273 555 -673 -398 155 -679 55 1171 -703 -886
2166h86J875q88p93J374k43j341P18R16m81l08P5m76L60O64n38P6O19r41k78J166
$$ -886 989 101 -692 682 439 -902 -184 732 251 -57 18 -458 -98 566 28 104 723 -218 -496 670
2186F70o7q11l5K52k19J33O9J82j09n90q7R74j03j009N57N10q77M44N38k11m2
$$ 670 603 -208 -243 9 -210 -77 -8 174 65 -525 -612 362 259 -750 -193 317 -560 -116 422 211 169
2207A69j75k20N43N15q45j12P33n80p41J116M05j413J4P81m81kM15m29N0r3j04
$$ 169 -6 -226 317 832 -13 -125 608 28 -713 403 808 -605 -591 190 -291 -293 122 -307 -257 -350 -454
2228d54M37N49o08m61Q36O5n94K74M36n88l51M96L03M2m14r5M53l48m05O21K32
$$ -454 -17 532 -76 -537 299 364 -230 44 480 -108 -459 37 340 382 -32 -127 326 -22 -427 194 426
2249D26o06p0L70lj99N7q5n9J07k03NQ78n55r44J109K92r75M04N64n85j51M80
$$ 426 -180 -250 120 117 -82 -25 -110 -169 -62 -265 -260 618 63 -881 228 520 -455 -51 513 -72 -223 257
2271B57L3k06L01l41k46R24m01p00P36k6q97J43R81p23n82Q52r6n64L01N53n18
$$ 257 290 84 385 44 -202 722 321 -379 357 331 -566 -423 558 -165 -747 105 9 -555 -254 299 -219
2292b19P4K62j88L0M89p68J17P24m32m22M86M87q69mQ11k39n51K64L71n00n7J30
$$ -219 -145 117 -71 -41 448 -320 -203 521 89 -333 153 640 -229 -233 578 339 -212 52 423 -77 -134 -4
2314dJ53l98J05J14k39K62m4m66O03J97p82L62O65n25n74R01J38j009M18O89p69
$$ -4 149 -249 -144 -30 -269 -7 -51 -517 86 283 -499 -137 528 3 -571 330 468 -541 -123 566 -203
2335b03k8N58l50o2N01n03o5N31o3q95P34L33j126J55J067m58r19R88K50p83J45
$$ -203 -231 327 -23 -85 416 -87 -152 379 316 -579 155 488 -638 -483 584 126 -793 195 445 -338 -193
2356a93O18n03K4L50k34j35N27m56m61Q19p8q32M45Q88j034k25P76m2n32L26K38
$$ -193 425 -78 -54 296 62 -73 454 -2 -463 356 278 -554 -109 779 -255 -480 296 254 -278 48 286
2377B86n10m1M51m53K48m7l75P5Q00n17m36O37L19p87Q5J041o81n24O73J53o59
$$ 286 -224 -265 186 -267 -19 -66 -441 -366 434 -83 -519 118 437 -350 -265 776 95 -429 244 397 -262
2398b62M61k8j11J92q5n35J17L63l72j19P91j95r94P60O32r14j58R51n57n35P69
$$ -262 199 171 60 252 167 -368 -251 112 -260 -379 412 217 -777 -17 615 -299 -457 494 -63 -598 171
2419A71J49n01R7M78o34L22J69n26L10N43o65l55R43p7r66M96R08j096j82Q38
$$ 171 320 -181 -84 394 -240 82 251 -275 35 578 -87 -442 501 424 -542 -46 862 -234 -416 422
2439D22l15n60N83K26o45L68k88l11O16K58q32J89P18n76n73J149M7q51L45N73
$$ 422 107 -453 130 356 -289 79 -209 -520 96 354 -478 -289 429 -147 -720 429 476 -375 -30 543
2459E43n10k28O69Np19K61K86l78K66P5p47L67O21p85j80R54k74j080P63O04q78
$$ 543 33 -195 474 479 -240 21 307 -71 195 270 -477 -110 511 -274 -454 500 226 -854 -91 513 -365
2480c65j20J161p60o70J039j11n19O09k3o67O29K62j060M12J277j166q59J616
$$ -365 -485 676 -84 -754 285 174 -345 264 241 -426 203 465 -595 -183 1094 -72 -931 685
2498F85k28j152P31O55j219K26Q68p85j21N23m48k26Q95l91o79R22K71j256N90
$$ 685 457 -695 36 691 -528 -302 566 -219 -340 183 -265 -491 404 13 -666 256 527 -729 -139
2517a39R73p79m89R97k96m59M81J74n02p9J76m6J1K36l85l62M12Q0k75K14M81
$$ -139 834 55 -434 563 267 -192 289 463 -39 -118 58 12 23 259 -126 -488 -76 4 -271 -57 424
2538D24q22m63J323O3r98Q1O94o24O0Q81k04p83M92P2l48O17M3j092O29O29r86
$$ 424 -398 -861 462 525 -473 -392 302 -322 -262 619 415 -368 124 196 -152 465 508 -584 45 674 -312
2559c12J43J019p89j409J628M48j336O18O81j299K88Q99n93j90N90p02m89J267
$$ -312 -169 850 61 -1348 280 728 -608 10 691 -608 -320 579 -14 -204 386 -316 -805 462
2577D62j01j160J052J51r85K95J214q10n91P91k81k00L11J10l64K23p3o9K54K58
$$ 462 361 -799 253 404 -581 -286 928 118 -473 318 37 -163 148 258 -106 117 44 -25 229 487
2597D87n66m30K03K40k22K29L23k84n88N60N82n40m03P30l41n92Q31L95p20m1
$$ 487 -79 -509 -306 -66 -288 -59 264 -20 -608 -48 534 -6 -409 321 -20 -612 219 614 -106 -147
2617a47K82m60O07M03p39k40O94m84p14J331Q9j616Q71Q06j059M8J008p22n98
$$ -147 135 -325 282 685 -54 -294 400 -84 -798 533 622 -994 -123 683 -376 -328 680 -42 -640
2636f40R34j38m28P00k90r43J053J60p76M75P15j118l22J147q1p39M84j50m81
$$ -640 294 156 -272 428 138 -805 248 408 -368 107 822 -296 -618 529 448 -291 193 43 -438
2655d38L92M42j10j54k07k47M90R5l16p1N6M4j66J90J65j3p60L07O02m5m95M80
$$ -438 -46 396 286 132 -75 -322 168 263 -53 -124 -68 -24 -190 0 165 152 -608 -301 301 256 -239 241
2677B41J02o64J88N97j67m99M87l95j28N54k39l97O90k99p00Q48M01j047j24P26
$$ 241 343 -321 -133 464 297 -202 285 -110 -238 316 77 -320 370 71 -629 219 620 -427 -551 175
2697A75j36n97R63j31n91K46K24k65M56R9r86O21M14q40K56P30n24n39N47K82
$$ 175 39 -558 405 274 -317 -71 153 -112 344 443 -543 78 492 -348 -92 638 114 -425 122 404
2717D04n61J85K89k08k65J15J60p2l4j46l9K15k40R8P6J14k17j2K75J57k74m74
$$ 404 -157 28 317 109 -156 -41 119 47 13 -133 -172 43 -197 -99 -23 91 -126 -138 137 294 20 -454
2739d54P35Rl99M41J3l88k68M77J20l42K87l81qJ88p9k16K94J14p18M36O70o95
$$ -454 281 290 -109 332 345 -43 -311 166 286 -56 231 -150 -158 30 -49 -265 29 143 -575 -139 531 -164
2761a64k78N09k9m81O03J71m38L1K79l19L99P5n11K62L90n32j17M63l4p22L00
$$ -164 -442 67 38 -443 160 331 -107 -76 203 -116 283 358 -153 109 499 -33 -150 313 279 -443 -143
2782a43M47l91j11N4J81l00J72K28j11j39n9OJ00K23l59J69K32j00l48M30J86
$$ -143 304 -87 -198 -144 37 -263 -91 137 26 -113 -172 -166 -66 157 -202 -33 199 99 -249 181 367
2803C67m60j36M86k2l94J45L00j95j89J37J23k52N6j61M2K32j59l39M99O5n02
$$ 367 -93 -229 257 235 -159 -14 286 91 -98 39 162 -90 -34 -195 -153 79 -80 -419 80 145 -357
2824c57K97M18m43j73M81J6k85P0j05n0K90j48j06J49J87m25J26M76l10l42M43
$$ -357 -60 358 -85 -258 223 239 -46 24 -81 -131 159 11 -95 54 241 -184 -58 418 108 -234 209
2845B09j3l33l3K75k92j42J66J37r9M4O8p8J43N7k75L40K7m06K03M81m64k77L10
$$ 209 196 -137 -170 105 -187 -329 -163 -26 -125 -81 -13 -91 52 109 -166 174 201 -205 -2 479 15 -262 48
2868D8Q2k70Q3L06k33Q9r1j26m7K76k70JL02j36j91J20M58p82N8M42p6l49J51
$$ 48 130 -140 -57 249 16 105 14 -112 -159 117 -153 -152 150 14 -177 -57 401 -381 -323 119 43 -306 -155
2891a55M73m13n3K22J32l9n3k21N3L45j10k97L72r9m44J75M98n53k55P73j50o09
$$ -155 318 -95 -148 74 206 167 114 -107 -54 291 181 -116 256 157 -287 -112 386 -167 -422 351 201 -408
2913d08J84M35m19p4L34k78L6K47k87p3N60k00m21N39K86o95K58M26m38k99M88
$$ -408 -224 211 -208 -282 52 -226 -190 57 -230 -303 257 57 -364 175 461 -234 24 450 12 -287 201
2934B01N8m00R9J46k56Q8J52l88L7N24l41k02M86j25n30L99M13o76J21M17m1l66
$$ 201 259 -141 -42 104 -152 -64 88 -300 -263 261 -80 -282 204 79 -451 -52 361 -315 -194 223 182 -184
2956a84K05Pn1J39j22O1m4Q6j22N0M21o05j96N50L0m64m3N01k71l95M32J15m09
$$ -184 21 28 -23 116 -6 55 11 97 -25 25 446 -159 -355 195 225 -239 -282 219 -52 -447 -15 100 -309
2979c09J51L52l60J88L7k42J16M33n42J25K85l9n49N28K69o64O0O76l95k42L24
$$ -309 -158 194 -166 22 59 -183 -67 366 -176 -51 234 195 -354 174 443 -221 -161 515 120 -122 202
3000B02l40J12J54j63j00J91j11k65K64J89l42K02J45j86l31L37L52l43J36k78
$$ 202 -138 -26 128 -35 -135 56 -55 -320 -56 133 -209 -7 138 -48 -379 -42 310 -33 103 -175
3020a75K08Q6j26J75K59l46k21J94M2j00j67J53l0j2k91L18J89j45l09K05J84
$$ -175 33 119 -7 168 427 81 -140 54 96 -4 -171 -18 -48 -60 -351 -33 156 11 -298 -93 91
3041I1j06j95K90j70n1R2P3J28j09l7j46L56k97r7N48k34n28L84K51m39J27K18
$$ 91 -15 -210 80 -90 -141 -49 24 152 43 6 -140 216 -81 -178 370 136 -392 -8 243 -196 -69 149
3063A49j80p0K76j34l3J24n18M5O28k80l73L69J98o47K95N00k59j47L3r9P9M08
$$ 149 -31 -101 175 41 8 132 -386 -341 287 7 -366 3 201 -446 -151 349 90 -57 -24 -123 -44 364
3085C64l76l5K59m29m1P36Mp38J91K86m31J39M51l82k28O9R9j11L68l58o5L00
$$ 364 -12 -47 212 -217 -258 478 482 -256 -65 221 -210 -71 380 -2 -230 -161 -62 -173 195 -163 -228 72
3107G2O1j90K44J77n81n2N81q4j68m4j26J50q2R8J27K1k94k9J15J71k65J64j49
$$ 72 133 -57 187 364 -217 -269 312 228 60 16 -110 40 -42 56 183 204 -90 -119 -4 167 -98 66 -83
3130h3j28J88P6K12Lq38J90O28j92k74M90l01l62M10M36l65o5R0m46L01M79l04
$$ -83 -211 -23 53 265 268 -570 -380 248 56 -218 272 -29 -391 19 455 90 25 115 -331 -30 449 145
3152A45l61O25n73m20Q81L24j035J28O06o24Q4O49m35l97M37j89p7N62j85n91
$$ 145 -216 409 -164 -584 297 621 -414 -286 320 -304 -220 429 -6 -403 34 -155 -232 330 145 -446
3172d46N80O5m66K33N87n25m99O29N6l64M57o3k51o2P1K11q0j03l65J32J95N5
$$ -446 134 199 -267 -34 553 28 -471 158 214 -150 307 244 -7 -69 2 213 133 30 -335 -203 -8 47
3194D7r4o8K44k66p0M70J67p63R6L61j13k92M30R9m92J95J05J02P0K06o42J45
$$ 47 -47 -115 129 -137 -207 263 430 -333 -237 124 11 -281 149 248 -244 -49 56 158 228 434 -208 -63
3216f3K80k22M1M40l71n66N03N39o46n5N32p92R7L83l6j32J37k89k74P79J2n49
$$ -63 217 -5 36 476 105 -461 42 581 -65 -120 412 -380 -283 100 64 -68 69 -220 -494 285 297 -252
3238b52K05K88n29J72N43m01l96M36J68l71K05L2k09n4J56L6n2L00m41k69M72
$$ -252 -47 241 -288 -116 427 26 -370 66 234 -137 68 100 -109 -163 -7 29 -23 277 -164 -433 39
3259C9j18p1J84pk09o8M35Q5l23L7J36kj11N3k4jj75L22j16o8J71l91L43K40n76
$$ 39 -79 -150 34 27 -182 -250 185 270 -53 -16 120 118 7 60 36 35 -140 182 66 -2 169 -222 121 361 -215
3284b15L6L26q8l81L57J94m40q5K36K32m18L08r5n1J16m5j98L36J07m62L37K2
$$ -215 -179 147 59 -322 35 229 -211 -296 -60 172 -246 62 -33 -84 32 -13 -211 125 232 -230 107 129
3306A29n0j64L82j60l28K44J85k18M5j21O7Q8n8L0j37p1j34K17Rn0j62J28J70
$$ 129 79 -85 297 137 -191 53 238 20 65 -56 11 99 41 71 -66 -137 -271 -54 -45 -95 -257 -129 41
3329D1j81J09J09K0j05q4O5J42r8J5O6O8k40P9r8M33l84K0n2J82j13n9J98k44
$$ 41 -140 -31 78 98 -7 -91 -26 116 18 33 99 167 -73 6 -92 341 -43 -23 -75 107 -6 -65 133 -111
3353a11r6k4J97N4O6j73l2K15k52K35J00j01r6j07J90K5j8j8K01m0k50pN2R6l34
$$ -111 -207 -231 -34 20 86 -87 -119 96 -156 79 179 78 -18 -125 65 90 72 54 255 215 -35 -42 10 106 -228
3378b28K92j1N5j68J51j02j27jK22j7o4J24P4j63j11M0J3O9q7lR8J24k16r4K28
$$ -228 64 53 108 -60 91 -11 -138 -139 83 66 2 126 200 37 -74 -34 -21 48 -39 -42 56 180 -36 -130 98
3403I8k9o7J25Kk42n2K50J9j22J3Q1j53K8p0m2J25j43o0J53L56r0k85L17l3l28
$$ 98 69 2 127 129 -113 -165 85 104 -18 -5 76 -77 -49 -119 -161 -36 -179 -239 -86 270 180 -105 212 179 -149
3428a49j20M02O9k55L6P1J26L2l70K21Q1j96m8K05%m52K88J04O7l47K09K06j53
$$ -149 -269 133 202 -53 -17 54 180 212 -158 63 144 -52 -100 105 105 -347 -59 45 112 -235 -26 180 27
3451B7n3K12j41K2j32J1L11r0j90o1K09O2l05K72Q6l59R4J09O5k68J52K8j42n
$$ 27 -26 186 45 67 -65 -54 257 167 -23 -84 125 187 -118 154 240 -119 -25 84 149 -119 33 61 -81 -86
3475h6P2j22R4J3r0M8J38j1k15L63k88l09M67J84l14o4K31j59j5J32P8j27M5M8
$$ -86 -14 -136 -42 -29 -119 -71 67 56 -159 204 -84 -393 74 258 -56 -120 111 -48 -63 69 147 20 65 113
3499A13r1J84m9k57k7N00o26k5L60J36m97J11K39j34r0K22N4r7J06j3q9N4j89
$$ 113 22 206 157 -100 -127 373 -253 -278 82 218 -279 -168 71 -63 -153 69 123 26 132 119 30 84 -105
3522a05j4L68K5k27j7M1rj22J87j0k46J3J49K3j71K61n3l1j31n5l8J69rj86P5
$$ -105 -119 249 274 47 30 71 62 -60 127 117 -129 -116 33 56 -115 146 93 62 -69 -124 -162 7 -2 -188 -113
3547a13K04j08j87M79k1o42M09L61n12J25L36j87j12J61l20R3J34m5m69O87N6
$$ -113 91 -17 -204 275 254 -388 21 382 -130 -5 331 144 32 193 -127 -34 100 55 -414 273 329
3568C29o70k1P06o47m4P75j69m58R6J41k40J29M23m16oK54j47o0L24l06l86N09
$$ 329 -341 -362 344 -303 -347 428 259 -199 -103 38 -202 -73 350 -66 -72 182 35 -25 299 -7 -393 116
3590A16J89l81NL72n00q3L45K66m19k22L52k72O2J47M4j42J72k48L2M88j29m83
$$ 116 305 -76 -71 301 -199 -282 63 329 -90 -312 40 -232 -170 -23 21 -121 51 -197 -165 323 194 -289
$$ [...]
8191C2
##END NTUPLES=NMR FID
##END=
