##TITLE=1H_DPABC1503
 CDCl3
 8 sc, 
 17.03.2022
##JCAMPDX= 6.0         $$ Bruker NMR JCAMP-DX V2.0
##DATA TYPE= NMR FID
##DATA CLASS= NTUPLES
##ORIGIN= UXNMR, Bruker Analytische Messtechnik GmbH
##OWNER= root
$$ XWIN-NMR		Version 3.5
$$ Thu Mar 17 10:01:55 2022 Russian Standard Time (UT+4h)  she@DPX200
##.OBSERVE FREQUENCY= 200.131346
##.OBSERVE NUCLEUS= ^1H
##.DELAY= (6, 6)
##.ACQUISITION MODE= SIMULTANEOUS
##.ACQUISITION SCHEME= undefined
##.AVERAGES= 8
##.DIGITISER RES= 18
##SPECTROMETER/DATA SYSTEM= spect
##.PULSE SEQUENCE= zg30
##.SOLVENT NAME= D2O
##.SHIFT REFERENCE= (INTERNAL, D2O, 0, 15.7039)
##AUDIT TRAIL= $$ (NUMBER, WHEN, WHO, WHERE, WHAT)
$$ ##TITLE= Audit trail, XWIN-NMR		Version 3.5
$$ ##JCAMPDX= 5.01
$$ ##ORIGIN= Bruker BioSpin GmbH
$$ ##OWNER= she
$$ F:/spectra/data/she/nmr/H-F/1/audita.txt
$$ ##AUDIT TRAIL=  $$ (NUMBER, WHEN, WHO, WHERE, WHAT)
(   1,<2022-03-17 10:00:39.20 +0400>,<she>,<DPX200>,
      <created by zg, POWCHK disabled, PULCHK disabled
       configuration hash MD5:
       00 E9 B6 7A A2 85 ED C7 34 08 36 98 17 FE 4E 26
       data hash MD5: 16K
       36 6E 44 9A 17 62 19 8C 10 99 F6 D1 1D 8D 35 1D>)
$$ ##END=
$$ 
$$ hash MD5
$$ 61 00 3D AA 0B DE B8 DE C0 3A 08 71 4C A6 96 78
##$RELAX= 
##$RELAX= 
##$RELAX= 
##$RELAX= 
##$RELAX= 
##$RELAX= 
$$ Bruker specific parameters
$$ --------------------------
##$DU= <F:/spectra>
##$EXPNO= 1
##$NAME= <H-F>
##$PROCNO= 1
##$TYPE= <nmr>
##$USER= <she>
##$AMP= (0..31)
100 100 100 100 100 100 100 100 100 100 100 100 100 100 100 100 100 100 
100 100 100 100 100 100 100 100 100 100 100 100 100 100 
##$AQSEQ= 0
##$AQ_mod= 1
##$AUNM= <au_zg>
##$AUTOPOS= <>
##$BF1= 200.13
##$BF2= 200.13
##$BF3= 200.13
##$BF4= 200.13
##$BF5= 200.13
##$BF6= 200.13
##$BF7= 200.13
##$BF8= 200.13
##$BYTORDA= 1
##$CFDGTYP= 0
##$CFRGTYP= 5
##$CHEMSTR= <none>
##$CNST= (0..31)
1 1 145 1 1 1 1 1 1 1 1 1 1 1 1 1 1 1 1 1 1 1 1 1 1 1 1 1 1 1 1 1 
##$CPDPRG= <>
##$CPDPRG1= <>
##$CPDPRG2= <>
##$CPDPRG3= <>
##$CPDPRG4= <mlev>
##$CPDPRG5= <mlev>
##$CPDPRG6= <mlev>
##$CPDPRG7= <mlev>
##$CPDPRG8= <mlev>
##$CPDPRGB= <>
##$CPDPRGT= <>
##$D= (0..31)
0 1.2 0 0 0 0 0 0 0 0.06 0 0.03 0 0 0 0 0.0002 0 0 0 0 0 0 0 0 0 0 0 0 
0 0 0 
##$DATE= 1647496838
##$DBL= (0..7)
120 120 120 120 120 120 120 120 
##$DBP= (0..7)
150 150 150 150 150 150 150 150 
##$DBP07= 0
##$DBPNAM0= <>
##$DBPNAM1= <>
##$DBPNAM2= <>
##$DBPNAM3= <>
##$DBPNAM4= <>
##$DBPNAM5= <>
##$DBPNAM6= <>
##$DBPNAM7= <>
##$DBPOAL= (0..7)
0.5 0.5 0.5 0.5 0.5 0.5 0.5 0.5 
##$DBPOFFS= (0..7)
0 0 0 0 0 0 0 0 
##$DE= 6
##$DECBNUC= <off>
##$DECIM= 32
##$DECNUC= <off>
##$DECSTAT= 4
##$DIGMOD= 1
##$DIGTYP= 9
##$DL= (0..7)
0 120 120 120 120 120 120 120 
##$DP= (0..7)
150 150 150 150 150 150 150 150 
##$DP07= 0
##$DPNAME0= <>
##$DPNAME1= <>
##$DPNAME2= <>
##$DPNAME3= <>
##$DPNAME4= <>
##$DPNAME5= <>
##$DPNAME6= <>
##$DPNAME7= <>
##$DPOAL= (0..7)
0.5 0.5 0.5 0.5 0.5 0.5 0.5 0.5 
##$DPOFFS= (0..7)
0 0 0 0 0 0 0 0 
##$DQDMODE= 0
##$DR= 18
##$DS= 0
##$DSLIST= <SSSSSSSSSSSSSSS>
$$ [...]
##$SUBNAM2= <"">
##$SUBNAM3= <"">
##$SUBNAM4= <"">
##$SUBNAM5= <"">
##$SUBNAM6= <"">
##$SUBNAM7= <"">
##$SUBNAM8= <"">
##$SUBNAM9= <"">
##$SW= 18.0517287032376
##$SWIBOX= (0..15)
0 0 2 0 0 0 0 0 0 0 0 0 0 0 0 0 
##$SW_h= 3612.71676300578
##$TD= 16384
##$TD0= 1
##$TE= 0
##$TE2= 300
##$TE3= 300
##$TEG= 300
##$TL= (0..7)
0 120 120 120 120 120 120 120 
##$TP= (0..7)
150 150 150 150 150 150 150 150 
##$TP07= 0
##$TPNAME0= <>
##$TPNAME1= <>
##$TPNAME2= <>
##$TPNAME3= <>
##$TPNAME4= <>
##$TPNAME5= <>
##$TPNAME6= <>
##$TPNAME7= <>
##$TPOAL= (0..7)
0.5 0.5 0.5 0.5 0.5 0.5 0.5 0.5 
##$TPOFFS= (0..7)
0 0 0 0 0 0 0 0 
##$TUNHIN= 0
##$TUNHOUT= 0
##$TUNXOUT= 0
##$USERA1= <user>
##$USERA2= <user>
##$USERA3= <user>
##$USERA4= <user>
##$USERA5= <user>
##$V9= 5
##$VALIST= <valist>
##$VCLIST= <CCCCCCCCCCCCCCC>
##$VD= 0
##$VDLIST= <DDDDDDDDDDDDDDD>
##$VPLIST= <PPPPPPPPPPPPPPP>
##$VTLIST= <TTTTTTTTTTTTTTT>
##$WBST= 1024
##$WBSW= 4
##$XGAIN= (0..3)
0 0 0 0 
##$XL= 0
##$YL= 0
##$YMAX_a= 441101
##$YMIN_a= -482197
##$ZGOPTNS= <>
##$ZL1= 120
##$ZL2= 120
##$ZL3= 120
##$ZL4= 120
##$ABSF1= 10
##$ABSF2= 0
##$ABSG= 5
##$ABSL= 3
##$ALPHA= 0
##$AQORDER= 0
##$ASSFAC= 0
##$ASSFACI= 0
##$ASSFACX= 0
##$ASSWID= 0
##$AUNMP= <proc_1d>
##$AZFE= 0.1
##$AZFW= 0.1
##$BCFW= 1
##$BC_mod= 2
##$BYTORDP= 1
##$COROFFS= 0
##$CY= 11.3945322036743
##$DATMOD= 1
##$DC= 2
##$DFILT= <>
##$DTYPP= 0
##$F1P= 2.36226072786647
##$F2P= -0.459571619588291
##$FCOR= 0.5
##$FTSIZE= 0
##$FT_mod= 4
##$GAMMA= 1
##$GB= 0.15
##$INTBC= 1
##$INTSCL= 1
##$ISEN= 128
##$LB= 0.24
##$LEV0= 0
##$LPBIN= 0
##$MAXI= 10000
##$MC2= 0
##$MEAN= 0
##$ME_mod= 0
##$MI= 1.114404
##$NCOEF= 0
##$NC_proc= 0
##$NLEV= 6
##$NOISF1= 3.799351
##$NOISF2= 2.8
##$NSP= 1
##$NTH_PI= 0
##$NZP= 0
##$OFFSET= 15.70392
##$PC= 1
##$PHC0= -16945.69
##$PHC1= 10.00078
##$PH_mod= 1
##$PKNL= yes
##$PPARMOD= 0
##$PSCAL= 0
##$PSIGN= 0
##$REVERSE= no
##$SF= 200.130013532006
##$SI= 16384
##$SIGF1= 3
##$SIGF2= 2
##$SINO= 400
##$SIOLD= 16384
##$SREGLST= <1H.CDCl3>
##$SSB= 0
##$STSI= 0
##$STSR= 0
##$SW_p= 3612.71676300578
##$SYMM= 0
##$S_DEV= 0
##$TDeff= 0
##$TDoff= 0
##$TI= <>
##$TILT= no
##$TM1= 0
##$TM2= 0
##$TOPLEV= 0
##$USERP1= <user>
##$USERP2= <user>
##$USERP3= <user>
##$USERP4= <user>
##$USERP5= <user>
##$WDW= 1
##$XDIM= 8192
##$YMAX_p= 0
##$YMIN_p= 0
$$ End of Bruker specific parameters
$$ ---------------------------------
##NTUPLES= NMR FID
##VAR_NAME=  TIME,          FID/REAL,        FID/IMAG
##SYMBOL=    X,             R,               I
##VAR_TYPE=  INDEPENDENT,   DEPENDENT,       DEPENDENT
##VAR_FORM=  AFFN,          ASDF,            ASDF
##VAR_DIM=   8192,          8192,            8192
##UNITS=     SECONDS,       ARBITRARY UNITS, ARBITRARY UNITS
##FACTOR=    0.0002768,     1,               1
##FIRST=     0,             0,               0
##LAST=      2.2672688,     0,               0
##MIN=       0,             -482197,         0
##MAX=       2.2672688,     441101,          0
$$ Real data points
##PAGE= N=1
##DATA TABLE= (X++(R..R)), XYDATA
0@%%%%%%%%qJ0j0J6k4L2m0M9n7P2q8J06j30J54j80K19k59K99l49M07m70N38o18
$$ 0 0 0 0 0 0 0 0 0 -8 2 -8 8 -16 16 -24 25 -32 40 -48 58 -72 82 -98 121 -138 161 -188 219 -251 287 -331
31c31P08q05R12j030J164j309J467j643J834k046K274k524K801l099L423l779
$$ -331 377 -428 484 -546 618 -691 776 -867 967 -1079 1195 -1329 1472 -1627 1796 -1983
47a983M172m599N065n579O149o777P470q248R125j0114J1244j2552J4081j5899
$$ -1983 2189 -2410 2655 -2924 3225 -3552 3918 -4330 4795 -5319 5925 -6627 7454 -8445
61h445J8106k0849K4366k9067L5696m5828O3416j02452L44273j26206m46844N82592
$$ -8445 9661 -11188 13178 -15889 19807 -26021 37395 -65057 279216 153010 -293834 288758
73B88758J31354m83767j95686M35656P4798m25369k54119L54221K64105l14943
$$ 288758 420112 -63655 -259341 176315 251113 -174256 -428375 -74154 189951 -124992
83a24992l04370M00133L03886m30918k56174N42761K58708m65536j69183M42866
$$ -124992 -429362 -29229 274657 -156261 -412435 130326 389034 -76502 -245685 197181
93A97181R8314l93036r2825L45030J09104l16249j97086K72810K21002k84112
$$ 197181 295495 -97541 -190366 154664 263768 -52481 -249567 23243 244245 -39867
103c9867k20621L50421K09716m07187k03588M07017J52282l80339r9626L33720
$$ -39867 -260488 89933 299649 -107538 -311126 95891 248173 -132166 -231792 101928
113A01928N3536l08244p7417K81476J45583k33469j65172K53946J88212k86329
$$ 101928 155464 -152780 -230197 51279 196862 -36607 -201779 52167 240379 -45950
123d5950j73281L52667J76138l68223j54408L34948Q5408l33002p7554K94415
$$ -45950 -219231 133436 309574 -58649 -213057 121891 207299 -125703 -203257 91158
133I1158P3987k85549j19304K62347J55721k44735j41279L00981J62973l28055
$$ 91158 165145 -120404 -239708 22639 178360 -66375 -207654 93327 256300 -71755
143g1755j50949L58472J44324l49948j22280L18923P4359l33298r3150L07192
$$ -71755 -222704 135768 280092 -69856 -192136 126787 201146 -132152 -225302 81890
153H1890R8571l10594j33516L01178J47218l02265j25127L52480J42031l53148
$$ 81890 180461 -130133 -263649 37529 184747 -117518 -242645 109835 251866 -101282
163a01282j17725L70036J15698l49587r1461L35669P3121l40697r3311L20904
$$ -101282 -219007 151029 266727 -82860 -174321 161348 234469 -106228 -199539 121365
173A21365R5192l30075j16802L18052J02615l36713r9772L45605R4134l41374
$$ 121365 216557 -113518 -230320 87732 190347 -146366 -246138 99467 193601 -147773
183a47773p7425L36536P2186l14291n7500L10349O7669k94298o6938K94738P7887
$$ -147773 -225198 111338 183524 -130767 -188267 122082 189751 -104547 -171485 123253 201140
194B01140k85425p2304K88559O7039k91746o4197K80662M8466k78845n1527K58196
$$ 201140 -84285 -156589 131970 199009 -92737 -156934 123728 172194 -106651 -158178 100018
205A00018M1787k57123n0853K44891M8632k42721n0976K43860N3697k40373m4216
$$ 100018 141805 -115318 -166171 78720 127352 -115369 -166345 77515 131212 -109161 -153377
216a53377K47728M6969k36691l6685K36994L8561k30010l4636K30442L7638k28228
$$ -153377 94351 141320 -95371 -132056 104938 143499 -86511 -121147 109295 146933 -81295
227h1295m0168K27647M1379k31568m2801K31334L4296k39679l7826K35002L0798
$$ -81295 -121463 106184 147563 -84005 -126806 104528 138824 -100855 -138681 96321 127119
238A27119k40803l4536K36971L0678k37577l0496K39949L3732k40734k9366K51246
$$ 127119 -113684 -148220 88751 119429 -118148 -148644 91305 125037 -115697 -145063 106183
249A06183L3841k48301k5370K55419K7561k53832k2244K56646J8204k59061j8471
$$ 106183 140024 -108277 -133647 121772 149333 -104499 -126743 129903 148107 -110954 -129425
260a29425K58155J6658k61935j7836K63134J3702k67033j2287K64966O009k70725
$$ -129425 128730 145388 -116547 -134383 128751 142453 -124580 -136867 128099 134108 -136617
271a36617q669K67266Q67k70953j894K67336R89k64199L126K67650q94k60582
$$ -136617 -145286 121980 122847 -148106 -150000 117336 118325 -145874 -142748 124902 124008 -136574
283a36574J0138K65920m398k56560J1193K59274q409k52673J0956K45634j6759
$$ -136574 -126436 139484 135086 -121474 -110281 148993 140584 -112089 -101133 144501 127742
294A27742k47287J0415K36675j9248k40282J3488K29837j7021k26544J5904K22015
$$ 127742 -119545 -109130 127545 108297 -131985 -118497 111340 94319 -132225 -116321 105694
305A05694j6210k16546J9945K14466j6640k07277J9820K08146j4543j99491K0042
$$ 105694 89484 -127062 -107117 107349 90709 -116568 -96748 111398 96855 -102636 -82594
316h2594J99601j7062j94159J8343J92315j9379j93181J6995J88659j9522j89908
$$ -82594 117007 99945 -94214 -75871 116444 97065 -96116 -79121 109538 90016 -99892
327i9892J5872J86122k0053j90293J7318J87267k1925j90890J9212J91431j9821
$$ -99892 -84020 102102 82049 -108244 -90926 96341 74416 -116474 -97262 94169 74348
338G4348j91912K3139J95096k2038j93221K7388J99300k5296j98717L0710K04111
$$ 74348 -117564 -94425 100671 78633 -114588 -87200 112100 86804 -111913 -81203 122908
349A22908k7918k02142L2315K07113l2888k08440L5204K08073m1870k15190L7918
$$ 122908 94990 -107152 -74837 132276 99388 -109052 -73848 134225 92355 -122835 -84917
360h4917K09978m6201k15811M4287K12342m7703k12511M8804K13416m8877k12712
$$ -84917 125061 78860 -136951 -92664 119678 71975 -140536 -91732 121684 72807 -139905
371a39905N2744K17492n1329k13977N7386K18040n6666k14283O2272K12399o4855
$$ -139905 -87161 130331 79002 -134975 -77589 140451 83785 -130498 -68226 144173 79318
382G9318k09665O5162K07944o3814k05536O2952K03914o3302k05500O1907K03062
$$ 79318 -130347 -65185 142759 78945 -126591 -63639 140275 76973 -128527 -66620 136442
393A36442o7686k07084O5436J98887p3615j97959P1159J88505p1651j83051P0573
$$ 136442 68756 -138328 -72892 125995 52380 -145579 -74420 114085 42434 -140617 -70044
404g0044J81246o1093j71266O4409J78227n5978j73262O1575J77305n9704j71127
$$ -70044 111202 50109 -121157 -56748 121479 65501 -107761 -46186 131119 71415 -99712
415i9712O3321J64147o9275j62790O4322J51390o5367j51410N3449J43525n2056
$$ -99712 -36391 127756 58481 -104309 -39987 111403 46036 -105374 -51925 91600 39544
426C9544j47456M9968J52093n1235j57702N2265J59179n5502j54222O5340J53306
$$ 39544 -107912 -57944 94149 42914 -114788 -62523 96656 41154 -113068 -47728 105578
437A05578o6987j47527O7724J49577n7242j43453N7753J48566n6296j53360N9916
$$ 105578 38591 -108936 -41212 108365 51123 -92330 -34577 113989 57693 -95667 -35751
448c5751J63124o3923j71150O3899J63415p8637j65849Q0453J59169q7036j63625
$$ -35751 127373 63450 -107700 -43801 119614 40977 -124872 -44419 114750 27714 -135911
459a35911P9473J59490p5714j55632P9642J63525p7852j67341Q5170J78362q2370
$$ -135911 -56438 103052 27338 -128294 -48652 114873 37021 -130320 -45150 133212 50842
470E0842j71530R1230J69292r7565j67140J01057J65316r9071j63557R1655J56412
$$ 50842 -120688 -29458 139834 42269 -124871 -23814 141502 42431 -121126 -29471 126941
481A26941r3360j59984R3464J63489r6385j68075R3084J62723r6931j58641J02148
$$ 126941 33581 -126403 -32939 130550 34165 -133910 -40826 121897 24966 -133675 -31527
492c1527J55989j04981j56572R9847J53702r3009j45754R7051J45379r9011j44859
$$ -31527 124462 19481 -137091 -37244 116458 23449 -122305 -25254 120125 21114 -123745
503a23745J02850J49381r3470j41345R1430J33285r3611j30116R5980J33598r2496
$$ -123745 -20895 128486 35016 -106329 -14899 118386 24775 -105341 -9361 124237 31741
514C1741j38598Q2684J30740q6954j26689R0029J20833r6949j25951Q8396J20936
$$ 31741 -106857 -24173 106567 19613 -107076 -17047 103786 6837 -119114 -30718 90218
525I0218q0095j11843P8074J08667p7186j11504Q0138J25006p1417j22893P5609
$$ 90218 10123 -101720 -23646 85021 7835 -103669 -23531 101475 30058 -92835 -17226
536a7226J22261p9928j14908R2077J15928r4367j16090Q4841J05550q2716j05840
$$ -17226 105035 25107 -89801 2276 118204 23837 -92253 -7412 98138 15422 -90418
547i0418P6211J05262q1550j19773Q0352J27626q4175j30834R3474J28762j06017
$$ -90418 -14207 91055 9505 -110268 -29916 97710 13535 -117299 -23825 104937 -1080
558a080j22170J15757J18643j11376j08843J07633J08452r8297j08709R7015J19815
$$ -1080 -123250 -7493 111150 -226 -109069 -1436 107016 8719 -99990 -2975 116840
569A16840r5399j29026J01629J35665j12893j34831J25109J26718j34540j20298
$$ 116840 21441 -107585 -5956 129709 16816 -118015 7094 133812 -728 -121026
579a21026J28772J04399j26648j02376J13167R9232j08347j09324J05461J21345
$$ -121026 7746 112145 -14503 -116879 -3712 95520 -12827 -122151 -16690 104655
589A04655j05808j23172J18785J25489j26108j14046J37985J07768j34661r3983
$$ 104655 -1153 -124325 -5540 119949 -6159 -120205 17780 125548 -9113 -103096
599a03096J28540Q6293j16092q3974J05208Q7279j03171j00013J01244J06459
$$ -103096 25444 111737 -4355 -88329 16879 104158 987 -99026 2218 108677
609A08677j08241j10313J13885J01719j23881r2471J25296P9631j21799p4818
$$ 108677 436 -109877 4008 105727 -18154 -110625 14671 94302 -27497 -102315
619a02315J05812P1245r2176p2127Q7937Q2839q5931q9224R7604J01616r9084
$$ -102315 3497 74742 -17434 -89561 -1624 81215 -4716 -93940 3664 105280 6196
630F196r3309J08498Q2483j11219p0020J08804O2818j03030o8957Q4537O7134
$$ 6196 -87113 21385 103868 -7351 -77371 31433 94251 -8779 -77736 6801 73935
641G3935q1892p6957Q0444Q1528r3314r0390J02999R2177j05545q0117J11027
$$ 73935 -7957 -84914 -4470 77058 -16256 -106646 -3647 88530 -17015 -97132 13895
652A3895P1670j09909o2170J10205O5775j00886o9209R4663P5003r5263p8931
$$ 13895 85565 -24344 -86514 23691 89466 -11420 -80629 14034 89037 -6226 -85157
663h5157J05890Q5053j16123q7375J23443Q1709j27640p3004J28021O1763j29665
$$ -85157 20733 105786 -10337 -97712 25731 107440 -20200 -93204 34817 96580 -33085
674c3085o3518J20494O3255j17087p1369J14145P3860j20967p7434J31546Q1260
$$ -33085 -96603 23891 87146 -29941 -101310 12835 86695 -34272 -111706 19840 101100
685A01100j34966p2518J41182O6465j36949n4042J36037N4427j27231n5763J19313
$$ 101100 -33866 -106384 34798 101263 -35686 -89728 46309 100736 -26495 -82258 37055
696C7055N8442j17307o2960J17677O3935j25832o7984J27256O2221j29340n5446
$$ 37055 95497 -21810 -84770 32907 96842 -28990 -96974 30282 92503 -36837 -92283
707i2283J25492M5676j24132m4261J17741M5550j10130m7934J05733N1597j04147
$$ -92283 33209 78885 -45247 -89508 28233 73783 -36347 -84281 21452 73049 -31098
718c1098n1697J11581N7061j11883n2646J15565N0555j11184m3067J10089L9159
$$ -31098 -82795 28786 85847 -26036 -78682 36883 87438 -23746 -66813 43276 82435
729H2435j07625m1329R9748M1212r7938m7447R4000M5689j00324n0197J01485
$$ 82435 -25190 -66519 33229 74441 -23497 -70944 23056 68745 -31579 -81776 19709
740A9709M8483j04265m6221J04780M3128j02564l7609J03296L9453r8255l8633
$$ 19709 68192 -36073 -82294 22486 65614 -36950 -74559 28737 68190 -30065 -68698
751f8698R8905M3751r6831m2096J00720M4120j03299m4415J06900M2027j10351
$$ -68698 30207 73958 -22873 -64969 35751 79871 -23428 -67843 39057 81084 -29267
762b9267m0563J09480L5898j12327l7713J09668L4633j13121l7215J12444L6275
$$ -29267 -69830 39650 75548 -36779 -74492 35176 69809 -43312 -80527 31917 68192
773F8192j15282l6584J18474L7427j20086l3931J23726L3827j22572k8987J25828
$$ 68192 -47090 -83674 34800 72227 -47859 -81790 41936 75763 -46809 -75796 50032
784E0032L0305j23686k6854J25486K7127j23612k6497J23090K4864j25474k5581
$$ 50032 80337 -43349 -70203 55283 82410 -41202 -67699 55391 80255 -45219 -70800
795g0800J22906K1874j24796k3461J21437K0096j22414k0727J19138J8520j17928
$$ -70800 52106 73980 -50816 -74277 47160 67256 -55158 -75885 43253 61773 -56155
806e6155j8333J16509J9443j13168j6670J14257J9659j09345j6721J10226J8588
$$ -56155 -74488 42021 61464 -51704 -68374 45883 65542 -43803 -60524 49702 68290
817F8290j07041j6703J06219J6981j04642j7215J02559J6319j02876j8296R9209
$$ 68290 -38751 -55454 50765 67746 -36896 -54111 48448 64767 -38109 -56405 42804
828D2804J4778j00727j7786R6922J5318r8349j6480R7114J6248r5892j5132R6291
$$ 42804 57582 -43145 -60931 35991 51309 -47040 -63520 33594 49842 -46050 -61182 35109
840C5109J6583r4299j4290R6169J5840r3467j3553R6010J5603r3883j4134R5328
$$ 35109 51692 -42607 -56897 39272 55112 -38355 -51908 44102 59705 -34178 -48312 47016
852D7016J3962r5608j4546R4544J2702r7159j4212R6374J1199r8982j2582R7394
$$ 47016 60978 -34630 -49176 45368 58070 -39089 -53301 43073 54272 -44710 -57292 40102
864D0102J0166j00477j0754R9996Q707j01024p152J03188Q138j02257m616J06501
$$ 40102 50268 -50209 -60963 39033 47740 -53284 -60436 42752 50890 -51367 -55983 50518
876E0518N920j04595k034J08074K363j07862R86J09094k635j09967L063J08321
$$ 50518 56438 -48157 -50191 57883 60246 -47616 -46630 62464 59829 -50138 -47075 61246
888F1246o253j10781M233J08276q108j10849O429J08888q392j10616R423J10389
$$ 61246 54993 -55788 -51555 56721 48613 -62236 -55807 53081 44689 -65927 -56504 53885
900E3885j0265j08665J2827J08512j1752j04331J4054J04841j1790j00043J2751
$$ 53885 43620 -65045 -52218 56294 44542 -59789 -45735 59106 47316 -52727 -39976
911c9976J00771r839r8879J0047R9115j0586r9270R893R6048j3280r7174J1430
$$ -39976 60795 50956 -47923 -37876 61239 50653 -48617 -38724 57324 44044 -53130 -41700
923d1700R1582j4862r1400J1308Q6676j0381q5784Q539Q6896o211q5983Q520Q9465
$$ -41700 49882 35020 -56380 -45072 41604 31223 -54561 -46022 40874 34663 -51320 -42800 46665
936D6665o113q6979J0365Q8212j0920q5038J3458Q3196j2165q1563R403P9113
$$ 46665 40552 -46427 -36062 52150 41230 -43808 -30350 52846 40681 -40882 -31479 47634
948D7634q587q0831O389Q2343p742q6881P028Q8053j1053q8962J3730Q5726j7782
$$ 47634 39047 -41784 -35395 46948 39206 -47675 -40647 47406 36353 -52609 -38879 46847 29065
961B9065q5010J7332Q3388j5443q1827J4662Q3439j1531q4063J3780R0920j3564
$$ 29065 -55945 -38613 44775 29332 -52495 -37833 45606 34075 -49988 -36208 54712 41148
973D1148r1803J9201R3717k2667r2028K6721Q9554k8597q8742K6216Q3725k6421
$$ 41148 -50655 -31454 62263 39596 -52432 -25711 63843 35246 -53496 -27280 56445 30024
985C0024q5857K2786Q7018k4498r3571K4801R4727k8721r4830L4010R3532l7961
$$ 30024 -55833 -33047 53971 29473 -64098 -39297 55430 26709 -68121 -34111 59421 21460
997B1460r0042M0814Q8095l6472q1848L5695Q2882l1863q3285L3185Q8825l1611
$$ 21460 -68582 -27768 60327 23855 -57993 -22298 60584 28721 -54564 -21379 67446 35835
1009C5835r0581L3484Q8561l9211q7295M1751Q1645m4975q1232L7217P3886l4571
$$ 35835 -54746 -21262 67299 28088 -59207 -17456 64189 19214 -62018 -24801 49085 14514
1021A4514p2151L0499P2545l0086p6774K9930Q1812k7629p8604L3500P7371l5622
$$ 14514 -57637 -27138 45407 15321 -61453 -31523 50289 22660 -55944 -22444 54927 19305
1033A9305p0365L9674O9810l4331o5293K9245O1921k5613o3656K3091O7249k5090
$$ 19305 -51060 -11386 58424 24093 -41200 -11955 49966 24353 -39303 -16212 51037 25947
1045B5947p4749K4049P3675l0570p2869L4474O8294l8770o6662L5795O3141l0210
$$ 25947 -48802 -24753 48922 18352 -54517 -20043 48251 9481 -57181 -21386 41755 11545
1057A1545n9817K8340O3094k6123o7139K8943P5349k8620p4645L4215P3144m0289
$$ 11545 -48272 -19932 43162 17039 -50100 -21157 54192 25572 -49073 -14858 58286 17997
1069A7997p0568M5508O8805m3939o6234L7935O0780l7575o2977L6526O6424l8853
$$ 17997 -52571 -7063 61742 17803 -48431 -10496 50284 12709 -50268 -13742 52682 13829
1081A3829p4733L7367P5436m0945p2325M8466O9388n4611o7752N5069O7093m8088
$$ 13829 -60904 -23537 51899 10954 -61371 -12905 56483 1872 -65880 -10811 56282 8194
1093H194o0928M6323N9341m5382o0949M8853O9465m7252p2415M8141O9442n3357
$$ 8194 -52734 -6411 52930 7548 -53401 -4548 64917 17665 -54750 -6609 62833 9476
1105I476o5474N8611O2213o1573o2619N5223N7411n1847n5288M8468N4667n1131
$$ 9476 -55998 2613 64826 3253 -59366 -4143 53268 1421 -53867 -5399 49268 -1863
1117a863o0622N0621O3686m9026o0878N1764N8050n3783n3945N7173N5161n1158
$$ -1863 -62485 -11864 51822 2796 -58082 -6318 51732 -2051 -55996 1177 56338 5180
1129E180n1471M7603M9536m3989m8801M5464N1393m5406n5355M1814N2305m3281
$$ 5180 -46291 1312 50848 6859 -41942 3522 54915 9509 -45846 -4032 48273 4992
1141D992n1913M3516M8750m7450n0678M2991M9768m0456m7648M0131M7143m1203
$$ 4992 -46921 -3405 45345 -2105 -52783 -9792 39976 -480 -48128 -7997 39146 -2057
1153b057m8001M4189N2525m0267m9956M1857M9421m2724m6296M6778M8543m5977
$$ -2057 -50058 -5869 46656 6389 -43567 -1710 47711 4987 -41309 5469 54012 8035
1165H035n0226M3600M8297m5487m7844M6616M6184n1729n0665N0152M8619n1105
$$ 8035 -42191 1409 49706 4219 -43625 2991 49175 -2554 -53219 -3067 45552 -5553
1177e553m6429N1067M3524n2758m4144N4124M7850n1920m6659N3172M7250n3811
$$ -5553 -51982 -915 42609 -10149 -54293 -169 47681 -4239 -50898 2274 49524 -4287
1189d287m4465N9432M5948n9992m4522N9736M2000n8029m0002N7109L8615n8579
$$ -4287 -48752 10680 56628 -3364 -47886 11850 53850 -4179 -44181 12928 51543 -7036
1201g036m1237N6519M1236n8213m2922N7939M0830o2025m0789O2891L8390o2090
$$ -7036 -48273 8246 49482 -8731 -51653 6286 47116 -14909 -55698 7193 45583 -16507
1213a6507l5537O1146L4728n8414l2390N8778L5095n5636l4808N6140L7267n6109
$$ -16507 -52044 9102 43830 -14584 -46974 11804 46899 -8737 -43545 12595 49862 -6247
1225f247l5572N7523L5222n8466l4585N7328L1630n7376l1225N3123K8682n2604
$$ -6247 -41819 15704 50926 -7540 -42125 15203 46833 -10543 -41768 11355 40037 -12567
1237a2567l0695M8790L1140m8570l2998M8380L3514m8939l3164N0617L3448m9143
$$ -12567 -43262 5528 36668 -11902 -44900 3480 36994 -11945 -45109 5508 38956 -10187
1249a0187l0399N0289L0126m7295k7482M7340K9597m5666l0085M5229L1410m5949
$$ -10187 -40586 9703 39829 -7466 -34948 12392 41989 -3677 -33762 11467 42877 -3072
1261c072l2737M6537L1112m9964l2003M9417K9141n1774k9579N0473K7639n1277
$$ -3072 -35809 10728 41840 -8124 -40127 9290 38431 -13343 -42922 7551 35190 -16087
1273a6087k7208N0899K7342n0741k6765N2777K8705n2793k6566N5930K7681n5405
$$ -16087 -43295 7604 34946 -15795 -42560 10217 38922 -13871 -40437 15493 43174 -12231
1285a2231k5161N7531K4541n7725k3086N7803K1926n8652k2406N7295K1205n9072
$$ -12231 -37392 20139 44680 -13045 -36131 21672 43598 -15054 -37460 19835 41040 -18032
1297a8032k2618N7998K0442n9910k1055N9117J9486o0242j8781O0623J8449n9304
$$ -18032 -40650 17348 37790 -22120 -43175 15942 35428 -24814 -43595 17028 35477 -23827
1309b3827j6701N9863J7674n8123j5851N9588J6572n7824j5165N8661J5775n7827
$$ -23827 -40528 19335 37009 -21114 -36965 22623 39195 -18629 -33794 24867 40642 -17185
1321a7185j5318N7442J3745n7370j4246N5289J2392n6140j4034N4438J2627n4797
$$ -17185 -32503 24939 38684 -18686 -32932 22357 34749 -21391 -35425 19013 31640 -23157
1333b3157j3429N3124J2970n2939j2658N2545J3078n1504j2031N1992J3649m9984
$$ -23157 -36586 16538 29508 -23431 -36089 16456 29534 -21970 -34001 17991 31640 -18344
1345a8344j2429N0931J3914m9170j2555M8969J3571m8733j3725M8181J3431m8921
$$ -18344 -30773 20158 34072 -15098 -27653 21316 34887 -13846 -27571 20610 34041 -14880
1357a4880j4243M7411J3031m8752j4271M6884J2431m8442j3463M7708J2548m7848
$$ -14880 -29123 18288 31319 -17433 -31704 15180 27611 -20831 -34294 13414 25962 -21886
1369b1886j2388M8484J3142m8159j1540M9965J2590m8995j0424N1497J0941n0534
$$ -21886 -34274 14210 27352 -20807 -32347 17618 30208 -18787 -29211 22286 33227 -17307
1381a7307q921N1616Q610n1605q409N1615P031n3409p596N2290N334n4570o203
$$ -17307 -26228 25388 33998 -17607 -26016 25599 32630 -20779 -28375 23915 29249 -25321 -31524
1394c1524N3806L947n5619l754N5163K553n4909j125N5416J220n3861N53N5349
$$ -31524 22282 26229 -29390 -33144 22019 24572 -30337 -31462 23954 25174 -28687 -28134 27215
1407B7215Q83n3322R94N4804j81n4124J546N4586k239n4257K039N2481m108n3009
$$ 27215 28098 -25224 -24230 30574 30393 -23731 -22185 32401 30162 -24095 -22056 30425 26317 -26692
1421b6692L027N0548m580n1231K001M9502k781n0034K494N0136k726m9583L306
$$ -26692 -23665 26883 22303 -28928 -26927 22575 19794 -30240 -27746 22390 19664 -29919 -26613
1434b6613N0243j998m7867M237M8494k949m6275L675M7009k375m5610J779M5022
$$ -26613 23630 21632 -26235 -21998 26496 23547 -22728 -19053 27956 25581 -20029 -18250 26772
1447B6772j998m5716J281M5300k036m6575P15M4307k701m4923K338M3671k993
$$ 26772 24774 -20942 -19661 25639 23603 -22972 -22257 22050 19349 -25574 -23236 20435 17442
1460A7442m3958J798M3696n55m2165J262M3340o41m3711K292M5460o91m4096K057
$$ 17442 -26516 -24718 18978 18423 -23742 -22480 20860 20219 -23492 -21200 24260 23569 -20527 -18470
1474a8470M4867k937m4418M312M4612m435m5294L393M3456m982m4730M871M4344
$$ -18470 26397 23460 -20958 -16646 27966 23531 -21763 -18370 25086 20104 -24626 -19755 24589
1487B4589o636m6051N212M5925o487m6601Q197M6899r936m7154J1816M7943j1266
$$ 24589 17953 -28098 -22886 23039 16552 -30049 -21852 25047 15111 -32043 -20227 27716 16450
1500A6450m5456J3311M5753j2710m4070J3572M5773j2234m5841J2828M5952j4318
$$ 16450 -29006 -15695 30058 17348 -26722 -13150 32623 20389 -25452 -12624 33328 19010
1512A9010m7020J4800M6271j7151m7316J6238M3542j8629m3094J7559M1491j6991
$$ 19010 -28010 -13210 33061 15910 -31406 -15168 28374 9745 -33349 -15790 25701 8710
1524H710m1328J4975M1695j2807m0410J4622M2697j4012m2838J6453M4205j5881
$$ 8710 -32618 -17643 24052 11245 -29165 -14543 28154 14142 -28696 -12243 31962 16081
1536A6081m1098J7549L8629j7881l7387J6976L6367j4999l7122J1082L5738j1497
$$ 16081 -25017 -7468 31161 13280 -24107 -7131 29236 14237 -22885 -11803 23935 12438
1548A2438l8791J1357M0057j4175m2138J4170M0623j5896l7554J7583L6023j6566
$$ 12438 -26353 -14996 25061 10886 -31252 -17082 23541 7645 -29909 -12326 23697 7131
1560G131l3843J5393L4634j0291l3487J0008L6334r618l8445J1981M1021j3871
$$ 7131 -26712 -11319 23315 13024 -20463 -10455 25879 16261 -22184 -10203 30818 16947
1572A6947m1440J5440L8019j8502l6574J8010L3486j7424l3459J3436L2606j2369
$$ 16947 -24493 -9053 28966 10464 -26110 -8100 25386 7962 -25497 -12061 20545 8176
1584H176l4668J2027L7799j3515m0600J5939M1783j8491l9015K3040L7567k3869
$$ 8176 -26492 -14465 23334 9819 -30781 -14842 26941 8450 -30565 -7525 30042 6173
1596F173l4282K4158L3597k0790l1170J9101L2212j8592l5288J9211L8174k1906
$$ 6173 -28109 -3951 29646 8856 -22314 -3213 28999 10407 -24881 -5670 32504 10598
1608A0598m0943K3540L7634k8637l5867K9660L2286l0787l0613K7513K8888k4094
$$ 10598 -30345 -6805 30829 2192 -33675 -4015 28271 -2516 -33129 -5616 23272 -822
1620h22k7720K3350L0856k2224l2829K4823L6079k5104l4431K8466L2634k9735
$$ -822 -28542 -5192 25664 3440 -29389 -4566 31513 6409 -28022 444 33078 3343
1632C343k9677K9982K7502k8404k6615K4240K5241k2881k7201K0508K8586k1988
$$ 3343 -26334 3648 31150 2746 -23869 371 25612 2731 -24470 -3962 24624 2636
1644B636l1494K2085L1650k4588l0668K6139K8749k6340k6005K5818K5078k2807
$$ 2636 -28858 -6773 24877 289 -30379 -4240 24509 -1831 -27836 -2018 23060 253
1656B53k3531K1545K5697j9130k6805J9973K9179k0294k9854K2635K9149k4573
$$ 253 -23278 -1733 23964 4834 -21971 -1998 27181 6887 -22967 -332 28817 4244
1668D244k8620K4818K6044k5150k5591K2844K3691k2665k5339K1068K6202k1455
$$ 4244 -24376 442 26486 1336 -24255 -1411 22280 -385 -25724 -4656 21546 91
1680I1k8065K2087K8537k3579k7610K6111K7881k5951k5625K7311K5784k5871
$$ 91 -27974 -5887 22650 -929 -28539 -2428 25453 -498 -26123 1188 26972 1101
1692A101k3425K6021K4231k5353k4676K6020K4988k6916k6114K7113K4513k9942
$$ 1101 -22324 3697 27928 2575 -22101 3919 28907 1991 -24123 2990 27503 -2439
1704b439k4936K9451K2487l0968k2469K9968K1382l0478k0640L0427K1231k9710
$$ -2439 -27375 2076 24563 -6405 -28874 1094 22476 -8002 -28642 1785 23016 -6694
1716f694k0555L1069K1594l0698k0026L2847K0566l2002j9058L2741J8506l1917
$$ -6694 -27249 3820 25414 -5284 -25310 7537 28103 -3899 -22957 9784 28290 -3627
1728c627j8129L1143J7193l1639j8565L0264J7439l0905j8512L0022J7072l1132
$$ -3627 -21756 9387 26580 -5059 -23624 6640 24079 -6826 -25338 4684 21756 -9376
1740i376j7594L0495J6846k9605j6532K9516J6880k7856j5709K8649J7415k7058
$$ -9376 -26970 3525 20371 -9234 -25766 3750 20630 -7226 -22935 5714 23129 -3929
1752c929j6935K7936J7657k7205j7007K7440J6753k7678j7048K6752J6474k7132
$$ -3929 -20864 7072 24729 -2476 -19483 7957 24710 -2968 -20016 6736 23210 -3922
1764c922j7232K6122J6191k6806j7392K6342J6758k6769j7483K6732J7014k7191
$$ -3922 -21154 4968 21159 -5647 -23039 3303 20061 -6708 -24191 2541 19555 -7636
1776g636j6434K7463J6764k7443j5640K8250J6566k7220j5100K8268J6258k7848
$$ -7636 -24070 3393 20157 -7286 -22926 5324 21890 -5330 -20430 7838 24096 -3752
1788c752j5407K8785J5745k9566j5198K9088J4146l0589j4843K9353J3096l0554
$$ -3752 -19159 9626 25371 -4195 -19393 9695 23841 -6748 -21591 7762 20858 -9696
1800i696j4225L0000J2799l0735j2806L0911J2973l0812j1900L2080J2041l1178
$$ -9696 -23921 6079 18878 -11857 -24663 6248 19221 -11591 -23491 8589 20630 -10548
1812a0548j0595L2234J1046l1563r844L2328R914l2181q980L2128Q659l2115q796
$$ -10548 -21143 11091 22137 -9426 -19270 13058 22972 -9209 -18189 13939 22598 -9517 -18313
1825a8313L1833P869l2675p969L1497O692l2726p541L1536O531l2436o407L1365
$$ -18313 13520 21389 -11286 -19255 12242 18934 -13792 -21333 10203 16734 -15702 -22109 9256
1838I256O634l0959n708L1537O896l0086n337L1115O668k9515n764K9731O210
$$ 9256 15890 -15069 -20777 10760 17656 -12430 -17767 13348 20016 -9499 -15263 14468 20678
1851B0678k9183o618K8648N977k9155p063K7735O489k8729p028K7559O858k8072
$$ 20678 -8505 -15123 13525 19502 -9653 -16716 11019 17508 -11221 -18249 9310 16168 -11904
1864a1904o959K7491P125k7836o820K7513P086k7462o988K7613P385k7304o474
$$ -11904 -18863 8628 15753 -12083 -18903 8610 15696 -11766 -18754 8859 16244 -11060 -17534
1877a7534K8212P461k7398o360K8702O963k8316n965K8584N452k9034n923K8233
$$ -17534 10678 18139 -9259 -15619 13083 20046 -8270 -14235 14349 19801 -9233 -15156 13077
1890A3077M254k9528n520K8085M229k9510m740K9269M121k9656l073L0525K903
$$ 13077 17331 -12197 -17717 10368 14597 -14913 -19653 9616 13737 -15919 -18992 11533 14436
1903A4436k9454j497L0191K175k9236q89K9973J278k9316r34K9813R06l0138n07
$$ 14436 -15018 -16515 13676 15851 -13385 -14274 15699 16977 -12339 -13273 16540 17446 -12692 -13199
1917a3199L0306n41l0799N73L0084j896l0738J869K9112k977k9673K399K8548
$$ -13199 17107 16566 -14233 -13660 16424 14528 -16210 -14341 14771 11794 -17879 -15480 13068
1930A3068k477k8894K598K9477k279k8989L625L0174l314k8777M962K9208m687
$$ 13068 10591 -18303 -15705 13772 11493 -17496 -13871 16303 12989 -15788 -10826 18382 13695
1943A3695k7661N110K7167m570k6851L677K6428l849k7339K630K6702l671k7750
$$ 13695 -13966 -8856 18311 13741 -13110 -9433 16995 13146 -14193 -11563 15139 11468 -16282
1956a6282K837K7343m075k7626M446K6211m354k5593L960K5215k297k4311K250
$$ -16282 -13445 13898 9823 -17803 -13357 12854 8500 -17093 -13133 12082 9785 -14526 -12276
1969a2276K5452o38k5351J678K7309j267k7010K213K6952k965k6534L433K5147
$$ -12276 13176 12538 -12813 -11135 16174 14907 -12103 -9890 17062 14097 -12437 -9004 16143
1982A6143l945k5808K932K4106k763k5369J383K5547k585k7217K902K8028m029
$$ 16143 12198 -13610 -10678 13428 10665 -14704 -13321 12226 9641 -17576 -14674 13354 9325
1995I325k7399N474K7623n951k6029P380K6502o059k4941O282K5511n728k5420
$$ 9325 -18074 -12600 15023 9072 -16957 -9577 16925 10866 -14075 -7793 17718 11990 -13430
2008a3430O266K6380o886k7669O735K7165q924k7554R242K5803j0945k6142J0160
$$ -13430 -7164 19216 12330 -15339 -8604 18561 9637 -17917 -8675 17128 6183 -19959 -9799
2021i799K5043r807k4324R636K3976q953k4590R756K5955r331k5365J0745K5429
$$ -9799 15244 5437 -18887 -9251 14725 5772 -18818 -9062 16893 7562 -17803 -7058 18371
2034A8371j1202k4203J2733K4572j2532k3324J1572K2566j1432k1847J1051K1925
$$ 18371 7169 -17034 -4301 20271 7739 -15585 -4013 18553 7121 -14726 -3675 18250
2046A8250j1751k3519J0218K3138j0714k3862J0731K2323j2211k2672J2346K2777
$$ 18250 6499 -17020 -6802 16336 5622 -18240 -7509 14814 2603 -20069 -7723 15054
2058A5054j1414k1708J1332K1378j0113k0342J1084K2098r285k1945R171K2341
$$ 15054 3640 -18068 -6736 14642 4529 -15813 -4729 17369 8084 -13861 -4690 17651
2070A7651q796k2383J0137K2110j0829k3145R758K1934j0261k1869R499K0478
$$ 17651 8855 -13528 -3391 18719 7890 -15255 -5497 16437 6176 -15693 -6194 14284
2082A4284j0698k1504R577K1648r019k1875R097K2104r484k1728J1050K3328j0665
$$ 14284 3586 -17918 -8341 13307 4288 -17587 -8490 13614 4130 -17598 -6548 16780 6115
2095F115k2239J1827K2202j1584k0622J2693K0934j2532k1212J1620K0522j2079
$$ 6115 -16124 -4297 17905 6321 -14301 -1608 19326 6794 -14418 -2798 17724 5645
2107E645k1199J2027K0703j3975k2408J3803K1697j4768k0805J5109J9473j6132
$$ 5645 -15554 -3527 17176 3201 -19207 -5404 16293 1525 -19280 -4171 15302 -830
2119h30j8980J6655J9625j5424j8447J5031J8767j4496j8273J6249J9575j6038
$$ -830 -19810 -3155 16470 1046 -17401 -2370 16397 1901 -16372 -123 19452 3414
2131C414j9525J6736J8842j6829j8031J7652J6701j8117j7144J6415J5830j5906
$$ 3414 -16111 625 19467 2638 -15393 2259 18960 843 -16301 114 15944 38
2143C8j6713J5170J5768j5983j7167J5923J8003j6172j7448J6955J6811j7043
$$ 38 -16675 -1505 14263 -1720 -18887 -2964 15039 -1133 -18581 -1626 15185 -1858
2155a858j5036J7521J5838j6222j4721J5799J5111j4420j5150J4903J6194j5170
$$ -1858 -16894 627 16465 243 -14478 1321 16432 2012 -13138 1765 17959 2789
2167B789j6952J4928J6858j6363j6566J5868J5224j7006j5774J5315J4737j4723
$$ 2789 -14163 765 17623 1260 -15306 562 15786 -1220 -16994 -1679 13058 -1665
2179a665j5128J3956J5299j3746j6118J4687J7834j4320j6693J5355J7088j5362
$$ -1665 -16793 -2837 12462 -1284 -17402 -2715 15119 799 -15894 -539 16549 1187
2191A187j5588J6666J5783j5910j5262J4916J5037j5027j5584J4769J5194j6274
$$ 1187 -14401 2265 18048 2138 -13124 1792 16829 1802 -13782 987 16181 -93
2203i3j6374J5653J6345j7236j5857J7548J4515j8686j3911J8756J3651j8223
$$ -93 -16467 -814 15531 -1705 -17562 -14 14501 -4185 -18096 660 14311 -3912
2215c912j2976J8190J3208j7265j2571J8419J3926j8350j3442J9583J3392k0235
$$ -3912 -16888 1302 14510 -2755 -15326 3093 17019 -1331 -14773 4810 18202 -2033
2227b033j2148K0439J1059k0479j0916J9410R946j9457j0597J8417R888j9049
$$ -2033 -14181 6258 17317 -3162 -14078 5332 15278 -4179 -14776 3641 13529 -5520
2239e520j1124J9034J1000j9539j0770J9989J0341j9559r405J9999R412j8818
$$ -5520 -16644 2390 13390 -6149 -16919 3070 13411 -6148 -15553 4446 13858 -4960
2251d960q723J9082R130j7785r023J8071R858j7940j0096J8215R790j8852r992
$$ -4960 -13683 5399 14529 -3256 -12279 5792 15650 -2290 -12386 5829 15619 -3233 -13225
2264a3225J8508R156j9140r387J7965Q542j8053q948J7097R062j7473r346J7355
$$ -13225 5283 14439 -4701 -14088 3877 12419 -5634 -14582 2515 11577 -5896 -15242 2113
2277B113R872j7118r783J8254J0189j7650r032J8484R533j7687q994J8077R195
$$ 2113 11985 -5133 -14916 3338 13527 -4123 -13155 5329 14862 -2825 -11819 6258 15453
2290A5453j7595r391J7361R098j7670j0019J7471R296j8611j0155J8169R209j9158
$$ 15453 -2142 -11533 5828 14926 -2744 -12763 4708 14004 -4607 -14762 3407 12616 -6542
2303f542r324J8698Q960j8793q340J9141Q558j8578p682J9372Q318j8842p429
$$ -6542 -15866 2832 11792 -7001 -15341 3800 12358 -6220 -13902 5470 13788 -5054 -12483
2316a2483J9659P749j9335p197J9875O591k0359o043J9862N545k0579n649J9768
$$ -12483 7176 14925 -4410 -11607 8268 14859 -5500 -11543 8319 13864 -6715 -12364 7404
2329G404M846k0407n151J9857M323k0320m168K0145L800k0247l573K0509L554
$$ 7404 12250 -8157 -13308 6549 10872 -9448 -13616 6529 10329 -9918 -13491 7018 10572
2342A0572j9680k975K0194L568j9319k721K0041L138j9170l029J9408L084j9460
$$ 10572 -9108 -12083 8111 11679 -7640 -10361 9680 12818 -6352 -9381 10027 13111 -6349
2355f349l148J8613K769j9369l358J8484K723j8979l602J8402L018j8420l320
$$ -6349 -9497 9116 11885 -7484 -10842 7642 10365 -8614 -12216 6186 9204 -9216 -12536
2368a2536J8323L397j8129l204J8517L639j7932k990J8508L701j7851l035J8484
$$ -12536 5787 9184 -8945 -12149 6368 10007 -7925 -10915 7593 11294 -6557 -9592 8892
2381H892L445j8073l465J8125L703j8450l967J8088L490j8627m170J8154L277
$$ 8892 12337 -5736 -9201 8924 12627 -5823 -9790 8298 11788 -6839 -11009 7145 10422
2394A0422j8837l868J8222L188j8650l189J8432L368j8282k812J9149L383j8655
$$ 10422 -8415 -12283 5939 9127 -9523 -12712 5720 9088 -9194 -12006 7143 10526 -8129
2407h129k576J9581K874j8672k193J9316J837j8864j808J8869J478j9462j502
$$ -8129 -10705 8876 11750 -6922 -9115 10201 12038 -6826 -8634 10235 11713 -7749 -9251
2420i251J8839N50j9590r02J9041j58j9449j68J9324o40j9061J275J8752r39j8637
$$ -9251 9588 10138 -9452 -10354 8687 8529 -10920 -11088 8236 7596 -11465 -10190 8562 7623 -11014
2435a1014J553J8952j272j8285K118J8811j674j8481K656J8861k636j8371K757
$$ -11014 -9461 9491 8219 -10066 -7948 10863 9189 -9292 -6636 12225 9589 -8782 -6025
2448f025J7878l125j8209L012J7365l326j8001K280J7343k787j7758K335J7591
$$ -6025 11853 8728 -9481 -6469 10896 7570 -10431 -8151 9192 6405 -11353 -9018 8573
2461H573k713j7965K899J8029k767j6845L310J6965k400j6413K654J6945j542
$$ 8573 5860 -12105 -9206 8823 6056 -10789 -7479 9486 7086 -9327 -6673 10272 8730
2474H730j6522J521J7002j537j7444J848J7717k309j7756J693J6780k648j6709
$$ 8730 -7792 -6271 10731 9194 -8250 -6402 11315 9006 -8750 -7057 9723 7075 -9634
2487i634J858J6284k343j7024J469J6838j207j7221J710J7832k227j7491K827
$$ -9634 -7776 8508 6165 -10859 -9390 7448 6241 -10980 -9270 8562 6335 -11156 -8329
2500h329J8556k494j7536L769J7165l243j6311L555J7013l066j7311K166J7082
$$ -8329 10227 7733 -9803 -6034 11131 7888 -8423 -4868 12145 9079 -8232 -6066 11016
2513A1016k831j7961L140J7692m461j8810M448J7402m935j7150N287J6244n542
$$ 11016 8185 -9776 -6636 11056 6595 -12215 -7767 9635 4700 -12450 -7163 9081 3539
2526C539j5976N219J6854m345j6303M804J7310m993j6946O566J7805o839j6887
$$ 3539 -12437 -7218 9636 5291 -11012 -6208 11102 6109 -10837 -4271 13534 6695 -10192
2539a0192P351J6197q091j5158P668J4678p768j5501O373J4800o673j5842O867
$$ -10192 -2841 13356 5265 -9893 -2225 12453 4685 -10816 -4443 10357 3684 -12158 -5291
2552e291J5736q068j6255Q370J6007q416j4793Q974J4078q352j3038Q249J3981
$$ -5291 10445 2377 -13878 -5508 10499 2083 -12710 -3736 10342 1990 -11048 -2799 11182
2565A1182o637j3811O410J4623o236j4876O967J5464p845j5411P490J4328q191
$$ 11182 4545 -9266 -2856 11767 5531 -9345 -2378 13086 5241 -10170 -2680 11648 3457
2578C457j4006P111J3396p341j3953N871J4072n560j4582N427J5494o043j5647
$$ 3457 -10549 -3438 9958 2617 -11336 -5465 8607 3047 -11535 -6108 9386 3343 -12304
2591a2304P115J6127p110j5023Q064J4585p334j3682P363J3935o494j4035O185
$$ -12304 -5189 10938 3828 -11195 -3131 11454 4120 -9562 -2199 11736 5242 -8793 -2608
2604b608J4404o415j5484O835J5482q082j5784P913J4747r237j4449Q986J3741
$$ -2608 11796 5381 -10103 -3268 12214 4132 -11652 -3739 11008 1771 -12678 -3692 10049
2617A0049r209j3427Q451J3545p689j3574Q451J4272q140j4570R470J5087r465
$$ 10049 840 -12587 -4136 9409 1720 -11854 -3403 10869 2729 -11841 -2371 12716 3251
2630C251j4177J0728J3453j0901j2585J0637J2346j0089j2714R327J1974r994
$$ 3251 -10926 -198 13255 2354 -10231 406 12752 2663 -10051 -724 11250 1256
2642A256j2798R628J2913j0764j3373J0525J2714j1395j1960J1936J1747j1841
$$ 1256 -11542 -1914 10999 235 -13138 -2613 10101 -1294 -13254 -1318 10429 -1412
2654a412j0969J1800J1294j0351j0310J0737J1009j0399j1123J0993J1691j0869
$$ -1412 -12381 -581 10713 362 -9948 789 11798 1399 -9724 1269 12960 2091
2666B091j1605J0819J0705j1574j1020J1154J0289j1295j0806J0177J0209j0200
$$ 2091 -9514 1305 12010 436 -10584 570 10859 -436 -11242 -1065 9144 -1056
2678a056j0452R815J0795r855j1164R699J1726r583j1311J0588J1790j0161j1332
$$ -1056 -11508 -1693 9102 -753 -11917 -2218 9508 -75 -11386 -798 10992 831 -10501
2691a0501J0890J1409r681j0876R637J1092r807j1529R777J1433j0228j2125R541
$$ -10501 389 11798 2117 -8759 878 11970 2163 -9366 411 11844 1616 -10509 -968
2704i68J1503j0808j1712J0655J1134j1074j1244J0729J1340j0771j0575J1326
$$ -968 10535 -273 -11985 -1330 9804 -1270 -12514 -1785 9555 -1216 -11791 -465
2716d65J0822j0901j0365J1263J0709j0891j0358J1611J0491j1552j0532J2193
$$ -465 10357 -544 -10909 354 11063 172 -10186 1425 11916 364 -10168 2025
2728B025J0472j2562r936J2340R400j2984r406J2513Q691j2758r163J2012Q824
$$ 2025 12497 -65 -10001 2339 11739 -1245 -10651 1862 10553 -2205 -11368 644 9468
2741I468j2447r207J2621R004j2969q630J3303Q886j2866p801J3486Q005j2823
$$ 9468 -2979 -12186 435 9439 -3530 -12160 1143 10029 -2837 -10638 2848 10853 -1970
2754a970p229J3079P624j2690p232J2468P134j2799p657J2566P083j2930p608
$$ -1970 -9199 3880 11504 -1186 -8418 4050 11184 -1615 -9272 3294 10377 -2553 -10161
2767a0161J2754O770j3042p090J2897O533j2950o442J2457O520j2288o227J2089
$$ -10161 2593 9363 -3679 -10769 2128 8661 -4289 -10731 1726 8246 -4042 -10269 1820
2780A820P243j1953o738J2420P497j2035p242J2994P208j2205p349J2334P128
$$ 1820 9063 -2890 -9628 2792 10289 -1746 -8988 4006 11214 -991 -8340 3994 11122
2793A1122j2502p300J1785P096j2446p793J1823P213j2240p977J2173P630j2420
$$ 11122 -1380 -8680 3105 10201 -2245 -10038 1785 8998 -3242 -11219 954 8584 -3836
2806c836p444J2496P620j2468o826J3010P140j2649o421J2912P183j2779o635
$$ -3836 -11280 1216 8836 -3632 -10458 2552 9692 -2957 -9378 3534 10717 -2062 -8697
2819h697J3191O507j3200o327J3209O147j3744o195J3602N371j4140n609J3593
$$ -8697 4494 11001 -2199 -8526 4683 10830 -2914 -9109 4493 9864 -4276 -9885 3708
2832C708M766j3770n205J3580M941j4063m542J4023M692j3685m074J4277M535
$$ 3708 8474 -5296 -10501 3079 8020 -6043 -10585 3438 8130 -5555 -9629 4648 9183
2845I183j3859l732J4327L914j4008l422J4087L323j3859l216J3532L131j3933
$$ 9183 -4676 -8408 5919 9833 -4175 -7597 6490 9813 -4046 -7262 6270 9401 -4532
2858d532l554J3525L029j4024l187J3232K795j3741k962J3467K750j3443k632
$$ -4532 -8086 5439 8468 -5556 -8743 4489 7284 -6457 -9419 4048 6798 -6645 -9277
2871i277J3619K799j3048k474J3462K915j2948k302J3217L077j3055k826J3276
$$ -9277 4342 7141 -5907 -8381 5081 7996 -4952 -7254 5963 9040 -4015 -6841 6435
2884F435K548j3100k702J2841K535j3012l119J2672K621j3140l148J2789K851
$$ 6435 8983 -4117 -6819 6022 8557 -4455 -7574 5098 7719 -5421 -8569 4220 7071
2897G071j3190l304J3267K963j3040k784J3166L011j2674k962J3493L258j2975
$$ 7071 -6119 -9423 3844 6807 -6233 -9017 4149 7160 -5514 -8476 5017 8275 -4700
2910d700k698J3225L456j3307k829J3397L046j3773k945J3557K149j3847k525
$$ -4700 -7398 5827 9283 -4024 -6853 6544 9590 -4183 -7128 6429 8578 -5269 -7794
2923g794J3496J795j3882k247J3513J677j3691j810J3963J491j3811j226J4088
$$ -7794 5702 7497 -6385 -8632 4881 6558 -7133 -8943 5020 6511 -7300 -8526 5562
2936E562J231j3628m17J4279N04j3660J22J3762K56j3520L06J3259l04j3370L5
$$ 5562 6793 -6835 -7252 7027 7531 -6129 -6007 7755 8011 -5509 -5203 8056 7752 -5618 -5583
2951e583J3114k72j4052K09J3304r27j3607O09J3086j140j3139J241J2782o73
$$ -5583 7531 7259 -6793 -6584 6720 5793 -7814 -7205 5881 4741 -8398 -7157 5625 4952
2965D952j2533R25J2780n04j2341O77J3322m37j2869R20J3226j121j2726J282
$$ 4952 -7581 -6656 6124 5620 -6721 -6044 7278 6841 -6028 -5108 8118 6997 -5729 -4447
2979d447J2508j283j2419O73J2011j284j2239N05J2138j117j2501N72J2486j071
$$ -4447 8061 6778 -5641 -4968 7043 5759 -6480 -5975 6163 5046 -7455 -6883 5603 4532
2993D532j2837J443J2575j035j2360J385J2383n15j1986J099J2521n53j2327P21
$$ 4532 -8305 -6862 5713 4678 -7682 -6297 6086 5571 -6415 -5316 7205 6652 -5675 -4954
3007d954J2713n16j2742O83J2832j031j3066Q06J2531j345j2921P57J2583j251
$$ -4954 7759 7243 -5499 -4816 8016 6985 -6081 -5275 7256 5911 -7010 -6253 6330 5079
3021E079j2935Q70J2843j146j3042J512J3136j604j2813J993J3398j928j2860
$$ 5079 -7856 -6986 5857 4711 -8331 -6819 6317 4713 -8100 -6107 7291 5363 -7497
3034g497K881J2770k134j2654L047J2624k980j2567K896J2161l292j2552L334
$$ -7497 -4616 8154 6020 -6634 -3587 9037 6057 -6510 -3614 8547 5255 -7297 -3963
3047c963J1975m115j2154L497J1765l738j2080L584J2081m331j1680M358J1884
$$ -3963 8012 3897 -8257 -4760 7005 3267 -8813 -5229 6852 2521 -9159 -4801 7083
3060G083m030j1310M445J1524m218j0926M741J1436m024j1407L947J1470m182
$$ 7083 3053 -8257 -3812 7712 3494 -7432 -2691 8745 4721 -6686 -2739 8731 4549
3073D549j1142M371J0987m688j1663M171J1152m535j1242M220J0327m446j0748
$$ 4549 -6593 -2222 8765 4077 -7586 -3415 7737 3202 -8040 -3820 6507 2061 -8687
3086h687L960J1023l652j0871L534J1143l435j1107M426J1617l768j1138M101
$$ -8687 -4727 6296 2644 -8227 -4693 6450 3015 -8092 -3666 7951 4183 -6955 -2854
3099b854J1209l960j0665M498J0281m167j0762L639J0442l440j1191L175J1232
$$ -2854 8355 4395 -6270 -1772 8509 4342 -6420 -2781 7661 4221 -6970 -3795 7437
3112G437m234j1960M176J1778m689j1471M654J0856n000j0468N119J0870m115
$$ 7437 3203 -8757 -4581 7197 2508 -8963 -4309 6547 1547 -8921 -3802 7068 2953
3125B953j0649M367J1117l844j1050M740J1813m829j2019N185J1663n839j0972
$$ 2953 -7696 -3329 7788 3944 -7106 -2366 9447 4618 -7401 -2216 9447 3608 -7364
3138g364N929J0036o166j0453N441R880n303j0248M806J0022n273j0703N856J1115
$$ -7364 -1435 8601 2435 -8018 -2577 7303 2000 -8248 -3442 6580 1307 -9396 -3540 7575
3152G575o142j0724O769J0172o857q836P331R155o582q854O430Q961n801r032
$$ 7575 1433 -9291 -2522 7650 793 -8043 -712 8443 1861 -6993 -563 8398 2597 -6435
3166f435O035R470o949r558O336R566p175r478O870Q661p486q701P013Q226o376
$$ -6435 -400 9070 2121 -7437 -1101 8465 1290 -8188 -1318 7343 -143 -8844 -1831 6395 19
3181A9q236N925Q639n670q839O305R521n961r136O264R665o497q758O700Q866
$$ 19 -8217 -2292 6347 677 -8162 -1857 7664 1703 -7433 -1169 8496 1999 -6759 -59 8807
3196H807o980q301O220Q297n837q842N667Q434o060r246N659R376o340r596O510
$$ 8807 1827 -6474 -254 8043 2206 -6636 -969 7465 1405 -7841 -2182 7194 854 -8742 -2232
3211b232R136o875q904O786Q896o323q580O516Q840n922q655O562R295o356r189
$$ -2232 6904 29 -8875 -2089 6807 484 -8096 -1580 7260 1338 -7317 -755 8540 2184 -7005
3226g005O696R328o889r082O995Q935p529q887P007Q187p210q615O979Q037p318
$$ -7005 -309 9019 2130 -6952 43 8978 1449 -7438 -431 7756 546 -8069 -1090 6947 -371
3241c71q515P084Q489p421q336P802Q447p417q077Q111Q144p689p510Q143P517
$$ -371 -8886 -1802 6687 -734 -9070 -1268 7179 -238 -8315 -204 7940 251 -7259 884 8401
3256H401p655p398Q206P094p976p329P678P188q236p334Q060O626q612o790Q337
$$ 8401 746 -6652 1554 8648 672 -6657 1021 8209 -27 -7361 699 7325 -1287 -8077 260
3271B60O177q166o386Q040O298q075n930P992O398p866n871P949O621p843n984
$$ 260 6437 -1729 -8115 -75 6223 -1852 -7782 210 6608 -1258 -7129 820 7441 -402 -6386
3286f386P950O359p781o066P604O135p615o386P385O074p552o705P287O337p643
$$ -6386 1564 7923 142 -5924 1680 7815 200 -6186 1199 7273 -279 -6984 303 6640 -1003
3301a003o680P467O328p482o590P453O888p823o305P758O724p408o568P982O658
$$ -1003 -7683 -216 6112 -1370 -7960 -507 6381 -1442 -7747 11 6735 -673 -7241 741 7399
3316G399p465o413P983O470p764o543Q066O312q020o385P722O203q211o409P903
$$ 7399 -66 -6479 1504 7974 210 -6333 1733 8045 25 -6360 1362 7565 -646 -7055 848
3331H48N905q290o358Q175N823q331o022Q508N864q444n471Q645N827q354n335
$$ 848 6753 -1537 -7895 280 6103 -2228 -8250 258 6122 -2322 -7793 852 6679 -1675 -7010
3346g010Q851N678q504n190Q708N469q580n396Q641N230r144m996Q538M655q887
$$ -7010 1841 7519 -985 -6175 2533 8002 -578 -5974 2667 7897 -1247 -6243 2295 6950 -1937
3361a937m853Q616M214q741m739Q861M065q628m271Q878M190q512m105Q967M042
$$ -1937 -6790 1826 6040 -2701 -7440 1421 5486 -3142 -7413 1465 5655 -2857 -6962 2005 6047
3376F047q515l608Q866L780q325l425Q518L648q398l685Q313L534q441l683Q164
$$ 6047 -2468 -6076 2790 6570 -1755 -5180 3338 6986 -1412 -5097 3216 6750 -1691 -5374 2790
3391B790L160q496l576P994L457q388l889Q079L882q255l510Q122M038q133l855
$$ 2790 5950 -2546 -6122 1872 5329 -3059 -6948 1131 5013 -3242 -6752 1370 5408 -2725 -6580
3406f580Q582M010p939l794Q423M220q197l846Q085M115q270m133Q235M017q553
$$ -6580 2002 6012 -1927 -5721 2702 6922 -1275 -5121 2964 7079 -1191 -5324 2911 6928 -1625
3421a625m386Q405L764q715m277Q542L700q546l881Q327L607q189l835Q853L677
$$ -1625 -6011 2394 6158 -2557 -6834 1708 5408 -3138 -7019 1308 4915 -3274 -7109 1744 5421
3436E421q441l299Q750L825q522l271Q872L324q734k936Q913K849r022k774Q929
$$ 5421 -3020 -6319 2431 6256 -2266 -5537 3335 6659 -2075 -5011 3902 6751 -2271 -5045 3884
3451C884K417q870l048Q608K598r117k868Q874K407q910k470Q976K133r112j846
$$ 3884 6301 -2569 -5617 2991 5589 -3528 -6396 2478 4885 -4025 -6495 2481 4614 -4498 -6344
3466f344Q884K410q499j765Q600K153q344j769Q658K277q793j827Q739J495q683
$$ -6344 2540 4950 -3549 -5314 3286 5439 -2905 -4674 3984 6261 -2532 -4359 4380 5875 -2808
3481b808j545Q503J074q539j517Q232R78q093j561P834J538q087j972Q208J959
$$ -2808 -4353 4150 5224 -3315 -4832 3400 4378 -3715 -5276 2558 4096 -3991 -5963 2245 4204
3496D204q361j501Q862J329q351r68Q399J454p664j338P857J493p591j780P741
$$ 4204 -4157 -5658 3204 4533 -3818 -4786 3613 5067 -2597 -3935 3922 5415 -2176 -3956 3785
3511C785K328q527k260Q153J953q588k063Q410J564q767j776Q170J532p940j586
$$ 3785 6113 -2414 -4674 3479 5432 -3156 -5219 3191 4755 -4012 -5788 2382 3914 -4026 -5612
3526e612Q032J810p983j907Q535K334q280j875Q779J809q934j006R033J079q711
$$ -5612 2420 4230 -3753 -5660 2875 5209 -3071 -4946 3833 5642 -3292 -4298 4735 5814 -2897
3541b897r06Q272Q04q387q10Q068P69q629j324Q340Q69q696p84Q679K17q823j82
$$ -2897 -3803 4469 5273 -3114 -3924 4144 4913 -3716 -5040 3300 4169 -4527 -5311 3368 3585 -5238 -5420
3558e420R041k86q119M30Q190R5p952L76Q275L20q104l25Q484nq673N51Q371o99
$$ -5420 3621 3335 -4784 -4354 3836 3931 -4021 -3645 4630 4950 -3154 -3479 5005 5000 -3673 -3122 5249 4550
3576D550q482K55P846o45p737L00P575p03p884K66P703o8p654J37Q277m52p893
$$ 4550 -3932 -3677 4169 3524 -4213 -3913 3662 2959 -4925 -4659 3044 2976 -4678 -4541 3736 3284 -4609
3593d609O62Q186n64p571P24P672m80p380O86P466k19p563l7P428j99p979L64
$$ -4609 -3947 4239 3675 -3896 -3172 4500 4020 -3360 -2674 4792 4573 -2990 -3027 4401 4202 -3777 -3413
3610c413P579n93q056L19P542m31p506O2P571m88p329K24Q001P6p755K20Q032
$$ -3413 4166 3573 -4483 -4164 3378 2947 -4559 -4497 3074 2586 -4743 -4519 3482 3558 -4197 -3977 4055
3627D055k12p613M41Q148j81p857K05P842l27q056N03P779n48q100J33P891q54
$$ 4055 3843 -3770 -3329 4819 4638 -3219 -3014 4828 4501 -3555 -3052 4727 4179 -3921 -3788 4103 3249
3644C249q066Q98P646j188p879J211P741j017p506J234P659j093p661J739P830
$$ 3249 -4817 -3919 3727 2539 -5340 -4129 3612 2595 -4911 -3677 3982 2889 -4772 -3033 4797
3659D797j292p360J605P510j617p491J820P395j989p366J586P137j778p461J846
$$ 4797 3505 -3855 -2250 5260 3643 -3848 -2028 5367 3378 -3988 -2402 4735 2957 -4504 -2658
3674b658O984j954p543J908P054j962p168K143P015k128o777K235O887j719o733
$$ -2658 4326 2372 -5171 -3263 3791 1829 -5339 -3196 3819 1691 -5086 -2851 4036 2317 -4416
3689d416K212O873j924o912K213P181j996o798K077O685k255o834K091O614k323
$$ -4416 -2204 4669 2745 -4167 -1954 5227 3231 -3567 -1490 5195 2940 -3894 -1803 4811 2488
3704B488o866J856O469k064o638J671O615j685p030K050O579j804o485K230O850
$$ 2488 -4378 -2522 3947 1883 -4755 -3084 3531 1846 -5184 -3134 3445 1641 -4844 -2614 4236
3719D236j883o633K147O776j705o599K175O671k021o668J830O927k366o875J884
$$ 4236 2353 -4280 -2133 4643 2938 -3661 -1486 5185 3164 -3504 -1674 5253 2887 -3988 -2104
3734b104O828k508o980K025O684k284o936K261O785k316o895K534O970k407o677
$$ -2104 4724 2216 -4764 -2739 3945 1661 -5275 -3014 3771 1455 -5440 -2906 4064 1657 -5020
3749e020K651P120k556o818L146O753k585o764K944O602k990o489L116O192l204
$$ -5020 -2369 4751 2195 -4623 -1477 5276 2691 -4073 -1129 5473 2483 -4006 -890 5302 2098
3764B098o415K952O168l304o577L163O282l703o120L476O056l573n812L413O019
$$ 2098 -4317 -1365 4803 1499 -5078 -1915 4367 664 -5456 -1980 4076 503 -5309 -1896 4123
3779D123l452n610L707N657l027n747L481O015l351n841L564N832l516n835L532
$$ 4123 671 -4939 -1232 4425 1398 -4349 -868 5147 1796 -4045 -481 5351 1835 -4000 -468
3794d68N485l495n856L367N462l613n567L177N376l373n647L311N466l172n533
$$ -468 5017 1522 -4334 -967 4495 882 -4685 -1508 3868 495 -5152 -1841 3625 453 -5080
3809e080L258N949l290n561L523N655l186n487L509N708l169n474L221N418l337
$$ -5080 -1822 4127 837 -4724 -1201 4454 1268 -4219 -710 4998 1829 -3645 -424 4994 1657
3824A657n513L199N606l596n815L258N685l663n839L432N580l712n505L532N585
$$ 1657 -3856 -657 4949 1353 -4462 -1204 4481 818 -5021 -1589 3991 279 -5226 -1694 3891
3839C891l551n503L565N773l317n610L952N782l931n114L886N432l846n432L985
$$ 3891 340 -5163 -1598 4175 858 -4752 -800 4982 1051 -4063 -177 5255 1409 -4023 -38
3854c8N409m038n548M138M971m205n488M070N027m119n223M136N024m397n033
$$ -38 5371 1333 -4215 -77 4894 689 -4799 -729 4298 179 -5044 -908 4116 -281 -5314
3869e314M383M770m271m583M443M894m386m414M682M588m320m433M522M371m418
$$ -5314 -931 3839 -432 -5015 -572 4322 -64 -4478 204 4792 472 -3961 561 4932 514
3884E14m150M374M306m545m336M288L970m438m264M137M001m344m368M397M084
$$ 514 -3636 738 5044 499 -3837 451 4421 -17 -4281 -144 3857 -487 -4855 -458 3626
3899C626m379m120M363M277m565m023M690M168m256l836M289M428m337l956M321
$$ 3626 -753 -4873 -510 3767 -798 -4821 -131 4037 -219 -4055 234 4662 325 -3631 690
3914F90M153m267m028M120M114m268m305M197L870m101m553M132M001m326m202
$$ 690 4843 576 -3452 668 4782 514 -3791 406 4276 175 -4378 -246 3755 -571 -4773
3929d773M135L951m005m092M070M375m151m209M705M050m097m012M541M262m309
$$ -4773 -638 3313 -692 -4784 -714 3661 -490 -4699 6 4056 -41 -4053 488 4750 441
3944D41m003M714L889m679m002M673L678m684l818M420L581m721l899M416L786
$$ 441 -3562 1152 5041 362 -3640 1033 4711 27 -3791 629 4210 -511 -4410 6 3792
3959C792m915l787M825L591m767l675M988L680m645l529N126L462m603l337N022
$$ 3792 -1123 -4910 -85 3506 -1261 -4936 52 3732 -913 -4442 684 4146 -457 -3794 1228
3974A228L372m690l195M854L002m841l132M884K896n155k784M562K762n205k728
$$ 1228 4600 -90 -3285 1569 4571 -270 -3402 1482 4378 -777 -3561 1001 3763 -1442 -4170
3989d170M851K526m819k850M913K567m695k504M716K835m850k437N054K757m677
$$ -4170 681 3207 -1612 -4462 451 3018 -1677 -4181 535 3370 -1480 -3917 1137 3894 -783
4004g83k554M852K657m743k507M801K525m558k922M300K729m569k864M472K790
$$ -783 -3337 1515 4172 -571 -3078 1723 4248 -310 -3232 1068 3797 -772 -3636 836 3626
4019C626m727l096M612K757m815k544M499K752m514k689M516K944m261k692M580
$$ 3626 -1101 -4197 415 3172 -1643 -4187 312 3064 -1450 -4139 377 3321 -940 -3632 948
4034I48K921m398k831M794K930m928k553M816K628m978k561M753K384m917k495
$$ 948 3869 -529 -3360 1434 4364 -564 -3117 1699 4327 -651 -3212 1541 3925 -992 -3487
4049c487M413K251m746k530M739K300m736k584M770K720n026k182N290K117m916
$$ -3487 926 3177 -1569 -4099 640 2940 -1796 -4380 390 3110 -1916 -4098 1192 3309 -1607
4064a607j835N004K258m613k020M890K015m758k384M943K270n197k132N210J643
$$ -1607 -3442 1562 3820 -793 -2813 2077 4092 -666 -3050 1893 4163 -1034 -3166 2044 3687
4079C687n427j867N172J423n087j571M856J240m607j527M705J807m703j676N007
$$ 3687 -1740 -3607 1565 2988 -2099 -3670 1186 2426 -2181 -3708 997 2804 -1899 -3575 1432
4094A432J777m808j569N297J417m925j065M697J267m812r66M414J098m509j628
$$ 1432 3209 -1599 -3168 2129 3546 -1379 -2444 2253 3520 -1292 -2258 2156 3254 -1255 -2883
4109b883M448J682m822j564M465J514n138j439M835J280m622j291M762J215m388
$$ -2883 1565 3247 -1575 -3139 1326 2840 -2298 -3737 1098 2378 -2244 -3535 1227 2442 -1946
4124a946j337M765J608m436j459M363K121m684j853N292J278m970j333M747J066
$$ -1946 -3283 1482 3090 -1346 -2805 1558 3679 -1005 -2858 2434 3712 -1258 -2591 2156 3222
4139C222m669j197M380J247m713j572M412J424m646j550M742J477m915j441N093
$$ 3222 -1447 -2644 1736 2983 -1730 -3302 1110 2534 -2112 -3662 1080 2557 -2358 -3799 1294
4154A294J244m742r07N073R65m576q51M858J045m634j204M629J318m736j229M839
$$ 1294 2538 -2204 -3111 1962 2927 -1649 -2500 2358 3403 -1231 -2435 2194 3512 -1224 -2453 2386
4170B386R07n088j027M914N24n052p28M873K61m740l48M518O11m560n89M830O14
$$ 2386 3293 -1795 -2822 2092 2616 -2436 -3164 1709 1970 -2770 -3118 1400 2011 -2549 -3138 1692 2306
4187B306m562m13N039M94m864k25M904J81m368j82M466K04m575m29M310L84m457
$$ 2306 -2256 -2669 2370 2864 -2000 -2225 2679 2860 -1508 -1690 2776 2980 -1595 -2024 2286 2670 -1787
4204a787m88M228K09m587l54M506J54m431l44M372K22m155j29M329K70m127j63
$$ -1787 -2275 1953 2162 -2425 -2779 1727 1881 -2550 -2894 1478 1700 -2455 -2584 1745 2015 -2112 -2275
4221b275M309N46m250l47M569L04m376l13M250M40m587k10M299K0m308l59M151
$$ -2275 2034 2580 -1670 -2017 2552 2856 -1520 -1833 2417 2857 -1730 -1940 2359 2379 -1929 -2288 1863
4238A863L82m594n30M373M39m508m90M572M74m708JM551K45m328M2M735Lm332
$$ 1863 2245 -2349 -2879 1494 1933 -2575 -3065 1507 1981 -2727 -2726 1825 2070 -2258 -2216 2519 2522 -1810
4256a810J6M504J26m388k05M476P0m855J61M530k95m677R8M250k86m618L26M456
$$ -1810 -1794 2710 2836 -1552 -1757 2719 2789 -2066 -1905 2625 2330 -2347 -2249 2001 1715 -2903 -2577 1879
4274A879m47m305M40M272m73m205P58M423m27m018L09M436m86m152O99M257n73
$$ 1879 1432 -2873 -2433 1839 1366 -2839 -2081 2342 1915 -2103 -1794 2642 2156 -1996 -1297 2960 2387
4291B387m239M25M213n24m273L50M044o00m170L71M081p09m059L12M239n90m078
$$ 2387 -1852 -1427 2786 2262 -2011 -1661 2383 1783 -2387 -2016 2065 1356 -2703 -2391 1848 1258 -2820
4308b820N01M300o92l965Q73M060m62l919P45L989o60l725N50M087q04l738M39
$$ -2820 -2319 1981 1289 -2676 -1803 2257 1795 -2124 -1379 2610 1950 -1775 -1225 2862 2058 -1680 -1241
4325a241M009p47l892L83L654n91m045N90L604l68m224N96M049n68m092R24L858
$$ -1241 2768 2021 -1871 -1488 2166 1575 -2470 -1880 1724 1356 -2868 -2272 1777 1209 -2883 -1959 1899
4342A899o86l731P75M116m01m007O85M128n34l997M36M164n56m145P07L852q02
$$ 1899 1213 -2518 -1743 2373 1972 -2035 -1350 2778 2244 -1753 -1317 2847 2291 -1854 -1147 2705 1903
4359A903m000M13M099q31m257P57L980r94m006R47L925j073l756J103L810p94
$$ 1903 -2097 -1684 2415 1584 -2673 -1916 2064 1070 -2936 -1989 1936 863 -2893 -1790 2020 1226
4375A226l852J206L855j004l548J110L975j133l572J054L625j180l664J112L538
$$ 1226 -2626 -1420 2435 1431 -2117 -1007 2968 1835 -1737 -683 2942 1762 -1902 -790 2748
4390B748j297l812J025L693j381l718J223L508j352l556J308L606j315l540J505
$$ 2748 1451 -2361 -1336 2357 976 -2742 -1519 1989 637 -2919 -1611 1995 680 -2860 -1355
4405a355L618j328l299J423L422j187l327J490L231j123l347J335L302j405l417
$$ -1355 2263 935 -2364 -941 2481 1294 -2033 -543 2688 1565 -1782 -447 2855 1450 -1967
4420a967J194L261j451l240J233L188j480l311J171L217j317l441J366L445j220
$$ -1967 -773 2488 1037 -2203 -970 2218 738 -2573 -1402 1815 498 -2943 -1577 1868 648
4435F48l188J380L316j290l113J299L491j131l289J365L401j312l519J403L181
$$ 648 -2540 -1160 2156 866 -2247 -948 2543 1412 -1877 -512 2889 1577 -1942 -539 2642
4450B642j268l489J264L312j418l512J235L325j442l432J262L490j610l283J466
$$ 2642 1374 -2115 -851 2461 1043 -2469 -1234 2091 649 -2783 -1521 1969 359 -2924 -1458
4465a458L532j571l174J589L355j246l468J994L036j442l055J729K991j549l280
$$ -1458 2074 503 -2671 -1082 2273 1027 -2441 -447 2589 1147 -1908 -179 2812 1263 -2017
4480b017J775K898j719l312J592L198k047k814J663K732j677l034J825K757j591
$$ -2017 -242 2656 937 -2375 -783 2415 368 -2446 -783 1949 272 -2762 -937 1820 229
4495B29k940J698K922j620l001K018L097j912k598J820L046j883k645J679K737
$$ 229 -2711 -1013 1909 289 -2712 -694 2403 491 -2107 -287 2759 876 -1769 -90 2647
4510B647j653k788J670K559j740k859J635K798j928k827J649K691j774k715J475
$$ 2647 994 -1794 -124 2435 695 -2164 -529 2269 341 -2486 -837 1854 80 -2635 -1160
4525a160K938j700k804J834K790j732k527J938K533j455k663J651K994j755k708
$$ -1160 1778 78 -2726 -892 1898 166 -2361 -423 2110 655 -2008 -357 2637 882 -1826
4540a826J812K746j782k709J581K828j955k803J735K614j918k821J654K443j475
$$ -1826 -14 2732 950 -1759 -178 2650 695 -2108 -373 2241 323 -2498 -844 1599 124
4555A24k833J721K792j807k873K163K788j613k668J908K830j938k694K111K722
$$ 124 -2709 -988 1804 -3 -2876 -713 2075 462 -2206 -298 2532 594 -2100 11 2733
4570B733j833k839K104K602k009k869J978K721k211k516J707K525k167k556K061
$$ 2733 900 -1939 165 2767 758 -2111 -133 2588 377 -2139 -432 2093 -74 -2630 -569
4585e69K529k179k427J994K367j931k179K002K474k105k224K123K513k012k124
$$ -569 1960 -219 -2646 -652 1715 -216 -2395 -393 2081 -24 -2248 -125 2388 376 -1748
4600a748K149K194k184k192K170K027k063k121J974J988k115k079J919K123k293
$$ -1748 401 2595 411 -1781 389 2416 353 -1768 206 2194 79 -2000 -81 2042 -251
4615b51k320J936K348k059k194K181K167k317j879K236K171k022j885K058K192
$$ -251 -2571 -635 1713 -346 -2540 -359 1808 -509 -2388 -152 2019 -3 -1888 170 2362
4630B362k165j917J873K305j788k374K186J967k228k244K349J988k416k187K176
$$ 2362 197 -1720 153 2458 670 -1704 482 2449 221 -2023 326 2314 -102 -2289 -113
4645a13J770k129j765K006J861k005k104J893K281j986k045K277K323k384j915
$$ -113 1657 -472 -2237 -231 1630 -375 -2479 -586 1695 -291 -2336 -59 2264 -120 -2035
4660b035K115K117j878k086K344J849k118j886K083J819k044k152K054J842k129
$$ -2035 80 2197 319 -1767 577 2426 308 -1578 505 2324 280 -1872 182 2024 -105
4675a05k131K150J964k515j904K431J632k199j577K159J881k219j761K463J729
$$ -105 -2236 -86 1878 -637 -2541 -110 1522 -677 -2254 -95 1786 -433 -2194 269 1998
4690A998k049j900K430J883k344j767K678J502k625j532K425J430k316j562K110
$$ 1998 -51 -1951 479 2362 18 -1749 929 2431 -194 -1726 699 2129 -187 -1749 361
4705C61J371k258j703K198J551k334j559K325J632k306j702K682J470k314j245
$$ 361 1732 -526 -2229 -31 1520 -814 -2373 -48 1584 -722 -2424 258 1728 -586 -1831
4720a831K299J203j893j289K215J509k193j464K242J538k399j460K187J617k570
$$ -1831 468 1671 -222 -1511 704 2213 20 -1444 798 2336 -63 -1523 664 2281 -289
4735b89j597K321J333k401j405K156J387k287j540K197J652k265j516K421J639
$$ -289 -1886 435 1768 -633 -2038 118 1505 -782 -2322 -125 1527 -738 -2254 167 1806
4750A806k588j076K330J487k157j342K486J143k241j296K481J131k210j471K187
$$ 1806 -782 -1858 472 1959 -198 -1540 946 2089 -152 -1448 1033 2164 -46 -1517 670
4765F70J252k306j311K020J490k609j357K429J201k479j158K312J240k227j226
$$ 670 1922 -384 -1695 325 1815 -794 -2151 278 1479 -1000 -2158 154 1394 -833 -2059
4780b059K288J472k419j026K378J299k150j321K595J324k574j236K580P89k413
$$ -2059 229 1701 -718 -1744 634 1933 -217 -1538 1057 2381 -193 -1429 1151 1940 -473
4795d73j140K558R04k483j215K385R76k569r00K264R64k404q41K476Q24k278q88
$$ -473 -1613 945 1849 -634 -1849 536 1512 -1057 -1957 307 1271 -1133 -1974 502 1326 -952 -1840
4812a840K309R98k191q11K635O74k291o52K210Q09k267r12K383O63k296q21K291
$$ -1840 469 1467 -724 -1535 1100 1774 -517 -1169 1041 1850 -417 -1329 1054 1717 -579 -1400 891
4829H91O31k456o05K195O19k346p97K223P48k278p87K342Q52k230o47K364R98
$$ 891 1522 -934 -1539 656 1275 -1071 -1868 355 1103 -1175 -1962 380 1232 -998 -1645 719 1717
4846A717k402o20K224R99k303r79K539P94k341q70K225P66k188r42K247O89k413
$$ 1717 -685 -1305 919 1918 -385 -1364 1175 1969 -372 -1242 983 1749 -439 -1381 866 1555 -858
4863h58j023K378R17k533q79K504P65k559n48K333P72k318o39K458P14k259n68
$$ -858 -1881 497 1414 -1119 -1998 506 1271 -1288 -1836 497 1269 -1049 -1688 770 1484 -775 -1343
4880a343K391P43k270o81K371P67k483n02K262M02k357p50K370N13k517n81K415
$$ -1343 1048 1791 -479 -1160 1211 1978 -505 -1007 1255 1657 -700 -1450 920 1433 -1084 -1665 750
4897G50L89k400o40K371N27k287l64K326M77k221m03K446L03j950m50K363M62
$$ 750 1139 -1261 -1901 470 997 -1290 -1654 672 1149 -1072 -1475 971 1274 -676 -1126 1237 1699
4914A699k219m39K236K96k233k74K007L46k278n23K264L04k407k37K167J31k214
$$ 1699 -520 -959 1277 1573 -660 -934 1073 1419 -859 -1382 882 1186 -1221 -1458 709 840 -1374
4931a374k44K132M50k168k21K294L66k266k58K275M79k109l53K359L14k251k07
$$ -1374 -1618 514 964 -1204 -1425 869 1235 -1031 -1289 986 1465 -644 -997 1362 1676 -575 -782
4948g82K081L14k304m21K189L11k238m28K077K94k145n22K252K08k316k16K130
$$ -782 1299 1613 -691 -1112 1077 1388 -850 -1278 799 1093 -1052 -1574 678 886 -1430 -1646 484
4965D84M42k376j9K202L50k114k11K213M38k164k22K271J15k026j86K207O7k128
$$ 484 926 -1450 -1469 733 1083 -1031 -1242 971 1409 -755 -977 1294 1409 -617 -803 1404 1471 -657
4983f57l13K089K36k468k54K369j05k149k95K342o8k159k0K149P2k082J39K099
$$ -657 -970 1119 1355 -1113 -1367 1002 897 -1252 -1547 795 727 -1432 -1452 697 769 -1313 -1174 925
5001I25J28k045j6K186K20k291J51K459l98k107N1K089j25k042r7K262j96k203
$$ 925 1053 -992 -1008 1178 1398 -893 -742 1717 1319 -788 -737 1352 1227 -815 -912 1350 1154 -1049
5019a049p8K049j32k206J40K026k32k029K65K098k14j879L07J983j73j947L00
$$ -1049 -1127 922 790 -1416 -1276 750 518 -1511 -1246 852 638 -1241 -934 1049 876 -1071 -771
5036g71K108q2j955k7K234k17k129J96K034j43k321M55J687j27k049j5J814j83
$$ -771 1337 1255 -700 -727 1507 1290 -839 -643 1391 1248 -1073 -618 1069 942 -1107 -1122 692 509
5054E09j831k3K033n6k074J05K080J02k182L43K270j71k177K84K167j50k069L90
$$ 509 -1322 -1345 688 632 -1442 -1337 743 845 -1337 -994 1276 1105 -1072 -788 1379 1229 -840 -450
5072d50J946j42k139MK284m07k032R8J967k33k293K17K221n08k012L22K072m12
$$ -450 1496 1354 -785 -781 1503 1096 -936 -838 1129 896 -1397 -1180 1041 533 -1479 -1157 915 503
5090E03j948N03J858j31k039L04K201l23j914L71K132l90j888M31J758m20j838
$$ 503 -1445 -942 916 785 -1254 -950 1251 928 -986 -615 1517 1127 -761 -330 1428 1008 -830
5107h30N94J637n27j941M04J831o72j808L33K000m84k098M10K093o32j734O69
$$ -830 -236 1401 874 -1067 -663 1168 496 -1312 -979 1021 537 -1561 -1151 942 310 -1424 -755
5124g55J645l99j661O65J926o18j709L60J884l30j919P35J716p09j935P06J670
$$ -755 890 491 -1170 -505 1421 803 -906 -546 1338 1008 -911 -176 1540 831 -1104 -398 1272
5141A272o38j804N75J633n22k031N32J556l08j684M50J714m68j529L31J872n49
$$ 1272 634 -1170 -595 1038 516 -1515 -983 573 265 -1419 -969 745 277 -1252 -921 951 402
5158D02j547N96J895l33k065P15J897n34j807N05J735n34j921N48J748o83j932
$$ 402 -1145 -549 1346 1013 -1052 -337 1560 1026 -781 -276 1459 925 -996 -448 1300 617 -1315
5175a315N33J982o05k131O38J676n44j919O12K043n67j866P01J799m35j810O54
$$ -1315 -782 1200 595 -1536 -898 778 234 -1685 -1073 970 403 -1463 -762 1037 602 -1208 -554
5192e54K070o89j802P48J787n20j953P56J736q13j837N98J700q40j530M74J465
$$ -554 1516 827 -975 -227 1560 1040 -913 -157 1579 766 -1071 -473 1227 387 -1143 -669 796
5209G96m47j802P66J588p11j761R89J398o71j639Q79J713p10j493P85J687o78
$$ 796 349 -1453 -687 901 190 -1571 -582 816 145 -1494 -615 1098 388 -1105 -320 1367 689
5226F89j541R09J388q53j362N52J709r13j479O37J381r20j447O44J730r65j568
$$ 689 -852 57 1445 592 -770 -218 1491 578 -901 -264 1117 197 -1250 -606 1124 159 -1409
5243a409P95J468q26j574J005J456o91j439P14J801q50j599J032J655j100j197
$$ -1409 -614 854 28 -1546 -541 915 224 -1215 -501 1300 450 -1149 -117 1538 438 -759
5259g59O58J673r52j571P69J499o69j686N38J665p67j802Q64J426p56j566P57
$$ -759 -101 1572 620 -951 -182 1317 648 -1038 -500 1165 398 -1404 -540 886 130 -1436 -679
5276f79J585p23j650Q40J576p64j509J013J535o54j590P60J656o50j615Q19J573
$$ -679 906 183 -1467 -627 949 185 -1324 -311 1224 570 -1020 -260 1396 746 -869 -50 1523
5293A523r43j729J064J456j048j469P56J551r86j567Q12J479r07j473Q70J430
$$ 1523 580 -1149 -85 1371 323 -1146 -390 1161 175 -1392 -580 899 -8 -1481 -611 819
5309H19q65j458R94J543q82j383J224J174q77j354J187J221q79j289R63J445j235
$$ 819 -46 -1504 -510 1033 151 -1232 -8 1166 289 -1065 122 1343 464 -825 138 1583 348
5326C48j296J000J343j064j459Q79J222r86j338Q97J390j286j191R93J484j128
$$ 348 -948 52 1395 331 -1128 -249 973 -13 -1351 -454 936 -350 -1541 -548 936 -192
5342a92j129R88J331r83j108J075J270r95j191J108J009p21j345J142J120q65
$$ -192 -1321 -333 998 15 -1093 -18 1252 257 -934 174 1183 462 -883 259 1379 514
5358E14j460R00J265j109j334Q60J343j025j475J028J311j081j081R36J292r47
$$ 514 -946 -46 1219 110 -1224 -364 979 -46 -1521 -493 818 -263 -1344 -408 884 -63
5374f3j230R61J343r87r66J055J169j035j062Q42J509j030j377R29J371j256j209
$$ -63 -1293 -332 1011 24 -942 113 1282 247 -815 27 1536 506 -871 58 1429 173 -1036
5391a036J124J123j227j493J273J306j162j301J070J114r33j421J166J409r62
$$ -1036 88 1211 -16 -1509 -236 1070 -92 -1393 -323 791 -142 -1563 -397 1012 50
5406E0j216J128J001q84j140J142J207j120r47J043J251j230j092Q92J195j120
$$ 50 -1166 -38 963 79 -1061 81 1288 168 -779 264 1515 285 -807 85 1280 160
5422A60j190Q87J207j130j172J038R36r29j083R86J033j058j043J108J216j155
$$ 160 -1030 -143 1064 -66 -1238 -200 736 -193 -1276 -290 743 -315 -1358 -250 966 -189
5438a89j006J204R09q09r05J180R71j156q49R70J095j169j087J237P99j307r22
$$ -189 -1195 9 918 109 -796 384 1355 199 -650 320 1415 246 -841 396 1195 -112 -1034
5455a034J092R25j222j111J118J004j041r37R61R26j020r74J190R69j088q56J243
$$ -1034 58 983 -239 -1350 -232 772 -269 -1206 -245 681 -339 -1313 -123 846 -242 -1098 145
5472A45Q51q59r55R76R99q97j058J026J272j227j121J037J210j566j024J183R09
$$ 145 996 137 -818 158 1157 260 -798 228 1500 273 -848 189 1399 -167 -1191 -8 901
5489I01j099j049J072J161j379j008J162J163j367q59J228R77r92j023J286J056
$$ 901 -198 -1247 -175 986 -393 -1401 -239 924 -443 -1302 -74 903 -89 -1112 174 1230
5505A230j214q28J344Q78j345r85J246J023j297r95J276Q80j291j134J132R60
$$ 1230 16 -812 532 1410 65 -920 326 1349 52 -943 333 1213 -78 -1212 -80 880
5521H80j262q31J184P04j114q91J375N65j034n94J300O66j121q10J279P79j065
$$ 880 -382 -1213 -29 675 -439 -1330 45 610 -424 -1018 282 948 -173 -983 296 1075 10
5538A0o79J153P27j060q13J119P35j283p88J241O01j261o50J077P64j431m91R13
$$ 10 -669 484 1211 151 -662 457 1192 -91 -879 362 963 -298 -948 129 893 -538 -1029 -116
5556a16Q51j271o28J316M99j129o16J201R14j174p21J372O82j200p60J222Q46
$$ -116 735 -536 -1164 152 651 -478 -1094 107 1021 -153 -874 498 1180 -20 -780 442 1288
5573A288j242q29J225P21j138r95J145R86j356q74J046Q47j298p40J153Q02j296
$$ 1288 46 -783 442 1163 25 -970 175 1161 -195 -1069 -23 824 -474 -1214 -61 741 -555
5590e55o26J114Q40j075o58J059Q68j071p65J375O50j103q28J338P25j228p04
$$ -555 -1181 -67 773 -302 -960 99 967 -104 -869 506 1156 53 -775 563 1288 60 -644
5607f44J058O40j101r18J186O97j435n80J196N40j201o73J295N23j151m38J143
$$ -644 414 1054 -47 -965 221 918 -517 -1097 99 639 -562 -1235 60 583 -568 -1006 137
5624A37O42j226m75J223N77j234k73J119O38j244m57J263N07j159p92J350M23
$$ 137 779 -447 -922 301 878 -356 -629 490 1128 -116 -573 690 1197 38 -754 596 1019
5641A019j149n92J041M13j304m38J208M32j238n70J259O40j416m32J196O50j071
$$ 1019 -130 -722 319 732 -572 -1010 198 630 -608 -1178 81 721 -695 -1127 69 719 -352
5658c52m81J255L99j103m37J355L27j081m60J243L43j072o88J170N58j250o36
$$ -352 -833 422 821 -282 -719 636 963 -118 -578 665 1008 -64 -752 418 976 -274 -910
5675i10J344L81j400l92J255K85j289l16J321J20r58n23J292N30j232l65J250
$$ -910 434 815 -585 -977 278 563 -726 -1042 279 399 -559 -1082 210 740 -492 -857 393
5692C93N89j276k39J090N71j297k90J235J11j197l71J318J98j331m43J230M25
$$ 393 982 -294 -533 557 1128 -169 -459 776 887 -310 -681 637 835 -496 -939 291 716
5709G16j380m66J250N31j465j83J333L12j360k07J184M48j147l41J466K64j060
$$ 716 -664 -1130 120 651 -814 -997 336 648 -712 -919 265 713 -434 -775 691 955 -105
5726a05m87J422K81j325l60J312K09j351l16J281J75j441p8J150J90j233l83J242
$$ -105 -592 830 1111 -214 -574 738 947 -404 -720 561 736 -705 -783 367 557 -676 -1059 183
5744A83K30j118j69J110L91j250k27J280K44j108l09J544K38j334k49J267K52
$$ 183 413 -705 -874 236 627 -623 -850 430 674 -434 -743 801 1039 -295 -544 723 975
5761I75j305J3R39K35j195k49J122J49j348r4J072J9j199o9J150L88j340k01J410
$$ 975 -330 -317 622 857 -338 -587 535 684 -664 -758 314 333 -866 -935 215 603 -737 -938 472
5780D72J62j312j64J374O9j143m3J392J79j294r5J227J75j315j05J127K5j193
$$ 472 634 -678 -842 532 601 -542 -585 807 986 -308 -403 824 999 -316 -421 706 731 -462
5798d62k34J308j24j216j13J232K4j344m0J233J88j319q1J368P5j091K1J222J70
$$ -462 -696 612 488 -728 -841 391 415 -929 -969 264 452 -867 -948 420 495 -596 -575 647 817
5817H17j380M1J456oj296m1J409o6j360O9J079qj296j87J373j86j154j77J366
$$ 817 -563 -522 934 928 -368 -409 1000 934 -426 -357 722 714 -582 -769 604 418 -736 -913 453
5836D53o5j342k1J423J7j264oJ308r3r40p4J245J37j160O9R69J52j165m8J196
$$ 453 388 -954 -975 448 465 -799 -805 503 410 -530 -604 641 778 -382 -313 656 808 -357 -405 791
5856G91%j304J24R89j9j175J2J133k58r82j64J140O2j107J04J049Q2j182l4J111
$$ 791 791 -513 -389 600 581 -594 -582 551 293 -689 -853 287 349 -758 -654 395 477 -705 -739 372
5876C72J1q99K3J150J85j239K04J029L7j293lJ164J50j446J69R90r6j054j75J241
$$ 372 383 -516 -493 657 842 -397 -193 836 873 -420 -423 741 891 -555 -386 604 508 -546 -721 520
5896E20j96j056l1J174k19j285J79J322p3j127J30J275j43r47q5J571l51j101
$$ 520 324 -732 -763 411 192 -1093 -914 408 335 -792 -662 613 470 -477 -562 1009 658 -443
5914d43K54J184m36j094M28J013k62j140J90Q95j63j131pJ296k43j281M16R70
$$ -443 -189 995 559 -535 -107 906 644 -496 -306 589 426 -705 -712 584 341 -940 -524 446
5932D46k31j195L31J148k22j182L06J388k85j166K62J151j00j034J87J004k93
$$ 446 215 -980 -649 499 277 -905 -599 789 504 -662 -400 751 651 -383 -196 808 515
5949E15j076L64J099m49r99J37R48p8j449M81J016k82j178L96J027l33j000J37
$$ 515 -561 -197 902 453 -546 -409 539 461 -988 -507 509 227 -951 -555 472 139 -861 -724
5967g24J297k52j070L48J089j79j031K05J152j57j117L15J007j33j187K90Q30
$$ -724 573 321 -749 -401 688 509 -522 -317 835 678 -439 -124 883 750 -437 -147 683
5984F83j87j306L96J054l18j253K90J102k68j163L94J072k78j146M32R72Oj359
$$ 683 496 -810 -414 640 322 -931 -641 461 193 -970 -576 496 218 -928 -496 476 482 -877
6002h77N07J319l93j165N19J094l87r76J44J267n39r84K50J142m80j166L70J084
$$ -877 -370 949 556 -609 -90 1004 617 -359 -215 1052 513 -471 -221 921 441 -725 -355 729
6020G29o10j145L07J400o64r44K92J137l60r79L74J256l65j124K15J368n78q79
$$ 729 119 -1026 -719 681 17 -927 -635 502 142 -837 -463 793 428 -696 -481 887 309 -570
6038e70O23Q59l20j125L94J108l90j125M84P56l65j202O50Q64n67q92K52R79l09
$$ -570 53 912 592 -533 -139 969 579 -546 -62 694 329 -873 -223 641 74 -818 -566 413 104
6057A04j025M91J240r45p47P24R22m36j031M09J092n05q44O74P81m30r64N37R01
$$ 104 -921 -430 810 -135 -882 -158 764 328 -703 -294 798 293 -551 123 904 474 -490 47 948
6076I48n15j261O75R37o44p87L51P51m32r74O01Q78o97o59N48Q24l94j088P03
$$ 948 433 -828 -153 784 140 -647 -296 455 23 -951 -350 528 -169 -828 -280 544 150 -938 -235
6095b35J147n14j196O93R71o57q20N52J031o51p35M84O73l44j062M09R29m75r04
$$ -235 912 398 -798 -105 866 209 -611 -59 972 321 -414 70 743 399 -663 -254 675 200 -704
6114g04L29R30n06r89N65P96m92j056Q20Q48m66r10O43R95p89p51Q09R66n50j094
$$ -704 -375 555 49 -940 -375 421 -71 -1127 -307 541 75 -835 -192 803 14 -737 72 1038 488 -606
6134f06O69Q11o19r31R27O49o77q56M39Q75o96p18N19Q62r39o43N89P85m99q39
$$ -606 63 874 255 -676 251 900 223 -633 -194 681 -15 -733 -214 648 -291 -934 -345 440 -59 -898
6154h98P80P34o84n41N22Q81n17q06O72Q24o09q97O30Q33n84j082Q35O25n61r26
$$ -898 -118 616 -68 -609 -87 794 277 -529 143 967 358 -539 91 924 340 -742 93 718 157 -769
6174g69O89Q82o49j062O05Q26o50q64P70P79p23q31P76R03o49p60Q65N24m79q98
$$ -769 -80 802 153 -909 -304 522 -128 -992 -222 557 -166 -997 -221 682 33 -727 138 662 183 -715
6194g15R53P56r29p05Q65R03q45q25P46N26o40p89O84P35r09q29Q12P63p99p50
$$ -715 238 994 65 -640 225 1128 283 -542 204 730 90 -699 -15 720 -189 -1018 -206 557 -242 -992
6214i92P15R38r39o97J023O28o18r63J161O98q82n88P83Q04j017o27Q69P17q68
$$ -992 -277 661 -278 -975 48 676 58 -905 256 954 72 -516 267 1071 54 -573 296 1013 145
6233A45p20P44O11r62p36J058L39p15p24O17O52o92n77P83O48q12m69R03N61o04
$$ 145 -575 169 780 -182 -918 140 479 -236 -960 -343 309 -383 -960 -177 471 -341 -810 93 654 50
6253E0n65P90O49p40o11P68M61o88n92O88N98p34p51P26M35m89p95O64O44o80
$$ 50 -515 275 924 184 -427 341 802 114 -478 210 808 74 -677 49 484 -5 -800 -136 508 -172
6273a72q62Q05O37o86o30Q59P04r39l40Q44L95o33l80P50N57r33n23R20N88p93
$$ -172 -1034 -229 408 -278 -908 -49 655 -284 -624 220 615 -18 -398 352 909 -24 -547 373 961 168
6293A68p23O90O62o86p12P73N51q91p64Q89O29q90n48P95M80p73m99O95P59q61
$$ 168 -555 135 797 111 -601 172 723 -168 -932 -43 586 -304 -852 -57 423 -350 -849 -154 605 -256
6313b56m43R95M67r82l28Q66N81q64o00J012M88j020l87P96M04q52o21J030L45
$$ -256 -699 296 763 -219 -547 319 900 36 -564 448 936 -84 -471 325 729 -123 -744 286 631
6332F31j003l62P82L54r42m17R98L18o24m86J014K92q23l59R90M95r85m06R60
$$ 631 -372 -734 48 402 -540 -957 41 359 -265 -751 263 555 -268 -627 363 858 -127 -533 427
6351D27M67j000m42J013K81p11m49O76M72r76m44R18K48q58m96P79P38j020n08
$$ 427 894 -106 -548 465 746 35 -414 262 734 -242 -686 232 480 -378 -874 -95 643 -377 -885
6370h85R28L97r54j77R40M32r86k57P91N09p90m74R91K77q38k73Q04M56j050m08
$$ -885 43 440 -514 -691 249 681 -305 -562 229 738 -52 -526 465 742 -96 -369 435 891 -159 -567
6390e67Q39M53j055m12Q87M31r72m42Q63L93r77k88Q07N16r40l32R45L56p59l73
$$ -567 272 725 -330 -742 145 576 -396 -838 25 418 -559 -847 -40 476 -464 -796 149 505 -254 -627
6410f27J127K53r76l02J200J86r49m30R89L12r13l64R68R3q75l00P76K62r77k17
$$ -627 500 753 -223 -525 675 861 -88 -518 471 783 -130 -494 474 567 -308 -608 168 430 -547 -764
6430g64J044P8j050r4R75L03r72k60J087K19q01k74R90K70r08k27R98M6r57l4
$$ -764 280 358 -692 -786 189 492 -480 -740 347 566 -235 -509 481 751 -157 -384 614 660 -297 -331
6450c31Q69J17r94j74R10J51r68j69P50L73j146j69Q78K37r07l22J032L26q67
$$ -331 538 655 -339 -513 397 548 -420 -589 161 534 -612 -781 97 334 -573 -895 137 463 -404
6469d04j63Q83K17r07M5Q66J15q16k12R25K12r86j65Q13J93r16k55Q47K04j049
$$ -404 -567 316 533 -374 -329 537 652 -164 -376 549 761 -225 -390 423 616 -300 -555 292 496 -553
6489e53m2P68K74j032k42J067J40q74k52J136J02q62j36R80K46j181oJ136J72
$$ -553 -595 173 447 -585 -827 240 380 -494 -746 390 492 -370 -506 474 720 -461 -467 669 841
6508H41r84p8Q72J48r92k49J082O7j215p5J164j59j183J01R59N7r76QR57k42o78
$$ 841 -143 -221 651 799 -193 -442 640 707 -508 -583 581 422 -761 -660 299 356 -620 -612 345 103 -575
6529e75j2R94J83r90K3R95qp58k27R65L9o98l08J010J1j119L1R97q2j096J50Q76
$$ -575 -587 407 590 -400 -377 618 610 -148 -375 590 629 -69 -377 633 644 -475 -444 553 471 -625 -475 401
6551D01j34j065J81R45j52q47pR92R8r54n3J111j03r08J31R16O6j057K28Q35r8
$$ 401 267 -798 -617 328 176 -671 -678 314 412 -542 -595 516 413 -495 -364 552 618 -439 -211 624 526
6572E26q91K23Q22j29r39k3Q79o8q08lR91l35r70J48P90j53p89l1J058j18q12
$$ 526 -365 -142 680 551 -388 -411 468 400 -408 -411 580 245 -725 -577 213 60 -729 -760 298 180 -632
6593f32J17R96j8j033J78J081j31r76J97J087k04r95Q9Q10k19o68k8R13p2r75
$$ -632 -515 481 463 -570 -392 689 558 -418 -221 866 662 -333 -244 566 347 -321 -349 564 492 -483
6613d83q1J036k84r53J61R85Mj236L04Q84o4q82K70R23l00q56K83R37o4r93P9
$$ -483 -564 472 188 -765 -604 381 385 -851 -547 337 273 -609 -339 584 284 -572 -289 648 584 -409 -330
6634c30J223m99q64K16J086l23j039K20J020n12q59L04P09j85q77J65J115k81
$$ -330 893 394 -470 -254 832 509 -530 -310 710 198 -661 -357 352 167 -710 -545 570 289
6652B89j158N43O71n3r14L50Q82k04q88L59R56l77r70L95Q42m18q41K38J167n88
$$ 289 -869 -326 345 292 -622 -272 610 406 -482 -123 833 456 -514 -119 723 305 -536 -298 869 281
6672B81q74K58Q45k89j026K50J113k77j102N53O28k61r48O19Q76k40j029L87J034
$$ 281 -593 -335 510 221 -805 -555 558 281 -821 -268 360 99 -849 -230 646 406 -623 -236 798
6691G98m80r11L64J068m96p00K58P92k94r36L38R55m78r26L53P89k29j164N24
$$ 798 318 -593 -229 839 343 -357 -99 693 399 -537 -199 756 278 -648 -295 494 265 -899 -375
6710c75Q73l77j026M63R35m77q33M82P90k32r72M94J113o21p84M89Q21n43q77
$$ -375 498 121 -905 -442 493 16 -817 -335 455 223 -749 -255 858 237 -547 -58 763 220 -657
6729f57O94Q90n42r58M95P93m58j050M78Q83n09q80M42R72l73j016L30R66n43
$$ -657 37 927 385 -573 -78 715 257 -793 -315 568 59 -821 -379 593 220 -796 -466 500 -43
6748d3p63N87P79l96p91N67Q44l84j001P12O23m02q07N35O62m76o50M77O33o46
$$ -43 -806 -219 560 164 -627 -60 784 400 -601 111 734 332 -475 60 722 246 -404 73 706 60
6768F0p64N22O17n52o68L67Q29m74p95N06Q14m22p85N88Q40m97p67O85P44n93
$$ 60 -704 -182 435 -117 -785 -418 411 -63 -858 -352 462 40 -745 -157 683 186 -581 104 848 255
6788B55p63P41M49l38r12N34Q06p35n63L39Q77o11j040P54P03o05p59N90Q59q43
$$ 255 -508 233 682 344 -568 -34 772 37 -526 -187 690 79 -961 -207 496 -109 -868 -278 581 -262
6808b62m64N53P36n01q18O92P50o85p21P20Q27o18r14Q95M93n32p94O63P54q35
$$ -262 -726 -173 563 62 -756 -64 686 1 -720 0 827 209 -705 190 683 151 -643 20 774 -61
6828f1m70O15O61r44n48O11O08o99m89O04N79o71p14R18P32r79n23Q38P99r03
$$ -61 -531 84 745 -199 -747 -136 472 -227 -716 -112 467 -204 -918 0 732 -247 -770 68 867 -36
6848c6m71P87M93o07n89Q16M66p34p19Q19P19r56n20O69N08j044k77N64P23q94
$$ -36 -507 280 773 166 -423 393 859 125 -594 225 944 -12 -532 137 645 -399 -676 -112 611 -283
6868b83m93P83M98o96m64O96N24o97m94P20N31o84m61P11Q07r09n12O56M22p00
$$ -283 -776 7 505 -191 -655 41 565 -132 -626 94 625 -59 -520 191 998 89 -423 233 655 -45
6888d5n11Q25M57r18l59N82M20n75o69Q80M05p79n03Q52M76q27m20O21Q87r14
$$ -45 -556 269 726 -192 -551 31 451 -124 -793 87 492 -287 -790 62 538 -289 -709 -88 799 -115
6908a15m90R77M41q26n51Q14N36p21m64O92M19o26o70P82L90o46n08P44N15j231
$$ -115 -605 372 813 -13 -564 250 786 65 -399 293 712 86 -584 198 588 -58 -566 178 693 -538
6928e38l22Q65M24p33o07J031M43q21m16Q45N82j023l15R05M00p66n55R29L49
$$ -538 -860 5 429 -304 -911 120 563 -258 -674 171 753 -270 -585 320 720 -46 -601 328 677
6947F77p66l28P82L16q78k94Q87L35j098k78P40L45o87l91Q09L92j053k02R38
$$ 677 -89 -417 365 681 -197 -491 396 731 -367 -645 95 440 -247 -638 171 563 -490 -692 246
6966B46K34p32m09R60L00q94k58R59L54p75n00Q77M52r95k74Q71K36r84j37Q32
$$ 246 480 -252 -661 299 599 -295 -553 406 760 -15 -515 362 814 -181 -455 416 652 -332 -469 363
6986C63K38j041k18P21L17q13j99Q54L48r84m04J058L46r53j70Q08L79r38j90
$$ 363 601 -440 -658 63 380 -433 -632 222 570 -414 -818 240 586 -367 -537 271 650 -288 -478
7005d78R30K08q98l30J028K66r57k82Q24M88j210j80R35K83j006k20Q84J20q95
$$ -478 452 660 -238 -568 460 726 -231 -513 311 799 -411 -591 344 627 -379 -599 285 405 -490
7024d90j69R81J13q48l68J118J56r31p7R46K07r17k32J039J41j002j8R66q6o75
$$ -490 -659 322 435 -413 -781 337 493 -438 -515 431 638 -279 -511 528 669 -333 -351 615 529 -146
7044a46k80R78J0j110oR92L6r86p9R06J58j192J30Q95K06j159K38Q01J02q48N9
$$ -146 -426 552 562 -548 -554 438 474 -512 -591 315 473 -719 -589 306 512 -647 -409 392 494 -354 -295
7065b95Q10J0q22m3J014L5r58J7Q71k14o26j41Q79k19q33o2J042p8r27j56J013
$$ -295 515 525 -297 -340 674 709 -249 -232 639 425 -201 -342 537 318 -515 -577 465 387 -540 -696 317
7086C17q8p29j49R56K14j019n0R05K66r92R9Q41n2r05R7J040n4j010q2J002O2
$$ 317 229 -500 -649 307 521 -498 -548 357 623 -369 -270 571 519 -386 -289 751 697 -313 -395 607 669
7107F69j067k5R15J0q53j33R23j25q61P6J005k67r67K58Q76o2r65K17R49o8j090
$$ 669 -398 -423 492 502 -351 -484 439 314 -547 -471 534 267 -700 -442 434 372 -593 -376 573 505 -585
7128e85J83J039k31p30O9Q17o2j011J30J007l5j132K25R32j81j061J63Q75o5r51
$$ -585 -402 637 406 -324 -255 562 500 -511 -381 626 591 -541 -316 616 435 -626 -463 412 347 -604
7148f04J40R78m04p78L14R86l46j014M26Q55k69p51K28J018m34q33M19O98k47
$$ -604 -464 514 110 -668 -354 632 286 -728 -302 553 284 -467 -239 779 345 -488 -69 629 382
7167C82q93M43O61j68q78K29P56k55q71K08P84j95q45K18Q19k61p27J29J024k50
$$ 382 -511 -68 593 425 -453 -224 532 277 -594 -386 398 203 -642 -424 395 134 -593 -464 560 310
7187C10q54K89Q40j66r99K82R88r2r52J81R21l75j016M39Q77l29q56K64Q03m01
$$ 310 -544 -255 585 419 -580 -298 690 598 -354 -173 748 373 -643 -204 673 344 -512 -248 555 154
7207A54p73J64J048o11p53M87O35j52p69K12R41k87j034M18J009l41q35L95R87
$$ 154 -619 -455 593 -18 -771 -284 351 199 -570 -358 583 296 -738 -320 689 348 -487 -92 895
7226H95m85q52K99R19m65r03M40R89o02q95M23Q57l52j190N50Q22k26r19L71Q15
$$ 895 410 -442 -143 776 311 -592 -152 837 235 -660 -237 620 268 -922 -372 450 224 -695 -324 491
7246D91m18p93L97R46m78q70O48R62m59r91N89P24o04o37M90P62o15p19N43Q55
$$ 491 73 -720 -323 623 145 -725 -77 885 426 -565 24 748 144 -493 -3 759 144 -575 -32 823
7266H23n38r04L93R21p96o04N27O89m12q61L99P75m31p43O41Q17o34o05M85P52
$$ 823 285 -619 -226 695 -101 -705 -178 511 99 -762 -363 412 -19 -762 -121 696 62 -543 -58 694
7286F94m62p39N17P95n78r00O93O87l87q74M92P70o08r66M74J010n67q34N65Q26
$$ 694 232 -507 10 805 227 -673 20 707 320 -554 -62 708 100 -866 -392 618 51 -783 -218 608
7306F08o65p50P30O70n48p22N77P43n06p54O38O85m66o18N03O90q47n00N42Q48
$$ 608 -57 -807 -77 593 45 -677 -100 643 137 -617 21 706 240 -378 125 815 -32 -532 10 858
7326H58n65r38O92P30q11p90O61N70n82o68Q16O57q22o82Q19O57q12n48P65P51
$$ 858 293 -645 47 777 -34 -824 -163 407 -175 -843 -27 630 -192 -874 -55 602 -210 -758 7 758
7346G58q93o18P69Q76r58m97Q85M13p86o76R07N04p05o73P76L97p57l56O10O16
$$ 758 -135 -753 16 892 -66 -563 322 735 -51 -727 180 684 -21 -694 82 479 -278 -634 -24 592
7366E92p71o28P43P79q80o31Q76N71p71n00P44O06q11n42P71O50p10o15P69M49
$$ 592 -179 -807 -64 715 -165 -796 80 651 -120 -620 124 730 -81 -623 148 798 88 -527 242 691
7386F91q15m91Q64L72p38n31P57M32n45p60R25M01p70n13Q10O22r08n40P20O52
$$ 691 -124 -615 249 621 -117 -648 109 541 -4 -764 161 562 -208 -721 89 711 -197 -737 -17 635
7406F35o86n42O73O56p28m55O49N41o77n54P14O32q58m48O97M06q26o08R11M30
$$ 635 -51 -593 80 736 8 -447 202 743 66 -488 226 858 0 -448 249 655 -171 -779 132 562
7426E62q57m79O83O95r36m36P31M76o71n41P17P94q35m32R26L21p80m98R96M22
$$ 562 -295 -774 -91 604 -332 -768 -37 439 -232 -773 -56 738 -97 -529 397 718 -62 -560 436 858
7446H58q65n58Q61O30j097m33Q69L58q72m44Q54M33r36k92Q80L34j002k93R59
$$ 858 -7 -565 296 926 -171 -604 265 623 -249 -693 161 594 -342 -634 246 580 -422 -715 244
7465B44K59r67l61J116L95q34m57J003J59o04m81R66L59r69l60Q50M18j040j88
$$ 244 503 -464 -825 291 686 -148 -605 398 557 -47 -528 438 797 -172 -532 318 736 -304 -492
7484d92P65K84r35k22R12J50q84k16P85K68o91l72R11L05q78l85Q72M91q45m84
$$ -492 273 557 -378 -600 312 462 -422 -638 147 415 -276 -648 263 568 -310 -695 177 668 -177 -661
7504f61J085M04q92n78R35M20q34l97P60M99j157n8P86L19j035l63J018K60r03
$$ -661 424 828 -64 -642 293 713 -121 -518 242 741 -416 -474 312 631 -404 -767 251 511 -392
7523c92m32J107L85j101l47J030K99r93j47J067N2q38j83R51K57r33n07J307K0
$$ -392 -824 283 668 -433 -780 250 549 -444 -591 476 528 -310 -493 458 715 -218 -725 582 602
7542F02q28k53Q86K60j162j20R74J42r64J8P21K01q28l04R35J96j008J8J114j22
$$ 602 -226 -479 407 667 -495 -615 359 501 -463 -445 276 477 -351 -655 280 476 -532 -514 600 478
7562D78q55j31Q99K84j181J80Q65J67r69P0O97k9o57m01J111Q2r65k30R62J00
$$ 478 -377 -508 391 675 -506 -326 539 706 -263 -193 504 475 -182 -583 528 610 -355 -585 377 477
7582D77r43j44J112q2j057J39R82J49j045J0Q74J46j054m4Q79Q2r59MJ121M3j086
$$ 477 -466 -610 502 420 -637 -498 484 633 -412 -402 472 618 -436 -480 399 481 -478 -474 647 690 -396
7603c96L5J096p1j161L9R13L7r95l5J057j50r38m1J054o5j109J13J145j05q44
$$ -396 -361 735 664 -497 -458 455 492 -503 -538 519 369 -569 -610 444 379 -730 -617 528 423 -421
7623d21r6R56K11j009K9Q06Q5j056j0J142k3r12l49J292j02r46o3J105k70q78
$$ -421 -517 439 650 -359 -330 476 561 -495 -505 637 614 -298 -647 645 543 -403 -466 639 369 -509
7643e09n2J042k43q57R9J035k00r06KJ152r0r90p5J200k11j082L11J010k61q01
$$ -509 -561 481 238 -619 -520 515 315 -591 -589 563 473 -517 -592 608 397 -685 -374 636 375 -426
7663d26K40Q67j74j066L46Q38n6j266M39P49k64r55N70P10k53j017L18P46j65
$$ -426 -186 681 507 -559 -213 625 569 -697 -258 491 227 -728 -158 552 299 -718 -400 346 181
7682A81q08M08Q66l43p96J63R55k43p25M7J025k78j018M61P75k26j036L71Q11
$$ 181 -627 -219 647 304 -492 -329 626 383 -342 -295 730 452 -566 -105 670 444 -592 -221 590
7701E90l61p78J03R96j01j223K69J158n56p01P0R89j12j115K46J127l51p89M06
$$ 590 229 -549 -446 550 449 -774 -505 653 97 -604 -534 455 343 -772 -526 601 250 -539 -133
7720a33P64k51j031M48R16l92r29L80R75l82p51J47Q57j86j132K64J087n95q43
$$ -133 631 380 -651 -203 713 321 -608 -228 747 365 -386 -239 618 432 -700 -436 651 56 -787
7739g87M32Q36k21j011L51R47k97j081M29R53n71n92L84R94n41p43M81Q57l92
$$ -787 -355 481 260 -751 -400 547 250 -831 -402 551 -20 -612 -228 766 225 -518 -37 820 428
7758D28j112O68R01n53r97N99P96o40o79K46R98n53p79L29R24n23q95O97R05p83
$$ 428 -684 -16 885 332 -665 -66 730 90 -589 -343 655 102 -677 -348 576 53 -842 -145 760 -23
7778b3o81M75R23l97j000Q85O24o82p42N40Q82n59q49M42R85o08p88M87R07q22
$$ -23 -704 -229 694 297 -703 182 806 124 -618 -78 804 245 -604 -162 823 215 -573 -86 821 -1
7798ao72N73O22n30p65N30Q80o25p02M75Q58n00q03M21Q68o02o78O51Q05n73q22
$$ -1 -673 -100 522 -8 -773 -243 637 12 -690 -215 643 143 -660 -239 629 27 -651 0 805 232 -590
7819e90N27Q45o06q34M55R31o11q13N20Q46n42r41N46J086p44q99O71P24n50q09
$$ -590 -63 782 176 -658 -203 728 117 -696 -176 670 128 -813 -267 819 75 -824 -153 571 21 -788
7839g88P38O41o76o59P07P17o16o53O87P85q26o00O55O50p38o13N91Q11p33p41
$$ -788 -50 591 -85 -744 -37 680 64 -589 98 883 57 -543 112 762 24 -589 2 813 80 -661
7859f61O53P25q12n80P12O02p10p80R49O50q97m49N30P37r04m43Q06O66o61q22
$$ -661 -8 717 -95 -675 37 639 -71 -851 98 748 -149 -598 -68 669 -235 -678 128 794 133 -689
7879f89R04O14p54q54J018N93q01p65R18N83r56n68R62N08q53p18Q83N61p06q46
$$ -689 215 829 75 -779 239 832 31 -734 184 767 -189 -757 205 713 -140 -858 25 586 -120 -966
7899i66R72P04r52m53P47O58p86n40Q46N52q02o12Q97N13p50o19Q76N95r79o29
$$ -966 6 710 -242 -695 52 710 -76 -616 230 782 -20 -632 265 778 28 -591 285 880 -99 -728
7919g28R84N27r96m20P03M95o75p01P96O74r73l33O95N77p85o68R27O30q94n67
$$ -728 256 783 -213 -633 70 565 -110 -811 -15 659 -314 -647 48 625 -160 -828 99 729 -165 -732
7939g32Q61N62j002m04Q72N86q79m58P47O82p97o04Q77O14j164m88R50M10p73
$$ -732 129 691 -311 -715 157 743 -136 -594 153 835 38 -566 311 925 -239 -727 223 633 -140
7958a40p16J100N66j078n12R42N00q71m80R01N56r87l21R15M88j034m44R02M10
$$ -140 -856 244 810 -268 -780 162 662 -209 -689 212 768 -219 -540 375 863 -171 -615 287 697
7977F97r92l32J073L79r89o88J166L84j134l49J139J83j057k41R63M07r88j92
$$ 697 -295 -627 446 825 -164 -852 314 698 -436 -785 354 537 -520 -761 202 609 -379 -571
7995e71P75K34p53l44J135O3q86l58J156K38r65j41Q05L73j048l34J029K93j030
$$ -571 204 438 -315 -659 476 539 -347 -705 451 689 -276 -417 388 761 -287 -621 408 701 -329
8014c29n19J165K38j043K4O77L09j018l60J100K94p67m42Q79L22q27n36J281J21
$$ -329 -848 317 555 -488 -464 213 522 -496 -856 244 538 -229 -671 208 530 -297 -833 448 569
8033E69r51k73J077L15j089pR75lq89l76J056K56j081j72R36L40j215j27R82M13
$$ 569 -382 -655 422 737 -352 -359 616 613 -276 -652 404 660 -421 -593 343 683 -532 -659 323 736
8053G36j159k79J074K16j039l68J227K09j124j15J117O6j159J05J083K9q74l19
$$ 736 -423 -702 372 588 -451 -819 408 617 -507 -622 495 561 -598 -493 590 619 -255 -574
8071e74J201K23j228k76J246j08j039r9J141J21j057j42J043k7r74q0J165J88
$$ -574 627 850 -378 -654 592 484 -555 -654 487 608 -449 -591 452 425 -549 -629 536 724
8089G24j324J29J112j16r66N9R49O8j343K30J008J85j162l8J046j9j084l7J070
$$ 724 -600 -471 641 525 -441 -382 567 635 -708 -478 530 715 -447 -485 561 542 -542 -579 491
8108D91lr14j91J118R2j183L7J014k18r21K18R75J56j321j9J190o8j018Q6R26
$$ 491 488 -426 -617 501 593 -590 -553 461 243 -678 -460 515 671 -650 -669 521 453 -565 -479 447
8128D47K66j139n3J199r3j161J34R38J51j167N5J183k00j256J68J228j68j142
$$ 447 713 -426 -479 720 627 -534 -400 538 689 -478 -423 760 560 -696 -528 700 532 -610
8146f10Q3J149j18j113n1J108K1j175J25J203j03j140J35J024j2j085N9J264l41
$$ -610 -527 622 504 -609 -660 448 469 -706 -581 622 519 -621 -486 538 526 -559 -500 764 423
8165D23r97J17J127j81j070K74Q88m6j261K63J189l47j124K18J165l33j125M29
$$ 423 -574 -457 670 489 -581 -307 581 535 -726 -463 726 379 -745 -527 638 305 -820 -391
8183c91R33j34j123L11R82k16q54J16
$$ -391 542 408 -715 -404 578 362 -492 -376
8191c76
$$ Imaginary data points
##PAGE= N=2
##DATA TABLE= (X++(I..I)), XYDATA
0@%%%%%%%%%%%qQqJ6j6J6k4L2l8M6n6O9p7Q8j04J21j38J58j82K08k36K66l02L43
$$ 0 0 0 0 0 0 0 0 0 0 0 0 -8 0 -8 8 -8 8 -16 16 -22 24 -32 37 -40 48 -56 65 -73 85 -97 111 -125 141 -161 182
35A82l86M33m84N41o02O67p40Q23r10J003j111J226j349J485j635J803j987K189
$$ 182 -204 229 -255 286 -316 351 -389 434 -476 527 -584 642 -707 778 -857 946 -1041 1148
53A148k418K676k966L296l679M126m656N296o089P105q444J0298j3051J7541k6050
$$ 1148 -1270 1406 -1560 1736 -1943 2183 -2473 2823 -3266 3839 -4605 5693 -7358 10183 -15867
68a5867M7469j94707l19092O36616K86682m63930j38616M76172J06800m24957
$$ -15867 31602 -163105 -482197 154419 441101 -22829 -161445 314727 421527 -3430
78c430j78257L61862K16889l59550l36993L01474K62709m27734k86882M93626
$$ -3430 -181687 180175 397064 37514 -299479 1995 264704 -163030 -449912 43714
88D3714K58063n03108k08596M72780J56166l80433n9566L87148J02174l27940
$$ 43714 301777 -201331 -409927 62853 219019 -161414 -220980 166168 268342 -59598
98e9598j60950K80590K06749k70856k22675L14423K12656l85864k12333M12398
$$ -59598 -220548 60042 266791 -4065 -226740 87683 300339 -85525 -297858 114540
108A14540J83265l94589j27684L51646O4683l27365o8128K85614J03156k58648
$$ 114540 297805 -96784 -224468 127178 191861 -135504 -203632 81982 185138 -73510
118g3510j60032K37325J76912k67704j78082L31652J92405l48223j53685L66502
$$ -73510 -233542 3783 180695 -87009 -265091 66561 258966 -89257 -242942 123560
128A23560J30119l27557p6984L06378N7982l04712j08867K61395J28895k61313
$$ 123560 253679 -73878 -150862 155516 213498 -91214 -200081 61314 190209 -71104
138g1104j60618K64570J54765l07176j46608L58428J60987l44796j22276L45485
$$ -71104 -231722 32848 187613 -119563 -266171 92257 253244 -91552 -213828 131657
148A31657J05695l19395p8128L18453Q6093l21934j33789K86672J26576l11708
$$ 131657 237352 -82043 -160171 158282 244375 -77559 -211348 75324 201900 -109808
158a09808j46222L20148J30561l53637j25660L73017J29016l47931r0722L53748
$$ -109808 -256030 64118 194679 -158958 -284618 88399 217415 -130516 -221238 132510
168A32510Q9879l30292p5315L35354R7475l24829j10405L17518J04366l33906
$$ 132510 222389 -107903 -183218 152136 249611 -75218 -185623 131895 236261 -97645
178i7645j08772L34332Q8907l51990r0866L36881P2792l27729o5908L10423O1922
$$ -97645 -206417 127915 216822 -135168 -226034 110847 183639 -144090 -209998 100425 162347
189A62347k99870o5235K96134P5180k86186o9963K93051P6414k84861o1119K91360
$$ 162347 -137523 -202758 93376 168556 -117630 -187593 105458 181872 -102989 -164108 127252
200A27252O0412k76886m8403K67546M4036k59920m8809K47637M5175k49267n6123
$$ 127252 187664 -89222 -137625 129921 173957 -85963 -134772 112865 158040 -91227 -147350
211a47350K37424M7875k45552n2081K41704M4044k42635m0405K39178M0164k30646
$$ -147350 90074 137949 -107603 -159684 82020 126064 -116571 -156976 82202 122366 -108280
222a08280l4073K32835L8823k26038l5873K30091M3244k26801l9269K34019M0333
$$ -108280 -142353 90482 129305 -96733 -132606 97485 140729 -86072 -125341 108678 149011
233A49011k35235l5701K36893L3799k39283l4817K35588K8980k40704l3321K35410
$$ 149011 -86224 -121925 114968 148767 -90516 -125333 110255 139235 -101469 -134790 100620
244A00620K8398k43285l4801K44330L0936k49977k8985K53154K7957k52244k1875
$$ 100620 129018 -114267 -149068 95262 126198 -123779 -152764 100390 128347 -123897 -145772
255a45772K58266K2660k55827j6056K60660J9291k57898j5932K63827J6675k64426
$$ -145772 112494 135154 -120673 -136729 123931 143222 -114676 -130608 133219 149894 -114532
266a14532j1870K66320R033k68853q642K67575L266k70902l541K65846k374k69321
$$ -114532 -126402 139918 148951 -119902 -128544 139031 142297 -128605 -132146 133700 131326 -137995
278a37995k172K63058n051k67267L552K62672o217k58898J0597K61315n656k51578
$$ -137995 -140167 122891 117840 -149427 -145875 116797 110580 -148318 -137721 123594 117938 -133640
290a33640J4937K53969j0465k43360J5663K44222j3421k38421J5600K33226j8021
$$ -133640 -118703 135266 124801 -118559 -102896 141326 127905 -110516 -94916 138310 120289
301A20289k31026J2983K19939k0373k23845J4692K12713k0215k12226J7699K07909
$$ 120289 -110737 -97754 122185 101812 -122033 -107341 105372 85157 -127069 -109370 98539
312I8539j5982k02467J9158K01541j6586j94542K0120J95568j6403j90322K0732
$$ 98539 82557 -119910 -100752 100789 84203 -110339 -90219 105349 88946 -101376 -80644
323h0644J93005j7179j87981J8216J88074j8042j89259J7403J87203k0857j90193
$$ -80644 112361 95182 -92799 -74583 113491 95449 -93810 -76407 110796 89939 -100254
334a00254J9167J89228k1678j93839J9777J91543k5030j96684K2304J94683k6856
$$ -100254 -81087 108141 86463 -107376 -87599 103944 78914 -117770 -95466 99217 72361
345G2361j99278K8061K02316k8043k00605L3579K07879k9319k05098L7251K11796
$$ 72361 -126917 -98856 103460 75417 -125188 -91609 116270 86951 -118147 -80896 130900
356A30900l6001k09731M1118K12777m2436k13400M3708K11663m9470k15761M4990
$$ 130900 94899 -114832 -73714 139063 96627 -116773 -73065 138598 89128 -126633 -81643
367h1643K09562n1365k15689M8944K14338n2271k15049N4880K17090n6299k15198
$$ -81643 127919 76554 -139135 -90191 124147 71876 -143173 -88293 128797 72498 -142700
378a42700O0647K14422o2763k10053O6631K09731o3439k05631O4750K06466o1354
$$ -142700 -82053 132369 69606 -140447 -73816 135915 72476 -133155 -68405 138061 76707
389G6707k02853O4147K06134o2840k04379O6780K02751p1064k00552P0022J89846
$$ 76707 -126146 -61999 144135 81295 -123084 -56304 146447 75383 -125169 -55147 134699
400A34699p5744j90352O7005J78501o9160j78680O0634J73272n9584j73683O1633
$$ 134699 58955 -131397 -64392 114109 44949 -133731 -73097 100175 40591 -133092 -71459
411g1459J79453n6466j70408O5573J72303o2831j60598O9163J58086o4859j51208
$$ -71459 107994 51528 -118880 -53307 118996 56165 -104433 -35270 122816 57957 -93251
422i3251N8318J45610n4270j47121M8855J47364n2966j57434M9591J57261n4526
$$ -93251 -34933 110677 56407 -90714 -41859 105505 52539 -104895 -55304 101957 47431
433D7431j58431N8713J52333o8294j51381O7554J48151o2410j45534N8219J47177
$$ 47431 -111000 -52287 100046 31752 -119629 -52075 96076 33666 -111868 -53649 93528
444I3528n3930j46989O1671J62016n8599j64703O6312J70097o9569j63698P9407
$$ 93528 39598 -107391 -45720 116296 57697 -107006 -40694 129403 59834 -103864 -24457
455b4457J60297q6993j64576P9949J57889q1190j60989P3665J55997q0644j66623
$$ -24457 135840 48847 -115729 -35780 122109 40919 -120070 -46405 109592 28948 -137675
466a37675Q1159J74075q2380j73913Q8606J72468r2147j65171J02770J68808r9149
$$ -137675 -56516 117559 35179 -138734 -50128 122340 30193 -134978 -32208 136600 37451
477C7451j63437R6356J60421r1323j56909R3626J60915r5670j66945R3977J65310
$$ 37451 -125986 -29630 130791 39468 -117441 -23815 137100 41430 -125515 -31538 133772
488A33772r5058j61458R8078J55379j05871j57658J01566J54275r7310j51044
$$ 133772 38714 -122744 -24666 130713 24842 -132816 -31250 123025 25715 -125329
498a25329R2967J43906r8607j44951J02099J48256r7921j44857R3042J38725q9799
$$ -125329 -32362 111544 12937 -132014 -29915 118341 20420 -124437 -31395 107330 17531
509A7531j28505R7880J33499r3444j35368Q8677J36626q3177j27867Q8075J22247
$$ 17531 -110974 -13094 120405 26961 -108407 -19730 116896 33719 -94148 -6073 116174
520A16174r5698j24987R1957J22308q6374j19439P5304J06243q0134j10888P7712
$$ 116174 20476 -104511 -12554 109754 23380 -96059 -20755 85488 5354 -105534 -27822
$$ [...]
8191F29
##END NTUPLES=NMR FID
##END=
