##TITLE=1H_DPAA1503
 aceton
 8 sc, 
 16.03.2022
##JCAMPDX= 6.0         $$ Bruker NMR JCAMP-DX V2.0
##DATA TYPE= NMR FID
##DATA CLASS= NTUPLES
##ORIGIN= UXNMR, Bruker Analytische Messtechnik GmbH
##OWNER= root
$$ XWIN-NMR		Version 3.5
$$ Wed Mar 16 11:04:50 2022 Russian Standard Time (UT+4h)  she@DPX200
##.OBSERVE FREQUENCY= 200.131346
##.OBSERVE NUCLEUS= ^1H
##.DELAY= (6, 6)
##.ACQUISITION MODE= SIMULTANEOUS
##.ACQUISITION SCHEME= undefined
##.AVERAGES= 8
##.DIGITISER RES= 18
##SPECTROMETER/DATA SYSTEM= spect
##.PULSE SEQUENCE= zg30
##.SOLVENT NAME= Acetone
##.SHIFT REFERENCE= (INTERNAL, Acetone, 0, 15.7039)
##AUDIT TRAIL= $$ (NUMBER, WHEN, WHO, WHERE, WHAT)
$$ ##TITLE= Audit trail, XWIN-NMR		Version 3.5
$$ ##JCAMPDX= 5.01
$$ ##ORIGIN= Bruker BioSpin GmbH
$$ ##OWNER= she
$$ F:/spectra/data/she/nmr/H-F/1/audita.txt
$$ ##AUDIT TRAIL=  $$ (NUMBER, WHEN, WHO, WHERE, WHAT)
(   1,<2022-03-16 11:03:20.26 +0400>,<she>,<DPX200>,
      <created by zg, POWCHK disabled, PULCHK disabled
       configuration hash MD5:
       00 E9 B6 7A A2 85 ED C7 34 08 36 98 17 FE 4E 26
       data hash MD5: 16K
       FF AD 6D 6E B0 71 11 EC 1F FC AC CF 17 F4 36 E9>)
$$ ##END=
$$ 
$$ hash MD5
$$ 1C EF 1D AD 28 A0 57 2B C1 E1 E2 19 AF 9A 6B 9A
##$RELAX= 
##$RELAX= 
##$RELAX= 
##$RELAX= 
##$RELAX= 
##$RELAX= 
$$ Bruker specific parameters
$$ --------------------------
##$DU= <F:/spectra>
##$EXPNO= 1
##$NAME= <H-F>
##$PROCNO= 1
##$TYPE= <nmr>
##$USER= <she>
##$AMP= (0..31)
100 100 100 100 100 100 100 100 100 100 100 100 100 100 100 100 100 100 
100 100 100 100 100 100 100 100 100 100 100 100 100 100 
##$AQSEQ= 0
##$AQ_mod= 1
##$AUNM= <au_zg>
##$AUTOPOS= <>
##$BF1= 200.13
##$BF2= 200.13
##$BF3= 200.13
##$BF4= 200.13
##$BF5= 200.13
##$BF6= 200.13
##$BF7= 200.13
##$BF8= 200.13
##$BYTORDA= 1
##$CFDGTYP= 0
##$CFRGTYP= 5
##$CHEMSTR= <none>
##$CNST= (0..31)
1 1 145 1 1 1 1 1 1 1 1 1 1 1 1 1 1 1 1 1 1 1 1 1 1 1 1 1 1 1 1 1 
##$CPDPRG= <>
##$CPDPRG1= <>
##$CPDPRG2= <>
##$CPDPRG3= <>
##$CPDPRG4= <mlev>
##$CPDPRG5= <mlev>
##$CPDPRG6= <mlev>
##$CPDPRG7= <mlev>
##$CPDPRG8= <mlev>
##$CPDPRGB= <>
##$CPDPRGT= <>
##$D= (0..31)
0 1.2 0 0 0 0 0 0 0 0.06 0 0.03 0 0 0 0 0.0002 0 0 0 0 0 0 0 0 0 0 0 0 
0 0 0 
##$DATE= 1647414199
##$DBL= (0..7)
120 120 120 120 120 120 120 120 
##$DBP= (0..7)
150 150 150 150 150 150 150 150 
##$DBP07= 0
##$DBPNAM0= <>
##$DBPNAM1= <>
##$DBPNAM2= <>
##$DBPNAM3= <>
##$DBPNAM4= <>
##$DBPNAM5= <>
##$DBPNAM6= <>
##$DBPNAM7= <>
##$DBPOAL= (0..7)
0.5 0.5 0.5 0.5 0.5 0.5 0.5 0.5 
##$DBPOFFS= (0..7)
0 0 0 0 0 0 0 0 
##$DE= 6
##$DECBNUC= <off>
##$DECIM= 32
##$DECNUC= <off>
##$DECSTAT= 4
##$DIGMOD= 1
##$DIGTYP= 9
##$DL= (0..7)
0 120 120 120 120 120 120 120 
##$DP= (0..7)
150 150 150 150 150 150 150 150 
##$DP07= 0
##$DPNAME0= <>
##$DPNAME1= <>
##$DPNAME2= <>
##$DPNAME3= <>
##$DPNAME4= <>
##$DPNAME5= <>
##$DPNAME6= <>
##$DPNAME7= <>
##$DPOAL= (0..7)
0.5 0.5 0.5 0.5 0.5 0.5 0.5 0.5 
##$DPOFFS= (0..7)
0 0 0 0 0 0 0 0 
##$DQDMODE= 0
##$DR= 18
##$DS= 0
##$DSLIST= <SSSSSSSSSSSSSSS>
$$ [...]
##$SUBNAM2= <"">
##$SUBNAM3= <"">
##$SUBNAM4= <"">
##$SUBNAM5= <"">
##$SUBNAM6= <"">
##$SUBNAM7= <"">
##$SUBNAM8= <"">
##$SUBNAM9= <"">
##$SW= 18.0517287032376
##$SWIBOX= (0..15)
0 0 2 0 0 0 0 0 0 0 0 0 0 0 0 0 
##$SW_h= 3612.71676300578
##$TD= 16384
##$TD0= 1
##$TE= 0
##$TE2= 300
##$TE3= 300
##$TEG= 300
##$TL= (0..7)
0 120 120 120 120 120 120 120 
##$TP= (0..7)
150 150 150 150 150 150 150 150 
##$TP07= 0
##$TPNAME0= <>
##$TPNAME1= <>
##$TPNAME2= <>
##$TPNAME3= <>
##$TPNAME4= <>
##$TPNAME5= <>
##$TPNAME6= <>
##$TPNAME7= <>
##$TPOAL= (0..7)
0.5 0.5 0.5 0.5 0.5 0.5 0.5 0.5 
##$TPOFFS= (0..7)
0 0 0 0 0 0 0 0 
##$TUNHIN= 0
##$TUNHOUT= 0
##$TUNXOUT= 0
##$USERA1= <user>
##$USERA2= <user>
##$USERA3= <user>
##$USERA4= <user>
##$USERA5= <user>
##$V9= 5
##$VALIST= <valist>
##$VCLIST= <CCCCCCCCCCCCCCC>
##$VD= 0
##$VDLIST= <DDDDDDDDDDDDDDD>
##$VPLIST= <PPPPPPPPPPPPPPP>
##$VTLIST= <TTTTTTTTTTTTTTT>
##$WBST= 1024
##$WBSW= 4
##$XGAIN= (0..3)
0 0 0 0 
##$XL= 0
##$YL= 0
##$YMAX_a= 890842
##$YMIN_a= -907483
##$ZGOPTNS= <>
##$ZL1= 120
##$ZL2= 120
##$ZL3= 120
##$ZL4= 120
##$ABSF1= 10
##$ABSF2= 0
##$ABSG= 5
##$ABSL= 3
##$ALPHA= 0
##$AQORDER= 0
##$ASSFAC= 0
##$ASSFACI= 0
##$ASSFACX= 0
##$ASSWID= 0
##$AUNMP= <proc_1d>
##$AZFE= 0.1
##$AZFW= 0.1
##$BCFW= 1
##$BC_mod= 2
##$BYTORDP= 1
##$COROFFS= 0
##$CY= 11.3945322036743
##$DATMOD= 1
##$DC= 2
##$DFILT= <>
##$DTYPP= 0
##$F1P= 2.36226072786647
##$F2P= -0.459571619588291
##$FCOR= 0.5
##$FTSIZE= 0
##$FT_mod= 4
##$GAMMA= 1
##$GB= 0.15
##$INTBC= 1
##$INTSCL= 1
##$ISEN= 128
##$LB= 0.24
##$LEV0= 0
##$LPBIN= 0
##$MAXI= 10000
##$MC2= 0
##$MEAN= 0
##$ME_mod= 0
##$MI= 1.114404
##$NCOEF= 0
##$NC_proc= 0
##$NLEV= 6
##$NOISF1= 3.799351
##$NOISF2= 2.8
##$NSP= 1
##$NTH_PI= 0
##$NZP= 0
##$OFFSET= 15.70392
##$PC= 1
##$PHC0= -17106.21
##$PHC1= 9.800779
##$PH_mod= 1
##$PKNL= yes
##$PPARMOD= 0
##$PSCAL= 0
##$PSIGN= 0
##$REVERSE= no
##$SF= 200.130013532006
##$SI= 16384
##$SIGF1= 3
##$SIGF2= 2
##$SINO= 400
##$SIOLD= 16384
##$SREGLST= <1H.CDCl3>
##$SSB= 0
##$STSI= 0
##$STSR= 0
##$SW_p= 3612.71676300578
##$SYMM= 0
##$S_DEV= 0
##$TDeff= 0
##$TDoff= 0
##$TI= <>
##$TILT= no
##$TM1= 0
##$TM2= 0
##$TOPLEV= 0
##$USERP1= <user>
##$USERP2= <user>
##$USERP3= <user>
##$USERP4= <user>
##$USERP5= <user>
##$WDW= 1
##$XDIM= 8192
##$YMAX_p= 0
##$YMIN_p= 0
$$ End of Bruker specific parameters
$$ ---------------------------------
##NTUPLES= NMR FID
##VAR_NAME=  TIME,          FID/REAL,        FID/IMAG
##SYMBOL=    X,             R,               I
##VAR_TYPE=  INDEPENDENT,   DEPENDENT,       DEPENDENT
##VAR_FORM=  AFFN,          ASDF,            ASDF
##VAR_DIM=   8192,          8192,            8192
##UNITS=     SECONDS,       ARBITRARY UNITS, ARBITRARY UNITS
##FACTOR=    0.0002768,     1,               1
##FIRST=     0,             0,               0
##LAST=      2.2672688,     0,               0
##MIN=       0,             -907483,         0
##MAX=       2.2672688,     890842,          0
$$ Real data points
##PAGE= N=1
##DATA TABLE= (X++(R..R)), XYDATA
0 0 0 0 0 0 0 0 8 0 8 -8 16 -16 24 -24 32 -40 48 -64 80 -96 112 -136 160 -192 222 -264 301 -352 402 -464
30 -464 530 -603 685 -777 875 -987 1109 -1240 1390 -1548 1725 -1915 2125 -2351 2605 -2872
46 -2872 3174 -3496 3855 -4246 4674 -5152 5676 -6264 6919 -7662 8499 -9466 10585 -11910
60 -11910 13489 -15431 17869 -21050 25376 -31655 41644 -60142 106407 -478578 -907483
71 -907483 -705372 -868907 -615508 -709636 -345782 -261476 -224133 -27614 229024 287355 379947
82 379947 541025 606331 794946 707925 684540 885175 680982 749274 590512 489213 518150
93 518150 231325 196097 68600 -99683 -185447 -362106 -428975 -504089 -579705 -699436 -645629
104 -645629 -706471 -705711 -579134 -663639 -474334 -436663 -384298 -130793 -151532 17954 143003
115 143003 216079 374031 425278 495573 571393 623217 574779 639292 619291 537641 544332 375309
127 375309 380729 293624 119607 92178 -69897 -127662 -221636 -340391 -370988 -452331 -507399
138 -507399 -529208 -519644 -541644 -497464 -487436 -438645 -319169 -323352 -181395 -105086 -60227 95573
150 95573 127471 245327 329959 338249 421224 475184 475104 488118 486056 433844 448717 359216 287029
163 287029 282450 139503 88697 -2242 -92321 -118226 -245443 -301421 -339106 -382166 -414562 -436897
175 -436897 -439892 -421831 -393645 -392051 -297371 -263626 -210498 -118060 -91430 44529 81057 137555
187 137555 236938 249706 332019 355788 380583 396220 389663 381877 361874 344347 255488 246674
199 246674 171371 91788 60691 -54722 -65243 -160606 -235580 -245429 -310518 -315469 -376053 -366437
211 -366437 -352879 -350496 -319207 -310239 -224946 -208153 -144715 -79717 -26480 66413 70387 167802
223 167802 210386 248121 302626 284621 352561 328248 326181 324148 282488 274279 196475 178595
235 178595 113510 64271 7829 -77733 -84372 -178865 -200259 -242861 -290799 -278332 -337398 -301299
247 -301299 -307406 -292094 -259612 -249452 -166524 -154381 -84681 -41685 10151 88977 99094 182407
259 182407 202802 247303 273296 268232 316755 283343 293913 258834 231754 221052 146848 129846
271 129846 58591 22890 -29310 -95178 -113155 -184136 -198232 -245277 -263479 -259817 -292746 -264566
283 -264566 -271730 -237746 -212296 -187595 -127923 -103576 -38874 -9244 50274 103926 124593 185563
295 185563 198182 240641 253753 252034 273622 250867 246748 214578 193447 162094 109830 76437
307 76437 21629 -7795 -65096 -110084 -137925 -183017 -199973 -236485 -240868 -243791 -254030 -235958
319 -235958 -227490 -193907 -169938 -139980 -94089 -54656 -9865 27798 75576 111542 147204 177695
331 177695 200852 228073 228017 235457 234997 220693 206310 176645 151690 119314 78561 37479 725
344 725 -40671 -81528 -115836 -150641 -171523 -200176 -214668 -218837 -225822 -215258 -209643 -185801 -161247
357 -161247 -137688 -100726 -66956 -24494 8667 48323 83636 118493 149401 165878 196547 200237
369 200237 212117 213714 197785 199616 167033 150605 123032 84605 60165 13938 -14864 -54555
381 -54555 -86579 -117040 -146531 -162448 -189358 -188448 -204045 -198424 -185791 -186538 -149531 -141874 -105775
394 -105775 -71734 -52304 -1462 20329 60307 90069 114170 145370 160719 179615 180328 195005
406 195005 184791 176620 169826 136011 133255 89607 62258 42800 -7721 -22952 -67501 -92795
418 -92795 -109764 -145280 -155983 -171335 -174056 -180404 -175666 -168805 -152032 -126582 -121765 -78119 -57488
431 -57488 -29180 13207 21321 73278 91541 107113 142781 143411 167348 168786 162623 167742 155692
444 155692 138602 121060 102490 70120 53165 15100 -14180 -27664 -77884 -85752 -110928 -138718
456 -138718 -133315 -164828 -157067 -152181 -162422 -137488 -129570 -112746 -84848 -66713 -39692 -5382 12237
469 12237 40252 76412 82467 114226 129379 131581 158667 140286 147137 153068 121174 122232 97176
482 97176 73922 63869 22504 1568 -14587 -49591 -71423 -87194 -111818 -117317 -131450 -150117
494 -150117 -130261 -138571 -136841 -113346 -115894 -80216 -64758 -57132 -12047 468 24181 51542 63588
507 63588 94649 108184 108468 126631 136689 127690 130655 115981 106217 108028 66057 58007 44332
520 44332 5830 1217 -38721 -53964 -56910 -97114 -101223 -109600 -123173 -115945 -123674 -126044 -102207
533 -102207 -98180 -91267 -58925 -57507 -26099 -291 -3317 44663 52885 63154 93729 84844 112796
546 112796 120029 102911 116728 110728 97879 93489 70615 56967 53233 13672 -411 -6706 -42397
559 -42397 -44804 -74500 -89657 -75924 -109664 -106991 -102003 -112406 -90983 -94358 -86995 -56464 -54314
572 -54314 -41127 -9991 -2409 21432 41328 39457 76336 82333 77944 104948 93165 99778 103526
585 103526 80638 91243 76939 49356 48993 29803 11034 957 -29529 -37630 -43108 -74716 -73497
598 -73497 -80165 -96209 -87447 -98917 -90356 -74029 -85401 -66752 -47598 -43091 -18725 -10507 3577
611 3577 32964 31700 49361 71748 68022 82821 83865 82708 96210 80969 72325 75202 55897
624 55897 46798 38064 12857 8996 -10850 -33379 -28983 -54424 -64417 -66481 -84089 -74910 -82854 -86435
638 -86435 -71995 -73893 -66845 -51234 -41648 -28034 -13568 -9052 16773 32421 31496 55214 56372
651 56372 68633 79249 67192 84926 77875 67298 68152 56563 52954 37824 20282 10251 4739
664 4739 -16522 -30334 -34745 -54585 -52985 -69293 -73257 -62609 -81270 -70621 -68132 -62046 -47175
677 -47175 -49463 -32823 -20488 -7684 2423 17460 29591 35437 52127 51968 68647 68267 62423
690 62423 76278 62156 67022 57619 44966 46259 24079 18736 7733 -3941 -17212 -31543 -36982
703 -36982 -47997 -49464 -65782 -63363 -62572 -71604 -57135 -63990 -50376 -43999 -44648 -20883 -17647 -3074
717 -3074 4649 14360 30637 35837 46676 49456 61105 58243 60536 65883 56801 61101 43688 42547
731 42547 39183 20277 18503 -171 -5472 -16427 -30531 -32512 -44076 -49706 -59127 -56180 -57273 -59275
745 -59275 -56102 -57191 -41095 -41672 -33336 -19402 -15375 907 2890 17490 30774 33220 41321 45140
759 45140 55585 55775 55604 54309 53355 51882 39749 39636 29692 20259 11176 -2278 -2993 -17246 -27379
774 -27379 -34052 -41152 -43637 -51664 -52076 -53109 -51716 -52309 -47034 -37423 -35683 -26216 -21228 -8454 2390
789 2390 5544 18697 24764 33513 38357 43452 50328 49513 49944 47297 50516 44345 36854 32306 23104
804 23104 20232 5931 -212 -6889 -18695 -23857 -34668 -34584 -41686 -47593 -48078 -49272 -44001 -47154 -40365
819 -40365 -36178 -30184 -21843 -18265 -2775 -308 8633 17102 23165 35701 32988 41723 44002 45734
833 45734 47534 41780 45931 36784 33785 26661 20483 17163 1140 -676 -11897 -16502 -23222 -34577
847 -34577 -31712 -42724 -41382 -44640 -44507 -38818 -44506 -34161 -32456 -23319 -17969 -14746 -305 1037
861 1037 13740 16213 24848 33564 30293 41778 38694 44497 42311 36429 41402 31174 31105 21103 16510
876 16510 11832 -1239 -2183 -14342 -15527 -25627 -32710 -30498 -40203 -36035 -43159 -39626 -35413 -38731
890 -38731 -28413 -28945 -18385 -15252 -10068 1900 4077 15479 15537 25740 30897 31161 39223 34554 42023
905 42023 36795 34486 36580 27016 27271 16205 13600 8029 -1581 -5351 -15576 -16033 -26264 -28781 -31388
920 -31388 -37151 -33535 -40833 -34055 -33560 -33084 -25302 -25458 -14705 -12205 -5432 2318 6758 15002 17046
935 17046 26367 27892 31969 34254 33456 38821 32029 33292 29632 24265 23092 12692 10958 3809 -3350
950 -3350 -8709 -15242 -18367 -25243 -27926 -32943 -31957 -33817 -36462 -30753 -32607 -26392 -23942 -20907 -11096
965 -11096 -9299 -2170 3441 9708 15612 19617 24056 27386 32399 30316 34055 32981 30111 31532 23284
980 23284 23495 17777 10683 8470 -716 -4123 -10164 -15857 -20531 -23877 -27940 -30759 -29654 -34812 -29581
995 -29581 -30353 -29921 -21012 -23757 -14160 -10313 -7695 2815 4302 11290 16340 20444 23940 28152 29256
1010 29256 29675 34018 27365 30723 26950 20558 23151 10856 11153 5226 -3596 -3734 -13820 -15385 -20182
1025 -20182 -24965 -27020 -28636 -29711 -31667 -27273 -30202 -22991 -21697 -21170 -8295 -11935 -1656 2897
1039 2897 3959 16791 13909 20588 25383 25869 28961 28789 29250 27787 28960 20446 21738 18229 8422
1054 8422 11480 -1670 -1861 -5243 -17124 -13297 -22325 -23590 -24582 -29857 -27370 -27794 -27200 -26495 -20853 -20803
1070 -20803 -14466 -9941 -10098 3471 880 7739 15694 12639 24862 21593 23635 30313 25549 27582
1084 27582 26176 23389 21787 19407 11369 10734 7477 -3625 -841 -10956 -13696 -13164 -25745 -20006
1098 -20006 -24527 -28499 -24041 -28435 -23926 -21469 -21938 -16965 -11009 -9984 -4249 1349 2495 12975 11255
1113 11255 15311 24020 19295 26479 24969 23642 28745 21347 20936 20663 14582 11719 8051 1629 182
1128 182 -4848 -13138 -10971 -17804 -21461 -19984 -26763 -22755 -24248 -26593 -20016 -20735 -18201 -13179 -11225
1143 -11225 -6016 -865 573 7272 11615 11884 18915 19430 21617 24841 21308 25133 23464 19453 20162
1158 20162 15685 12689 10031 4002 1189 -1271 -9144 -10586 -13018 -18753 -17685 -23215 -23107 -20416 -25109
1173 -25109 -21228 -19371 -18402 -13929 -12434 -8406 -2317 -287 2214 9477 11016 14972 17929 17318 23863
1188 23863 21447 20981 23545 19664 20165 15537 12632 12049 6439 1963 -1388 -4274 -8677 -11560 -16382
1203 -16382 -17092 -18072 -23335 -20144 -22017 -21188 -18326 -20333 -13462 -11839 -9819 -4767 -2482 2829 5903
1218 5903 9469 12257 16154 17521 18817 22181 19766 22071 19748 17670 18293 12497 12245 7357 3258
1233 3258 1311 -4063 -5651 -10829 -13324 -15509 -17766 -18909 -21005 -19320 -20820 -18682 -17654 -15680 -10564
1248 -10564 -11427 -6183 -2583 611 5572 6041 11225 14013 15803 17647 18839 20566 18932 19347 17603
1263 17603 17012 14788 9591 9116 4842 1897 -1718 -6216 -7410 -12188 -14093 -16016 -17610 -18419 -20665
1278 -20665 -18807 -18129 -16876 -15604 -13517 -9451 -7696 -3741 -773 3115 6274 7672 12764 14583 16177
1293 16177 17332 17591 19752 18401 17188 16117 14385 11848 8121 6436 3097 -346 -4434 -7666 -8499
1308 -8499 -12325 -14936 -16498 -17440 -17604 -18708 -17557 -16281 -15095 -13566 -11039 -6762 -4750 -2245 1292
1323 1292 4672 8251 9822 12731 15064 16033 17002 17457 18503 16984 14974 14017 12301 10325 6330 3509
1339 3509 1253 -2317 -5440 -8285 -9826 -12950 -15454 -15855 -16423 -16290 -17685 -16742 -14153 -13139 -10989 -8872
1355 -8872 -5458 -2761 -667 3043 6292 9058 10040 12504 15219 15914 16545 15873 16509 15501 13497 12469
1371 12469 10166 7956 4055 1657 -5 -3648 -6604 -9678 -10918 -12617 -14912 -15431 -15830 -15849 -16196 -14588
1387 -14588 -12393 -10985 -9360 -7409 -3254 -612 1267 4367 6854 9698 11111 12842 15124 15219 14978
1402 14978 15056 15218 14319 11825 9645 8294 5962 2700 225 -2176 -4999 -7738 -10210 -11038 -12525 -15026
1418 -15026 -15239 -14977 -14575 -13797 -13610 -11154 -9038 -7814 -4465 -1887 647 2762 4845 8368 10675 11444
1434 11444 12600 14424 14702 14719 14273 13369 12990 9835 8296 7346 3843 1824 -1834 -3700 -4982 -8870
1450 -8870 -10053 -11717 -13039 -13984 -14490 -13898 -13351 -12937 -12464 -8877 -7565 -5914 -2826 -1719 2937 3909 5804
1467 5804 9829 9578 12075 12727 13564 14993 13230 12696 12244 11236 8515 7178 4645 2171 579 -4159
1483 -4159 -3705 -6741 -10279 -9899 -13301 -11763 -13440 -15073 -12471 -12977 -11462 -10115 -8134 -5982 -3783 -2093
1499 -2093 660 4698 4299 8043 9514 10230 14019 11442 14063 14068 11619 13278 10312 9607 7756 4760
1515 4760 3214 1129 -1728 -4398 -5296 -9268 -9368 -10866 -13354 -11440 -14823 -12882 -11466 -12891 -9174
1530 -9174 -9304 -6562 -3914 -3099 343 2879 4372 6013 9276 9821 12115 12375 11569 15027 11978 11946 11830
1547 11830 8484 9383 5071 3187 2956 -1245 -3368 -5361 -7305 -8636 -10387 -13133 -11775 -12223 -14567
1562 -14567 -11600 -12652 -10151 -8361 -9631 -3708 -2734 -1796 1835 2981 6571 8370 8114 11023 13389
1577 13389 11560 13103 13023 11784 13021 8164 8456 8579 3145 2955 -369 -2509 -2941 -7787 -8911 -8628
1593 -8628 -11775 -12618 -12234 -13865 -11273 -12205 -12690 -7587 -8623 -6091 -3064 -3020 2099 2814 4085 8242 8643
1610 8643 9997 12336 11907 12851 13823 11050 12657 10838 7633 9104 4335 3204 1708 -2761 -2212 -5998
1626 -5998 -8604 -8466 -10769 -12146 -12271 -13194 -12659 -11093 -13086 -9494 -7379 -8118 -3440 -3745 306 3454
1642 3454 2247 7148 8387 9761 11308 11363 12891 13563 12318 10893 12287 9147 8094 6433 2411 3959
1658 3959 -1394 -3408 -3902 -8125 -7325 -11046 -12032 -11256 -12984 -12956 -12760 -11350 -10795 -8536 -8446 -5318 -2008
1675 -2008 -2885 2394 2760 5521 8808 7158 11896 11817 12101 13119 12112 12969 11252 10130 8039 7770 4742
1692 4742 1899 1394 -3027 -2793 -6748 -8888 -8191 -12277 -11171 -13117 -12976 -11816 -12949 -10707 -10030 -7670
1708 -7670 -6647 -4152 -1851 -105 3504 3350 7587 8632 9383 12505 10942 13624 12852 11875 12482 10082
1724 10082 9775 7303 5775 3226 1346 -800 -4072 -4549 -8326 -8721 -10452 -12567 -11463 -13762 -12328
1739 -12328 -12405 -12002 -9614 -9281 -6476 -5225 -2610 -426 1689 4328 5631 8748 9128 11333 12209 12119 13821
1756 13821 11814 12538 11235 9397 8826 5645 4451 1920 -305 -2815 -4882 -6627 -9131 -9706 -12110
1771 -12110 -11979 -12651 -13698 -11936 -12490 -10431 -9410 -7815 -5248 -3850 -896 861 3774 5325 7407
1786 7407 9732 10477 12436 12037 13402 13219 12170 12103 9917 9614 6715 4691 3143 265 -1491 -4801
1802 -4801 -5873 -8239 -9880 -11113 -12770 -11980 -13855 -12752 -12048 -11569 -9317 -9192 -5856 -4144 -2053 396
1818 396 2338 5674 6301 9323 10363 11810 13057 12116 14185 12460 12224 11013 9040 8659 4796 3860
1834 3860 1020 -1194 -3335 -6669 -6917 -10047 -10857 -12734 -13168 -12488 -14319 -12157 -12495 -10298 -8782 -8159
1850 -8159 -3811 -3327 -37 1761 4147 7380 7762 10788 11026 13230 13290 12917 14268 11769 12343 9649 8540
1867 8540 7359 3237 2610 -1142 -2278 -5099 -8116 -8396 -11691 -11520 -13661 -13389 -13087 -14075 -11938 -12000 -8773
1884 -8773 -8182 -6214 -2765 -1848 2488 2924 6409 8761 9113 12210 12081 14337 13664 13246 13504 11928 11676
1901 11676 8358 7710 5099 2302 683 -3116 -3481 -7443 -9277 -10140 -12483 -12156 -14634 -13693 -13318 -13235 -11527
1918 -11527 -10707 -7840 -6942 -4258 -1746 980 3700 4281 8331 9524 11295 12771 12516 14867 13459 13168
1934 13168 12995 11355 10022 7202 5806 3462 1322 -2150 -4330 -5648 -9119 -9809 -12106 -12755 -13244 -15155
1950 -15155 -13240 -13097 -12198 -11062 -9599 -6538 -4822 -2676 -200 2983 4486 6872 9416 10695 12912
1965 12912 12162 13865 14822 13074 13224 11360 10487 8660 5637 4151 1988 -1154 -4114 -5281 -7834 -9388
1981 -9388 -11687 -13575 -12124 -14395 -13988 -13001 -12988 -10454 -10370 -7686 -4619 -3261 -1143 1696 4683 6569
1997 6569 8797 9456 12430 13319 12469 14787 13126 13425 12139 9298 10271 6754 4168 2107 -559 -2126
2013 -2126 -4965 -7638 -9458 -10010 -13007 -13098 -13022 -14492 -12290 -13912 -11304 -8710 -9174 -5188 -4228 -1272 1891
2030 1891 3045 6202 8133 9690 11076 13186 12984 13925 13965 11949 13476 10236 9290 8175 3515 3792
2046 3792 133 -2200 -3822 -7700 -8315 -10265 -12108 -13014 -13074 -13914 -13472 -12567 -12337 -8692 -9220 -7050 -3041
2063 -3041 -2659 1837 2366 4626 8751 8561 11107 12369 12991 13681 13162 12640 12890 11589 8187 8019 5227
2080 5227 3168 1618 -3299 -2978 -6158 -9241 -9053 -12136 -12068 -13091 -14438 -12732 -12224 -12217 -10284 -8426 -7266
2097 -7266 -3524 -2468 -158 3703 3595 7802 9625 9548 12845 12189 13265 14160 12158 12639 11714 8783 7862
2114 7862 6209 3198 1749 -2048 -4110 -4422 -8828 -9852 -10652 -13010 -12187 -14190 -13723 -11300 -12753 -10978
2130 -10978 -8407 -7147 -4032 -2930 -1071 3576 4472 6048 9359 9937 12164 12837 12011 14818 13281 11331
2146 11331 12012 9528 8594 6537 2530 2382 -433 -4220 -4854 -7604 -9455 -10520 -13223 -12351 -12475 -14441
2162 -14441 -12695 -11792 -10938 -8552 -8216 -5076 -1924 -1613 2011 4583 6092 8919 9120 11379 13650 12313
2178 12313 13132 13354 12108 11964 9642 7907 7343 3651 1385 297 -3269 -4705 -7174 -9884 -9468 -11926
2194 -11926 -13204 -12417 -13665 -12530 -11712 -11349 -8722 -7385 -6013 -2781 -949 1175 4236 5327 7956
2209 7956 10010 10318 12810 12726 12491 13487 11952 11778 10394 7766 7161 4582 1872 368 -2613 -4622 -6382
2226 -6382 -9164 -9846 -10865 -13119 -12610 -12864 -13024 -11267 -11583 -9400 -7072 -6587 -3307 -1228 710 3642
2242 3642 4831 7539 9637 10243 11637 12716 12713 12887 12363 11143 10854 8425 6670 5521 2175 803 -2053
2259 -2053 -4324 -5347 -8638 -9450 -10756 -12128 -12355 -12945 -12471 -11599 -10941 -10035 -7554 -6025 -4328 -1441 -227
2276 -227 3188 4840 6045 9296 9575 11320 12079 12038 13016 11822 11287 10279 9017 7124 5076 3312 715
2293 715 -855 -3885 -5362 -7046 -9554 -9813 -11826 -11724 -12023 -12766 -11053 -11097 -9460 -7998 -6551 -4120 -2448
2310 -2448 60 1857 4502 5826 7685 9735 9981 12028 11478 11986 12319 10529 10742 8596 7455 5720
2326 5720 3133 1768 -939 -2529 -5101 -6547 -8228 -9922 -10307 -12017 -11375 -11981 -11565 -10231 -10120 -7548
2342 -7548 -6903 -4616 -2359 -998 1951 3192 5615 7138 8602 10026 10618 11717 11196 11771 10814 9901
2358 9901 9266 6828 6156 3580 1767 58 -2598 -3811 -6273 -7461 -8980 -10142 -10653 -11496 -11028 -11220
2374 -11220 -10167 -9431 -8232 -6330 -5190 -2665 -1263 1075 3173 4450 6841 7774 9372 10253 10621 11228
2390 11228 10965 10727 9574 8974 7310 5790 4172 1813 550 -1969 -3634 -5281 -7240 -8047 -9713 -10170
2406 -10170 -10635 -10874 -10596 -10221 -8943 -8314 -6482 -5197 -3151 -1160 126 2762 4004 6052 7402 8312
2422 8312 9978 9998 10685 10431 10277 9637 8370 7509 5572 4559 2035 468 -1016 -3590 -4408 -6789 -7529
2439 -7529 -8764 -10059 -9721 -10551 -9897 -10023 -8881 -7755 -6864 -4772 -3970 -1174 -35 1765 4082 4817 7295
2456 7295 7461 8965 9883 9652 10441 9384 9666 8248 7201 6207 4110 3228 340 -376 -2541 -4390 -5288
2473 -5288 -7674 -7405 -9302 -9621 -9493 -10134 -8829 -9200 -7510 -6488 -5288 -3571 -2484 439 965 3222
2489 3222 4480 5832 8033 7232 9525 9387 9320 9701 8235 8898 7053 5819 4461 3054 1837 -860
2505 -860 -1562 -3859 -4586 -6438 -8066 -7268 -9599 -8980 -9383 -9334 -7539 -8387 -6400 -5348 -3891 -2376 -1122
2522 -1122 1153 2159 4299 4686 6910 7859 7558 9448 8318 9401 8753 7236 7850 5541 4864 3327
2538 3327 1732 466 -1586 -2817 -4383 -4940 -7175 -7467 -7945 -9062 -7954 -9281 -7790 -7041 -7327 -4902
2554 -4902 -4442 -2511 -1187 -200 1946 3283 4456 5327 7113 7199 8156 8335 7971 9038 6871 6984 6538
2571 6538 4467 4162 1702 787 -221 -2469 -3479 -4500 -5840 -6950 -7180 -8215 -7469 -8081 -8464 -6326
2587 -6326 -6945 -5284 -4128 -3740 -978 -805 806 2912 3427 4717 5809 6479 7452 7962 6949 8223 7466
2604 7466 6126 6809 4302 4324 2911 315 878 -1453 -2825 -3686 -5232 -5689 -6319 -7491 -7432 -6843 -8050
2621 -8050 -6483 -6172 -6024 -3578 -4458 -1882 -251 -429 2317 2451 3968 5377 5391 6618 7210 6830 6869 7472
2639 7472 5935 6179 4943 3329 4101 891 656 -129 -2739 -2424 -4654 -4922 -5124 -6939 -6777 -6506 -6605 -6725
2657 -6725 -5717 -5825 -3996 -3433 -3422 -156 -653 872 2334 2418 5322 4560 5203 6627 6365 6703 6226 6133
2675 6133 5716 5278 3488 3395 2755 312 451 -1780 -1899 -2577 -5331 -4219 -5609 -6061 -5880 -6720 -5650 -5656
2693 -5656 -5592 -4670 -3176 -3012 -1974 -657 -203 2193 1780 3076 4830 3993 5809 5495 5827 6482 5112
2710 5112 5449 5109 4215 3255 2475 1396 638 -347 -2112 -1821 -3526 -4435 -4337 -5765 -4879 -5938 -6055 -4897
2728 -4897 -5382 -4313 -3868 -3166 -2114 -1314 -411 805 1845 2065 3638 3882 4513 5445 4689 5844 5217 4836
2746 4836 5168 3984 3696 2663 1789 1197 151 -950 -1741 -2288 -3537 -3747 -4577 -4785 -4784 -5653 -4671 -4711 -4380
2765 -4380 -3793 -3595 -2141 -1578 -1019 25 961 1776 2432 3314 3716 4534 4321 4670 5135 4539 4672 3922 3556
2784 3556 3201 2010 1616 628 -152 -1091 -1841 -2437 -3197 -3686 -4379 -4205 -4620 -4645 -4300 -4386 -3586 -3533 -2669 -1785
2804 -1785 -1527 -378 12 1220 1837 2326 3184 3537 4094 4003 4520 4465 4238 4051 3298 3514 2467 1791 1186
2823 1186 265 17 -1267 -1718 -2355 -2974 -3376 -4045 -3808 -4266 -4220 -4049 -3841 -3101 -3096 -2138 -1729 -987 -280 131
2843 131 1367 1563 2319 2827 3184 3883 3550 3996 3929 3810 3660 3011 2963 2094 1662 854 306 -186 -1325 -1469
2863 -1469 -2377 -2580 -3142 -3683 -3413 -3939 -3677 -3698 -3422 -2830 -2870 -2003 -1594 -869 -277 137 1123 1492 2194 2452
2883 2452 3052 3411 3352 3728 3456 3562 3279 2753 2713 1888 1562 847 269 -202 -1060 -1435 -2075 -2403 -2937 -3258
2903 -3258 -3286 -3573 -3374 -3517 -3095 -2702 -2553 -1805 -1583 -776 -288 164 1001 1357 2014 2373 2729 3093 3209 3385
2923 3385 3341 3412 2995 2740 2424 1866 1590 707 376 -153 -930 -1273 -1952 -2201 -2607 -3057 -3027 -3248 -3245 -3129 -2939
2944 -2939 -2685 -2295 -1923 -1433 -754 -474 251 760 1211 1887 2053 2557 2972 2923 3198 3230 3074 3008 2602 2268 2001
2965 2001 1365 908 489 -241 -645 -1223 -1768 -2007 -2581 -2781 -2943 -3182 -3127 -3059 -2951 -2491 -2315 -1899 -1300 -1019
2985 -1019 -380 181 473 1320 1642 2068 2596 2601 3064 3116 2990 3152 2890 2547 2385 1825 1413 1042 243 -70 -599
3006 -599 -1436 -1503 -2167 -2545 -2619 -3217 -3032 -3035 -3216 -2744 -2688 -2275 -1753 -1472 -998 -299 67 722 1264 1483 2297 2352
3028 2352 2622 3207 2890 3247 3161 2723 2827 2257 1873 1507 864 449 -112 -812 -1179 -1652 -2317 -2386 -2841 -3123
3048 -3123 -2938 -3376 -3017 -2747 -2812 -2110 -2002 -1485 -651 -506 220 771 1182 1786 2186 2464 3018 3065 3026 3393 2952
3069 2952 2952 2816 2007 2104 1292 789 585 -398 -717 -1335 -1946 -2131 -2671 -3068 -3056 -3253 -3359 -3012 -3066 -2728 -2126
3090 -2126 -2120 -1199 -881 -467 564 655 1445 1967 2127 2875 2889 3040 3431 3294 3157 3085 2618 2380 2052 1076 930
3111 930 327 -549 -680 -1670 -1950 -2180 -3118 -2931 -3298 -3465 -3222 -3328 -3045 -2593 -2404 -1956 -1135 -941 -135 485
3131 485 683 1809 1976 2399 3100 2982 3592 3457 3244 3466 3086 2662 2324 1754 1235 882 -110 -516 -896 -1928
3151 -1928 -2068 -2771 -3073 -2959 -3776 -3557 -3330 -3386 -2913 -2808 -2273 -1513 -1289 -760 157 572 1156 1821 2019 3072
3171 3072 3129 3054 3747 3522 3692 3369 2876 2963 2350 1490 1149 593 -63 -684 -1653 -1978 -2216 -3133 -3287 -3526 -3762
3192 -3762 -3468 -3891 -3380 -2840 -2790 -2157 -1611 -1010 -235 152 809 1808 2065 2434 3180 3230 3762 3697 3501 3944 3312
3213 3312 2951 2676 2027 1597 832 120 -305 -1019 -1972 -2210 -2792 -3253 -3356 -3964 -3691 -3750 -3854 -3172 -2947 -2465
3233 -2465 -1971 -1509 -657 -52 438 1235 2105 2281 2946 3321 3639 4102 3592 3838 3838 3178 3080 2303 2003 1357 380
3254 380 -98 -611 -1474 -2295 -2507 -3123 -3332 -3771 -4108 -3566 -3919 -3559 -3196 -2976 -2040 -1989 -1140 -255 249 984
3274 984 1440 2349 2823 3297 3439 3902 4093 3707 4041 3456 3360 2854 1914 1913 831 226 -427 -1361 -1703 -2622 -2952
3295 -2952 -3446 -3681 -4065 -4088 -3734 -4013 -3294 -3387 -2637 -1832 -1745 -452 -98 741 1428 1876 2877 3080 3550 3735
3315 3735 4119 4210 3920 3847 3326 3310 2387 1831 1459 319 25 -1161 -1634 -2066 -3110 -3247 -3846 -3850 -4133 -4244
3335 -4244 -3888 -3849 -3309 -3116 -2184 -1729 -1186 -204 199 1443 1733 2334 3215 3324 3971 3909 4294 4263 3815 3666
3355 3666 3231 3017 2019 1542 844 78 -492 -1653 -1813 -2691 -3374 -3553 -4062 -3881 -4343 -4233 -3837 -3568 -3019
3374 -3019 -2796 -1809 -1339 -580 140 873 1895 2083 2958 3421 3863 4197 4026 4468 4075 3882 3535 3039 2572
3393 2572 1594 1103 316 -360 -1212 -2129 -2405 -3264 -3510 -4119 -4185 -4129 -4518 -3885 -3830 -3221 -2868 -2439 -1405 -794
3413 -794 30 563 1534 2180 2726 3399 3599 4306 4078 4243 4422 3955 3873 2997 2728 2128 1280 630 -335 -817
3433 -817 -1815 -2384 -3002 -3504 -3776 -4463 -4161 -4363 -4234 -3858 -3746 -2780 -2649 -1786 -964 -366 642 1010 2113
3452 2113 2573 3281 3575 3868 4571 4137 4497 4093 3794 3618 2488 2556 1447 779 -93 -956 -1239 -2428 -2790
3471 -2790 -3524 -3766 -4091 -4643 -4145 -4458 -3933 -3859 -3389 -2367 -2327 -1132 -694 347 1185 1467 2694 2985 3686
3490 3686 3913 4299 4615 4301 4464 3804 3901 3133 2236 2050 816 508 -643 -1460 -1796 -2910 -3182 -3914 -3964
3509 -3964 -4309 -4570 -4313 -4337 -3641 -3665 -2806 -2128 -1681 -557 -306 1061 1582 2115 3041 3288 3986 4062 4369 4410
3529 4410 4332 4140 3542 3593 2499 2069 1388 335 117 -1328 -1672 -2307 -3227 -3371 -4049 -4119 -4387 -4368 -4226 -3895
3549 -3895 -3443 -3262 -2234 -1928 -921 -187 298 1509 1708 2647 3274 3566 4186 4166 4356 4430 4207 3782 3387
3568 3387 2911 2118 1737 507 112 -676 -1864 -2001 -3047 -3349 -3777 -4453 -4103 -4452 -4289 -4064 -3660 -3220 -2558
3587 -2558 -1996 -1367 -152 103 1139 1847 2273 3447 3328 3924 4330 4144 4492 4025 3905 3615 2972 2176 1758
3606 1758 957 85 -419 -1688 -1898 -2615 -3592 -3443 -4249 -4182 -4165 -4602 -3821 -3729 -3362 -2749 -2098 -1461 -545 -19
3626 -19 714 2033 2053 3029 3447 3614 4676 3983 4251 4530 3748 3743 2960 2508 1969 1063 178 -259 -980 -2047
3646 -2047 -2393 -3410 -3431 -3834 -4690 -3901 -4471 -4101 -3636 -3760 -2587 -2275 -1665 -669 -8 721 1458 2118 2646
3665 2646 3650 3457 4053 4488 3962 4629 3758 3625 3577 2279 2216 1223 427 -63 -1054 -1800 -2294 -2979 -3633 -3600
3685 -3600 -4380 -4245 -4033 -4487 -3479 -3619 -3071 -2029 -2060 -786 -157 374 1394 1864 2544 3267 3610 3853 4404
3704 4404 4123 4207 4232 3356 3619 2676 2034 1838 348 183 -686 -1647 -1988 -2865 -3389 -3561 -4029 -4279 -3964 -4281
3724 -4281 -3957 -3374 -3375 -2282 -1964 -1354 -153 -24 1089 1748 2190 3160 3368 3710 4170 4166 4089 4195 3676 3387
3744 3387 3048 2072 1839 902 24 -326 -1421 -1914 -2585 -3335 -3390 -3937 -4217 -4109 -4158 -3946 -3551 -3343 -2644 -1877
3764 -1877 -1585 -478 123 796 1697 1985 2857 3413 3533 4064 4100 4222 4107 3734 3454 3161 2339 1690 1238 304
3784 304 -281 -1169 -1886 -2237 -3122 -3391 -3816 -4056 -4015 -4180 -3916 -3557 -3277 -2848 -2050 -1583 -843 -54 422 1505
3804 1505 1854 2401 3230 3433 3799 3946 4032 4068 3773 3435 3040 2580 1906 1320 606 -69 -738 -1684 -2005 -2700
3824 -2700 -3265 -3482 -3972 -3830 -4026 -3937 -3484 -3348 -2760 -2376 -1723 -981 -284 357 1010 1847 2231 2912 3301 3595
3844 3595 3986 3747 4014 3790 3392 3108 2550 2096 1347 699 77 -640 -1283 -2053 -2424 -2953 -3349 -3706 -3874 -3720
3864 -3720 -3913 -3639 -3297 -2882 -2285 -1907 -1105 -459 101 855 1373 2178 2617 3013 3396 3716 3856 3781 3808 3497
3884 3497 3145 2690 2111 1738 884 202 -353 -990 -1582 -2366 -2701 -3115 -3470 -3661 -3807 -3648 -3601 -3364 -2921 -2460
3904 -2460 -1923 -1497 -677 -53 655 1178 1732 2548 2749 3202 3473 3718 3797 3550 3459 3216 2779 2262 1664 1249
3924 1249 450 -126 -818 -1417 -1967 -2746 -2924 -3262 -3545 -3715 -3737 -3493 -3392 -3077 -2621 -2044 -1494 -1038 -210 395
3944 395 1029 1553 2105 2821 3106 3411 3566 3703 3694 3337 3271 2933 2401 1857 1241 803 3 -627 -1352 -1768 -2291
3965 -2291 -2914 -3111 -3418 -3532 -3613 -3573 -3256 -3007 -2696 -2217 -1591 -1039 -487 241 831 1457 1880 2428 2968 3181
3985 3181 3415 3515 3625 3456 3110 2874 2507 2021 1440 813 287 -374 -1064 -1659 -2000 -2575 -3023 -3300 -3382 -3387 -3528
4006 -3528 -3382 -2938 -2758 -2291 -1804 -1147 -596 -121 535 1248 1832 2150 2712 3027 3386 3440 3414 3591 3159 2807
4026 2807 2577 2172 1670 960 336 -171 -737 -1479 -1935 -2386 -2890 -3037 -3392 -3312 -3230 -3494 -2987 -2743 -2351 -1804
4046 -1804 -1507 -633 -92 355 1002 1663 2093 2516 2864 3164 3512 3270 3272 3378 2821 2729 2015 1693 1291 321 -83
4067 -83 -625 -1245 -1888 -2299 -2678 -2923 -3236 -3531 -3141 -3242 -3144 -2711 -2578 -1711 -1593 -1058 -149 176 955 1366 1899
4088 1899 2536 2771 2969 3291 3487 3230 3312 2953 2696 2453 1432 1448 596 21 -354 -1278 -1439 -2066 -2671 -2828
4108 -2828 -3148 -3283 -3274 -3251 -3145 -2700 -2612 -2078 -1361 -1304 -250 72 642 1512 1481 2417 2633 2799 3277 3237 3390 3199
4130 3199 2937 2624 2484 1762 1274 1055 15 -105 -944 -1577 -1582 -2617 -2587 -2859 -3264 -3017 -3297 -3042 -2719 -2584
4150 -2584 -2290 -1493 -1180 -712 118 233 1251 1494 1804 2728 2483 3076 3224 3046 3299 2839 2634 2449 1942
4169 1942 1399 1015 378 -114 -552 -1479 -1480 -2114 -2700 -2566 -3139 -2887 -2963 -3242 -2562 -2509 -2240 -1710 -1286 -711 -80
4190 -80 160 824 1559 1581 2305 2554 2694 3229 2781 3063 3056 2546 2462 1916 1510 1126 492 -46 -381 -1111 -1590 -1813
4212 -1813 -2471 -2487 -2886 -3101 -2760 -3114 -2687 -2436 -2347 -1665 -1425 -919 -294 151 575 1325 1673 2043 2573 2509 3059
4233 3059 2993 2777 3148 2591 2521 2118 1551 1278 613 154 -300 -865 -1444 -1751 -2236 -2612 -2600 -3085 -2850 -2876 -2932
4254 -2932 -2417 -2442 -1875 -1390 -1136 -377 3 617 1036 1567 1982 2408 2639 2734 3152 2789 2978 2713 2319 2340 1501
4275 1501 1348 884 152 -182 -875 -1236 -1773 -2079 -2474 -2657 -2750 -3004 -2757 -2867 -2526 -2205 -2066 -1356 -1201 -519
4295 -519 -14 239 1105 1295 1925 2190 2464 2824 2784 2983 2710 2878 2421 2143 1903 1245 1090 214 -153 -522
4315 -522 -1175 -1416 -2105 -2274 -2540 -2743 -2798 -2912 -2608 -2686 -2290 -2032 -1641 -1131 -868 -76 162 746 1198 1535 2166
4336 2166 2273 2632 2765 2804 2851 2590 2567 2098 1921 1468 946 634 -131 -326 -1008 -1373 -1782 -2244 -2207 -2736 -2704
4357 -2704 -2750 -2744 -2464 -2416 -1908 -1746 -1181 -819 -417 213 491 1110 1422 1865 2270 2364 2666 2612 2828 2583 2441 2243
4379 2243 1771 1627 1021 708 166 -369 -699 -1306 -1529 -2030 -2268 -2387 -2706 -2609 -2661 -2389 -2338 -2118 -1687 -1368 -879
4400 -879 -584 13 489 824 1333 1606 2144 2312 2467 2632 2569 2663 2323 2287 1886 1620 1269 633 394 -224 -626
4421 -626 -1098 -1493 -1719 -2201 -2296 -2497 -2604 -2466 -2525 -2212 -2111 -1795 -1448 -1040 -556 -259 368 659 1192 1557 1837
4442 1837 2313 2304 2562 2509 2532 2518 2105 1978 1610 1355 833 345 59 -518 -856 -1416 -1647 -1947 -2291 -2355 -2544 -2342
4464 -2342 -2449 -2344 -1970 -1897 -1449 -1149 -651 -242 137 707 958 1501 1706 2031 2339 2280 2568 2361 2524 2222
4484 2222 1839 1761 1240 1011 439 38 -331 -820 -1145 -1581 -1751 -2068 -2249 -2377 -2436 -2212 -2334 -2037 -1754 -1567
4504 -1567 -1045 -942 -298 106 435 920 1246 1704 1838 2131 2297 2370 2393 2239 2275 1897 1752 1341 928 777 94
4525 94 -173 -592 -1070 -1308 -1740 -1912 -2089 -2300 -2280 -2269 -2140 -2122 -1789 -1603 -1135 -820 -558 47 251 760 1109
4546 1109 1391 1867 1901 2111 2317 2321 2282 2124 1943 1737 1459 1013 782 314 -171 -404 -955 -1136 -1449 -1920 -1909
4567 -1909 -2152 -2192 -2179 -2186 -2008 -1844 -1671 -1304 -822 -634 -120 149 559 1096 1172 1678 1916 1938 2206 2190 2281 2113
4589 2113 1826 1784 1540 1054 740 477 -40 -256 -797 -1144 -1261 -1788 -1882 -2012 -2152 -2115 -2188 -2028 -1736 -1652 -1422
4610 -1422 -1010 -626 -311 96 378 936 1136 1405 1868 1862 2106 2153 2080 2205 1946 1704 1550 1182 944 529 132
4631 132 -224 -497 -1043 -1251 -1522 -1766 -1787 -2159 -2007 -2016 -2098 -1695 -1668 -1433 -1042 -819 -437 -32 270 643 1070 1258
4653 1258 1656 1781 1848 2118 1915 2070 1966 1616 1606 1263 947 676 199 -24 -391 -821 -1091 -1248 -1636 -1734 -1945
4674 -1945 -2053 -1789 -2026 -1821 -1554 -1513 -1072 -927 -526 -95 61 515 932 1183 1424 1620 1726 2022 1966 1902 1962
4695 1962 1719 1553 1411 950 870 379 -71 -212 -638 -886 -1232 -1478 -1575 -1816 -1960 -1952 -1813 -1841 -1582 -1517 -1183 -891
4717 -891 -743 -257 32 367 803 898 1342 1550 1672 1885 1969 1877 1872 1809 1611 1457 1114 795 576 115 -125 -445
4739 -445 -800 -1030 -1357 -1456 -1655 -1860 -1878 -1818 -1815 -1650 -1512 -1293 -975 -794 -445 -89 199 540 760 1050 1462 1549
4761 1549 1637 1810 1816 1857 1728 1553 1477 1198 900 658 313 53 -234 -625 -822 -1081 -1366 -1532 -1679 -1736 -1772 -1782
4783 -1782 -1646 -1459 -1411 -1142 -842 -563 -256 -41 349 717 903 1202 1479 1530 1672 1688 1722 1762 1637 1447 1273
4804 1273 990 700 526 135 -112 -513 -795 -942 -1254 -1378 -1568 -1703 -1649 -1699 -1690 -1455 -1355 -1185 -902 -683 -339
4825 -339 -114 190 492 793 962 1245 1453 1603 1599 1676 1682 1588 1453 1269 1114 863 592 333 63 -222 -557 -774
4847 -774 -1020 -1279 -1376 -1583 -1596 -1530 -1651 -1446 -1334 -1213 -923 -871 -496 -234 23 314 620 891 1049 1290 1422
4868 1422 1567 1534 1562 1576 1434 1338 1143 929 718 431 173 -86 -359 -610 -915 -1096 -1262 -1419 -1569 -1517 -1531 -1463
4890 -1463 -1379 -1279 -1060 -845 -671 -282 -142 156 425 649 941 1152 1358 1369 1531 1550 1533 1464 1320 1222 918 821
4912 821 512 197 33 -276 -497 -734 -1006 -1154 -1319 -1398 -1420 -1493 -1459 -1413 -1231 -1202 -912 -741 -495 -196 -27 374
4934 374 505 787 993 1163 1351 1348 1492 1468 1461 1352 1269 1030 799 622 382 155 -120 -414 -508 -872 -1005 -1138
4956 -1138 -1326 -1355 -1465 -1402 -1387 -1281 -1174 -1020 -773 -605 -296 -135 156 424 610 915 1068 1207 1351 1306 1491
4977 1491 1382 1364 1223 1056 958 739 567 247 82 -204 -465 -640 -925 -1022 -1141 -1278 -1351 -1447 -1284 -1322 -1173 -1014
4999 -1014 -916 -670 -486 -237 -12 265 484 718 939 1077 1183 1316 1347 1360 1287 1280 1139 930 795 628 416 136
5021 136 -37 -303 -513 -716 -890 -1071 -1202 -1320 -1321 -1345 -1276 -1228 -1057 -985 -829 -586 -360 -80 65 344 504 763
5043 763 906 1100 1216 1208 1379 1258 1251 1213 1082 1007 723 495 328 37 -89 -389 -520 -787 -937 -1061 -1225 -1241
5065 -1241 -1296 -1205 -1248 -1125 -977 -941 -646 -562 -251 -50 110 399 605 846 952 1061 1165 1222 1332 1207 1173 1086
5087 1086 946 818 597 461 229 -18 -220 -448 -620 -817 -953 -1058 -1156 -1232 -1266 -1165 -1152 -1007 -866 -744 -579
5108 -579 -418 -208 62 285 489 611 843 981 1107 1171 1212 1215 1190 1100 969 889 691 489 411 74 -43 -301 -578
5131 -578 -617 -825 -974 -1120 -1139 -1173 -1226 -1162 -1069 -970 -905 -683 -434 -298 -56 101 376 538 638 887 946 1103 1129
5154 1129 1166 1174 1162 1040 892 856 588 469 274 6 -125 -412 -561 -662 -960 -1045 -1130 -1145 -1195 -1165 -1107 -998 -918 -768
5178 -768 -536 -453 -190 13 157 518 586 712 976 986 1142 1173 1153 1139 1105 938 909 727 516 400 122 -35 -217
5201 -217 -413 -572 -740 -891 -998 -1070 -1109 -1170 -1114 -1038 -935 -810 -702 -550 -359 -84 48 236 459 633 895 831
5223 831 1069 1115 1049 1158 1125 1022 946 830 645 505 273 115 -42 -320 -533 -610 -835 -882 -1049 -1119 -1097 -1140 -1049
5246 -1049 -1023 -885 -741 -606 -451 -201 -46 102 382 510 673 880 901 1077 1106 1111 1158 1015 1011 874 684 585 363
5269 363 188 12 -219 -394 -469 -711 -841 -935 -1102 -1021 -1109 -1117 -945 -953 -749 -715 -567 -353 -142 -12 217 409 563
5292 563 780 804 969 1126 1063 1158 1056 998 970 727 675 538 273 147 -36 -252 -402 -636 -789 -867 -944 -1097 -1050
5315 -1050 -1135 -1014 -1022 -955 -736 -678 -424 -285 -149 109 309 431 651 765 881 967 1052 1111 1092 997 965 849 742
5338 742 631 388 277 97 -164 -299 -504 -666 -825 -939 -1010 -1107 -1056 -1096 -991 -1016 -836 -712 -565 -391 -229 53
5360 53 148 324 570 708 845 966 1038 1096 1082 1104 1033 979 796 665 522 333 150 -88 -172 -414 -559 -698 -906
5383 -906 -1021 -1057 -1095 -1084 -987 -976 -869 -785 -655 -498 -340 -167 45 280 445 599 759 873 1014 1030 1072 1100 1031
5406 1031 917 931 742 597 463 238 135 -98 -305 -456 -579 -735 -834 -923 -991 -1026 -1033 -1017 -922 -877 -729 -595 -459
5429 -459 -237 -75 151 342 480 623 838 903 1016 1111 1067 1092 1000 884 830 663 626 381 207 38 -125 -348
5451 -348 -515 -699 -809 -869 -990 -993 -1009 -1008 -945 -872 -832 -652 -589 -296 -239 -4 198 387 568 699 890 969 993 1059 1000
5476 1000 1041 1019 879 734 650 471 277 115 -88 -235 -430 -584 -689 -860 -852 -967 -994 -964 -988 -902 -806 -692 -611
5499 -611 -411 -280 -123 86 238 429 624 668 900 980 976 1033 978 1017 891 788 667 552 436 155 91 -97 -287
5522 -287 -559 -645 -709 -891 -868 -980 -983 -971 -888 -830 -761 -613 -519 -393 -221 -20 199 317 542 657 845 982 951 983
5546 983 991 1023 999 784 759 611 427 318 66 -73 -246 -392 -554 -703 -851 -864 -976 -1011 -954 -927 -881 -726 -676 -567
5570 -567 -417 -249 -66 27 250 418 554 744 802 876 1002 1016 918 959 876 846 659 497 373 239 43 -153 -348
5593 -348 -481 -642 -748 -835 -878 -964 -980 -937 -891 -779 -779 -606 -485 -386 -175 -25 177 356 475 634 734 900 960
5616 960 991 1000 1040 882 821 730 575 438 271 79 -64 -227 -370 -527 -723 -720 -847 -972 -894 -959 -925 -843 -808 -644
5640 -644 -559 -438 -303 -103 42 303 372 583 716 799 914 927 931 1014 974 835 799 641 508 417 169 16 -124
5663 -124 -329 -359 -587 -747 -752 -919 -882 -907 -928 -828 -853 -735 -579 -491 -411 -147 -93 190 346 498 661 783 812 979
5687 979 946 943 948 846 790 670 566 505 343 126 -87 -202 -365 -508 -695 -776 -912 -941 -890 -948 -866 -833 -801 -665 -515
5712 -515 -401 -248 -100 113 292 418 544 730 826 901 976 964 994 913 864 782 628 505 300 167 18 -151 -337
5735 -337 -508 -618 -703 -835 -867 -854 -951 -953 -857 -796 -696 -577 -459 -278 -167 -1 194 328 580 622 794 886 953 958
5759 958 981 961 845 857 642 526 449 246 114 -103 -269 -343 -577 -682 -721 -861 -883 -969 -922 -877 -830 -746 -632 -536
5783 -536 -384 -196 -94 176 318 509 689 721 875 922 908 994 982 893 811 734 573 505 235 122 -30 -285 -376
5806 -376 -567 -685 -730 -865 -916 -980 -966 -910 -881 -768 -678 -529 -393 -210 -79 139 298 424 600 704 857 967
5828 967 1009 967 944 971 855 728 627 532 316 148 -11 -177 -346 -483 -691 -701 -816 -869 -994 -898 -887 -871 -807 -696
5852 -696 -592 -407 -326 -92 34 197 445 517 721 794 850 904 946 944 922 902 743 642 472 392 283 30 -120 -255
5876 -255 -414 -569 -660 -760 -848 -954 -935 -909 -821 -790 -757 -607 -472 -359 -184 -16 150 287 493 656 777 835 922
5899 922 940 961 948 879 815 737 576 384 283 116 -99 -240 -415 -556 -707 -775 -847 -909 -884 -956 -867 -818 -767 -661 -541
5924 -541 -406 -286 -106 183 271 492 566 785 866 901 933 950 922 868 840 743 570 461 271 147 7 -183 -338
5947 -338 -470 -529 -708 -818 -827 -840 -899 -914 -770 -677 -582 -520 -394 -235 -128 76 271 379 568 639 752 848 862 866 839
5972 839 885 778 739 598 489 309 196 27 -191 -348 -436 -614 -644 -764 -822 -893 -879 -833 -814 -682 -738 -538 -454 -296
5996 -296 -108 1 254 368 509 649 731 907 903 932 907 936 802 740 654 516 399 216 60 -163 -268 -444 -594
6019 -594 -647 -751 -859 -936 -916 -811 -841 -754 -662 -569 -455 -374 -157 -51 164 290 436 660 726 816 847 912 903 849 866
6044 866 763 653 543 441 255 99 -23 -200 -368 -483 -607 -625 -806 -786 -792 -834 -795 -755 -730 -607 -521 -361 -242
6067 -242 -100 62 258 351 478 654 687 878 840 877 879 763 772 693 557 441 258 140 -16 -142 -305 -398 -540
6090 -540 -659 -703 -799 -806 -838 -807 -748 -671 -587 -575 -377 -260 -101 41 175 341 416 592 702 759 828 905 891 788 786 692
6116 692 547 480 332 210 47 -152 -283 -386 -497 -645 -759 -762 -799 -777 -842 -756 -705 -629 -533 -514 -291 -180 -36 125
6140 125 246 435 530 635 766 834 763 764 852 768 746 562 514 383 187 81 -72 -224 -329 -470 -545 -578 -745 -791
6164 -791 -806 -774 -706 -693 -627 -572 -454 -350 -222 -108 61 226 325 494 627 741 827 826 792 785 791 737 613 452 402 214
6190 214 118 -61 -200 -246 -378 -497 -583 -656 -721 -789 -770 -747 -655 -631 -571 -518 -394 -202 -167 11 151 265 461 566
6214 566 625 682 693 750 777 766 672 637 500 373 360 215 59 -53 -271 -309 -475 -525 -608 -692 -673 -660 -655 -629 -603 -534 -491
6241 -491 -425 -306 -175 -98 111 234 319 499 541 662 657 687 689 670 667 584 576 426 329 257 114 -21 -145 -179 -358 -435
6267 -435 -521 -626 -601 -629 -654 -655 -619 -572 -501 -418 -344 -234 -109 18 188 285 377 535 569 661 681 682 688 673 589 526 438 381
6295 381 259 110 9 -48 -207 -340 -440 -482 -543 -621 -634 -649 -636 -574 -627 -537 -435 -337 -263 -143 -76 71 256 318 438
6320 438 488 541 630 636 681 608 608 561 471 396 303 177 78 -77 -168 -267 -365 -483 -496 -589 -595 -642 -627 -621 -552 -528 -429 -352 -295 -132
6350 -132 -47 69 153 309 395 517 570 597 573 650 678 558 587 562 352 365 125 49 -57 -177 -202 -343 -499 -527 -544
6375 -544 -625 -673 -626 -620 -576 -516 -432 -365 -237 -184 -104 47 188 286 420 421 547 586 637 654 588 557 578 513 421 340 200 116
6403 116 -2 -72 -254 -331 -382 -467 -546 -556 -545 -606 -582 -575 -556 -432 -385 -274 -221 -87 -12 194 250 314 441 497 520 536 530
6430 530 621 564 551 476 382 361 265 109 26 -90 -234 -263 -374 -468 -531 -555 -604 -618 -556 -592 -476 -406 -382 -339 -185 -175 -24
6457 -24 133 179 356 464 469 564 623 587 583 593 568 512 490 349 279 182 55 -21 -160 -221 -352 -446 -449 -558 -577 -576 -554 -534
6485 -534 -534 -471 -390 -283 -265 -156 -87 82 161 268 395 525 536 570 559 604 587 582 518 450 371 265 191 77 -43 -74
6511 -74 -157 -338 -417 -468 -467 -510 -551 -577 -524 -492 -461 -461 -310 -231 -153 -104 84 110 255 348 458 499 534 566 549 526 476 475 410
6540 410 329 269 170 103 7 -131 -191 -336 -390 -456 -499 -439 -553 -561 -509 -463 -417 -390 -286 -269 -218 -97 0 97 218 325 413
6567 413 439 474 585 542 511 517 520 430 383 294 209 111 32 -46 -100 -272 -319 -396 -424 -452 -494 -497 -485 -464 -450 -382 -353 -247 -173 -144
6597 -144 -23 91 201 260 327 381 416 483 484 500 487 452 378 332 259 218 156 26 2 -126 -233 -284 -358 -402 -436 -495 -436
6624 -436 -448 -459 -413 -413 -347 -234 -186 -172 -86 44 136 197 295 408 394 511 411 486 519 487 426 384 320 251 140 128 -41
6651 -41 -128 -215 -294 -410 -458 -467 -511 -437 -548 -489 -479 -394 -385 -271 -194 -126 -87 40 111 226 337 367 435 542 526 518 497 450
6679 450 452 422 335 265 145 105 -66 -170 -196 -276 -443 -428 -437 -496 -501 -520 -468 -434 -411 -306 -281 -185 -124 -46 41 170 222 304
6707 304 366 447 398 523 497 495 442 406 386 269 279 170 72 5 -99 -226 -299 -362 -420 -478 -425 -512 -435 -486 -469 -364 -320
6734 -320 -234 -149 -117 -46 101 90 218 281 396 435 427 466 484 546 492 417 397 276 173 138 133 -9 -96 -146 -301 -375 -391
6761 -391 -474 -452 -423 -495 -465 -434 -394 -288 -212 -159 -90 -19 22 87 219 265 352 432 412 499 505 475 424 365 375 291 281 146 86
6790 86 -28 -53 -166 -279 -295 -376 -446 -415 -421 -453 -417 -402 -345 -273 -192 -181 -153 -40 74 84 237 303 337 348 412 473 393 409
6818 409 416 436 289 307 202 205 92 -3 -114 -119 -241 -289 -292 -404 -447 -401 -453 -433 -425 -391 -354 -245 -214 -136 -76 27 85 174
6846 174 257 310 328 424 452 421 434 393 385 433 308 261 243 132 6 -86 -102 -207 -303 -392 -435 -430 -527 -461 -417 -436 -395 -341 -273
6875 -273 -225 -87 -9 18 94 124 260 316 367 421 399 455 454 467 398 368 333 251 203 110 36 -6 -137 -199 -253 -331 -376 -407 -468
6904 -468 -434 -361 -427 -363 -337 -276 -240 -127 -66 7 59 149 219 260 401 451 472 440 390 427 395 328 347 295 198 183 60 -60
6932 -60 -119 -161 -314 -319 -427 -393 -417 -418 -474 -450 -436 -342 -338 -281 -187 -97 15 -10 88 185 265 359 399 429 506 477 449 422 367 395
6962 395 323 210 146 70 -64 -90 -142 -266 -349 -362 -402 -497 -443 -505 -493 -434 -376 -297 -281 -213 -103 -44 38 179 194 305 329
6989 329 400 420 472 443 422 417 379 346 329 262 180 113 -41 -81 -169 -218 -328 -349 -399 -468 -495 -446 -456 -413 -382 -333 -332 -240 -97
7018 -97 -35 66 83 198 325 356 435 489 494 458 482 492 492 379 316 289 179 127 25 -88 -184 -325 -266 -373 -504 -471
7044 -471 -533 -464 -485 -491 -472 -385 -339 -249 -104 -44 41 125 211 235 339 412 479 501 534 502 508 467 402 377 255 283 155 5
7072 5 -46 -153 -219 -215 -293 -390 -445 -521 -497 -482 -475 -446 -407 -352 -261 -174 -96 7 69 155 199 355 312 438 458 520 544 466 469 398
7102 398 365 318 240 198 90 2 -99 -189 -291 -368 -435 -521 -440 -525 -499 -476 -418 -356 -360 -290 -173 -108 -32 51 156 222 267 376
7130 376 391 482 446 491 440 429 423 277 320 264 140 77 -27 -74 -226 -241 -365 -404 -424 -519 -443 -476 -466 -509 -444 -321 -288
7157 -288 -234 -144 -47 81 139 215 299 352 384 432 499 532 478 457 447 425 367 241 192 111 -26 -31 -159 -177 -265 -428 -387 -508
7185 -508 -525 -520 -549 -492 -441 -426 -364 -264 -209 -38 39 101 175 216 337 394 460 523 485 543 486 503 461 405 353 261 141 21
7213 21 -57 -63 -205 -290 -344 -453 -469 -522 -542 -540 -536 -501 -392 -382 -300 -205 -108 -19 83 156 249 335 375 458 435 518 541 538 510 469
7243 469 450 334 331 187 128 37 -84 -212 -246 -381 -439 -456 -483 -520 -569 -580 -526 -437 -391 -330 -246 -143 -115 10 137 240
7269 240 306 362 444 492 483 549 508 549 514 447 364 331 227 125 60 -42 -156 -192 -299 -326 -476 -485 -489 -521 -501 -483 -413 -378
7297 -378 -348 -253 -167 -98 8 106 155 304 337 430 461 424 525 528 496 475 427 421 351 203 147 56 3 -59 -180 -265 -366 -416
7325 -416 -428 -475 -458 -527 -492 -484 -425 -393 -265 -201 -167 -4 27 219 233 317 331 434 472 484 498 510 499 472 390 346 258 148
7353 148 111 -10 -110 -199 -260 -335 -413 -450 -489 -516 -533 -522 -497 -375 -341 -377 -187 -132 -52 19 124 232 304 347 439 490 498
7380 498 487 503 504 480 410 352 280 195 109 -27 -83 -157 -237 -337 -395 -447 -483 -512 -494 -533 -482 -410 -426 -328 -256 -165 -71 17 94
7409 94 162 226 312 412 475 541 487 511 487 468 476 388 373 193 126 85 -62 -167 -235 -276 -406 -476 -469 -446 -543 -493 -536 -430
7437 -430 -417 -392 -265 -197 -133 -67 107 214 216 327 356 464 494 548 516 533 520 475 443 362 249 162 104 -30 -117 -189 -269
7464 -269 -350 -406 -490 -452 -528 -526 -521 -472 -413 -405 -297 -238 -92 -72 69 113 187 276 385 450 508 533 617 534 520 448 383 388 212
7493 212 177 65 -27 -84 -171 -232 -345 -357 -450 -544 -434 -557 -543 -484 -412 -431 -353 -236 -218 -26 66 131 198 235 428 416
7519 416 490 504 558 542 465 546 446 389 300 241 127 -29 10 -158 -285 -329 -397 -458 -437 -485 -541 -528 -446 -507 -402 -359 -269
7546 -269 -197 -76 11 111 228 267 309 438 456 474 539 554 475 508 465 357 327 175 121 28 -26 -128 -181 -316 -421
7571 -421 -437 -475 -554 -571 -539 -524 -513 -457 -342 -312 -171 -99 20 117 156 304 350 432 549 489 538 518 583 547 433 388 323
7598 323 253 127 88 -16 -76 -208 -357 -396 -475 -491 -566 -520 -576 -522 -530 -503 -391 -344 -241 -143 -56 8 185 257 344 422 475
7625 475 522 503 598 592 488 491 486 378 311 247 75 -53 -131 -159 -306 -377 -460 -523 -545 -563 -606 -529 -513 -473 -412 -313 -207 -173
7653 -173 -28 34 142 232 309 413 477 523 548 572 632 519 554 449 408 289 196 109 -2 -84 -220 -287 -374 -445 -501 -599
7679 -599 -543 -616 -570 -579 -501 -425 -346 -361 -229 -132 -30 108 218 264 425 403 505 539 577 642 552 587 534 489 375 235
7705 235 219 91 -96 -150 -280 -267 -452 -454 -591 -531 -568 -593 -509 -577 -523 -395 -335 -198 -137 -31 44 185 274 368 476
7730 476 463 558 574 585 576 509 545 415 400 270 167 88 -39 -113 -243 -361 -402 -422 -574 -631 -583 -611 -605 -546 -495 -408 -378
7757 -378 -247 -107 -56 128 157 289 362 430 501 570 601 683 627 550 566 486 434 343 191 127 33 -148 -195 -345 -427 -470
7783 -470 -551 -612 -608 -645 -638 -631 -549 -416 -350 -315 -147 -51 102 182 269 390 403 545 635 604 615 670 656 582 482 424 340 272
7811 272 168 28 -100 -182 -270 -443 -470 -546 -600 -618 -695 -589 -503 -574 -451 -353 -288 -205 -27 -11 148 260 343 409 452
7836 452 599 586 660 633 608 546 483 493 386 241 154 17 -81 -240 -248 -379 -482 -514 -640 -638 -640 -633 -599 -582 -509 -422 -302
7863 -302 -214 -147 -5 186 230 324 477 455 569 656 627 665 626 622 610 469 457 262 159 84 -31 -165 -231 -341 -436
7888 -436 -499 -577 -686 -570 -707 -619 -585 -528 -446 -393 -205 -158 -20 117 181 307 368 452 563 564 642 677 643 577 607 517
7914 517 444 364 251 135 17 -82 -279 -419 -395 -536 -525 -571 -616 -654 -602 -567 -574 -457 -398 -303 -145 -88 42 191 216
7939 216 412 511 560 640 661 659 647 668 587 579 448 417 293 133 3 -81 -193 -388 -456 -487 -620 -655 -726 -663 -718 -661 -677
7966 -677 -541 -472 -399 -212 -144 -1 146 229 369 447 599 586 655 662 656 688 654 656 516 431 308 219 81 -55 -181 -272
7992 -272 -382 -477 -617 -640 -689 -711 -722 -641 -710 -627 -519 -381 -300 -207 -81 45 253 319 437 495 595 647 692 792 725
8017 725 751 652 555 512 394 275 98 45 -100 -253 -299 -502 -583 -653 -714 -754 -776 -724 -691 -664 -600 -455 -296 -271 -86
8042 -86 -17 208 263 432 536 558 680 680 772 779 766 722 675 572 406 337 197 88 -33 -243 -305 -496 -601 -632 -755
8067 -755 -746 -805 -788 -729 -733 -656 -583 -387 -318 -196 -32 84 299 350 461 613 675 739 728 791 790 765 737 628 530 387 326
8094 326 131 -20 -130 -262 -439 -516 -637 -698 -804 -794 -804 -719 -756 -706 -599 -510 -311 -217 -96 72 141 320 356 559
8118 559 706 669 773 782 834 825 738 644 546 486 299 186 13 -88 -249 -388 -493 -622 -637 -744 -826 -853 -843 -759 -751 -625
8144 -625 -468 -419 -251 -147 5 103 304 411 624 694 741 781 794 794 846 770 700 599 575 398 244 103 -87 -205
8168 -205 -323 -493 -559 -716 -812 -824 -900 -855 -836 -753 -759 -575 -464 -381 -152 -27 131 282 424 563 644 760 753
8191G53
$$ Imaginary data points
##PAGE= N=2
##DATA TABLE= (X++(I..I)), XYDATA
0 0 0 0 0 0 0 0 0 0 0 0 0 0 0 0 -5 0 -4 0 -4 0 -4 2 -4 4 -4 4 -3 4 -3 5 1 5 1 1 3 0 5 -4 9 -10 13 -15 19 -24 26 -33 34 -43 44 -53 55
51 55 -66 67 -73 75 -80 77 -76 63 -46 15 37 -124 268 -513 965 -1844 3856 -9951 57365
70 57365 300053 172557 425593 493800 653468 835608 682723 800141 890842 821852 680685
81 680685 697887 590250 509402 364106 88563 184186 -65578 -237940 -283574 -529736 -450165
92 -450165 -655147 -727601 -658877 -779699 -713301 -721071 -653189 -550063 -477825 -416048 -266299
103 -266299 -111824 -74461 163795 189612 310273 486175 432846 647421 618591 596641 700372
114 700372 604446 622799 549827 454125 393602 306707 161378 68411 15565 -177159 -218835
125 -218835 -350777 -426434 -409510 -579230 -545001 -566083 -583376 -512315 -536072 -442262 -380707
136 -380707 -325160 -224922 -116453 -37381 51739 157100 210744 351249 368873 421345 514745
147 514745 458979 532522 509807 468227 479463 365819 325323 286103 179600 87827 21347
158 21347 -88125 -146937 -218354 -337807 -323057 -410925 -462803 -438185 -483530 -423662 -434854 -419668
170 -419668 -328326 -283113 -217463 -154219 -71870 5148 90881 137175 225304 298950 302140 384329
182 384329 378180 417871 433320 365565 400557 332777 295757 259340 171055 123984 40079 -18516
194 -18516 -91339 -141685 -230175 -272966 -289673 -373207 -348510 -391043 -378011 -347691 -380280 -286844
206 -286844 -264192 -210246 -160465 -110869 -6291 27024 103390 143316 219790 265038 274982 339982
218 339982 330650 367304 330811 320164 332132 254839 248060 162592 132628 85800 -11261 -30509
230 -30509 -116691 -149610 -215069 -254485 -267242 -318041 -307604 -347560 -305203 -299917 -294520 -223935
242 -223935 -225138 -139182 -114045 -55188 25903 44939 127289 147873 221196 249042 260813 305915
254 305915 287898 324948 283529 276547 263655 203786 190241 109856 94177 30787 -34026 -66613
266 -66613 -141438 -148727 -217916 -240597 -258082 -289200 -271319 -300164 -260599 -254762 -229897 -182151
278 -182151 -163508 -86639 -67203 -7119 45704 82125 145770 162189 218768 233869 255509 271469
290 271469 263423 282853 240728 235234 204925 163408 139424 70576 46428 -9162 -58318 -97029
302 -97029 -145111 -167172 -215603 -230111 -248217 -253322 -251250 -259350 -224429 -212487 -179148 -146381 -111378
315 -111378 -53758 -27055 25329 67630 108977 150050 170989 208018 226011 238183 240684 239982
327 239982 232332 209940 191031 157366 129948 86180 41719 9723 -38702 -76160 -116322 -149374
339 -149374 -173897 -202133 -219544 -226499 -227929 -227791 -212996 -196661 -169719 -141601 -113219 -67627 -35044
352 -35044 6906 45103 81220 122024 144087 174658 194790 210125 216584 214581 213189 197482 183636
365 183636 151610 129582 97250 55499 29582 -20985 -46762 -85085 -122831 -138459 -175029 -183156
377 -183156 -200332 -206995 -201594 -201008 -181240 -169274 -138257 -116790 -81916 -46253 -20202 30026 48290
390 48290 91593 120018 136480 174393 171299 193960 196452 187962 189846 165274 155709 128036 101979
403 101979 68654 38799 9424 -35226 -53238 -96692 -114541 -136625 -170907 -161547 -187815 -183827
415 -183827 -177567 -180285 -148314 -144031 -118027 -87468 -60039 -28265 -1193 34803 61215 98177
427 98177 109529 136321 161892 156924 181559 166522 169319 170756 133400 134935 103468 77809 57832
440 57832 14109 -4380 -34522 -67208 -92476 -111055 -135055 -147319 -155586 -171792 -153527 -163936
452 -163936 -153599 -123882 -126881 -86088 -71078 -49644 -2733 4820 42244 71744 85667 115612
464 115612 128770 139579 154860 154228 147857 155508 134134 118835 113007 74158 65523 33189 -2551
477 -2551 -5130 -52372 -71514 -84596 -117136 -117022 -138515 -149828 -137318 -144708 -141683 -122352 -112607
490 -112607 -93461 -68273 -59774 -20716 6483 12719 54356 66372 88685 116069 106551 134775
502 134775 140003 128207 137697 122052 116747 106002 74770 61386 49009 15197 -7268 -26951
514 -26951 -55622 -59551 -92177 -111926 -101333 -130385 -124640 -125214 -132273 -100528 -109453 -96619 -64486
527 -64486 -57263 -29411 -9438 2508 36680 57769 61058 91873 99191 103465 127935 106267 120055
540 120055 124235 91796 101982 75679 61284 58456 14047 4772 -7030 -38221 -50514 -69643
552 -69643 -87940 -85665 -106215 -118577 -98235 -112880 -105214 -92461 -96370 -56220 -56617 -49137 -9396
565 -9396 -6740 21081 39385 43098 75887 82316 80948 103953 103513 98988 107305 86181 88890 87172
579 87172 49633 53348 34029 6986 6031 -28370 -36462 -43268 -77562 -76660 -80560 -96957 -92579 -99861
593 -99861 -98366 -77698 -85574 -73193 -47425 -48688 -24594 -9354 1516 32849 32312 45376 73435
606 73435 71554 82618 89644 83444 97093 85845 73471 82323 59433 46662 39464 15930 12594
619 12594 -8053 -33128 -33314 -50617 -66483 -66428 -82622 -83716 -79937 -92602 -74225 -71519 -74805 -49928
633 -49928 -48355 -29702 -12112 -9864 16589 27070 34394 53945 62997 68327 76619 74853 80358 87949
647 87949 67745 69261 64002 46504 47292 19894 14513 6727 -22270 -24681 -38496 -48429 -57807 -71866
661 -71866 -72808 -70084 -74730 -80215 -65377 -66056 -55851 -43514 -42147 -13153 -14213 -2618 21124 24340
675 24340 44831 45297 54576 67888 68384 71425 70212 72293 61457 61190 50857 41442 36548 10280
689 10280 12382 -4348 -19506 -22862 -45751 -43132 -57272 -64849 -61049 -68791 -66731 -69375 -59220 -54510
703 -54510 -45358 -39761 -32333 -10065 -11229 8860 18265 24276 43776 38166 57437 61833 59372 65752
717 65752 59425 65615 57192 51402 43325 35930 27137 10559 9756 -8690 -16029 -28160 -41479 -36347
731 -36347 -55513 -55550 -59206 -63655 -56203 -62434 -51345 -47716 -42782 -34410 -23709 -9098 -5855 7792
745 7792 14112 29506 37994 37515 53607 51562 57383 57192 54372 60842 48409 43556 37367 32310 23764
760 23764 9234 2084 -8487 -14385 -28781 -34382 -38242 -49817 -50228 -56787 -52010 -51879 -55941 -46926
774 -46926 -43028 -33760 -28781 -20535 -9191 -1441 7799 15762 29435 32506 38422 44941 48314 55387
788 55387 49122 51005 49985 43962 40556 31777 28238 17202 7657 -791 -7049 -14701 -28453 -31532
802 -31532 -39213 -41355 -46718 -51461 -46038 -50531 -45771 -43178 -36407 -28222 -27376 -15383 -8246 3094 8572
817 8572 15324 26817 29759 39122 39484 46956 48162 43576 48468 41962 43377 33480 26335 24786 12461
832 12461 8632 -4312 -8253 -16591 -27138 -28991 -38041 -36544 -46225 -45914 -42830 -45581 -37873 -41615 -30068
847 -30068 -26094 -22008 -9612 -7408 7022 7659 17210 26919 29120 38060 34809 44384 42849 41974 43023
862 43023 35715 39291 25794 24656 19011 8615 6188 -9595 -8586 -18466 -25791 -28792 -37623 -34318
876 -34318 -43549 -40116 -40335 -40048 -34286 -37477 -23598 -22937 -15660 -7943 -5001 10030 8874 19815 25000
891 25000 28509 35970 32757 42048 38574 39205 36916 32285 34527 22224 22034 12641 7063 2852 -10575
906 -10575 -8818 -20392 -24277 -29006 -34945 -31953 -39680 -36625 -38195 -34303 -31219 -30915 -20456 -20503 -10084
921 -10084 -6769 -265 10952 10029 21307 23150 29095 33791 32255 38210 35060 36333 32452 30730 27959
936 27959 19946 17920 8448 6646 -2285 -9952 -11594 -21751 -22281 -29662 -32078 -31578 -36714 -34173 -34426
951 -34426 -30506 -28790 -25045 -19977 -14727 -6833 -5454 4810 9320 13827 21560 21847 30399 30960 31392
966 31392 34547 32973 33146 29264 26762 22279 19421 12226 6384 3464 -6487 -8113 -16283 -21033 -21937
981 -21937 -30384 -28982 -32467 -33253 -31042 -31823 -28351 -25336 -20825 -17811 -9994 -7184 -790 7596 7342 18698
997 18698 19506 22972 30497 26583 33297 31709 29728 30807 26562 23983 19740 15986 8503 6987 -1566
1012 -1566 -7323 -8097 -19831 -17594 -25048 -29067 -25523 -33948 -28588 -30234 -29367 -23749 -24019 -17842 -13918
1027 -13918 -8105 -5125 2943 6650 11127 19281 16406 27684 26596 26071 33712 25585 31912 27080 21502
1042 21502 24256 15790 12965 7380 2673 -2839 -6274 -13517 -18488 -16663 -27863 -24460 -27889 -31823
1056 -31823 -23605 -32263 -24618 -21706 -22547 -13178 -13722 -6414 -796 2712 7129 13322 17215 19071 25986
1071 25986 22319 29572 29000 23411 31125 21347 23099 20423 10212 14254 4781 -426 -2785 -9457 -12877
1086 -12877 -16153 -21760 -24376 -21847 -30075 -26459 -24907 -29021 -18929 -24264 -17907 -9624 -13347 -2604
1100 -2604 -720 3659 11340 11421 16412 21982 22477 23212 27655 24218 27015 25211 18248 23758 14628 11321
1116 11321 10528 488 2274 -5665 -11982 -10906 -17662 -20931 -21712 -24999 -24870 -23396 -27398 -22058 -19041
1131 -19041 -21194 -12290 -12196 -7371 -106 -1293 7724 11281 12084 18385 19811 21746 24809 23238 23812 25338
1147 25338 19930 19964 17952 11802 11558 4167 1370 -516 -8949 -9985 -13601 -18108 -18824 -22226 -23493 -21665
1163 -21665 -24282 -23265 -18330 -19755 -14870 -12014 -10525 -1652 -1931 2520 9409 10011 14948 17196 18984
1178 18984 22773 22626 20763 23516 22100 18351 18300 12415 12078 8479 652 1408 -4795 -8352 -11451 -16463
1194 -16463 -15730 -19575 -22360 -22083 -21313 -21480 -20423 -18694 -16462 -11090 -11597 -6067 -807 -121 6983 7209
1210 7209 12427 17147 15631 20189 20370 21471 21710 20103 19100 17127 15027 10427 9555 4211 515 -1726
1226 -1726 -8159 -8163 -13511 -15941 -16796 -21144 -19160 -21221 -20202 -19420 -19009 -15005 -13581 -9790 -7556 -2871
1242 -2871 370 3204 8115 9619 15079 15123 16707 20854 19331 21282 18748 18142 18297 14141 12249 8818
1258 8818 6479 1907 -1632 -4199 -8011 -9988 -15296 -15808 -16839 -19504 -18897 -20484 -18083 -17457 -16484 -12697
1274 -12697 -11063 -7332 -5445 -1081 3288 5417 8855 10923 14918 16146 17405 19062 18802 19348 16899
1289 16899 16960 15669 11594 9564 5901 4073 421 -4125 -6342 -9416 -12007 -15157 -16031 -16958 -18736 -18897
1305 -18897 -18800 -16073 -15222 -14548 -11243 -8531 -4972 -2543 829 4716 6964 9719 12236 15471 16557 16405
1321 16405 17903 18081 17864 15971 14206 13047 9795 7100 4359 1766 -1701 -5974 -7748 -9997 -12305
1336 -12305 -15034 -16759 -16497 -17384 -17359 -16588 -14892 -13500 -12480 -8746 -5756 -2997 -891 1784 6548 8500
1352 8500 10459 12795 14685 16188 15907 16930 17100 15946 13769 11957 11450 8311 5169 1992 -523 -2772
1368 -2772 -6685 -8527 -10810 -13028 -14918 -16109 -15195 -16223 -16300 -15333 -13382 -10919 -10003 -7167 -4101 -1505
1384 -1505 944 3909 7567 9208 10878 12576 14985 16170 15136 15582 15246 14229 12664 10354 9165
1399 9165 6184 2695 522 -1610 -4268 -7724 -10257 -11355 -12719 -14610 -15349 -15096 -15181 -14761 -13577 -11432
1415 -11432 -9242 -8384 -5606 -2095 311 2995 4814 7611 10498 11059 13172 14774 14675 14771 14065 14229 13313
1432 13313 10588 8439 7157 4705 1631 -647 -3556 -5332 -8310 -10832 -10690 -13165 -14290 -14665 -14972
1447 -14972 -12838 -13617 -12314 -9738 -8454 -5957 -3774 -786 1684 3787 5575 8904 11110 10945 13477
1462 13477 13338 14510 14686 12136 13703 10854 8877 7968 4743 3754 4 -2803 -4189 -6254 -9026 -10879
1478 -10879 -11507 -13530 -12950 -14688 -13506 -11613 -13669 -9770 -8833 -6588 -3259 -3797 1183 3252 4696 7615
1494 7615 9047 11082 12036 12905 13104 14803 12640 11593 12361 8514 9126 5361 2576 2758 -2851 -2978 -5550
1511 -5550 -8587 -9007 -11906 -12191 -12623 -13389 -13886 -12191 -12137 -11082 -7728 -8346 -4041 -2948 -1430 3968 2988
1528 2988 6745 8766 9246 12466 11688 13073 13770 12795 11761 11810 10299 7964 6916 2746 3157 118 -4157
1545 -4157 -3466 -7955 -8271 -10058 -13059 -10894 -13175 -13843 -12434 -11894 -10554 -9279 -8547 -5582 -2029 -2764
1561 -2764 1431 3872 4778 8867 7472 11307 13529 10862 13313 12776 12613 12382 9128 8527 8429 4217 1910
1578 1910 1416 -2604 -3193 -6880 -9460 -7325 -12314 -12772 -12027 -13847 -11480 -12822 -12377 -8380 -8327 -7369 -3482
1595 -3482 -2399 613 3315 2760 8271 9284 8773 12873 11234 13250 13812 10989 12816 11042 8476 8254
1611 8254 5627 2993 2292 -1896 -3437 -4117 -9140 -8041 -10332 -13009 -10927 -13990 -12281 -11599 -13015 -9407
1627 -9407 -8409 -7551 -4815 -2714 -807 2672 3067 5472 9942 8065 11277 12185 11785 14828 10899 11999
1643 11999 12416 9108 8591 5856 4409 2757 -316 -3464 -3767 -6133 -9488 -9065 -12567 -11107 -12165 -14766
1659 -14766 -10872 -12662 -10489 -9072 -9163 -4506 -3870 -1829 713 3365 5279 7206 8825 9781 13329 11062
1675 11062 12711 13700 11103 13274 8928 9012 8453 3864 3665 232 -1141 -3500 -6285 -7882 -9213 -10195
1691 -10195 -13191 -11647 -13187 -12667 -11413 -12947 -8402 -9035 -6980 -3826 -3365 1080 1426 4339 6789 8216
1707 8216 10006 10650 12813 12105 13556 12077 11694 12147 8188 8937 5500 3621 2667 -1921 -2060 -5315 -7145
1724 -7145 -8609 -10610 -11285 -12685 -12232 -13486 -11975 -11689 -11031 -8030 -8387 -4565 -3219 -1279 2274 2774
1740 2774 6471 7529 9442 11049 11531 13069 12514 13152 11894 11572 10125 8067 7306 3744 3055 -204
1756 -204 -2662 -3642 -7295 -7756 -10304 -11411 -11868 -13010 -12785 -12960 -11574 -11417 -9372 -7949 -6257 -3058 -2490
1773 -2490 1254 3004 4956 7720 8462 11036 11500 12637 13082 12871 12865 11202 11187 8818 7494 5257 2827
1790 2827 1518 -2188 -3369 -6165 -7844 -9361 -11818 -11404 -13019 -12957 -13254 -12582 -10994 -10666 -8260 -7230
1806 -7230 -4052 -2448 -631 3118 3953 7210 8142 10114 12195 11891 13350 12767 13488 11904 10897 10278
1822 10278 7501 6707 3009 1956 -399 -3827 -4717 -8154 -8486 -11097 -12365 -12187 -13799 -12690 -13622 -11485
1838 -11485 -10596 -9831 -7113 -5955 -2003 -1466 1535 4365 5654 9106 8819 12114 12611 12540 13995 12599
1854 12599 13779 11229 10363 8922 6574 5376 1295 861 -2811 -4994 -6564 -9693 -9307 -12936 -12834 -13208
1870 -13208 -13986 -12543 -13787 -10744 -10336 -8342 -5879 -4514 -508 0 3625 5613 7855 10225 10022 13438
1886 13438 12794 14027 13841 12490 13651 10018 9856 7645 5436 3628 -415 -1157 -4340 -6089 -8888 -10671
1902 -10671 -10966 -13690 -12968 -14354 -13270 -12738 -13180 -9709 -9286 -6428 -4856 -2780 1172 2158 5386 7040
1918 7040 9486 10909 11747 13768 13692 14529 12615 12831 12369 9378 8760 5337 4187 1655 -2013 -2866 -6015
1935 -6015 -7983 -10356 -11540 -12277 -13442 -14095 -14500 -12550 -12745 -11257 -9075 -7931 -4621 -3850 -233 2820
1951 2820 3964 6746 8332 11084 12266 12731 13654 14337 13843 12577 12598 10478 9070 6374 3933 3369 -1035
1968 -1035 -3069 -5243 -7716 -8897 -11771 -12363 -12845 -14045 -14621 -13155 -12268 -11708 -9835 -8941 -4864 -3281
1984 -3281 -2124 2183 3320 6451 8032 9548 12652 12467 13014 13705 14269 13203 12137 10416 9084 8244
2000 8244 3845 3089 477 -2886 -3932 -8177 -8055 -9982 -13123 -12816 -13852 -13293 -13430 -13265 -11967 -9678
2016 -9678 -8672 -7026 -3001 -2537 1130 3010 4663 9399 8444 11131 12801 12673 14737 13228 13208 12692
2032 12692 10976 9338 8069 5719 2731 1442 -2622 -3459 -5839 -9390 -8932 -12824 -12545 -12591 -14673 -12700
2048 -12700 -13677 -11964 -9847 -9275 -6924 -4343 -2242 -230 3101 4431 7805 9212 9204 13487 12488 13596
2064 13596 14067 11765 13909 10990 9268 8605 5606 3828 980 -1399 -3111 -5185 -8981 -9785 -10408 -12979
2080 -12979 -12253 -14545 -13450 -11697 -13433 -9895 -9055 -7515 -4362 -3623 42 2855 3937 6418 9032
2095 9032 9922 12040 13013 12336 14507 12549 12172 12792 8646 8603 6466 3209 2588 -1409 -3361 -4636 -8291
2112 -8291 -9662 -10142 -12480 -12947 -13465 -14255 -11603 -12330 -11880 -8203 -8018 -4994 -2886 -1570 3216 3692 5333
2129 5333 9216 10016 11650 12494 12134 14387 13730 11384 12258 10284 8237 7146 3287 2713 454 -4264
2145 -4264 -4563 -6802 -9309 -10004 -13045 -12661 -12239 -14551 -12723 -11684 -11644 -9113 -8274 -5637 -2167 -2011 1070
2162 1070 4515 5569 8376 9373 10771 13554 12334 12915 14276 12228 11973 10134 8219 8108 4173 1647
2178 1647 724 -2631 -4444 -6676 -9338 -9563 -11637 -13512 -12271 -13204 -13226 -11810 -11995 -9062 -7361 -6959 -3076
2195 -3076 -1457 663 3896 5005 7763 9693 10104 12226 13095 12673 13401 12393 11420 11101 8322 7242
2211 7242 5437 1871 895 -1927 -4432 -5752 -9018 -9693 -10812 -12959 -12644 -13008 -13128 -11927 -11528 -9928
2227 -9928 -7511 -6781 -4247 -1247 6 3217 4913 6556 9843 9766 11426 13021 12326 13239 12356 11545 11264
2244 11264 8870 7116 5682 3216 757 -1212 -3891 -5451 -7637 -9964 -10101 -12064 -12689 -12459 -13246 -11438
2260 -11438 -11467 -10303 -7818 -6896 -4407 -2368 -21 2543 4360 6145 8466 10230 10573 12237 12300 12590
2276 12590 12935 10681 11166 9389 7108 6171 3108 1782 -809 -3325 -4903 -7021 -8676 -10466 -11040 -12168
2292 -12168 -12190 -12365 -12233 -10422 -10504 -8238 -6673 -5160 -2046 -1229 2014 3906 5462 8021 8816 10701 11228
2309 11228 11967 12107 12057 11566 10043 9847 7336 6068 4168 1320 536 -3008 -4359 -6160 -8406 -9032 -11127
2326 -11127 -11171 -11861 -11935 -11574 -11190 -9531 -8932 -6700 -5351 -3178 -678 562 3759 4708 7091 8680 9330
2343 9330 11368 10988 11926 11595 10922 10598 8871 7982 5900 4362 2112 67 -1544 -4334 -5287 -7742 -8808
2360 -8808 -9761 -11300 -10873 -11827 -11105 -10634 -9944 -8234 -7330 -5097 -3648 -1379 605 2459 4748 5969 8137
2377 8137 8903 10196 10980 10873 11617 10421 10224 9156 7557 6489 4149 2667 571 -1397 -3369 -5159
2393 -5159 -6661 -8402 -9061 -10514 -10575 -10862 -11099 -9922 -9714 -8205 -6980 -5552 -3375 -1876 345 2058
2409 2058 4136 5580 7145 8668 9385 10606 10309 10960 10606 9584 9219 7301 6584 4570 2681 1109
2425 1109 -1069 -2557 -4877 -6014 -7723 -8695 -9567 -10634 -9887 -10825 -9853 -9213 -8547 -6461 -6023 -3451 -2092
2442 -2092 -230 1769 3132 5510 6242 8110 8733 9664 10415 9643 10612 9130 8921 7686 5885 5445 2597
2459 2597 1601 -589 -2253 -3570 -5963 -6464 -8405 -8760 -9793 -10049 -9362 -10248 -8517 -8578 -6803 -5225 -4735
2476 -4735 -1752 -1051 1380 2770 4157 6359 6698 8437 8571 9922 9736 9120 9656 7950 8198 5819 4717
2493 4717 4064 987 466 -2124 -2947 -4461 -6828 -7091 -8398 -8386 -9842 -9398 -9010 -8903 -7523 -7831 -4968
2510 -4968 -4341 -3224 -519 -106 3030 3307 4778 6962 7255 8525 8437 9382 9060 8864 8118 7199 7078 4215
2528 4215 3986 2112 242 -320 -3630 -3543 -5383 -6973 -7129 -8565 -8349 -9050 -8730 -8346 -7484 -6874 -6217 -3820
2546 -3820 -3565 -1189 -105 1140 3835 3489 5885 6888 7236 8403 7898 8719 8565 7802 6914 6529 5209
2563 5209 3580 2920 544 159 -2127 -3929 -3648 -6280 -6473 -7511 -8343 -7523 -8576 -8060 -7211 -6669 -6033
2580 -6033 -4472 -3397 -1938 -193 -41 2871 3726 4240 6478 5966 7737 7895 7330 8494 7376 6738 6298
2597 6298 5203 4155 3226 1017 198 -466 -3382 -3182 -4970 -6207 -5755 -8234 -7068 -7210 -8249 -6775
2613 -6775 -6686 -5736 -4392 -3892 -2673 -492 -153 1352 3486 3122 5612 5616 6023 8258 6375 7499 7396 6171
2631 6171 6640 4884 4202 3495 1766 372 21 -1906 -3260 -3548 -5798 -5032 -6532 -7551 -5896 -7858
2647 -7858 -6474 -6025 -6076 -3980 -4423 -3027 -1168 -223 543 2127 3094 4070 5531 4733 6874 6842 5780 7346
2665 7346 5688 6429 5398 3239 4032 2346 1140 -52 -1118 -2060 -3130 -4481 -5161 -4662 -6777 -6328
2681 -6328 -6149 -6642 -4936 -6470 -4742 -3321 -3647 -1560 -1302 344 1573 1849 3207 4590 4902 4929 6219
2698 6219 5698 6456 6063 4774 5957 3854 3435 3139 1208 1298 -855 -1629 -1871 -3338 -4188 -4866 -5144 -5669
2716 -5669 -5539 -6268 -5385 -4949 -5445 -3441 -3500 -2246 -1033 -1160 1169 1441 2314 3506 3762 4776 5106 5338
2734 5338 5531 5693 4853 4955 4616 3276 3358 1657 1112 555 -1323 -1218 -2599 -3454 -3878 -4682 -4667 -5177 -5377
2753 -5377 -5279 -4651 -4738 -4038 -3194 -2845 -1498 -1366 26 1315 1418 2625 2988 4037 4591 4390 4959 5027 4970
2772 4970 4525 4279 3680 3196 2317 1262 1200 -244 -962 -1738 -2785 -2824 -3931 -4191 -4348 -4799 -4656 -4656 -4212 -4033
2792 -4033 -3449 -2955 -2079 -1203 -790 466 848 1848 2488 2946 3952 3804 4345 4502 4464 4558 3835 3761 3243 2685
2812 2685 1884 1209 657 -434 -970 -2019 -2210 -2876 -3880 -3746 -4270 -4098 -4337 -4352 -3669 -3651 -2936 -2578 -1669
2831 -1669 -980 -558 513 944 1960 2237 2835 3558 3591 4168 3893 4195 3963 3501 3482 2711 2506 1524 890 519
2851 519 -434 -895 -1841 -2159 -2724 -3323 -3510 -3912 -3657 -4092 -3737 -3379 -3224 -2532 -2449 -1389 -895 -395 513 819
2871 819 1857 2006 2555 3226 3326 3670 3488 3813 3563 3284 2997 2427 2231 1289 1031 295 -416 -725 -1799
2890 -1799 -1893 -2544 -2977 -3132 -3568 -3406 -3669 -3448 -3139 -2901 -2459 -2173 -1319 -919 -228 274 847 1695 1809 2535
2910 2535 2847 3100 3463 3261 3489 3368 3019 2828 2339 2012 1420 888 280 -241 -796 -1464 -1706 -2321 -2621 -3011
2930 -3011 -3293 -3100 -3423 -3152 -3041 -2693 -2233 -1993 -1391 -861 -397 209 787 1309 1790 2241 2550 2967 3025 3124
2950 3124 3387 2978 3038 2621 2256 2047 1313 855 472 -195 -649 -1205 -1813 -2064 -2488 -2908 -2872 -3173 -3154 -3013 -3020
2971 -3020 -2507 -2318 -1929 -1343 -959 -397 243 639 1279 1707 2063 2560 2735 2933 3199 2964 3109 2945 2481 2427
2991 2427 1781 1388 1067 303 -101 -602 -1279 -1595 -2123 -2540 -2669 -3011 -3159 -2947 -3211 -2849 -2514 -2418 -1716 -1521
3011 -1521 -973 -215 -48 755 1214 1552 2217 2416 2654 3146 3070 3016 3156 2769 2685 2383 1644 1589 868 358 82
3032 82 -937 -1096 -1604 -2323 -2366 -2841 -3050 -3023 -3247 -3112 -2734 -2742 -2298 -1724 -1619 -722 -458 69 1038 1100 1746 2242
3054 2242 2344 3070 2929 3046 3359 3011 2912 2692 2194 1964 1480 708 560 -195 -920 -1054 -1927 -2148 -2456 -3136
3074 -3136 -2868 -3269 -3354 -2966 -3114 -2655 -2234 -2066 -1296 -847 -433 406 823 1191 2080 2191 2660 3115 2914 3501
3094 3501 3275 2998 3208 2512 2445 1980 1135 987 329 -408 -830 -1433 -2002 -2190 -2884 -3112 -3005 -3591 -3235 -3199
3114 -3199 -3289 -2469 -2563 -1874 -1182 -1016 -156 379 851 1637 2056 2351 3037 3159 3292 3693 3221 3357 3227 2451
3134 2451 2564 1781 1318 977 -66 -300 -943 -1760 -2089 -2572 -3025 -3112 -3537 -3628 -3132 -3483 -3085 -2624 -2520 -1497
3154 -1497 -1427 -866 222 475 1240 1749 2163 2917 3021 3129 3622 3639 3428 3417 2927 2841 2487 1396 1332 671 -134
3175 -134 -545 -1557 -1678 -2172 -3097 -3170 -3346 -3619 -3592 -3668 -3489 -2782 -2824 -2394 -1455 -1153 -295 64 666 1748 1891
3196 1891 2492 3093 3264 3639 3618 3533 3798 3410 2790 2723 2131 1584 1058 62 -160 -948 -1858 -2110 -2740 -3104 -3465
3217 -3465 -3816 -3711 -3615 -3804 -3394 -2871 -2719 -1914 -1558 -853 47 240 1294 1900 2312 2922 3162 3636 3820 3707
3237 3707 3739 3797 3214 2846 2639 1840 1551 469 -149 -338 -1568 -1930 -2522 -3037 -3215 -3876 -3811 -3712 -3780 -3783 -3280
3258 -3280 -2805 -2382 -1736 -1420 -269 309 672 1795 2058 2918 3073 3351 4111 3840 3945 3757 3624 3317 2749
3277 2749 2234 1629 1222 45 -340 -1008 -1939 -2087 -3177 -3149 -3560 -4127 -3805 -4165 -3722 -3559 -3261 -2600 -2149
3296 -2149 -1462 -994 135 543 1330 2022 2345 3463 3247 3858 4150 3910 4244 3619 3647 3222 2447 2122 1334
3315 1334 808 -256 -808 -1564 -2084 -2684 -3542 -3386 -4073 -4155 -4089 -4234 -3423 -3680 -3021 -2422 -1873 -1046 -547 450
3335 450 998 1735 2302 2978 3625 3519 4212 4087 4180 4163 3387 3670 2802 2264 1676 867 424 -752 -1223 -1892
3355 -1892 -2405 -3156 -3697 -3763 -4181 -4037 -4333 -3904 -3461 -3466 -2582 -2172 -1193 -703 -209 1041 1451 2237 2697 3347
3375 3347 3825 3923 4293 4087 4374 3726 3421 3262 2472 2085 946 534 -258 -1186 -1660 -2499 -2876 -3604 -3880 -4048
3395 -4048 -4266 -4197 -4351 -3661 -3463 -2932 -2343 -1821 -682 -403 665 1411 1956 2787 3011 3848 4028 4239 4248 4150
3415 4150 4225 3552 3424 2664 2209 1509 396 170 -972 -1535 -2361 -3026 -3158 -3973 -4099 -4447 -4350 -4179 -4190 -3412
3435 -3412 -3308 -2466 -2065 -1158 -236 151 1301 1619 2643 3179 3355 4174 4083 4491 4181 4190 4080 3383 3046 2147
3455 2147 1922 841 56 -445 -1562 -1865 -3004 -3246 -3628 -4316 -4203 -4596 -4078 -4170 -3894 -3225 -2950 -1914 -1711
3474 -1711 -476 194 760 1802 2116 3387 3374 3825 4369 4242 4736 4023 4212 3759 3079 2660 1719 1468 204
3493 204 -401 -1154 -1967 -2375 -3618 -3505 -4171 -4402 -4340 -4723 -3931 -4150 -3587 -3039 -2357 -1459 -1112 18 603 1590
3513 1590 2103 2622 3660 3595 4401 4239 4378 4705 3809 3988 3328 2782 2204 1270 840 -197 -753 -1801 -2176
3532 -2176 -2914 -3702 -3595 -4494 -4184 -4492 -4478 -3784 -3930 -3065 -2639 -1987 -1073 -513 452 1129 1941 2339 3292 3639
3552 3639 3794 4450 4091 4552 4257 3657 3790 2800 2474 1724 820 283 -676 -1455 -2117 -2670 -3439 -3650 -4136 -4467
3572 -4467 -4154 -4619 -4020 -3714 -3490 -2484 -2379 -1303 -508 43 969 1684 2396 2952 3528 3785 4382 4285 4196 4493
3592 4493 3697 3827 3081 2262 2196 876 405 -410 -1353 -1825 -2633 -3313 -3658 -3881 -4430 -4209 -4410 -4257 -3462 -3740
3612 -3740 -2722 -2239 -1729 -457 -362 824 1660 2037 2863 3406 3745 4135 4344 4073 4552 3971 3424 3528 2378
3631 2378 2291 1168 192 174 -1195 -1741 -2403 -3191 -3265 -3954 -4367 -4264 -4106 -4368 -3724 -3501 -3069 -1981 -2107 -806
3651 -806 15 232 1662 1779 2827 3417 3405 4193 4268 4296 4236 4096 3530 3561 2697 1837 1774 400 54 -759 -1980
3672 -1980 -1824 -3119 -3523 -3605 -4326 -4089 -4331 -4315 -3884 -3490 -3292 -2378 -1879 -1384 -32 89 1228 2042 2168
3691 2168 3456 3362 3892 4482 4042 4397 4091 3691 3461 2932 2160 1704 867 -64 -332 -1681 -2013 -2474 -3630
3710 -3630 -3277 -4172 -4305 -3989 -4501 -3858 -3594 -3346 -2570 -2066 -1442 -462 193 719 1866 2079 2902 3529 3427
3729 3427 4380 4112 4077 4298 3617 3606 3041 2331 1951 1043 204 -281 -1098 -1955 -2258 -3204 -3488 -3712 -4389 -4006
3749 -4006 -4238 -4105 -3564 -3503 -2681 -2179 -1702 -646 7 653 1458 2022 2621 3424 3490 3936 4305 4020 4224 3785
3769 3785 3500 3294 2411 1937 1310 442 -170 -1054 -1680 -2219 -2933 -3510 -3610 -4075 -4159 -4106 -4221 -3576 -3459 -2970
3789 -2970 -2201 -1744 -948 -186 455 1322 1881 2390 3080 3511 3732 4087 4003 4065 3899 3363 3322 2605 2019 1447 633
3810 633 126 -715 -1453 -2044 -2584 -3119 -3555 -3750 -3982 -3889 -4012 -3696 -3202 -3053 -2368 -1926 -1064 -369 101 1107
3830 1107 1621 2246 2787 3252 3677 3794 3940 3879 3919 3539 3160 2821 2113 1619 814 133 -365 -1329 -1780 -2490
3850 -2490 -2909 -3366 -3790 -3792 -3879 -3873 -3717 -3369 -2939 -2542 -1955 -1362 -509 64 548 1458 1992 2699 2929 3358 3779
3871 3779 3725 3888 3680 3592 3221 2666 2315 1763 1103 307 -284 -926 -1671 -2156 -2741 -3086 -3464 -3809 -3704 -3814
3891 -3814 -3595 -3489 -3086 -2532 -2138 -1446 -912 -107 548 1011 1813 2403 2855 3122 3469 3772 3703 3743 3416 3360 2963
3912 2963 2286 1922 1261 652 -194 -741 -1196 -1901 -2495 -3023 -3231 -3569 -3767 -3660 -3637 -3347 -3197 -2739 -2106 -1727
3932 -1727 -1047 -411 357 901 1404 2171 2628 3065 3232 3578 3745 3643 3508 3208 3087 2524 1929 1492 793 226
3952 226 -615 -1119 -1689 -2242 -2730 -3176 -3300 -3606 -3689 -3605 -3386 -2974 -2875 -2331 -1599 -1195 -544 42 759 1381 1824
3973 1824 2394 2876 3315 3389 3549 3548 3536 3265 2898 2682 2093 1497 1033 425 -219 -1009 -1491 -1986 -2524 -2964 -3286
3994 -3286 -3355 -3520 -3536 -3428 -3043 -2803 -2524 -1903 -1324 -637 -147 329 1215 1646 2142 2621 3049 3305 3376 3459 3492
4015 3492 3388 2874 2618 2207 1693 1200 387 -38 -648 -1414 -1784 -2341 -2687 -3120 -3412 -3348 -3368 -3352 -3177 -2738 -2491
4036 -2491 -1970 -1426 -912 -170 221 904 1628 1923 2561 2685 3185 3431 3381 3371 3288 3007 2635 2300 1772 1383 615
4057 615 -136 -306 -1235 -1675 -2159 -2705 -2792 -3318 -3377 -3286 -3353 -3167 -2925 -2464 -1969 -1506 -1179 -320 295 631 1457
4078 1457 1797 2425 2821 2802 3451 3381 3329 3277 2966 2955 2331 1815 1300 908 142 -416 -918 -1688 -1857 -2682 -2847
4099 -2847 -2919 -3538 -3266 -3423 -3166 -2712 -2833 -2047 -1635 -1145 -592 56 666 1274 1716 2001 2876 2857 3137 3508
4119 3508 3012 3478 2950 2715 2677 1750 1587 937 338 -154 -852 -1385 -1793 -2282 -2885 -2747 -3287 -3384 -3136 -3376
4139 -3376 -2659 -2709 -2395 -1560 -1456 -654 -182 266 1040 1460 1896 2427 2800 2837 3291 3078 3197 3212 2473 2703 1985
4160 1985 1443 1304 367 67 -582 -1278 -1486 -2053 -2502 -2730 -2952 -3172 -3001 -3207 -2834 -2337 -2475 -1689 -1364 -939
4180 -939 -136 -47 806 1401 1571 2227 2545 2729 2972 2987 2904 3156 2644 2384 2280 1450 1425 543 -3 -194 -1073
4201 -1073 -1375 -1844 -2377 -2528 -2905 -3081 -2945 -2921 -2930 -2452 -2376 -1933 -1359 -1221 -228 119 468 1319 1421 2078 2422
4222 2422 2538 2984 3002 2900 2939 2790 2326 2257 1666 1277 977 -18 -96 -778 -1390 -1597 -2355 -2432 -2702 -3045 -2969 -2962
4244 -2962 -2885 -2701 -2331 -2090 -1444 -1169 -648 197 267 1137 1459 1838 2482 2394 2928 2927 2914 2986 2727 2529 2213 1892
4266 1892 1228 980 384 -241 -504 -1398 -1501 -2076 -2532 -2448 -2969 -2797 -2962 -2870 -2526 -2443 -2049 -1685 -1050 -760 -142
4287 -142 419 739 1517 1568 2305 2463 2614 3077 2760 3013 2756 2479 2334 1830 1544 975 550 -61 -542 -967
4307 -967 -1665 -1730 -2391 -2450 -2768 -2972 -2723 -3005 -2558 -2436 -2144 -1593 -1394 -724 -336 253 704 1124 1706 1898 2470
4328 2470 2536 2742 2861 2690 2858 2422 2399 1920 1523 1277 532 259 -426 -800 -1313 -1773 -2023 -2546 -2499 -2870 -2726
4349 -2726 -2658 -2712 -2302 -2266 -1711 -1358 -965 -362 -60 633 931 1485 1883 2134 2466 2484 2805 2646 2633 2572 2215 2120
4371 2120 1535 1268 734 235 -128 -750 -1031 -1653 -1877 -2185 -2547 -2515 -2782 -2572 -2576 -2406 -2051 -1943 -1299 -1076 -545
4392 -545 -113 358 890 1224 1748 2007 2330 2477 2532 2765 2540 2523 2217 2001 1750 1222 912 378 -43 -538 -1027
4413 -1027 -1369 -1826 -1978 -2433 -2449 -2562 -2592 -2435 -2463 -2034 -1926 -1502 -1086 -732 -120 157 721 1066 1428 1961 1990
4434 1990 2442 2425 2567 2576 2385 2368 1898 1866 1323 941 566 -43 -238 -944 -1216 -1521 -1993 -2193 -2564 -2396 -2517
4455 -2517 -2474 -2400 -2139 -1767 -1732 -1132 -823 -344 207 415 1134 1322 1685 2064 2174 2523 2424 2488 2374 2282 2040 1715
4477 1715 1563 985 727 89 -295 -582 -1274 -1358 -1877 -2146 -2265 -2476 -2364 -2499 -2325 -2171 -1871 -1482 -1342 -784
4497 -784 -488 71 425 783 1392 1529 1965 2063 2213 2457 2276 2383 2150 2110 1811 1411 1131 720 314 -241 -513
4518 -513 -888 -1296 -1594 -2031 -2049 -2275 -2410 -2184 -2353 -2005 -1958 -1659 -1268 -1021 -497 -134 329 619 1071 1431 1791
4539 1791 2040 2011 2389 2346 2187 2296 1948 1893 1494 1032 893 359 45 -414 -786 -1113 -1425 -1831 -1939 -2090 -2306
4560 -2306 -2164 -2241 -2083 -1824 -1784 -1269 -958 -718 -178 115 568 924 1220 1570 1976 1985 2144 2300 2118 2231 1988
4581 1988 1725 1665 1158 903 587 94 -229 -699 -1065 -1290 -1622 -1940 -1984 -2221 -2223 -2143 -2165 -1752 -1746 -1425 -961 -786
4603 -786 -368 7 348 870 1135 1389 1737 1959 2073 2121 2119 2158 2040 1685 1678 1261 985 664 117 -32 -457 -920
4625 -920 -1130 -1556 -1730 -1926 -2093 -2067 -2064 -2084 -1858 -1585 -1531 -1045 -865 -472 52 108 693 986 1184 1653 1707 1908
4647 1908 2096 2015 2013 2001 1694 1617 1414 918 770 334 -68 -249 -880 -1015 -1311 -1732 -1671 -1992 -1971 -1940 -2019 -1840 -1610
4670 -1610 -1480 -1233 -834 -656 -112 107 395 980 1067 1480 1649 1711 2012 1929 1904 1931 1760 1537 1334 1083 882
4691 882 496 23 -190 -543 -986 -1122 -1511 -1691 -1809 -2100 -1880 -1978 -1847 -1741 -1619 -1264 -924 -734 -377 33
4711 33 263 686 957 1247 1608 1632 1785 1945 1871 1923 1788 1593 1531 1100 919 730 211 -102 -390 -753 -1033 -1376
4733 -1376 -1614 -1656 -1912 -1970 -1816 -1868 -1634 -1557 -1424 -963 -781 -519 -112 129 487 769 972 1401 1565 1643 1835
4754 1835 1847 1801 1802 1582 1516 1335 868 771 430 163 -244 -573 -838 -1091 -1431 -1588 -1629 -1825 -1844 -1793 -1655 -1439 -1467
4777 -1467 -1170 -857 -606 -327 -64 306 674 840 1117 1404 1536 1662 1696 1755 1788 1651 1424 1352 1049 809 480
4798 480 209 10 -456 -724 -910 -1250 -1430 -1558 -1669 -1717 -1684 -1675 -1508 -1415 -1188 -903 -738 -403 -152 164 567 760
4820 760 1013 1231 1429 1568 1617 1668 1648 1620 1496 1370 1182 911 734 315 59 -160 -560 -759 -1024 -1245 -1406
4841 -1406 -1578 -1546 -1609 -1633 -1525 -1405 -1219 -1054 -823 -573 -240 -38 288 612 782 1062 1230 1393 1500 1526 1589
4862 1589 1520 1501 1321 1159 927 771 500 165 -65 -389 -644 -872 -1061 -1237 -1459 -1581 -1537 -1563 -1554 -1386 -1257 -1134
4884 -1134 -921 -620 -403 -50 172 484 671 944 1194 1303 1442 1526 1522 1600 1435 1389 1223 1006 792 599 340
4905 340 86 -172 -534 -774 -1002 -1187 -1286 -1423 -1485 -1542 -1472 -1390 -1374 -1177 -1000 -732 -537 -294 17 271 579 748
4927 748 1033 1215 1264 1470 1455 1485 1477 1363 1308 1037 1004 667 430 180 -84 -321 -617 -792 -992 -1199 -1279 -1402 -1388
4950 -1388 -1520 -1408 -1369 -1193 -1023 -890 -645 -356 -130 134 369 621 834 1012 1184 1295 1388 1422 1454 1347 1286
4971 1286 1130 929 794 572 318 97 -210 -356 -680 -857 -1031 -1160 -1299 -1405 -1380 -1382 -1274 -1189 -1038 -897 -758
4992 -758 -441 -294 -18 220 431 699 914 1035 1166 1283 1320 1331 1327 1217 1142 1022 837 650 435 229 -94 -273
5014 -273 -493 -658 -890 -1080 -1193 -1306 -1313 -1318 -1306 -1209 -1137 -978 -855 -614 -405 -141 131 266 553 751 867 1069
5036 1069 1144 1281 1293 1284 1275 1164 1049 915 712 573 373 138 -135 -320 -582 -747 -945 -1099 -1156 -1285 -1252 -1273 -1245
5059 -1245 -1161 -1030 -859 -738 -464 -330 -19 156 326 609 707 955 1045 1151 1231 1234 1198 1208 1133 968 813 648 447
5082 447 249 -5 -246 -378 -624 -787 -1040 -1017 -1122 -1254 -1243 -1219 -1147 -1086 -924 -784 -658 -373 -247 66 227 394
5104 394 678 792 1023 1020 1179 1274 1235 1216 1108 1017 913 730 558 357 175 -123 -278 -528 -708 -766 -1016 -1102 -1200
5127 -1200 -1234 -1207 -1207 -1079 -987 -871 -708 -531 -304 -186 140 301 564 695 892 1086 1029 1266 1161 1194 1203 1013 990
5150 990 805 618 454 240 99 -145 -302 -553 -690 -881 -1026 -1014 -1184 -1136 -1143 -1126 -1026 -966 -822 -582 -471 -225
5172 -225 -22 154 388 560 777 943 1033 1097 1229 1183 1180 1089 948 973 686 562 446 134 45 -169 -427 -599 -780
5195 -780 -945 -1014 -1146 -1186 -1125 -1148 -1119 -933 -933 -658 -572 -330 -104 25 191 444 632 798 891 1001 1135 1149 1114 1191
5219 1191 997 951 849 617 549 275 106 -31 -264 -455 -602 -789 -893 -1038 -1131 -1076 -1119 -1139 -964 -938 -780 -567
5241 -567 -479 -213 -139 120 344 512 750 870 952 1051 1152 1087 1118 1039 1000 900 682 627 416 183 111 -131 -316
5264 -316 -537 -718 -755 -954 -1102 -1088 -1079 -1099 -1055 -961 -879 -679 -603 -410 -112 -40 241 379 558 765 845 983 1086 1081
5288 1081 1033 1089 1002 930 837 623 592 317 87 -9 -248 -389 -624 -745 -851 -1011 -960 -1101 -1124 -1080 -985 -927 -809 -664
5312 -664 -530 -324 -121 103 316 406 663 815 907 1084 1033 1192 1104 1047 1040 871 811 616 459 241 59 -125 -288
5335 -288 -472 -681 -835 -946 -1009 -1083 -1185 -1044 -1091 -1016 -874 -707 -553 -408 -241 -35 218 345 510 674 815
5356 815 974 1026 1068 1151 1017 1036 967 815 680 494 375 210 6 -239 -435 -578 -735 -872 -1017 -986 -1058 -1092 -1043
5379 -1043 -1022 -884 -832 -698 -517 -345 -162 -20 237 413 548 728 836 943 999 1100 1066 1025 1033 906 795 625
5401 625 456 310 133 -65 -297 -401 -629 -793 -873 -976 -986 -1078 -1069 -996 -894 -847 -777 -570 -446 -275 -93 103 318
5424 318 416 627 739 877 998 1023 1042 1028 980 997 857 743 602 460 233 76 -91 -296 -520 -606 -765 -914
5446 -914 -960 -1011 -1069 -986 -968 -881 -787 -685 -527 -359 -191 -32 255 366 514 702 823 944 973 1000 1076 976 905 887
5470 887 815 677 463 299 116 7 -252 -433 -522 -738 -847 -914 -992 -1002 -1068 -1032 -961 -811 -750 -586 -405 -312 -85
5493 -85 53 266 461 622 774 793 907 955 1016 1003 937 939 781 714 615 390 237 79 -118 -286 -517 -620 -795
5516 -795 -874 -942 -1005 -1045 -1015 -913 -885 -774 -611 -548 -360 -232 1 180 359 555 635 816 876 962 1020 993 991 931 819
5541 819 747 642 464 347 117 -43 -234 -441 -561 -753 -820 -873 -935 -1026 -979 -914 -957 -793 -747 -553 -412 -276 -49
5564 -49 81 232 498 545 746 787 918 1011 985 983 1007 878 825 660 619 446 254 94 -103 -304 -509 -635 -754
5587 -754 -812 -951 -1031 -923 -964 -916 -805 -780 -660 -461 -343 -167 24 95 357 423 627 811 825 936 940 947 969 866
5611 866 889 809 609 531 346 157 -7 -150 -365 -531 -668 -813 -871 -1030 -970 -929 -958 -875 -832 -684 -551 -423 -356
5634 -356 -125 -9 267 395 544 715 767 829 981 962 965 902 885 857 733 576 453 249 94 -154 -256 -399 -650
5657 -650 -717 -785 -885 -934 -936 -956 -909 -806 -735 -655 -503 -352 -138 -94 202 361 455 643 711 780 917 904 870 972 917
5682 917 862 763 579 545 347 126 -10 -212 -398 -515 -683 -721 -873 -925 -933 -976 -910 -875 -830 -692 -531 -425 -226 -128
5706 -128 39 279 380 600 734 797 914 878 925 951 883 863 707 624 550 380 176 74 -184 -372 -467 -676 -739
5729 -739 -841 -928 -929 -990 -967 -868 -857 -719 -589 -457 -317 -160 -3 195 357 492 688 753 856 935 859 1045 892
5752 892 877 813 711 579 499 277 127 -54 -282 -421 -565 -755 -785 -875 -924 -916 -978 -838 -882 -761 -675 -569 -363 -226
5776 -226 -74 160 268 378 557 769 796 948 936 954 1012 886 885 817 665 516 288 168 78 -192 -362 -537 -687
5799 -687 -787 -858 -925 -918 -990 -927 -820 -830 -690 -588 -442 -216 -70 86 234 376 536 722 870 929 976 897 1001
5822 1001 956 901 734 637 565 359 208 69 -146 -303 -453 -677 -781 -918 -903 -941 -944 -988 -906 -840 -714 -582 -485 -249
5846 -249 -180 1 172 345 533 676 758 805 914 918 955 955 837 863 685 550 469 218 125 -80 -221 -377 -564 -709
5870 -709 -739 -858 -913 -908 -919 -908 -841 -772 -586 -441 -293 -180 -46 137 290 482 631 713 773 882 948 930 868 899 796
5895 796 717 598 526 299 172 -15 -239 -316 -543 -687 -761 -839 -920 -998 -933 -896 -841 -730 -664 -460 -386 -241 -68 67
5919 67 312 415 578 695 778 909 956 961 905 886 797 738 632 499 343 207 27 -171 -337 -458 -652 -733 -798 -882
5943 -882 -912 -952 -821 -848 -772 -676 -553 -394 -272 -109 -6 253 417 503 678 742 884 845 840 931 878 826 725 646 540
5968 540 372 243 104 -66 -236 -452 -575 -706 -749 -900 -866 -914 -890 -852 -807 -730 -551 -454 -310 -160 61 168 330
5991 330 463 594 740 845 852 913 945 905 811 787 621 606 458 242 205 -85 -182 -410 -527 -719 -777 -906 -908 -867 -944
6016 -944 -847 -868 -749 -602 -534 -340 -189 -97 88 303 459 589 701 777 868 947 901 917 860 790 686 593 518 313
6040 313 165 -21 -162 -298 -519 -620 -810 -754 -885 -825 -820 -875 -763 -750 -640 -492 -405 -255 -104 44 194 356
6062 356 533 540 729 751 830 855 828 828 721 692 602 505 313 189 111 -124 -216 -340 -531 -645 -731 -818 -811 -814 -785 -744 -685
6089 -685 -625 -513 -429 -299 -128 6 179 286 443 627 722 713 839 779 869 791 725 683 643 455 384 200 131 -66
6113 -66 -221 -358 -529 -615 -735 -790 -811 -847 -841 -797 -777 -668 -607 -444 -319 -139 -59 111 282 402 542 577 735 768
6137 768 770 848 802 762 729 689 564 350 251 140 24 -185 -299 -396 -589 -659 -755 -801 -814 -779 -719 -730 -636 -556 -508 -349
6163 -349 -204 -51 40 203 323 441 630 653 790 759 772 829 751 744 664 525 469 331 210 42 -91 -276 -379
6186 -379 -518 -630 -706 -788 -730 -787 -788 -743 -690 -596 -503 -374 -302 -114 20 128 307 450 552 583 643 802 778 810 711
6211 711 677 636 581 526 384 211 83 -27 -172 -294 -420 -557 -566 -616 -720 -673 -727 -647 -618 -635 -509 -454 -290 -189
6235 -189 -53 28 207 326 443 538 546 659 661 755 692 633 649 529 440 389 278 186 19 -61 -213 -307 -418 -501 -588 -650
6261 -650 -712 -699 -698 -580 -598 -524 -422 -328 -216 -162 39 108 258 354 467 545 634 668 616 653 646 593 606 503 415 328 211
6288 211 122 -52 -195 -307 -402 -510 -579 -578 -633 -683 -662 -586 -599 -579 -455 -375 -244 -177 -63 109 160 340 386 475 530 632
6314 632 670 692 666 625 579 498 387 344 246 102 4 -151 -245 -407 -438 -546 -574 -671 -667 -591 -603 -554 -547 -457 -415 -303 -188
6341 -188 -45 91 174 238 374 506 544 635 645 631 708 595 586 474 413 393 267 74 8 -70 -234 -353 -468 -492 -602
6366 -602 -591 -686 -641 -611 -615 -509 -482 -374 -287 -193 -62 20 160 285 391 497 535 621 656 617 679 600 599 489 506 384
6392 384 246 168 70 -83 -248 -326 -436 -498 -541 -601 -679 -609 -623 -523 -611 -476 -442 -363 -254 -122 -6 84 258 306 441
6417 441 525 566 565 563 628 588 567 541 461 406 291 243 137 24 -161 -321 -340 -432 -501 -543 -621 -626 -637 -545 -524 -427 -410 -319 -266
6446 -266 -112 -12 92 171 298 384 441 552 561 581 574 584 552 537 429 404 309 198 151 31 -154 -211 -352 -434 -461 -571
6472 -571 -564 -598 -583 -542 -511 -491 -389 -277 -269 -148 -25 29 144 256 403 444 489 499 561 514 567 574 475 460 411 343 188
6499 188 139 15 -64 -200 -274 -376 -456 -517 -573 -557 -619 -554 -580 -486 -377 -353 -265 -207 -52 49 165 240 317 397 485 456
6525 456 542 536 559 532 500 422 414 338 241 147 62 -67 -173 -257 -310 -434 -487 -528 -519 -583 -552 -493 -413 -380 -331 -274 -178 -57 16
6554 16 100 210 267 379 454 483 513 561 562 550 517 407 408 362 237 176 103 -33 -151 -249 -320 -421 -446 -486 -490 -573 -496 -465
6582 -465 -446 -370 -342 -260 -186 -137 -40 50 187 212 284 425 425 489 527 472 543 504 430 397 356 298 236 96 32 -126 -168 -280
6610 -280 -362 -403 -486 -504 -502 -482 -503 -486 -427 -377 -291 -207 -144 -75 51 98 258 308 367 458 521 512 499 489 520 481 444 368 273 199
6640 199 130 -2 -49 -179 -259 -293 -444 -435 -528 -489 -503 -484 -455 -381 -408 -291 -215 -149 -89 32 99 225 293 371 385 464 474
6667 474 489 514 498 475 420 417 223 248 86 -1 -52 -194 -261 -343 -382 -471 -513 -562 -511 -458 -463 -389 -379 -246 -221 -122 -7 46
6695 46 106 209 338 432 423 467 532 504 489 460 393 406 387 258 171 48 -10 -60 -157 -257 -310 -355 -423 -454 -510 -468 -479 -393
6723 -393 -352 -344 -290 -218 -126 43 23 117 203 267 366 463 412 454 499 453 449 403 371 345 276 214 90 -3 -73 -133 -260 -335 -400
6752 -400 -457 -457 -449 -511 -543 -467 -352 -329 -283 -207 -171 -53 68 117 218 314 336 402 502 477 485 506 417 403 407 306 295 239 160
6781 160 -24 -78 -161 -256 -298 -352 -379 -454 -465 -465 -426 -388 -388 -314 -269 -229 -106 -53 -5 55 215 257 296 418 374 472 407 454 468
6810 468 417 297 294 271 193 96 41 -22 -122 -206 -294 -295 -404 -431 -434 -450 -401 -410 -435 -329 -231 -225 -118 -28 -13 27 122 298 285
6839 285 371 379 429 384 396 420 409 358 340 196 172 96 34 -4 -114 -210 -270 -304 -382 -369 -446 -465 -430 -405 -397 -383 -268 -242 -184
6868 -184 -73 12 97 138 204 288 340 389 400 429 439 454 424 367 287 276 190 125 68 -32 -94 -205 -291 -319 -334 -444 -489 -446
6896 -446 -443 -426 -345 -285 -199 -213 -150 -57 -21 56 195 211 282 355 342 403 414 474 430 350 375 337 267 267 130 59 3 -92 -158 -238
6926 -238 -280 -345 -396 -515 -422 -465 -443 -435 -404 -280 -272 -193 -88 -23 48 95 189 297 335 407 429 483 492 477 478 450 388 338 259 181
6956 181 112 55 -66 -151 -281 -367 -384 -416 -464 -512 -433 -486 -417 -384 -327 -263 -215 -118 -108 22 97 215 287 313 384 441 485 516
6984 516 465 480 445 367 284 284 214 62 32 -23 -152 -218 -297 -338 -406 -478 -489 -497 -479 -502 -453 -345 -298 -258 -160 -40 24 86 145
7013 145 261 315 372 495 516 538 529 475 457 350 320 300 272 146 24 -17 -91 -259 -359 -396 -437 -471 -506 -523 -442 -470 -401
7040 -401 -414 -351 -212 -192 -110 36 96 170 250 296 363 453 511 524 460 461 521 397 354 294 245 173 57 -52 -100 -198 -235 -388
7068 -388 -366 -452 -467 -523 -481 -500 -453 -416 -334 -291 -169 -88 -31 36 180 215 268 361 382 443 435 503 486 469 413 325 320 287 181
7097 181 171 -13 -121 -189 -258 -313 -418 -430 -535 -517 -463 -491 -481 -359 -334 -291 -193 -125 -23 55 135 186 289 326 473 415
7123 415 472 478 463 503 380 408 349 256 119 109 -3 -131 -124 -229 -278 -429 -459 -455 -452 -498 -469 -462 -416 -353 -326 -217 -165 -68 66
7152 66 137 194 260 321 431 462 492 502 477 491 468 415 370 276 236 148 59 -70 -158 -195 -300 -377 -413 -491 -543 -512 -483 -481 -404
7181 -404 -425 -357 -232 -170 -104 30 61 140 257 356 397 467 501 500 533 488 511 484 382 333 234 166 93 13 -89 -149 -260
7208 -260 -312 -426 -431 -454 -494 -502 -452 -470 -415 -415 -372 -235 -167 -86 2 139 240 285 390 371 489 512 571 503 484 450 416 405
7236 405 273 201 128 60 -50 -175 -242 -279 -417 -437 -487 -535 -558 -466 -473 -477 -363 -342 -269 -191 -98 8 95 194 233 367 410
7263 410 432 551 522 522 507 521 445 381 320 255 142 55 3 -115 -247 -286 -343 -402 -453 -516 -460 -524 -477 -444 -404 -287 -278 -210
7291 -210 -140 -45 55 129 304 353 423 441 496 547 514 500 463 454 415 311 271 195 41 -9 -90 -149 -258 -344 -404 -452 -464 -550
7319 -550 -450 -545 -505 -420 -366 -296 -218 -138 -38 71 109 205 282 364 410 438 481 537 502 494 420 410 317 288 189 60 0 -32
7347 -32 -119 -247 -354 -401 -497 -539 -526 -509 -517 -557 -402 -394 -327 -237 -147 -56 35 136 212 304 374 427 469 524 569 477 521 501 424
7376 424 357 251 188 91 42 -58 -113 -210 -304 -353 -404 -487 -524 -523 -500 -496 -445 -333 -327 -250 -201 -108 -77 118 162 240 265 421 459
7405 459 477 518 495 512 522 424 406 338 277 193 68 26 -96 -226 -316 -307 -384 -500 -512 -562 -501 -514 -469 -452 -324 -303 -206 -159
7433 -159 -73 69 151 245 363 416 385 425 488 530 447 500 473 409 378 218 196 98 45 -63 -163 -206 -337 -360 -439 -478 -515
7460 -515 -518 -508 -476 -419 -441 -354 -239 -146 -60 50 109 163 270 400 444 443 468 531 493 514 478 393 336 307 178 136 94 -37
7488 -37 -144 -267 -318 -356 -414 -486 -530 -509 -553 -490 -524 -387 -306 -240 -158 -96 -5 70 162 312 311 379 509 474 542 488 518 464
7516 464 418 307 268 242 133 38 -121 -115 -272 -363 -337 -414 -497 -560 -512 -511 -528 -494 -424 -321 -293 -233 -97 20 79 163 245
7543 245 357 418 471 427 528 534 503 461 474 327 294 238 151 80 -50 -112 -205 -315 -353 -409 -499 -547 -510 -510 -536 -485 -421 -343
7571 -343 -288 -196 -150 -62 45 130 251 361 401 469 524 484 510 502 545 511 432 404 249 198 105 10 -74 -198 -332 -366 -386
7598 -386 -506 -514 -474 -595 -538 -558 -459 -356 -372 -290 -134 -32 25 110 206 315 386 469 525 540 550 606 543 534 428 420 359 233
7626 233 123 17 -81 -147 -252 -330 -445 -418 -556 -535 -560 -632 -514 -465 -453 -374 -296 -172 -90 66 87 146 340 393 458
7651 458 482 534 530 620 551 492 459 428 356 228 127 91 -78 -158 -271 -390 -421 -477 -522 -605 -578 -579 -518 -568 -421 -380 -301 -211
7679 -211 -124 46 83 157 349 351 457 586 601 600 541 564 541 479 353 302 313 155 58 -18 -146 -201 -340 -447 -509 -553
7705 -553 -560 -617 -602 -585 -563 -472 -436 -364 -235 -128 7 61 187 246 375 397 538 589 558 616 565 576 500 425 405 290 238
7732 238 49 -7 -136 -244 -343 -450 -478 -561 -590 -578 -657 -570 -585 -492 -391 -331 -255 -155 -26 30 206 191 376 487 522
7757 522 598 584 665 680 547 615 509 432 294 254 122 19 -81 -217 -293 -424 -458 -570 -617 -575 -688 -612 -561 -576 -486
7782 -486 -446 -286 -176 -123 14 145 280 382 438 462 593 593 589 692 634 615 540 417 398 240 132 82 -89 -158 -232
7807 -232 -387 -506 -510 -614 -626 -697 -621 -552 -586 -474 -421 -332 -177 -154 38 131 188 353 394 503 550 659 587 620 608 570
7833 570 599 386 363 325 180 121 10 -140 -275 -342 -464 -538 -547 -660 -673 -717 -623 -596 -511 -411 -352 -251 -129 -45 122
7858 122 195 308 454 482 579 614 627 679 625 635 535 487 353 288 220 89 -34 -158 -182 -384 -377 -472 -526 -560 -646 -594
7884 -594 -624 -561 -568 -497 -392 -258 -132 -97 11 190 218 377 472 565 562 618 676 674 638 579 544 420 311 244 165 53 -103
7911 -103 -269 -275 -417 -499 -558 -644 -638 -683 -632 -620 -570 -474 -449 -253 -137 -117 7 188 288 324 494 509 670 661 696 705 657
7938 657 641 504 439 428 284 165 91 -58 -249 -308 -413 -557 -597 -669 -644 -693 -719 -673 -676 -564 -460 -365 -258 -163 33
7963 33 75 261 342 487 505 547 631 693 716 679 687 684 477 470 353 251 106 -10 -164 -259 -428 -493 -573 -682 -725 -717 -731
7990 -731 -635 -648 -643 -499 -496 -345 -218 -46 52 192 318 448 525 597 633 718 703 800 686 660 617 535 404 286 229 46
8016 46 -107 -153 -329 -396 -543 -601 -657 -738 -736 -755 -720 -671 -589 -516 -412 -250 -194 3 112 185 386 470 612 677 725 749
8042 749 768 781 667 674 623 525 405 295 147 -51 -98 -297 -441 -494 -625 -698 -801 -707 -751 -761 -718 -696 -564 -469 -346
8067 -346 -195 -78 134 196 343 436 546 721 703 807 812 847 751 677 636 523 416 283 169 23 -145 -229 -432
8090 -432 -462 -586 -722 -739 -817 -742 -746 -731 -694 -640 -489 -413 -238 -150 24 199 272 468 515 651 711 757 753 855 807 723
8116 723 653 568 458 328 150 54 -98 -187 -297 -461 -525 -710 -734 -739 -779 -801 -770 -711 -659 -561 -468 -306 -108 2 208
$$ [...]
8191B83
##END NTUPLES=NMR FID
##END=
