##TITLE=1H_DPAA1412K
 CDCl3
 8 sc, 
 14.12.2021
##JCAMPDX= 6.0         $$ Bruker NMR JCAMP-DX V2.0
##DATA TYPE= NMR FID
##DATA CLASS= NTUPLES
##ORIGIN= UXNMR, Bruker Analytische Messtechnik GmbH
##OWNER= root
$$ XWIN-NMR		Version 3.5
$$ Tue Dec 14 12:34:27 2021 Russian Standard Time (UT+4h)  she@DPX200
##.OBSERVE FREQUENCY= 200.131346
##.OBSERVE NUCLEUS= ^1H
##.DELAY= (6, 6)
##.ACQUISITION MODE= SIMULTANEOUS
##.ACQUISITION SCHEME= undefined
##.AVERAGES= 8
##.DIGITISER RES= 18
##SPECTROMETER/DATA SYSTEM= spect
##.PULSE SEQUENCE= zg30
##.SOLVENT NAME= CDCl3
##.SHIFT REFERENCE= (INTERNAL, CDCl3, 0, 15.7039)
##AUDIT TRAIL= $$ (NUMBER, WHEN, WHO, WHERE, WHAT)
$$ ##TITLE= Audit trail, XWIN-NMR		Version 3.5
$$ ##JCAMPDX= 5.01
$$ ##ORIGIN= Bruker BioSpin GmbH
$$ ##OWNER= she
$$ F:/spectra/data/she/nmr/H-F/1/audita.txt
$$ ##AUDIT TRAIL=  $$ (NUMBER, WHEN, WHO, WHERE, WHAT)
(   1,<2021-12-14 12:33:10.46 +0400>,<she>,<DPX200>,
      <created by zg, POWCHK disabled, PULCHK disabled
       configuration hash MD5:
       00 E9 B6 7A A2 85 ED C7 34 08 36 98 17 FE 4E 26
       data hash MD5: 16K
       C6 17 42 6E 72 CD CF 2F 57 94 49 BA D3 99 88 0A>)
$$ ##END=
$$ 
$$ hash MD5
$$ 1D F4 9B A7 B9 45 DB 58 42 8E 26 66 CB 56 8A C4
##$RELAX= 
##$RELAX= 
##$RELAX= 
##$RELAX= 
##$RELAX= 
##$RELAX= 
$$ Bruker specific parameters
$$ --------------------------
##$DU= <F:/spectra>
##$EXPNO= 1
##$NAME= <H-F>
##$PROCNO= 1
##$TYPE= <nmr>
##$USER= <she>
##$AMP= (0..31)
100 100 100 100 100 100 100 100 100 100 100 100 100 100 100 100 100 100 
100 100 100 100 100 100 100 100 100 100 100 100 100 100 
##$AQSEQ= 0
##$AQ_mod= 1
##$AUNM= <au_zg>
##$AUTOPOS= <>
##$BF1= 200.13
##$BF2= 200.13
##$BF3= 200.13
##$BF4= 200.13
##$BF5= 200.13
##$BF6= 200.13
##$BF7= 200.13
##$BF8= 200.13
##$BYTORDA= 1
##$CFDGTYP= 0
##$CFRGTYP= 5
##$CHEMSTR= <none>
##$CNST= (0..31)
1 1 145 1 1 1 1 1 1 1 1 1 1 1 1 1 1 1 1 1 1 1 1 1 1 1 1 1 1 1 1 1 
##$CPDPRG= <>
##$CPDPRG1= <>
##$CPDPRG2= <>
##$CPDPRG3= <>
##$CPDPRG4= <mlev>
##$CPDPRG5= <mlev>
##$CPDPRG6= <mlev>
##$CPDPRG7= <mlev>
##$CPDPRG8= <mlev>
##$CPDPRGB= <>
##$CPDPRGT= <>
##$D= (0..31)
0 1.2 0 0 0 0 0 0 0 0.06 0 0.03 0 0 0 0 0.0002 0 0 0 0 0 0 0 0 0 0 0 0 
0 0 0 
##$DATE= 1639470789
##$DBL= (0..7)
120 120 120 120 120 120 120 120 
##$DBP= (0..7)
150 150 150 150 150 150 150 150 
##$DBP07= 0
##$DBPNAM0= <>
##$DBPNAM1= <>
##$DBPNAM2= <>
##$DBPNAM3= <>
##$DBPNAM4= <>
##$DBPNAM5= <>
##$DBPNAM6= <>
##$DBPNAM7= <>
##$DBPOAL= (0..7)
0.5 0.5 0.5 0.5 0.5 0.5 0.5 0.5 
##$DBPOFFS= (0..7)
0 0 0 0 0 0 0 0 
##$DE= 6
##$DECBNUC= <off>
##$DECIM= 32
##$DECNUC= <off>
##$DECSTAT= 4
##$DIGMOD= 1
##$DIGTYP= 9
##$DL= (0..7)
0 120 120 120 120 120 120 120 
##$DP= (0..7)
150 150 150 150 150 150 150 150 
##$DP07= 0
##$DPNAME0= <>
##$DPNAME1= <>
##$DPNAME2= <>
##$DPNAME3= <>
##$DPNAME4= <>
##$DPNAME5= <>
##$DPNAME6= <>
##$DPNAME7= <>
##$DPOAL= (0..7)
0.5 0.5 0.5 0.5 0.5 0.5 0.5 0.5 
##$DPOFFS= (0..7)
0 0 0 0 0 0 0 0 
##$DQDMODE= 0
##$DR= 18
##$DS= 0
##$DSLIST= <SSSSSSSSSSSSSSS>
$$ [...]
##$SUBNAM2= <"">
##$SUBNAM3= <"">
##$SUBNAM4= <"">
##$SUBNAM5= <"">
##$SUBNAM6= <"">
##$SUBNAM7= <"">
##$SUBNAM8= <"">
##$SUBNAM9= <"">
##$SW= 18.0517287032376
##$SWIBOX= (0..15)
0 0 2 0 0 0 0 0 0 0 0 0 0 0 0 0 
##$SW_h= 3612.71676300578
##$TD= 16384
##$TD0= 1
##$TE= 0
##$TE2= 300
##$TE3= 300
##$TEG= 300
##$TL= (0..7)
0 120 120 120 120 120 120 120 
##$TP= (0..7)
150 150 150 150 150 150 150 150 
##$TP07= 0
##$TPNAME0= <>
##$TPNAME1= <>
##$TPNAME2= <>
##$TPNAME3= <>
##$TPNAME4= <>
##$TPNAME5= <>
##$TPNAME6= <>
##$TPNAME7= <>
##$TPOAL= (0..7)
0.5 0.5 0.5 0.5 0.5 0.5 0.5 0.5 
##$TPOFFS= (0..7)
0 0 0 0 0 0 0 0 
##$TUNHIN= 0
##$TUNHOUT= 0
##$TUNXOUT= 0
##$USERA1= <user>
##$USERA2= <user>
##$USERA3= <user>
##$USERA4= <user>
##$USERA5= <user>
##$V9= 5
##$VALIST= <valist>
##$VCLIST= <CCCCCCCCCCCCCCC>
##$VD= 0
##$VDLIST= <DDDDDDDDDDDDDDD>
##$VPLIST= <PPPPPPPPPPPPPPP>
##$VTLIST= <TTTTTTTTTTTTTTT>
##$WBST= 1024
##$WBSW= 4
##$XGAIN= (0..3)
0 0 0 0 
##$XL= 0
##$YL= 0
##$YMAX_a= 35285
##$YMIN_a= -30494
##$ZGOPTNS= <>
##$ZL1= 120
##$ZL2= 120
##$ZL3= 120
##$ZL4= 120
##$ABSF1= 10
##$ABSF2= 0
##$ABSG= 5
##$ABSL= 3
##$ALPHA= 0
##$AQORDER= 0
##$ASSFAC= 0
##$ASSFACI= 0
##$ASSFACX= 0
##$ASSWID= 0
##$AUNMP= <proc_1d>
##$AZFE= 0.1
##$AZFW= 0.1
##$BCFW= 1
##$BC_mod= 2
##$BYTORDP= 1
##$COROFFS= 0
##$CY= 11.3945322036743
##$DATMOD= 1
##$DC= 2
##$DFILT= <>
##$DTYPP= 0
##$F1P= 2.36226072786647
##$F2P= -0.459571619588291
##$FCOR= 0.5
##$FTSIZE= 0
##$FT_mod= 4
##$GAMMA= 1
##$GB= 0.15
##$INTBC= 1
##$INTSCL= 1
##$ISEN= 128
##$LB= 0.24
##$LEV0= 0
##$LPBIN= 0
##$MAXI= 10000
##$MC2= 0
##$MEAN= 0
##$ME_mod= 0
##$MI= 1.114404
##$NCOEF= 0
##$NC_proc= 0
##$NLEV= 6
##$NOISF1= 3.799351
##$NOISF2= 2.8
##$NSP= 1
##$NTH_PI= 0
##$NZP= 0
##$OFFSET= 15.70392
##$PC= 1
##$PHC0= -16027.36
##$PHC1= 8.400801
##$PH_mod= 1
##$PKNL= yes
##$PPARMOD= 0
##$PSCAL= 0
##$PSIGN= 0
##$REVERSE= no
##$SF= 200.130013532006
##$SI= 16384
##$SIGF1= 3
##$SIGF2= 2
##$SINO= 400
##$SIOLD= 16384
##$SREGLST= <1H.CDCl3>
##$SSB= 0
##$STSI= 0
##$STSR= 0
##$SW_p= 3612.71676300578
##$SYMM= 0
##$S_DEV= 0
##$TDeff= 0
##$TDoff= 0
##$TI= <>
##$TILT= no
##$TM1= 0
##$TM2= 0
##$TOPLEV= 0
##$USERP1= <user>
##$USERP2= <user>
##$USERP3= <user>
##$USERP4= <user>
##$USERP5= <user>
##$WDW= 1
##$XDIM= 8192
##$YMAX_p= 0
##$YMIN_p= 0
$$ End of Bruker specific parameters
$$ ---------------------------------
##NTUPLES= NMR FID
##VAR_NAME=  TIME,          FID/REAL,        FID/IMAG
##SYMBOL=    X,             R,               I
##VAR_TYPE=  INDEPENDENT,   DEPENDENT,       DEPENDENT
##VAR_FORM=  AFFN,          ASDF,            ASDF
##VAR_DIM=   8192,          8192,            8192
##UNITS=     SECONDS,       ARBITRARY UNITS, ARBITRARY UNITS
##FACTOR=    0.0002768,     1,               1
##FIRST=     0,             0,               0
##LAST=      2.2672688,     0,               0
##MIN=       0,             -30494,          0
##MAX=       2.2672688,     35285,           0
$$ Real data points
##PAGE= N=1
##DATA TABLE= (X++(R..R)), XYDATA
$$ [...]
667c052M192l18l350K272J056k234K176J201k899J949K378m079p82L220j750j230
$$ -3052 1140 822 -2528 -256 800 -1434 742 1943 -956 993 3371 -708 -1490 1730 -20 -1250
683a250J865j864k78L585j466l159K590J092k229R61N50j824K126J432l297O28
$$ -1250 615 -1249 -1527 2058 592 -2567 23 1115 -1114 -153 397 -1427 699 2131 -1166 -538
699e38K678k373j263J766q70m4K005j769j186L315K02k913O88P83j286J054K20
$$ -538 2140 -233 -1496 270 -600 -644 1361 -408 -1594 1721 1923 -990 -302 481 -805 249 469
716D69k171J570K158k316p24J813o69o91P52j111q6K263n43j956J412J023j394
$$ 469 -1702 -132 2026 -290 -1014 799 130 -561 191 -920 -1006 1257 714 -1242 170 1193 -201
733b01j59L9q53J383Q40k001M95K134p80r72K91l76qQ65j176r21J874O38j493
$$ -201 -360 -321 -1174 209 1049 -952 -457 1677 897 -75 216 -160 -168 697 -479 -1400 474 1112 -381
752c81P2M59o02N43k68j269R98J405j063m36J091K13m00l1p94j08J214j20j371
$$ -381 -309 150 -452 91 -177 -1446 -448 957 -106 -542 549 762 362 331 -463 -571 643 523 -848
771h48P61R22m31j85l02n22N60K38r57k0J042K13m94M7O6J38J75p28o05Q56N37
$$ -848 -87 835 404 219 -83 -605 -45 193 -764 -784 258 471 -23 24 90 228 403 -325 -930 -74 463
792D63o14j15L38K72K30n24n96K51M97j95m01L65M77M0j36m13m1L73k93n90J97
$$ 463 -151 -266 72 344 574 50 -546 -295 202 7 -394 -29 448 488 352 -61 -102 271 -22 -612 -415
813d15M57J18j2k36J26K79j61m78l09L99J78j25M9K07K34J54l72k60K37N5j10
$$ -415 42 160 148 -88 38 317 156 -322 -631 -232 -54 -179 -130 77 311 465 93 -167 70 125 15
834A5j48J02K92J56j92k03o6J18j59l39J47J29J00J36j28O3J33j45j98k8k7R6
$$ 15 -133 -31 261 417 225 22 -44 74 -85 -424 -277 -148 -48 88 -40 23 156 11 -187 -215 -242 -146
856a46P3M3J72L2J75k17p2P2j23q8J53l9l6K11k5j23Jj14j78nQ4j71P1L20r6L
$$ -146 -73 -30 142 174 349 132 60 132 9 -79 74 35 -1 210 185 62 63 -51 -229 -234 -150 -321 -250 70 -26 -23
882b3K15l00q8K66k74j63M60l0j92L40J42k03K27r6m69J81L97m38j29L18l54R1
$$ -23 192 -108 -196 70 -204 -367 93 63 -129 211 353 150 377 281 -188 -7 390 -48 -177 141 -213 -122
904a22L62n82k45N24j05k79N33J47l59L67J77n01L29L64j010pP44m36j71M97n84
$$ -122 240 -342 -587 -63 -168 -447 86 233 -126 241 418 -83 246 610 -400 -407 337 -99 -270 227 -357
925c57m7J052n04p20P17P3n33O49J33p83M39L98j013M44P17j032k04P95m38K5
$$ -357 -404 648 144 -576 141 214 -319 330 463 -320 119 517 -496 -52 665 -367 -571 224 -214 -189
945a89Q34q61m70J217k56r81P98M3q82Q99K97j164P81Q45j322J34J177q87j66
$$ -189 645 -216 -686 531 275 -706 92 135 -747 152 449 -715 66 911 -411 -277 900 13 -153
964a53J064r01n40J253n78j114J202j4j416R52N07j316R04P95j536M83J564j240
$$ -153 911 10 -530 723 145 -969 233 219 -1197 -245 262 -1054 -150 645 -891 -408 1156 -84
982h4j92J216r74l14J483p58j198J426j38j342J320J30j722R24Q06j538R04J026
$$ -84 -276 940 -34 -348 1135 377 -821 605 467 -875 445 575 -1147 -223 583 -955 -51 975
1000I75j925K30J677j143l51J466j250p33K084l29j676J439R0j675J644O10k157
$$ 975 -950 -720 957 -186 -537 929 -321 -1054 1030 701 -975 464 554 -1121 523 1133 -1024
1017a024P34J190j706M92J508j800m39K017r35q75J824q52j462K115K23j900J359
$$ -1024 -290 900 -806 -314 1194 -606 -1045 972 37 -838 986 134 -1328 787 1010 -890 469
1034D69L57k051J400J151k173J88J341j562P9J985j561r86K058o97j047K166m62
$$ 469 826 -1225 175 1326 -847 -659 682 -880 -801 1184 -377 -1363 695 -2 -1049 1117 655
1051F55j877J880M17j845J414O06k297Q22J552j935m4J528j716l48K316j277j419
$$ 655 -1222 658 1075 -770 644 1250 -1047 -225 1327 -608 -652 876 -840 -1188 1128 -149 -1568
1068a568K097m69j372K178o3k066J567Q49j909J065J120k172J98J831j564k19
$$ -1568 529 60 -1312 866 803 -1263 304 1153 -756 309 1429 -743 -545 1286 -278 -497
1084d97J777j770q69K411o22j601J604m32j513K055L90k225J137J073j869R43
$$ -497 1280 -490 -1359 1052 430 -1171 433 1 -1512 543 933 -1292 -155 918 -951 -8
1100hJ512k077j20J958j559l22K069j545j463K314j73j611J474k32j823J731J161
$$ -8 1504 -573 -693 1265 -294 -616 1453 -92 -1555 759 586 -1025 449 217 -1606 125 1286
1117A286k154N30J313j715M32J882j685o56J786j070p57K004p86j727J546J23
$$ 1286 -868 -338 975 -740 -308 1574 -111 -767 1019 -51 -808 1196 410 -1317 229 352
1133C52j298J276J88j923J048J309j628K59J332j458L5J786j341n72J817q73j051
$$ 352 -946 330 518 -1405 -357 952 -676 -417 915 -543 -508 1278 -63 -635 1182 309 -742
1150g42J670l47j488J324Q2j633J080P21j834O07J283j622J39J542j159k85J609
$$ -742 928 581 -907 417 499 -1134 -54 667 -1167 -560 723 -899 -760 782 -377 -662 947
1167I47r55q37J804j81j321R54J59j300J080O16j623K89R17j177L73J117j363
$$ 947 -8 -845 959 778 -543 411 570 -730 350 966 -657 -368 549 -628 -255 862 -501
1184e01m64J325m97l75J115n70j015J222L44r66P36J07j213R35Q52j249J64N34
$$ -501 -965 360 -137 -512 603 33 -982 240 584 -382 354 461 -752 183 1035 -214 -50 484
1202D84j074L30J109j065o08R29l29k85J044l96j041J071M82q85O45K64j084M03
$$ 484 -590 -260 849 -216 -824 105 -224 -509 535 139 -902 169 651 -234 411 675 -409 -6
1220fP73q81R1M34r12j54R76l30o26N68j79k98J028q6q97N32M95o50K88K47p31
$$ -6 767 -114 -23 411 -501 -655 321 -9 -635 -67 -246 -544 484 398 -499 33 528 -122 166 413 -318
1241c18K96N06o17k4N73m69l83N77k6l63L64j75m68O91J45p43J49L20k73J29J88
$$ -318 -22 484 -133 -157 416 -53 -436 141 115 -248 116 -59 -527 164 309 -434 -285 35 -238 -109 79
1262G9l50K08O27m35k09M89Ol82J29j96k00M37j17n37K55L49k82j10Q6n9K14J85
$$ 79 -271 -63 564 129 -80 409 415 33 162 -34 -234 203 86 -451 -196 153 -129 -239 -153 -212 2 187
1284A87m00P3N53p9l79P9l1pJ49l94j68M02K02k99p8K34J37m1p3k19K73L01l18
$$ 187 -213 -140 413 334 -45 34 3 -4 145 -249 -417 -15 187 -112 -190 44 181 140 67 -152 121 422 104
1307A04k96K30K02k09j19k48J09L01p6l48J45L62J8j88q5Q9J69pl71l7M04Q9l13
$$ 104 -192 38 240 31 -88 -336 -227 74 -2 -350 -205 157 175 -13 -98 -9 160 153 -218 -255 149 238 -75
1330g5lJ30K29q3k89j32K85J77k27j70J30K14o5j87k89J60K58k26k52K70K77J20
$$ -75 -78 52 281 198 -91 -223 62 239 12 -158 -28 186 121 -66 -355 -195 63 -163 -415 -145 132 252
1352B52j28k11J84K84k31l40K0K22O1j63j74M2K25L2l68p4L68J28j16q6J52L02
$$ 252 124 -87 97 381 150 -190 -170 52 113 -50 -224 -182 43 75 -293 -367 1 129 13 -73 79 381
1374C81N2l49k25J77J60k61l00J25J92J22j47j97J25L40k40k01J29K16J13r4q0
$$ 381 433 84 -141 36 196 -65 -365 -240 -48 74 -73 -270 -145 195 -45 -246 -117 99 212 118 38
1395C8J28J90K8m13o8K11o8n1o8l0K16J59m59j90L48l1k47l6J00J17K41o0j77
$$ 38 166 356 384 -29 -97 114 46 -5 -73 -103 113 272 -187 -377 -29 -60 -307 -343 -243 -126 115 55 -122
1418a22L24K47l53q1J71j07J32N9l33R3L16l09m06J63J18k39K14j19j41M93J76
$$ -122 202 449 96 15 186 79 211 270 -63 30 346 37 -369 -206 -88 -327 -113 -232 -373 120 296
1439B96m76J85K93l13P8J05k95K09L11l59k00N01j44l75J40q0k97M44k3m40M44
$$ 296 -180 5 298 -15 63 168 -127 82 393 34 -166 335 191 -184 -44 -124 -421 23 0 -440 4
1460DK71m91J45L34l87L6M71l69q2N71l11l80L92o4n10L61j21m76M93K74o55K64
$$ 4 275 -216 -71 263 -124 -88 383 14 -68 503 192 -188 204 140 -370 -9 -130 -606 -113 161 -494 -230
1482b30M59m13J27M01m70o9O44l73k44P26l51m47O63j63o04M50J5o73M86M50p47
$$ -230 229 -184 -57 344 -126 -195 449 76 -168 558 207 -240 423 260 -344 106 121 -552 -66 384 -363
1503c63J40M19n79M0P15o16l41Q04k03l21R14k58p09P64K42p47M00P6q57L06O61
$$ -363 -223 196 -383 -343 372 -244 -585 219 16 -305 609 351 -358 406 648 -99 301 377 -480 -174 487
1524D87p81j56O20o77j57J009m01n03P50j13l58R52Kr99M52L11p25L61L13j006
$$ 487 -294 -450 170 -507 -664 345 -56 -559 191 78 -280 672 674 -325 127 438 -287 74 387 -619
1544f19J88Q93o97q4P21p06k62J070l94m80Q12k27p45R10J41j014M93L47q16M41
$$ -619 -431 462 -235 -319 402 -304 -566 504 110 -370 442 215 -530 380 521 -493 0 347 -469 -28
1564b8O57r24mR80o97l68Q57n84n86R39l15p50R35N7p76O09M93q11M76O57q72
$$ -28 629 -295 -299 681 -16 -384 473 -111 -697 242 -73 -823 112 169 -607 2 495 -316 160 817 -55
1585e5R0P75q11j62Q60o78o30P86m05m33Q81k80r60Q86N05n98M24K99j028N48
$$ -55 35 810 -1 -163 697 19 -611 175 -230 -663 218 -62 -1022 -136 369 -229 195 494 -534 14
1605A4Q83q57k02P31q68q0J059m42p62O32j85m75R46R3j203M02O54o61N11K83
$$ 14 897 40 -162 569 -299 -379 680 238 -524 108 -77 -552 394 487 -716 -314 340 -321 190 473
1625D73j179J61J101m91j76N18o29l12J171j24p81M54j46o60R25L06j154J79M30
$$ 473 -706 -545 556 65 -111 407 -222 -534 637 513 -268 186 40 -620 305 611 -543 -364 66
1644F6n73M61O82j039j96R72l16j04P31n45o35R40M8p87N61j16r10O36N54q70
$$ 66 -507 -46 636 -403 -599 373 57 -47 684 139 -496 444 492 -295 266 150 -760 -124 430 -440
1664d40Q8M81o37K69P74o17l54Q15l42k92P28j07p43O11J55p05N03J41o83K33
$$ -440 -352 129 -508 -239 535 -82 -436 379 37 -255 473 366 -377 234 389 -316 187 328 -355 -122
1684a22M11o10N5N44n16j39N65l85k20O43j26n00O13j6m41N04J20o43L08L19n47
$$ -122 289 -321 -266 278 -238 -377 188 -197 -417 226 100 -400 213 197 -244 260 380 -263 45 364 -183
1705a83J79M08o18j20O43l41k23M91l41k89O50l8m46L12O9l56L78K43o48J27L38
$$ -183 -4 404 -214 -334 309 -32 -255 236 -105 -394 256 218 -228 84 153 -203 175 418 -230 -103 235
1726B35l56NM29l98j89M08j35k21L79j79l89M31J56k99K18K2l08K83K21l60J3
$$ 235 -121 -116 313 -85 -274 134 -1 -222 157 -22 -411 20 176 -123 95 117 -191 92 313 -47 -34
1747c4K61k99o7L87l11j88L45k18j84L53p4k63K00J45k26K27J06k50J60K13j99
$$ -34 227 -72 -139 248 -63 -251 94 -124 -308 45 -29 -292 -92 53 -173 54 160 -90 70 283 84
1768H4j05K42j76q5K46j70j64K07q9k42K01K2j77J49M7j56R9J62j61N4K17j55
$$ 84 -21 221 45 -40 206 36 -128 79 -10 -252 -51 -29 -206 -57 -10 -166 -67 95 -66 -12 205 50
1790E0p5J63j40m8J74r2l8N5j0j85P3L2n1O8O0q3QJ47j18l8N6j9J7L9o0o7J23
$$ 50 -25 138 -2 -50 124 32 -6 49 39 -146 -73 -41 -92 -24 36 -47 -39 108 -10 -48 8 -11 6 45 -15 -82 41
1817D1M2r3L4O6j15L7j2j05K0J11j00K3Kk8L3M9kO3N1k2P1j2Lp6J8m4r0l1L9j29
$$ 41 83 -10 24 90 -25 12 0 -105 -85 26 -74 -51 -49 -77 -44 5 3 66 117 95 166 154 157 81 99 55 -35 -66 -27 -156
1847a56k8P8o7M1J23m3K0R3M4k9K6J7rM8o3q8k7O7m6o3J9l5J35n4k6LM3Kj15Q
$$ -156 -184 -106 -173 -132 -9 -52 -32 61 105 76 102 119 110 158 95 7 -20 47 1 -62 -43 -78 57 3 -23 -20 23 25 -90 -82
1877h2qJ2k7J0p5K29L0r0N6P0M5Ql0j26N7L3q8j21J4Qq4j9J3K0J40L4n6P1J56
$$ -82 -90 -78 -105 -95 -170 59 89 -1 55 125 170 178 148 22 79 112 24 -97 -83 -75 -159 -178 -165 -145 -5 29 -27 44 200
1906B00k1o0k1q7P2k8j69o8J15m8j54J01O3O3J20r7k0J40J52j82n5J12q5M5q3
$$ 200 179 119 98 11 83 55 -114 -182 -67 -115 -269 -168 -105 -42 78 -19 -39 101 253 71 16 128 43 88 5
1931Er0k5J99j56j05K10M9q7J4m1m7J46m8k68J03J37q7k6P0j13J27K49j76qK14
$$ 5 -85 -110 89 -67 -172 38 87 0 14 -27 -74 72 24 -244 -141 -4 -91 -117 -47 -160 -33 216 40 32 246
1956B46k5k64J77Kj48O9j98j56J99J19k68j3K40q2Q8J83k37O3L01j78j71J93l9
$$ 246 221 -43 134 136 -12 57 -141 -297 -98 21 -247 -260 -20 -102 -14 169 -68 -5 296 118 -53 140 101
1979A01k42J33o0j38K47M2l05P3L10j96j0J55j73j1L86l46j64L53n8l34K53n1
$$ 101 -141 -8 -68 -206 41 83 -222 -149 161 -35 -45 110 -63 -74 312 -34 -198 155 97 -237 16 -35
2001c5j37K71k6k97K41K92l77m0L12k91p1K69j84j36M17k84j93M08J14l35J17
$$ -35 -172 99 73 -224 17 309 -68 -108 204 -87 -158 111 -73 -209 208 -76 -269 139 253 -82 35
2022C5P1k58L88P2m95j1M08k03o8K13l77n4M40k11j04L55j62l15L34J75k73J78
$$ 35 106 -152 236 308 -187 -198 210 7 -61 152 -225 -279 161 -50 -154 201 39 -276 58 233 -40 138
2044A38m9m40M12M06m67j22K34k65J79L34m43k82M34l1k30M10r5m28K88K25l53
$$ 138 89 -351 61 467 0 -122 112 -153 26 360 -83 -365 69 38 -192 218 123 -305 -17 208 -145
2065a45K92L9n71K18N91l92r2K17l06l2N26l42l74M64Nk79L42R8n17L01J62l69
$$ -145 147 186 -385 -167 424 32 -60 157 -149 -181 345 3 -371 93 98 -181 161 259 -258 43 205 -164
2087a64K42J97n18O8L64k20o9L34l51j40M81j39m00M17N7m20L74J24n66L29K20
$$ -164 78 275 -243 -175 189 -31 -100 234 -117 -257 224 85 -315 102 159 -261 113 237 -329 0 220
2108B20m40Q7L69l15j9M15l36r1M41k67k59M02j46l78L62P4l92K22J55m51K83
$$ 220 -220 -133 236 -79 -98 317 -19 -110 331 64 -195 207 61 -317 45 119 -273 -51 104 -347 -64
2129f4L65m04qK46k25N0M59l97l08L99j11j90L73j17m55L66K53l11J90O9m44J58
$$ -64 301 -103 -111 135 -90 -40 419 22 -286 113 2 -188 185 68 -387 -21 232 -79 111 180 -264 -106
2151a06L99k90j90L46k19j37M84j62l67K88K6l38M65K4n20K32K56l06J28K10m42
$$ -106 293 3 -187 159 -60 -197 287 125 -242 46 72 -266 199 223 -297 -65 191 -115 13 223 -219
2172b19k8M25j64j60K83j85j83M84m3k85K43j01l02L11J32l70O6J96l12J52K67
$$ -219 -247 178 14 -146 137 -48 -231 253 210 -75 168 67 -235 76 208 -162 -96 100 -212 -60 207
2193B07l94n9M09j76j98M15j98j66K58Nk75K61R2l47J43J98l01N7K29k75N9L12
$$ 207 -187 -246 163 -13 -211 204 6 -160 98 103 -172 89 181 -166 -23 175 -126 -69 160 -115 -56 256
2215B56k94j75L04j03j78K03j8k03K80M4k66J88J40k09JK26k71L6K40k98K1J66
$$ 256 -38 -213 91 -12 -190 13 -5 -208 72 116 -150 38 178 -31 -30 196 -75 -39 201 -97 -76 90
2237I0j17j00J92p2j61K56k9j13J75N4k54P3J26j99L7J80k53QJ94j31k4J24o1
$$ 90 -27 -127 65 -7 -168 88 59 -54 121 175 -79 -6 120 -79 -42 138 -115 -107 87 -44 -68 56 -5
2260ep3J13M6j60J61K5j57N4Q7j37J3J25j41j9J63q7m5J03n8J0L9Mj62R2J9j84
$$ -5 -78 35 81 -79 82 107 -50 4 91 -46 -33 92 -49 -68 95 8 -37 66 8 18 57 61 -101 -9 10 -174
2286a74R6R9j18P4J02j28K9P3j06L9J23k0j25R4k0j04O1J0o4J0J10q4MJ14m6p0
$$ -174 -78 21 -97 -23 79 -49 -20 53 -53 -14 109 89 -36 58 38 -66 -5 5 -59 -49 61 -23 -19 95 49 -21
2312b1J23r0j3Qm3k5O7o0j3N4n2q0J41M8q6J17k2p0R3J2n2n3nK7JJ2Kj12R9j4
$$ -21 102 12 -1 7 -36 -61 6 -54 -67 -13 -65 -145 -4 44 -42 75 53 -17 76 88 36 -17 -22 5 6 18 20 -92 7 -7
2342gp7N7J9nN2m5j1K3K0k0k5QK7k5J5N5p4M4%%N3p0j7L6K7q0qK6n2L5K2L0p6
$$ -7 -84 -27 -8 -13 39 -6 -17 6 26 6 -19 -11 16 -9 6 61 -13 31 31 31 84 14 -3 33 60 -20 -28 -2 -54 -19 3 33 -43
2375d3P8k7k3K8k4j7N7j0r7R3J6p4P3k8n1Q1ll1M3j8M0l5om2qM0N8j08O8l5pK3
$$ -43 35 8 -15 13 -11 -28 29 19 -78 15 31 -43 30 2 -49 32 29 -2 41 23 63 28 22 -20 -28 12 70 -38 30 -5 -12 11
2407A1Lj6o6Q4m7NK6q1K9N8K5m3K8pJ3K7n6k6M4K8j7nl4J3j6O1n7J8P0o9kM9j4
$$ 11 14 -2 -68 16 -31 -26 0 -81 -52 6 31 -12 16 9 22 49 -7 -33 11 39 22 17 -17 -4 -20 41 -16 2 72 3 1 50 36
2440C6o0Q0k7q5N2k8o2O0Q4j08R3j0m7mJ61r6k6M1n9M0J6m3r2M0N5r9J16nj32
$$ 36 -24 56 29 -56 -4 -32 -94 -34 50 -58 35 25 -22 -26 135 39 13 54 -5 35 51 8 -84 -44 11 -88 28 23 -109
2469a09L0J48j22O5L1j34O4L4jq1J13n2r0J38R7j60Q5j1n7J46n6j44L5M8m5J0
$$ -109 -79 69 -53 12 43 -91 -27 7 6 -75 38 -14 -104 34 131 -29 56 45 -12 134 78 -66 -31 17 -28 -18
2495a8P3j15j09K26j00p3J58p4o9J55Oj17J20rj26P0J11j55J1R5l6o7J05o7q9
$$ -18 55 -60 -169 57 -43 -116 42 -32 -101 54 60 -57 63 54 -72 -2 109 -46 -35 60 24 -43 62 -5 -94
2520i4J57p7r2J60M2j81J57jj69J02M2j49J28N0j34N7J29j43k7J88k06n3K10o5
$$ -94 63 -14 -106 54 96 -85 72 71 -98 4 46 -103 25 75 -59 -2 127 -16 -43 145 -61 -114 96 31
2544C1j34J40N3j60J30N3k37P5J97j73l0J94j92p2K78j28p7J64j05k14K66J12
$$ 31 -103 37 90 -70 60 113 -124 -49 148 -25 -55 139 -53 -125 153 25 -52 112 7 -207 59 171
2566A71k92J09L2j41J75J26k38o8K67j54m1K09j40j67K79r4j41K61j09j93J98
$$ 171 -121 -12 20 -121 54 180 -58 -126 141 -13 -54 155 15 -152 127 33 -108 153 44 -149 49
2587D9O5j82R7mj52J23J54k53q5K59q5n7K22j76j33K68n2k07K26rj53J29M5k01
$$ 49 114 -68 29 25 -127 -4 150 -103 -188 71 -14 -71 151 -25 -158 110 58 -149 77 68 -85 44 89 -112
2611a12R4J77k81L8K31p1j83K18j61l2K16r0k07K27L3k72J79R8k36J68N8j83N8
$$ -112 -18 159 -122 -84 147 76 -107 111 -50 -82 134 44 -163 64 97 -175 4 102 -134 34 92 -91 -33
2634c3K00j87o6J77j00o3J98j17j59K67n0k35K35mj14R4N4j75Q3J24k34O8J66
$$ -33 167 -20 -86 91 -9 -72 126 9 -150 117 67 -168 67 63 -51 43 97 -78 5 129 -105 -37 129
2657A29k02q1J80o3j02K88j75j61K69M9k52J74J7j57M5J71j37m6K11k11n5K60
$$ 129 -73 -154 26 -37 -139 149 -26 -187 82 131 -121 53 70 -87 -42 129 -8 -54 157 -54 -109 151
2679A51j72p1J84p4j38K19k4j99J31Q3r7NQ8k08J24J12j75k7J57j14m8J35j7j04
$$ 151 -21 -92 92 18 -120 99 75 -124 7 90 -7 -2 86 -122 2 114 -61 -88 69 -45 -93 42 25 -79
2703g9J25l2j03J79pj76J01J29k09J06P3j52J1J66j38q2J57r6j07J39n6k9J37
$$ -79 46 14 -89 90 83 -93 8 137 -72 34 107 -45 -34 132 -6 -88 69 -27 -134 5 -51 -80 57
2726E7Jj34J21J2j55R4R3j86Q2M9j2p0J85j48k6J49j02n1Q1j5j71J91K9r9k4P8
$$ 57 58 -76 45 57 -98 -4 89 -97 -15 34 22 -48 137 -11 -37 112 10 -41 40 25 -146 45 74 -25 -49 29
2752B9j19M6J09r2jJ01j06J2J30p3k5L2Jj23J09K1j48J00M6q1l3J06j12K6J24
$$ 29 -90 -44 65 -27 -28 73 -33 -21 109 36 11 43 44 -79 30 51 -97 3 49 -32 -65 41 -71 -45 79
2777G9j06jK0m3lJ30m4j22L3N0j01J24%r1P1R2p9J6R9j33RL8j7j0l0K3o1P9Mk4
$$ 79 -27 -28 -8 -51 -54 76 32 -90 -57 -7 -108 16 16 -75 -4 88 9 25 124 -9 0 38 21 11 -19 4 -57 22 26 2
2807BN9jm5K3J4q2L6Ol0l3P2q6JO4k8l0O2J9p6Q8%%%l6pJ0M8m1J1J2l0Lrmk0N8
$$ 2 61 60 15 38 52 -30 6 12 -18 -51 21 -65 -64 0 -28 -58 4 23 -53 35 35 35 35 -1 -8 2 50 9 20 32 2 5 -4 -8 -28 30
2843C0J1m2j9L8NJ9l3o7%pLnJ12m9m6N2L9n7J0M5j5l2L9q1L6lm0M5l1J9J9lj8
$$ 30 41 -1 -20 18 23 42 9 -58 -58 -65 -62 -67 45 -4 -50 2 41 -16 -6 39 24 -8 31 -50 -14 -17 -57 -12 -43 -24 -5 -8 -26
2876b6K3K4l8J6L7n0RK1l0j5JJ8l7n0Q0K4K4n8N1L4k3L9j1k0n2rM2n8K3M4l3N
$$ -26 -3 21 -17 -1 36 -14 -5 16 -14 -29 -28 -10 -47 -97 -17 7 31 -27 24 58 35 74 63 43 -9 -18 24 -34 -11 33 0 5
2908Ek7J0M3n5M7j7k9qJk6O8k3J5J1J1KRj9J5m3K4l6NO1q0Q1l5j9J6J7r2J4L7
$$ 5 -22 -12 31 -24 23 6 -23 -31 -30 -56 12 -11 4 15 26 28 37 18 33 -10 14 -22 -17 44 -36 45 10 -9 7 24 -68 -54 -17
2941a7J9Pk5lK7j3K3j7N6j6j16L0R6n6n4N0Pn3M7j9J0M3p9kL3j9K5K4j2k8J2N4
$$ -17 2 9 -16 -19 8 -5 18 1 57 41 -75 -45 51 -5 -59 -9 -2 -55 -8 -27 -17 26 -53 -55 -22 -41 -16 8 -4 -32 -20 34
2973C4j09R2K7n6J3On3J0M6K1n3PJ4k7M5J6m5PK6o9J10m9l0J6K7j15Q6N4n7j5
$$ 34 -75 17 44 -12 1 7 -46 -36 10 31 -22 -15 -1 -28 17 33 -12 -5 21 -48 62 13 -17 -1 26 -89 -3 51 -6 -21
3003b1J9l9MM7Pl9L2N8j37J10J8j17N1O8o5mR9j01m4J01m2o1P4J4j17J08Jr9M9
$$ -21 -2 -41 -37 10 17 -22 10 68 -69 41 59 -58 -7 61 -4 -8 91 -10 -54 47 5 -56 18 32 -85 23 24 -75 -26
3032b6J1l5N9L4p2k6J12p6l2Q4j8q4R0J4j22J29m5l5R5L7j67P3Ql6kJ08j46N3
$$ -26 -15 -50 9 43 -29 -55 57 -19 -51 33 15 -69 21 35 -87 42 -3 -38 57 94 -73 0 8 -28 -30 78 -68 -15
3060a5K4m5J3P1o9p1J57r7m4J07Jj23R7k2o4Q9P0j65M6J35j19K4O4q8l6J23o2
$$ -15 9 -36 -23 48 -21 -92 65 -32 -76 31 32 -91 6 -16 -80 9 79 -86 -40 95 -24 0 64 -24 -60 63 1
3087Al7L4Oj03J12J2j23P7M8j02M3O1p6L4J09j33oJ26q8p1J36k5j39J33j0j09
$$ 1 -36 -2 4 -99 13 25 -98 -21 27 -75 -32 29 -47 -13 96 -37 -43 83 -5 -76 60 35 -104 29 19 -90
3113i0J50lj03j0J06q8k6J56j47j2J28l4n4L5l1r1J13oo9J02L3r1M1O8j01J9Q0
$$ -90 60 57 -46 -56 50 -38 -64 92 -55 -67 61 27 -27 8 -23 -114 -1 -7 -76 26 59 -32 9 77 -24 -5 75
3140G5p5k2J07j48J5R5n9o7J38m3q9M6O4j49R1R2q6K1M9q4kJ21j07j8K6Kn4J40
$$ 75 0 -22 85 -63 -48 47 -12 -79 59 16 -73 -27 37 -112 -21 71 -15 6 55 -29 -31 90 -17 -35 -9 -7 -61 79
3168G9n4l1J2K6l9j1J51j91N6O7o1j3J16j25n6J27o5MQ4j06n1R9O0j61O1O8j61
$$ 79 25 -6 6 32 -7 -18 133 -58 -2 65 4 -9 107 -18 -74 53 -12 -8 76 -30 -81 18 78 -83 -22 46 -115
3195a15J50Lo4j7Q2n1L1O2r1l5Q2j5QK5q0p9R9Q0o8j2j7j3K6Q4j00K0M1r8M0Q0
$$ -115 35 38 -26 -43 39 -12 19 81 -10 -45 37 22 30 55 -25 -104 -5 75 7 -5 -22 -35 -9 75 -25 -5 36 -62 -22 58
3225E8n2j25J31Pp6J9O4j32J17L6o6M1lo9N2K5j9m8P5no4M0m6KP3j5j34J45Pj39
$$ 58 6 -119 12 19 -57 -38 26 -106 11 47 -19 22 19 -50 2 27 8 -40 35 30 -34 6 -40 -38 35 20 -114 31 38 -101
3255a01N5L2m3M5K4n7K3K5l5j2L1M4n8N9q0NJ18j5j20L6K1m5N6m1Jj9R5k5m9N7
$$ -101 -46 -14 -57 -12 12 -45 -22 3 -32 -44 -13 31 -27 32 -48 -43 75 60 -60 -24 -3 -48 8 -33 -32 -51 44 19 -30 27
3285B7Jo9M8K1n2L6J9o2O5K4j17N7N5r3O1R2j56N2O3j29O4Qj7QK3qk0J9%j3k0
$$ 27 28 -41 7 28 -24 12 31 -31 34 58 -59 -2 53 -40 21 113 -43 9 72 -57 7 15 -2 6 29 21 1 20 20 7 -13
3316a3Q7j00M3o0N4RMm9k2O9j9o9Q2l4LL5n6kM7rj4N1m4K7j0K2J5r8Q9l2qL0j4
$$ -13 74 -26 17 -43 11 20 24 -25 -47 22 3 -66 16 -18 -15 20 -36 -38 9 0 -14 37 -7 20 10 32 47 -51 38 6 -2 28 14
3349A4qj6L3p3K1O6n8k4P0j3k8M8n2MM9m4L4k0K1j1M1J3p5M0Jo6M8K0k9Lp7P7
$$ 14 6 -10 23 -50 -29 37 -21 -45 25 12 -16 32 -20 -16 33 -11 23 3 24 13 54 67 -8 32 33 -33 15 35 6 9 -68 9
3381Iml7K0j8O6o2J5Mj4P6q2P0n3rJ0j5N9n7RM9L4k5m8Q%j4K6j6j1l7mL5JM1r3
$$ 9 5 -32 -12 -30 36 -26 -11 -7 -21 55 -27 43 -10 -19 -9 -24 35 -22 -13 36 70 45 -3 5 5 -9 17 1 -10 -47 -51 -16 -15 26 -67
3416f7N2j4mk3Q9kj1k1oK0Npj6j4L8q1Q0k5j7L9K2q4Q0k1k8N1p5K3%L9m1lN0l5
$$ -67 -15 -29 -33 -56 33 31 20 -1 -7 13 18 11 -5 -19 19 -62 18 -7 -24 15 37 -47 33 12 -16 35 -40 -17 -17 22 -19 -22 28 -7
3450gj8J9L3k0lj7rP9m7k7M5p0PM9k1L4l4Q5q3K6l3M3p0P4j4j7j2M6o2J2J8q8
$$ -7 -25 -6 27 7 4 -13 -22 57 10 -17 28 -42 -35 14 -7 27 -7 78 -5 21 -12 31 -39 35 21 4 -8 38 -24 -12 6 -82
3482h2N2Q6l3n5jM6l9K9l2L4Ln8N7J6k6n2M4Ml3lQ5o7J6M6p5P8n2J1j5O5o2j7
$$ -82 -30 56 23 -32 -33 13 -26 3 -29 5 8 -50 7 23 -3 -55 -11 -7 -40 -43 42 -25 -9 37 -38 40 -12 -1 -16 49 -13 -30
3514c0M5J9n5J6L7o6M5k7N3p4J13p6l3MP1j05K9K3opN5m9M1l6J7L3n6l1LJ00j41
$$ -30 15 34 -21 -5 32 -34 11 -16 37 -37 76 0 -33 -29 42 -63 -34 -11 -17 -24 31 -18 23 -13 4 37 -19 -50 -47 53 -88
3545h8P0J1k2lR4o3l7J11m6o3k1L7j4kO5n8K7%j2j3O4q0M1K1o8L4J0L8l6M4jl7
$$ -88 -18 -7 -29 -32 62 -1 -38 73 27 -36 -57 -20 -34 -36 29 -29 -2 -2 -14 -27 37 -43 -2 19 -49 -15 -5 33 -3 41 40 3
3577CkJ6l5j6Q8j00K0P6m2QPl3k7Q6n4m1N1p1K8JJ00k5m8K5j08J00N3k6m8mjJ
$$ 3 1 17 -18 -34 54 -46 -26 50 8 16 23 -10 -37 49 -5 -46 5 -66 -38 -37 63 38 -10 15 -93 7 60 34 -14 -18 -19 -18
3609a8L1j8o8J19o3JL9l3k8L8L7l9oO5j00j1J18j08L0M3p1k1J12l5q5N9Nl1M4
$$ -18 13 -5 -73 46 -17 -16 23 -10 -38 0 37 -2 -8 57 -43 -54 64 -44 -14 29 -42 -63 49 14 -71 -12 -7 -38 6
3638Fk3k0M1O8j12P9Po2LJ29j27j7qN1p0P8j2r9J05j4m6N8L9j07L1L8k1nP9n4
$$ 6 -17 -37 4 72 -40 39 46 -16 -13 116 -11 -28 -36 15 -55 23 11 -88 17 3 -43 15 54 -53 -22 16 -5 -10 69 15
3668A5k2O1n6o2R8K1r2J49q6j75J34M3n1OP4j23J3J19p3n1J10l5q3J36l2n8M8
$$ 15 -7 54 -2 -64 34 55 -37 112 26 -149 -15 28 -23 -17 57 -66 -53 66 -7 -58 52 17 -66 70 38 -20 28
3695B8l4k8M7L3j12N2J13j34K1O2q9rQ2j1m1K6m8PP4po2N3K3l4J6K6j08QN1l0
$$ 28 -6 -34 13 46 -66 -14 99 -35 -14 48 -41 -50 32 21 -20 6 -42 -35 39 32 -30 23 46 12 28 54 -54 -46 5 -25
3725b5J4L9o0ML2l6J8N0n2j0M4j3po4MN6O1k1p7N5K5j06N2M4n1%J3J1o9J13l0
$$ -25 -11 28 -32 -28 4 -32 -14 36 -16 -26 18 5 -2 -66 -62 -6 55 34 -43 12 37 -69 -17 27 -24 -24 -11 0 -69 44 14
3756A4o4N3P1o8k2j1RK2M3q2M0j6Mj6K0K1l1L0j6m4Nk3J2O9j18O7O5L0n7n0oP
$$ 14 -50 3 74 6 -16 -27 -18 4 47 -35 5 -11 -7 -23 -3 18 -13 17 1 -43 -38 -61 -49 20 -98 -31 34 64 7 -43 -49 -42
3788d2K1K4L4qo8K1Pj8L8n2L5j4J5JK0k7K2O7j11N6J8n8k0J5J5L0l3J1l9M8Qj8
$$ -42 -21 3 37 29 -39 -18 -11 -29 9 -43 -8 -22 -7 -6 14 -13 9 76 -35 21 39 -19 -39 -24 -9 21 -12 -1 -40 8 16 -2
3820bK2k1n4O2M9m6j9kMk0J6N3m1qRJ2lk1l5M7K1m7J6j0Lm0L8j3M4J0k8mJ2k9
$$ -2 20 -1 -55 7 56 10 -9 -11 -7 -27 -11 42 1 -7 2 14 11 -10 -45 2 23 -24 -8 -18 -15 -55 -17 -30 14 24 -4 -8 4 -25
3854b5N8Qn0KpJN9l2L5n6k6L7L7n5kJ4m3O5qn7N7l0jL3l3l3O2k2k7N7j0k3N4o8
$$ -25 33 41 -9 -7 -14 -13 46 14 49 -7 -33 4 41 -14 -16 -2 -45 20 12 -45 12 -18 -19 14 -19 -52 10 -12 -39 18 8 -15 39 -29
3888b9N6Rj9j1j8N1j9OqJm9j2L0L2k4kK7p5L9j6N7J4m5J7OL3q5m2O6L0K6l4n2
$$ -29 27 36 17 6 -12 39 20 26 18 19 -30 -42 -12 20 -4 -6 21 -54 -15 -31 26 40 -5 12 18 51 -34 -76 -10 20 46 12 -40
3921d0K0M3m4K5l9M1k4N8m8L8k9J2n0M7%K6k7j5l0O8n9L3L2m1J4m0M1K2q0K6j7
$$ -40 -20 23 -21 4 -35 6 -18 40 -8 30 1 13 -37 10 10 36 9 -6 -36 32 -27 6 38 -3 11 -29 12 34 -46 -20 -37
3952c7P6orl6NoL6L6p3lL3O0p7Lm1N6j6P2o1m5K8KpkJ9l0O5k3m8Q1k2o0O4m0J8
$$ -37 39 33 24 -12 -7 -13 23 59 -14 -17 16 76 -1 2 -39 17 1 73 12 -33 -5 -3 -10 -12 7 -23 42 19 -29 52 30 -30 34 -6 12
3987A2J4rj2k8M3l9NrRRL9n6M3m4m%j0M6j2l3J6L4k1L6rMn6KN9M4q1RJ7k7j4q
$$ 12 26 17 5 -23 20 -19 -14 -23 -14 -5 34 -22 21 -23 -27 -27 -37 9 -3 -36 -20 14 -7 29 20 24 -32 -30 29 73 -8 1 18 -9 -23 -31
4023c1JJ8L2%Jl8O3o3M0j7Kl9R2o6%J3No0R3k8n5N3M4n3o4Q8k3o1P3k6l0K6l1
$$ -31 -30 -12 20 20 21 -17 46 -17 23 6 8 -31 61 -5 -5 8 13 -47 46 18 -37 16 60 7 -57 31 8 -53 20 -6 -36 -10 -41
4056d1J7PK0L2m4LqJj8L4j6J2J5n1L3k1rM9m9K9k6L3K6k8N3r1N6Km9N9Pk3K9L
$$ -41 -24 -17 3 35 -9 -6 -14 -13 -31 3 -13 -1 14 -37 -4 -25 -34 15 -34 -5 -31 2 28 0 53 -38 18 20 -29 30 37 14 43 46
4090D6j3m3Mk7j1K9pl1N4O1n5K6k2k6K4k8m7N7Q6Rj07O2o1nRJ3k8M3m4L0P8n6
$$ 46 33 -10 -6 -33 -44 -15 -22 -53 1 62 7 33 11 -15 9 -19 -66 -9 77 86 -21 41 -20 -25 -16 -3 -31 12 -32 -2 76 20
4122B0o5P4k1k8K2j5Mk4R2o2j0K0j0k7L8rLL0p8K0k4R3k3m3J8rJ5K8o3RN0l4m9
$$ 20 -45 29 8 -20 2 -13 -9 -33 59 -3 -13 7 -3 -30 8 -1 2 32 -46 -26 -50 43 20 -23 -5 -14 1 29 -34 -25 25 -9 -58
4155e8K4N1l4L8m8M4j6Rm1k7P7k0K3K9r0N3J0k3NL1jj09J07k0m1N1K1j06O3L6
$$ -58 -34 17 -17 21 -27 17 1 10 -31 -58 19 -1 22 51 -39 14 24 1 6 37 36 -73 34 14 -27 24 45 -61 2 38
4185C8j01M5Q8j29L4O6m7kL4r7K9PM3l2J7j5L5J2L4o1J9Nk4N0m3J6m5M0m1%M4
$$ 38 -63 -18 70 -59 -25 41 -6 -8 26 -71 -42 -35 8 -24 -7 -22 13 25 59 -2 17 22 -2 48 5 21 -24 16 -25 -25 19
4216A9m%LJ6nqlmm0J7j2Rjl9N3Ol2J1R4q2J6J5Ok8K5j6q0Q3mk2n1%K8M7k2l0L5
$$ 19 15 15 18 34 29 21 18 14 -26 -9 -21 -12 -13 -52 1 7 -25 -14 80 -2 14 29 35 7 32 16 -64 19 15 -7 -58 -58 -30 17 -5 -35 0
4253@L6m6L3Ml0PNn1K0M0qj8k0M9J0Qk4k1m1O1l8k3K9j0J6L4kj3k3j4pJ7J9J1
$$ 0 36 -10 23 27 -3 4 9 -42 -22 18 10 -8 -28 21 31 39 15 -6 -47 14 -24 -47 -18 -28 -12 22 20 7 -16 -30 -37 -20 -1 10
4287A0k3J7j9l6R4n0K3k5k0JL9RK8r2M6K2j2j3rj6K2j0O3j2m3ml3K8J1k8M7l4
$$ 10 -13 4 -15 -51 43 -7 16 -9 -29 -28 11 20 48 -44 2 24 12 -1 -10 -26 -4 -14 49 37 -6 -10 -43 -15 -4 -32 15 -19
4319a9Lmj7N2plk3M6k6q8J11k6J7l2l1K1Q8r8QL0L8l1L4l7Qm6M1MK1ol8rqM0R
$$ -19 -16 -20 -37 15 8 5 -18 28 2 -86 25 -1 16 -16 -47 -26 62 -36 -28 2 40 9 43 6 14 -32 9 13 34 28 -10 -19 -27 13 22
4354B2n0J7J5Jlk0N2q2K3k0M8l6M1J6k3K8m1M3k4Nj8J8qM6r0N6r1P9m5M7kl3Q
$$ 22 -28 -11 4 5 2 -18 34 -48 -25 -45 3 -33 8 24 1 29 -12 31 7 12 -6 12 4 50 -40 16 -75 4 -41 6 4 -29 -21
4387b1J6K2k4k4J6%K1KL0m2J4K7m1m7R2p9J5N1q0M2N5o6rl1P4l0K1J2l0m4RK6
$$ -21 -5 17 -7 -31 -15 -15 6 8 38 -4 10 37 -4 -51 41 -38 -23 28 -52 -10 45 -21 -30 -61 13 -17 4 16 -14 -58 -49 -23
4419b3N9J0lk4m7LNM8o1kL1J5o8N0k8PJ9J0j6K1n5O0Ql5OQK8l6%Pj1OK7%J1m5
$$ -23 36 46 43 19 -28 -25 -20 28 -33 -35 -4 11 -57 -7 -35 -28 -9 1 -15 6 -49 11 19 -16 -10 -2 26 -10 -10 -3 -14 -8 19 19 30 -15
4455a5MJM5m0K1j1Rj7Rqk4J1K1mk8N2L4n0M1o8QN9m1J2j3j3J5j7l9jR7m2K0m0
$$ -15 -11 -10 35 -5 16 5 14 -3 6 -2 -26 -15 6 2 -26 26 60 10 51 -17 -9 50 9 21 8 -5 10 -7 -46 -47 50 8 28 -12
4489a2j1M3mk5OL4p3P2m5j7M0MN1q2qJ8n3L6j4N0l1QN3Q%q0Q4m4m4P9p1j1J4n4
$$ -12 -23 20 16 -9 -3 31 -42 30 -15 -32 8 12 63 -19 -27 -9 -62 -26 -40 10 -21 -13 40 48 48 -32 52 8 -36 43 -28 -39 -25 -79
4523g9N6J4J9j9j8KOM2Oj9K9k3l9K1Qj3j1K4K9q0J5J5K2j7l2J4PM3j3Mm5RM3J7
$$ -79 -23 -9 10 -9 -27 -25 -19 23 29 10 39 16 -23 -2 6 -7 -18 6 35 -45 -30 -15 7 -10 -42 -28 -21 22 9 13 -32 -23 20 37
4557C7pm4Q5n2n5K2J5MpOl8J9K9NK3m5k7K4L1o6P7o3J6l9O5K5r8J08r5NQ3o3K1
$$ 37 30 -14 71 19 -36 -14 1 5 -2 4 -34 -15 14 19 42 -3 -30 -6 25 -41 36 -27 -11 -50 15 40 -58 50 -45 -40 43 -20 1
4590Am8J5J1oJ7l2j3J06p4J6K6m2l3N6Nj2J5QPJ4m1j0L1Nm4J3j5L4m7N4Kl9N6
$$ 1 -47 -32 -21 -27 -10 -42 -55 51 -23 -7 19 -23 -56 0 5 -7 8 16 23 37 -4 -14 17 22 -22 -9 -24 10 -37 17 19 -20 36
4623C6n2J4J9J2o5N7Jo0N8l1n3N9J5m4MR0j2pl6Mql1K2J5N3k8m6kJ3l7K5J8K1
$$ 36 -16 -2 17 29 -36 21 22 -38 20 -11 -64 -5 10 -34 -30 60 48 41 5 9 1 -30 -8 7 60 32 -14 -16 -3 -40 -15 3 24
4656B4p3Q6k1M4l5m5oP3o4rN6j3m0j0O8k5J2Nm6J2L1q6N7J6mn0P2n4K6M2j0jk0
$$ 24 -49 37 16 60 25 -20 -26 47 -17 -26 30 17 -23 -33 35 10 22 27 -19 -7 24 -62 -5 11 7 -43 29 -25 1 43 33 32 12
4689A2Oo1J02n4m8j4J03q0L9L5j23O5pl6P4k2L5k7L9%m4Mj8l1Q2m2lK4Kk9K8K8
$$ 12 18 -43 59 5 -43 -57 46 -34 5 40 -83 -18 -25 -61 13 -9 26 -1 38 38 -6 -2 -20 -51 31 -11 -14 10 12 -17 11 39
4721C9o0K1kM2q9R2p2QJ2m3O7p1O2pM6k4n0M7%k1k7L9m2l4O7kLj2k5J7N4l5Ok5
$$ 39 -21 0 -2 40 -49 43 -29 -21 -9 -52 15 -56 6 -1 45 21 -29 18 18 -3 -30 9 -33 -67 0 -2 1 -11 -36 -19 35 0 6 -19
4755a9K8M4m4L9j09KJ12j0o1L5o2L1Q1q3m3N7j5k8P5Ql0k4%J1moRj2N1n1K2m2
$$ -19 9 53 9 48 -61 -59 53 43 -18 17 -45 -14 67 -16 -59 -2 -17 -45 30 38 8 -16 -16 -5 -9 -15 -6 -18 33 -18 4 -38
4787c8K6m0O9l8K6N6o5p7O7MJK5K0m3k4O7j4p2N5j4Mk2J0oJ6L7m1m4L1L1p5R9
$$ -38 -12 -52 17 -21 5 61 -4 -81 -14 -10 -9 16 36 -7 -31 36 22 -50 5 -9 -5 -27 -17 -23 -7 30 -11 -55 -24 7 -68 31
4819C1m1mjJ8n0O3qQM2o2j5J9m5N2K1j7j9n6L2Q9p0K3ll7J00k6l6l9Rj8N4Ll0
$$ 31 -10 -14 -15 3 -47 16 8 16 58 -4 -19 0 -45 7 28 11 -8 -64 -32 57 -13 10 7 -30 70 44 8 -31 -22 -40 14 17 -13
4852a3jj8J3pQ6q7j5M5j5l1N9o0M6K5k1k2QP8q8J6K1J3J3n3jJL6k8k7L7JKQM0
$$ -13 -14 -32 -19 -26 60 -27 -42 3 -12 -43 16 -44 2 27 6 -16 -8 70 -18 -2 19 32 45 -8 -9 -8 28 0 -27 10 11 13 21 61
4886F1q7L1O4p0K1n9k1N2L4m8J8M9o7nQ2q6L1Qm1k3L7j3j6M1j2JJK0L3n8P5j7
$$ 61 -26 5 69 -1 20 -39 -60 -8 26 -22 -4 45 -22 -27 55 -31 0 8 -33 -56 -19 -32 -48 -7 -19 -18 -17 3 36 -22 53 36
4918C6K6n6m0O8n8nj5K4Nn8J62j21L1%j3M4l0J7n6K2K8j2J5m8K2RK0n7P5J2k9
$$ 36 62 6 -34 34 -24 -29 -44 -20 -15 -73 89 -32 -1 -1 -14 30 0 17 -39 -17 11 -1 14 -34 -12 -3 17 -40 35 47 18
4949A8kJ5j1k0mL3j7rOo6M7J1nJ8k1N5n6J5NK3l5L0n9l0J12m8k7PK6onLJ0J6m
$$ 18 16 31 20 0 -4 29 12 3 9 -57 -10 1 -4 14 -7 48 -8 7 12 35 0 30 -29 -59 53 5 -22 -15 11 5 0 3 13 29 25
4984B5l1M2m2j8K7J3k0K8q4K5%K2OpNL2n3O0m6j0M0n7J7J2j7NL9k7K0L6j5l7J7
$$ 25 -6 36 -6 -24 3 16 -4 24 -60 -35 -35 -13 -7 -14 -9 23 -30 30 -16 -26 14 -43 -26 -14 -31 -26 13 -14 6 42 27 -10 7
5017Gj0M1p6LL4jl7K5K9j9Pk1rN3q7P1npL6j5j9N9r8L2JM0r2j4R3%l5j0k0P6P
$$ 7 -3 38 -38 -35 -1 -2 -39 -14 15 -4 3 -18 -27 26 -61 10 5 -2 34 19 0 59 -39 -7 -6 34 -58 -72 21 21 -14 -24 -44 32 39
5052C9no2L7L4k7o1R4j6m2pj5KR2l6m3jRKK9rk1l0K6k0L7M2p9k1J03m5l1Q1n0
$$ 39 34 -28 9 43 16 -45 49 33 -9 -16 -31 -29 63 27 -16 -17 -8 -6 23 14 -7 -37 -11 -31 6 48 -31 -52 51 6 -25 56 6
5085Fq4Q9qQlj2N0n4L4m8M4k1pK5Rp2J7J2J2j4O0m6QM1q0N8n8J00r8N2k3J3p7
$$ 6 -78 11 3 11 8 -4 46 -8 26 -22 22 1 -6 19 28 -44 -27 -15 -3 -17 43 -3 5 46 -34 24 -34 66 -32 20 -3 10 -67
5118f7J21l5OJ7o1ljL7n4L3j2J0K7jm2N4Nr4J01j3r6P8K7q6M7%mj4R6j15MJ6l
$$ -67 54 19 25 42 -19 -22 -23 14 -40 -7 -19 -9 18 17 -25 29 34 -60 41 28 -68 10 37 -49 -2 -2 -6 -20 76 -39 -35 -19 -22
5151b2o2Q6J7m3QQq0Q3O6j43N1L3jnL4r0M2O2L1j30P5m5K2K6J0p4O8k7k1O3j0
$$ -22 -84 2 19 -24 -16 -8 -88 -5 61 -82 -31 2 1 -4 30 -60 -18 44 75 -55 20 -25 -3 23 33 -41 27 0 -21 42 32
5182C2m6J1J7m7LO8k0o4M4Jm4Q9p5qN3%J9j8j2k5JP9l3Jko4K7O6j5q0O2M2j20
$$ 32 -14 -3 14 -33 -30 38 18 -46 -2 -1 -45 44 -31 -39 14 14 33 15 3 -22 -21 58 25 26 24 -40 -13 53 38 -42 20 62 -58
5215e8P0L0n5O1o6l2K8L9l1k0J4j4n6P3J6l5O0rm2lM9q8M9K4M1k9M8j04K2O6o9
$$ -58 12 42 -13 48 -18 -50 -22 17 -14 -34 -20 -34 -90 -17 -1 -36 24 15 -27 -30 19 -69 -20 4 45 16 64 -40 -18 48 -21
5246b1rL3roK9K2j1l9rJ1O0n0K8k3L8j04K2M5k2K3N8q7l4Q8l3q4J26l8nL8m5p2
$$ -21 -30 3 -6 -12 17 39 28 -11 -20 -9 51 1 29 6 44 -60 -38 7 -15 8 66 -21 -55 33 0 -84 42 4 -1 37 -8 -80
5278h0N5L8m1K9k4K9nL6m9J1K1L7n3K8n8L6k3L6k4K8l1n5Q9m4QPJ7k4L1ln2o0
$$ -80 -25 13 -28 1 -23 6 1 37 -12 -1 20 57 4 32 -26 10 -13 23 -1 27 -4 -59 30 -14 -6 1 18 -6 25 22 -30 -90
5310i0R4j0RM2j5j8k9kM8n6P1mp0N2j8j0Ok9J8l8N4l4P6n0j8K4O1l0mm1j0k4P9
$$ -90 4 -6 3 45 30 12 -17 -19 29 -27 44 40 -30 22 4 -6 0 -29 -11 -49 5 -29 47 -3 -21 3 64 34 30 -11 -21 -45 34
5343C4p7J3M4l0K4J2Po0j8P2p5O5l8j2M1K1k1j1J2Rn4M7k8kP4l8k0K6kk0MJ8n0
$$ 34 -43 -30 14 -16 8 20 27 -33 -51 21 -54 11 -27 -39 2 23 2 -9 3 12 -42 5 -23 -25 49 11 -9 17 15 -5 -1 17 -33
5376c3N9m1pOj9K6J4rj6P0m9N5o4jkJ4K5j2l6O0k7n8N3K2m8jM8j7l0M0Kl1Ln4
$$ -33 26 -15 -22 -16 -35 -9 5 -4 -20 50 1 56 -8 -9 -11 3 28 16 -20 40 13 -45 8 30 -18 -19 29 12 -18 22 24 -7 -4 -58
5410e8K3L9pl5K6O2j02K7M2j4j5J1K9l3J2J7o0N7J2o0J1L3k3K2J1jK1m2m4K0k2
$$ -58 -35 4 -3 -38 -12 50 -52 -25 17 3 -12 -1 28 -5 7 24 -36 21 33 -27 -16 17 -6 16 27 26 47 5 -39 -19 -41
5441d1P2k4j4L0k3J9qm7NK3K4l3P7m4l1L8k8K8n4k0O7k7o7P7J9j3nj7J0Rj7M6
$$ -41 31 7 -7 23 0 19 11 -36 -31 -8 16 -17 60 16 -15 23 -5 23 -31 -51 16 -11 -78 -1 18 5 0 -17 -7 2 -15 31
5473C1n2M2l1mqP2q1jN5j7k4J7k4l2N4J9k8J2K6j9K0J8pn4L2l3PLlK8j8On7L3
$$ 31 -21 21 -10 -14 -22 50 -31 -32 23 6 -18 -1 -25 -57 -3 16 -12 0 26 7 27 45 38 -16 16 -17 -10 -7 -10 18 0 6 -51 -18
5507a8p1O0%K2O9p2L1j7J2k0k9MO7k3m0M6J7l3Qk1jK3j7QK5o2M8k4L8o2O5k0R
$$ -18 -89 -29 -29 -7 62 -10 21 4 16 -4 -33 -29 38 15 -25 21 38 5 13 -8 -9 14 -3 5 30 -32 16 -8 30 -32 33 13 22
5540B2m6M8m3K3j3ml0L3n4O7l8N8m2L8l5NK1n1L2n3O8j0MN1o8P0k8j1n2l4R9q1
$$ 22 -24 24 -19 4 -9 -13 -43 -10 -64 3 -35 23 -19 19 -16 -11 10 -41 -9 -62 6 -4 0 51 -17 53 25 14 -38 -72 27 -54
5572e4L3L8n4pN8k7K8J4%l1M4%m5k2M0J3n7O8pqk0J4M0r8L9j1%%j6P0o4M1l0J5
$$ -54 -21 17 -37 -44 14 -13 15 29 29 -2 42 42 -3 -25 15 28 -29 39 32 24 4 18 58 -40 -1 -12 -12 -12 -28 42 -22 19 -11 4
5606DlJ2Mn2Q7m5o0J13k0jm5K4l8M5M0l0J1k4q7N6K9Qn1L5Pqj1L0n3O2l5M2p0
$$ 4 1 13 17 -35 52 7 -53 60 40 39 -6 18 -20 25 65 35 46 22 -65 -9 20 28 -23 12 19 11 0 30 -23 39 4 46 -24
5639b4L2NJ0j2Mjrj8k2M4j2j6N8o1m0Q8l8l6Q8k8K0k5k3LrO2k9j6L2k6l1N6k2
$$ -24 8 13 23 11 15 14 5 -13 -35 9 -3 -19 39 -22 -62 26 -12 -48 40 12 32 7 -16 -13 -22 40 11 -5 27 1 -30 26 4
5672Dj7O2l6m1M0R2j13O1n5K7l2J9m0k7N9Qm9Q4l1l1M3l5k1MM1oKO2o4lJ1j8j2
$$ 4 -13 49 13 -28 12 104 -9 52 -3 24 -8 11 -29 -56 3 11 -38 46 15 -16 27 -8 -29 -25 16 10 12 74 10 7 18 0 -12
5705a2M7m4KM3m5mN0j6oqrk3%J8m0M1J4n4N9Lm5rR1j4k9l9K7J6P9r6j5N7o6L0
$$ -12 35 -9 -7 36 -9 -13 37 21 15 7 -2 -25 -25 -7 -47 -6 8 -46 13 16 -29 -38 53 39 10 -29 -2 14 93 -3 -18 39 -27 3
5739CKL5p3JN7n3oN2Ln3Q7o0N8l1m7n4R2K4p2lP1n7N1Ql1J4J1J0o7P5k6n7L8K8
$$ 3 5 40 -33 -32 25 -28 -34 18 21 -32 55 -5 53 22 -25 -79 13 37 -35 -38 33 -24 27 35 4 18 29 39 -28 47 21 -36 2 30
5773C0n5O5m0j1K5j2k3K1Ko0L7j5pK0N2l3p5Q3Rqk6%k5P3k5K5QJ4o3L0j0KPj3
$$ 30 -25 40 0 -11 14 2 -21 0 2 -58 -21 -36 -43 -23 29 -4 -79 4 13 5 -21 -21 -46 27 2 27 35 49 -14 16 6 8 15 2
5807BM0p2Q5j06J7K6j6K1K7k0k7QJ8j9K4J6k0L8nm4M9N0q0KO8m1n2K7j6k8M6J7
$$ 2 42 -30 55 -51 -34 -8 -24 -3 24 4 -23 -15 3 -16 8 24 4 42 37 -7 42 92 12 14 82 41 -11 16 0 -28 18 35
5839C5n1M0M6j20NN7mMj7N7n0L3m9m5L3K0Ok3M5n6Q4p2K6J7k8k8N6J4p2J8L6l4
$$ 35 -16 24 70 -50 -45 12 8 12 -5 52 2 35 -14 -59 -26 -6 0 -23 22 -34 50 -22 4 21 -7 -35 21 35 -37 -19 17 -17
5871a7lJ9K9k6M5m3m1mJ3j4O3k5K5O6j23L8J6n6m3N4M0P8q7j7pJ6K2k0m4P2k2
$$ -17 -20 -1 28 2 47 4 -37 -41 -28 -42 21 -4 21 87 -36 2 18 -38 -81 -27 13 91 4 -13 -20 -4 18 -2 -46 26 4
5902Dm9j0N3LJ0K6l8nO4r0N7mMk4K6k5m0K8l5P1n7R7k1m5k8P1n0QM1n5K5j0K6
$$ 4 -45 -55 -2 1 11 37 -1 -6 58 -32 25 21 25 1 27 2 -38 -10 -45 26 -31 66 45 0 -28 43 -7 1 42 -13 12 2 28
5935B8l3j2m4J08p8pnM0K4o2L2k1kJ4jJ2N8l6n4N0k3K3n2O6n5nK6k9K7Kl4N3J7
$$ 28 -5 -17 -61 47 -31 -38 -43 -3 21 -41 -9 -30 -32 -18 -19 -7 51 15 -39 11 -12 11 -41 25 -30 -35 -9 -38 -11 -9 -43 10 27
5968B7j1jK0rj7K3m3M1o1M4m8N7jn9J8mj5L5j6jM7pl6N0Mj4lnK7l2qm9N7k5j2
$$ 27 16 15 35 26 9 32 -11 30 -31 13 -35 22 21 -38 -20 -24 -39 -4 -20 -21 26 19 -17 33 37 23 20 15 42 10 2 -47 10 -15 -27
6003b7j2O8m0L1m1j2m0J20k6l9J8mk9O0pn6O2l2j2k0Q8j0l8ok5j4qJ3K8n2L9k1
$$ -27 -39 29 -11 20 -21 -33 -73 47 21 -18 0 -4 -33 27 20 -36 26 -6 -18 -38 50 40 2 -4 -29 -43 -51 -38 -10 -62 -23 -44
6035d4O4Ro6M3KM1o1K2L0l0Ol0J7Rk5J6l3L1J0Lm2O7p8N5l9KM9j8J3o8J02q7j1
$$ -44 20 29 -37 6 8 49 -12 10 40 10 16 -14 3 12 -13 3 -30 1 11 14 -28 39 -39 16 -23 -21 28 10 23 -45 57 -30 -41
6068d1K6n2N7J6l9O9o2L1l2L4K6o6O4k3N7o1N1n5J5Nk6o0O8JJnk4N8k9j4K4kk4
$$ -41 -15 -67 -10 6 -33 36 -26 5 -27 7 33 -33 31 8 65 4 55 0 15 20 -6 -66 2 3 4 -1 -25 33 4 -10 14 12 -12
6101a2M7q4J1J2M9J4o7J1J6Kl3M5k0k7N8L2qo6K8oJ0j1j6%ln5L8O0r0P9m7L8m1
$$ -12 35 -49 -38 -26 23 37 -30 -19 -3 -1 -34 11 -9 -36 22 54 46 -20 8 2 12 1 -15 -15 -18 -73 -35 25 -65 14 -33 5 -36
6134c6K3m1O3M2m9m8O8rj5j1j9N1m0P3j4o2M7m4K8k1lJ2J8J4m9MM5m4ON6l7K9
$$ -36 -13 -54 9 51 2 -46 22 13 -2 -13 -32 19 -21 52 38 -24 23 -21 7 -14 -17 -5 13 27 -22 -18 27 -17 -11 45 8 37
6166C7kp8j6R9r1Q9n5Qo0Q7j0QQJ6o9J0L0m6M6J1n3L0J1J3K0pl4n1O3n9j7O4J6
$$ 37 35 -43 -59 40 -51 38 -17 -9 -69 18 8 16 24 40 -29 -19 11 -35 11 22 -31 -1 10 23 43 36 2 -49 14 -45 -62 2 18
6199A8m8P3m2J9pJ2o9M7k8M6m1N8m5l4P5rl4j0L1l4J2J2m3L1K7q8NL8lj6N8qK7
$$ 18 -30 43 1 20 13 25 -44 3 -25 21 -20 38 -7 -41 34 25 -9 -19 12 -22 -10 2 -41 -10 17 -71 -66 -28 -31 -47 11 3 30
6232C0L6p8pJ9Oj2K6Kp7M7k9pN7J2j04L4P0m2L2k2j1J0JJ4k1rK2j0%O3p5J8J2
$$ 30 66 -12 -19 0 6 -6 20 22 -55 -8 -37 -44 13 25 -79 -45 25 -17 15 -7 -18 -8 -7 7 -14 -23 -1 -11 -11 52 -23 -5 7
6265Go3M3j9O1Mmn0M4J2j9m6O7j5o0J04n6k2k7Q1m3l4M1m5L4j5pmN2qo2P4J3o6
$$ 7 -56 -13 -32 29 33 29 -21 23 35 16 -30 37 22 -38 66 10 -12 -39 42 -1 -35 6 -39 -5 -20 -27 -31 21 13 -49 25 38 -28
6298b8K5j5Kj2M3l2j7jL5k9K2l3K5M3l3J2J4k1m0K6j6Q3p8O6j3RK5r1K0K1RJ2
$$ -28 -3 -18 -16 -28 15 -17 -34 -35 0 -29 -7 -40 -15 28 -5 7 21 0 -40 -14 -30 53 -25 41 28 37 62 -29 -9 12 21 33
6330C3k5j7qjj0N0j5j8N1q5L7P4o7m4L4K9k2J7mr0P1o1Q8l1J9mN6r3M5j9rP2p2
$$ 33 8 -9 -17 -18 -28 22 7 -11 40 -45 -8 66 -1 -45 -11 18 -4 13 9 -81 -10 -71 17 -14 5 1 57 -36 9 -10 -19 53 -19
6363a9M2J7k8k6Jl3M6k2m9P7J7np3M9K6ll2K4oJ1j6n8Q2j0L5n2n2N0J6j9L9Pm1
$$ -19 23 40 12 -14 -13 -46 0 -22 -71 6 23 18 -55 -6 20 17 -15 9 3 14 -2 -60 22 12 47 -5 -57 -7 9 -10 29 36 -5
6396eN8po1k7M8J3Km6l9J8N2L3j7l9nlK6L3o6K0mpJ2J8K4Rk9l5MO1m1jO0k3q9
$$ -5 53 46 -15 -42 6 19 21 -25 -64 -46 6 39 22 -17 -22 -25 1 34 -32 -12 -16 -23 -11 7 31 40 11 -24 -20 41 0 -1 59 36 -53
6431e3R1m3Mj5k1O0pjn0j4K9L9q1Q4l3J2l9O0j4m7M8j5qP4p0K6k9N6J6m1k6jJ6
$$ -53 38 -5 -1 -16 -37 23 16 15 -35 -49 -20 19 -62 22 -11 1 -38 22 8 -39 9 -6 -14 60 -10 16 -13 43 59 18 -8 -9 7
6464GJ9k7M0m0qJ5mNoK5m1J3mPm0J02m4qk2M3qm7N0m8L2J9m4J0J0k5pN5k4Nm9
$$ 7 26 -1 39 -1 -9 6 2 7 1 26 -15 -2 -6 1 -39 63 19 11 -11 32 24 -23 27 -21 11 30 -14 -4 6 -19 -26 29 5 10 -39
6499c9J6M7M2k1p7J7m7J01l9l6J6n0M2K2K0m4j0K1PK6Ok0nJ5%l2jM8p3K5O4m3
$$ -39 -23 24 66 45 -32 -15 -62 39 0 -36 -20 -70 -28 -6 14 -30 -40 -19 -12 14 20 0 -5 10 10 -22 -23 25 -48 -23 41 -2
6531brk9L6n3Q4p9O6ql9K3k9K5%J3lN1l8J6L5r7L5K9j4kJm9N8KL7n8n5M6o2J02
$$ -2 -11 -40 -4 -57 27 -52 14 6 -33 -10 -39 -14 -14 -1 -4 47 9 25 60 -37 -2 27 13 11 12 -37 21 23 60 2 -53 -7 -69 33
6565C3n9J1K0J1m6QO5p0M6n2Q2Ko9JL3M6m1Pqq8N2O3o3k1N5k4k0j3N6K8qmr2P7
$$ 33 -26 -15 5 16 -30 -22 43 -27 19 -33 49 51 -18 -17 16 62 21 28 20 -68 -16 47 -16 -37 18 -6 -26 -39 17 45 37 33 -59 18
6599A8Rk0J2n4J0L6Mj5k1L3m5J9%m0L1L8j8k3Q4o6J4k3PJ7Jl4J7N6m5K0J4j05
$$ 18 27 7 19 -35 -25 11 15 0 -21 12 -33 -14 -14 -54 -23 15 -3 -26 58 -8 6 -17 -10 7 8 -26 -9 47 2 22 36 -69
6631f9O1l0J5j9l5N7Jm0J02j2l2j2OJ0n8Q7n7oK9j8L7L2q9RJ8L7k3l0j3l7Q4J1
$$ -69 -8 -38 -23 -42 -77 -20 -19 -59 43 31 -1 -13 -7 3 -55 32 -25 -31 -2 -20 17 49 -40 -31 -13 24 1 -29 -42 -79 5 16
6663A6o9L6L0k8O6o0J0QM9n3j7L3J3k4Ko7M6M0m4J4k3Kj4K4K0l6M7n3lK3j3K1
$$ 16 -53 -17 13 -15 51 -9 1 9 58 5 -12 21 34 10 12 -55 -9 31 -13 1 -22 -20 -34 -10 10 -26 21 -32 -35 -12 -25 -4
6695dJlL3l6k9OK5L0j0o7L5L9Nk2J7o8O6k4l8M8L1n7M2l4N8k1jJ3o0K0Nk7l1M1
$$ -4 -3 -6 27 -9 -38 -32 -7 23 13 -54 -19 20 25 3 20 -48 18 -6 -44 4 35 -22 20 -14 44 23 22 35 -25 -5 0 -27 -58 -17
6729a7rLL8l7pN6l5o4N2M2pl6P2o0N9J6j16M2J5Lk5K8k6l8Q7o6M1j4m2P1j7mm0
$$ -17 -26 -23 15 -22 -29 27 -8 -72 -20 22 15 -21 51 -9 50 66 -50 -8 7 10 -15 13 -13 -51 36 -30 11 -3 -45 26 9 5 -35
6762c5RO6n6oN7p7N8n4L8m2P6p9J8P6l5m5N5k4k4O3l6k7j2L4j03Q8L4l0N5pJ1
$$ -35 -26 40 -16 -22 35 -42 16 -38 0 -42 34 -45 -27 49 14 -31 24 0 -24 39 3 -24 -36 -2 -105 -17 17 -13 42 35 46
6793D6p9L1k4kJ08j08j0M3j7rO6m1l3j6R9r0L6J0n0O5qk7j6N0m4J4K9oj9j2n5
$$ 46 -33 -2 -26 -28 80 -28 -38 5 -12 -21 45 4 -29 -45 54 -36 0 10 -40 25 17 -10 -26 24 -20 -6 23 17 -2 -14 -69
6824f9N6M4qjl2L1m8N9j7Ll5M4k6l2M3j8j4J2joM7m3nrO6nn5L2n5K5n%l6J11m7
$$ -69 -13 31 23 22 -10 21 -27 32 15 18 -17 27 1 -31 12 -6 -20 -8 -9 -15 32 -11 -16 -25 41 36 -19 13 -42 -17 -22 -22 -58 53 6
6859Fj9K4Jm1M2k4k7J1JO3k0K1n9k6K4K2Jk1Qj3Rj6R7m4Ok7l1M5k6RN5p0N1Lk2
$$ 6 -13 11 12 -29 13 -11 -38 -27 -26 37 17 38 -21 -47 -23 -1 0 -21 -13 -26 -17 -33 64 20 26 -1 -32 13 -13 -4 51 -19 32 35 13
6894A3K1oK0j9n1mK3M3Ll4K2m5JR1r6j1P9Jj5r1NK4jN4o0J4M4j8k5M2p3O2j1M4
$$ 13 34 28 48 29 -22 -26 -3 40 43 9 31 -14 -13 78 -18 -29 50 51 36 -55 -50 -26 -27 27 -33 -19 25 7 -18 24 -49 13 2 46
6928D6k5m5M6J8m6j2L7k5pk7L8llj3L1k3kJ5qM5j0K1m1J3Qq0N5k3L5K0m8J8%j0
$$ 46 21 -24 22 40 -6 -18 19 -6 -13 -40 -2 -5 -8 -21 10 -13 -15 0 -8 37 27 48 7 20 28 -52 3 -20 15 35 -13 5 5 -5
6962eM1l0J0l5N4pm0N7m8nl7K1O0j11L4L2l%L0k5k7M9jj1m3L3rKO1p5K6K4l7K2
$$ -5 36 6 16 -19 35 28 -12 45 -3 -8 -45 -24 36 -75 -41 -9 -12 -12 18 -7 -34 15 14 3 -40 -7 -16 -14 47 -28 -2 22 -15 7
6996Gj7K5l5M2ql9M0K0q8M8L2j6n2L0KJK7l8NJ6oNRj9P6m5QJ7m2JJ5j3k0J8NO
$$ 7 -10 15 -20 22 14 -25 15 35 -53 -5 27 11 -41 -11 -9 -8 19 -19 -14 2 -4 1 10 -9 67 22 30 47 5 6 21 8 -12 6 11 17
7032A7K9k4j4j6RL3j9pL9p9OP2l1mJ5k2Ok%nk5nmL3n7J00j1l5Q6j21N7om2N0l4
$$ 17 46 22 8 -8 1 34 15 8 47 -32 -26 46 15 11 26 4 10 8 8 3 -22 -27 -31 2 -55 45 34 -1 85 -36 21 15 -27 23 -11
7067a1m3P8j1Nk1l1K2j1K1K5L9q0J7K0J5j2m8L9m4O7j8J3l8o2J11n8KM1k2nJ8
$$ -11 -54 24 13 18 -3 -34 -12 -23 -2 23 62 -18 -1 19 34 22 -26 13 -31 36 18 31 -7 -69 42 -16 -14 27 5 0 18
7098A8J5l1l6j1J8M8K2o4N%J5Ml6J3k1R0k5n7M4K9k2k8j2NM2mj2nL7m2n3R9o9
$$ 18 33 2 -34 -45 -27 21 43 -21 -16 -16 -1 3 -33 -20 -41 49 24 -33 11 40 18 -10 -22 -17 25 21 9 4 41 -1 -54 45 -24
7131b4L1l3M6l3L2j3l4O8l5pp2P1K8kk6Om5J5n1R0J8k9K9rN1q5P7n3K6l9Qm9M1
$$ -24 7 -26 20 -13 19 6 -28 40 5 -2 -74 -3 25 23 -3 3 -42 -27 -78 12 30 1 30 21 72 -13 64 11 37 -2 6 -43 -2
7164bj4L5qj5kl6L8m6L4M2k5j1Ok1L7j7J2lLm0N1J9l9jk8Oo%M0l8rP2ol2k8mR7
$$ -2 -16 19 11 -4 -6 -42 -4 -50 -16 26 1 -10 -4 -25 12 -5 7 4 7 -33 18 37 -2 -3 -31 -25 -31 -31 9 -29 -38 34 28 -4 -32 -36 61
7201F1p3J3J4OKj3J5Mk6m7P7j6J2p1JL3N4n2j9O1l9J8l6J2m5O5pj7QJ3J2J5k8
$$ 61 -12 1 15 21 23 10 25 29 3 -44 33 17 29 -42 -41 -8 46 -6 -25 36 -3 15 -21 -9 -54 11 4 -13 -5 8 20 35 7
7234Gk6L5NJ7j6L6l8q7L3N2m1M1rl8K4rJ4l0ML7k1Pk5m4O3Nk5n7J00j7K1j8l9
$$ 7 -19 16 21 38 22 58 20 -67 -34 18 -23 18 9 -29 -5 -14 0 -30 -26 11 -10 -3 -28 -72 -9 -4 -29 -86 14 -3 18 0 -39
7267c9P1J0m6K7k8M0o2K4J2l1M6k4k0k1M0m9P1k7o9O2jj6MN9m6K9Ql4M8J6m1J6
$$ -39 32 42 -4 23 -5 35 -27 -3 9 -22 24 0 -20 -41 -1 -50 21 -6 -75 -13 -14 -30 -26 33 -13 16 24 -10 38 54 13 29
7299B9k7K8Lk5J6p5R6Qp9j2K4N8r3L2jJ1j2L0l7R%OJ8j6L3k4pK7Qn0L9k0J4Kk7
$$ 29 2 30 33 8 24 -51 45 53 -26 -38 -14 44 -49 -17 -18 -7 -19 11 -26 -17 -17 -11 7 -9 24 0 -7 20 28 -22 17 -3 11 13 -14
7334a4K0j9lMJ4jJ3n8O1K9k7oL2m4K7l2JL6o6K4ol2P9k6j0N1n6PL1J4o5M0n9M9
$$ -14 6 -13 -16 -12 2 1 14 -44 17 46 19 13 45 1 28 -4 -3 33 -33 -9 -15 -47 32 6 -4 47 -9 -2 29 43 -22 18 -41 8
7368HJ5n8N0k3K6L4o3L1rK0Nl7j7K7n9M8O5n2RJo0K2N3k5MJ6k5o7R3j7k7K1m1
$$ 8 23 -35 15 -8 18 52 -11 20 11 31 36 -1 -18 9 -50 -2 63 11 20 21 -39 -17 36 11 15 31 6 -61 32 15 -12 9 -32
7401c2J9Pj4N4J0l0Qqk0JRl8N2L2o6J5L4Nr3N7k1JJ7MJ3j4K1m7L6k5J4K5m2K7
$$ -32 -13 -6 -20 34 44 14 22 14 -6 -5 4 -34 18 50 -16 -1 33 38 -55 2 -19 -18 -1 3 16 2 23 -24 12 -13 1 26 -16 11
7435A1l3k4N6OrJ0l2%K8%l1M1l5M4o7K2jK8J5m4JM0k8lk0O4qnm0n4J7J9KO7l8
$$ 11 -22 -46 10 16 7 17 -15 -15 13 13 -18 23 -12 32 -35 -13 -14 14 29 -15 -14 26 -2 -5 -25 39 31 26 -14 -68 -51 -32 -30 37 -1
7470aj3J3j4K8Kj7k4j2M7JM1n0k6K1M3l8l7R3p5N0o0M4k5%L8n0L8J6k8k4l4L4
$$ -1 -14 -1 -15 13 15 -2 -26 -38 9 10 51 1 -25 -4 39 1 -36 57 -18 32 -28 16 -9 -9 29 -21 17 33 5 -19 -53 -19
7502a9K0L6Kk3m8O1k1J8m2j2J7J3k8K4k9L8Ln8J01o8%M1nm7K7k0j9N1J2k7l0m3
$$ -19 1 37 39 16 -32 29 8 26 -16 -28 -11 2 -26 -2 -31 7 10 -48 53 -15 -15 26 21 -26 1 -19 -38 13 25 -2 -32 -75
7534g5M0N7l1K5q9R4K2l4l2M6k0l4KQ8m1Rn9jN4k3j4J5k2N6q7N0j7J3k5j8N4k5
$$ -75 -35 22 -9 16 -73 21 43 9 -23 23 3 -31 -29 59 18 27 -32 -33 21 -2 -16 -1 -23 33 -54 -4 -21 -8 -33 -51 3 -22
7566b2kL1k8L0j2l4K4Pm0rJ20p1L0Mk0Rpj4K5NK7p0m1O1L6l3J1l1l8jQ2l9oJ5
$$ -22 -24 7 -21 9 -3 -37 -13 -6 -46 -55 65 -6 24 28 8 17 10 -4 21 26 53 -17 -58 3 39 6 17 -14 -52 -53 29 -10 -16 -1
7600aJ4o0K9P6o2n5M7LOK7m9M3j9nNj8K9J2Rm1K2km1L5RJ0l1K3jl6Q0l8jl0j7
$$ -1 13 -47 -18 58 -4 -59 -12 -9 -3 24 -25 18 -1 -6 -1 -19 10 22 31 -10 12 10 -31 4 13 23 -8 15 14 -22 58 20 19 -11 -28
7635b8j3K0K3J3PLm6J6M0j4kNl1%L2l0JJ1j5Lj3L2n8K9O7r7K9lK1kL3k4L9m7L0
$$ -28 -41 -21 2 15 22 25 -21 -5 35 21 19 24 -7 -7 25 -5 -4 7 -8 -5 -18 14 -44 -15 52 -45 -16 -19 2 0 33 9 48 1 31
7670C1k5PN9m9m7M8n3K3K6o4N3n2Q0k1L0l6jm2J2qK2L1mr0Q7j1j1pM4n7N2k1L6
$$ 31 6 13 72 23 -24 24 -29 -6 20 -44 9 -43 37 16 46 10 9 -33 -21 -29 -7 24 20 -70 17 6 -5 -12 32 -25 27 6 42
7703D2m0l2N8l1O1o7N5Kn8k7L6l9N0Rj4kN3o1k0kj1rJ2K3j9j3O6p3N9J3l7pO9
$$ 42 2 -30 28 -3 58 -9 46 48 -10 -37 -1 -40 10 19 5 3 56 -5 -25 -27 -38 -47 -35 -12 -31 -44 22 -51 8 21 -16 -23 46
7736D6Qj9k6l4J5K4m3L1J7rJ0o1QL4k7N5l8NN3r1K0P8m5n4O4k2k1N2J6kk5on4
$$ 46 54 35 9 -25 -10 14 -29 2 19 10 20 -41 -33 1 -26 29 -9 -4 49 -42 -22 56 11 -43 21 -1 -22 30 46 44 19 13 -41
7769d1K1lJ0N8k9k0LL7m9k5l5P5n6O0k2pM3l4j9N0n3l7jJ01l2l4M6l5J2L7l7j3
$$ -41 -20 -23 -13 45 16 -4 -1 36 -13 -38 -73 2 -54 6 -16 -23 20 -14 -33 17 -36 -73 -74 27 -5 -39 7 -28 -16 21 -16 -29
7801b9N2m3nj7J6k6R4m1o6K5M7p2J09k3k9J7k8N3k4pk1M7Mo4jLKP5k8l7L8l4O2
$$ -29 23 -20 -25 -42 -26 -52 42 1 -65 -40 7 -65 44 21 -8 9 -19 34 10 3 -18 29 33 -31 -32 -29 -27 48 20 -17 21 -13 49
7834D9k4n7J6K0l3P0p6M2Jl2l8P3l4K3OL4o2j3J8ML5j9m7L1N0l0j3K6M0l8K4p8
$$ 49 25 -32 -16 4 -29 41 -35 7 8 -24 -62 11 -23 0 6 40 -22 -35 -17 -13 22 3 -44 -13 37 7 -6 20 60 22 46 -32
7866c2N6pj1n5M6l6M9kJ3j5j1pm9J14p6J5m1M9J5k7m7N1k3J7M5k0k2J3mJ3k4K1
$$ -32 24 17 6 -49 -3 -39 10 8 21 6 -5 -12 -61 53 -23 -8 -49 0 15 -12 -59 -8 -31 -14 31 11 -11 2 -2 11 -13 8
7898HjNOp%K4j1l3Nj0L8n9M5m3J3J8l3O3k7L1j7j2K9m6O9n9K8Qm9L6jk8k4M4n1
$$ 8 7 12 18 11 11 35 24 -9 -4 -14 24 -35 10 -33 -20 -2 -35 28 1 32 15 3 32 -14 55 -4 24 32 -17 19 18 -10 -34 10 -41
7933d1%J3M8n4jL5oj6m3N6JK7pm5L5m7K9KO1k8k9M8k4j2m3M8np2K9K5jJ8J8l8
$$ -41 -41 -28 20 -34 -35 0 -6 -22 -65 -9 -8 19 12 -33 2 -45 -16 -14 47 19 -10 38 14 2 -41 7 2 -70 -41 -16 -17 1 19 -19
7967a9pJ9j9pO4m3J2m8J1j9L3K3MJ0j2QK0k7n9O6j4P2p4K2kp0J7O5p2Q2p3L3m
$$ -19 -26 -7 -26 -33 31 -12 0 -48 -37 -56 -23 0 4 14 2 10 30 3 -56 10 -4 68 -6 16 14 -56 -39 26 -46 36 -37 -4 -8
8000hk8N0m4M5K3o4O0n0k6K3L8j2k6J1J3K0Rj9k5L4MNl9mM7k1j12Q6l3J0O5k1
$$ -8 -36 14 -30 15 38 -26 34 -16 -42 -19 19 7 -19 -8 5 25 34 15 -10 24 28 33 -6 -10 37 16 -96 -10 -43 -33 32 11
8032A1k4k2j5OQ4jo8oNK6k5Q1m7m4J1N4k4j9K8Kl8J4Ll0M2j6K8l0j6K9K3j2K4
$$ 11 -13 -35 -50 -44 40 39 -29 -35 -30 -4 -29 52 5 -39 -28 26 2 -17 11 13 -25 -11 -8 -38 4 -12 16 -14 -30 -1 22 10 34
8065C4l4l1Rl3P7l8L6k3j3J7Kk4nL3j1nk2pL6j9O3ol9k6Q9k7l3O1j26K2PM0Lj2
$$ 34 0 -31 -22 -55 22 -16 20 -3 -16 1 3 -21 -26 7 -4 -9 -31 -38 -2 -21 42 36 -3 -29 60 33 0 61 -65 -43 -36 4 7 -5
8099eO4m7k9P9p2k1L0l8K1K3K6qo1K3J7QLj5O9o2nJ3qj8kl9R8Qn0N2n5JJ2l6P
$$ -5 59 12 -17 62 -10 -31 -1 -39 -18 5 31 23 -38 -15 2 10 13 -2 67 5 0 13 5 -13 -15 -54 44 52 2 54 -1 0 12 -24 -17
8134a7nL7m1k2rN2j0jj6O6l4M1q7N7qj4pK2k6k2M8k8K9k7N2l7l3M8j8kL8o7L9
$$ -17 -22 15 -26 -48 -57 -5 -15 -16 -32 34 0 41 -46 11 3 -11 -18 4 -22 -44 4 -24 5 -22 30 -7 -40 8 -10 -12 26 -41 -2
8167bj6j2J4j3M8l8L5m6N9o3Q9p6m1O5%J5n6QJN2p2J9Ok1
$$ -2 -18 -30 -16 -29 19 -19 16 -30 29 -34 55 -21 -62 3 3 18 -38 -30 -29 23 -49 -30 -24 -45
8191d5
$$ Imaginary data points
##PAGE= N=2
##DATA TABLE= (X++(I..I)), XYDATA
0@%%%%%%%%%%%%%%%%%%%%%%%%%%%%%%%%%%%%%%%%%%%%%jKlK%%%jKkLlLnPj1J7
$$ 0 0 0 0 0 0 0 0 0 0 0 0 0 0 0 0 0 0 0 0 0 0 0 0 0 0 0 0 0 0 0 0 0 0 0 0 0 0 0 0 0 0 0 0 0 0 -1 1 -2 0 0 0 0 -1 1 -1 2 -1 2 -3 4 -7 10
62A0k4L7n9R4j66L31q14L637J6097k9297j5767Q552j2611O949K2842j5395q805
$$ 10 -14 23 -36 58 -108 223 -591 3046 19143 -10154 -25921 -17369 -29980 -23031 -189 -15584 -24389
79b4389K7526L124o433K4104K374k2187P076M347j3826J0026N93k9228L369K2321
$$ -24389 3137 6261 -172 23932 26306 4119 11195 15542 1716 11742 12335 -16893 -13524 8797
93H797r372o263N658j2541J775K0586j0057j4208J5591Q22j0546J3861K241j3994
$$ 8797 -575 -6838 -1180 -13721 -11946 8640 -1417 -15625 -34 788 -9758 4103 6344 -7650
107g650J0118M752j3704J2638J3793j6637j291J3664q845l702P321j6589j0400
$$ -7650 2468 7220 -6484 6154 19947 3310 2019 15683 6838 3136 10457 -6132 -16532
120a6532J5180o238j5359J2956M942q575J1724N107r866J3006J1635j3974J021
$$ -16532 -1352 -7590 -22949 -9993 -5051 -13626 -1902 3205 -6661 6345 17980 4006 5027
133E027J2659q235l407P217j1633q155R072q268j1312J0897K35j0366R240O429
$$ 5027 17686 9451 6044 13261 1628 -6527 2545 -5723 -17035 -6138 -5903 -16269 -7029 -600
147f00n008Q689L681j1360N849J1697q795m082O742m896m52R450p846q867Q882
$$ -600 -5608 3081 6762 -4598 1251 12948 4153 71 6813 1917 1465 10915 3069 -5798 3084
162C084j390q432P115O51r381M661L841o508M656M603j0407k70J0780k085j843
$$ 3084 1694 -6738 377 1028 -8353 -3692 149 -6359 -1703 2900 -7507 -7777 3003 918 -925
177i25O188l572j245J0402k430q465M335m80p041L591P60p438K105L190n663J998
$$ -925 5263 1691 446 10848 8418 -47 4288 3808 -3233 358 1118 -6320 -4215 -1025 -6688 -4690
193d690N902n456j474P061j002n03O134k977l239O710k98o037K231k47n336K487
$$ -4690 1212 -4244 -5718 1343 341 -162 5972 2995 -244 6466 6168 131 2362 2115 -3221 -734
209g34K100n217Q71L561m255k33M864l113j824M767j097j277N048l61k965L471
$$ -734 1366 -3851 -2980 581 -3674 -3907 957 -2156 -3980 787 -310 -1587 3461 3100 135 3606
225C606P10l612J363Q26l915L23K062l363m42K346k796q20L010j592j282L255
$$ 3606 4316 704 2067 2893 -1022 -699 1363 -2000 -2442 -96 -2892 -3712 -702 -2294 -3576 -321
241c21J76p65K764M64j407J838N35k541N93J186k429l45J283j880k5J457k163
$$ -321 -145 -910 1854 2318 911 2749 3284 743 1336 2522 93 -252 1031 -849 -874 583 -1580
258a580q46J916p00j153J167L94l30J395L43j199J341J339j481j44J373n83p4
$$ -1580 -2426 -510 -1210 -2363 -1196 -802 -1132 263 606 -593 748 2087 606 462 1835 1252 1178
275A178M86j300j80P98j228j496K10K10m52k3K32K54J311P90o51M55J393j78m12
$$ 1178 1664 364 184 982 -246 -1742 -1532 -1322 -1774 -1797 -1565 -1311 0 790 139 594 1987 1809 1397
294A397k37l44K79j99j242o79K00M6o70n63K64N75M24J2nJ056J046k54j88K45
$$ 1397 1160 816 1095 896 -346 -1025 -825 -779 -1449 -2012 -1748 -1173 -749 -737 -742 314 1360 1106 918 1163
314A163M39L30p26p83J34J37m33q91m55M48n1n34k60J83P53K41n57K91O69M12
$$ 1163 1602 1932 1206 423 557 694 261 -630 -1085 -637 -688 -1222 -1482 -1299 -546 -305 -862 -571 98 510
334E10J09l20K40O61Ql37l52J60K75n69o33j8r5J02m19n88M69M24k58j16J19L37
$$ 510 619 299 539 1200 1208 871 519 679 954 385 -248 -266 -361 -259 -678 -1266 -797 -373 -631 -747 -628 -291
356b91L65P2k57J14O39K53m97L33K72m58K46l19o61K85p7j071M2M62m28o2N98
$$ -291 74 146 -111 3 642 895 398 731 1003 545 791 472 -189 96 19 -1052 -1010 -548 -976 -1038 -440
377d40j14J99J241J8n91J154R9q16O57k40j447K97nj325P6L35j091Q9J303l92
$$ -440 -554 -355 886 904 313 1467 1566 750 1407 1167 -280 17 12 -1313 -1237 -902 -1993 -1904 -601 -993
397i93k5J641k95m24J874j39j199J208k67j652J027L02k159K46R49j396M72J425
$$ -993 -1018 623 328 -96 1778 1639 440 1648 1381 -271 756 1058 -1101 -855 94 -1302 -830 595
415E95j688l09K453r35j211K008p43j647K109l24j968J954O38k187J271J746j695
$$ 595 -1093 -1402 1051 116 -1095 913 170 -1477 632 308 -1660 294 932 -1255 16 1762 67
432F7L59J806k004l16K217k086j520K367j327k246K143k45j630K587J56k692K499
$$ 67 426 2232 228 -88 2129 43 -1477 890 -437 -2683 -540 -785 -2415 172 328 -2364 135
449A35K446k257N63J614k814M85L029l201j872K882k170j876L847q90l161K885
$$ 135 2581 324 887 2501 -313 172 3201 0 -1872 1010 -1160 -3036 811 -79 -3240 -355
465c55N36k162L650J365m787J040L787k391R2J960m496o50N254j873l046K867
$$ -355 181 -1981 1669 3034 -1753 -713 3074 683 775 2735 -1761 -2411 2843 970 -2076 791
481G91j651k426M730N96m259J656P98l143L384K946n156q22L656j886J116L690
$$ 791 -860 -3286 1444 2040 -2219 -563 235 -2908 476 3422 -1734 -2556 1100 -786 330 4020
497D020m621k270N499m31k488K989k132l941M471J472m906J625J369m777K634
$$ 4020 -601 -2871 2628 2197 -291 2698 566 -3375 1096 2568 -2338 -713 656 -4121 -1487
512a487M564m815j005M033l013L67N802l491l912N038N1l240L946o63n605L507
$$ -1487 3077 -1738 -2743 1290 -1723 -1356 4446 955 -2957 2081 2132 -1108 2838 2175 -3430 77
528G7K813n057J662K762n343P69M814l975j064M638l082j963N510j387l541M718
$$ 77 2890 -2167 -505 2257 -3086 -2317 2497 -1478 -2542 2096 -986 -2949 2561 1174 -2367 2351
544B351M8m556L672J263n129K681K607n707J094M151m487j24M595m118j841N881
$$ 2351 2399 -2157 1515 2778 -2351 330 2937 -2770 -1676 2475 -2012 -2136 2459 -1659 -3500 2381
560B381j517l264M634r43m245N326J470o064K063K289m641K579L639n818o48N076
$$ 2381 864 -2400 2234 1291 -2954 2372 3842 -2222 -159 2130 -2511 68 3707 -2111 -2759 2317
576B317k949j050M590l513l601N190N5l249M046p91n244M418L423m585J086J718
$$ 2317 -632 -1682 2908 -605 -4206 984 1039 -2210 1836 1045 -4199 219 3642 -943 143 1861
592A861m404K494M962m638j856M053k709j735M557k662m247M295j47l611M767
$$ 1861 -2543 -49 4913 275 -1581 2472 -237 -1972 2585 -77 -4324 -29 -176 -3787 980
607I80J159n558K775L626l564J276K422n164N31N787l271l231L781j749k555M573
$$ 980 2139 -3419 -644 2982 -582 694 3116 -2048 -1517 4270 999 -2232 1549 -200 -2755 1818
623A818j201m420L991J297m249L232K861m425N47K611l334Q07L354m316j701N112
$$ 1818 617 -3803 188 1485 -2764 468 3329 -1096 -549 2062 -1272 -465 2889 -1427 -3128 1984
639A984j008k675L036j189k338M056n62m185L141J891l738J430K137l169P09K116
$$ 1984 976 -1699 1337 148 -2190 1866 1304 -2881 260 2151 -1587 -157 1980 -1189 -480 1636
655A636l553J13M391k571k415L813o4j653K696j682l342L561Q31m296J309K183
$$ 1636 -1917 -1804 2587 16 -2399 1414 1350 -303 2393 711 -2631 930 1761 -2535 -1226 957
671I57k493O85K102k624N27L128l066j460M098m37k235K082n01j375K804r79l843
$$ 957 -1536 -851 1251 -1373 -846 2282 -784 -2244 1854 1417 -818 1264 763 -612 2192 1213 -2630
688b630J965K105k681J09J686j391R39J923k872m48L147j706k102K289N7r71J609
$$ -2630 -665 1440 -1241 -1132 554 -837 102 2025 -847 -1295 1852 146 -1956 333 390 -581 1028
705A028r00j698K637P05l238K70J937j015K51R85j736O97K310k188j718K149j13
$$ 1028 128 -1570 1067 1772 -1466 -1196 741 -274 -23 962 -774 -77 2233 45 -1673 476 363
722C63j319Q80j27m31J926j59k286R45J552j735o55Q19m79P13R71j714j39K164
$$ 363 -956 -76 -203 -634 1292 1133 -1153 -208 1344 -391 -1046 -227 -706 7 978 -736 -875 1289
740A289o60j642O43K78j33Q86m92q79J630P95j825m05R49n85p2J32r51P11J364
$$ 1289 629 -1013 -370 -92 -225 661 169 -710 920 1715 -110 -515 434 -151 -223 -91 -1042 -331 1033
759A033j041q85J177J65q37r0j30k3J224J17j294N46J270p18o25j6k59M31M20
$$ 1033 -8 -893 284 449 -388 -478 -608 -631 593 710 -584 -38 1232 514 -111 -127 -386 45 465
778D65q17j30J112J7p94j20K70p0M7l55l46Q91O76p32l22M99m3q3m68n15L68O17
$$ 465 -352 -482 630 647 -147 -267 3 -67 -20 -375 -721 170 846 114 -208 291 248 165 -303 -818 -450 167
800A67j65l05L43M79j30l18k68o9M00n5n19L61O28kk64k81pJ73j57m14m7M34K54
$$ 167 2 -303 40 519 389 71 -197 -266 134 79 -440 -79 549 547 283 2 -5 168 11 -403 -450 -16 238
823B38j83j78K57k8Ll49l27L43J78r2P6J16K87N4j96k00j9J39n1k51J60K99q0
$$ 238 55 -123 134 106 109 -240 -567 -224 -46 -138 -62 54 341 395 199 -1 -20 119 68 -183 -23 276 196
846A96Mj19j41J18j48k58J23Q1O9L4J4M4j8k9j26j89J43J09p9K52J53q0K40p0
$$ 196 200 81 -60 58 -90 -348 -225 -144 -75 -41 -27 17 -1 -30 -156 -345 -202 -93 -172 80 233 153 393 323
870C23k54J7p7j34M2J94n4o8K32j2k26R9j35k85K53q7j84M32J0k61Q4J58j96J6
$$ 323 69 86 9 -125 -83 111 57 -11 221 209 -17 82 -53 -338 -85 -172 -356 76 86 -175 -91 67 -129 -113
894a13J62l76J53O85k68k53M59j25k19L45m63m30N03On76L78K32m64J13M16m19
$$ -113 49 -327 -174 511 243 -10 449 324 105 450 -13 -443 60 66 -510 -132 100 -364 -251 165 -254
915b54J44M75o14j63J025k30n39M51k68l62P07k38r23N98M33n56K82M91p04J66
$$ -254 -110 365 -249 -412 613 383 -156 295 27 -335 372 134 -789 -191 242 -314 -32 459 -245 -79
935g9O24p53j5R57q56m90J104k84m51P04m51p20J059K14j184N08N31r09L50O85
$$ -79 545 -208 -223 734 -122 -612 492 208 -243 461 10 -710 349 563 -621 -113 418 -491 -141 544
955E44j144J30J158j178m07J451n35o22J200l26p55J283Lj356R78O19j535L37
$$ 544 -600 -470 688 -490 -897 554 19 -603 597 271 -484 799 802 -554 424 1043 -492 -155
973a55R82j411J44J090j455j47J577q95q85J418k42p73J434j36j462J298O50j528
$$ -155 827 -584 -440 650 -805 -952 625 -270 -1155 263 21 -752 682 546 -916 382 1032 -496
991d96P44Q36j743L97J344j403n0J290j483m67J898o60j200J386l77j205J827
$$ -496 248 1084 -659 -262 1082 -321 -371 919 -564 -1031 867 207 -993 393 16 -1189 638
1008F38K56k039J030R82j720Q95J228j986P0J832j350l75J685j294j175K168l63
$$ 638 894 -1145 -115 867 -853 42 1270 -716 -646 1186 -164 -539 1146 -148 -1323 845 482
1025D82j562J442j3j761J689R77k275P97J203j760O82J688j938m88J928j095o70
$$ 482 -1080 362 349 -1412 277 1254 -1021 -224 979 -781 -99 1589 -349 -837 1091 -4 -674
1042f74J889j092j670J960J29j813J504L02k142J397J311k047O77J549j997K46
$$ -674 1215 123 -1547 413 542 -1271 233 535 -1607 -210 1101 -946 -269 1280 -717 -471
1058d71K127j516q79J963j038j106K080n65k120J728N55k069J441O49k253R54
$$ -471 1656 140 -739 1224 186 -920 1160 595 -1525 203 758 -1311 130 779 -1474 -520
1074e20J579j828J89J707j766m22K372r49j159J865p43j500K277O9k223J240O07
$$ -520 1059 -769 -580 1127 -639 -1061 1311 362 -797 1068 325 -1175 1102 1171 -1052 188 795
1091G95j830J280R88k358M08J731j601j65J848j596q17K269o42j230J947n90j838
$$ 795 -1035 245 1233 -1125 -717 1014 -587 -752 1096 -500 -1317 952 310 -920 1027 437 -1401
1108a401K125O62k163Q28O36j840J036J569k236l99J883j142m08J964j051j370
$$ -1401 724 1386 -777 51 687 -1153 -117 1452 -784 -1183 700 -442 -850 1114 63 -1307
1124a307J972j16j340J776r2j979J222R67j552N76P67j808L44J718j545n73J593
$$ -1307 665 549 -791 985 893 -1086 136 1103 -449 127 894 -914 -570 1148 -397 -970 623
1141F23j065o37J774o98j228J744m4j448J509L98j658R60Q87j612N15J240j653
$$ 623 -442 -1079 695 -3 -1231 513 469 -979 530 928 -730 230 1117 -495 20 1260 -393
1158c93j73J627j325p39J674p70j044J531l88j228J554L10j540P55Q17j185O51
$$ -393 -566 1061 -264 -1003 671 -99 -1143 388 0 -1228 326 636 -904 -149 668 -517 134
1175A34J088j559k19J451p89l84J224r58r35J502k29q48Q56k74j112J031P02j220
$$ 134 1222 -337 -556 895 106 -278 946 -12 -947 555 326 -522 334 60 -1052 -21 681 -539
1193e39K40N51r44M84J207j105l64R96n76j27J204p85r76R45J27o92O68j41j178
$$ -539 -299 252 -692 -208 999 -106 -470 526 -50 -177 1027 242 -734 211 338 -354 314 173 -1005
1212a005O92Q50r61J31P13r17K15J141o08m12P76n53m40J024k23r05L61J88n08
$$ -1005 -313 537 -424 -293 420 -497 -282 859 251 -161 615 62 -378 646 423 -482 -121 67 -441
1231d41N53J86j069L22Q45o53P3N15n07K6O50m14l05O04k02o00O04R6m17K79L7
$$ -441 112 298 -771 -449 396 -257 -184 331 -176 -150 500 86 -219 385 183 -417 187 283 -134 145 182
1252A82m47M93L42q15n3M88k69j71K60l26m4M88k24m10N50J45l89K35J21j52M28
$$ 182 -265 228 570 -245 -298 190 -79 -250 10 -316 -360 128 -96 -506 44 189 -200 35 156 4 432
1273D32J4n62J93L68l76l06J14m4N6P8k41NM42L8m45J20K68o3Q3j25k41L50K09
$$ 432 446 -116 77 445 69 -237 -123 -167 -111 -33 -274 -269 173 211 -234 -114 154 91 174 49 -192 158 367
1296C67m50k11K14N4j49%n8K03L23j77k98L71K08k70j72m1J15K07j27l72Q2M05
$$ 367 -83 -294 -80 -26 -175 -175 -233 -30 293 116 -182 189 397 127 -45 -86 29 236 109 -263 -181 224
1318B24j18k67j30J83J07J3k16L6L82J17l64j28J77P8k5l21n3L57K12j35j99J54
$$ 224 106 -161 -291 -108 -1 12 -204 -168 214 331 -33 -161 16 94 69 -252 -305 52 264 129 -70 84
1340H4K93j24l10j06Q7K53k09k18J24J82L6k86j33K36J91p1j98J32L20N1j69j20
$$ 84 377 253 -57 -163 -76 177 -32 -250 -126 56 92 -194 -327 -91 100 29 -169 -37 283 334 165 45
1362D5O2J11j15l67r9L15M5k16PJ04L01m6k58n3K78K33k55j83K37K16r3j69l23
$$ 45 107 218 103 -264 -363 -48 -3 -219 -212 -108 193 147 -111 -164 114 347 92 -91 146 362 269 100 -223
1385b23R0K25k78k90J87K61L9n4l5N0J60m8l13K8L36L9j38Q3P4O8J13l60j78K60
$$ -223 -133 92 -186 -476 -289 -28 11 -43 -78 -28 132 84 -229 -201 135 174 36 119 193 261 374 14 -164 96
1409I6O6k87p4J69j8O6j30k64R4L08l48j02L84N5K6K09j65M1L41k35l84J47J92
$$ 96 162 -125 -199 -30 -48 18 -112 -376 -282 26 -322 -424 -40 15 41 250 85 126 467 232 -152 -5 187
1432A87j90O2L7k78K23J76n55QL89k83q5K99j21P2M38k67k88M67K4n11K37J46
$$ 187 -3 59 96 -182 41 217 -338 -330 59 -224 -309 -10 -131 -59 379 112 -176 291 315 -196 41 187
1454A87k40K13J14m89J58L55n06j27L36k92n8M54j48j89N67j6n58N29J67n72K45
$$ 187 -53 160 274 -215 -57 298 -208 -335 1 -291 -349 105 -43 -232 335 319 -239 290 457 -115 130
1475A30K35n59K93L12o39k0M31l87j69L84l57j32O72r2m20N75n0m47M15K47o85
$$ 130 365 -194 99 411 -228 -248 183 -204 -373 11 -346 -478 194 102 -318 257 207 -240 175 422 -263
1496b63K86L47o26L22O20o67j84N10l77l00O98m72o48P88L8o15O30Q1q94N98N13
$$ -263 23 370 -256 66 686 19 -165 345 -32 -332 366 -106 -754 34 72 -543 87 168 -726 -128 385
1517C85o61K15N11n69J52Q58o53m46O32l74n30P92k44q81O14K44n97O08L18j026
$$ 385 -276 -61 450 -119 33 891 238 -208 424 50 -480 312 68 -813 -199 45 -552 56 374 -652
1537f52M59P21n52R8N12p39q4R75n33o05P36l79o56R35qq15O99J78p91O17M94
$$ -652 -193 528 -24 74 586 -153 -237 738 205 -400 336 -43 -699 236 228 -587 112 290 -501 116 610
1558F10j064J86P36p16pQ11p26l36J068k95o92Q80j34p85Q57Lq83N15M37j050
$$ 610 -454 -268 468 -248 -255 556 -170 -506 562 267 -425 455 321 -464 393 396 -487 28 465 -585
1578e85J83O74q06%Q59o52k76J117m03l38R94l02p88Q02O5p27N50m7j078N05P84
$$ -585 -402 272 -534 -534 325 -327 -603 514 111 -227 767 465 -323 479 544 -183 367 320 -758 -253 531
1599E31q49j11N46q07J52J118n92n83J030l77l76J014j90j103O33L15o22O16K55
$$ 531 -318 -429 117 -690 -538 580 -12 -595 435 58 -318 696 506 -597 36 351 -271 345 600
1618F00j272K35J043n75r6M95r22j45J260l28p89N57k49m29J028J04j032M18L52
$$ 600 -672 -437 606 31 -65 430 -492 -637 623 295 -494 63 -186 -615 413 517 -515 -97 255
1637B55o11O74N48j152j51P95m21J5N53q86n18J121o3n40N58j30p64Q67N32q67
$$ 255 -356 318 866 -286 -437 358 -63 -48 505 -381 -899 222 159 -381 177 47 -717 150 682 -185
1657a85K01M90p96L16P53q69k93O77m84j74P68m85o53P59J17o27N47J76p70N01
$$ -185 16 506 -290 26 779 -90 -383 294 -190 -364 404 -81 -734 25 142 -485 62 238 -532 -31
1677c1N11o93K54M55o65J09O30n06k71O33m27l35N44j52m94N43J7o71M31L57o41
$$ -31 480 -213 41 496 -169 -60 570 64 -207 426 -1 -336 208 56 -438 105 122 -549 -118 239 -402
1698d02L26M28p20J74N51m26o7N74m73k28O20j47m60M05j03m73N57K60p22J96
$$ -402 -76 352 -368 -194 357 -69 -136 438 -35 -263 357 210 -250 155 52 -421 136 396 -326 -130
1718a30L27m40K17L67n34p7N58k77j21L95k23l94N15m7l27K97k4m39L81J30l69
$$ -130 197 -243 -26 341 -193 -270 288 11 -110 285 62 -332 183 136 -191 106 82 -357 24 154 -215
1739b15J25J10k62J40L54l03j55L87j23j13L17p5l41L44J8l08J68P7m70K28K11
$$ -215 -90 20 -242 -102 252 -51 -206 181 58 -55 262 187 -154 190 208 -100 68 145 -325 -97 114
1760A14k43J9J39k49J9L36k28j12K94K2j94L11n7j91J18L1j76J11Q0k22jJ36j33
$$ 114 -129 -110 29 -220 -201 135 -93 -205 89 111 -83 228 171 -20 98 129 -47 64 144 -78 -79 57 -76
1783g6l5J54j52o6J69o6r4J68l1o8K05j4r1L6Q4j70kJ79j20nQ4j13p4J95j19j05
$$ -76 -111 43 -109 -175 -6 -72 -166 2 -29 -97 108 94 3 39 123 -47 -49 130 10 5 89 -24 -98 97 -22 -127
1809a27J61m4l3J24o2o2N1mr1R8J8k8j6O5k2j1N5p9n6N2n2q0J6K8o2M2j2Q8J9
$$ -127 34 -10 -43 81 19 -43 8 4 -87 11 29 1 -15 50 28 17 72 -7 -63 -11 -63 -143 -127 -99 -161 -119 -131 -43 -24
1838b4Q3J0J3O0mjN8m4o6mm9p2n7k6p9L5N6J2LJ2J35l2L5j4L0R1p2q0J2%j4J9
$$ -24 59 69 82 142 138 137 195 151 85 81 32 -40 -97 -123 -202 -167 -111 -99 -96 -84 51 19 54 40 70 161 89 9 21 21 7 26
1870B6k1l3O9J5m6j2N2n4L3l4q0lN4j03m5J32l4J4P1JR6R2m1r6R2K4j53k8m4k6
$$ 26 5 -28 41 56 10 -2 50 -4 29 -5 -85 -88 -34 -137 -182 -50 -84 -70 1 2 98 190 149 53 145 169 16 -12 -56 -82
1900h2j4k6j42Q0J81n1JM7Q7R7K5q5k5Q5j05j44J3L3r4J5q1q8J64J72j62j3J92
$$ -82 -96 -122 -264 -184 -3 -54 -53 -6 81 178 203 118 93 178 73 -71 -58 -25 -119 -104 -185 -273 -109 63 -99 -112 80
1927H0jK6j6m0RP6j04j60J26J36j29o3J26m6J38jj91m0K05l9k10L4m4l4J03r9
$$ 80 79 105 89 49 58 134 30 -130 -4 132 3 -60 66 20 158 157 -34 -74 131 92 -118 -84 -128 -162 -59 -158
1953a58j13K58L1j11R6J93m3O3j7k08J73J15l55j61K10o8n6R9p1j71L52%k02J72
$$ -158 -271 -13 18 -93 3 196 153 216 199 -9 164 279 -76 -237 -27 -95 -151 -52 -123 -294 58 58 -144 28
1977B8J86k16J41J6j63J00J06l89l4M28k58j61K24k9m5K75j51k46L41Q7m06K36
$$ 28 214 -2 139 155 -8 92 198 -191 -225 203 -55 -216 8 -21 -66 209 58 -188 153 240 -166 70
1999G0P1k26Q7P9l27J90L61l21j91L18j04j13K80j38k30L62r1l87L29J92m63P0
$$ 70 141 -85 2 81 -246 -56 305 -16 -207 111 7 -106 174 36 -194 168 77 -310 19 211 -252 -182
2021a82K40k39K58K51m83j7M96j71j80K09k17j86M58r3l34K23ql80L38K62l85
$$ -182 58 -181 77 328 -155 -172 324 153 -27 182 -35 -221 237 144 -190 33 25 -355 -17 245 -140
2042a40L2J70l22K43M90n37k64M43r3k1L07l59l54N24O8l09K73k2m25K56L02l72
$$ -140 -108 62 -260 -17 473 -64 -328 115 22 1 308 -51 -405 119 187 -122 151 129 -296 -40 262 -110
2064a10j0K62m65J32O43l45l18L04j23k15N55k29m73M17J63l02J36K17n09J00
$$ -110 -120 142 -323 -191 452 107 -211 93 -30 -245 310 81 -392 25 188 -114 22 239 -270 -170
2084a70M00l48RL50l88m1N07j84l12L58k22k80M88M1m92L20K04m62J95K35l93
$$ -170 230 -118 -109 241 -147 -188 319 135 -177 181 -41 -321 167 208 -284 36 240 -222 -27 208 -185
2105a85L6M18m39j00N04l18j95M84j68l81M68M5l58L06J00m53L34K21l57k5K52
$$ -185 -149 269 -170 -270 234 -84 -279 205 37 -344 124 169 -189 117 217 -236 98 319 -38 -63 189
2126A89m04M5M23l61k31M28r7j70M45k18l48M28J34m16K05J33n42L05M08m25p4
$$ 189 -215 -170 253 -108 -339 89 -8 -178 267 49 -299 129 263 -153 52 185 -357 -52 356 -69 -143
2147a43L30l94M1N02k40l68M04j23k20N04j20n01K41K61l45K11J67m14J06L04
$$ -143 187 -207 -166 336 96 -272 132 9 -211 293 173 -328 -87 174 -171 40 207 -207 -101 203
2167B03k10m3K71l39j71M91j48l05L27p7k23K66J19m23K59J43k49J66K84l93o8
$$ 203 -7 -50 221 -118 -289 202 54 -251 76 -1 -224 42 161 -262 -3 140 -109 57 341 -52 -120
2188a20L45j86j08K68k34k07K78M3k79K62l0k77K70Q6k89J75J95l87J39L11k86
$$ -120 225 39 -69 199 -35 -242 36 79 -200 62 32 -245 25 111 -178 -3 192 -195 -56 255 -31
2209c1q2L13j94j67L08o8k53L14N4l21K00N9l43J63J48k44M7K15k85L2K32j43
$$ -31 -113 200 6 -161 147 79 -174 140 194 -127 73 132 -211 -48 100 -144 -97 118 -167 -135 97 -46
2231d6J0J72j05j32K53j2k68J89qj86J51Pj50P3K11k35KK50j31m0J22p2j56K68
$$ -46 -36 136 31 -101 152 140 -128 61 53 -133 18 25 -125 -52 159 -76 -74 176 45 5 127 55 -101 167
2255A67p9j70Q6J7j43R6O0j80J72J45j90k1K14k04p0J91j38o3J70p7r9J53K0j00
$$ 167 88 -82 4 21 -122 -26 34 -146 26 171 -19 -40 174 -30 -100 91 -47 -110 60 -17 -116 37 57 -43
2279d3L3O1n4P3L7j29P2O2j30k9P7r4k9Q3n8lR2k1rO2j5j15J43n1l7lN4q7j4J40
$$ -43 -10 51 -3 70 107 -22 50 112 -18 -47 30 -64 -93 -10 -68 -71 21 0 -9 53 38 -77 66 15 -22 -25 29 -58 -72 68
2309F8n2p0J15l8j4N5o6k5N4qq7J10j8o8J2j4km8Q8k1m1O1l3O6P8q9j5L2K7J3
$$ 68 16 -54 61 23 9 64 -2 -27 27 19 -68 42 24 -44 -32 -46 -48 -96 -8 -29 -70 -9 -42 24 102 13 -2 30 57 70
2339G0j8K7j27M8j2pN6k5m2J5K4p6J4K0O7k7j5K0o9M5K0qk3J5j2P0m1O4k1%k8
$$ 70 52 79 -48 0 -12 -19 37 12 -30 -15 9 -67 -53 -33 34 7 -8 12 -57 -12 8 0 -23 -8 -20 50 9 73 52 52 24
2370B4k7L6j7k7J4l0l0J9PN9L1p7j9M6pPk7N2m3J3p0N0J8J8K4p5M4K8l0%lj0M7
$$ 24 -3 33 16 -11 3 -27 -57 -38 -31 28 59 -18 -37 9 2 9 -18 34 -9 4 -66 -16 2 20 44 -31 13 41 11 11 8 -2 45
2403D5k0l3N1K4o1j1mL1rL5m1n3J01n7p8O7M2k7m4N7l0QP9m1m6L9J2k9J4pn3J10
$$ 45 25 -8 43 67 6 -5 -9 22 13 48 7 -46 55 -2 -80 -13 29 2 -42 15 -15 -7 72 31 -15 24 36 7 21 14 -39 71
2435G1o0l5J08l2p6P3n7%N4l5k9K3L3j3q1K5l9J4R6lj02M3R6r2Q2l9r0J04J0q5
$$ 71 11 -24 84 52 -24 49 -8 -8 46 11 -18 5 38 25 -56 -31 -70 -56 40 37 -65 -22 74 -18 64 25 -65 39 49 -36
2465c6O3l4k7M1J04r7p1R4o4j9J26m6j27R6J9r6J16J4j49J9J13j11N6O0r1N9J12
$$ -36 27 -7 -34 7 111 14 -57 37 -27 -46 80 34 -93 3 22 -74 42 56 -93 -74 39 -72 -16 44 -47 12 124
2492A24p8j2J01j20n9P1j1j22J21L4j60P4Q8j27K7K8j6qJ65j15j23K00n7n0Q1
$$ 124 46 34 135 15 -44 27 16 -106 15 49 -111 -37 51 -76 -49 -21 -37 -45 120 5 -118 82 25 -25 56
2517E6o1j03J51k1j06J31Q6j73K5O9j43N3J74k61M1J55r3n8J41o3o7J12o7q3K08
$$ 56 -5 -108 43 22 -84 47 133 -40 -15 54 -89 -36 138 -123 -82 73 -20 -78 63 0 -67 45 -22 -105 103
2542A03K1k31J38P7j93M7J26k40P9K24j63j00K38j46j04K04qj34J47nj81J64J28
$$ 103 124 -107 31 108 -85 -38 88 -152 -73 151 -12 -112 126 -20 -124 80 72 -62 85 80 -101 63 191
2565A91k78OJ05p9K7J39k20j4K20j09r1J74n7r9J76Jj83J72L6k74J01K16k27R7
$$ 191 -87 -81 24 -55 -28 111 -109 -123 97 -12 -103 71 14 -85 91 92 -91 81 117 -157 -56 160 -67 30
2589C0J10j66OK81k89j42K22p2p2J88q7k46K64P6k08P2K05k92N3J65j60j4K08
$$ 30 140 -26 -20 261 -28 -170 52 -20 -92 96 9 -237 27 103 -105 -33 172 -120 -67 98 -62 -76 132
2612A32k52j6K77o4k76K31oj77K70Ol27K16J16k17O4J65k39N8J21j69MJ96j34
$$ 132 -120 -136 141 77 -199 32 26 -151 119 125 -202 14 130 -87 -23 142 -97 -39 82 -87 -83 113 -21
2635b1j65L06p0j34R4m7j06K10N3k77R7J67j85K5J68j56j5K14j74q2K24p2j37
$$ -21 -186 120 50 -84 10 -37 -143 67 120 -157 -60 107 -78 -53 115 -41 -56 158 -16 -98 126 54 -83
2658h3J47n6j70J83mj82J63J39k15K0J61j92L7J30j27m1K47p8j86K09o4j50J52
$$ -83 64 8 -162 21 17 -165 -2 137 -78 -58 103 -89 -52 78 -49 -90 157 79 -107 102 38 -112 40
2681D0J7j98J83J18k53K2J78j41l1J05j06qJ47p9r6J77m1j60K04J9j56J46o0j49
$$ 40 57 -141 42 160 -93 -71 107 -34 -65 40 -66 -74 73 -6 -102 75 34 -126 78 97 -59 87 27 -122
2705a22J02J19j53l7J57j06J3J58j91QJ96j19j22K00p9j21J14j2q2O9Q1j86O8
$$ -122 -20 99 -54 -91 66 -40 -27 131 -60 -52 144 25 -97 103 24 -97 17 5 -77 -8 73 -113 -45
2728d5J39j20k9M5p1M3J49j28k0Q3j35k5J29M8j07J08J8j36K5J69j41j1J06j37
$$ -45 94 -26 -55 -10 -81 -38 111 -17 -37 46 -89 -114 15 63 -44 64 82 -54 -29 140 -1 -12 94 -43
2752d3J1R1q5q1J30l7o8J62n1j47J23P7r8N1J5j18J3J69j62K7Oj8k1P9pq7O2M1
$$ -43 -32 59 -26 -107 23 -14 -82 80 29 -118 5 82 -16 35 50 -68 -55 114 -48 -21 -15 -33 -54 25 18 -69 -7 34
2780C4l4P3m0m4M4qm8l7J07j63R0KMJ0O1o0k5J15p1J1K3K0j28J09m2n8K2M3m1
$$ 34 0 73 33 -11 33 25 -23 -60 47 -116 -26 -24 -20 -10 51 -9 -34 81 10 21 44 64 -64 45 3 -55 -33 10 -31
2809c1N3j6k1%J20q1p8Q9K9n1k4M0o4M5o5%M2k8j1MP0k9M5K0l0j9N6m3k1Jq3J4
$$ -31 22 6 -15 -15 105 24 -54 35 64 13 -11 29 -35 10 -55 -55 -13 -41 -52 -48 22 -7 38 58 28 9 65 22 1 2 -81 -67
2841f7O9K9k4KN2o9O9j9k2k3K8m0%J9j9n3K1L6m1M5M0q1Q2ORLRl7o1J03p2j6N
$$ -67 2 31 7 9 61 -8 61 42 20 -3 25 -15 -15 4 -15 -68 -47 -11 -52 -7 33 -48 34 40 49 52 61 24 -37 66 -6 -22 -17
2874a7k0KK7K6J9o9P4o0O2m5j2N6m1pJ4m6j2J7Jn7O6J8j8L0j0J9rK6joMk3j7l6
$$ -17 -37 -35 -8 18 37 -32 42 -18 44 -1 -13 43 2 -5 9 -37 -49 -32 -31 -88 -22 -4 -22 8 -2 17 8 34 33 27 31 8 -9 -45
2908d5O0m2L8N1j30Q4m2M1m8M8k2j0M5J1r6K9Mj0K8k9J6J7K5m0K0RK2l3O2p3k8
$$ -45 15 -27 11 62 -68 16 -26 15 -33 15 -7 -17 28 39 -57 -28 -24 -34 -6 -35 -19 -2 23 -17 3 12 34 1 63 -10 -38
2939c8M4o7J3R8q9j4K2k3M8K3m5M1k2P2r4jO6n8l8P7KmO7qr1P5kq7Q6n7j2nK7
$$ -38 6 -61 -48 50 -39 -53 -31 -54 -6 17 -28 13 -9 63 -31 -32 34 -24 -62 15 17 13 80 72 -19 56 54 -33 53 -4 -16 -21 6
2972Fj7k4Q7n9m1O1l9J2k3M7m7P2o1JML8n6O5K5p4qR0n4l6P4n4J0L4l2o8P3qk5
$$ 6 -11 -35 52 -7 -48 13 -26 -14 -37 10 -37 35 -26 -25 -21 17 -39 26 51 -23 -31 59 5 -31 43 -11 -1 33 1 -67 6 -2 -27
3005b7R2m2l9K0No3J4N2r1L4P1m7l1Q5J6p3P6j9m1j2O6o1O0L1r7j2R7p4nQ4j24
$$ -27 65 23 -16 4 9 -54 -40 12 -79 -45 26 -21 -52 33 49 -24 52 33 -8 -20 46 -15 45 76 -21 -33 64 -10 -15 69 -55
3036e5J8R0l7j30J89p9n7R8J8j50R5R8j52Q8M9j16JO5l6n2R1j7n7J8M9r1J34m5
$$ -55 -37 53 16 -114 75 -4 -61 37 55 -95 0 98 -54 34 83 -33 -32 33 -3 -55 36 19 -38 -20 29 -62 72 27
3064B7j27P9P4r1Q8M4j58M0J12j47L6L9m3j4R2m9r2J73n6j33J34om9L0J0m0N2
$$ 27 -100 -21 53 -38 50 94 -64 -24 88 -59 -23 16 -27 -41 51 2 -90 83 27 -106 28 22 -27 3 13 -27 25
3091B5N5j22QJ33j45J6P3p7l1P7M7j78J13mq4R7O9q5j0K8r1O7J12q4n1J50j16
$$ 25 80 -42 -34 99 -46 -30 43 -34 -65 12 59 -119 -6 -10 -94 3 72 -13 -23 5 -86 -19 93 9 -42 108 -8
3118hj9Q0j3j25J89l1q3M8j0o6O3K9j47P4J36j40OR0j06K4J18j25k7N9J5r1J47
$$ -8 -27 53 40 -85 104 73 -10 38 28 -38 25 54 -93 -19 117 -23 -17 73 -33 -9 109 -16 -43 16 31 -60 87
3145H7pj45J15M2j45O5O2j06J4J17p0n5J17j47K2J11n0j15J02K6q5Q3k2j01O8
$$ 87 80 -65 50 92 -53 12 74 -32 -18 99 29 -26 91 -56 -34 77 27 -88 14 40 -45 38 16 -85 -17
3170a7Q0o1k9J03q8m4Q5rk9O9k1j29J22L0q2L0kp4R3N7j30PK7k6L5K7n0n4J60
$$ -17 63 2 -27 76 -12 -56 29 20 -9 60 39 -90 32 62 -20 10 8 -66 27 84 -46 -39 -12 -38 -3 24 -26 -80 80
3199H0j03L1L9k8j11J32K2q9P4j7r6O1J35j28n8Q3p7K6J06o5p6J23k0j08J82j07
$$ 80 -23 8 47 19 -92 40 62 -27 47 30 -66 -5 130 2 -56 27 -50 -24 82 17 -59 64 44 -64 118 11
3225A1n9N1L1q5K6N4q6P9Qo4n1R2m4o1J88j01m1J35q0l8L6l6k0J12m6r4Q9O4j29
$$ 11 -48 3 34 -51 -25 29 -57 22 30 -34 -85 7 -37 -98 90 -11 -52 83 3 -35 1 -35 -55 57 11 -83 6 70 -59
3254e9Q0K6q3n6J14r1L0Q8q7J4M7J1q7L8J9m5P2j4r8R2K2l5L5L0r0J4ppON0l2
$$ -59 21 47 -36 -92 22 -69 -39 49 -38 -24 23 34 -53 -15 4 -41 31 17 -81 11 33 -2 33 63 -27 -13 -20 -27 -21 29 -3
3285cm0K1M4o3M8J8k4J1Qj2j3L5o1K7L5p0J9L5k2l3Q9m9k6J9jQ1o5qj5j6P3p6
$$ -3 -43 -22 22 -41 7 25 1 12 20 8 -5 30 -31 -4 31 -39 -20 15 -7 -40 49 0 -26 -7 -8 73 8 0 -15 -31 42 -34
3317c4K6L4j9krl%j2M4r0P9m5lM3k8K6j2m5M9k0j1K7L1k0l6k2O7L4q4J0K3L3m1
$$ -34 -8 26 7 5 -4 -7 -7 -19 25 -65 14 -31 -34 9 -19 7 -5 -50 -1 -21 -32 -5 26 6 -30 -52 15 49 -35 -25 -2 31 -10
3350a0k5j6L5oL7m2O1k5k6J4J8Rk0j0NLK5q1Q2j4L8j4j0l0oO3p0lOrK2N8n0j8
$$ -10 -35 -51 -16 -22 15 -27 34 9 -17 -3 15 24 4 -6 -1 2 27 -54 28 14 52 38 28 -2 -8 55 -15 -18 -12 -21 1 59 9 -9
3384iL2n4L2o5K6M3m1M9m5K5J7K0q2J6L0l5qP2j1jnL3r3Q8Ln7M9m0M0p5N7j4l
$$ -9 23 -31 1 -64 -38 5 -36 13 -32 -7 10 30 -52 -36 -6 -41 -49 23 12 11 6 39 -54 34 37 -20 29 -11 29 -46 11 -3 -6
3417fM5l8k1J4j2mL4j1J3J6j8n5M0m8K9M4jn2N8q0O2j8k8L9j9O9m3lnK6k7Op2
$$ -6 39 1 -20 -6 -18 -22 12 1 14 30 12 -43 -3 -51 -22 22 21 -31 27 -53 9 -9 -37 2 -17 52 9 6 1 27 0 6 -66
3450f6N0J5J9k5N1q9N5k8L0k6j3M0J6n7M4qQj8KkOOj9K7l6K8M4q4j5M0L2n0L9
$$ -66 -16 -1 18 -7 44 -45 10 -18 12 -14 -27 13 29 -28 16 8 16 -2 0 -2 4 10 -9 18 -18 10 54 -30 -45 -5 27 -23 16
3483A6l8oQM2r2Q4K0n5P0J0j23L5J1J3O0k8n5k4O6l0L0jkl5J7%NK3jr7M4Q8p1
$$ 16 -22 -28 -20 22 -70 14 34 -21 49 59 -64 -29 -18 -5 55 27 -28 -52 14 -16 14 13 11 -24 -7 -7 -2 21 20 -77 -33 55 -16
3516a6nJL2n3O5r1J5M8M0m7N9l6l7P7n0j1M3n7J0K5J9j4o9P9n2K4m0M1j4N7n1
$$ -16 -21 -20 12 -41 24 -67 -52 -4 36 -11 48 12 -25 52 2 -9 34 -23 -13 12 31 17 -52 27 -25 -1 -41 0 -14 43 -8
3547hm5L5M5m3O6Oj14M0O2m1KL2j3n7Q2n2m1P8n6pkPpQK4qN5k3l6l3O9m3K7j3
$$ -8 -53 -18 27 -16 50 56 -58 -18 44 3 5 37 24 -33 49 -3 -44 34 -22 -29 -31 -24 -31 -23 1 -7 48 25 -11 -44 25 -18 9 -4
3581dpJ5K3K2k6mo6P0j2K8n1L1J1r6M4O3r2JO1j8m6J24n8r3O7K6m8Q7j6r9M5N4
$$ -4 -11 4 27 49 23 19 -47 23 11 39 -12 19 30 -66 -22 41 -51 -50 11 -7 -53 71 13 -80 -13 13 -35 52 36 -63 -18 36
3613C6j6K1m4n1N6K0j03O0N5l5l9J29p5k7J9Rk7O6j9q1P0Jl0K3Rm4L8k0k8l3J24
$$ 36 20 41 -3 -54 2 22 -81 -21 34 -1 -40 89 14 -13 6 15 -12 54 35 -46 24 25 -5 18 27 -17 21 1 -27 -60 64
3644F4o2m9J28l0o7N0l7pN3K9j07M4K2o8L8K3k3l3Q7m3m6O0j9m0L5J8j24J18l0
$$ 64 2 -47 81 51 -16 34 -3 -10 43 72 -35 9 31 -37 1 24 1 -32 55 12 -34 26 7 -33 2 20 -104 14 -16
3673a6kJ7J8j7n2R6Ko8J8n6M9j2j6nK0m1L1L6J3n5L6N6p3N7Rn8K3K9j2l9l6P7
$$ -16 -18 -1 17 0 -52 44 46 -22 -4 -60 -11 -23 -39 -44 -24 -65 -34 2 15 -40 -4 52 -21 36 45 -13 10 39 27 -12 -48 29
3705B9o1L9L7p9N0l5oM6K9l2n3P2j8Mk3l7N6RJ8q4Q6k4q2O5J1q7M6L3q0O6L1l3
$$ 29 -32 7 44 -35 15 -20 -26 20 49 17 -36 36 18 22 -1 -38 18 27 45 -39 47 23 -59 6 17 -70 -24 9 -71 -5 26 -7
3737gJ9k4M7k1J1j5L0qj1QMm0k2M9n0L6k1P0j15K1L1n3l7J27o7O2j5M2m0Pm0O1
$$ -7 12 -12 35 14 25 10 40 32 21 29 33 -7 -29 20 -30 6 -15 55 -60 -39 -8 -61 -98 29 -38 24 9 51 11 18 -22 39
3769C9J3j6n3J0L1o4R6o1K2k8K2j6qj5n1N8N7K8q4N3n0L5%L3j5j3K8n7J3M7m3
$$ 39 52 36 -17 -7 24 -40 56 -5 17 -11 11 -5 -13 -28 -79 -21 36 64 -20 33 -17 18 18 51 36 23 51 -6 7 54 11
3800A1j5M4r1M3j2K5oL3K2m9l4J02q5NP0q8NK2OoL5n8k2O8m5K9m2j8M9pK1n3O0
$$ 11 -4 40 -51 -8 -20 5 -1 32 54 5 -29 73 -12 -7 63 -25 -20 2 8 2 37 -21 -43 25 -20 9 -33 -51 -2 -9 12 -41 19
3833A9k2k1J3j8L6mml8j6J32m0q8L2K4k5jM0l8O4n4lJ0k0L1jrj1LoK1k5j0O9n3
$$ 19 -3 -24 -11 -29 7 3 -1 -39 -55 77 37 -51 -19 5 -20 -21 19 -19 45 -9 -12 -2 -22 9 8 -1 -12 -9 -15 6 -19 -29 40 -13
3867a3J5m1MK9L3j7oL7k1K0m8K2n7J1L2M0n1k2L1Jj6j2M9ol9K5M3p8M8Mp0L7J3
$$ -13 2 -39 -35 -6 27 10 4 41 20 40 -8 14 -43 -32 0 40 -11 -33 -2 -1 -17 -29 20 14 -25 0 43 -35 13 17 -53 -16 -3
3900ck0K9m6K9L9j9j4j0P7p0j5R5n3n6M0k8o2Q2j1K9pk4K6l1K5L2l0M2p7L1K3
$$ -3 -23 6 -40 -11 28 9 -5 -15 62 -8 -23 72 19 -37 3 -25 -87 -5 -16 13 6 -18 8 -23 2 34 4 46 -31 0 23
3931B3n9L7N4n4k4NQO1l4l6QK3L6o1L5k6k6L1p1J8K0J00k7j9Pn0l0M0L8k4J6J8
$$ 23 -36 1 55 1 -23 -18 -10 51 17 -19 -11 12 48 -13 22 -4 -30 1 -70 -52 -32 68 41 22 29 -21 -51 -11 27 3 19 37
3963C7p6N2j1J7l0K5j2Pl4pj3K5K6o1P7p0KR0j9m4K5p2P9J5l9M8l4j2Qk6N0j4
$$ 37 -39 13 2 19 -11 14 2 9 -25 -32 -45 -20 6 -55 22 -48 -46 44 25 -19 6 -66 13 28 -11 37 3 -9 -1 -27 23 9
3995IpK5k3n9N7o6J6K1L9M2r2N0k9K9l4J1n8Q5J8m0l8J3l3O9k9jJ0M5k1o4Q3n0
$$ 9 2 27 4 -55 2 -64 -48 -27 12 54 -38 12 -17 12 -22 -11 -69 16 34 -6 -44 -31 -64 5 -24 -25 -15 30 9 -55 28 -22
4027b2RQl8P8n7pP3l2J2m8j5Q6r1Q3n2K3j7j5K3q2Q8l1J4M2k1l5K0L2o6NO1n7
$$ -22 -13 -5 -43 35 -22 -29 44 12 24 -24 -39 47 -44 39 -13 10 -7 -22 1 -81 7 -24 -10 32 11 -24 -4 28 -38 -33 28 -29
4059b9M8n0oP0j9Oj4M3q6pK1lqL1k8N2N%Pl9mL5l4J0k3K3N1l1p3L7Kl6N2M4j24
$$ -29 19 -31 -37 33 14 20 6 49 -37 -44 -23 -26 -34 -3 -31 21 26 26 33 -6 -10 25 -9 1 -22 1 52 21 -52 -15 -13 -49 3 47 -77
4094g7O8j5klQK3m4J9KmK8Ml9P4n5k2R7j20K5jK8n4N0M1m6L3nn4J4N3k8K6NQl5
$$ -77 -9 -24 -26 -29 -21 2 -42 -23 -21 -25 3 7 -32 42 -13 -35 62 -58 -33 -34 -6 -60 -10 31 -15 18 13 -41 -27 26 -2 24 29 37 2
4129Bj8M5m5N2m3KqJ5n5j3N8m0M2K4l6rM7n2nM3k6k6O7n6O9K8o2n8P3K6m4mK3
$$ 2 -16 29 -16 36 -7 -5 -13 2 -53 -66 -8 -48 -6 18 -18 -27 20 -32 -37 6 -20 -46 21 -35 34 62 0 -58 15 41 -3 -7 16
4162A6Pj1K2k3l1ljK7L1m3K1mjk4O0o0j1J2J8l4M2K7k0no0Jj2O7Oq2J24p3nP0
$$ 16 23 12 34 11 -20 -23 -24 3 34 -9 12 8 7 -17 43 -17 -28 -16 2 -32 10 37 17 12 -48 -47 -59 8 14 -68 56 -17 -22 48
4196D8j1r0N8N0r1N0K2j5pk0qk2Q3l6o8J33p4l5RO4j00M5K8OqoLl7L1l1M5L6j04
$$ 48 37 -53 5 55 -36 14 36 21 14 -6 -14 -36 47 11 -57 76 2 -33 -24 40 -60 -15 13 19 11 5 8 -29 2 -29 16 52 -52
4229e2L1J4mj1R3p8l9O6n0J0N2q4MR7l5m0m3J11p2nL3k1k4N2k8NL0J9o5K9Kj5
$$ -52 -21 -7 -11 -22 71 -7 -46 20 -30 -20 32 -52 -48 49 14 -26 -69 42 -30 -35 -2 -23 -47 5 -23 -18 12 31 -34 -5 -3 -18
4261a8L5%k6K6k0l2j8K6nMK7oL7ok2j8N7l3M0q2L4j0K0jm6J3P0l0p6P6J2n8M5
$$ -18 17 17 -9 17 -3 -35 -53 -27 -32 -28 -1 -7 30 24 2 -16 41 8 48 -34 0 -10 10 9 -37 -24 46 16 -60 16 28 -30 15
4294A5L7n7L4l3m4O1j4J2k3K0o2L9j1Q6p7K7n3lO7K4m9j3N1q1qM1K9j7O0r8L8
$$ 15 52 -5 29 -4 -48 13 -1 11 -12 8 -54 -15 -26 60 -17 10 -43 -46 21 45 -4 -17 34 -47 -55 -14 15 -2 58 -40 -2
4325bM0m4K7Lp0K5N7k1KJ1o0m1J01QJ3k9%l4k7P4j0n0Rj2j0%J8PL2l0j9K3j5Q
$$ -2 38 -6 21 24 -46 -21 36 15 17 28 -32 -73 28 36 49 20 20 -14 -41 33 23 -27 -18 -30 -40 -40 -22 -15 17 -13 -32 -9 -24 -16
4359a6lMlOK0k0L5l5K3m2O5J4n7J2OrJ4k6J4J0Ml5J3kL5m2j9MJ9Pn6P8K1l2j3
$$ -16 -19 -15 -18 -12 8 -12 23 -12 11 -31 34 48 -9 3 9 0 14 -12 2 12 16 -19 -6 -8 27 -15 -34 -30 -11 -4 -60 18 39 7 -6
4394fQ2j10qP1m3ML4l3j7K3j6P9k3o0K8j2J04q7n6M1%J2k3%LM9m0M3o3L8l2J7
$$ -6 76 -34 -42 29 -14 -10 24 -9 -26 -3 -19 60 37 -23 5 -7 97 10 -46 -5 -5 7 -16 -16 -13 36 -4 39 -24 14 -18 -1
4426am2J0N9k5m8M7k2m8N3L6o4K6l0Q1m4k7O7l7l6M1jl0L5j3l4N7jj1L8j9qj8
$$ -1 -43 -33 26 1 -47 0 -22 -70 -17 19 -45 -19 -49 32 -12 -39 28 -9 -45 -4 -5 -35 0 -13 -47 10 9 -2 36 17 9 -9
4458ioM0o2j8L4j4j4L7J1q1M2M0KjO0m3j0k1J8l6k6N1k2LmL3rJ4j8kNKPk2N6k8
$$ -9 -15 25 -37 -55 -21 -35 -49 -12 -1 -82 -40 0 2 1 61 18 8 -13 5 -31 -57 -6 -28 -25 -29 4 -5 9 -9 -11 -6 -4 3 -19 37 9
4494IkNk8JOkkL8l2j2J9j8K0j0j3pL2okN1j3n9m8N3%j7k8N0N3o1qJ6L3n3K1J5
$$ 9 7 12 -16 -15 -9 -11 -13 25 -7 -19 0 -18 2 -8 -21 -28 4 -2 -4 47 34 -25 -73 -20 -20 -37 -65 -15 38 -23 -31 -15 18 -35 -14 1
4530Al1R1m3n1N3j6L5m3j3M9rm5K5K5n9pKqO8J2n9j3M2J9m3M2o5K8M5k6j3L8M
$$ 1 -30 61 18 -33 20 4 39 -4 -17 32 23 -22 3 28 -31 -38 -36 -44 24 36 -23 -36 6 25 -18 24 -41 -13 32 6 -7 31 35
4563C5l0k9N1m0L5k2Qom6K7JJ6j9O6j0m7K1l0L9k5l8M5l5K6LmK1K7llJ3n6MOK2
$$ 35 5 -24 27 -13 22 0 8 2 -44 -17 -16 0 -19 47 37 -10 11 -19 20 -5 -43 2 -33 -7 -4 -8 13 40 37 34 47 -9 -5 1 23
4598B3k6Nm9JNL1l5OK3k0QK9l1N8J1o0K3K1Rj1n1LnL3J2l2L0j3K0%k3nK8rj4k7
$$ 23 -3 2 -47 -46 -41 -10 -45 -39 -16 -36 -28 1 -30 28 39 -21 2 23 32 21 -30 -27 -32 1 13 -19 11 -2 18 18 -5 -10 18 9 -5 -32
4634c2N5Ql5L6r3N0J1k3j3M5J8p0K9J4QkJk3K5J8r3OM8J8j5l3k0O2N9o2QMM0n2
$$ -32 23 31 -4 32 -61 -11 0 -23 -36 9 27 -43 -14 0 8 6 7 -16 9 27 -66 -60 -12 6 -9 -42 -62 0 59 -3 5 9 49 -3
4668cj0J4o2J08o0Rj1OKk9O7Pm0l8L0M4mRj9j3N7p0J2J7p0O5j4rk7O8k5L3m6l
$$ -3 -13 1 -61 47 -13 -4 -15 -9 -7 -36 31 38 -2 -40 -10 34 30 39 20 7 64 -6 6 23 -47 18 4 -5 -32 36 11 44 -2 -5
4702eK0Lnk3l3K1J3N8k5j3lN6n2J3J5n8mL1l3N0Jm0KM6k3k6j4K4m4L6N4p2MM2
$$ -5 15 18 13 -10 -43 -22 -9 49 24 11 8 64 12 25 40 -18 -22 9 -24 26 27 -13 -11 35 12 -14 -28 -4 -48 -12 42 -30 -26 16
4736A6n1RK4J5p2L5R1o9J2M1p7nR5q2L0Jj9j0Q8j06J0L7m6K5Pk7J5J5P7j08N4
$$ 16 -35 -26 -2 13 -59 -24 67 -2 10 51 -26 -31 64 -18 12 13 -6 -16 72 -34 -24 13 -33 -8 -1 -28 -13 2 79 -29 25
4767B5K3m8K2l8Pl0KJ3K2P6n2Ql3m2J7O5k6k9J0J1J4p6O7l7N8j0l4M6n3K0k8K3
$$ 25 48 0 22 -16 -9 -39 -37 -24 -2 74 22 30 -3 -45 -28 37 11 -18 -8 3 17 -59 8 -29 29 19 -15 31 -22 -2 -30 -7
4799gJ8m1M2L0j23J14J1l2m8K5L6m9LnM1Lk5KK1K5o0m0J31j06O9o9J9qL3p6O8
$$ -7 11 -30 12 42 -81 33 44 12 -36 -11 25 -24 -21 -26 15 18 -7 -5 16 41 -19 -59 72 -34 35 -34 -15 -23 10 -66 2
4830Bl9L1nO7k1o6P4q2K0l3K7L9l4K5m3L6k3m0O7L4J3n5j3J6m9Q0l0l5ML0l6J8
$$ 2 -37 -6 -11 56 35 -31 43 -39 -19 -52 -25 14 -20 5 -38 -2 -25 -65 2 36 49 -6 -19 -3 -52 28 -2 -37 -33 -3 -39 -21
4862b1O2J3j1k7m7O7k5O3o1n3kO2K5l4m2M5OLK5l5K1K7m5J6k1jn7j2N4rJ7J4l0
$$ -21 41 54 43 16 -31 36 11 74 13 -40 -42 20 45 11 -31 14 20 23 48 13 34 61 16 32 11 10 -47 -59 -5 -14 3 17 -13
4895a3l7L4J7jJ6lK2j2j8NJ2l5QM3k6J2MKo1J7L6op0N2nRJ5m7M9k4PMl1N8m4n4
$$ -13 -50 -16 1 0 16 13 35 23 5 10 22 -13 -5 38 12 24 28 30 -31 -14 22 16 -54 -2 -7 2 17 -30 19 -5 2 6 -25 33 -11 -65
4931f5M9J0K3lOJ2j9J0qrLj4J5l1j8K7n4M1M3m9QN4oK4m8Nm2L9k7P6r5M2j1M8
$$ -65 -16 -6 17 14 20 32 13 23 15 6 9 -5 10 -21 -39 -12 -66 -25 18 -31 -23 31 25 49 1 6 -36 3 -24 52 -43 -1 -12 36
4965C6j4n3MP0l3qK5k9pK5Qo9K1K7l9l5N3J5J2o2N7m9P0m7N5k1n3jN6J6m2M2l7
$$ 36 22 -31 -27 43 10 2 27 -2 -9 16 24 -45 -24 3 -36 -71 -18 -3 9 -53 4 -45 25 -22 33 12 -41 -42 14 30 -12 30 -7
4998gJ2k2M0j6k4k1L6J2L1m3k9N6j3l5o6J06j6j1j5Nl5P1k8K7j7j5QLK0Mj2K2
$$ -7 5 -17 23 7 -17 -38 -2 10 41 -2 -31 25 12 -23 -89 17 1 -10 -25 -20 -55 16 -12 15 -2 -17 -9 -6 14 18 6 28
5030B8q0N8Kn3K4J5%J2Nqm1M4j1j3K1j4K6nM6n0nL9l4Mnk0kM8on9N0m0K0K7Rj06
$$ 28 -52 6 8 -45 -21 -6 -6 6 11 3 -38 6 -5 -18 3 -11 15 10 56 6 1 40 6 10 5 -15 -17 31 25 -34 16 -24 -4 23 32 -74
5066g4P7N1q3O3qj7K4n3QJ1K4j9M1n0k1N7j2o6L6J4j1P2n1J9j13N8K2m2N8L3p2
$$ -74 3 54 -29 34 26 9 33 -20 -12 -1 23 4 45 -5 -26 31 19 -47 -11 3 -8 64 13 32 -81 -23 -1 -43 15 48 -24
5097b4k5J05l6p8P6l8jM6p3kM1l%k2M1m0P5j7o2O6N5r9J3KM5o5JK6q9M6J0k6O9
$$ -24 -49 56 20 -58 18 -20 -21 25 -48 -50 -9 -12 -12 -34 7 -33 42 25 -37 29 84 -15 -2 0 45 -20 -19 7 -82 -36 -26 -52 17
5130A7l3K9k3o8J02m9O2o6j2Q1m1j5O2j02nM5Q0j17O3J2q0P8k9lj5j3K5N7j7l3
$$ 17 -16 13 -10 -78 24 -25 37 -29 -41 40 -1 -16 46 -56 -61 -16 64 -53 10 22 -58 20 -9 -12 -27 -40 -15 42 25 -8
5160hj3L3l1j7J06r5k1PQ9rj2mp3N2J2m8M7J8q5M8N1m8k1j7O4l3J4Rp2J08n6r9
$$ -8 -21 12 -19 -36 70 -25 -46 -39 50 41 29 25 -48 4 16 -32 15 33 -52 -4 47 -1 -22 -39 25 -8 6 15 -57 51 -5 -104
5192a04J17K3p1J3j6Kj3P5k1l7P9o6oL8m9RJ21o3k6m6P7l3M4n0N1p1J0p2N6M6
$$ -104 13 36 -35 -22 -38 -36 -49 26 5 -32 47 -19 -25 13 -36 -27 94 31 5 -41 36 3 47 -3 48 -23 -13 -85 -29 17
5222A7m3j3L5Rl6N3rq2j0Q4k5Q0l0r8Q0Poq2J16p0L9K4pl8k6J6K4%K5m8pK8l1
$$ 17 -26 -39 -4 5 -31 22 13 -69 -79 5 -20 60 30 -68 12 19 13 -69 47 -23 16 40 33 -5 -31 -15 9 9 34 -14 -21 7 -24
5255b4M6Op8K2R4p8l6O2k1p8O3J1p2Q1P0j11oO0k8K3L2mn0J7k2k3Q5rj5jj9JL0
$$ -24 22 28 -50 -28 66 -12 -48 14 -7 -85 -22 -11 -83 -2 68 -43 -49 11 -17 6 38 34 -16 1 -21 -44 41 32 17 16 -3 -2 28
5288B8k3j0NP1q5pP5m7k1k5QN5m8ml4J00j18Q3%k4LJ5L9m5l3P0pL7k9j5Lll2L4
$$ 28 5 -5 0 71 -14 -21 54 7 -14 -39 -31 24 -24 -28 -62 38 -80 3 3 -21 -18 -3 36 -9 -42 28 21 58 29 14 17 14 -18 16
5322A6j9Mk6m6P3k4KJ2m6N5ok3O2k2K9Pj7l9M6qLJJ6q0k9P8L7j14kJ03p5K8L7
$$ 16 -3 1 -25 -71 2 -22 -20 -8 -54 1 -5 -28 34 12 41 48 31 -8 38 30 33 34 50 -30 -59 19 56 -58 -60 43 -32 -4 33
5355C3Qq4Q6q6J02p3k6J3L8j6mMO9o4l4P1kn5L7pl8KM6Npj3j0O5r8K5Q5o5KKK
$$ 33 41 -43 43 -43 59 -14 -40 -27 11 -5 -9 -5 64 0 -34 37 35 -20 17 10 -28 -26 20 25 18 5 -5 60 -38 -13 72 7 9 11 13
5390A3l3J3J0r0L6J4L7j6j5K1k0O1jm2k7Q8m9j4J1K2o2P6j2j8Oj3l2N2Rn8M0o1
$$ 13 -20 -7 3 -87 -51 -37 0 -16 -31 -10 -30 31 30 -12 -39 49 0 -14 -3 19 -43 33 21 3 9 -4 -36 16 25 -33 7 -54
5422e4N8L1l1m1M3j4k2N1m1j5O2m8mK6K4m6j2P4m4l9jL4o3M1Ll4N5Qp8R2nj1K1
$$ -54 4 35 4 -37 6 -8 -30 21 -20 -35 27 -21 -25 1 25 -21 -33 41 -3 -42 -43 -9 -72 -31 -28 -62 -7 1 -77 15 10 -1 20
5455B0m2J6J8jm2N7j4j6J3j1K0Kj8j5O5o7kNN1k6j3J2Jp2M8qk6O0p1L5K3J9o0
$$ 20 -22 -6 12 11 -31 26 12 -4 9 -2 18 20 2 -13 52 -15 -17 -12 39 13 0 12 13 -59 -11 -19 -45 15 -56 -21 2 21 -39
5488c9N2m1K8j5j5N6m1MK8n8K1K3JL6n2K0m4M0j5j2m3R4q4N7Ql3J0K4l7qO5p3
$$ -39 13 -28 0 -15 -30 26 -15 -11 17 -41 -20 3 4 40 -12 8 -36 4 -11 -23 -66 28 -56 1 9 -24 -14 10 -27 -35 30 -43
5520d3N1j6PK9m4N4l1j8J6jmLoJ3j9L4k1J7k4mkJ5j3mLj3j0K9o5Q7j3q7J11k9
$$ -43 8 -8 -1 28 -16 38 7 -11 5 4 0 3 -3 10 -9 25 4 21 -3 -7 -9 6 -7 -11 -8 -21 -31 -2 -67 20 7 -80 31 2
5554BJ9pnl8M1Ol2k2N8m7KL8mr5J37q0QM7l3l2N2l7MK1l9K5pL1j5MJ5On3O1j6
$$ 2 21 14 9 -29 12 18 -14 -36 22 -25 -23 15 11 -84 53 -27 -19 28 -5 -37 15 -22 -18 3 -36 -11 -18 13 -2 2 17 23 -30 31 15
5589A5m2K7j7L1J2l1rM7o5Mm1O2j3OM7l7J7n1L0nJ2Nk0k3N5Qj2J2jJ0m0JL1l1
$$ 15 -27 0 -17 14 26 -5 -14 33 -32 -28 -69 -7 -20 -14 33 -4 13 -38 -8 -13 -1 4 -16 -39 16 24 12 24 23 33 -7 -6 25 -6
5623fPk2L5pm4O0l0NJ5j0m5L4M2J0p2L1Om8K4l9J2P3p0O1K1q2j9N2Nm4K1M2j9
$$ -6 1 -21 14 7 -37 23 -7 -2 13 3 -42 -8 34 44 -28 3 9 -39 -15 -54 -42 31 -39 22 43 -39 -58 -6 -1 -45 -24 18 -1
5656alL6n8M6Mm1KJ1K9l7ll5K9L1l0PJ4J6q0P1k0Npj3M2rJ7l2kL8k4l4NKo0J40
$$ -1 -4 32 -26 20 24 -17 -15 -4 25 -12 -15 -50 -21 10 -20 -13 1 17 -63 8 -12 -7 -14 -27 15 6 23 -9 -11 27 3 -31 -26 -24 -84 56
5692E6n3j1l4%L2M1Mp6N0Lk5oK4m6j5R4k9m0N2nn3QK5N9o9J3JPm4J1L6L5q0L5
$$ 56 3 -8 -42 -42 -10 31 35 -41 9 12 -13 -19 5 -41 -56 38 9 -31 21 16 -37 -29 -4 55 -14 -1 0 7 -37 -26 10 45 -35 0
5726@k7L3n0L4L6j1m4O7o8J1P4p6M0rj1j6L4JOnM2r9Q4j0m7K3Ro2KP3r0R5l1j6
$$ 0 -27 6 -44 -10 26 15 -29 38 -30 -19 55 -21 19 10 -1 -17 17 18 24 19 61 -38 46 36 -11 12 21 -41 -39 34 -56 39 8 -8
5760hk4J4j1oJ6K8l0M0m4rN0q1L2M7rN9r1%Rp7J26j0l1J9m3j0jQN5jpp2M6k4K4
$$ -8 -32 -18 -29 -35 -19 9 -21 19 -25 -34 16 -65 -33 14 5 64 -27 -27 -18 -95 31 21 -10 9 -34 -44 -45 -37 18 17 10 -62 -16 -40 -16
5795a6L0j4KPl1M0o3K3K3nL3m6o8J01o1L3J1j2o1P0L4o4K5N8o0j7M4k2j3L9oN
$$ -16 14 0 2 9 -22 18 -45 -22 1 -4 29 -17 -85 16 -45 -12 -1 -13 -74 -4 30 -34 -9 49 -11 -28 16 -6 -19 20 14 19
5827A9k3m0N3kn4J2P0o2J1L0j6lj8N3j6mnj7k8M1k2L5jn2Rm9J18p4K1K5k8rM6
$$ 19 -4 -44 9 7 -47 -35 35 -27 -16 14 -2 -5 -23 30 14 10 5 -12 -40 1 -21 14 13 -39 -30 -79 39 -35 -14 11 -17 -26 20
5860B0m4J1k3K5OL9l0KrM1n1J9L5o6N4Nm1nN0p5J4K6k7J5ooM9ok8j4QNl6KM9m2
$$ 20 -24 -13 -36 -11 -5 34 4 6 -3 38 -13 6 41 -25 29 34 -7 -12 38 -37 -23 3 -24 -9 -15 -21 28 22 -6 -20 -12 -7 -43 -41 8 -34
5896c4QL6%P9o4k0j0K1j1kJ0j4O2l4Pp6O2rj1m4M6m8J3K5l5J4L4LL0r1K9J5J3
$$ -34 -26 10 10 89 25 5 -5 16 5 3 13 -1 61 27 34 -42 20 11 0 -44 2 -46 -33 -8 -43 -29 5 8 38 -53 -24 -9 4
5929DQmJ9l1k1M9l0k2M0k4j6J1j1P5r7O4L2m7K0o1j5O6l3j6L2k2O3j5l6j1J8r
$$ 4 12 8 27 -4 -25 24 -6 -28 12 -12 -28 -17 -28 47 -50 14 46 -1 19 -42 -57 9 -24 -40 -8 -30 33 18 -18 -29 -11 -20
5961b0L4Pl8pJ6K3J0k7K5l9K4o5j5L8O8l2m6J9QJ4PK4k7l3MN2j16R6rl5P6j8K3
$$ -20 14 21 -17 -24 -8 15 25 -2 23 -16 8 -57 -72 -34 34 2 -44 -25 -17 -3 4 28 1 -32 -28 24 -92 4 -5 -40 36 18 41
5994D1j4n5RL2pL1n9Q4r2L8J3J6n4K0j8Rj8L8n0N1l8L6Ko9K8j1ml1k5J26k3k5
$$ 41 27 -28 -19 13 6 37 -22 62 -30 8 21 37 -17 3 -15 -6 -24 14 -36 15 -23 13 15 -54 -26 -37 -41 -72 -97 29 6 -19
6026a9ONJ0Q1p6N5Jo2L3m6Jk5L7Mj3J6m0L1O3o0n5Q0l2k9M7J0J3o3L7k5l0k2J0
$$ -19 -13 -8 2 83 7 62 63 1 34 -12 -11 -36 1 5 -8 8 -32 -1 62 2 -53 27 -5 -34 13 23 36 -27 10 -15 -45 -67 -57
6059e7Q7q8P7j8M0n9P8o2K4o6J9mM2JRk7m6N9k3K4J6n0j7L7J2J1mJ9j8k7J4m8
$$ -57 30 -58 19 1 41 -18 60 -2 22 -44 -25 -29 13 14 23 -4 -50 9 -14 10 26 -24 -41 -4 8 19 15 34 16 -11 3 -45
6091d5N3nO4q2N7%j03L5J7j4L3l5J8j2J0L6Jk3J1L9o2J8p7P5n1Q7pm5K1o8N1J0
$$ -45 8 3 67 -15 42 42 -61 -26 -9 -23 10 -25 -7 -19 -9 27 28 5 16 55 -7 11 -66 9 -42 45 38 -7 14 -54 -3 7
6123Gk1m2P4m5P1p0kJ5j1j8K2ln4M7l1L1MJ4Ok2J2M4l4L0k0p3Q5J9l4PJ9q5M2
$$ 7 -14 -56 18 -27 44 -26 -28 -13 -24 -42 -20 -23 -77 -30 -61 -30 -26 -12 -6 -28 -16 28 -6 24 4 -69 16 35 1 8 27 -58 -16
6156a6j8K1M4l5K9jnk9Lk0K8k0J2Kk5N8o6J3L6Ml4N1j1o7J6L6kkL7j4l9M2n8q
$$ -16 -34 -13 31 -4 25 24 19 -10 -7 -27 1 -19 -7 -5 -30 28 -38 -25 11 15 -19 32 21 -46 -30 6 4 2 39 25 -14 28 -30 -38
6190c8K9Rn2O3J6k5j3Qj8qK1n3L0k6lL8P6k2o5O7l0mJ2Mo0J0K5J2j5j7J9k6J2
$$ -38 -9 0 -52 11 27 2 -11 -3 -21 -29 -8 -61 -31 -57 -60 -22 54 32 -33 34 4 0 12 16 -44 -34 -9 3 -12 -29 -10 -36 -24
6223b4Ml4L8k0m4J23n7qK2Ml7O1Mq7N0nq5N8L0Mj8L1olJ1Ko7R6o1MM4K4j14R6
$$ -24 -20 -54 -16 -36 -80 43 -14 -22 0 4 -33 28 32 -55 -5 -10 -95 -37 -7 -3 -21 10 4 1 12 14 -53 43 -18 -14 30 54 -60 36
6257C6m0j2K4nk1j0j6J1O4J0n5K8o1Q0m3K0n4P8Ok9J3j2j9k3J8N6m1k1K5jL2l9
$$ 36 -4 -16 8 3 -18 -28 -44 -33 31 41 -14 14 -47 33 -10 10 -44 34 40 11 24 12 -7 -30 -12 44 3 -18 7 6 38 -1
6289aKOk6pRJ7k0m0M2N0m0L2j6pjj1rk6J6L2J5j9J5Jj0K9o4O4k0o1N1L5m1n0R7
$$ -1 1 7 -19 -26 -17 0 -20 -60 -18 32 -8 24 8 1 0 -11 -20 -46 -30 2 17 -2 13 14 4 33 -31 33 13 -48 3 38 -3 -53 44
6324D4l3n5O6k2J3J0n4M4L1k8pj4J3jjl0rQK9j9L4mn1K2M8n7J8lj3j7P6j8k9o
$$ 44 11 -44 22 0 13 23 -31 13 44 16 9 -5 8 7 6 -24 -33 -25 4 -15 19 15 -36 -14 34 -23 -5 -8 -21 -38 38 20 -9 -15
6358a5oL4k6L2l0N2K2j01O0k6jj9P7n5K5l4K3p2M8jk7L6kK1j5K6k2nj8mK0jj6
$$ -15 -21 13 -13 19 -11 41 63 -38 22 -4 -5 -24 53 -2 23 -11 12 -60 -12 -13 -40 -4 -6 15 0 26 4 -1 -19 -23 -3 -4 -20
6391b0QqK8j8k7N6k8K7K0l9L3rLOJ2n0l0Q6o3jj7j6jQ0o2M8n2L2qK9j8l1lk2L8
$$ -20 -12 -20 8 -10 -37 19 -9 18 38 -1 32 23 26 32 44 -6 -36 50 -13 -14 -31 -47 -48 32 -30 18 -34 -2 -10 19 1 -30 -33 -55 -17
6426a7RN1m3k7M1Jo3LK1mlK0RLNl4K8J6L2n6M7m0Nj0jK7k8J7K%m2N2jKj8jN7n0
$$ -17 -8 43 0 -27 14 15 -48 -45 -24 -28 -31 -11 -2 1 6 -28 0 16 48 -8 39 -1 4 -6 -7 20 -8 9 11 11 -31 21 20 22 4 3 60 10
6464A0K7j1l7L3Rk3l4M8k9n2J05p9L0j0J1M1l0m5QM0n1jl6O4J1Mj8J9Oj0oN2o
$$ 10 37 26 -11 22 31 8 -26 22 -7 -59 46 -33 -3 -13 -2 39 9 -36 -28 12 -39 -40 -76 -12 -1 3 -15 4 10 0 -6 46 40
6497D0m0J1l4j6L1L8j0j9o4%P4l3O7r9K5M0Nk7j8L1J7l9L1l3K8l7J0KNJ2J7j8
$$ 40 0 11 -23 -39 -8 30 20 1 -63 -63 11 -22 45 -54 -29 11 16 -11 -29 2 19 -20 11 -22 6 -31 -21 -19 -14 -2 15 -3
6529cN3l0m8Kk0Q9p5K3l1jL1K0q0P4Lm3J6JK3k1M4on5N5Ln8M8o8P6J3m5J8j7K9
$$ -3 50 20 -28 -26 -46 43 -32 -9 -40 -41 -10 10 -70 4 7 -36 -20 -19 4 -17 27 21 -34 21 24 -34 14 -54 22 35 -10 8 -9 20
6563B0l1mmOOj6L1k1%M6k6K4J0q2oN5J7r6Q6j2Jl4Q9o0kJ1k6j4J0k5J6L3lJ4n7
$$ 20 -11 -15 -19 -13 -7 -23 8 -13 -13 33 7 31 41 -41 -47 8 25 -71 15 3 4 -30 59 -1 -3 8 -18 -32 -22 -47 -31 2 -1 13 -44
6598d4M1p4J00L1o2rL0n5N5J7l5l4M3K2lm6M2Npj0m1j1O0j5k7L8NK2m0j0k1L4
$$ -44 -3 -77 23 54 -8 -17 13 -42 13 30 -5 -39 4 26 23 -23 19 24 17 7 -34 -45 15 0 -27 11 16 38 -2 -12 -33 1
6630Al6jL7q4Q8j6J9o6K5qj2M7L5n2k6N0k4l6L3N6K5k1J2p4L2L2o3K7mmJ3k3l7
$$ 1 -35 -36 1 -83 5 -11 8 -58 -33 -41 -53 -6 29 -23 -49 1 -23 -59 -26 30 55 34 46 -28 4 36 -27 0 -4 -8 5 -18 -55
6663e5L8K1Mo5R6o8jQ5n1%m5j0lM7j0j0kK3J3Mqn7J7L3Lj9J16j03m1O9n6L8NN
$$ -55 -17 4 8 -57 39 -29 -30 55 4 4 -41 -51 -54 -7 -17 -27 -29 -6 7 11 3 -54 -37 -4 -1 -20 96 -7 -48 21 -35 3 8 13
6697A3o7Q8j7j5j1O4j24M5P9n4n2N4k4j6N2Rj0J8J0l7J1j9l4PJ8k7K5J9l9M1L8
$$ 13 -54 34 17 2 -9 55 -69 -24 55 1 -51 3 -21 -37 15 24 14 32 42 5 16 -3 -37 -30 -12 -39 -14 5 -34 7 45
6728D5m6K0nm0K1JNj9O6m1L1k7J9m7K8l2JO3l2K2m8K9l8Jj7L7k9M2j4j2m3L4j5
$$ 45 -1 19 14 -26 -5 -4 1 -18 48 7 38 11 30 -17 11 -21 -20 43 11 33 -15 14 -24 -23 -40 -3 -32 10 -4 -16 -59 -25 -40
6761d0M2J0m1J07r5j0j8P2l3J7k7M4m4L4L5p8M2K6r2K4Q1m6j6J9m9K7N1r4L6O
$$ -40 2 12 -29 78 -17 -27 -45 27 -6 11 -16 28 -16 18 53 -25 17 43 -49 -25 56 10 -6 13 -36 -9 42 -52 -16 -10
6791a0Rj4K2k2K0rJj2l2Q8k8j3N4m7j5K7k4O9m0n5MM8l2NK5k7J0j6nj8lM3l5N
$$ -10 -1 -15 7 -15 5 -4 -3 -15 -47 41 13 0 54 7 -8 19 -5 64 24 -31 -27 21 -11 -6 19 -8 2 -14 -19 -37 -40 3 -32 -27
6825b7M1J9m9rl8O4J6Qj8L7k0o2K1Kl7M9J1k9k8j1j2P8j0m4K8j3O0o9O1m7L0M3
$$ -27 14 33 -16 -25 -63 1 17 25 7 44 24 -38 -17 -15 -52 -3 8 -21 -49 -60 -72 6 -4 -48 -20 -33 27 -42 19 -28 2 45
6857D5o8jK2k4J2m1J16m9MMMm8P1n7J7M4l8j2J8j4j1j2JL7k6j5JRk5J9k3O8n2
$$ 45 -23 -24 -2 -26 -14 -55 61 12 16 20 24 -24 47 -10 7 51 13 1 19 5 -6 -18 -17 20 -6 -21 -20 -11 -36 -17 -40 28 -24
6890b4O3l0L2J0J0l7o9N6Jo1P7J6l3pNl1K0j1%j0OK7n1N1j7K0J2k3j4J8n0N0L0
$$ -24 39 9 41 51 61 24 -45 11 12 -49 28 44 11 4 9 -22 -2 -13 -13 -23 -17 10 -41 10 -7 13 25 2 -12 6 -44 6 36
6923C6j1l2O0r7k1L2NL1M2p1K1l8L4K9m2J7n1O2mL7j4m7L8j2Pp9M7qN4j7k3J0
$$ 36 25 -7 53 -44 -65 -33 -28 3 45 -26 -5 -43 -9 20 -22 -5 -56 6 2 39 25 -22 16 4 11 -68 -21 -29 25 8 -15 -5
6955eK9k2j4J7k3N6o8pP6q6%N9k2m2K6Q2l5k8l2n0J27m2oQQl8MJ4j8L4j4M1jj0
$$ -5 24 2 -12 5 -18 38 -30 -37 39 -47 -47 12 -10 -52 -26 56 21 -7 -39 -89 38 -4 -10 -2 6 -32 -28 -14 -32 2 -12 29 28 18
6989A8j2L2o7L1j7M7j6K3n5%NJ4J5kKj5j4k5P7r1Q5o4J7Mk8L1Jl2Lk0M1M1m5O7
$$ 18 6 38 -29 2 -15 32 16 39 -16 -16 -11 3 18 16 18 3 -11 -36 41 -50 35 -29 -12 -8 -36 -5 -4 -36 -33 -53 -12 29 -16 51
7023E1r7N7Nm7J4ON5J8o9J3pQk5lK8n9M1j3K3kL1p5pK3K2K9r1N3j9K6j2l4P0j
$$ 51 -46 11 16 -31 -17 -11 44 62 -7 6 -1 7 -18 -21 7 -52 -11 -24 -1 -3 28 -47 -54 -31 -9 20 -71 -18 -37 -11 -23 -57 13 12
7057A2l9K4N1o7N3l5K1m4L4K0o3M7kpK0l4k8M1L4l9J8k3j4K8j8j7L4j1PL5o3m7
$$ 12 -27 -3 48 -19 34 -1 20 -24 10 30 -33 14 12 5 25 -9 -37 4 38 -1 17 -6 -20 8 -10 -27 7 -4 3 38 -25 -72
7089g2O2m8P1k9K9LnPk7j5J2Ql6R3n8l3O3MJ4j9qk8pM3l5K6J2m3kK0M7o9nlnK3
$$ -72 -10 -58 13 -16 13 16 11 18 -9 -24 -12 -4 -40 53 -5 -38 25 29 43 24 16 -12 -19 24 -11 15 27 -16 -18 2 49 -20 -25 -28 -33 -10
7125a0po8M3N0j4M%J1l6N9q0pP2k0k8K9kK0rL0k9j5N7m9j5NL3K9l1j2OJ5J2J0
$$ -10 -17 -85 -42 8 -6 -2 -2 9 -27 32 -48 -55 17 -3 -31 -2 -4 16 7 37 8 -7 50 1 -14 -9 24 53 22 10 16 31 43 53
7159E3j24R7L7j21M9n7J22n1l3j8kP1l4M4m5k8P5Pp9K8J2n1L3K4lk2O%J5JK8m9
$$ 53 -71 26 63 -58 -9 -66 56 5 -28 -46 -48 23 -11 33 -12 -40 35 42 -37 -9 3 -48 -15 9 6 -16 -10 -10 5 6 34 -15
7191a5L2l9JM0l7RK4k2j5K3JNq2J07o3O8m5%qOOj8PK8l4j0K5K0l2QLK2k2k3M5
$$ -15 17 -22 -21 19 -18 -9 15 -7 -22 1 2 7 -75 32 -31 37 -8 -8 -16 -10 -4 -22 -15 13 -21 -31 -6 14 -18 -10 -7 15 -7 -30 15
7226A5j0m0QK2Lj4MMJ2kJ9n1J5J8J7Nl0k8L2O4q2kk6J8K9kk6K5Mj1p8O0NM0jk9
$$ 15 5 -35 -27 -5 -2 -16 -12 -8 4 2 21 -30 -15 3 20 25 -5 -33 -1 63 -19 -21 -47 -29 0 -2 -28 -3 1 -10 -88 -28 -23 17 16 -13
7262a3M1n9PoN0l9J1qj1ML6lJ6j9MJ5o3kJ2k2L5ml6N6J6l4j5N2k5o3K5N1j3j4
$$ -13 28 -31 -24 -30 20 -19 -8 -16 -27 -23 13 10 26 7 11 26 -37 -39 -27 -49 -14 -18 -54 2 18 -16 -31 21 -4 -67 -42 9 -4 -18
$$ [...]
8191G
##END NTUPLES=NMR FID
##END=
