##TITLE=1H_DPAA1103
 CDCl3
 8 sc, 
 14.03.2022
##JCAMPDX= 6.0         $$ Bruker NMR JCAMP-DX V2.0
##DATA TYPE= NMR FID
##DATA CLASS= NTUPLES
##ORIGIN= UXNMR, Bruker Analytische Messtechnik GmbH
##OWNER= root
$$ XWIN-NMR		Version 3.5
$$ Mon Mar 14 10:39:14 2022 Russian Standard Time (UT+4h)  she@DPX200
##.OBSERVE FREQUENCY= 200.131346
##.OBSERVE NUCLEUS= ^1H
##.DELAY= (6, 6)
##.ACQUISITION MODE= SIMULTANEOUS
##.ACQUISITION SCHEME= undefined
##.AVERAGES= 8
##.DIGITISER RES= 18
##SPECTROMETER/DATA SYSTEM= spect
##.PULSE SEQUENCE= zg30
##.SOLVENT NAME= CDCl3
##.SHIFT REFERENCE= (INTERNAL, CDCl3, 0, 15.7039)
##AUDIT TRAIL= $$ (NUMBER, WHEN, WHO, WHERE, WHAT)
$$ ##TITLE= Audit trail, XWIN-NMR		Version 3.5
$$ ##JCAMPDX= 5.01
$$ ##ORIGIN= Bruker BioSpin GmbH
$$ ##OWNER= she
$$ F:/spectra/data/she/nmr/H-F/1/audita.txt
$$ ##AUDIT TRAIL=  $$ (NUMBER, WHEN, WHO, WHERE, WHAT)
(   1,<2022-03-14 10:38:00.35 +0400>,<she>,<DPX200>,
      <created by zg, POWCHK disabled, PULCHK disabled
       configuration hash MD5:
       00 E9 B6 7A A2 85 ED C7 34 08 36 98 17 FE 4E 26
       data hash MD5: 16K
       EA 7A 28 CA 3F FF 3D F4 87 32 46 A2 B4 77 C5 1B>)
$$ ##END=
$$ 
$$ hash MD5
$$ 7C 70 06 36 E3 A3 24 E9 D1 F8 41 AA A6 88 D2 33
##$RELAX= 
##$RELAX= 
##$RELAX= 
##$RELAX= 
##$RELAX= 
##$RELAX= 
$$ Bruker specific parameters
$$ --------------------------
##$DU= <F:/spectra>
##$EXPNO= 1
##$NAME= <H-F>
##$PROCNO= 1
##$TYPE= <nmr>
##$USER= <she>
##$AMP= (0..31)
100 100 100 100 100 100 100 100 100 100 100 100 100 100 100 100 100 100 
100 100 100 100 100 100 100 100 100 100 100 100 100 100 
##$AQSEQ= 0
##$AQ_mod= 1
##$AUNM= <au_zg>
##$AUTOPOS= <>
##$BF1= 200.13
##$BF2= 200.13
##$BF3= 200.13
##$BF4= 200.13
##$BF5= 200.13
##$BF6= 200.13
##$BF7= 200.13
##$BF8= 200.13
##$BYTORDA= 1
##$CFDGTYP= 0
##$CFRGTYP= 5
##$CHEMSTR= <none>
##$CNST= (0..31)
1 1 145 1 1 1 1 1 1 1 1 1 1 1 1 1 1 1 1 1 1 1 1 1 1 1 1 1 1 1 1 1 
##$CPDPRG= <>
##$CPDPRG1= <>
##$CPDPRG2= <>
##$CPDPRG3= <>
##$CPDPRG4= <mlev>
##$CPDPRG5= <mlev>
##$CPDPRG6= <mlev>
##$CPDPRG7= <mlev>
##$CPDPRG8= <mlev>
##$CPDPRGB= <>
##$CPDPRGT= <>
##$D= (0..31)
0 1.2 0 0 0 0 0 0 0 0.06 0 0.03 0 0 0 0 0.0002 0 0 0 0 0 0 0 0 0 0 0 0 
0 0 0 
##$DATE= 1647239879
##$DBL= (0..7)
120 120 120 120 120 120 120 120 
##$DBP= (0..7)
150 150 150 150 150 150 150 150 
##$DBP07= 0
##$DBPNAM0= <>
##$DBPNAM1= <>
##$DBPNAM2= <>
##$DBPNAM3= <>
##$DBPNAM4= <>
##$DBPNAM5= <>
##$DBPNAM6= <>
##$DBPNAM7= <>
##$DBPOAL= (0..7)
0.5 0.5 0.5 0.5 0.5 0.5 0.5 0.5 
##$DBPOFFS= (0..7)
0 0 0 0 0 0 0 0 
##$DE= 6
##$DECBNUC= <off>
##$DECIM= 32
##$DECNUC= <off>
##$DECSTAT= 4
##$DIGMOD= 1
##$DIGTYP= 9
##$DL= (0..7)
0 120 120 120 120 120 120 120 
##$DP= (0..7)
150 150 150 150 150 150 150 150 
##$DP07= 0
##$DPNAME0= <>
##$DPNAME1= <>
##$DPNAME2= <>
##$DPNAME3= <>
##$DPNAME4= <>
##$DPNAME5= <>
##$DPNAME6= <>
##$DPNAME7= <>
##$DPOAL= (0..7)
0.5 0.5 0.5 0.5 0.5 0.5 0.5 0.5 
##$DPOFFS= (0..7)
0 0 0 0 0 0 0 0 
##$DQDMODE= 0
##$DR= 18
##$DS= 0
##$DSLIST= <SSSSSSSSSSSSSSS>
$$ [...]
##$SUBNAM2= <"">
##$SUBNAM3= <"">
##$SUBNAM4= <"">
##$SUBNAM5= <"">
##$SUBNAM6= <"">
##$SUBNAM7= <"">
##$SUBNAM8= <"">
##$SUBNAM9= <"">
##$SW= 18.0517287032376
##$SWIBOX= (0..15)
0 0 2 0 0 0 0 0 0 0 0 0 0 0 0 0 
##$SW_h= 3612.71676300578
##$TD= 16384
##$TD0= 1
##$TE= 0
##$TE2= 300
##$TE3= 300
##$TEG= 300
##$TL= (0..7)
0 120 120 120 120 120 120 120 
##$TP= (0..7)
150 150 150 150 150 150 150 150 
##$TP07= 0
##$TPNAME0= <>
##$TPNAME1= <>
##$TPNAME2= <>
##$TPNAME3= <>
##$TPNAME4= <>
##$TPNAME5= <>
##$TPNAME6= <>
##$TPNAME7= <>
##$TPOAL= (0..7)
0.5 0.5 0.5 0.5 0.5 0.5 0.5 0.5 
##$TPOFFS= (0..7)
0 0 0 0 0 0 0 0 
##$TUNHIN= 0
##$TUNHOUT= 0
##$TUNXOUT= 0
##$USERA1= <user>
##$USERA2= <user>
##$USERA3= <user>
##$USERA4= <user>
##$USERA5= <user>
##$V9= 5
##$VALIST= <valist>
##$VCLIST= <CCCCCCCCCCCCCCC>
##$VD= 0
##$VDLIST= <DDDDDDDDDDDDDDD>
##$VPLIST= <PPPPPPPPPPPPPPP>
##$VTLIST= <TTTTTTTTTTTTTTT>
##$WBST= 1024
##$WBSW= 4
##$XGAIN= (0..3)
0 0 0 0 
##$XL= 0
##$YL= 0
##$YMAX_a= 616622
##$YMIN_a= -402246
##$ZGOPTNS= <>
##$ZL1= 120
##$ZL2= 120
##$ZL3= 120
##$ZL4= 120
##$ABSF1= 10
##$ABSF2= 0
##$ABSG= 5
##$ABSL= 3
##$ALPHA= 0
##$AQORDER= 0
##$ASSFAC= 0
##$ASSFACI= 0
##$ASSFACX= 0
##$ASSWID= 0
##$AUNMP= <proc_1d>
##$AZFE= 0.1
##$AZFW= 0.1
##$BCFW= 1
##$BC_mod= 2
##$BYTORDP= 1
##$COROFFS= 0
##$CY= 11.3945322036743
##$DATMOD= 1
##$DC= 2
##$DFILT= <>
##$DTYPP= 0
##$F1P= 2.36226072786647
##$F2P= -0.459571619588291
##$FCOR= 0.5
##$FTSIZE= 0
##$FT_mod= 4
##$GAMMA= 1
##$GB= 0.15
##$INTBC= 1
##$INTSCL= 1
##$ISEN= 128
##$LB= 0.24
##$LEV0= 0
##$LPBIN= 0
##$MAXI= 10000
##$MC2= 0
##$MEAN= 0
##$ME_mod= 0
##$MI= 1.114404
##$NCOEF= 0
##$NC_proc= 0
##$NLEV= 6
##$NOISF1= 3.799351
##$NOISF2= 2.8
##$NSP= 1
##$NTH_PI= 0
##$NZP= 0
##$OFFSET= 15.70392
##$PC= 1
##$PHC0= -16946.3
##$PHC1= 12.60078
##$PH_mod= 1
##$PKNL= yes
##$PPARMOD= 0
##$PSCAL= 0
##$PSIGN= 0
##$REVERSE= no
##$SF= 200.130013532006
##$SI= 16384
##$SIGF1= 3
##$SIGF2= 2
##$SINO= 400
##$SIOLD= 16384
##$SREGLST= <1H.CDCl3>
##$SSB= 0
##$STSI= 0
##$STSR= 0
##$SW_p= 3612.71676300578
##$SYMM= 0
##$S_DEV= 0
##$TDeff= 0
##$TDoff= 0
##$TI= <>
##$TILT= no
##$TM1= 0
##$TM2= 0
##$TOPLEV= 0
##$USERP1= <user>
##$USERP2= <user>
##$USERP3= <user>
##$USERP4= <user>
##$USERP5= <user>
##$WDW= 1
##$XDIM= 8192
##$YMAX_p= 0
##$YMIN_p= 0
$$ End of Bruker specific parameters
$$ ---------------------------------
##NTUPLES= NMR FID
##VAR_NAME=  TIME,          FID/REAL,        FID/IMAG
##SYMBOL=    X,             R,               I
##VAR_TYPE=  INDEPENDENT,   DEPENDENT,       DEPENDENT
##VAR_FORM=  AFFN,          ASDF,            ASDF
##VAR_DIM=   8192,          8192,            8192
##UNITS=     SECONDS,       ARBITRARY UNITS, ARBITRARY UNITS
##FACTOR=    0.0002768,     1,               1
##FIRST=     0,             0,               0
##LAST=      2.2672688,     0,               0
##MIN=       0,             -402246,         0
##MAX=       2.2672688,     616622,          0
$$ Real data points
##PAGE= N=1
##DATA TABLE= (X++(R..R)), XYDATA
0 0 0 0 0 0 0 0 0 0 -8 0 -8 8 -8 16 -16 24 -24 32 -40 48 -56 70 -81 97 -113 129 -153 177 -204 234 -268 304
32 304 -344 391 -441 497 -559 627 -701 782 -869 965 -1070 1185 -1311 1449 -1598 1762 -1942
49 -1942 2138 -2358 2598 -2865 3160 -3492 3866 -4295 4785 -5355 6029 -6839 7833 -9092
63 -9092 10740 -13006 16322 -21686 31839 -58093 283149 616622 457604 497271 335572 242557
75 242557 141762 -10771 -187776 -224573 -326929 -402246 -377065 -332335 -324489 -206112 -107451
86 -107451 -57499 30532 118923 139089 218805 274489 221796 158809 130957 74295 58116 52612
98 52612 -12386 -59704 -49235 -74013 -84905 -42878 -27745 -25973 9209 558 -19535 12932 15837
111 15837 -10495 15618 19364 -21214 -18565 -9358 -18673 30412 77435 54184 57310 86470 58179
124 58179 42502 60879 26907 -9646 -16397 -78626 -136308 -116553 -117014 -140770 -115312 -102138 -109849
137 -109849 -60608 -7204 11182 68842 124284 112950 113339 132896 104620 82519 81922 36184 -7450
150 -7450 -20696 -71839 -119051 -104224 -95980 -106629 -92295 -89987 -95666 -54373 -12066 -920 29379
163 29379 54187 39619 39725 50237 32936 30964 38366 9620 -11854 -10880 -34491 -50601 -31989
176 -31989 -29450 -36840 -28880 -41590 -55081 -25573 -2477 -5314 8528 14009 -3349 5180 22163
189 22163 16884 27689 43043 26002 15823 23548 12527 6210 19098 10157 -8211 -11317 -27757
202 -27757 -43829 -27505 -15496 -21261 -17390 -18739 -29170 -16308 4000 10057 23222 33500 23503
215 23503 20790 28559 26447 29430 36813 24683 10688 7088 -2882 -5547 8482 12307 6935 7860
229 7860 222 -8133 3916 14424 13862 19169 15345 -1606 -3237 2836 343 4753 9765 -1898
243 -1898 -9411 -4775 -4083 3639 22115 25995 19145 20245 17178 12383 20919 26122 19091 14246 4827
258 4827 -12056 -15732 -9047 -7536 -6461 -5142 -10915 -14070 -6061 2399 11498 22505 24280 15228 8816
273 8816 6531 6653 9065 8104 253 -9767 -19419 -25241 -24684 -17840 -9673 -6477 -9441 -11161 -7060 538
289 538 9100 17036 18613 12574 5451 -1990 -7051 -3366 648 -4904 -13321 -20059 -25466 -25138 -17979 -11304
305 -11304 -7650 -5949 -8822 -14078 -10223 166 5248 6853 5107 -2544 -9023 -10331 -9179 -5674 -2216
320 -2216 -3989 -12528 -18902 -16917 -12168 -6574 -718 -854 -4708 -6955 -8360 -5900 1948 7827 6296
335 6296 -973 -6922 -9726 -9864 -6134 -3492 -5508 -9395 -14931 -19106 -15267 -5461 3108 7021 7031 6479
351 6479 6121 9589 16403 19837 19830 15423 3610 -6908 -9788 -9386 -10039 -10547 -13724 -19914 -21464 -15021
367 -15021 -7157 3855 17325 20943 19346 22232 23685 25127 29982 29183 19298 8596 -2104 -13307
381 -13307 -16629 -12363 -12298 -14325 -13297 -14967 -12016 1219 13089 21798 29590 29095 24161 23448 22582 21137
397 21137 20659 14999 3421 -6965 -14268 -18575 -14557 -7530 -6654 -5197 -3612 -5601 368 12389 16842
412 16842 20192 21260 11773 5010 7803 6788 5754 10056 6296 -2412 -2155 -1277 -2128 7647 13897 6080
428 6080 3160 1554 -7485 -6190 -210 -6145 -9740 -9590 -19459 -23809 -13677 -8596 -5011 5100 5050
443 5050 -442 7035 12028 11894 21997 23074 8635 2231 -1207 -10268 -7818 -5008 -16049 -20402 -17900
458 -17900 -25424 -25301 -13500 -11507 -7999 2844 -2567 -9362 443 2961 1669 13572 10605 -5317
472 -5317 -4741 -3604 -9079 1953 6720 -9336 -11409 -4663 -13680 -12375 -2280 -10963 -13647 -3276
486 -3276 -13264 -23446 -10741 -7874 -8663 7261 7230 -6854 1330 10472 7888 20401 24634 3867
500 3867 -2063 3007 -6850 -8077 -3199 -17471 -24110 -14776 -20823 -25084 -10963 -6219 -2720 13753
514 13753 13906 5653 16190 21937 19839 29591 25239 3292 -1103 -1823 -11206 -5424 -2398 -19165 -19897
529 -19897 -9410 -14885 -7335 11405 8494 10131 25061 16612 8660 22438 18487 7217 15933 7061
543 7061 -14853 -8979 -5577 -16791 -3793 7593 -6092 -1258 13183 5322 13327 34383 24759
556 24759 15370 21350 5726 -6070 6888 -90 -18299 -13974 -19496 -32995 -16866 -3248 -8376
569 -8376 5877 20790 14112 23746 36945 26157 27795 39696 25402 11082 6824 -13527 -24865
582 -24865 -13895 -20061 -34042 -30382 -33994 -36465 -13461 1469 1969 15958 21972 15047 27486 36044
596 36044 23153 22232 23064 5176 -2371 -5543 -24514 -28144 -15565 -22777 -28682 -19215 -23122 -21389
610 -21389 2593 9203 5249 17320 14281 55 9990 15432 1898 2806 1630 -16136 -15852 -8691
624 -8691 -20619 -18031 -1617 -7905 -12388 -1204 -4827 -4553 13152 10574 -1186 4835 -541 -14440
638 -14440 -7060 -3261 -12510 -7304 -5653 -18128 -11420 1762 -4344 -780 11634 5029 1397 7740
652 7740 350 -564 10782 2935 -10640 -8377 -12578 -19160 -9145 -5285 -9589 -1583 1708 -6132 2719
667 2719 14986 10693 11907 15116 5630 4623 8158 -2038 -4044 3968 -3369 -13228 -11025 -12915 -12301
682 -12301 -97 2590 -1015 6799 8374 1959 9741 17035 12758 13362 10526 -113 2379 7969 261
697 261 -1626 3275 -2411 -7046 -3989 -5655 -2160 8954 7334 1561 6888 6583 2354 8254 10352
712 10352 6160 8564 5022 -4249 -73 7050 3081 1977 3056 -2800 -3909 875 -1264 837 10279
727 10279 6676 -936 1778 2746 1706 7001 6240 1531 3743 3266 -3279 -777 5515 3574 814 -1011
743 -1011 -6700 -6928 -1602 -2041 -1935 2873 866 -4038 -3576 -1352 1996 6201 4288 -249 525 839 -930
760 -930 -23 1655 95 -2083 -6292 -10567 -8001 -3503 -2556 -2070 -1946 -4107 -4723 -3845 -2916 853 4450
777 4450 1396 -3317 -3070 -2240 -1788 -49 -1355 -4041 -4824 -7363 -9935 -6764 -1637 -863 -1700 -2831 -5276
794 -5276 -4438 -1576 -666 650 2600 764 -3184 -3541 -1639 -117 747 -1012 -4558 -6060 -6078 -6177 -3956
811 -3956 -564 261 -1218 -3192 -3927 -2087 1181 3576 3791 3199 2262 828 2 1444 2979 2535 -657
828 -657 -4050 -5727 -4983 -2875 -538 239 499 -245 -1313 -918 2625 5789 7082 7108 5077 2753 2610
845 2610 2995 3134 3146 2056 -1118 -3972 -3853 -1931 300 3070 3668 2112 1602 2181 3186 5853 8191
862 8191 7658 5484 3327 1582 718 2034 2513 1301 -502 -2390 -3606 -1737 1175 3321 4692 4400
878 4400 2570 2118 2524 4242 6175 6390 4231 1704 114 -686 12 1438 1089 439 -453 -2829 -2549
895 -2549 494 2301 3135 3383 620 -1896 -1435 -827 -398 1597 1391 -2368 -3383 -2440 -2634 148 2747
912 2747 1061 779 2141 -235 -344 3106 3326 2036 1066 -2987 -6379 -4835 -4001 -4943 -3438 -3911 -7662
929 -7662 -6997 -4364 -3687 394 3029 262 526 2560 946 1592 4431 2419 371 -498 -5443 -8248
945 -8248 -4995 -4770 -6623 -4638 -6346 -9350 -5492 -2864 -3131 2144 4176 -189 888 3894 1392 3165
961 3165 6016 1613 -1023 464 -4918 -7312 -1715 -2668 -6295 -3288 -5640 -9316 -3378 -907 -3106
976 -3106 1445 3668 -1493 188 4109 1992 4311 8471 3193 511 3575 -83 -1562 4080 1687
991 1687 -2583 -735 -3579 -6630 -1051 -102 -3659 -304 348 -3328 -209 2723 905 5171 8717 3487
1007 3487 3052 5644 2168 4324 9250 3667 178 2302 -2536 -3675 2699 174 -4337 -266 -1537
1022 -1537 -5511 1062 2804 -1860 4106 7199 170 2910 6916 1178 4891 11667 4173 848 5095
1037 5095 -117 -1540 6874 2968 -4369 61 -2236 -7840 -346 1369 -5635 -1460 1082 -5256 -1022
1052 -1022 4461 -451 2411 8868 3301 1504 6566 2311 1075 8093 3959 -2740 141 -3118 -7579
1067 -7579 -1112 -1041 -7232 -3940 -3756 -8550 -2763 1893 -2072 1266 4981 -381 1155 5423 721 1863
1083 1863 7204 781 -3364 76 -4666 -6606 304 -2836 -8687 -3812 -5183 -9638 -2012 468 -4844
1098 -4844 -49 2355 -4032 -70 4636 -1067 1687 7654 260 -2493 2321 -2356 -2967 4747 -402
1113 -402 -7314 -2641 -4416 -8502 -1062 -719 -7894 -3674 -1590 -7047 -2135 3089 -2485 24 6255
1128 6255 705 -151 5135 1030 950 8019 3218 -3134 741 -1680 -4711 1713 983 -5959 -3169 -2567
1144 -2567 -6973 -1675 2466 -2497 -539 3242 -1569 447 5851 2355 2541 7361 2664 89 4293
1159 4293 1606 -235 4184 1869 -2502 433 -548 -4626 -173 1781 -2141 300 883 -3964 -754
1174 -754 4269 1848 3285 5523 480 849 5882 3961 3096 5955 2077 -687 3226 1323 -2605 923
1190 923 674 -3034 152 -200 -5305 -1751 2008 38 2283 3859 -1443 -523 5390 4118 3548 6094
1206 6094 1508 -985 3538 2182 -1241 1572 171 -4143 -1525 -1287 -4916 -2137 130 -2158 -369
1221 -369 1552 -1873 -1326 3315 2988 2549 3729 12 -1674 1848 1360 -680 646 -1171 -3949 -2610
1237 -2610 -2383 -3392 -1074 -349 -2486 -2031 -1122 -2224 -940 1222 366 688 913 -2527 -2410 411 -164
1254 -164 -917 -452 -2685 -3554 -1675 -2039 -2124 419 278 -1887 -1401 -1149 -1540 872 1712 -521 24 285
1272 285 -2142 -2121 -104 -723 -1228 -1477 -3604 -4082 -1656 -1402 -2065 -266 21 -1639 -1284 -138 384 2912
1290 2912 3644 1592 1224 1790 932 696 937 461 -458 -1805 -3500 -4236 -2541 -1647 -2341 -2137 -1862 -1525
1308 -1525 -700 673 2293 4833 5372 3895 3569 3335 3896 3796 2695 1238 3 -1182 -2866 -3767 -2601
1325 -2601 -2115 -2548 -2888 -3196 -2026 433 1652 2757 4855 5370 4701 3911 3663 4205 4567 3249 946
1342 946 -503 -811 -1706 -2515 -1852 -1427 -1545 -2062 -2597 -1539 845 2358 2403 2475 3016 2567 1826 1844 2279 2613
1362 2613 2164 105 -868 -328 184 341 52 -76 -195 -530 -1267 -864 261 783 287 -1091 -1914 -1498 -1045
1381 -1045 -1104 -849 715 1203 335 485 1577 2552 3446 2887 1287 775 516 -836 -1719 -1349 -2172 -3471
1399 -3471 -4666 -6072 -5609 -3620 -2747 -2450 -812 580 887 2132 3571 4040 5021 4700 1992 1016 813
1416 813 -502 -1434 -1952 -3447 -4750 -5209 -6395 -5766 -3371 -2075 -1941 -715 10 564 2441 2667 2319
1433 2319 3401 2639 -87 -144 98 -1015 -426 -383 -2917 -2754 -1797 -3004 -2259 448 254 -372 1059 171
1451 171 -606 1676 1478 -671 561 207 -2234 -1207 119 -662 777 1635 -462 -464 1803 956 1164 3277
1469 3277 1935 248 1104 -460 -1791 144 -811 -2734 -1574 -1600 -2811 -677 1028 613 2721 3722
1485 3722 1887 2517 4005 2876 3616 4712 1243 -284 349 -1959 -2521 -550 -2787 -4279 -2041 -2520
1501 -2520 -2758 902 1335 77 3432 4315 1710 3813 4890 2057 3947 5616 724 -194 1302 -2063
1517 -2063 -1808 1162 -2458 -4984 -1950 -2760 -4023 293 -135 -3042 537 1781 -995 2123 4489 1416
1533 1416 3739 6248 2170 1814 3861 665 136 2561 -1902 -5043 -2796 -4324 -5999 -2926 -3852 -6530
1549 -6530 -2505 -1392 -2580 1715 4016 2572 5356 7051 3530 4304 5288 1768 1258 1750 -3363 -5755
1565 -5755 -4276 -6744 -7483 -4387 -6292 -7225 -2371 -1776 -2093 3195 4502 3109 6580 6372 2548 4693
1581 4693 5332 643 498 569 -4799 -5312 -2729 -6290 -6374 -2443 -5201 -5607 -288 -1331 -2282 3241 3331 1165
1599 1165 4242 3555 -718 2746 4526 -198 344 941 -3498 -1683 2141 -1753 -2466 517 -2190 -2546
1615 -2546 1767 -872 -3444 525 200 -2123 826 -479 -4000 264 3450 749 1758 2365 -925
1630 -925 2232 6349 2810 1558 2517 -547 -599 2450 -922 -3968 -1768 -2986 -4111 -889 -2171 -4543
1646 -4543 -480 2002 1074 3578 3470 813 4189 7103 4078 3502 2973 -1253 -626 1890 -1994 -3638
1662 -3638 -2248 -4662 -4595 -796 -1752 -2580 1472 2043 1144 4658 4537 1912 4899 5246 1781 2147 1728
1679 1728 -3089 -2512 -1014 -4320 -4341 -2114 -4729 -4451 -238 -330 -231 4164 3695 1839 5034 4937 2729 4454
1697 4454 3592 -945 -804 -727 -4506 -4192 -2938 -5666 -5019 -2152 -3406 -2752 640 961 1644 4725 4184
1714 4184 2238 3781 3415 1755 2621 1261 -2493 -2651 -2565 -4142 -3296 -2848 -4490 -3392 -1488 -1999 -644
1731 -644 1495 1034 1671 3391 2143 1283 2457 1240 629 1629 -274 -2579 -1630 -2172 -2930 -1643 -1591
1748 -1591 -3269 -2196 -1043 -2071 -630 786 -314 308 1764 248 442 2001 1226 929 2248 1074
1764 1074 -420 676 479 -676 29 -441 -2648 -2332 -1764 -2720 -1976 -744 -1514 -1101 238 6 595 2460
1782 2460 2779 2275 3109 2539 1363 1759 1218 254 -52 -1021 -2488 -2390 -2212 -2291 -1281 -773 -840 30 870 1014
1802 1014 1946 2838 2654 2155 1932 926 342 771 -41 -760 -782 -1264 -1843 -845 -494 116 976 1405 1053 1421
1822 1421 1466 1113 1063 1191 -9 -590 -890 -1497 -1490 -640 -537 -199 443 883 1287 2062 2796 2508 2484 1855 551
1843 551 -417 -995 -2128 -2619 -2666 -3323 -3252 -2530 -1417 -312 1405 2541 3548 4254 4461 4369 4032 3167 1756
1862 1756 -108 -2291 -4024 -5219 -5698 -6066 -5621 -4746 -3745 -2115 3 2099 4192 5778 6192 6441
1878 6441 5932 5027 3310 1891 -316 -2541 -4335 -6185 -7503 -6980 -6276 -5538 -3750 -1836 -50 1986
1894 1986 3729 4995 6238 6374 5447 3697 2642 896 -947 -2395 -4102 -5248 -5474 -5705 -5350 -3737
1910 -3737 -2041 -778 734 2010 2693 3831 4283 3491 3303 2576 737 -670 -1507 -2515 -2636 -2748 -3128
1927 -3128 -2785 -1393 -827 109 1733 2260 2543 2922 2412 1104 1406 576 -1121 -1808 -2018 -3307 -3294 -2649
1945 -2649 -2402 -998 835 680 1482 3525 3844 4001 4331 3392 2130 1855 89 -1944 -2113 -2621 -4249
1962 -4249 -4045 -3875 -4120 -2734 -1427 -509 1393 3429 3223 3651 4862 4769 4639 4170 2062 702 682 -1486
1980 -1486 -3063 -2784 -3747 -4470 -3595 -3515 -3552 -1273 16 -111 2043 3510 2867 3768 4519 3029 3376 3804
1998 3804 1249 3 600 -1497 -2609 -1710 -2755 -3698 -2448 -2820 -3812 -960 190 -1230 532 2010
2014 2010 1209 2836 3830 1900 2293 3834 1739 914 1703 -455 -1758 -266 -1623 -3372 -2525 -3562
2030 -3562 -4680 -2215 -1127 -2576 -1197 -299 -449 2079 3542 1923 2467 3847 2748 2680 3215 922
2046 922 -212 597 -1503 -2920 -2505 -4210 -5101 -2722 -2599 -3291 -1789 -1654 -1522 1831 2819 1178 2491
2063 2491 3438 2043 3277 3782 593 305 1314 -1225 -2194 -944 -3446 -4048 -1220 -2021 -2966 -727 -1226
2080 -1226 -1894 1513 2332 33 1522 2268 302 2383 3189 -115 -146 1618 -1111 -1305 480 -1753 -2400
2097 -2400 256 -868 -2089 224 -229 -1661 1155 1479 -582 1004 1441 -506 1107 2188 -445 75
2113 75 1193 -1049 -986 976 -584 -887 894 -603 -1389 1056 515 -606 1214 352 -813 1366 1118
2130 1118 -687 403 616 -1112 347 634 -1594 -773 580 -344 705 1828 -320 -580 1686 954
2146 954 396 1816 -454 -1567 929 324 -1197 -23 -804 -2289 379 1172 -1272 94 1011 -407
2162 -407 1234 2364 -472 -702 1156 -266 -537 1196 -970 -2447 358 123 -876 1330 875 -759
2178 -759 1372 2202 155 947 1340 -888 -413 198 -2433 -2910 -1495 -2835 -2834 -780 -1551 -1615 1000 1432
2196 1432 1366 3552 3612 2347 3503 3468 1641 1503 689 -1823 -2320 -2842 -4622 -4619 -3626 -4282 -3721 -1718 -1706
2215 -1706 -298 2144 2251 2913 4446 4013 3357 3860 2732 1201 1161 -392 -2477 -2245 -2619 -4285 -3460
2232 -3460 -2769 -3283 -2056 -708 -1067 168 2165 1653 1905 3023 2022 1287 2420 1430 136 773 -174
2249 -174 -1590 -567 -633 -1736 -746 -473 -1116 -673 40 -836 -505 658 32 -446 646 -70 -368 804
2267 804 384 403 1059 889 294 843 1088 488 844 764 -110 -220 -120 -894 -845 -549 -1137 -1210 -621 -955 -607
2288 -607 217 391 234 961 992 1043 1383 1431 866 1124 706 53 117 -73 -678 -498 -434 -951 -865 -599 -783 -461
2310 -461 -38 -141 -190 204 41 144 692 564 385 672 735 372 634 625 592 664 552 -13 -77 -64 -605 -671 -619
2333 -619 -996 -1199 -845 -978 -679 -173 -49 346 762 750 800 1079 984 672 497 172 -265 -798 -683 -1204 -1101
2354 -1101 -853 -1040 -658 -139 221 665 1313 1337 1470 1489 926 648 320 -411 -1050 -1454 -2038 -2647 -2253 -2185 -1920
2375 -1920 -998 -194 413 1245 1928 2696 3062 3015 2632 1929 1214 240 -879 -1464 -2265 -3003 -3428 -3276 -3073 -2264
2395 -2264 -1421 -584 383 1357 1908 2524 2947 3048 2794 2182 1280 191 -370 -1376 -2101 -2129 -2405 -2607 -1969
2414 -1969 -1746 -1131 130 620 1106 1833 1947 2047 1886 1745 1109 628 33 -808 -1329 -1150 -1688 -1674 -1024 -854
2434 -854 -610 153 478 675 1414 1368 951 1149 820 351 41 -32 -744 -961 -794 -1031 -853 -450 -384 -86 804
2455 804 620 875 1249 1001 1004 1176 425 -43 -304 -552 -922 -652 -829 -1421 -895 -315 -642 268 614 334 1265
2476 1265 1599 1061 1004 1070 384 222 613 -140 -1066 -735 -1033 -1404 -470 -726 -1316 -327 135 -301 705 1252
2496 1252 470 992 1653 659 770 1161 49 -260 238 -524 -1377 -537 -1034 -1280 -372 -628 -1280 -299 49
2515 49 -447 363 817 295 839 1250 329 410 1096 97 -136 513 -646 -884 -221 -1056 -1235 -469 -1137 -1367
2535 -1367 -232 -438 -849 313 286 28 1251 1346 382 1092 1832 638 931 1250 -128 -274 443 -921
2553 -921 -1214 -555 -1700 -2052 -813 -1324 -1779 -266 -410 -806 777 1094 158 1517 2267 1125 1746 2141
2571 2141 191 764 1499 -111 -784 35 -1651 -1934 -719 -1727 -2255 -863 -788 -1498 177 341 -507 780
2589 780 1566 893 1720 1944 552 966 2141 591 166 608 -739 -1151 -199 -1199 -1786 -956 -1494 -1791
2607 -1791 -280 -119 -861 249 781 353 1374 1700 385 948 1777 628 584 821 -612 -570 382 -752
2625 -752 -876 0 -1107 -1273 132 -218 -694 423 19 -781 671 745 -603 420 618 -498 663 1123
2643 1123 -427 392 1374 102 119 1366 -169 -462 622 -447 -1346 -195 -1176 -2338 -789 -767 -1905
2660 -1905 -360 269 -591 826 1944 828 1621 2832 1519 1119 1989 483 -415 124 -1284 -2370 -1665
2677 -1665 -2380 -3009 -1769 -1541 -1720 -458 430 173 1604 2274 1507 2055 2603 1477 1158 1159 -352 -675 -287
2696 -287 -1415 -1755 -1345 -1883 -1648 -701 -572 -620 807 511 161 1364 1230 56 781 628 -389 66 93
2715 93 -1020 -609 214 -671 -309 431 -32 52 1167 447 259 1021 288 -805 119 -280 -1228 -625 -622 -1530
2735 -1530 -760 -186 -632 213 991 602 845 1773 1195 949 1407 534 -240 404 -257 -1498 -1065 -1367 -1950
2754 -1950 -1093 -681 -1320 -533 294 258 1044 1599 982 1168 1767 1264 1329 1373 361 -400 -167 -690 -1362 -1093
2774 -1093 -1643 -1614 -1227 -960 -837 -301 201 170 978 1310 991 1185 1466 1060 1131 1042 296 142 50 -549 -736
2795 -736 -660 -1128 -1276 -619 -796 -727 -122 -141 -352 348 562 234 670 734 363 694 814 276 296 507 3 120
2817 120 271 -240 -415 -172 -345 -617 -483 -531 -757 -474 -386 -606 62 214 184 418 457 284 493 733 387
2838 387 552 441 178 -32 -59 -183 -602 -516 -428 -732 -650 -450 -497 -233 57 -242 166 351 80 217 384 402
2860 402 226 357 133 176 110 55 -21 45 -311 -238 -192 -349 -180 -510 -392 -553 -343 -453 -447 -109 -30 68 492 396
2884 396 628 696 749 918 830 791 337 171 -80 -547 -705 -745 -902 -913 -928 -742 -688 -425 -51 82 480 848 717
2907 717 935 949 857 808 685 388 -86 14 -176 -618 -597 -678 -903 -396 -397 -248 10 -9 130 267 487 495 450 479
2931 479 164 62 206 -166 -206 -105 -165 -206 134 68 -64 88 28 -10 217 102 -16 27 -69 -112 -92 -170 -255 -146
2955 -146 -51 -425 -50 52 -128 60 303 62 91 508 224 -63 74 142 -310 104 15 -487 -145 73 -368
2976 -368 -48 201 -276 50 86 -173 -108 225 -71 -30 267 20 -301 70 -48 -243 40 -142 -487 -188 84
2997 84 -442 -44 136 -333 97 204 -51 70 354 57 1 536 -45 13 265 41 -363 32 -191 -478 -107
3018 -107 -291 -447 -78 -84 -290 218 305 -158 244 444 -72 77 413 -42 70 289 -255 -293 183 -306 -372 214
3040 214 -76 -279 206 103 -261 340 405 -248 244 521 -536 35 296 -559 -367 206 -567 -84 105 -387
3060 -387 -341 426 190 -2 660 346 -158 570 519 -230 294 283 -789 -54 307 -414 -326 256 -469 -292 347
3081 347 -166 -366 277 -33 -12 710 256 -497 372 266 -382 377 189 -401 -8 455 -328 104 142 -511 -68
3102 -68 457 -114 -225 269 -309 -112 524 8 -293 249 -56 -319 578 129 -564 413 36 -580 65 55 -643
3123 -643 144 447 -660 26 526 -441 -107 839 -222 -238 909 202 -206 560 307 -438 374 54 -869
3142 -869 -110 -99 -768 -167 396 -635 -242 633 -33 -8 789 -53 -150 621 188 -447 456 -109 -499 90 -56
3163 -56 -763 -297 80 -473 61 268 -397 -23 802 74 82 202 -160 -18 499 21 -466 35 -262 -372 182
3184 182 -114 -395 106 92 -155 539 175 -643 79 557 -251 -6 101 -558 24 479 -390 -317 261 -218 -53
3205 -53 883 184 -346 344 1 -175 497 80 -903 -213 24 -629 -180 -88 -688 25 625 172 258 813 222
3226 222 169 999 478 -57 394 -3 -668 152 -242 -1003 -495 -252 -756 -113 21 -552 -113 456 44 196
3246 196 674 246 190 582 359 -12 426 -46 -220 -38 -31 -129 178 -78 -345 95 -59 -335 -99 118 -235
3267 -235 -188 -126 -410 -203 171 -424 -25 396 127 162 447 232 411 820 263 -42 131 44 -331 -226 -315 -841
3289 -841 -621 -304 -518 -327 -51 -443 -55 439 392 428 754 521 307 677 481 -172 200 -13 -499 -88 -339
3310 -339 -607 -649 -335 -562 -244 42 -204 -156 261 335 348 447 268 229 368 239 -118 159 21 -138 -11 -100
3332 -100 -298 -283 -221 -342 -262 -210 -273 -250 -151 -144 -149 -46 95 123 356 232 333 224 317 328 267 299 -6 174 27
3357 27 -224 -222 -567 -343 -286 -427 -353 -200 -222 -55 -38 95 -62 109 327 231 237 233 144 243 166 113 77 135 -72 35
3383 35 38 4 -159 -227 118 82 -78 16 -137 -233 -138 -246 -265 19 49 -129 130 148 93 172 347 177 313 263 26
3408 26 -38 -150 -292 -381 -339 -427 -237 -267 -120 -23 172 89 274 371 414 290 261 348 39 63 -209 -264 -177 -495 -449
3433 -449 -567 -320 -458 -56 146 199 458 574 583 643 606 198 239 81 -192 -421 -419 -682 -725 -705 -461 -587 -421
3456 -421 -228 0 351 486 442 603 728 545 563 386 96 -179 -85 -363 -529 -470 -498 -652 -336 -357 -161 56
3478 56 232 127 420 563 346 321 363 1 95 -25 2 -191 113 -299 -457 -213 -291 -264 -22 -104 -134 126 106
3501 106 -102 141 204 -176 -66 29 -99 -157 42 -109 98 209 82 406 215 52 -14 206 112 -89 35 -238
3523 -238 -445 -176 -266 -571 -386 -148 -464 -6 313 -38 304 501 234 719 805 405 243 469 -39 -276 20
3544 20 -438 -628 -220 -388 -905 -356 -329 -635 -183 269 -59 376 558 197 377 838 480 250 565 161 -162
3565 -162 148 -151 -452 -289 -426 -706 -143 -179 -562 -88 -15 -139 140 385 -121 137 237 331 215 370 96
3586 96 -226 307 -97 -140 26 -229 -558 61 -198 -326 -89 -348 -300 123 260 -156 159 206 -20 360 582
3607 582 3 154 389 -34 25 379 -449 -496 -25 -436 -460 -111 -360 -737 26 36 -207 -66 477 -143 505
3628 505 842 -33 333 749 29 216 688 -166 -378 -2 -228 -594 -318 -492 -756 -72 -250 -336 -123 204
3648 204 -215 211 643 -4 248 408 297 214 362 -49 -20 378 61 -14 177 -178 -415 10 -72 -433 -133
3669 -133 -274 -384 5 -188 -483 50 -103 -179 311 374 8 456 745 82 457 571 338 155 446 -145 -485
3690 -485 -42 -606 -897 -618 -741 -1019 -318 -68 -546 106 390 195 751 1270 699 736 1247 675 471 423 -243
3711 -243 -548 -486 -710 -1236 -988 -1059 -1335 -666 -335 -598 3 467 440 992 1391 925 898 1035 769 563 521 -101
3733 -101 -483 -500 -717 -757 -898 -881 -1022 -686 -304 -306 -23 100 89 463 623 324 603 582 338 487 382 115
3755 115 -5 184 -133 -132 68 -284 -361 -196 -274 -480 -191 -321 -702 -298 -370 -372 -133 214 -132 180 495 401 549
3778 549 752 559 406 632 491 113 150 -184 -455 -390 -584 -993 -802 -656 -779 -569 -225 -293 111 538 506
3799 506 669 876 791 690 822 358 208 197 -204 -589 -544 -736 -995 -817 -853 -792 -322 -5 80 207 461 561
3821 561 708 891 721 621 458 261 158 -146 -149 -364 -382 -499 -565 -544 -341 -505 -213 -18 56 366 257 377
3843 377 340 508 459 497 441 203 218 83 -225 -359 -297 -216 -372 -52 -279 -306 -194 -154 -118 82 148 -37 301 315
3867 315 164 109 299 94 161 125 87 1 23 -197 -253 -212 -216 -275 -253 -289 -210 -23 17 -122 31 286 170 128 262
3892 262 377 465 287 129 122 0 -119 -429 -172 -505 -322 -324 -388 -172 -2 40 30 212 376 155 558 410 365
3915 365 176 100 -68 -81 -118 -259 -114 -111 -164 -22 -85 -170 -59 -14 -121 -129 34 5 30 22 -92 -156 123 52 -37 120
3941 120 132 139 269 267 124 209 194 70 -95 -25 -410 -336 -116 -617 -549 -462 -379 -312 -137 -82 70 272 595 684 599
3966 599 687 315 416 418 301 -126 -99 -399 -554 -579 -778 -744 -685 -412 -364 -90 117 207 386 647 646 665 732 645 480
3991 480 242 -118 -304 -279 -397 -714 -613 -629 -577 -416 -228 -47 150 164 454 537 728 524 589 488 85 249
4013 249 -67 -215 -288 -354 -435 -277 -446 -635 -297 22 -153 -33 295 288 344 483 332 57 152 89 -160 -4 -142
4036 -142 -368 -183 54 -81 79 47 -5 56 239 186 -18 62 -84 -128 81 83 -317 -105 32 -276 35 63 -169
4059 -169 201 386 235 289 271 91 167 60 114 -135 -57 -414 -278 -32 -362 -430 -111 -183 -53 173 152 193 391
4082 391 346 -28 288 416 46 23 -76 -449 -351 -234 -505 -419 -156 -172 -206 232 -29 135 532 340 395 506 411
4105 411 148 316 190 -343 -158 74 -544 -544 -193 -341 -394 -154 -310 -279 274 76 91 289 256 265 365 271 158
4128 158 161 238 -24 86 -42 -240 -127 -41 -388 -186 -39 -125 -212 -179 -157 -136 32 176 -24 199 279 -110 236
4151 236 360 74 234 217 -79 88 -103 -304 -77 -306 -430 -59 -26 -155 26 4 -107 204 529 249 -48
4172 -48 203 30 -100 229 -1 -418 -104 -281 -406 -114 17 -460 -241 104 -94 -60 270 165 313 396 315
4193 315 122 255 82 -99 -26 -213 -486 -163 -140 -547 -131 -106 -181 103 298 52 254 366 161 276 404
4214 404 63 -53 -53 -262 -299 -135 -87 -263 -6 -53 -314 155 182 105 235 278 144 217 265 167 -90 -60 -226 -467
4238 -467 -173 -207 -412 -159 -381 -133 261 112 -43 422 98 80 340 145 -86 -84 -2 -289 -65 139 -255 -138
4260 -138 3 -174 -32 295 101 178 404 182 27 327 189 -173 31 -132 -386 -194 -227 -315 -220 -163 -132 17
4282 17 132 138 220 345 372 227 359 328 27 134 -192 -162 -210 -141 -412 -439 -289 -483 -137 -90 -64 43 311 288
4306 288 329 489 514 266 315 163 37 -110 -260 -262 -237 -235 -394 -225 -298 -258 -43 116 210 222 163 280 277 349 199
4331 199 -28 90 -249 -163 -49 -214 -346 -226 -177 -319 -126 162 -103 166 92 130 184 334 251 23 146 47
4353 47 -3 15 -7 -296 -96 -239 -298 -6 -184 -255 -10 -43 133 6 146 26 1 131 104 -31 24 -50 140 -24
4377 -24 -113 30 -3 -89 46 34 -49 -59 -11 -15 15 107 -89 -122 4 46 5 143 76 108 31 3 -88 49 -23 -120 13
4404 13 -33 -2 -34 11 -34 -56 -50 -117 90 144 206 67 10 77 -24 32 200 96 -60 -88 -67 -90 -5 -147 -158 30 -235
4431 -235 -123 -74 -45 108 105 90 28 82 45 100 -135 -16 -90 -121 -138 -63 -41 57 -26 15 80 36 118 15 154 38 -93
4458 -93 -136 -114 -100 -143 -267 -202 -89 -43 -174 -111 53 88 149 283 314 338 287 237 146 106 38 -9 -82 -275 -291 -304 -331
4485 -331 -300 -314 -110 129 43 231 332 298 169 374 417 201 77 48 -123 -331 -186 -392 -402 -57 -278 -120
4507 -120 -63 31 101 189 392 197 250 331 58 166 18 -198 -175 -147 -568 -245 -326 -169 -181 99 98 137 288 307 226
4532 226 379 72 166 31 -2 -165 -344 -95 -362 -96 -230 -272 -186 -7 18 281 367 452 265 474 258 315 -8
4555 -8 -71 -221 -252 -215 -429 -261 -276 -366 -152 48 -55 276 377 102 491 570 419 277 237 17 -143 -92 -385
4578 -385 -423 -267 -566 -505 -11 -267 -290 114 170 214 426 329 272 302 314 -15 64 58 -244 -119 -182 -345 -211 -75
4602 -75 -338 -371 -45 101 11 176 325 29 209 72 -67 91 245 1 -57 29 -204 -243 58 -19 -133 128
4624 128 14 -152 251 158 -96 88 -78 -116 137 -25 -39 -39 -45 21 57 79 -100 154 127 -34 66 40 -51 107
4648 107 -56 -220 -242 -113 -91 -201 -87 -139 -384 79 84 -121 201 167 -54 179 236 -65 126 21 -99 -31 59
4671 59 -53 -37 -59 -261 -301 -91 -92 -275 -92 50 -68 181 -86 -214 -19 137 19 -45 235 82 108 215 -3
4694 -3 -74 187 -67 -226 89 -181 -256 -142 -113 -168 -118 -180 -275 -37 111 113 -22 251 217 281 334 -86 195 264 -49
4719 -49 69 -200 -303 -297 -84 -147 -222 -132 -145 -11 340 197 -46 150 349 156 243 188 -10 284 -18 -109 -83 -46
4743 -46 -266 -241 56 -207 0 93 -30 76 292 231 13 219 194 324 -71 85 -131 5 -162 -44 -247 -49
4765 -49 -307 -42 -30 -194 -25 -18 -35 78 200 37 -137 111 108 69 158 -13 61 -19 0 28 -43 -69 -36 -65 163 -24
4791 -24 -59 8 -144 -63 59 -128 -225 -89 95 -109 18 51 -5 -51 96 51 66 71 64 124 -8 24 162 -7 -111
4816 -111 -41 1 -182 -145 -110 -333 14 -35 -20 -83 164 -17 143 246 232 91 89 260 25 185 -31 -109 -171 -12
4840 -12 -192 -146 -56 -105 -5 -56 -17 -131 9 166 203 173 130 238 151 13 96 71 21 9 -144 22 -163 -33 -41
4865 -41 -31 -66 46 -45 -5 150 161 14 48 101 235 39 -83 -17 15 -189 -93 -14 -259 109 -117 -315 -113 -86
4889 -86 28 19 -33 -61 -22 39 107 14 111 -69 84 -154 11 -58 -52 111 47 11 56 99 -4 -11 68 -42 -84 120 60
4916 60 -124 -52 -12 -183 45 21 -29 -81 -74 -27 130 132 76 90 56 99 84 159 41 -126 -138 -261 12 -125 100 -186
4942 -186 60 -36 -44 103 170 -20 -6 -22 -90 -67 2 43 -99 5 -170 116 -130 -100 -101 -138 -95 -22 124 -7 25 -8
4968 -8 96 108 129 107 126 82 -46 -19 136 -94 -78 -119 62 -55 -114 -137 -51 -155 -130 -62 44 52 23 -54 137 38 23
4995 23 213 262 58 174 206 -11 9 -42 45 -63 -347 -155 -250 -352 -288 -134 73 -2 82 -31 242 179 211 258
5019 258 272 39 205 79 -64 -239 -272 -213 -226 -137 -101 -110 -86 -124 64 50 96 310 420 213 140 187 140 150 -32
5044 -32 96 6 -166 -62 -263 -88 -92 -178 -93 58 10 10 -5 0 157 -93 -133 10 -246 -245 -43 -249 -169 -47 214
5069 214 193 131 170 311 338 291 97 57 -66 -308 -126 -31 -189 -287 -180 -162 -287 -131 8 -52 225 215 316 236
5093 236 271 128 116 193 158 -106 -146 -87 -56 -244 -243 -134 -176 -120 -137 54 -31 91 163 66 205 235 94 -3 48 133
5119 133 -21 14 48 -21 56 132 -58 -71 -11 -148 23 -84 -125 78 77 -90 -58 17 -133 81 204 -82 27 153
5143 153 225 29 147 210 -128 -48 27 10 -198 -47 -236 -183 -68 -207 5 46 -62 -40 130 64 9 -2 248 86
5167 86 226 169 97 -46 48 -64 -152 -187 -118 -267 16 -314 -65 -11 -70 -72 36 284 59 136 147 34 234 121
5191 121 -38 15 15 -99 96 -143 -117 -226 -123 -69 5 -150 -98 -34 -31 33 61 178 26 268 216 24 100 228 122
5216 122 181 150 -1 -63 6 -40 -383 18 -170 -236 -252 67 8 158 61 103 280 120 145 22 246 132 131 118 -50
5241 -50 14 -99 -63 -293 -290 117 -159 89 -150 155 -98 212 138 161 89 74 156 46 241 -75 -218 -125 -27 -272
5265 -272 -102 -148 -130 4 94 44 20 -27 26 -113 -148 -9 221 -16 101 -16 8 -159 -49 97 -28 57 -23 -3
5289 -3 164 -11 63 84 34 -4 -55 -6 -190 -117 -37 -95 -34 40 -24 138 228 -15 35 197 -32 -20 25 44 -88 15
5315 15 110 -156 -98 113 -103 -21 90 -1 -8 120 23 2 128 132 -78 225 17 0 -187 -119 -164 -7 -25 19 54 -104
5341 -104 29 -19 -23 51 59 72 -5 38 -16 -86 -9 -96 -18 -90 26 -203 -48 -107 -214 77 -2 -22 22 122 -69 13 -72
5368 -72 13 51 -107 28 -140 -73 -7 -82 38 59 45 -144 -28 -73 147 30 32 -91 6 75 -108 -48 -114 -105 -114 31
5394 31 -62 -48 -72 61 -217 -209 115 -173 22 -176 -38 -50 35 -97 28 221 83 76 123 128 -40 138 141 -12 -117
5419 -117 159 20 84 -112 -18 -36 -111 -86 13 19 46 -15 46 169 174 112 -41 106 -99 61 -18 12 -135 -65 -96 -58
5445 -58 18 -240 -41 -122 -1 136 -149 6 79 200 72 -12 46 -81 -9 156 -89 -60 166 2 -114 -141 87
5468 87 -124 67 -56 -104 76 28 58 50 31 -78 -14 -100 -228 184 -1 35 -88 44 -74 90 -113 51 48 16
5492 16 -128 42 64 -16 -18 44 -110 -2 111 88 163 225 115 126 -71 81 66 80 -62 0 -80 153 -89 -92 35
5517 35 -3 115 -16 -223 -84 -84 -84 134 -19 106 58 72 158 91 -30 204 98 134 45 104 39 47 -33 -11 128 -49
5543 -49 -174 -106 -322 -6 -24 -6 -16 -14 193 17 -9 0 161 2 36 270 -35 -87 26 68 -91 -77 -99 4 -28
5568 -28 -239 10 80 -107 29 -217 137 85 164 -24 162 44 -17 7 14 -4 19 150 -29 14 -87 29 38 27 -150
5593 -150 -23 56 97 57 52 27 -127 89 8 26 -85 157 -116 -113 -112 71 54 7 -75 50 -14 67 95 73 115 -129 -114
5620 -114 -42 -47 -179 -182 67 -3 260 119 -2 7 54 182 27 108 80 -123 -73 -180 -35 -6 -88 -113 -150 -118 -18 -67
5646 -67 -53 87 37 171 106 66 119 157 -128 -3 50 -46 -25 -253 -173 -170 26 -33 -24 87 -8 -87 -68 28 -32 23 135
5673 135 34 151 23 70 -65 -139 76 63 -19 -58 -78 29 -48 35 -38 44 -50 -49 61 -39 108 4 -10 157 -10
5698 -10 14 108 105 -123 114 102 -44 -4 93 16 22 59 35 -1 -47 -101 24 80 -16 41 40 -36 -53 6 -104 -16 96 -26
5726 -26 25 32 -149 -105 186 248 71 25 125 65 -44 240 21 -183 -164 -33 -26 94 -10 -153 -41 123 3 -124
5750 -124 27 -57 41 182 217 -62 159 66 139 41 -226 -63 -12 -145 -73 -72 0 -231 89 -42 -127 129 70 103 133
5775 133 13 -33 255 55 -8 -70 -10 -152 40 -49 -110 -14 -32 -63 6 157 50 74 114 78 97 140 89 -95 51
5800 51 -17 -40 85 2 -21 -58 -85 22 103 -60 52 143 -77 10 91 99 61 -51 46 -77 -77 -106 -5 -162 -189 -169 31
5827 31 -179 -72 151 -66 175 60 -85 122 73 71 -41 15 -109 283 -78 10 -120 -112 -17 77 -46 -124 -145 58
5851 58 174 -28 147 -1 60 98 37 -15 -85 -102 -126 -103 -100 -106 38 -158 -95 3 -46 -48 -118 94 6 -46 34 -13 106 110
5879 110 -138 -63 -33 117 8 -74 -151 21 -157 264 154 131 -61 -74 -2 21 -79 -38 -54 -7 -80 -74 -79 -32 60 81
5905 81 -23 52 -90 31 -61 -53 2 91 -96 -58 -28 -121 -253 -63 42 8 109 -65 -81 77 -17 111 -70 14 205
5930 205 121 112 35 -21 28 109 38 27 -21 -153 -114 -10 41 9 56 -73 -93 -131 34 19 70 -89 -108 88 98 -4 119
5957 119 30 9 140 131 112 -15 -232 29 113 37 -169 69 10 -94 -11 -49 -120 183 -1 62 41 105 66 -3 206
5982 206 84 33 -36 55 -7 -72 -263 41 -66 -157 -58 43 -110 40 -61 131 47 4 163 -46 126 94 137 21
6006 21 34 -27 -225 -52 -86 -192 -79 64 -109 12 152 -50 81 70 11 -8 -111 81 194 114 -194 3 -47
6029 -47 -43 -19 -79 -74 37 69 -18 152 -71 93 -40 132 118 -22 -107 68 55 91 50 41 -117 76 7 14 167 21
6055 21 15 28 25 2 43 -48 -162 175 -2 -35 57 -32 -13 -127 69 -121 -71 44 21 -73 196 -73 -10 43 -101 191
6081 191 92 79 -63 -36 -106 -221 -93 -207 7 106 -52 70 260 129 -32 100 -67 -150 147 18 -64 81
6103 81 85 -99 -76 37 -308 -189 -21 4 -143 44 172 -157 -44 24 -72 59 -44 -14 -7 202 -46 42 53 -72
6127 -72 -26 167 64 -154 -56 -132 112 89 -21 102 143 -59 44 85 22 24 -34 -43 41 -96 86 25 78 43 71 167
6153 167 9 8 -97 -36 41 -9 -86 -39 17 -69 21 160 62 58 -174 16 19 71 85 158 -66 -62 7 -56 238 61 -130
6180 -130 99 54 119 -54 -50 52 16 -90 -63 37 -52 -124 62 -81 -120 154 18 134 -17 104 92 131 33 -57
6204 -57 -92 -140 0 1 -166 118 -77 -36 212 127 82 39 170 36 10 49 -50 2 -99 11 139 -90 -8 151 24
6229 24 118 -45 -5 -44 -102 -66 4 26 64 -120 26 93 -114 28 186 52 78 7 -83 58 -79 -154 -112 -8 63
6254 63 -10 -33 99 10 51 -14 -54 -9 230 61 -93 -80 -54 44 -28 -23 45 -62 -49 143 67 217 110 -66 9 48
6280 48 -21 -13 -17 -89 35 111 98 3 -113 129 -15 -197 -123 -110 -135 -35 -82 40 215 76 9 292 28 51 20 35
6306 35 137 0 -173 -63 -89 -2 -33 6 95 -120 51 75 -85 -26 -32 98 45 -48 -47 132 -20 27 139 -64 -65 24
6332 24 87 18 26 162 74 7 34 53 91 29 -10 110 -149 -69 -98 -91 -85 -99 11 -253 38 -29 123 -33 151 52 63
6359 63 131 -133 78 -159 7 113 -153 -176 -154 -53 -73 -141 -53 -81 65 -110 -9 -29 123 137 79 99 70 124 89
6384 89 -34 106 -206 39 -96 -27 39 -143 197 -124 90 192 84 -19 89 -57 13 -124 65 -67 -11 -74
6406 -74 -112 162 -187 56 35 -120 19 -47 5 -43 -109 9 -57 25 -64 80 7 177 -27 -123 42 34 -30 -14 151
6431 151 67 -126 -26 54 73 -24 213 -51 -205 68 76 -32 -178 -166 -114 -181 58 76 -124 -90 48 -169 138 157
6455 157 -135 4 -1 168 -34 -109 -106 -68 -50 -155 -14 -8 -230 85 8 -33 117 -52 74 210 166 136 43 19 145
6480 145 56 27 -47 -94 -72 -82 46 -175 62 -9 45 218 55 -76 -18 102 39 95 -13 51 41 122 -100 7 23
6505 23 -14 53 88 -42 -65 -1 12 -116 -175 -109 93 -35 117 41 44 83 87 50 -129 94 109 49 -125 -128 16 -36 -12
6532 -12 5 -59 -49 113 -79 61 -5 27 76 75 58 -76 -15 -41 142 79 79 43 -66 -36 41 -52 -93 21 162 -42 21
6559 21 32 77 40 71 109 99 78 48 47 55 71 -43 -196 126 160 84 94 -153 -4 29 29 -57 -118 -57 46 26 -34 61 231
6588 231 148 -38 -114 1 -108 -106 74 -17 -112 66 -105 134 -38 -65 87 65 143 -92 77 57 -45 54 110 196
6612 196 -30 36 -73 -104 64 -28 30 62 14 -46 26 59 18 61 27 -107 -129 -8 55 -43 -7 -69 68 -6 45 -39 51
6639 51 -9 54 -96 108 236 127 77 39 14 -55 57 94 1 -95 42 5 -11 -131 81 45 44 -206 45 48 7 78
6665 78 118 29 -159 -118 -54 21 -10 -23 -194 16 -182 -36 77 54 230 56 8 103 42 2 140 147 -23 15 -45 76
6691 76 102 -287 45 142 130 36 22 -128 -61 101 54 -95 -71 93 -5 -32 -105 68 -43 2 57 -61 19 27 166 6
6717 6 -65 -155 130 30 70 127 23 37 -83 12 85 -62 -4 75 -11 18 -79 -131 53 -79 9 5 -16 163 -15 -38 -123
6744 -123 72 -35 28 19 -9 -11 111 -20 -88 -68 -90 24 136 76 -18 64 -181 -66 71 75 204 4 95 115 -104
6769 -104 76 -163 47 140 -23 42 -65 0 132 -27 34 -6 50 59 -33 33 4 16 13 5 92 -18 -9 -13 -1 -78 151 18
6797 18 -50 80 26 -88 78 -75 -153 -71 38 -10 -46 -21 -19 -75 -61 0 119 3 -114 147 74 43 60 50 25 -1
6823 -1 -1 32 141 -71 10 113 -4 67 -19 -5 -10 11 -151 10 -48 -18 -58 -64 -98 124 -82 -8 28 0 60 71 50 -67
6851 -67 -4 39 -116 -53 -63 -61 -47 36 -36 -73 -42 96 -40 129 135 43 200 151 34 -47 5 -41 -44 20 71 -67 50 97
6879 97 -113 -62 119 39 77 117 -157 112 104 -89 16 12 -48 -74 -8 -17 67 -113 22 65 164 3 -10 106 -123 -32
6905 -32 -9 -41 1 -34 -77 -119 -164 54 159 42 50 -78 45 82 10 69 1 -75 -28 -141 6 47 136 -84 -142 -74 -74
6932 -74 177 -75 -21 5 139 -97 61 2 10 -100 -19 -74 3 89 -201 -47 11 22 13 15 129 -51 60 81 48 -86
6958 -86 62 76 -107 -143 -154 -93 -164 63 -47 20 -58 4 -116 -111 18 102 -43 -51 9 28 -91 -235 111 -163 -87 95
6984 95 -15 -79 -12 -73 161 33 18 -112 177 -34 -35 -111 65 158 -84 186 86 -11 -205 193 14 -17 -54 81
7008 81 -6 -216 161 -90 -12 -148 57 106 -67 210 -3 93 115 -67 73 -53 -16 110 -48 -65 19 -13 89
7031 89 3 -78 -103 -64 61 -2 -129 231 59 -80 -21 32 10 -47 -58 83 -8 23 -38 93 74 104 -16 -102 42 -20
7057 -20 -4 85 61 -92 -11 99 20 -15 201 5 91 141 125 -30 13 16 -59 -27 -9 -91 36 -165 -9 61 -136 96
7083 96 41 -33 -36 -184 -3 6 39 -31 -70 -95 56 -15 59 -66 66 -96 128 59 64 -60 -187 -61 -151 -28 -95 60
7109 60 2 148 -77 56 86 177 104 105 10 -30 101 112 -17 -64 39 9 51 76 -9 33 -84 -29 -60 -166 62 36
7135 36 168 37 5 108 -210 -216 1 154 -25 -17 59 -38 -42 -62 -120 -10 -46 169 217 -103 51 167 19 85 64
7160 64 103 -97 -22 32 -65 37 79 -109 -33 43 -40 51 -36 -10 -9 39 131 -25 31 28 116 -152 -20 32 52 83 16 117
7188 117 -144 63 66 31 43 145 -33 84 47 -27 -17 13 77 -195 84 37 -23 77 36 73 -52 5 37 -115 -26
7213 -26 -50 30 47 -20 10 -56 39 43 63 171 87 83 91 -50 127 5 186 14 30 -129 -19 108 -163 6 -33 52
7239 52 88 -2 -25 -20 -39 -47 -34 138 46 125 -14 -10 52 57 73 -52 -9 -24 42 -52 -57 56 116 107 -125 -14 13 18 153 81
7269 81 17 94 153 -52 51 -7 85 104 -150 196 94 129 -29 79 36 61 -15 26 17 -27 -18 -71 20 -130 -51 -54 140
7296 140 -2 42 -55 52 68 -6 -84 -14 -101 -68 75 29 56 21 -19 -1 89 -7 131 -5 -114 77 53 5 208 118
7322 118 47 -92 -25 -62 79 67 66 80 -159 -44 -40 -35 -87 32 -34 108 -156 125 -74 -153 15 43 0 65 -58 -115
7348 -115 155 -85 -36 81 -51 -17 -153 -82 -17 48 -105 -75 -28 -27 36 162 -7 18 -61 -157 15 -33 -41 61 129 -4
7374 -4 -96 -108 54 -66 32 86 130 -47 137 59 -147 6 -46 -30 -132 24 124 -60 174 -87 133 3 38 -108
7398 -108 10 22 77 -76 48 -33 -8 76 -49 6 36 159 11 -44 -102 11 41 -82 -92 10 21 -17 6 66 42
7423 42 142 248 66 -80 159 26 -43 81 -155 -74 -32 -39 -97 37 -88 45 -106 -70 75 -88 160 -105 -32
7446 -32 187 -4 -6 49 -27 -56 121 25 104 -49 -57 -138 76 -179 62 27 -82 -24 -120 -211 61 -29 -3 95 -265 -44
7472 -44 -104 -134 -45 -54 218 9 -127 21 17 -75 -76 -1 -26 -7 257 -41 -7 0 -84 67 52 92 -110 129 14 119 -2
7499 -2 64 55 27 -85 -79 9 34 -75 -53 55 -55 -98 8 -5 -38 -81 -173 -73 21 7 130 169 -75 -177 -9 -57 63
7526 63 -14 -50 -8 31 43 -10 77 89 -78 -40 -5 13 -16 -27 102 -71 44 -105 39 -64 -15 -10 -40 -126 71 -41
7552 -41 13 -55 5 93 160 51 -50 102 0 -24 -140 -73 -27 -63 -38 96 17 -9 -58 -123 59 4 21 12 132 63 -84
7579 -84 -33 30 -82 -105 -128 232 -14 -160 -123 -86 -80 -54 -98 223 -18 53 110 -36 141 -95 79 -11 66 -12 0 126
7605 126 -88 24 -51 -26 -159 -236 132 41 -48 6 -11 -27 87 49 -34 49 -98 134 38 119 72 -110 -29 -6 -105 14
7631 14 4 -116 -72 68 -84 -174 49 180 -100 137 49 -119 74 -169 -140 -3 -56 -86 13 -123 111 70 48 121
7655 121 90 27 -113 223 156 55 58 20 179 6 5 137 138 -93 -8 35 -51 -96 150 -67 86 -62 -3 -36 -90 -48
7681 -48 -62 -217 35 -59 -34 -15 -119 14 104 -81 -11 93 130 56 -56 -1 74 80 238 -104 40 106 -23 -52 53
7706 53 -64 -71 2 -12 -39 -27 -114 -217 -70 -8 -88 -97 124 76 63 -119 25 -13 92 57 -49 92 -117 -302 38
7731 38 -31 71 150 -9 50 -88 -41 6 -21 -52 6 52 16 -108 90 58 98 -125 11 21 3 -131 186 -241 -17
7756 -17 -82 -78 11 -131 -91 -2 135 2 64 82 18 -2 24 48 214 95 106 116 128 77 28 52 -129 -11 -145 -11
7782 -11 -1 42 -214 118 -33 142 57 50 41 27 126 127 128 -44 -23 56 81 -67 -57 -126 86 4 22 121 -51 -155 -48
7809 -48 -53 -182 -15 47 36 -46 68 86 72 -40 -95 -58 127 14 -77 119 76 23 123 249 -58 -53 1 -20 -100 13
7835 13 147 -105 -100 -36 -70 -130 113 116 -4 -53 -70 -13 -10 -56 27 16 47 -26 -56 187 5 -34 -68 23 127 -171 -153 0
7863 0 30 -42 9 95 55 63 157 12 42 -111 24 126 68 25 22 -208 -95 108 -41 15 -76 -33 146 -11 151 -23
7889 -23 76 -153 -156 -38 -53 -87 -243 -6 -30 6 47 123 -53 -27 22 -106 -55 157 -53 18 -8 65 55 -108 -29 -30 14
7916 14 142 11 96 49 126 35 -66 -47 -45 -117 66 -101 8 -62 -47 -81 -47 -8 -90 -91 -124 -50 103 117 33 -23 3 75
7944 75 64 85 73 64 91 84 77 188 -70 37 110 65 -60 -150 108 88 -92 88 99 -58 -104 -97 75 31 78 177 -155
7971 -155 26 -118 -79 -83 7 23 -90 -106 16 88 -115 -22 -112 -44 18 -68 147 -49 -77 -72 29 10 205 73 39 51
7997 51 60 43 10 -2 37 -2 -74 153 -211 65 196 -123 -36 237 26 10 -134 4 79 35 -31 -11 -47 -122 -62 -63 56
8024 56 -8 -105 -124 47 34 -129 10 106 187 -109 100 124 -17 -4 -87 176 -189 -82 3 42 14 31 122 -7 -46
8049 -46 61 -73 -13 -56 119 105 60 32 -14 -105 6 2 -13 68 -55 39 78 14 56 41 -45 -95 104 170 111 -81 22
8076 22 -34 12 236 18 148 -66 -68 -103 -21 70 -113 184 59 -1 43 14 -2 -28 -4 1 -71 18 78 -82 35 -64 93
8103 93 -17 -6 146 -10 123 189 35 -70 22 144 55 76 63 63 -151 -3 51 -97 47 194 -41 -14 57 -76
8127 -76 73 -14 96 130 183 -147 -45 -3 79 105 56 -49 76 13 -119 -45 2 -124 83 -48 38 -129 52 18
8151 18 -42 -27 43 31 47 57 12 64 -18 -138 19 68 10 69 -16 -62 -100 -37 24 -22 134 -69 57 72 101 -37 4
8178 4 76 -68 62 87 -13 -47 -18 40 -72 -106 134 -30 116
8191A16
$$ Imaginary data points
##PAGE= N=2
##DATA TABLE= (X++(I..I)), XYDATA
0 0 0 0 0 0 0 0 0 0 0 0 0 -6 0 -8 8 -8 8 -8 16 -16 21 -24 30 -32 40 -44 53 -60 70 -78 88 -102 117 -133 149
35 149 -166 186 -210 234 -259 291 -322 360 -395 439 -485 533 -588 649 -715 787 -866 956
53 956 -1053 1164 -1290 1435 -1598 1789 -2015 2289 -2623 3048 -3608 4374 -5504 7329 -10780
68 -10780 19581 -91242 -111307 168477 292394 366989 458005 474944 427646 463663 409004 252534
80 252534 139909 29002 -134806 -191798 -202894 -265946 -285013 -256592 -266880 -205511 -90197
91 -90197 -47985 -9856 77079 111102 124800 149722 122485 96511 123994 100147 34322 12346
103 12346 -14070 -48107 -19864 1146 -12380 10011 12342 -27368 -8132 25297 3140 864
115 864 5347 -36247 -41954 -14850 -33535 -23336 36351 38680 25598 65650 82644 89952 140880
128 140880 142161 98110 99141 74167 -644 -23605 -32425 -81406 -98974 -105788 -151413 -151326 -101705
141 -101705 -87111 -58868 6444 24672 29299 76225 101310 114529 153978 144204 92325 79044
153 79044 60623 11431 -7105 -18620 -54585 -64803 -68140 -98780 -95987 -59246 -47696 -32060
165 -32060 -3428 -8426 -9359 20588 30908 37974 62802 49796 15034 12295 7749 -7712 555
178 555 -3336 -28821 -28191 -27985 -51932 -47430 -25847 -30762 -28510 -19674 -37686 -40507 -13901 -5574 243
193 243 20962 14446 -2624 8664 17212 16858 32907 32209 8596 3891 1596 -16136 -16496 -10286 -24394
208 -24394 -32443 -35162 -49978 -49445 -29780 -22031 -16807 -6289 -12589 -17966 -4837 4403 10686 23525
222 23525 19345 3931 2350 972 -3431 5916 9497 -2241 -5072 -6104 -13164 -3892 11167 10904
236 10904 11495 12863 -694 -7179 2120 3567 2427 6113 -4199 -18876 -16446 -12264 -11218 1723
250 1723 9356 1768 1982 7799 9719 21571 34620 30430 22991 18968 8431 1721 6005 7565 3015
265 3015 -1189 -9773 -18151 -13196 -1892 5068 12684 17303 14977 13656 16513 21902 28966 31280 24162
280 24162 11541 715 -3985 -4153 -3117 -2083 -2869 -8190 -14279 -12920 -4017 6416 16163 19524 15158
295 15158 12729 14345 14624 17247 21995 18651 8105 -1868 -8991 -10307 -4907 29 -2773 -6227 -7606
310 -7606 -11293 -10055 -427 7387 9651 8146 1672 -3542 -1594 3837 6055 5274 2944 -4372 -12791
325 -12791 -13597 -9250 -4403 -113 -2894 -9747 -12280 -9807 -5348 501 5956 6918 816 -4795 -6285
340 -6285 -4616 163 2284 -3710 -11829 -18528 -22807 -22869 -18103 -12178 -10515 -13008 -14022 -12483 -5622 6734
356 6734 14134 15220 14888 10024 2885 365 1574 -375 -6048 -13860 -25776 -34614 -32296 -26797 -22166
371 -22166 -13618 -9048 -10279 -5634 3576 11932 22235 29062 24586 16071 10584 3424 -2276 -2288 -6412
386 -6412 -16181 -22615 -28704 -32237 -23992 -12506 -4783 3082 6567 6315 11219 19443 25008 28577 26628
401 26628 16325 6100 881 -4315 -5029 -2352 -6899 -12574 -12766 -15242 -12325 -217 6162 8166 12657
416 12657 8950 2445 6783 11964 11250 13546 11879 487 -1298 4440 4242 10550 20342 15894 10694
431 10694 13327 9155 9112 17864 14280 3325 266 -7505 -17160 -11821 -6535 -9955 -5761 -3867 -10573
446 -10573 -3739 8902 10672 18379 27503 21157 16745 18767 12362 11992 20191 12305 -1852 -5018 -12363
461 -12363 -17202 -5857 -3444 -11028 -6191 -6442 -14066 -3262 6183 894 6580 12030 382 -157 6240
476 6240 -2032 1712 16573 8547 -2990 682 -5201 -7209 9693 7316 -10202 -8689 -11562 -22895
490 -22895 -12439 -5377 -17948 -14578 -6885 -16217 -11205 2908 -982 4106 21529 15578 6004 10342
504 10342 4410 887 13332 5694 -16068 -20129 -24878 -32092 -19994 -14796 -25136 -19721 -12489 -15642
518 -15642 -2606 11395 7286 13543 23043 12219 7888 11332 -1011 -3915 5592 -8266 -23216
531 -23216 -19116 -25504 -27638 -6721 -3197 -12183 -112 3405 -4371 12276 23148 10058 12999 15103
545 15103 -6508 -9189 1115 -12223 -15503 -3387 -15995 -22973 -3819 -2256 -3390 18784 22239
558 22239 11890 23974 24070 7315 14926 19501 158 -3326 -5530 -29236 -32348 -17094 -21515 -19001
572 -19001 -4808 -12269 -10348 16552 26060 28070 42572 38336 26835 34731 30046 11478 10593 5536
586 5536 -13564 -16172 -19575 -36506 -32678 -19425 -20811 -9821 3694 -3780 2383 24930 30238 33843
600 33843 41619 26687 14380 21943 14073 36 3860 -4306 -20723 -15303 -15477 -25691 -12088 -273
614 -273 -7502 2252 13362 3037 7300 21680 16016 14357 19254 1111 -10880 1152 -2308 -11103
628 -11103 -1567 -4958 -15790 -4843 -1643 -8590 5721 14347 1918 3543 7873 -3083 -693 7462
642 7462 -3458 -7436 -2540 -16606 -22593 -6941 -4382 -6418 3237 -297 -5795 6484 8372 998
656 998 9440 10647 -2956 -4761 -5465 -14334 -10265 -4427 -15180 -16866 -9863 -16659 -15860 -1064 2750
671 2750 5136 11772 3633 -1411 9485 9770 1925 4259 248 -11096 -10409 -10748 -16489 -9485 -4584
686 -4584 -13878 -13418 -6422 -8812 -3846 6151 5125 7283 11590 1986 -3400 5598 6568 1679 2253 -3514
702 -3514 -9726 -4638 -3985 -7871 -296 2437 -6226 -5724 -1815 -2315 4849 10002 3759 3817 7303 405
718 405 -2461 4332 4707 2602 4010 -1963 -6074 1890 3573 -978 3394 4548 -2245 -1783 652 636
734 636 7589 11819 4583 1871 5186 3567 2900 7501 6942 4805 5353 893 -2992 2635 5165 1334
750 1334 425 -420 -2975 -1713 180 1514 6676 9350 4820 1558 2850 4531 6906 7972 5438 3807
766 3807 2965 -621 -1874 1251 2088 673 -1094 -4591 -4594 -250 1564 1926 4882 5124 1412 -401 39
783 39 1531 5019 5421 906 -1547 -1256 -2873 -2949 -773 -791 -2525 -3815 -6208 -6262 -1049 2123 1713 1130
801 1130 351 -1806 -2571 -1235 120 2178 2442 -1465 -4872 -4665 -3553 -3042 -2690 -3867 -5705 -7442 -7602
818 -7602 -6018 -2436 796 1250 -1029 -2293 -2166 -927 663 2265 2339 637 -2546 -5185 -5561 -4274
834 -4274 -2982 -3795 -6188 -7256 -7693 -6520 -3291 212 1642 1686 321 -1355 -840 1621 3379 2821 1731
851 1731 -986 -4302 -5029 -3977 -3402 -2408 -2215 -4210 -4933 -3147 -685 2196 4875 4992 2864 1451 1048
868 1048 1031 2936 4175 2394 190 -2182 -3985 -3409 -1291 -117 614 -65 -1025 -960 1273 3752 5744
885 5744 6873 5241 2270 1148 1097 2282 4529 3992 1805 1140 -356 -951 1712 3258 3783 3965 2747
902 2747 208 1169 3228 3121 3520 3996 353 -2348 -1586 -1547 367 4083 2879 -62 1395 1947 2555
919 2555 6317 7538 5545 5566 4474 1064 1855 3603 1247 34 -422 -4893 -5882 -3835 -4208 -2051 2066
936 2066 -103 -1945 393 1734 3309 7651 7005 3731 4249 2780 -1066 1017 1937 -2254 -2524 -4068
952 -4068 -9515 -7835 -3912 -5460 -3348 626 -2547 -3865 714 1065 1896 7187 5249 72 2727 1896
968 1896 -2471 1034 1905 -3961 -3581 -4084 -10088 -7804 -2732 -5419 -5655 -2295 -6013 -7027 -950 -943 -1448
985 -1448 4070 2254 -2575 1568 2095 -690 3708 4164 -1239 -628 -1349 -6380 -3596 159 -3777 -4563
1001 -4563 -4066 -8639 -7340 -1298 -2922 -2996 1390 -1661 -2971 3068 1970 808 6617 5153 484 3632
1017 3632 1811 -3506 1522 3628 -2699 -1928 -1664 -9247 -5252 1965 -3033 -2923 1633 -4468 -4432 4768
1033 4768 2558 -167 7178 4505 -393 5874 6066 -144 6175 8472 420 2476 3681 -4749 -1982
1048 -1982 4517 -1771 -3110 580 -6317 -7159 2096 636 -1874 4181 1874 -1948 5540 7336 3097
1063 3097 8289 9270 2369 4986 5907 -749 1966 4971 -1865 -2350 -218 -6878 -6005 1155 -1469 -1994
1079 -1994 2870 -1241 -2531 5837 5123 2517 8420 6290 440 5081 4526 -1411 3647 4447 -3505 -2147
1095 -2147 -520 -7617 -4418 1763 -3766 -4055 469 -5310 -5281 4097 1767 -1303 4832 2042 -2130 5231
1111 5231 4651 -1361 4519 5863 -1766 622 1722 -5998 -2597 2657 -4495 -5423 -2222 -8849 -8500 418
1127 418 -2023 -5277 -164 -2967 -5367 3124 3605 -1249 3575 4266 -1635 2039 3459 -2742 336 3303
1143 3303 -3393 -3887 -1299 -6915 -6394 -202 -3614 -5313 -1555 -5226 -6818 959 909 -1512 2848 1245
1159 1245 -2991 1488 3225 114 3668 3948 -2593 -1550 989 -2668 -980 1928 -3741 -4434 -623
1174 -623 -4458 -4744 283 -1661 -2595 1965 -280 -3324 1473 2754 1371 6034 5290 -928 898 3589
1190 3589 693 3434 4648 -2458 -3039 351 -2878 -2028 1434 -2570 -3680 1223 -424 -2544 2237
1205 2237 2544 1047 5770 5125 -44 2451 4794 2497 4787 5415 -723 -1612 970 -1412 -436 2191
1221 2191 -1419 -3632 -552 -614 -1245 2260 2492 955 3829 3599 278 2514 3942 2536 3821 3162
1237 3162 -537 -567 721 -488 244 1411 -896 -2188 -718 -919 61 2394 1002 75 1490 559 -772
1254 -772 1370 1691 954 1595 -152 -2521 -1203 248 -1092 -373 310 -1662 -1425 -489 -1212 354 2763
1271 2763 679 -800 575 -53 -366 1236 877 -119 -60 -1453 -3795 -2558 -1014 -2353 -2619 -2557 -3752
1288 -3752 -3180 -1597 -1876 -740 1509 660 -511 -5 976 2098 3034 2007 678 232 -805 -2808 -3007
1305 -3007 -2268 -2787 -4018 -5275 -5650 -4293 -2858 -2542 -1283 -16 405 792 1317 2466 4440 5262 3590
1322 3590 1789 1002 -3 -1082 -1712 -2259 -3361 -3758 -5226 -6068 -4128 -2080 -1361 -1156 -520 490 1576
1339 1576 2655 3526 4755 5502 3876 1656 890 790 498 -72 -1002 -2033 -2101 -2576 -3045 -2168 170 578
1357 578 116 -310 170 1493 2606 2693 2713 2970 2024 711 -184 623 1747 2007 1100 465 883 1083 868
1376 868 932 1345 1380 440 -1124 -1918 -621 266 -211 -694 -620 -992 -325 460 1221 3222 4878 4074 3051
1395 3051 3711 3976 3470 3049 1787 -116 -1079 -2640 -4397 -3712 -2622 -3232 -3903 -3384 -3296 -1323 769 1880
1413 1880 3297 4984 4667 3944 4422 4174 3432 2974 754 -1344 -1957 -3006 -4230 -3483 -2734 -3438 -3312 -3370
1431 -3370 -3541 -1076 1168 706 1883 2918 1439 1067 1792 629 418 1254 -1202 -2974 -1567 -1792 -2517
1448 -2517 -678 -357 -1958 -895 -869 -2094 -96 1767 -404 -487 211 -2066 -2111 -506 -1838 -2062 -367
1465 -367 -1561 -3025 -185 364 141 2492 2091 -192 867 932 -1073 388 946 -1801 -2562 -2538 -4421
1482 -4421 -3434 -1561 -2676 -2588 -454 -829 -216 2979 2646 2488 4808 3510 1446 2721 1211 -820 1164
1499 1164 230 -3107 -2651 -3203 -5725 -3045 -813 -2959 -2210 476 -1423 394 4841 2932 2008 5161
1515 5161 3114 1430 4593 2752 -182 2853 2278 -1761 -646 -853 -4500 -2124 175 -3592 -3304 -860
1531 -860 -3451 -1867 2955 940 239 3972 2625 2197 6451 5486 2693 5422 4859 698 1440 527 -3542
1548 -3542 -1902 -1377 -5904 -5386 -3674 -6047 -3550 627 -883 82 3808 3164 4009 8289 6684 4980
1564 4980 6989 4539 483 1572 -659 -4623 -2684 -3737 -8266 -6376 -4912 -6578 -2942 203 -1945
1579 -1945 882 4583 2600 4105 7814 5193 3744 6007 2046 -1369 1388 -1266 -4679 -1617 -3462
1594 -3462 -7741 -4143 -2360 -4820 -1476 586 -3077 -223 3711 145 513 4117 958 575 3799
1609 3799 -166 -2811 1513 711 -1441 1846 -97 -4251 -566 1187 -1545 -62 -287 -5048 -2762
1624 -2762 879 -2692 -3117 -813 -3354 -1834 2205 -621 -1933 2178 2309 2129 5344 2765 -864 2110
1640 2110 2685 259 1163 -994 -6037 -3827 -1381 -3793 -3234 -2585 -5085 -2578 1644 -66 582 3667
1656 3667 2679 3351 6347 3505 989 3052 1595 -650 984 -1656 -5802 -3460 -2459 -4410 -1860
1671 -1860 -800 -3597 -557 3001 1493 3330 6270 3378 3040 5527 2399 484 2675 -335 -3391
1686 -3391 -1378 -3260 -5969 -3086 -2232 -4208 -868 1383 -548 2123 4794 3240 4609 7232 4099
1701 4099 2651 3580 802 -843 894 -1889 -4696 -3580 -4187 -5061 -2197 -1151 -2447 -115 1860 1292
1717 1292 3398 4598 3129 3978 5021 2609 1404 1146 -1156 -1582 -582 -2549 -4019 -3093 -3580 -3216
1733 -3216 -541 -420 -1104 850 1050 902 2866 3100 1576 2493 2590 482 807 769 -1171 -1007 65 -2100
1751 -2100 -2707 -1459 -2590 -2326 -303 -1053 -2168 -649 -762 -1147 812 1193 128 1278 1753 542 1231
1768 1231 2033 622 758 1508 -479 -1415 -871 -2011 -2223 -1647 -2648 -3434 -2381 -2186 -2140 -397 475 506
1786 506 1348 1711 1531 2284 2656 1554 1243 972 -558 -1183 -1477 -2114 -2221 -2089 -2637 -2571 -1858 -1070 -345 946
1806 946 1447 1375 1663 1485 997 1216 1163 214 -208 -762 -1766 -1196 -800 -858 -261 78 117 306 1350 1454 1495
1827 1495 1866 985 -52 -225 -858 -1499 -1074 -1194 -1624 -1091 -617 -359 999 1832 2751 3101 3136 2728 2147
1846 2147 2016 958 -382 -1244 -2398 -3568 -3970 -3960 -3147 -2037 -925 218 1760 3185 4414 5451
1862 5451 5759 5759 4824 3586 1500 -298 -1686 -3483 -4723 -5734 -6484 -6197 -5218 -3607 -1609 970 2871
1879 2871 4183 5495 6630 7228 6796 5710 3780 2083 -69 -2780 -4426 -5211 -6231 -6584 -6095 -5331
1895 -5331 -3808 -1480 509 2408 4252 5228 5487 5231 5019 4182 3177 1079 -1141 -2683 -3907 -4870
1911 -4870 -4955 -4470 -4027 -2903 -1867 -932 782 2519 2900 3331 3399 2937 1954 1377 -147 -1050 -1067 -2268 -3592
1930 -3592 -3107 -2691 -2181 -673 167 471 1826 2526 1911 2155 2525 1179 101 -565 -2203 -3229 -2937 -3871
1948 -3871 -3963 -2530 -2052 -1857 -416 841 1990 3786 4271 3258 3703 3567 2108 1343 465 -1397 -2681
1965 -2681 -3317 -4863 -4758 -3804 -4027 -3483 -1446 -809 412 2125 2844 3499 5301 5089 3330 3645 2945 1029
1983 1029 618 -479 -2855 -2927 -3098 -4975 -4084 -2432 -3020 -2251 -368 -700 602 3020 2782 2814 4731 3801
2001 3801 2393 3333 2700 758 935 194 -2263 -1530 -1464 -3817 -3381 -1606 -2529 -2091 -558 -1754 -1046 2096
2019 2096 1926 1420 3650 2820 1871 3762 3657 1872 1996 1458 -1165 -275 63 -2759 -3000 -2416 -3589 -2814
2037 -2814 -1878 -3358 -2796 401 603 1129 2865 2079 1951 4341 4158 2893 3491 1924 17 1018 481
2054 481 -2410 -2466 -2756 -4463 -3053 -2319 -4277 -3240 -494 -534 349 2006 692 1097 4133 3290 2056
2071 2056 3443 1709 -427 1734 662 -2126 -1186 -1806 -4019 -1879 -868 -3443 -2273 124 -1213
2086 -1213 -136 1812 -430 -292 2968 1727 314 2347 591 -1051 1344 722 -1705 -138 -515 -2622
2102 -2622 -892 97 -2089 -982 460 -1143 -490 1449 -502 -404 1890 100 -383 1535 165 -954
2118 -954 840 -70 -1374 445 104 -1728 -277 254 -1051 656 1391 -1009 -251 970 -455 440 1490
2135 1490 -895 -1166 534 -674 -805 611 -1029 -1455 820 582 -522 1198 760 -614 1959 2063
2151 2063 -432 206 606 -1205 492 1154 -1425 -1526 168 -952 -414 1663 -425 -1233 1558 927 -142
2168 -142 1765 736 -1378 980 855 -1643 -459 -114 -2032 -44 1515 -235 33 2067 910 1356
2184 1356 3339 1615 198 1759 307 -1161 -130 -1434 -3475 -2351 -2629 -3584 -2159 -910 -1512 386
2200 386 2254 1828 2957 4459 3488 3762 4312 2347 1196 1254 -605 -2342 -2062 -3805 -4740 -3869 -4217 -4278
2218 -4278 -2192 -1227 -857 1382 2543 2197 3685 4422 3071 3621 3364 928 522 515 -1617 -2269 -1735 -3298
2236 -3298 -3612 -2384 -2721 -2624 -702 -393 -730 1127 1465 519 1828 2300 798 1484 1523 -14 -39 315 -508
2255 -508 -801 36 -939 -1242 -356 -560 -1043 11 -299 -1053 -351 -406 -962 -312 74 -708 -230 448 54 239
2275 239 1085 698 820 1461 596 362 961 24 -157 73 -750 -1113 -837 -1238 -1387 -953 -723 -929 -273 -28
2295 -28 -91 577 1100 812 1096 1213 758 651 870 464 222 350 -140 -542 -90 -596 -704 -265 -419 -623 -401
2316 -401 -163 -535 -113 23 -211 -88 338 112 347 767 735 656 1153 824 618 908 443 106 137 -322 -751
2337 -751 -815 -899 -987 -865 -821 -595 -47 109 243 724 1057 1424 1225 1087 659 262 159 -392 -761 -861 -1124
2358 -1124 -1315 -1017 -670 -352 448 946 1101 1662 1847 1847 1808 1690 1044 139 -443 -1424 -2074 -2388 -2839 -2757 -2164
2379 -2164 -1987 -1493 -386 606 1394 2383 2940 2886 2961 2833 2057 1492 545 -674 -1466 -2305 -3162 -3186 -3119 -2890
2399 -2890 -2428 -1571 -645 355 1346 2080 2559 2853 2691 2266 1823 1250 102 -401 -1332 -2256 -2300 -2420 -2446 -1969
2419 -1969 -1200 -725 -80 623 935 1374 1975 1751 1525 1533 731 -118 -158 -724 -1316 -1292 -1463 -1516 -1067 -777 -560
2440 -560 247 758 796 1108 1331 847 765 841 193 -334 -386 -962 -1352 -887 -1022 -937 -267 -70 35 793 972 927
2462 927 1376 1334 785 767 423 -408 -259 -179 -1061 -989 -950 -1540 -1136 -18 -360 -210 844 584 824 1713 1328
2483 1328 661 1214 1097 -17 358 88 -1312 -667 -491 -1297 -1110 -555 -1157 -580 505 67 20 1057 699
2502 699 482 1466 1316 560 1031 723 -124 212 118 -964 -548 -360 -1216 -971 -357 -920 -649 254 -34 -42 899
2523 899 523 369 1378 936 551 1105 698 0 590 44 -893 -103 -283 -1379 -1094 -840 -1451 -814 -307
2542 -307 -1209 -771 432 -101 89 1409 596 727 2206 1314 630 1376 742 -224 524 59 -1452 -796 -964
2561 -964 -2106 -1313 -891 -2395 -1541 -25 -1062 -455 1108 196 701 2442 1496 813 2350 1563 342
2578 342 1539 680 -997 -61 -320 -1937 -1145 -779 -2548 -1910 -656 -1573 -994 136 -720 -240 1696 1086
2596 1086 455 1822 1337 834 1855 1274 -249 662 230 -929 -428 -270 -1930 -1528 -708 -1537 -896 -239
2614 -239 -1078 -546 1147 409 561 1446 760 536 1715 761 -16 982 220 -602 466 19 -1105 -304 -187
2633 -187 -1039 189 459 -1234 -446 347 -681 -265 722 -655 -679 867 72 -225 1327 744 97 1612
2651 1612 1307 229 1469 1316 -541 412 484 -1595 -1189 -602 -2112 -1738 -677 -1897 -1452 192 39
2668 39 136 1896 1626 1306 2649 2500 1224 1974 1440 -255 -99 -417 -2212 -2033 -1578 -2591 -2349 -1280
2686 -1280 -1877 -1060 688 586 832 2008 1682 1663 2507 1555 778 1152 293 -686 -315 -861 -1742 -1243 -960
2705 -960 -1566 -574 -131 -826 -59 796 443 584 1135 125 -12 459 -230 -621 138 -584 -952 217 3
2724 3 -532 677 915 31 991 1132 -89 493 783 -672 -579 -281 -1240 -1524 -643 -1473 -1367 21 -226 -217
2744 -217 1035 801 717 1700 1836 792 1213 1136 -48 89 42 -1503 -1526 -959 -1712 -1630 -1097 -1438 -1180 44
2764 44 353 514 1255 1201 1283 1835 1788 1022 799 648 -156 134 -327 -1267 -1185 -1405 -1681 -1081 -787 -1016 -757 29
2786 29 203 514 1075 886 917 1567 1268 786 930 643 196 345 40 -527 -531 -614 -978 -689 -336 -782 -845 -249
2808 -249 -374 -211 274 -39 57 616 596 254 632 594 242 572 532 420 198 175 -297 -115 -19 -426 -417 -335 -908
2831 -908 -563 -220 -387 -399 -76 -42 109 435 629 360 590 488 421 353 440 68 72 90 -384 -268 -388 -545 -409
2854 -409 -383 -312 -340 -77 -124 9 221 103 20 264 228 108 366 277 334 356 177 -16 185 96 70 -88 -106 -379
2878 -379 -356 -489 -685 -732 -608 -527 -622 -36 -148 55 498 573 699 834 1102 774 704 568 310 -14 -427 -751
2900 -751 -688 -907 -1050 -1106 -773 -720 -607 -182 46 209 721 870 769 998 848 702 631 324 0 -163 -146 -369
2922 -369 -383 -374 -664 -515 -324 -220 -227 -1 61 160 396 213 143 385 115 23 77 -48 -151 45 -216 -101 38
2945 38 148 55 208 450 262 194 202 -114 -61 137 -299 -250 -175 -316 -354 -8 -144 -225 242 -42 -203 304 268 30
2969 30 246 419 -184 110 457 -77 82 58 -182 -239 37 -272 -170 -62 86 -62 202 266 -154 161 195 -66
2991 -66 189 248 -220 4 313 -209 -90 38 -387 -284 30 -286 -335 61 -103 -191 287 -14 -60 419 458 268
3013 268 404 300 -63 134 188 -275 2 -43 -648 -150 38 -293 -277 152 -250 -260 163 53 -69 564 161
3034 161 -62 331 119 -225 -4 133 -520 -100 151 -553 -5 254 -297 17 571 -87 121 769 -218 -165
3054 -165 539 90 -200 31 -310 -753 -32 13 -720 -18 104 -603 75 605 -124 83 758 -65 63 729
3074 729 166 -317 343 -48 -452 244 -205 -722 -34 144 -584 180 101 -523 5 323 17 143 467 -421
3094 -421 90 677 98 -184 216 -429 -153 189 -13 -225 145 -213 -212 461 246 -529 236 241 -397 291 131
3115 131 -186 267 425 -363 176 596 -358 -127 503 -402 -299 388 -333 -393 269 -191 -575 456 227 -487
3135 -487 527 561 -359 455 679 -584 168 645 -384 -154 306 -552 -702 221 -423 -739 266 -217 -423
3154 -423 467 501 -251 259 494 -122 365 434 -516 -134 454 -256 -176 102 -627 -439 359 -282 -482 223 -95
3175 -95 -165 733 185 -117 337 273 -10 316 177 -462 -195 -36 -411 227 89 -422 19 440 -95 -171 319
3196 319 -252 -35 565 -59 -665 240 -147 1 376 -26 -583 296 594 -153 516 396 -415 84 617 -178
3216 -178 -184 75 -719 -403 326 -406 -826 -131 -278 -400 513 384 -200 513 760 341 690 745 -119 64 512
3237 512 -226 -242 11 -856 -584 -109 -492 -574 -28 -252 -295 87 108 3 472 290 -73 355 303 14 229 42
3259 42 -340 192 261 35 -81 143 -52 82 151 -73 -54 -54 -357 -468 -114 -224 -594 -151 -159 -149 115 254 30
3282 30 653 812 335 529 682 128 202 495 -160 -267 -240 -715 -929 -393 -507 -598 -309 -198 -113 440 545 410
3304 410 546 829 512 648 599 3 82 364 -222 -386 -139 -629 -710 -311 -315 -396 -177 -228 -257 286 280 227 385 456
3328 456 221 325 314 103 161 200 24 -81 -75 -74 -106 -31 -314 -289 -302 -251 -321 -228 -216 -296 -101 -29 39 186 271 208 437
3355 437 415 312 467 414 116 144 121 -167 -199 -266 -259 -238 -186 -440 -343 -197 -182 -16 97 110 90 60 294 86 160
3380 160 258 111 -63 -1 46 33 160 95 170 265 78 41 215 -27 -152 -95 -29 -346 -95 -43 -148 -187 53 -152
3404 -152 45 163 192 151 434 241 71 364 186 26 12 -321 -487 -222 -384 -514 -74 -209 -49 286 280 350
3426 350 424 601 213 478 251 73 -65 -190 -255 -506 -552 -483 -595 -438 -291 -271 159 236 348 658 537 510
3448 510 655 594 422 165 -62 -398 -555 -455 -710 -546 -627 -470 -540 -152 -65 261 671 435 595 785 509
3469 509 333 328 265 -71 -176 -127 -460 -516 -313 -496 -385 -282 -172 12 126 234 361 497 227 231 302 117 -192
3492 -192 -96 -110 -176 -113 -37 -287 -196 17 -239 51 156 -44 -46 129 21 133 39 -235 -182 35 -400 -143 101
3515 101 34 -164 351 229 153 333 354 170 410 283 -228 -109 -195 -357 -521 -282 -650 -575 -182 -255 -243 248
3537 248 189 80 554 531 430 613 509 306 601 481 -208 13 -96 -562 -468 -326 -757 -636 -262 -634 -279
3558 -279 117 -36 2 484 411 322 530 537 180 217 273 -25 257 1 -365 -241 -102 -386 -365 -9 -486 -375 78
3581 78 32 -59 364 34 -52 255 329 53 390 134 -231 391 180 -228 63 17 -485 -52 134 -524 -413 -166
3603 -166 -219 98 341 -367 -129 327 50 280 629 189 -8 741 443 -163 276 19 -432 -206 50 -712
3623 -712 -317 -211 -866 -233 34 -406 -366 220 95 149 837 509 34 780 741 117 344 380 -59 107 221
3644 221 -346 -473 -183 -723 -421 -25 -489 -390 48 -20 -26 252 233 20 397 358 -14 279 128 60 426 159
3666 159 -76 157 218 -242 -13 129 -351 -451 -140 -533 -437 -215 -592 -392 124 -304 -256 375 218 313 779
3687 779 673 315 916 716 186 510 239 -488 -137 -314 -995 -970 -575 -1074 -766 -323 -592 -354 365 507
3707 507 386 997 957 605 1406 1261 487 538 288 -461 -171 -327 -1265 -1078 -866 -1244 -1020 -441 -446 -641 430
3728 430 606 666 1185 1064 730 953 926 476 567 184 -296 -181 -213 -740 -643 -759 -943 -607 -356 -534 -470 -150
3750 -150 -129 321 423 257 218 580 525 304 348 158 128 324 219 15 174 77 -242 -72 125 -433 -345 -171
3772 -171 -568 -550 -395 -540 -462 127 -107 -208 519 443 372 793 711 506 714 684 273 194 206 -264 -490 -450 -880
3795 -880 -914 -700 -987 -660 -387 -143 -45 350 520 711 886 933 666 848 636 267 242 -134 -449 -676 -491
3816 -491 -801 -850 -658 -527 -504 -254 -19 138 299 430 673 668 746 495 613 303 84 131 -163 -423 -326 -364 -649
3839 -649 -589 -366 -360 -222 -143 -297 8 338 254 143 529 537 418 304 277 106 305 40 -375 -76 -131 -321 -458
3862 -458 -214 -362 -229 46 -154 -109 -69 22 85 316 309 215 381 206 269 239 113 -34 -13 7 -39 -426 -298 -350
3886 -350 -341 -179 -267 -253 -10 -104 207 448 164 455 300 461 230 252 191 86 -44 -199 -200 -241 -302 -376 -404 -123
3910 -123 -174 -155 -75 163 281 262 234 386 265 217 190 155 -72 9 16 -93 -51 -72 -41 -60 -45 -78 -17 -11 -10 -37 -53 -104
3938 -104 -182 -96 114 -33 -44 22 79 161 102 350 329 447 470 372 355 58 51 46 -156 -405 -473 -521 -594 -624 -335 -456
3964 -456 -225 -43 -57 232 415 453 507 703 467 632 449 320 117 -40 -295 -607 -645 -716 -630 -654 -329 -337 -47
3987 -47 -59 111 407 648 522 747 500 493 257 121 237 -146 -333 -629 -725 -603 -691 -735 -495 -164 -126 187 255
4010 255 275 529 623 458 416 477 295 137 97 -222 -394 -218 -321 -583 -203 -268 -342 38 -44 83 191 377 238
4033 238 238 149 -62 43 -11 0 -113 137 -75 -100 28 13 -77 167 186 73 188 221 -91 244 65 -156 -128 -53
4057 -53 -170 -315 -26 -100 -157 -10 79 176 437 236 183 234 350 -38 236 100 -164 -194 -236 -493 -409 -267 -278 -85
4081 -85 4 -10 187 394 70 365 457 6 195 572 -21 -95 -25 -214 -481 -115 -409 -464 -221 -253 -505 196 193
4104 193 -31 239 548 217 382 589 136 39 337 -49 -211 68 -346 -360 -207 -429 -482 -247 -126 -368 -146
4125 -146 291 -75 57 270 119 273 401 232 72 433 -63 94 50 9 -203 90 -101 -246 -56 -163 -261
4146 -261 -22 -25 -270 -31 29 233 88 258 -30 85 298 128 108 205 -52 -22 194 -196 -239 -201 -243 -272 -59
4169 -59 -84 -331 126 137 122 309 335 34 266 271 -27 104 61 -304 -277 71 -382 -302 -194 -405 -199 116 216
4192 216 -53 346 364 283 335 399 -27 55 100 -174 -174 -27 -453 -499 -125 -181 -85 -27 14 8 325 262 154 297 332 148
4218 148 279 225 -56 -57 -178 -329 -345 -129 -360 -46 -50 -229 219 197 -112 86 201 268 98 117 229 -286 -223
4241 -223 -150 -379 -55 -290 -227 -87 59 61 219 210 162 239 191 132 105 214 -88 -91 140 -247 -319 -86 -163 -171 -142 105
4267 105 -77 113 317 66 118 473 136 221 90 -195 -150 30 -257 -465 -230 -402 -344 -68 10 -133 139 159
4289 159 125 437 473 255 507 263 116 25 92 -101 -14 -141 -489 -390 -263 -334 -130 112 118 -35 226 129 188 497
4313 497 596 242 318 258 -40 -104 -154 -239 -221 -232 -290 -217 -132 -119 -34 188 -242 112 402 287 362 202 162 5 86
4338 86 100 -310 -84 -225 -277 -35 -232 -250 -166 -18 -32 28 139 186 91 352 55 12 263 106 -3 -14 -107 -78
4362 -78 -20 -204 -172 -167 6 -143 -190 -16 -103 -53 1 255 18 38 71 222 130 -35 59 141 79 -2 31 -103 -139 -62
4388 -62 209 -115 -131 -50 -123 -108 10 -180 -106 -86 46 2 117 -59 112 -96 154 -5 1 121 -48 -171 -14
4411 -14 -201 -303 -19 -29 -91 76 -41 94 -36 259 161 62 -53 98 24 -108 3 103 -113 -37 35 -33 -104
4434 -104 -9 56 42 68 4 194 186 66 72 50 39 6 -36 -38 -232 1 24 -142 -140 140 -16 10 125 136 116 290 226
4461 226 -18 59 -3 -111 -164 -103 -213 -303 -254 -255 -81 -30 -93 209 353 53 249 525 335 242 261 45 74 -44
4485 -44 -222 -306 -232 -239 -542 -355 -185 -123 -65 158 268 221 380 341 309 210 305 113 18 -196 -161 -280 -380 -448 -246
4510 -246 -188 -295 15 69 232 295 454 345 350 392 222 111 130 -79 -216 -267 -377 -433 -216 -89 -117 76 85 200
4534 200 316 280 244 170 293 161 66 -14 -269 -349 -283 -267 -418 -88 -264 -192 -35 134 252 255 442 251 397 340
4558 340 272 153 5 -291 -234 -416 -312 -348 -242 -291 -240 -109 102 100 441 129 236 576 365 333 144 -44 20
4581 20 -160 -257 -600 -384 -395 -447 -359 -102 -96 -140 279 134 179 423 321 295 281 167 13 222 -151 -118 -16 -123
4605 -123 -279 -50 -266 -160 -49 -59 55 158 132 31 104 165 -20 -35 71 -77 -258 80 100 -275 29 -39
4627 -39 68 70 116 201 13 -49 -60 67 67 -42 -140 -26 -73 -93 -86 -65 -28 160 26 -10 149 94 21 93 109 -73 152
4654 152 -111 -233 -34 61 -243 -45 -205 -292 -18 183 107 -43 217 -68 -60 346 262 37 286 -16 84 174
4676 174 -86 -248 106 -103 -297 39 -22 -119 -59 116 -247 -173 47 -106 -220 103 -11 -63 207 57 -132 136
4698 136 166 46 69 79 19 -220 -45 -163 -205 -275 -272 -87 22 -131 -50 60 82 126 255 294 202 219 153 99 157 7
4724 7 -22 -274 -160 -322 -113 -157 -261 -118 19 -88 244 284 45 337 347 208 22 237 90 -3 148 -101
4746 -101 -211 -159 -185 -137 -259 -272 -177 -103 216 89 127 215 135 112 416 97 -70 126 17 -97 -2 21 -286 -26
4770 -26 39 -131 -1 73 -163 -52 29 -93 103 130 -124 15 142 -28 29 -48 51 -34 109 -38 17 118 74 85
4794 85 50 -69 45 18 -119 -164 37 -36 55 3 -154 -111 -27 75 -108 -24 82 100 -34 133 144 -15 66 111 78
4819 78 144 12 -150 -66 -38 -111 -69 -219 -166 -54 44 -73 -25 66 82 168 142 63 99 129 77 -16 -61 -48 -98 -198 -45
4846 -45 -151 -62 -171 -215 -143 -162 -80 73 155 141 269 287 283 112 232 92 -171 -21 31 -300 -226 -52 -179 -110 -27
4871 -27 -215 -68 73 157 -123 114 6 180 365 235 42 28 52 38 55 -47 75 16 -207 -114 39 -96 -126
4894 -126 19 -63 -159 78 -22 -15 2 -64 -143 -27 -92 -61 72 0 -123 -82 44 94 121 -102 -76 -170 42 -15 -13 80
4920 80 31 5 -214 229 -56 -91 97 -36 15 -5 63 -20 -67 -82 3 -17 -184 -12 -170 133 -209 -115 -174 -129 -59
4945 -59 1 146 -11 123 119 44 115 103 64 50 -13 52 -79 3 -51 -47 -171 -235 -98 -129 -141 -13 115 53 -74 5 -60
4972 -60 -51 245 37 42 51 -128 157 169 121 153 99 -52 -90 -8 -2 -137 -119 -163 -77 -116 -198 -157 -72 -81 -18 145 96 137 137 292
5002 292 155 184 209 118 -47 120 -261 -128 -228 -252 -263 -313 -250 -334 -85 -23 26 99 159 210 290 294 102 159 24 20
5028 20 -184 -202 -105 -148 -223 -272 -145 -175 -133 -47 -10 205 52 168 49 79 160 292 -128 -218 -79 -78 -287 -207 -31
5053 -31 -71 -35 -41 -6 -101 290 113 150 -55 -11 35 -118 -115 -162 -103 -191 -163 96 -100 35 211 142 216 208 325 76 338
5080 338 95 -10 115 -95 -367 -171 -141 -318 -207 -163 -354 -33 -17 -43 157 94 204 200 325 209 225 140 72
5103 72 48 -108 -46 -189 -130 -127 -222 -317 -122 -154 -133 153 61 236 180 138 68 216 -53 75 -13 -20 -44 10 -45 -33 -84
5130 -84 -128 -102 -69 -75 -263 -8 -142 -27 24 -187 -120 -10 -247 -56 16 212 -194 134 218 135 132 209 177 -18 24
5155 24 -153 -63 -139 -136 -317 -50 -133 -217 -97 -49 -37 0 211 -30 168 163 109 239 267 135 -67 80 58 -117 -148
5180 -148 -115 -298 -9 -83 5 -217 -59 -18 159 151 134 157 171 108 -141 363 153 58 185 -49 18 -59 -80 -107 -141
5205 -141 -157 -126 -172 -80 -220 47 -76 163 45 78 -54 151 175 -1 130 262 -163 13 48 -94 -120 -72 -34
5228 -34 -143 -53 -246 -190 80 123 -147 1 61 113 -32 148 152 48 134 -23 -6 -142 -141 -85 -140 -108 -184 25 58 -182
5254 -182 -65 42 177 55 91 19 139 54 15 10 12 -94 -200 -74 28 -104 -61 71 -179 21 84 17 29 22 -92
5279 -92 146 30 -15 -69 8 9 5 -62 155 2 83 -83 94 148 55 155 127 70 85 -108 -139 -378 -107 -149 -61 -61 -179
5306 -179 -120 84 99 -28 168 17 100 168 256 -80 171 98 10 -18 -81 -79 -245 -275 -212 -134 50 12 44 119 108 53
5332 53 178 110 61 -14 -54 -48 -213 -46 75 36 -212 -176 44 19 157 -33 -43 -24 -49 -67 11 83 -16 183 -309 -99
5358 -99 -34 -59 -36 -14 88 -36 51 46 -138 9 -1 -80 99 -150 -48 82 -72 -102 50 63 -7 35 -20 11 182
5383 182 29 -37 31 -24 -34 132 4 18 68 -83 -39 41 -53 -95 42 -21 88 -107 -39 -64 13 13 74 -29 -92 -38
5409 -38 -53 -116 5 -71 -71 -36 83 85 149 127 52 18 64 121 -17 -70 54 -77 -168 -129 -40 -37 -123 -92 -50 19 70 37 119
5438 119 -79 -39 10 -65 13 86 9 86 -49 29 13 -30 34 -35 -76 96 32 92 138 75 56 -62 5 -4 140 -22 -7
5465 -7 207 157 117 -2 66 119 -17 -66 -6 -19 99 34 -88 -53 129 167 2 -30 183 89 52 157 75 -84 33
5490 33 58 30 43 -24 -55 37 -1 -101 -84 -93 47 -122 -20 -26 11 24 58 -261 90 -157 -68 238 11 225 109 177
5516 177 107 114 7 122 225 -96 -132 102 21 77 45 -149 39 -176 69 -115 -29 -12 6 234 -44 37 90 186
5540 186 8 50 45 -7 -35 -64 -71 -45 -119 -133 -72 -146 -109 55 -2 6 142 12 41 113 54 -13 58 110 -72 153 23 10
5568 10 1 -134 -74 55 -106 5 143 -76 85 36 -154 52 146 0 47 -91 -15 -142 18 -4 -11 90 -6 4
5592 4 14 118 12 -16 80 -41 97 117 14 -123 -38 -24 52 -126 53 -69 17 -49 6 164 10 -12 -47 -52 130
5617 130 -18 -40 -51 87 -12 -187 -143 -90 -219 -158 -39 -195 -147 194 -32 -63 170 149 -79 124 66 180 229 -82
5641 -82 -127 35 -177 -113 -157 -62 -59 131 -97 -77 4 -58 26 -49 25 93 26 22 176 10 27 37 -152 -166 -54 -188 11
5668 11 -184 -91 -50 7 16 89 104 5 -24 64 -6 120 -23 -79 -135 48 -80 18 3 106 14 -1 -199 46 147 6
5694 6 -177 99 -10 62 12 1 -26 7 195 -131 -65 7 -106 -115 -60 -30 -49 86 33 -48 81 -63 -86 11 -41 -74 44
5721 44 -62 -5 -17 54 -61 -54 47 -53 84 -36 64 22 71 28 -37 -2 191 -152 136 105 -46 -100 -124 13 79
5746 79 10 12 -162 -8 -14 -215 1 3 -25 120 38 -40 20 14 21 65 -1 -14 8 19 13 -197 -52 27 -9 13 -43 -34 -13 102
5776 102 -39 157 -18 127 189 -65 36 -189 42 -43 151 -35 -185 -32 -240 -53 136 -1 -23 23 136
5797 136 125 175 -6 273 31 42 -4 56 -97 -167 -111 -182 -150 24 -35 -27 -126 -96 -20 274 90 130 137 149 73 -92 -110
5824 -110 -81 5 -105 91 -147 151 -136 -14 -47 -98 -18 152 67 -1 22 134 198 96 51 -71 -220 -80 8 -51
5848 -51 -48 -112 -132 -18 -69 -95 77 2 80 27 192 132 2 36 47 -52 -48 37 -100 -119 -4 -75 -99 139 -56 83 16
5875 16 -91 -48 33 -138 13 90 9 -67 61 -144 -8 51 -62 -18 -95 56 89 0 -7 42 60 -95 145 -41 27
5900 27 -7 -180 -139 -84 108 -47 11 48 7 51 104 -56 125 84 -162 -92 34 108 127 143 46 100 -20 -173 -3
5925 -3 -113 -50 61 6 35 -111 -21 60 -86 -49 -73 -48 132 34 126 -55 -24 -147 28 -41 73 -54 55 71 -87
5950 -87 50 -113 -51 103 -32 10 25 114 69 38 -25 94 83 -11 -113 -26 -189 -237 -7 -26 15 -80 -219 -85 23
5975 23 -168 -224 -11 88 -185 -33 -23 -161 -52 61 1 130 -95 73 20 -110 -37 -15 -87 4 23 -188 -115 -67
5999 -67 80 -77 -35 -9 63 178 71 -84 28 102 128 13 -123 -2 -93 -100 -212 -43 -45 -219 -21 -178 -53 79
6023 79 -64 78 -19 10 -30 -10 30 76 98 -89 6 -9 -25 120 51 -147 -43 84 46 -32 104 -66 88 13 91
6048 91 4 -75 -29 71 85 139 176 36 -30 -114 26 22 -17 42 34 -54 -85 73 -105 -166 69 -9 59 76 -58 13 31 -61
6076 -61 20 -122 139 100 -46 -90 71 -67 98 -116 89 1 -24 46 -15 -35 -65 -264 -67 -38 -3 92 75 -44 77
6101 77 -52 13 145 -83 -78 5 -41 137 -7 -71 -138 -22 -176 -125 -114 -43 -9 63 67 -26 69 162 -20 7 4 -110 6
6128 6 100 -127 -85 -43 64 -60 167 62 16 58 -52 -22 -95 37 11 95 -106 -17 43 -83 -119 77 9 -28 6 29
6154 29 50 -41 55 170 109 94 -74 22 -21 -116 54 46 16 29 11 44 -94 178 -27 23 242 115 -22 6 36 -26
6180 -26 105 96 257 54 78 -77 58 20 -101 201 -48 -27 42 57 -74 143 -79 182 14 -99 155 -25 -7
6203 -7 211 -173 84 103 -33 -2 -59 -49 3 116 -71 99 126 -60 7 47 -166 63 29 27 86 101 86 -11 98 36
6229 36 40 48 -70 72 -67 12 0 -34 -96 219 52 0 -41 53 29 70 64 6 32 -39 -79 -63 -99 -179 -33 -29 135 -39
6257 -39 7 100 30 -21 1 149 110 -187 79 -23 -26 -15 -54 -46 131 47 -23 122 32 -86 9 -29 -146 14 -100 -73
6283 -73 179 19 201 213 132 40 47 98 75 37 -119 54 -29 -93 -51 0 87 -24 -38 56 -135 -51 85 -88 45 -33
6309 -33 34 -7 171 -8 -87 -164 29 9 32 28 -53 129 -11 159 86 44 -47 71 69 29 37 4 8 121 -111 35 -56
6336 -56 132 -29 -90 24 -11 24 258 96 87 1 137 60 -47 -21 -4 -132 -12 104 22 185 88 -72 3 -24 -55
6361 -55 151 171 126 38 161 67 82 29 62 -148 -107 -170 -92 -21 46 -112 -96 -42 -70 97 -26 27 -26 -47 78 132 215
6388 215 78 -132 -150 -32 -66 -79 103 -217 -19 -99 29 -69 -58 -73 68 141 -137 64 99 63 138 -84 10 -228
6412 -228 -80 215 -214 -36 89 59 -11 145 -78 36 21 -90 -52 61 25 -74 -38 -96 15 67 70 -5 -12 -35 4
6437 4 168 26 18 146 -47 -15 -52 65 13 11 148 -12 159 -70 -37 -141 39 86 15 -30 33 -13 -9 39 46 -74 -74
6464 -74 -256 93 -133 -76 -141 -46 58 -144 -25 -83 47 -116 -71 -94 -18 127 39 108 147 188 73 -172 -48 155
6488 155 100 -92 -24 14 -47 29 5 119 3 -40 31 102 110 164 -42 26 17 11 57 51 53 -41 -151 -30 -210 -99 141 -173
6516 -173 -10 108 50 -32 -33 64 114 -65 18 -135 -57 -118 156 108 -20 -14 157 -160 87 -1 -127 -15 99 -18
6540 -18 62 15 -6 32 -85 58 252 -39 113 110 21 105 -59 -98 28 110 -125 -96 -65 -27 -66 -66 -55 -76 96 56 138
6567 138 12 71 14 -28 -108 -69 17 82 47 -102 114 -66 -49 -43 19 -54 -100 -145 16 -36 57 75 53 223 97 -8
6593 -8 -17 -171 58 2 44 78 -201 73 223 -15 -142 -70 -179 -26 -188 -47 22 22 -91 66 -20 -28 -42 -12 29 -12
6619 -12 -31 69 -90 -62 -35 -117 168 2 216 201 -28 30 -109 47 -1 50 -155 -81 -75 -12 101 -125 201 35
6643 35 -3 93 84 -79 -77 55 -39 6 -139 1 -12 24 -83 -44 32 -52 -139 -97 37 -101 31 -81 81 -49 130
6668 130 39 -186 -86 146 84 -45 -28 72 8 -7 54 -19 -15 14 100 164 46 -2 -43 -70 -5 132 47 66 -68 33
6694 33 152 72 24 -19 110 13 13 -74 42 24 2 8 185 -91 -2 -118 162 176 -51 26 161 -22 7 -59 -71 -18
6720 -18 122 46 -222 -29 131 39 102 105 -34 27 -24 181 46 3 84 101 120 -123 -34 12 52 -209 -190 -86 52
6745 52 131 55 84 -13 -69 6 35 173 33 -144 -168 55 -3 -85 -16 -21 44 136 13 -70 47 26 62 -19 7 36 -222
6772 -222 -15 0 14 133 66 18 -46 15 19 -35 -187 73 -174 -91 55 47 -166 53 -3 -19 -99 -94 -7 -45 -23 241 66
6799 66 -34 -158 9 -8 -71 -32 53 -56 42 65 75 -15 70 -79 3 -45 -117 -68 -11 -25 -105 50 -47 92 -194 -11
6825 -11 107 -90 -71 57 64 21 -17 -64 85 49 -123 -48 23 -31 124 32 8 49 52 78 38 135 5 26 112 -121 113
6852 113 -43 -39 -68 -52 -76 28 -104 -88 -30 -2 99 83 131 -2 -72 -109 139 -119 11 -184 77 -16 74 36 -15
6877 -15 27 -223 -4 -222 79 45 67 -82 -51 72 88 15 -13 52 181 -67 -19 74 77 164 -112 -83 -146 -20 6 20
6903 20 38 124 60 -18 94 -34 -42 -81 -131 -150 50 -42 -20 -23 11 -8 -7 -74 65 -79 -47 -80 -170 147 -59 -57 123 58
6931 58 -29 37 -63 -50 33 39 -72 53 -87 56 -39 121 40 -53 14 -135 -26 -34 -73 215 1 32 184 39 -5
6956 -5 0 -64 62 -47 51 -40 139 30 184 -129 20 -95 26 17 -71 -82 40 54 -45 24 35 70 151 -12 55 -12
6982 -12 152 89 -187 178 2 31 122 -66 -27 73 2 15 -36 -72 116 37 0 154 -38 3 139 -62 49 -87
7006 -87 16 -18 84 -67 40 70 -101 -29 84 -78 -14 -133 -110 108 -54 60 4 -63 5 -136 -23 95 -114
7029 -114 -75 -141 181 -55 5 -109 31 -84 -86 -80 77 -32 -44 166 68 -24 -1 26 40 8 133 -1 49 206 17
7054 17 11 54 -170 -29 -6 78 24 50 170 -139 -79 -61 -140 141 5 53 -9 -73 -55 -103 -23 -46 -4 -85 111 177 -106
7081 -106 -183 117 -55 -55 -26 76 -90 89 -46 16 -21 -47 43 -44 -29 -117 157 -38 106 157 -66 -54 44 71 18
7106 18 -31 -119 5 11 -81 -93 -24 5 -29 -115 32 -38 -23 -37 63 92 24 20 -18 -96 114 -49 47 -151 -102 12 -64 60
7134 60 -67 -1 145 137 -14 152 71 -22 -148 225 -70 -68 -168 37 21 -17 19 -149 129 -19 38 39 -109 -5 -27
7159 -27 5 -55 -29 73 -43 127 -26 -96 -64 38 87 26 119 75 -48 -66 -76 -88 -71 -103 106 -18 35 -179 -111 -55
7185 -55 60 35 -101 -16 -116 117 -81 116 37 -93 123 19 -36 -136 -21 47 51 -34 8 31 -14 55 78 43 56
7210 56 3 69 16 41 -48 -16 150 -89 24 -43 -46 -180 169 24 75 102 39 -121 57 42 201 35 69 173 202
7235 202 -76 -96 43 0 -119 151 -144 40 37 -87 -15 0 6 -92 -26 204 -74 94 127 -80 -61 -93 -73 49 100
7260 100 41 108 40 -53 55 -49 14 -34 -65 91 -84 -26 -53 -61 135 162 212 -105 -18 103 41 -3 -81 10 -79 -63 0
7287 0 -15 20 22 -14 -32 52 -135 -34 -59 -23 -142 -93 7 -58 112 82 -26 -21 -79 8 2 142 -65 -28 26 -119 -21 -29
7315 -29 61 -168 -100 47 -99 -9 -221 65 83 110 7 -76 62 149 -28 -62 8 138 20 -69 18 235 75 -35
7339 -35 -12 6 75 -258 -67 -70 -123 -4 18 8 154 -24 29 103 -71 -89 7 -4 56 -16 74 -56 -93 106 -75 6
7365 6 11 -55 6 -88 60 59 8 -35 -37 85 51 -126 -30 -74 -65 -104 -120 -39 -102 70 -18 -197 -70 -103 8 -48 89 35 49
7394 49 103 -49 30 -83 40 -90 -48 -32 16 -62 90 -161 -9 -31 -184 -66 -35 -28 73 50 -112 110 -11 70
7418 70 11 55 36 46 -62 -42 -2 32 -31 26 -114 -31 -96 125 128 52 -27 -72 59 -82 -150 -156 -81 -9 -5 -142 113 1
7446 1 13 52 -84 21 -16 -62 -137 -54 -52 -52 -39 32 108 -64 -54 -30 69 -24 1 -74 -106 5 -5 44 -59 29 34 166 -127
7475 -127 70 -42 14 50 -61 21 78 -76 -8 70 5 -79 -17 -12 -99 20 -120 -9 92 61 -12 -112 -10 29 100
7500 100 -84 -30 127 9 -28 -34 -15 -103 141 -63 6 -10 -53 -112 106 -26 -117 73 22 106 -88 -77 -44 -100 -123 120
7526 120 -92 40 101 117 13 -19 -75 -109 36 179 48 -78 -9 -123 29 79 -133 60 -54 -47 30 18 92 -105
7550 -105 13 84 -47 -12 -15 162 -50 152 27 -45 100 -2 15 37 -68 -149 -35 16 -104 -66 27 -30 -11 -61 -83
7575 -83 -115 -70 -18 14 -37 -201 89 -100 76 52 64 -123 153 64 -31 140 -29 -102 -22 -209 -66 61 -108 62
7599 62 -97 50 2 -47 69 -93 87 156 31 10 -30 118 -135 -86 24 -79 -30 -80 -24 -88 -98 90 233 83
7623 83 -61 29 38 114 -50 -10 -46 -48 -26 -11 95 -70 23 77 -9 -80 -3 -4 51 19 27 -95 -52 -44 8 119 99 -107 0
7652 0 3 11 31 -169 -153 -12 10 -20 -52 45 48 53 -43 -141 -120 -103 -98 119 -56 -56 -12 161 -20 126 102 -118 -24 78 -45
7681 -45 -177 66 18 46 -83 -49 -56 2 76 -95 -79 -54 18 128 159 -148 -13 158 29 -60 114 -65 142 48 -39
7706 -39 -127 -129 228 14 46 -75 -115 68 78 24 25 -117 95 82 -22 -15 -66 93 -74 -121 -59 -34 -32 -18 13 47 58 -89
7734 -89 -5 -96 18 38 42 40 -171 108 51 35 -89 75 -45 83 -58 -136 37 -11 -92 -73 39 1 51 70 -95 18
7760 18 -82 -14 21 -117 -63 18 9 74 115 47 119 -81 12 125 -45 12 112 -2 213 24 106 75 56 -122 157
7785 157 16 27 -104 -57 -17 38 118 83 -97 -42 -19 -3 65 -80 -19 -17 -21 -95 78 127 9 -67 -87 -63 1 114 -126
7812 -126 -60 -51 -73 35 53 -40 -22 -18 -9 230 8 51 -75 -20 138 -12 -153 48 150 109 -6 20 -81 -1 0 -111
7838 -111 -85 12 74 25 157 -71 -12 35 -46 -37 124 -27 106 -22 -151 -88 9 44 -21 -126 -5 -3 -102 96 -148
7863 -148 25 228 95 -72 135 -87 -114 -89 11 -138 -140 -145 -86 8 105 -53 40 7 -22 196 -116 -29 104 4
7887 4 70 57 46 74 36 -67 -284 45 114 -78 79 41 -55 75 -62 -12 70 87 30 -85 -73 2 133 -10 -93 53
7913 53 -19 -81 -27 -56 138 -23 10 182 -82 -29 -81 3 40 124 13 30 -23 -17 -97 -107 17 82 -155 -27 -64 -115 63
7940 63 -53 -187 148 -63 -71 38 16 72 87 76 -50 -130 -40 -18 46 -47 -167 -53 -64 9 29 -92 -84 -43 -15 -145
7966 -145 53 -141 -3 -88 -32 121 21 -54 53 -96 18 99 6 -35 -15 -25 203 14 -65 -84 3 -33 -37 92 152
7991 152 -8 94 45 -48 -66 7 30 -7 -231 -68 70 43 -4 96 140 42 31 27 -11 24 7 -27 -86 -43 -3 -136 32
8018 32 12 58 -88 -69 -44 67 -57 42 -120 -11 34 77 -146 139 -85 72 -29 -124 29 -91 -78 -144 -55 6
8042 6 -126 -95 -132 -130 -3 -86 -199 -118 -70 7 37 3 103 161 -102 59 87 -70 -90 183 -91 -167 17 -23 -30 54 -8
8069 -8 -63 148 97 5 -94 -75 -33 28 87 -78 5 -18 -42 39 -35 -109 -171 -72 -150 -107 35 139 13 95 63 -33 77 -18
8097 -18 -223 -24 -32 181 12 35 49 -109 -80 27 -14 -169 179 175 152 -78 151 68 -145 86 -68 73 43 -49
8121 -49 111 -128 -84 106 -51 -299 -48 -35 -66 64 -58 -61 -133 -77 14 19 -15 39 31 56 -48 -73 59 159 -200 34
8147 34 -94 -66 17 15 14 121 107 -42 -3 -39 -46 17 -83 -76 -80 -51 -37 41 70 -1 -145 -155 126 -82 47 16 -48 60
8175 60 -104 -147 -89 -127 -135 -109 76 17 -11 -14 67 -27 -123 -68 -60 -33
8191c3
##END NTUPLES=NMR FID
##END=
