##TITLE=1H_DPAA0812-3
 CDCl3
 8 sc, 
 10.12.2021
##JCAMPDX= 6.0         $$ Bruker NMR JCAMP-DX V2.0
##DATA TYPE= NMR FID
##DATA CLASS= NTUPLES
##ORIGIN= UXNMR, Bruker Analytische Messtechnik GmbH
##OWNER= root
$$ XWIN-NMR		Version 3.5
$$ Fri Dec 10 11:18:23 2021 Russian Standard Time (UT+4h)  she@DPX200
##.OBSERVE FREQUENCY= 200.131346
##.OBSERVE NUCLEUS= ^1H
##.DELAY= (6, 6)
##.ACQUISITION MODE= SIMULTANEOUS
##.ACQUISITION SCHEME= undefined
##.AVERAGES= 8
##.DIGITISER RES= 18
##SPECTROMETER/DATA SYSTEM= spect
##.PULSE SEQUENCE= zg30
##.SOLVENT NAME= CDCl3
##.SHIFT REFERENCE= (INTERNAL, CDCl3, 0, 15.7039)
##AUDIT TRAIL= $$ (NUMBER, WHEN, WHO, WHERE, WHAT)
$$ ##TITLE= Audit trail, XWIN-NMR		Version 3.5
$$ ##JCAMPDX= 5.01
$$ ##ORIGIN= Bruker BioSpin GmbH
$$ ##OWNER= she
$$ F:/spectra/data/she/nmr/H-F/1/audita.txt
$$ ##AUDIT TRAIL=  $$ (NUMBER, WHEN, WHO, WHERE, WHAT)
(   1,<2021-12-10 11:16:25.54 +0400>,<she>,<DPX200>,
      <created by zg, POWCHK disabled, PULCHK disabled
       configuration hash MD5:
       00 E9 B6 7A A2 85 ED C7 34 08 36 98 17 FE 4E 26
       data hash MD5: 16K
       0E FE A0 10 91 DD AE F0 B9 7A A0 C1 EC 31 9E BC>)
$$ ##END=
$$ 
$$ hash MD5
$$ DF A5 09 2F CE 3F 03 1A 51 AC 1C 4B 92 19 A1 28
##$RELAX= 
##$RELAX= 
##$RELAX= 
##$RELAX= 
##$RELAX= 
##$RELAX= 
$$ Bruker specific parameters
$$ --------------------------
##$DU= <F:/spectra>
##$EXPNO= 1
##$NAME= <H-F>
##$PROCNO= 1
##$TYPE= <nmr>
##$USER= <she>
##$AMP= (0..31)
100 100 100 100 100 100 100 100 100 100 100 100 100 100 100 100 100 100 
100 100 100 100 100 100 100 100 100 100 100 100 100 100 
##$AQSEQ= 0
##$AQ_mod= 1
##$AUNM= <au_zg>
##$AUTOPOS= <>
##$BF1= 200.13
##$BF2= 200.13
##$BF3= 200.13
##$BF4= 200.13
##$BF5= 200.13
##$BF6= 200.13
##$BF7= 200.13
##$BF8= 200.13
##$BYTORDA= 1
##$CFDGTYP= 0
##$CFRGTYP= 5
##$CHEMSTR= <none>
##$CNST= (0..31)
1 1 145 1 1 1 1 1 1 1 1 1 1 1 1 1 1 1 1 1 1 1 1 1 1 1 1 1 1 1 1 1 
##$CPDPRG= <>
##$CPDPRG1= <>
##$CPDPRG2= <>
##$CPDPRG3= <>
##$CPDPRG4= <mlev>
##$CPDPRG5= <mlev>
##$CPDPRG6= <mlev>
##$CPDPRG7= <mlev>
##$CPDPRG8= <mlev>
##$CPDPRGB= <>
##$CPDPRGT= <>
##$D= (0..31)
0 1.2 0 0 0 0 0 0 0 0.06 0 0.03 0 0 0 0 0.0002 0 0 0 0 0 0 0 0 0 0 0 0 
0 0 0 
##$DATE= 1639120584
##$DBL= (0..7)
120 120 120 120 120 120 120 120 
##$DBP= (0..7)
150 150 150 150 150 150 150 150 
##$DBP07= 0
##$DBPNAM0= <>
##$DBPNAM1= <>
##$DBPNAM2= <>
##$DBPNAM3= <>
##$DBPNAM4= <>
##$DBPNAM5= <>
##$DBPNAM6= <>
##$DBPNAM7= <>
##$DBPOAL= (0..7)
0.5 0.5 0.5 0.5 0.5 0.5 0.5 0.5 
##$DBPOFFS= (0..7)
0 0 0 0 0 0 0 0 
##$DE= 6
##$DECBNUC= <off>
##$DECIM= 32
##$DECNUC= <off>
##$DECSTAT= 4
##$DIGMOD= 1
##$DIGTYP= 9
##$DL= (0..7)
0 120 120 120 120 120 120 120 
##$DP= (0..7)
150 150 150 150 150 150 150 150 
##$DP07= 0
##$DPNAME0= <>
##$DPNAME1= <>
##$DPNAME2= <>
##$DPNAME3= <>
##$DPNAME4= <>
##$DPNAME5= <>
##$DPNAME6= <>
##$DPNAME7= <>
##$DPOAL= (0..7)
0.5 0.5 0.5 0.5 0.5 0.5 0.5 0.5 
##$DPOFFS= (0..7)
0 0 0 0 0 0 0 0 
##$DQDMODE= 0
##$DR= 18
##$DS= 0
##$DSLIST= <SSSSSSSSSSSSSSS>
$$ [...]
##$SUBNAM2= <"">
##$SUBNAM3= <"">
##$SUBNAM4= <"">
##$SUBNAM5= <"">
##$SUBNAM6= <"">
##$SUBNAM7= <"">
##$SUBNAM8= <"">
##$SUBNAM9= <"">
##$SW= 18.0517287032376
##$SWIBOX= (0..15)
0 0 2 0 0 0 0 0 0 0 0 0 0 0 0 0 
##$SW_h= 3612.71676300578
##$TD= 16384
##$TD0= 1
##$TE= 0
##$TE2= 300
##$TE3= 300
##$TEG= 300
##$TL= (0..7)
0 120 120 120 120 120 120 120 
##$TP= (0..7)
150 150 150 150 150 150 150 150 
##$TP07= 0
##$TPNAME0= <>
##$TPNAME1= <>
##$TPNAME2= <>
##$TPNAME3= <>
##$TPNAME4= <>
##$TPNAME5= <>
##$TPNAME6= <>
##$TPNAME7= <>
##$TPOAL= (0..7)
0.5 0.5 0.5 0.5 0.5 0.5 0.5 0.5 
##$TPOFFS= (0..7)
0 0 0 0 0 0 0 0 
##$TUNHIN= 0
##$TUNHOUT= 0
##$TUNXOUT= 0
##$USERA1= <user>
##$USERA2= <user>
##$USERA3= <user>
##$USERA4= <user>
##$USERA5= <user>
##$V9= 5
##$VALIST= <valist>
##$VCLIST= <CCCCCCCCCCCCCCC>
##$VD= 0
##$VDLIST= <DDDDDDDDDDDDDDD>
##$VPLIST= <PPPPPPPPPPPPPPP>
##$VTLIST= <TTTTTTTTTTTTTTT>
##$WBST= 1024
##$WBSW= 4
##$XGAIN= (0..3)
0 0 0 0 
##$XL= 0
##$YL= 0
##$YMAX_a= 121311
##$YMIN_a= -128143
##$ZGOPTNS= <>
##$ZL1= 120
##$ZL2= 120
##$ZL3= 120
##$ZL4= 120
##$ABSF1= 10
##$ABSF2= 0
##$ABSG= 5
##$ABSL= 3
##$ALPHA= 0
##$AQORDER= 0
##$ASSFAC= 0
##$ASSFACI= 0
##$ASSFACX= 0
##$ASSWID= 0
##$AUNMP= <proc_1d>
##$AZFE= 0.1
##$AZFW= 0.1
##$BCFW= 1
##$BC_mod= 2
##$BYTORDP= 1
##$COROFFS= 0
##$CY= 11.3945322036743
##$DATMOD= 1
##$DC= 2
##$DFILT= <>
##$DTYPP= 0
##$F1P= 2.36226072786647
##$F2P= -0.459571619588291
##$FCOR= 0.5
##$FTSIZE= 0
##$FT_mod= 4
##$GAMMA= 1
##$GB= 0.15
##$INTBC= 1
##$INTSCL= 1
##$ISEN= 128
##$LB= 0.24
##$LEV0= 0
##$LPBIN= 0
##$MAXI= 10000
##$MC2= 0
##$MEAN= 0
##$ME_mod= 0
##$MI= 1.114404
##$NCOEF= 0
##$NC_proc= 0
##$NLEV= 6
##$NOISF1= 3.799351
##$NOISF2= 2.8
##$NSP= 1
##$NTH_PI= 0
##$NZP= 0
##$OFFSET= 15.70392
##$PC= 1
##$PHC0= -15515.97
##$PHC1= 17.8008
##$PH_mod= 1
##$PKNL= yes
##$PPARMOD= 0
##$PSCAL= 0
##$PSIGN= 0
##$REVERSE= no
##$SF= 200.130013532006
##$SI= 16384
##$SIGF1= 3
##$SIGF2= 2
##$SINO= 400
##$SIOLD= 16384
##$SREGLST= <1H.CDCl3>
##$SSB= 0
##$STSI= 0
##$STSR= 0
##$SW_p= 3612.71676300578
##$SYMM= 0
##$S_DEV= 0
##$TDeff= 0
##$TDoff= 0
##$TI= <>
##$TILT= no
##$TM1= 0
##$TM2= 0
##$TOPLEV= 0
##$USERP1= <user>
##$USERP2= <user>
##$USERP3= <user>
##$USERP4= <user>
##$USERP5= <user>
##$WDW= 1
##$XDIM= 8192
##$YMAX_p= 0
##$YMIN_p= 0
$$ End of Bruker specific parameters
$$ ---------------------------------
##NTUPLES= NMR FID
##VAR_NAME=  TIME,          FID/REAL,        FID/IMAG
##SYMBOL=    X,             R,               I
##VAR_TYPE=  INDEPENDENT,   DEPENDENT,       DEPENDENT
##VAR_FORM=  AFFN,          ASDF,            ASDF
##VAR_DIM=   8192,          8192,            8192
##UNITS=     SECONDS,       ARBITRARY UNITS, ARBITRARY UNITS
##FACTOR=    0.0002768,     1,               1
##FIRST=     0,             0,               0
##LAST=      2.2672688,     0,               0
##MIN=       0,             -128143,         0
##MAX=       2.2672688,     121311,          0
$$ Real data points
##PAGE= N=1
##DATA TABLE= (X++(R..R)), XYDATA
0@%%%%%%%%%%%%lJ1j6J6j6K4l2L2m0M8n6P2q1Q9j05J27j50J69j93K24k56K88l23
$$ 0 0 0 0 0 0 0 0 0 0 0 0 0 -3 8 -8 8 -8 16 -16 16 -24 24 -32 40 -41 48 -57 70 -80 89 -104 120 -136 152 -171
35a71L64m10M60n16N77o42P14p92Q79r74J078j190J310j445J593j755J935k134
$$ -171 193 -217 243 -273 304 -338 376 -416 463 -511 567 -623 687 -758 835 -920 1015 -1119
53a119K353k596K869l181L538l949M430n000N691o551P654r124J1197j4364J9864
$$ -1119 1234 -1362 1507 -1674 1864 -2085 2345 -2655 3036 -3515 4139 -4985 6212 -8152 11712
68A1712l2154J12570q144q2315J08185o0959j6333M0902q6180r7657P8772j469
$$ 11712 -20442 92128 83984 1669 109854 48895 32562 73464 -12716 -110373 -31601 -33070
80c3070n9223M8084J4726p8212M8341P2790j7449K0378L4427n0031J7370O5369
$$ -33070 -92293 -44209 -29483 -107695 -59354 13436 -4013 16365 50792 761 18131 83500
92H3500k9485m5597P025j8493Q78K7921k8079k6314L4170k551k2041K2503m719
$$ 83500 54015 8418 15443 -3050 -2172 25749 -2330 -28644 5526 2975 -19066 3437 -1282
105a282k5712J8940j2549k6078M4364J1431m8056J9244L1046k2631K2302L1273
$$ -1282 -26994 -8054 -20603 -46681 -2317 9114 -38942 -19698 11348 -11283 11019 42292
117D2292l7849R330N3141l4523k8095M6932k0255n3700J7177j6983m2862M0956
$$ 42292 4443 13773 66914 32391 4296 51228 30973 -22727 -5550 -22533 -65395 -24439
129b4439J0495n8390K4330N2429k0516J1273M3030k3004l597M5292j8127k4036
$$ -24439 -13944 -72334 -48004 4425 -16091 -4818 38212 15208 11611 56903 38776 14740
141A4740L7759j4557m8691J8941M431l8816N569K48l4224J9571L2093k5494k408
$$ 14740 52499 37942 -10749 8192 12623 -26193 -20624 -20376 -54600 -35029 -2936 -28430 -30838
154c0838L4801k497j399K1945j7070j3229L1382r69k2125J6370J655j9737J2716
$$ -30838 3963 1466 67 22012 4942 -8287 23095 22126 1 16371 18026 -1711 11005
167A1005O905j7895M816N86k2914P986J9782j6681j0692R000q647K344J7173j4782
$$ 11005 17910 15 4831 5417 -17497 -9511 10271 -6410 -17102 -8102 -16749 -14405 2768 -12014
181a2014j0221K1885J954l420J8403k765j1490J7098J218j8497Q092K994k3873
$$ -12014 -22235 -350 1604 -1816 16587 13822 2332 19430 20648 2151 10243 13237 -10636
194a0636K895J4907j5124k341J0649j6956q9K4445j0466j3228J9656R91j0220
$$ -10636 -7741 7166 -7958 -10299 350 -16606 -16695 7750 -2716 -15944 3712 4703 -5517
207e517J8188M511j8889O800Q470j7161K054J2517j6172n649J4280q746o078J4357
$$ -5517 12671 17182 -1707 5093 13563 -3598 -1544 10973 -5199 -10848 3432 -5314 -11392 2965
221B965o443j1531J1574L464q529P268O856o052M536Q102n310J096M897p850k349
$$ 2965 -3478 -15009 -3435 29 -8500 -1232 5624 -428 4108 12210 6900 7996 12893 5043 2694
236B694N137o443l976L447m731m051K007l007j311L167k200l26P485K245k704
$$ 2694 7831 1388 -2588 859 -3872 -7923 -5916 -8923 -10234 -7067 -9267 -9593 -2108 137 -2567
251b567N376L135l883N041K722p159K030M326n729l25L724n325l053L178l882
$$ -2567 2809 5944 2061 7102 9824 2665 4695 9021 3292 2967 6691 1366 -1687 1491 -2391
266b391m459M589M3p423K548N629k455J053K119k488K498M622k306j350L585J170
$$ -2391 -6850 -2261 -2218 -9641 -7093 -1464 -3919 -2866 -747 -3235 -737 3885 1579 229 3814 4984
282D984j679L79J016j727j954j568k742O86J462j875j329P26K389L457L0r40J245
$$ 4984 3305 3684 4700 2973 1019 -549 -3291 -2605 -1143 -3018 -4347 -3621 -1232 2225 2255 1315 2560
299B560J281R35k40j939o72o65j763k641j67J490k245l576Q25K436J215Q03j571
$$ 2560 3841 4776 4536 2597 1925 1260 -503 -3144 -3311 -1821 -4066 -7642 -6817 -4381 -3166 -2363 -3934
316c934P86M153K126M2L99J019J048k72O92k51j804o03k171l500L35P99j907k648
$$ -3934 -3148 1005 3131 3173 3572 4591 5639 5367 6059 5808 4004 3401 1230 -2270 -1935 -1136 -3043 -5691
334e691r83K143K067q8j390m1K742K139j026J085K287m09j00Q70J080O08j808
$$ -5691 -6674 -4531 -2464 -2552 -3942 -3983 -1241 898 -128 957 3244 2835 2735 3605 4685 5293 3485
351C485j474n50m00K47q21j959j320K44J507M74j540j91K97N29Q41p38L46J887
$$ 3485 2011 1461 1061 1308 487 -1472 -2792 -2548 -1041 -567 -2107 -2298 -2001 -1472 -631 -1369 -1023 864
369H64j702q34L115P08j939o53K17j66L09l4k230n98J831j408J031L532j920k62
$$ 864 -838 -1672 1443 2151 212 -441 -224 -390 -81 -115 -2345 -2943 -1112 -2520 -1489 2043 123 -139
387a39M448K03j225K403p87k759J210j42l604m99j49m522M17L011m148n37N155
$$ -139 4309 4512 3287 5690 4903 2144 3354 3212 -392 -891 -1040 -5562 -5145 -2134 -6282 -6819 -1664
404a664k244j87O312j489j726N654J02l185M007J70o668L114L814p428o58N335
$$ -1664 -3908 -4095 2217 728 -998 4656 4758 1573 5580 5750 -918 2196 6010 -1418 -2076 3259
420C259n326j437O871m347l464O292k285n018N616P02n896K600J844n008L293
$$ 3259 -2067 -3504 3367 -980 -4444 1848 -437 -5455 161 863 -5033 -2433 -589 -5597 -2304
435b304M850m988R66N306l380N87N615l741j120L430n002j709O363l045o550K752
$$ -2304 2546 -2442 -1476 3830 450 1037 6652 2911 1791 5221 219 -1490 4873 1828 -4722 -1970
451a970m88j868O989q49q336O356M375o354N391M040j1272J386Q725p650j497
$$ -1970 -2458 -4326 2663 1814 -6522 -166 4209 -2145 3246 7286 -3986 -2600 6125 -1525 -3022
466c022P139r656n162J3723q20r057P803r89q535J3958O850j6048J972R209q505
$$ -3022 4117 -5539 -10701 3022 2202 -6855 948 -41 -8576 5382 12232 -3816 -1844 7365 -1140
481a140L493R222j2822n390J1695m404m848J1322o006j2755J1716M753j0790N781
$$ -1140 2353 11575 -1247 -6637 5058 654 -4194 7128 1122 -11633 83 4836 -5954 -173
495a73J724j2634P490R986j1435p00Q266o562J965J1378q979o023J3283j106p291
$$ -173 1551 -11083 -3593 6393 -5042 -5742 2524 -4038 -2073 9305 326 -5697 7586 6480 -811
510h11R163l178j1124R706L604j0198M534J1j2953O899R684j0366j675O658p799
$$ -811 8352 5174 -5950 3756 7360 -2838 1696 1707 -11246 -4347 5337 -5029 -6704 -46 -7845
525g845K310J3491p362o903J0098k728m237J2445l968j1356J0584J127j0777R873
$$ -7845 -5535 7956 594 -6309 3789 1061 -3176 9269 5301 -6055 4529 5656 -5121 4752
539D752K963j5123N284Q743j2549J772J1207j2807k160J5989q812p330J6987n717
$$ 4752 7715 -7408 -2124 6619 -5930 -4158 7049 -5758 -7918 8071 -741 -8071 8916 3199
553C199j3432J5753J931j5118J0899N418j8298N133J3039j3817o51J3210j3601
$$ 3199 -10233 5520 7451 -7667 3232 8650 -9648 -4515 8524 -5293 -5944 7266 -6335
566f335o332K0149k599j0629J1147l722j1234J5235O657j4217J906L785q976O920
$$ -6335 -12667 7482 4883 -5746 5401 1679 -9555 5680 12337 -1880 26 3811 -5165 1755
580A755J0406j1991n758O158n825J344J0383p802q144O266j064J336J0307p579
$$ 1755 12161 170 -5588 570 -5255 -3911 6472 -1330 -9474 -3208 -4272 -2936 7371 -208
594b08r653R558K486m467Q535j651j0700R289P384j1384M337O114j4804P97J3667
$$ -208 -9861 -303 2183 -2284 6251 4600 -6100 3189 10573 -811 3526 9640 -5164 -4367 9300
609I300j0810n081J1824r292p420J7412j900j5287J0106N138j1494Q367P309j5263
$$ 9300 -1510 -6591 5233 -4059 -11479 5933 4033 -11254 -1148 3990 -7504 863 8172 -7091
623g091M451J3345j3402l044J4264q049p673J2014l320q197J1645M54j1494P829
$$ -7091 -2640 10705 -2697 -5741 8523 474 -7199 4815 1495 -6702 4943 5397 -6097 1732
637A732M885j1592L353O924q586K387O354j0136k10J1434n299n654M561l395j208
$$ 1732 6617 -4975 -1622 5302 -3284 -897 5457 -4679 -4889 6545 1246 -4408 153 -3242 -4450
652d450Q320k989n961P373j12p249O229L215p289K394J543o502O971O912r038
$$ -4450 3870 881 -5080 2293 2181 -5068 1161 4376 -2913 -519 1024 -5478 1493 8405 -633
667f33r81O763m216l10N528p218l881Q832k527p084P608Q17q408L866J716o188
$$ -633 -1614 5149 933 623 6151 -1067 -4948 3884 1357 -5727 1881 2698 -5710 -1844 -128 -6316
683f316O086L046j0090L550J0027n528k615N391m124j577P429l925o276Q376J036
$$ -6316 -230 2816 -7274 -3724 6303 775 -1840 3551 -573 -2150 5279 1354 -4922 3454 4490
698D490p657M945K823o096K624J652p480K847O539o519l035O220r82k666L371
$$ 4490 -3167 1778 4601 -1495 1129 2781 -4699 -1852 4687 -1832 -4867 1353 371 -2295 1076
713A076k526l064N665k74n918M416M205l414M16J132k515K130J615m603l63M317
$$ 1076 -1450 -4514 1151 877 -5041 -625 3580 166 582 1714 -801 1329 2944 -1659 -2022 2295
729B295p22j639J714o01m49K011l064k595M237K88l256R91K85l15K080j335l883
$$ 2295 1573 -66 1648 1047 598 2609 -455 -3050 1187 1475 -1781 -790 -505 -820 1260 -75 -3958
746c958K548K494l799p99L726k61K34K120k712j8M120j846l696K745J367j848
$$ -3958 -1410 1084 -2715 -3514 212 -49 185 2305 -407 -425 3695 1849 -1847 898 2265 417
762D17J230N03k277J384J089l703j430L166p28k240J195KO48J939j880k401K035
$$ 417 1647 2150 -127 1257 2346 -1357 -2787 379 -349 -2589 -1394 -1392 -744 1195 -685 -3086 -1051
779a051J651j456m76J157P35N89K59p48N50Q44j699j121J170N27K5K33j303L56
$$ -1051 600 -856 -1332 -175 560 1149 1408 660 1210 2054 355 -766 404 931 956 1189 -114 242
797B42J828m69j854r52L80J43l5m77k18J104O71j460j18J270o16n74k74M48J435
$$ 242 2070 1601 -253 -1205 -825 -682 -717 -1194 -1412 -308 363 -1097 -1215 55 -561 -1135 -1409 -961 474
816D74N90n20k41N20O13k76l98j79l48K55N83n95J16K93p61o02k02J17R5p07p23
$$ 474 1064 544 303 823 1436 1160 762 583 235 490 1073 478 594 887 126 -476 -678 -561 -466 -1173 -1896
837a896M12J153K98o53l49L89o4J34N13n1L34M07n6Q76M12p16p84p3Q1L94J49
$$ -1896 -1484 -331 -33 -686 -1035 -646 -710 -576 -63 -114 220 627 571 1447 1859 1143 359 286 367 761 910
858I10m6l90j99M33k04m05n19r35K23K16l56M64ol74M09L23J96J72r3k19M7Q06
$$ 910 864 474 275 708 504 99 -420 -1355 -1132 -916 -1272 -808 -814 -1188 -779 -456 -260 -88 -181 -400 -353 453
880D53N3j76Q82j25r32J124K81j159L25k09m90Q92L19j307k04P33j408q44J204
$$ 453 506 330 1212 1087 155 1279 1560 401 726 517 27 919 1238 -69 -273 460 -948 -1792 -588
899e88m38j284J088K59r68J978N64j781Q50J292n72N62J005j598l10K120o63j738
$$ -588 -1026 -2310 -1222 -963 -1931 47 611 -1170 -320 972 400 962 1967 369 59 2179 1516 -222
917b22J358l98j847R92N33j217J254k26j729J462J362j530o12M04p50J97J509
$$ -222 1136 738 -1109 -117 416 -801 453 227 -1502 -40 1322 -208 -820 -416 -1166 -969 540
934E40j131q54J252o33Q6J605j178n18K008r77j000K980m27k481J518O55k075
$$ 540 -591 -1445 -193 -826 -740 865 -313 -831 1177 200 -800 2180 1753 -728 790 1445 -630
951f30J597P54l391J300K822l718m39M181k667k360L924j629k959L877o4m311
$$ -630 967 1721 -1670 -370 2452 -1266 -1705 2476 -191 -2551 1373 -256 -3215 662 598 -3713
967c713K587K368l892J613L316m123J23M980k942j519N115j989l428M225j3l263
$$ -3713 -1126 1242 -2650 -1037 2279 -1844 -1721 3259 317 -1202 3913 1924 -1504 2721 2708 -555
983e55K326m83l732K329K186l766j10K154k917M14L584k655j081L021j779n08
$$ -555 1771 1288 -2444 -115 2071 -1695 -1805 349 -2568 -2154 1430 -1225 -2306 715 -1064 -1572
999a572L434j520j726K833r31j868L469l67l377K645J139l731K456J886m285J579
$$ -1572 1862 342 -1384 1449 518 -1350 2119 1752 -1625 1020 2159 -1572 884 2770 -1515 64
1015F4K961m912jM746l706j324M360l152k988N726l68m796M178M04n478M531L769
$$ 64 3025 -1887 -1888 2858 -848 -2172 2188 -964 -3952 1774 1406 -3390 788 1192 -4286 245 4014
1032D014o629J339M174n487R10O611m800l278N622j962l017O264j046o588M314
$$ 4014 -2615 -1276 2898 -2589 -1679 4932 132 -3146 2476 514 -2503 3761 2715 -3873 441
1047D41K579n353L359K950p384J046N698m161q26L890m542k085N828r47l092L249
$$ 441 3020 -2333 1026 3976 -3408 -2362 3336 -825 -1651 2239 -2303 -4388 1440 493 -2599 650
1063F50j258l312N035K272m401J251J128l325L492K846m436J72J809l179J670
$$ 650 -608 -3920 1115 3387 -1014 237 1365 -1960 1532 4378 -58 114 1923 -1256 414
1078D14L637m179j918L220k729q59N094l019m129M697o22l477N713k99o263M386
$$ 414 4051 -128 -2046 1174 -1555 -2414 2680 -339 -4468 229 -393 -3870 1843 1544 -4719 -333
1094c33L451o020K433M536n791J62O541m848l038P348k949n060O775o87o905N123
$$ -333 3118 -2902 -469 4067 -1724 -1562 4979 131 -2907 4441 1492 -3568 3207 2520 -4385 738
1110G38K513p106K868M462o520N86N972m161k516N381k441k796N620j008n260
$$ 738 3251 -3855 -987 3475 -3045 -2459 3513 -648 -3164 2217 -224 -3020 2600 1592 -3668
1125c668M043J631m288K883J619m333J281K580k243M24K042l155J59L336j885
$$ -3668 375 2006 -2282 601 2220 -2113 -832 1748 -495 -71 1971 -1184 -1025 2311 426
1140D26m95K455l095p71L924k020j921L049k105k453M141o52l567L387M07m882
$$ 426 -69 2386 -709 -1480 2444 424 -1497 1552 -553 -3006 1135 483 -3084 303 710 -4172
1156d172L186L061m434J137L924m400j48N946l057k317M860k214l776N308O08
$$ -4172 -986 2075 -2359 -1222 2702 -1698 -1846 4100 1043 -1274 3586 1372 -2404 2904 3512
1171C512n269K380J415n161K213M009m763j427L829k957m05M968k599l293L594
$$ 3512 -1757 623 2038 -3123 -910 3099 -1664 -3091 738 -2219 -2624 2344 -255 -3548 46
1186D6N77k118L063J23l652J604K540j866N80J116l148L75L322j844j158J373
$$ 46 623 -1495 1568 1691 -1961 -357 2183 317 897 2013 -1135 -760 2562 718 -440 933
1202I33j860o39L079j021j819Q73o51m63K591j38k392J255P98j674J832P02l030
$$ 933 -927 -1566 1513 492 -1327 -454 -1105 -1568 1023 885 -1507 -252 546 -1128 704 1406 -1624
1219a624R83J762j986L16J612k188j07K415j233p88K346r30j708K618N68k664
$$ -1624 -641 1121 -865 -549 1063 -1125 -1232 1183 -50 -838 1508 578 -1130 1488 2056 -608
1235f08J085J032k119J113R24l164N27K142j714q75J927r26j429K229k9j712J725
$$ -608 477 1509 -610 503 1427 -1737 -1210 932 -782 -1657 270 -656 -2085 144 115 -1597 128
1252A28Q76j971R06J383j426M02Q17j367K56J778j195r75J338L28j107K58J5r26
$$ 128 1004 -967 -61 1322 -104 298 1115 -252 4 1782 587 -388 950 1278 171 429 444 -482
1270d82P16m82j084N22N27o47Ok7j10P41K17n13J31P96R2j0K74j65K58L07q12
$$ -482 234 -248 -1332 -810 -283 -930 -924 -951 -1061 -320 -103 -616 -485 311 403 393 667 502 760 1067 255
1291B55m60J236j64j180J52L65K6M23m42r38M72P06n80o56O18j87l82O11m11l15
$$ 255 -205 1031 867 -313 -161 204 230 653 211 -727 -255 451 -129 -785 -167 -354 -736 -125 -536 -851
1311h51O32k07o22M31Q65j7k15O7K57O41M58p83q78P60L45o54j64N7L31j41o21
$$ -851 -219 -426 -1048 -617 248 231 16 83 340 981 1439 656 -222 538 883 229 65 122 453 312 -309
1332c09k10P42j50m76m64K37O17j78m03k92K44M03n1k98L28J89K80R9j92M39O82
$$ -309 -519 223 73 -403 -867 -630 -13 -191 -594 -886 -642 -239 -290 -588 -260 -71 209 308 116 555 1237
1353A237l06m95r9L18K89p88k87k15N77j1r03k05N88j69m12K2K42M21M14m85L3
$$ 1237 931 436 337 655 944 156 -131 -346 231 220 -683 -888 -300 -469 -881 -859 -617 -196 218 -267 -234
1374b34L34M67n78m88L33r4M74R0o70K97R91l01n22P7K36O6n0n11J71O75k86r11
$$ -234 100 567 -11 -499 -166 -260 214 304 -366 -69 922 621 99 176 412 478 428 -83 88 763 477 -434
1396d34K41M72l92m77K34n65M30M32n75j70P90j42k02J16k40K41N43j31m20P45
$$ -434 -193 279 -113 -590 -356 -921 -491 -59 -634 -804 -14 -156 -358 -242 -482 -241 302 171 -249 496
1416D96Q70n43l10K73k86L33j51j097M73N51q25k69K67m28j64P2l30k40R20j48
$$ 496 1366 823 513 786 500 833 682 -415 58 609 -216 -485 -218 -646 -810 -738 -1068 -1308 -388 -536
1436e36o18J279J16l34Q22j24j174J214O55j390K26J191j111K7Q51j015n79J173
$$ -536 -1154 125 241 -93 729 605 -569 645 1300 -90 136 1327 216 243 1094 79 -500 673
1454F73q58j192J627J24j333P67N69j378P23P35j412N5J460o57o86J596m96j049
$$ 673 -185 -1377 250 374 -959 -192 377 -1001 -278 457 -955 -900 560 -97 -783 813 317 -732
1472g32J230k14j214J046L67j226Q66M84r08Q61L99j024M80N63j135O4R43q88
$$ -732 498 284 -930 116 483 -743 123 607 -301 560 959 -65 415 978 -157 -93 850 -38
1490c8k04R16j187k89J501j170j065J444n60j068K151j88j707J528O52j564J292
$$ -38 -242 674 -513 -802 699 -471 -1536 -92 -652 -1720 431 243 -1464 64 716 -848 444
1507D44J098k240l3K440j366l91K469k067j618K882j95k354J708l40k813J717
$$ 444 1542 -698 -731 1709 343 -48 2421 354 -1264 1618 1423 -931 777 437 -2376 -659
1523f59J898k600J95J479k419M30L338j843j580K423n87q56K828m82k320J081
$$ -659 1239 -1361 -1166 313 -2106 -1676 1662 -181 -1761 662 75 -781 2047 1565 -755 326
1539C26O59j434J435O45k704M50J725j496M21J302k224m96K511j055p49J847j544
$$ 326 985 -449 986 1631 -1073 -623 1102 -394 27 1329 -895 -1391 1120 65 -684 1163 -381
1556c81j105J985n17j246J766k97k147J915J028j963J169J212k672J032K110k517
$$ -381 -1486 499 -18 -1264 502 205 -1942 -27 1001 -962 207 1419 -1253 -221 1889 -628
1572f28J48K288k548o89L101j209j394K402q64k811L267J170l401J164J075l024
$$ -628 -480 1808 -740 -1429 1672 463 -931 1471 607 -2204 1063 2233 -1168 -4 1071 -1953
1588a953J571K450l500o59K803k239o18L679j407k695L079N77k006K470M02l342
$$ -1953 -382 2068 -1432 -2091 712 -1527 -2145 1534 127 -2568 511 1088 -918 1552 1954 -1388
1604a388J696K434k774M8J547k513R1K630j650j608J772m41j062J946n12j947
$$ -1388 308 2742 -32 16 1563 -950 -859 1771 121 -1487 285 -156 -1218 728 216 -1731
1620a731J327P01j064J128M8k200J070J631j254P45O3j625J263K096j737o39J266
$$ -1731 -404 297 -767 361 409 -1791 -721 910 -344 401 464 -1161 102 2198 461 -178 1088
1637A088j539J85K428j615k382J953j61j403K687l55l503J976J777k370J388J635
$$ 1088 -451 -266 2162 547 -1835 118 -43 -1446 1241 886 -2617 -641 1136 -1234 154 1789
1653A789l510j83L784j408j515K366j620j977L437N33l094J485Q71k457J602K156
$$ 1789 -1721 -1904 1880 472 -1043 1323 -297 -2274 1163 1696 -1398 87 958 -1499 103 2259
1669B259k422o38K229j452n15K086q35j735J605j95j632J703o9j781J197M03j423
$$ 2259 -163 -801 1428 -24 -539 1547 712 -1023 582 387 -1245 458 389 -1392 -195 208 -1215
1686a215P15R37j309J07P23o97P46J146j117n20J383o65O0J500j063j344J301
$$ -1215 -500 437 -872 -765 -42 -739 7 1153 36 -484 899 234 294 1794 731 -613 688
1703F88l03o27J218o84j693J154P29j416P81N09j924M34J990j309k10J400j145
$$ 688 385 -242 976 292 -1401 -247 482 -934 -153 356 -1568 -1134 856 -453 -663 737 -408
1720d08o31J962k42j364J153n6j069J468M20j854M77J124j165Q1J355j590l72
$$ -408 -1039 923 681 -683 470 414 -655 813 1233 -621 -144 980 -185 -104 1251 -339 -711
1737g11J453o65q25J307l03j244J081L11j209L18O05o85J48Q93j021k7Q75m67
$$ -711 742 77 -748 559 256 -988 93 404 -805 -487 118 -567 -419 474 -547 -574 301 -166
1755a66k65P93m16k21Q97j97m04M62j7k81L78J09n36J57K4n01J25L22p98q0K89
$$ -166 -431 362 -54 -275 622 425 21 483 466 185 563 672 136 293 317 -184 -59 263 -535 -615 -326
1776c26m21J97K51n76J74O53k06o5P18j02m11N73L8n40N44K35p31J70M42o06O2
$$ -326 -747 -550 -299 -875 -701 -48 -254 -319 399 297 -114 459 497 -43 501 736 5 175 617 11 73
1797G3K47o52J27N04l37m54N90o1m70K57J40m19J97J63l07K53Q0j07m8M09j6k38
$$ 73 320 -332 -205 299 -38 -492 98 37 -433 -176 -36 -455 -258 -95 -402 -149 -69 -176 -224 185 169 -69
1819f9M68j11j56K4L34j12k31K18j51j62P6l05L01j21r6n6K49L6j79L4j90K2n1
$$ -69 399 288 132 156 490 378 147 365 214 52 128 -177 124 3 -93 -149 100 136 -43 -9 -199 -177 -228
1842b28L1l15K07j01JJ67N6j82J11K44K35N1J31R2J32k0l8j55m4j15n19L63k63
$$ -228 -197 -512 -305 -406 -405 -238 -182 -364 -253 -9 226 277 408 500 632 612 574 419 375 260 -259 104 -159
1865a59l34J90k19o6L05J5R6J44l13K22j21P9L2J5J95L2k17J49M6J16Q3O3M2K51
$$ -159 -493 -303 -522 -588 -283 -268 -172 -28 -341 -119 -240 -161 -129 -114 81 113 -104 45 91 207 290 353 395 646
1889F46j20q9Qn6l16j41L0l41RJ26l34j71L25M6J61K73k03K82L16o4l82J30J40
$$ 646 526 437 445 389 73 -68 -38 -379 -370 -244 -578 -749 -424 -378 -217 56 -147 135 451 387 5 135 275
1912B75j57k14K8j0J9K9j54J95M67l56O6J86O4j40J62l03k67J95j56l37J14J3
$$ 275 118 -96 -68 -78 -59 -30 -184 11 478 122 188 374 438 298 460 157 -110 85 -71 -408 -294 -281
1934b81m79L28K18n38M13P28o79j04P95l05r9K94l20l4M68j51l51L74K90l16Q7
$$ -281 -760 -432 -214 -752 -339 389 -290 -394 401 96 -3 291 -29 -63 405 254 -97 277 567 251 338
1955C38L30n07rL99n56l32N02l54k87O0k52j4L12j59k31N95M19m33M18K82k83
$$ 338 668 161 152 551 -5 -337 165 -189 -476 -416 -668 -682 -370 -529 -760 -165 254 -179 239 521 238
1976B38J41P1k56N3L11n22O2J89m68p7N60n68l11O96M3p96P79J79r42P29J68j212
$$ 238 379 450 194 247 558 36 98 287 -181 -258 302 -266 -577 119 162 -634 145 324 -618 111 279 -933
1998i33Q44O14j242J00J316j000j48J094o32m43J225l72j100J007O20j377N99
$$ -933 -89 525 -717 -617 699 -301 -449 645 13 -430 795 423 -677 330 950 -427 172
2015A72N96j086L95P91j282j40J053l17p88J027m53q08R03j28n34N52R6j095O73
$$ 172 768 -318 77 868 -414 -554 499 182 -606 421 -32 -840 63 -65 -599 -47 49 -1046 -373
2034c73Q69n84J78j12n08P67Q91p50m70M42n24K76R77n50j024Q23o03j65J278
$$ -373 496 -88 90 -22 -530 237 1128 378 -92 350 -174 102 1079 529 -495 328 -275 -440 838
2053H38n69j512J153J98p32J004N0j865N80J506j120J26J008j492J31J826n30
$$ 838 269 -1243 -90 108 -624 380 430 -1435 -855 651 -469 -343 665 -827 -696 1130 600
2070F00j167J556m20j601J576N51j625O29P89j374M05J272j497m50J474r01o06
$$ 600 -567 989 569 -1032 544 1095 -530 99 888 -486 -81 1191 -306 -756 718 -183 -789
2087g89J300n68q56J184K7j487J100M83r54K44P25r71L56R61q71R9O94n95k72
$$ -789 511 -57 -913 271 298 -1189 -89 394 -560 -316 409 -562 -206 755 -116 -17 677 82 -190
2106a90J294q63m84O46l69k90P32j51r72Q40j27o48P56P1j275R38N80j256M33
$$ -190 1104 241 -243 403 34 -256 476 325 -647 193 66 -582 174 245 -1030 -92 488 -768 -335
2125c35P37j218J75J535j200l12J442o67o71J589l57j599J414M79j448P43O84
$$ -335 402 -816 -641 894 -306 -618 824 157 -514 1075 718 -881 533 1012 -436 307 991
2142I91j697J94J589j239n87J240j100o42K039l76j626R79M06r21R04N40j688
$$ 991 -706 -512 1077 -162 -749 491 -609 -1251 788 412 -1214 -235 171 -750 154 694 -994
2159i94L40J268p60J80P65j126j11J079j39m25L45m37o53R30K87p50L50l01m63
$$ -994 -654 614 -146 34 799 -327 -438 641 502 77 422 -15 -668 262 549 -201 149 -152 -615
2178f15P10M51r00O5J38n40P02N19q54J19L02p60K31R44o39n69J313m52o71J298
$$ -615 95 546 -354 -289 -151 -691 11 530 -324 -205 97 -663 -432 512 -127 -696 617 165 -506 792
2198G92k16r47Q49K01j000N44N98j193K17O92q35k67J105p25r46J242m7j021J020
$$ 792 576 -371 478 679 -321 223 821 -372 -155 537 -298 -565 540 -185 -1131 111 64 -957 63
2217F3L85j161N46M28p05J88O19n77j26Q74l83j89O44j15p32N78K02m98K04K0
$$ 63 448 -713 -167 261 -444 -256 363 -214 -340 534 151 -38 606 491 -241 337 539 41 245 265
2237B65n87L15K89o75K39J64m47j9M52j37N6K03m84N8O05m03p6L15l49p6N40j23
$$ 265 -322 -7 282 -393 -154 10 -437 -456 -4 -141 -85 118 -366 -308 297 -106 -182 133 -216 -292 248 125
2259A25k83K52J59j69J29J37l20J55J41n75J44N82n29m01N23k39k21M26j51m29
$$ 125 -158 94 253 84 213 350 30 185 326 -249 -105 477 -52 -453 70 -169 -390 36 -115 -544
2279e44K46K29k23K30K62l93m4N91l56k10O23k62k61O01p0l61L94k41k48K34P1
$$ -544 -298 -69 -292 -62 200 -193 -237 354 -2 -212 411 149 -112 489 419 58 452 211 -37 197 268
2300B68m88K96j8l26M7J19j64kJ59j98j6M03j41M8Q1k68K21K71j17k32m8P3k5
$$ 268 -220 76 58 -268 -221 -102 -266 -268 -109 -307 -323 80 -61 -13 68 -200 21 292 175 -57 -105 -32 -57
2323e7P4K8M1P0L6j66Q1K99n11m4L17p4j37J85j17j61j00P2j82J17O1j29J29J82
$$ -57 17 45 86 156 192 26 107 406 -105 -149 168 94 -43 142 25 -136 -236 -164 -346 -229 -168 -297 -168 14
2347A4n8O0J21l6Q0J2J0n1j60K40k6j16J50j64J08l9o4j4N9j94J6j61L8R5j50
$$ 14 -44 16 137 101 181 193 203 152 -8 232 206 90 240 76 184 145 81 67 126 -68 -52 -213 -175 -80 -230
2372b30p9M9J21j75K81o1J40j44J06l3J65Q3R7k36J58p7j4K8L7q3j00R0r1j54
$$ -230 -309 -260 -139 -314 -33 -94 46 -98 8 -25 140 223 320 84 242 165 151 179 216 133 33 123 32 -122
2396a22J08J49l50J21N4k42J47P7j51o3j4k4J30K13j44J61R4J15j35K27l4l09
$$ -122 -14 135 -215 -94 -40 -282 -135 -58 -209 -272 -286 -310 -180 33 -111 50 144 259 124 351 317 8
2418HK20M1j58J0l6k6R3j28r0P8n5q4o8J35k05P0p7R9k74L43k4k44L39N8k4M0
$$ 8 228 269 111 121 85 59 152 24 -66 12 -43 -127 -195 -60 -265 -195 -272 -173 -447 -104 -128 -372 -33 25 1 41
2444D1n5m7L05P4k10j25L75k60q5L45m30P6Q4j03r7L46j76m19K97j11j77J68Q0
$$ 41 -14 -61 244 318 108 -17 358 98 13 358 -72 4 88 -15 -112 234 58 -361 -64 -175 -352 -184 -104
2467a04m79L51K41k43J51K59l78P5M00j71q0L32j22k86N08l49l87M77Q2m01J96
$$ -104 -583 -232 9 -234 -83 176 -202 -127 273 102 22 354 232 -54 454 105 -282 195 277 -124 72
2488G2J64n26J58M16m35p5N17n43k22N67r0n00M27p8j61K28K17n16M13K70k06
$$ 72 236 -290 -132 284 -151 -226 291 -252 -474 93 3 -497 -70 -148 -309 -81 136 -380 33 303 97
2509I7L6J79j25k58M89k59r3R0j9r8N4j53J1J20k84j1L45k03k83K63K1l28L60
$$ 97 133 312 187 -71 418 159 66 156 137 39 93 -60 -49 71 -213 -224 121 -82 -365 -102 -81 -409 -49
2532d9K12n62L29K93l80j40R61o31rN48m91k99N85P1o31L90n2m56L39M31p61K6
$$ -49 163 -399 -70 223 -157 -297 664 33 24 572 81 -218 367 438 -193 197 145 -311 28 459 -302 -276
2554b76N13o41j18J081n61n55N72L4n65Q35j62o12L08M69p01M64M77q42kR45n44
$$ -276 237 -404 -522 559 -2 -557 15 49 -516 319 157 -455 -147 322 -379 85 562 -280 -282 663 119
2575A19o7M31n10k81M77J79l27J35j20m09N26M9n31K59M4k11K43K09o30K88J56
$$ 119 52 483 -27 -308 169 348 21 156 36 -373 153 202 -329 -70 -26 -237 6 215 -415 -127 29
2596B9m94L51K60j57j79M93l30j9N68l84k63M54R3p56N82J3n46L80J27p53L52
$$ 29 -465 -114 146 -11 -190 303 -27 -46 522 138 -125 329 422 -334 248 261 -285 95 222 -531 -179
2617a79O59p95j36Q15n18m85R47n04m22Q30j34o80N90O22p81J89N09p47R9R05
$$ -179 480 -315 -451 364 -154 -639 308 -196 -618 212 78 -602 -12 610 -171 18 527 -220 -121 784
2637G84o21m19N87j57m24P14k74p38N57K47n69L19K29n55j23N86m79L8M15p36
$$ 784 163 -256 331 174 -250 464 190 -548 9 256 -313 6 235 -320 -443 143 -336 -298 117 -619
2657f19J44M82o5j38K93j36k67P10k13j82K93j25l88M71J48l29J76j7n44K44M79
$$ -619 -475 7 -58 -196 97 -39 -306 404 191 9 302 177 -211 260 408 79 255 238 -306 -62 417
2678D17o75n6N37n37j3N14l54k60N42k16l63O25Km90L39K94p25L82P02p92N4M44
$$ 417 -258 -314 223 -314 -327 187 -167 -427 115 -101 -464 161 163 -327 12 306 -419 -37 665 -127 -73 371
2700C71m16p2O23l84m73M79J6m39N38L8p27L45L69n26J20K32n04j17N44p9k77
$$ 371 -45 -117 506 122 -351 128 144 -295 243 281 -446 -101 268 -258 -138 94 -410 -527 17 -62 -339
2721c39L97n1k45L37J4m15M01Q8j81j9K58l30K75J79m02K71j00l00J73J77l53
$$ -339 58 7 -238 99 113 -302 99 187 6 -13 245 -85 190 369 -33 238 138 -162 11 188 -165
2742a65n8K71k59K9K73j91l92L40lj97L98Q5m54M03L31o94L34M57n00M0L76l53
$$ -165 -223 48 -211 -182 91 -100 -492 -152 -155 -352 46 131 -323 80 411 -283 51 508 8 48 424 71
2764G1j7L14j94k07K80K8m03J65j39k18K54L4j75oJ64l34J49K40j21k90L61j9
$$ 71 54 368 174 -33 247 275 -128 37 -102 -320 -66 -32 -207 -213 -49 -383 -234 6 -115 -405 -44 -63
2786f3o1L11J75m90L04P7k17J70Ml0j50K73j14j04J03j41l8R0j91j65J33m6j25
$$ -63 -124 187 362 -128 176 253 36 206 210 180 30 303 189 85 188 47 9 99 -92 -257 -124 -170 -295
2809b95J33p7p0K17l5j05O9K55j02k1J75k09K34q5J7n4K07k22n5L50k19q1mJ52
$$ -295 -162 -239 -309 -92 -127 -232 -163 92 -10 -31 144 -65 169 84 101 47 254 32 -23 327 108 27 23 175
2833A75k19j2N5K6L3j62k07L7K92k06j77K60J11j43oO4P7J13J55j00j56Q9n6P9
$$ 175 -44 -56 -1 25 58 -104 -311 -274 18 -188 -365 -105 6 -137 -143 -79 -2 111 266 166 10 99 43 122
2857A22N2j61k3K85j37j76J10l0j6q0N5o6j2K0j71J04J7l4j05K32j01J4l6J89
$$ 122 174 13 -10 275 138 -38 72 42 26 -54 1 -65 -77 -57 -228 -124 -107 -141 -246 -14 -115 -101 -137 52
2881E2k29K98m6J23n2O3j27J97k80P3L4j05P8j69J61p9N1p1m0q0J9r3K30j09N8
$$ 52 -177 121 75 198 146 209 82 279 -1 72 106 1 79 -90 71 -8 43 -28 -68 -148 -129 -222 8 -101 -43
2906d3k69J93R1J8l6J47p1L2M5l8K8R3J04k42J10N4j07N0j03M1j23Loj44K11k37
$$ -43 -312 -119 -28 -10 -46 101 30 62 107 69 97 190 294 52 162 216 109 159 56 97 -26 -23 -29 -173 38 -199
2932a99nJ21q8J57m4m3j18K50j45J64MNN1r7O8p5N1N8J35Nj63Q1J32k91m4K33
$$ -199 -204 -83 -171 -14 -58 -101 -219 31 -114 50 54 59 110 13 81 6 57 115 250 255 92 173 305 14 -30 203
2958B03j86k80K48q3j07L9K05k12j0J74k15qJ43J13M3J20j20L7P8Pk38J46m0K10
$$ 203 17 -263 -15 -98 -205 -166 39 -173 -183 -9 -224 -232 -89 24 67 187 67 104 182 189 -49 97 57 267
2982B67j14Q8j06k11K59L9l49K2J36r8j4J03j83o1L01l90K14NJ03j53J72j26n0
$$ 267 153 241 135 -76 183 222 -127 -105 31 -67 -81 22 -161 -222 79 -311 -97 -92 11 -142 30 -96 -146
3005a46J57qjO5J7q6K54o0q5J93j29j72L7K32k72J01l5j15Q3O5k78K4K35m16L2
$$ -146 11 3 2 67 84 -2 252 192 107 300 171 -1 36 268 -4 97 62 -53 30 95 -183 -159 76 -340 -308
3030c08M17k61j48L98k92m5M29j41k31L20J9l67L59K21k64o6L81m10p3L77l00
$$ -308 109 -152 -300 98 -194 -239 190 49 -182 138 157 -210 149 370 106 40 421 11 -62 315 15
3051A5k01L21k18j28K27J4l23K63K9k49LL04l28k7L53j79MM36k95k7J28J37k81
$$ 15 -186 135 -83 -211 16 30 -293 -30 -1 -250 -247 57 -271 -298 55 -124 -120 316 21 -6 122 259 -22
3074b2K69J0k83J19K22l53K54j54j39J57K7k80J9K70l49K3M51l61j36M49k90p7
$$ -22 247 257 -26 93 315 -38 216 62 -77 80 107 -173 -154 116 -233 -210 241 -120 -256 193 -97 -174
3096a74M47m06j78M96j19l01L90J14m86L46K45l44k14N51l60j40O82n72l66M05
$$ -174 273 -133 -311 185 66 -235 155 269 -217 129 374 30 -184 367 7 -133 549 -23 -389 16
3116A6P7n42L57L01o26J25L88m04J5L05k12kN79l00j57L21k07j61R9L44k39m5
$$ 16 93 -449 -92 209 -417 -292 96 -308 -293 12 -200 -202 377 77 -80 241 34 -127 -28 316 77 32
3138C2J25k39K98R5l58J65P9m21R7K75q3k96K15k31j21M70k28j99K26j83J30K09
$$ 32 157 -82 216 311 -47 118 197 -224 -127 148 65 -231 -16 -247 -368 102 -126 -325 -99 -282 -152 57
3160E7J64l48J45J17l18K59K17m68J06M98l13p2K16m20n2M23j80j02J20M9o15
$$ 57 221 -127 18 135 -183 76 293 -175 -69 429 116 44 260 -160 -212 211 31 -71 49 98 -517
3181e17N46K03m86K31J98m29n2M11k21j84M91l36j37M97n9l74K85Q2l54L52P5
$$ -517 29 232 -254 -23 175 -254 -306 105 -116 -300 191 -145 -282 215 156 -218 67 149 -205 147 222
3202B22l99K50J10k47N5K48k39j54K92n4k51Q9P1j84J08n5lk2P7J3J59q3n6J41
$$ 222 -177 73 183 -64 -9 239 0 -154 138 84 -167 -78 -7 -191 -83 -138 -141 -163 -86 -73 86 3 -53 88
3226H8K42l75K7K19k93J28L69l31j78L08j26m5K09l22j24K22O7k88O9R3m56M28
$$ 88 330 -45 -18 201 -92 36 405 74 -104 204 78 33 242 -80 -204 18 85 -203 -134 -41 -497 -69
3248f9K03m00J98K3j97M9L10j66O7J81k48n1L08L6l10J41J73k84N9J43j13r3K05
$$ -69 134 -266 -68 -45 -242 -193 117 -49 18 199 -49 -100 208 244 -66 75 248 -36 23 166 53 -40 165
3271A65j79j65O9Q8ln6r4L6O7Olo1k1J24j41K07O9k94K19O6J63J7l62J36J21k8
$$ 165 -14 -179 -110 -22 -25 -81 -175 -139 -72 -66 -69 -130 -151 -27 -168 39 108 -186 33 99 262 279 -83 53 174 146
3297A46k8O7j45M6r8l2j19R3J9j57j1J73j02J15Q7j59L1L4o0n3J01L0m1J91M7
$$ 146 118 185 40 86 -12 -44 -163 -70 -51 -208 -219 -46 -148 -33 54 -105 -74 -40 -100 -153 -52 -22 -63 128 175
3322A75N3K6r9J7j45J83l10K31l7k1j37J14l17K26pP1p5k8j34R1J4O0q1K0J85
$$ 175 228 254 155 172 27 210 -100 131 94 73 -64 50 -267 -41 -48 23 -52 -80 -214 -123 -109 -49 -130 -110 75
3347G5j54P8J0K5N8J2j34J00j9RL5J18n4Mj74j83L64j13j2j74J19l5j32K9K64
$$ 75 -79 -1 9 34 92 104 -30 70 51 60 95 213 159 163 -11 -194 170 57 45 -129 -10 -45 -177 -148 116
3372A16j91o7R7n4l1L0O5N8l4qR9j5L6J11j85J97p8j42J12n3q5n0J32j48K05k6
$$ 116 -75 -142 -45 -99 -130 -100 -35 23 -11 -19 80 65 101 212 27 224 146 4 116 63 -22 -72 60 -88 117 91
3398I1j50j1Ok06K25j62K21n5k2KJ10k03J27P5n9JJ25r6l5K9O8P6M1k52J53q6
$$ 91 -59 -70 -64 -270 -45 -207 14 -41 -63 -61 49 -154 -27 48 -11 -10 115 19 -16 13 81 157 198 -54 99 13
3424A3J12o7p8Q1qj48RJ08j50J69k96J00N8L9o6o5L99j97M2jk8n0J28p5O5k3J18
$$ 13 125 58 -20 61 53 -95 -86 22 -128 41 -255 -155 -97 -58 -124 -189 210 13 55 54 26 -24 104 29 94 71 189
3451A89j01j2m0P3j11J40k00m5J74j99O2j15K52r3Jp1Rj64K60K0L7N9j21J99k26
$$ 189 88 76 36 109 -2 138 -62 -107 67 -132 -70 -185 67 -26 -25 -96 -87 -251 9 29 66 125 4 203 -23
3476b3Mj9J74n0Pm4J95j62l3k9j39J73K3k42J47j1j01j1J80j39j05J03o1r5K04
$$ -23 -19 -38 136 86 93 49 244 82 49 20 -119 54 77 -165 -18 -29 -130 -141 39 -100 -205 -102 -163 -258 -54
3501e4mk2P1j03Q0J6O7j78J72R9k7K5R0q5j58J86k82J93R8j97k5N5L3m22L48n2
$$ -54 -58 -80 -9 -112 -32 -16 51 -127 45 144 117 142 232 147 -11 175 -107 86 184 -13 -38 17 50 -372 -24 -76
3527g6j91J60J24j42J95l7k14R8J9J19om2j15J36M1O1r5rJ10j35N2J62l37K13
$$ -76 -267 -107 17 -125 70 33 -181 -83 -64 55 49 7 -108 28 69 130 35 26 136 1 53 215 -122 91
3551I1K9l12M7K27l01M2K60j9j88K01n2j77J82j81J47J07j49qL6O8k7J55j01K0
$$ 91 120 -192 -145 82 -219 -177 83 64 -124 77 25 -152 30 -151 -4 103 -46 -54 -18 50 23 178 77 97
3575I7p8j6Q1N4j6j05k26K63J15k67M3j9k12M02j58j12J64n4k63K14K19k27j1
$$ 97 19 3 84 138 122 17 -209 54 169 -98 -55 -74 -286 116 -42 -154 10 -44 -307 -93 126 -101 -112
3598a12Q5k3J3L69j84k94L56K3k45K87k08j77O3J44j85L9J60k26L3J78k53j59
$$ -112 -27 -50 -37 332 148 -146 210 233 -12 275 67 -110 -47 97 -88 -49 111 -115 -82 96 -157 -316
3620c16L19j43j54K73k0m11L51M1r9J03K09k14J26M2J21l3k04o1K18L5Nq1R3p1
$$ -316 3 -140 -294 -21 -41 -452 -101 -60 -159 -56 153 -61 65 107 228 195 -9 -70 148 183 188 107 200 129
3644A29k54L29j87r9J75j39j64J72K20k96N6L1k55K24Q4k27O9J35j9j97M69k0
$$ 129 -125 204 17 -82 93 -46 -210 -38 182 -114 -58 -27 -282 -58 26 -201 -132 3 -16 -213 256 236
3666B36k98L27j20k19L79j21l5k0N7k4q7K13l64j34L25j39j72L13k07j53J13R0
$$ 236 -62 265 145 -74 305 184 149 129 186 162 75 288 -76 -210 115 -24 -196 117 -90 -243 -130 -40
3688d0q1Q0L1p1J22N2p3Pj27n0J86J88j89J04L0m6p0j27J87o4m6N8l5RJ18l11
$$ -40 -121 -41 -10 -81 41 93 20 27 -100 -150 36 224 35 139 169 123 53 -74 113 49 3 61 26 35 153 -158
3714a58kJ94m0j87J72k24K1K55j67J48J28j09p1K08M1j42j9J13j13K13p0l56Q2
$$ -158 -160 34 -6 -193 -21 -245 -224 31 -136 12 140 31 -40 168 209 67 48 161 48 261 191 -165 -83
3737h3K47k22j50L67k25p3J69j13M6mJ23l40P2J93k26J21K60k36J03K6j67K36
$$ -83 164 -58 -208 159 -66 -139 30 -83 -37 -41 82 -258 -186 7 -219 -98 162 -74 29 55 -112 124
3759A24K5j09J14Q6j24J23m3p2o9r1L0OJ12j35j36R9J3p9J24j1o0j27J01N9K0
$$ 124 149 40 154 240 116 239 196 124 55 -36 -6 0 112 -23 -159 -60 -47 -126 -2 -13 -73 -200 -99 -40 -20
3784b0NJ02p9L1P2j80J44N7k67J89O7j08M4J00q9p0K04k82J34n0p6p6K18j81j3
$$ -20 -15 87 8 39 111 -69 75 132 -135 54 121 13 57 157 68 -2 202 -80 54 4 -72 -148 70 -111 -124
3809a24J47j35o3K17j4j07J26P8k03O1J93j54k3L0L6r0J90N5n6j2N8k39P6Q2k41
$$ -124 23 -112 -175 42 28 -79 47 125 -78 -17 176 22 -1 29 65 -25 165 220 164 152 210 -29 47 129 -112
3834a12N3j21R0j12J43L3j40J29k07J55k4J68j73J84p9L9O4o9o9J12L2L5J9P5
$$ -112 -59 -180 -90 -202 -59 -26 -166 -37 -244 -89 -113 55 -118 66 -13 26 90 21 -48 64 96 131 150 225
3858B25j24p8Q7j34N4M7k57J18O2j22J22R4k44J08N3j4r2j34J02P6L7J1o5J59
$$ 225 101 23 110 -24 30 77 -180 -62 0 -122 0 94 -150 -42 11 -3 -95 -229 -127 -51 -14 -3 -68 91
3882I1n5m2n3J21K79j65j1o3N6j60J66Mk22J48r3l0J59q0j00J46k62Q8K0k74L45
$$ 91 36 -6 -59 62 341 176 165 102 158 -2 164 168 -54 94 1 -29 130 50 -50 96 -166 -78 -58 -332 13
3907A3j35K9j5K1O7m9N7j4J10j13J17l7N5J03k52K07l02L02j2o1j22L3l1j26J45
$$ 13 -122 -93 -108 -87 -20 -69 -12 -26 84 -29 88 51 106 209 -43 164 -138 164 152 91 -31 2 -29 -155 -10
3932a0k1o7P5K9k43N3K1K16j18LK7J02J7K1j01q9J60M8J32k83Q2L2j14N7L8l7
$$ -10 -31 -98 -23 6 -237 -184 -163 53 -65 -62 -35 67 84 105 4 -85 75 123 255 -28 54 86 -28 29 67 30
3958C0j53J18j7j48J44n7j1P8j08q8J16N9n1J15K7L8m4n6j41K32j10J82J99k94
$$ 30 -123 -5 -22 -170 -26 -83 -94 -16 -124 -212 -96 -37 -88 27 54 92 48 -8 -149 83 -27 155 354 60
3982F0O9J71j41p3r9kK5L9O7k50P4l4O1p0R6j08N6j03J82N1k95J38Q9p2J5J26
$$ 60 129 300 159 86 -13 -15 10 49 116 -134 -60 -94 -33 -103 -7 -115 -59 -162 20 71 -224 -86 3 -69 -54 72
4008G2j75J07m5P7K8J9M4m4m7p4J41O7J7j13L2k63K69j64p5Oj54K69O1j09j36
$$ 72 -103 4 -41 36 64 83 127 83 36 -38 103 170 187 74 106 -157 112 -52 -127 -121 -275 -6 55 -54 -190
4033a90R9J2p0J24L5k8q5N3J39l0L0j3p1K40k45J97j90L1O6k94K26k0k1k19J78
$$ -190 -91 -79 -149 -25 10 -18 -103 -50 89 59 89 76 5 245 0 197 7 38 104 -190 36 16 -5 -224 -46
4058d6K9kK7k5J0j42J11J6N3o8K4O0k1j38K01K9L9k77M6K08j78O2p4J14LL4n7
$$ -46 -17 -19 8 -17 -7 -149 -38 -22 31 -37 -13 47 26 -112 89 118 157 -120 -74 134 -44 18 -56 58 61 95 38
4085C8p7K1j14j01O3J22p1o3J19o0j01K50j7Q0r4L8j85O1K72k48K13K4n1L4Q7
$$ 38 -39 -18 -132 -233 -170 -48 -119 -182 -63 -123 -224 26 9 89 -5 33 -152 -91 181 -67 146 170 119 153 240
4110B40j24n8K58k46n7J2k4l5k7J26k68O2Q2k64J92K5q1k9J47m7K2K18m8Q4J39
$$ 240 116 58 316 70 13 25 1 -34 -61 65 -203 -141 -59 -323 -131 -106 -187 -216 -69 -116 -94 124 76 160 299
4135B99l48J50P9o8NJ26l59p8J66J51j20J18o8j52J24K8k40J2J34k10J58J34j1
$$ 299 -49 101 180 112 117 243 -116 -194 -28 123 3 121 53 -99 25 53 -187 -175 -41 -251 -93 41 30
4158C0l80M15k10K6M81l04j94J63J52j99J31J52l65j26K76O6j48K31q3k88L16
$$ 30 -350 65 -145 -119 362 58 -136 27 179 -20 111 263 -102 -228 48 114 -34 197 114 -174 142
4179A42kk60M1J24j77J26K4j83J34K0p4J3J89Q0l13J56O9k04L00j03O7J11k97
$$ 142 140 -120 -79 45 -132 -6 18 -165 -31 -11 -85 -72 117 197 -116 40 109 -95 205 102 169 280 -17
4202a7L3J05n4m6r9J30k17J62J9k5j33J30k7r6J55j39k0P8J4j47K85P8l56J54
$$ -17 16 121 67 21 -78 52 -165 -3 16 -9 -142 -12 -39 -135 20 -119 -139 -61 -47 -194 91 169 -187 -33
4226c3J21j34J13J75j65j21L00j44N5m4L8k40K23k52j7J74N3l73K57J53l14N1
$$ -33 88 -46 67 242 77 -44 256 112 167 123 161 -79 144 -108 -125 49 102 -271 -14 139 -175 -124
4248a24K0J09k61L41j65j29J91Q7j61J59m8q6J74R6r3K8J38j43j82J35nJ8l5n8
$$ -124 -104 5 -256 85 -80 -209 -18 69 -92 67 19 -67 107 203 110 138 276 133 -49 86 81 99 64 6
4272FQ0j59q5J24j7m4o0j1K07k19J70K1j69J01j84J30j9J88J43j81J25j66j35
$$ 6 86 -73 -158 -34 -51 -95 -155 -166 41 -178 -8 13 -156 -55 -239 -109 -128 60 203 22 147 -19 -154
4295a54K61P2j11n5P7o5K4j3N9k12J49m3o6O1j73l8K33j63J88jj42J13l5Q3Kj33
$$ -154 107 179 68 13 90 25 49 36 95 -117 32 -11 -77 -16 -189 -227 6 -157 31 30 -112 1 -34 49 51 -82
4321h2K31j84m1J33N3k23K06O6J19j40J4o9j19k0J28j38KPJ51k70QJ08j56J14
$$ -82 149 -35 -76 57 110 -113 93 159 278 138 152 83 -36 -56 72 -66 -64 -57 94 -176 -168 -60 -216 -102
4345a02R2k1m5M4J02O6k2q5n7P1J24P7k71R6l0M8q0P9k6l2J76l25J32Q9k31J12
$$ -102 -10 -31 -76 -32 70 136 114 29 -28 43 167 244 -27 69 39 87 7 86 60 28 204 -121 11 100 -131 -19
4371a9k03J55P7l8n1J02k0M8k11Q1K58n1j82J88l04L39j9m4M5M0rR1j30K3r5J48
$$ -19 -222 -67 10 -28 -79 23 3 51 -160 -79 179 128 -54 134 -170 169 150 106 151 191 182 273 143 166 71 219
4397B19j57n7r8j2QP9L0j62RJ11p9K5j2J30j78n8J32K12jr3k1J14q1p7L2J34j12
$$ 219 62 5 -93 -105 -97 -18 12 -150 -141 -30 -109 -84 -96 34 -144 -202 -70 142 141 48 27 141 60 -17 15 149 37
4424C7P0j1K7r5j4J11k88J1R8l4r8k7J87n9kK15k4k63K11j04Q9j9Q7J76j09r4
$$ 37 107 96 123 28 14 125 -163 -152 -54 -88 -186 -213 -26 -85 -87 128 104 -159 52 -52 37 18 105 281 172 78
4450G8o5K2K1L1l8Q1k19J81n4M9k35p4J89j42J42L2j24m5J23L5n2j1N6r4pJ48
$$ 78 13 35 56 87 49 130 -89 92 38 87 -148 -222 -33 -175 -33 -1 -125 -170 -47 -12 -64 -75 -19 -113 -120 28
4476B8m9J12r6N8j27J53p4J22k6m0j81J61Jkp4K8l2j3l0M8nj73J40q6J98r1M4
$$ 28 -21 91 -5 53 -74 79 5 127 101 61 -120 41 42 40 -34 -6 -38 -51 -81 -33 -38 -211 -71 -157 41 -50 -6
4503fj18j19J67QJ13kj12P3K43k64O6J27o5j3q4j3M3j33M6o6J58p2L7p4M5n3j02
$$ -6 -124 -243 -76 -68 45 43 -69 4 247 -17 49 176 111 98 14 1 44 -89 -43 -109 49 -23 14 -60 -15 -68 -170
4530a70N2N3Q7j07Q0p7n6O8K34k27R2k1MP9%j31n5K88j25M4L3j00k6O7j90l0Q1
$$ -170 -118 -65 22 -85 -5 -82 -138 -70 164 -63 29 8 12 91 91 -40 -95 193 68 112 145 45 19 86 -104 -134 -53
4557e3l9n0Q1P1j56J8Q4on0K37k12k3K42ok24K42k21k3K87k12J23K0Jj02n6PP8
$$ -53 -92 -142 -61 10 -146 -128 -44 -50 -100 137 -75 -98 144 138 -86 156 -65 -88 199 -13 110 130 131 29 -27 -20 58
4584E8k29J54O8k62K71j49m7r1J42j1K5Q8j17j33K56Q1rp4n3j03J88j33J77P9
$$ 58 -171 -17 51 -211 60 -89 -136 -227 -85 -96 -71 17 -100 -233 23 104 95 21 -32 -135 53 -80 97 176
4608A76L9p4j49K67m1q9q8j31O5m0j65L00j71mo5J84k47J34j16M3k4P3L8J17J04
$$ 176 215 141 -8 259 218 129 41 -90 -25 -65 -230 70 -101 -105 -170 14 -233 -99 -215 -172 -196 -123 -85 32 136
4633A36j54O0N4J29k47M6J14K8p9j03q9J15Q7o0q5M1m0j0Lj55J72k3J76n02K18
$$ 136 -18 42 96 225 -22 24 138 166 87 -16 -105 10 97 37 -48 -7 -47 -57 -54 -209 -37 -60 116 -386 -168
4658a68K04k08J66K02k80J56N9j99J28j08J80j17l8L8K67k97J23l0n7qj90J50
$$ -168 36 -172 -6 196 -84 72 131 -68 60 -48 132 15 -23 15 282 -15 108 78 21 13 -177 -27
4680b7l2o7L2o4O8K8J59j15q9M6J10L2r9J27k15J14nm7K22j15ol4K02k65JJ42
$$ -27 -59 -126 -94 -158 -90 -62 97 -18 -107 -61 49 81 -18 109 -106 8 3 -44 178 63 57 23 225 -40 -39 103
4706A03q9j5K03l11L1J34k74J70P7q1Kk4oNp0R8r4j76N56k22K8J25k38K7J88j75
$$ 103 14 -1 202 -109 -78 56 -218 -48 29 -52 -50 -74 -80 -75 -145 -47 -141 -317 239 17 45 170 -68 -41 147 -28
4732b8J10j4M9r7M7Q2j71Q9JM4l17K08Pk62K52j86P8n9J19m6QJ05Q0r7j14J55
$$ -28 82 68 117 20 67 149 -22 67 68 112 -205 3 10 -252 0 -186 -108 -167 -48 -94 -86 19 99 2 -112 43
4758D3J29L9k69P3j40K02K59j81j16j53K46Ol7M9l04J08J19p3q9J94j43k68K77
$$ 43 172 211 -58 15 -125 77 336 155 39 -114 132 138 101 150 -154 -46 73 0 -89 105 -38 -306 -29
4781b9LM2o4j7n8r9K74k7L9l7Pk3j0J36L1L9Rk41J50j41K20k03K49l14l1J86j27
$$ -29 -26 16 -48 -65 -123 -222 52 25 64 27 34 11 1 137 168 207 216 -25 125 -16 204 1 250 -64 -95 91 -36
4808c6%Q6j67N3J17l36J39J26k28L61n7j17O2J33m9o2J15J6Lo4jq4j7J09O3j51
$$ -36 -36 50 -117 -64 53 -283 -144 -18 -246 115 58 -59 3 136 87 25 140 156 159 95 94 10 -7 102 165 14
4834A4m9N1o1Mr0j9P1L9k3J7J79m34L19J5j23R5o0J42r9J76P9j78j04K01q0l1
$$ 14 -35 16 -45 -41 -131 -150 -79 -40 -63 -46 133 -301 18 33 -90 5 -55 87 -12 164 243 65 -39 162 82 51
4860E1J2j14K96j93Rm6Q2j75Q0Q4j75j77J66P9n6j0K1j13J80KL9m7K7L2K4k22
$$ 51 63 -51 245 52 61 15 97 -78 2 86 -89 -266 -100 -21 -77 -87 -66 -179 1 3 42 -5 22 54 78 -144
4886a44J48J03j33J1J67L7j39j7O4J7k3j57m5P8l1J07k48K17r5j6O8P6j98Qk9
$$ -144 4 107 -26 -15 152 189 50 33 97 114 91 -66 -111 -33 -64 43 -205 12 -83 -99 -31 45 -153 -145 -174
4911a74J15J47n2M5n0p6M3r4J54R1j14P2j52J43j93Q0o8J30p2k8K7p7o9l6L28
$$ -174 -59 88 36 81 31 -45 -2 -96 58 149 35 107 -45 98 -95 -15 -83 47 -25 -53 -26 -103 -172 -208 120
4936A20j69r8O2k8K8J9Q4l3R7j02j1K53k69K4jJ34P7j51rq6J62k1rk3K9k6j07
$$ 120 -49 -147 -85 -113 -85 -66 18 -15 82 -20 -31 222 -47 -23 -24 110 187 36 27 -59 103 82 73 50 79 53 -54
4963e4r5J74P8k49J8j36P8J53L4j18N7l9m4L40l39K13q4K55k97J43o8J84l13J73
$$ -54 -149 25 103 -146 -128 -264 -186 -33 1 -117 -60 -99 -143 197 -142 71 -13 242 -55 88 20 204 -109 64
4987F4n3N6r1j7J25j51k2O9L6k9n6j31J40PO9L7r6qJ63q2l01L78Nj47K09p5m5
$$ 64 11 67 -24 -41 84 -67 -89 -20 16 -13 -69 -200 -60 -53 16 53 -43 -51 112 30 -271 107 112 -35 174 99 54
5014E4M2m1Q4J1k32N3O6O9o4j33K02o1j23j32Q9J75j67%K2%N4j07Q6J43j04L6
$$ 54 96 55 139 150 -82 -29 37 106 42 -91 111 50 -73 -205 -116 59 -108 -108 -86 -86 -32 -139 -53 90 -14 22
5040B2k2j08J62O6m1k1O7k01K00L3j52NQ5q7oRQ3j29O8M6j75M6L5j09J65j25R8
$$ 22 0 -108 54 120 79 58 125 -76 124 157 5 10 95 8 2 11 94 -35 33 79 -96 -50 -15 -124 41 -84 14
5067A4L7o3j19J07K30j04n2m8O5j06j0K98k48O0J00M1j70R4l4k59J45p6j30M5
$$ 14 51 -12 -131 -24 206 102 50 2 67 -39 -49 249 1 61 161 202 32 126 92 -167 -22 -98 -228 -183
5091a83O9%R3p2J92k76J81O2J5rL5k44K59l0jK7j20J49m1k00K80o8j88J07Q7M5
$$ -183 -114 -114 -21 -93 99 -177 4 66 81 72 107 -137 122 92 91 118 -2 147 106 -94 186 118 -70 37 124 169
5117A69o5k36J38j16O5K1j4L3o8k9j80K06L0K0L9o4L6q1Q3J1K70j97p4j8K70l67
$$ 169 104 -132 6 -110 -45 -24 -38 -5 -73 -102 -282 -76 -46 -26 13 -51 -15 -96 -13 -2 268 71 -3 -21 249 -118
5143a18L18j00m2Rj8K9n8o4j29K31p2J17j90m0J20Nl9o6J44J1j34P3J82p4Np3
$$ -118 200 100 58 67 49 78 20 -44 -173 58 -14 103 -87 -127 -7 -2 -41 -107 37 48 -86 -13 169 95 100 27
5169B7QP9L4N8l50K40o2p0K3P6j08L4P4j87J12n3J24k12J92k14K19j02Q2j69J67
$$ 27 35 114 148 206 -144 96 34 -36 -13 63 -45 -11 63 -124 -12 -65 59 -153 39 -175 44 -58 24 -145 22
5194B2O9k7m9R6m9j05K43j82R0m2j0l0K4R8k27L6K32k19L6l5k8j26P2J07j45Q7
$$ 22 91 64 15 111 62 -43 200 18 108 66 56 26 50 148 -79 -43 189 -30 6 -29 -57 -183 -111 -4 -149 -62
5220f2j04J90r3j45J51J75K7j93Q6J01j52OO2k0R3j75J15R4j44q2J64Ro3J3o4
$$ -62 -166 24 -69 -214 -63 112 139 -54 32 133 -19 -13 49 29 122 -53 62 156 12 -70 94 103 40 53 -11
5245a1n1r2L44l62n5J86M5k24K14j5j18J31l3m2J83k6j27Q1J24Np4N9k14P3K33
$$ -11 -62 -154 190 -172 -227 -41 4 -220 -6 -21 -139 -8 -41 -83 100 74 -53 28 152 157 83 142 -72 1 234
5270B34k46m0K01j34j9R6j62KJ88j35o0J1J58j44K2R6j30O9J03%r4L2J9k5P2L1
$$ 234 -12 -52 149 15 -4 92 -70 -68 120 -15 -75 -64 94 -50 -28 68 -62 7 110 110 16 48 67 42 114 145
5296A45rl3O2j59J42K7k2j47o1M3N6n5k1k10K21o7l0J65o9m6l0J87k81K57j11
$$ 145 136 103 165 6 148 175 153 6 -55 -12 44 -11 -32 -242 -21 -88 -118 47 -22 -68 -98 89 -192 65 -46
5321d6J5mJ04m5O1l7o1M7J03o9j64J56L5j17k1O1n8r3J04j28lJ18J29k80R2J71
$$ -46 -31 -35 69 24 85 48 -13 34 137 68 -96 60 95 -22 -43 18 -40 -133 -29 -157 -160 -42 87 -193 -101 70
5347G0k84K91j31j71J63J78j02j4k6K21j13L9o3N3P8r4p1J32ml9r1J36k08r3J15
$$ 70 -214 77 -54 -225 -62 116 14 0 -26 195 82 121 58 111 189 95 24 156 152 113 22 158 -50 -143 -28
5372b8j55J37k2j28K39k0j68J08j9n9J18j19J86k8j88K12l8O6O3K8j83K09j47
$$ -28 -183 -46 -68 -196 43 23 -145 -37 -56 -115 3 -116 70 42 -146 66 28 94 157 185 2 211 64
5395F4o1n0j52L15q6L0k5L3q8Q4k80J41j3Q4K0j39P9kJ37j97J03rJ34o3j27J90
$$ 64 3 -47 -199 116 30 60 35 68 -20 64 -216 -75 -88 -4 16 -123 -44 -46 91 -106 -3 -12 122 59 -68 122
5421A22l6l8NO3o8n1r2j43K66J8l1O6r3M1k84J04J41k65K12K5j00J68p3P1PN2
$$ 122 86 48 53 116 48 -3 -95 -238 28 46 15 81 -12 29 -255 -151 -10 -275 -63 -38 -138 30 -43 28 35 87
5447H7nk2r5J30M1k06O6O2J35n3k20J16P3j46j4R4j9j48J17j03L7p2J46p1j00
$$ 87 82 60 -35 95 136 -70 -4 58 193 140 -80 36 109 -37 -51 43 24 -124 -7 -110 -73 -145 1 -70 -170
5472a70J79p9rl6K2J94k16Q9o5K27k33K42k75K58j62P0J30k37J70p7NJ46l8k63
$$ -170 9 -70 -79 -115 -93 101 -115 -26 -91 136 -97 145 -130 128 -34 36 166 -71 99 22 27 173 135 -128
5496a28J02lj27J33N6j57J21j7L4P2o0%m3o6L2J37K6p0J59k16O4p5Q0oM9j15l3
$$ -128 -26 -29 -156 -23 33 -124 -3 -20 14 86 26 26 -17 -83 -51 86 112 42 201 -15 49 -26 54 48 97 -18 -51
5523e1k2J04N1K0j56o1o0J17K51j76%J19l00L6Q2q4J45M8J04j96L0pJ16r4L6L0
$$ -51 -73 31 82 102 -54 -115 -175 -58 193 17 17 136 -164 -128 -46 -130 15 63 167 -29 1 -6 110 16 52 82
5549H2j50N7k6k6M4n3P2n9O0Kj58j00L44k86J48k30J94O2J05n2q7N4J8M7J2Qj13
$$ 82 -68 -11 -37 -63 -19 -72 0 -59 1 3 -155 -255 89 -197 -49 -279 -85 -23 82 30 -57 -3 15 62 74 82 -31
5576c1O9R3j88o6K59q3L3j03N6p4oQ1J12k12j6k7m4m8kJ04M4rn9K13n3q4KK3J43
$$ -31 38 131 -57 -123 136 53 86 -17 39 -35 -41 40 152 -60 -76 -103 -147 -195 -197 -93 -49 -58 -117 96 43 -41 -39 -16 127
5605A27j82J3J19%l2M3l9lP6j88Q5NJ9n9pn4P8k46M01j23o2m8k4o4J46l9m1J03
$$ 127 -55 -42 77 77 45 88 49 46 122 -66 19 24 43 -16 -23 -77 1 -245 156 33 -29 -77 -101 -165 -19 -58 -99 4
5633DK7j3j09J53j14J50o6m1R6ln2O2j12m6Jk3J17q7nM0J33l4l8J2m9M5o6o1J17
$$ 4 31 18 -91 62 -52 98 32 -9 87 84 32 94 -18 -64 -63 -86 31 -56 -61 -21 112 78 40 52 3 48 -18 -79 38
5662C8j10J95j76PK46q2k50J36J19P8j89J8p7j57L00L7j53K5N0j67J63P4l09J06
$$ 38 -72 123 -53 -46 200 118 -132 4 123 201 12 30 -47 -204 96 133 -20 5 55 -112 51 125 -184 -78
5686g8J69j75O1k7P8o5j84J82m8qJ11n5m5J60rn7J48Ok04J68Q0r2q8qqJ13q3r4
$$ -78 91 -84 -23 -50 28 -37 -221 -39 -87 -95 16 -39 -84 76 67 10 158 164 -40 128 208 116 28 20 12 125 42 -52
5714e2J81k29R9k5P2j36O4n9M4M0j3m1Q3J34k88N8J3r5J82L0j55J38J05l7j52
$$ -52 129 -100 -1 -26 46 -90 -26 -85 -41 -1 -14 -55 28 162 -126 -68 -55 -150 32 62 -93 45 150 113 -39
5739c9j04K23L4k02K0Q8k07J56j2q7m9K23k29K39j75Q2j60J57J0Q8J5j04P1j61
$$ -39 -143 80 114 -88 -68 20 -187 -31 -43 -130 -179 44 -185 54 -121 -39 -199 -42 -32 56 71 -33 38 -123
5763a23O5J26O2j19K6km8l4j0P2o2J3Q3j09M0M8jJ1j37o6M3K15k18K37m0j61Q7
$$ -123 -58 68 130 11 37 35 -13 -47 -57 15 -47 -34 49 -60 -20 28 27 38 -99 -165 -122 93 -125 112 72 -89 -2
5790bN1j06J4j06Q3P2J69k11l7J44Q9k35L3J87r1Q2j1p3j86L1J03n5M3j15j47
$$ -2 49 -57 -43 -149 -66 6 175 -36 -73 71 160 -75 -42 145 54 136 125 52 -134 -103 0 -55 -12 -127 -274
5815b74K98L5j54J07L1l7k5K19k23M6q2J49K0q3n6OP2j45K11n7l5j5k8m9N8q5
$$ -274 24 59 -95 12 43 6 -19 200 -23 23 -59 90 110 27 -29 -23 49 -96 115 58 23 8 -20 -69 -11 -96
5841i6R1k06J02O4L5%p9J22J02n1k87J39J18m5j1R5j85K36k8J1r3J70l19N6J03
$$ -96 -5 -211 -109 -45 -10 -10 -89 33 135 84 -203 -64 54 9 -2 93 -92 144 116 127 34 204 -115 -59 44
5866D4kr3P4J11k09n9K21j31L6k8l7L2L5j44Q3L8J8J05r7P1N5j32J99k87K20M
$$ 44 42 -51 23 134 -75 -134 87 -44 -8 -36 -73 -41 -6 -150 -67 -29 -11 94 -3 68 123 -9 190 -97 123 127
5892A27j80J55r6m9J29L5j07L3J6o1m6Q2m4j44JJ53j64J33J6J49p9jn6Q9j41K05
$$ 127 -53 102 6 -43 86 121 14 47 63 2 -44 38 -6 -150 -149 4 -160 -27 -11 138 59 58 2 91 -50 155
5918A55O0k57J19l5kJ30J2k40N5O0j59J16J8L6p1L6p2j11O2N9k2r4Q6J55k24J87
$$ 155 215 -42 77 42 40 170 182 -58 -3 57 -102 14 32 68 -3 33 -39 -150 -88 -29 -51 -145 -59 96 -128 59
5944E9m8m8K79l91K64j09R3j32J65j63J01Q8k16K7J1J82j13q4oN6l7O3l6q8Q7
$$ 59 11 -37 242 -149 115 6 99 -33 132 -31 70 158 -58 -31 -20 162 49 -35 -41 15 -22 41 5 -83 4
5969DK1p1j42J62N7l3j80Q3J54j71R1n2K72k68K46k54J12M6O6j38m1Q5j38K31
$$ 4 25 -46 -188 -26 31 -2 -182 -99 55 -116 -25 -77 195 -73 173 -81 31 77 143 5 -36 49 -89 142
5993A42J4k07o5K54k70L63l50J05j18j2N7o5J27p3o3J80j70N7K11o9j6O0j30O9
$$ 142 156 -51 -116 138 -132 231 -119 -14 -132 -144 -87 -152 -25 -98 -161 19 -151 -94 117 48 32 92 -38 31
6017C1j00K6J02l6J14k31J55qj36KJ21j24P1RP9j32j26J3K09j53N6N7J20p4j31
$$ 31 -69 -43 59 23 137 -94 61 53 -83 -81 40 -84 -13 -4 75 -57 -183 -170 39 -114 -58 -1 119 45 -86
6042h6O1K2J40Jj58j9K04j41j08K26k41L46j53j50m9O9oN0k9j04J5l2J22j1j09
$$ -86 -25 -3 137 138 -20 -39 165 24 -84 142 -99 247 94 -56 -105 -36 -42 8 -21 -125 -110 -142 -20 -31 -140
6067a40K33j44q3Q9qkJ0J41j52J68J04k9j65J61j99J2J11j67J57q6J23j49n6n6
$$ -140 93 -51 -134 -45 -53 -55 -45 96 -56 112 216 187 22 183 -16 -4 107 -60 97 11 134 -15 -71 -127
6091a27J57m5j14J81k13J29j39J34M9j47K4K7Q6M3j8LP6j32J60j74M1R8j88J22
$$ -127 30 -15 -129 52 -161 -32 -171 -37 12 -135 -111 -84 2 45 27 30 106 -26 134 -40 1 99 -89 33
6115C3r3J41n2Q5j86P2J53l00N8L8J57J0k10l8m4R0J56r8j9J39k59J79N3j52K9
$$ 33 -60 81 29 114 -72 0 153 -147 -89 -51 106 116 -94 -132 -176 -86 70 -28 -47 92 -167 12 65 -87 -58
6140e8K51nj38J33N4k03m6%k25M14j83n9O0j33P6L8L7j10J8J76j16j36QP6J72
$$ -58 193 188 50 183 237 34 -12 -12 -237 177 -6 -65 -5 -138 -62 -24 13 -97 -79 97 -19 -155 -147 -71 101
6165A01j25m2J21k7J0J15j81N1R8O3l4m4k7J10j23N4q1J19j38j69O3p0J08J2o
$$ 101 -24 -66 55 28 38 153 -28 23 121 184 150 106 79 189 66 120 39 158 20 -149 -86 -156 -48 -36 -42
6190d2oj22P2L5L1o0J81oqq1N8k14K94J0k7J2j17j03k8L39j49q2Q5L1k22Ll6O1
$$ -42 -48 -170 -98 -63 -32 -92 89 83 75 -6 52 -162 132 142 115 127 10 -93 -121 218 69 -13 72 103 -119 -116 -152 -91
6218i1o6J06Q4j61l9J27P3K9j34K4M4p2N1M8j5k1L7j1p7M9J45k53J88mQ1l1k6
$$ -91 -157 -51 33 -128 -167 -40 33 62 -72 -48 -4 -76 -25 23 8 -13 24 13 -64 -15 130 -123 65 61 142 111 85
6245H5l1n9J0k9R2j78lq5J21R1J3j0J0j35J20j2Q4l1p6j55K05R0j29Q7Q2k15k5
$$ 85 54 -5 5 -24 68 -110 -113 -198 -77 14 27 17 27 -108 12 0 84 53 -23 -178 27 117 -12 75 157 -58 -83
6272h3J56j36J03O8j25j71L63r8k91J28OQ7pL4o1j28J86j51J01l5J6Q7J03q5j24
$$ -83 73 -63 40 108 -17 -188 175 77 -214 -86 -80 7 0 34 -27 -155 31 -120 -19 -54 -38 49 152 67 -57
6297e7M2J53j04p4J05m9Qm4j7K6L4O0k19K35p2j06j65N9J99j39Q8J59l18K13j25
$$ -57 -15 138 34 -40 65 16 24 -20 -37 -11 23 83 -136 99 27 -79 -244 -185 14 -125 -37 122 -196 17 -108
6322a08L4Q1J4k7J7K5oM6r5j32J60L4m3N9j63J25M6j89K10j27J66j20OQ2j15J16
$$ -108 -74 7 21 -6 11 36 30 76 -19 -151 9 43 0 59 -104 21 67 -122 88 -39 127 7 13 95 -20 96
6348I6m8j02j6oJ6R2M2o3J14r5Q4k31J42J37j85q9K64j13J17m1j28j88J73M9m6
$$ 96 48 -54 -70 -76 -60 32 74 11 125 30 114 -117 25 162 -23 -112 152 39 156 115 -13 -201 -28 21 -25
6373b5p5L5J23j46L12l08j26L36k34J79m4j12L09k40J2n2N9M7r1P1m9P1Q7j50
$$ -25 -100 -65 58 -88 224 -84 -210 126 -108 71 27 -85 224 -16 -4 -56 3 50 -41 30 -19 52 139 -11
6397a1m7k3J74j29J81k96J27J31k33J74m6L0j66K11j77N1J14k7J1l7K3q4p1M5
$$ -11 -58 -81 93 -36 145 -151 -24 107 -126 48 2 32 -134 77 -100 -49 65 38 49 12 35 -49 -120 -75
6421g5J32q3J69N8j80Q2j5n1k1Q8j31j9jP7j19Pq1J04n4R2m8O3j01J10n9k5L7
$$ -75 57 -26 143 201 21 103 88 37 16 104 -27 -46 -47 30 -89 -82 -163 -59 -113 -21 -69 -6 -107 3 -56 -81 -44
6448d4J33k02K55o7j55K86p7j44J5qLM8r4p2P8K79k86J01j75J42J05j69k1J07
$$ -44 89 -113 142 75 -80 206 129 -15 0 -8 -5 43 -51 -123 -45 234 -52 49 -126 16 121 -48 -69 38
6472C8j92N3J76r3k0o2M6p4m0J58m2j45J29J67p7P7n5L0L5j00J49n9j08j4J86
$$ 38 -154 -101 75 -18 -38 -100 -54 -128 -168 -10 -52 -197 -68 99 22 99 44 74 109 9 158 99 -9 -23 163
6497A63l36L8O0k8O2q2J2J14K6R3j88M1p0n1K25j23J87q9j37J87j17r7R8J16r6
$$ 163 -173 -135 -75 -103 -41 -123 -111 3 29 122 -66 -25 -95 -146 79 -44 143 54 -83 104 -13 -110 -12 104 8
6522Hj28J04P2l1L1j33M2Q6l1r2J0O6o5r6J63q4N8J16r9R3j04j32R0K81j74o8
$$ 8 -120 -16 56 25 56 -77 -35 51 20 -72 -62 4 -61 -157 6 -78 -20 96 -3 90 -14 -146 -56 225 51 -17
6548a7K4l5Q1j37K4K3j2O6q1q8J78j80J67k69J46oL0Q5j13J35J29J1k58R4O6p4
$$ -17 7 -28 53 -84 -60 -37 -49 17 -64 -152 26 -154 13 -256 -110 -116 -86 -1 -114 21 150 161 -97 -3 63 -11
6574a1r8J30L2r8j4K06ok52J64m2Q6r2j54N0N6J86j19r4J09Q6j75o8KN0r4J40
$$ -11 -109 21 53 -45 -59 147 141 -111 53 11 97 5 -149 -99 -43 143 24 -70 39 125 -50 -118 -116 -66 -160 -20
6600b0j75K44j02J52k68P2K68j25j5J35j57n7J76k06n1J39K4rq4J81j46p4J09
$$ -20 -195 49 -53 99 -169 -97 171 46 31 166 9 -48 128 -78 -129 10 34 25 -59 122 -24 -98 11
6623A1k38J91N8m5q6J54j85J95K4p6K3NP5k58L71n9k25P4P2j7q7J5r8P5J15p8
$$ 11 -227 -36 22 -23 -109 45 -140 55 79 3 26 31 106 -152 219 160 -65 9 81 64 -23 -8 -106 -31 84 6
6649FL1k01J36P5j16l2K6P6Q0j44P7j09M1MJ52j23m4N9j16J67N0j10J8J03k80
$$ 6 37 -164 -28 47 -69 -101 -75 1 81 -63 14 -95 -54 -50 102 -21 -65 -6 -122 45 95 -15 3 106 -174
6674a74J52Q3M5o0Q0p0j07J4J69Pk60J49L9Qk80J94r1q0J71m4O6n2r5k6R7R1n1
$$ -174 -22 61 106 46 126 56 -51 -37 132 139 -121 28 67 75 -205 -11 -102 -182 -11 -55 11 -41 -136 -162 -65 26 -25
6701b5J83k20J05P8l7j47J63Oj25L1j2J8l0K22k45o9J37K1q3J12k27K16j22O7
$$ -25 158 -62 43 121 84 -63 100 106 -19 12 0 18 -12 210 -35 -104 33 54 -29 83 -144 72 -50 17
6725A7K7k5Q9j00K9Q0l2j56J4N1J13j08k6M4M7O2k02p8J92M3p5j72R3Qj8J38n2
$$ 17 44 19 108 8 37 117 85 -71 -57 -6 107 -1 -27 17 64 126 -76 -154 38 81 6 -166 -73 -65 -83 55 3
6752Ck7m1j25K03n1Q2j14J25Q8j13N8j82K84j49J2k2n9M0l0J27n2m9N0k31K39
$$ 3 -24 -65 -190 13 -38 44 -70 55 143 30 88 -94 190 41 53 31 -28 12 -18 109 57 8 58 -173 66
6777F6j3M1k59K00j63j23K19j01O8J76j25j68J71M1jO0J4j01j7M2j9N4qM5Pj41
$$ 66 53 94 -165 35 -128 -251 -32 -133 -65 111 -14 -182 -11 30 29 89 103 2 -15 27 8 62 54 99 106 -35
6803c5J14k07J74q8O2l8L8K7r7q6J2K23j92Q7j01p2K10j27K08j42K05j68M2o4
$$ -35 79 -128 46 -42 20 -18 20 47 -50 -136 -124 99 -93 -6 -107 -179 31 -96 112 -30 175 7 49 -15
6827a5M3l7N2Q1l4J20Rj78J49k71R6Q1k92K90k08K9O3j56K51o3L5j89K76m0j44
$$ -15 28 -9 43 124 90 210 219 41 190 -81 15 96 -196 94 -114 -85 -22 -178 73 10 45 -144 132 92 -52
6852e2J06n4J32l58K93j10J31mk12K57j6J12l10K18j83J5L1j9L2k33M08l81K39
$$ -52 54 0 132 -226 67 -43 88 84 -128 129 113 225 -85 133 -50 -35 -4 -23 9 -224 184 -197 42
6875D2l1N3m5p0P0J5r0k7J08P1q3N4q3j9Q6J14k36Q3Q5j36J76o9K6j83J29m1j90
$$ 42 11 64 19 -51 19 34 -56 -83 25 96 13 67 -16 -35 51 165 -71 12 97 -39 137 68 94 -89 40 -1 -191
6902a91K10j32Q9o6Q9j16J37P8k41J34P7j55J24p5P1n7J37j96P0J85r6n3R9n9
$$ -191 19 -113 -24 -90 -1 -117 20 98 -143 -9 68 -87 37 -38 33 -24 113 -83 -13 172 76 23 122 63
6926F3P5j61J12j43J22j7j57J45Nj66J22jn5l9Q9m2P9J9q0J6q5J45r8L8N2L8M9
$$ 63 138 -23 89 -54 68 51 -106 39 44 -122 0 -1 -56 -95 -6 -48 31 50 -30 -14 -99 46 -52 -14 38 76 125
6953A25J3q8L5P4k23q8K24p3J21J8j19j29P0J48r8J9%P2j93m2L15k61J16j41J16
$$ 125 138 50 85 159 -64 -152 72 -1 120 138 19 -110 -40 108 10 29 29 101 -92 -134 181 -80 36 -105 11
6978A1L4j14q8L2K54n3Q2j59J7kj34P4k8K0O8l4o0J09J2m5OJ03q0J7L0k02J40
$$ 11 45 -69 -157 -125 129 76 158 -1 16 14 -120 -46 -74 -54 14 -20 -80 29 41 -4 2 105 25 42 72 -130 10
7005A0j14K02j42N7o2no2R7R3J17j08j0o4j30J82R6j73R3O4j10P5o4j57P3qj7
$$ 10 -104 98 -44 13 -49 -54 -116 -19 74 191 83 73 9 -121 61 157 -16 77 141 31 106 42 -115 -42 -50 -67
7031f7J02M4j29M2L1n6p0J09n7J53j99J05J41o4J02n9k13P9K1l3J4K26nj92K3
$$ -67 35 79 -50 -8 23 -33 -103 6 -51 102 -97 8 149 85 187 128 -85 -6 15 -18 -4 222 217 25 48
7056D8L1l9j82J46O0j22r1J47n8R3j25K72j92Oj8K9j47R1o8M5J40j22N1P5oj29
$$ 48 79 40 -142 4 64 -58 -149 -2 -60 33 -92 180 -12 -6 -24 5 -142 -51 -119 -74 66 -56 -5 70 64 -65
7082f5Q7J94k48m7nP6J10n6M5j79N8n3J33k44L53j47j28K7j0J22n0n4J71j78J26
$$ -65 22 216 -32 -79 -84 -8 102 46 91 -88 -30 -83 50 -194 159 12 -116 -89 -99 23 -27 -81 90 -88 38
7107C8r3l2O5K15j17nJ6K7j40J32q6R6j46L8N0p7%K9j5q5P2m6J00j21J31m7J62
$$ 38 -55 -87 -22 193 76 71 87 114 -26 106 20 116 -30 8 58 -19 -19 10 -5 -90 -18 -64 36 -85 46 -1 161
7134A61k44Q0l3J51j90M7R7j31J19N8r3J1p6J6P2j34J83p4O6j52j3j42J10J56
$$ 161 -83 -3 -36 115 -75 -28 69 -62 57 115 22 33 -43 -27 45 -89 94 20 86 -66 -79 -221 -111 45
7158D5MJ78j78q7J7n8J24%K4j15J07q4P0K50j86o7J38j88O4Kp4P5n1r6J5J2J04
$$ 45 49 227 49 -38 -21 -79 45 45 69 -46 61 -23 47 297 111 44 182 -6 58 60 -14 61 10 -86 -71 -59 45
7185D5l7L1r4P3j4k55K35j83L11j36n6j33J60J7J18j25j4K40k59P0m1J46j35J71
$$ 45 8 39 -55 18 4 -251 -16 -199 112 -24 -80 -213 -53 -36 82 -43 -57 183 -76 -6 -47 99 -36 135
7209A35j53J23pQo9o8Q9N6j63O0l8j0R9j0j61J16NK9k83Q4QK34r0K8j38J69q0
$$ 135 -18 105 98 106 37 -31 58 114 -49 11 -27 -37 62 52 -109 7 12 41 -242 -158 -150 84 -6 22 -116 53 -27
7236b7J56k4j02k07L13l6q7O4Q5j17j38L01j41j87M8J13K4o7N7kp7j2O2k3j5N5
$$ -27 129 105 3 -204 109 73 -14 50 135 18 -120 181 40 -147 -99 14 38 -29 28 26 -51 -63 -1 -24 -39 16
7262A6j08R3J8J5M0o5Lp2O2j2l9K01j67J60k38J41J36m48L99k09Q9J00j53n9J1
$$ 16 -92 1 19 34 74 9 12 -60 2 -10 -49 152 -15 145 -93 48 184 -264 135 -74 15 115 -38 -97 -86
7287h6K09j40n6J45l9jM9R4k40L29q1k8k06L4M8j50K29j88q8Q4J23J18k81K80
$$ -86 123 -17 -73 72 33 32 81 175 -65 264 183 155 -51 -17 31 -119 110 -78 -166 -82 41 159 -122 158
7311A58j23Lj54Q7N5j06J7P5k3j25k3J51o0l8pQ3jJ1pJ01j66J47M6j16M4N5R9
$$ 158 35 38 -116 -29 26 -80 -63 12 -11 -136 -159 -8 -68 -106 -113 -30 -31 -20 -27 74 -92 55 101 -15 29 84 183
7338A83j53m8M9k24K57j66J51o8K6m8K5M5j66K71k78O3J00N5j14j1J4K9j2J24
$$ 183 30 -18 31 -193 64 -102 49 -19 7 -41 -16 29 -137 134 -144 -81 19 74 -40 -51 -37 -8 -20 104
7362A04k3J36k12J26J4j90M0J8N6J27j94M8k28N0P0j21J65R3j87J27N4j8q4K41
$$ 104 81 217 5 131 145 -45 -5 13 69 196 2 50 -178 -128 -58 -179 -14 79 -108 19 73 55 -29 212
7386B12k01k5q9J98L9o1o8J0k3K7n3J57j70M8j54J1J93j64K78j94n6J18r5J15
$$ 212 11 -14 -103 95 134 73 5 15 -8 19 -34 123 -47 1 -153 -142 51 -113 165 -29 -85 33 -62 53
7410E3m8j23J05j63J03J58j59OQ1n2O3R2nj40jj6j21J17J8K62k13J6j08j0J51
$$ 53 5 -118 -13 -176 -73 85 -74 -68 13 -39 24 116 111 -29 -30 -46 -167 -50 -32 230 17 33 -75 -85 66
7435F6O8j26L5P1%j05On3j31J34j82J88q9J24J6l4jK4M0N9j49J03j03J15N0l9
$$ 66 134 8 43 114 114 9 15 -38 -169 -35 -217 -29 -118 6 22 -12 -13 11 51 110 -39 64 -39 76 126 87
7461H7l4j29J51o8M1L9Nj31j9j6R1n3J75j44M4l2r6R4n6l2J69K8j93K72p1p9k14
$$ 87 53 -76 75 7 48 87 92 -39 -58 -74 17 -36 139 -5 39 7 -89 5 -51 -83 86 114 -79 193 122 43 -171
7488a71J30O9l0p9J52j00NN5n4j08K03j30N7j42M0J85j08L9L6L1p7o4R2p1J45
$$ -171 -41 28 -2 -81 71 -29 -24 31 -23 -131 72 -58 -1 -143 -103 82 -26 13 49 80 3 -61 31 -40 105
7513A05p3j06J60q1J68k24O7R1k19J68l4o8km3O1J08q0R4r4OO5l8l1n0O9j31J96
$$ 105 32 -74 86 5 173 -51 16 107 -112 56 22 -46 -48 -91 -30 78 -2 92 -2 4 69 31 0 -50 19 -112 84
7540H4j91J25m1LK29j41p5O7K0j35J77M9o3j32pk1oM4l2J62j26j4M2NR5j33j01
$$ 84 -107 18 -23 -20 209 68 -7 60 80 -55 122 171 108 -24 -31 -52 -58 -14 -46 116 -10 -24 18 23 118 -15 -116
7567a16K02k21N5RN6q4P1O9J16j69J19j06j09J25l9J27k07K13j52J34p1Mn8L8
$$ -116 86 -135 -80 -71 -15 -99 -28 41 157 -12 107 1 -108 17 -22 105 -102 111 -41 93 22 26 -32 6
7591Fj07K46j57K5N6j71R6o2j2O3m4j5J11lj06J21J39j70o5L1K3Qn5P4k80J28
$$ 6 -101 145 -12 13 69 -102 -6 -68 -80 -17 -61 -76 35 32 -74 47 186 16 -49 -18 5 13 -42 32 -248 -120
7617a20J33N8j8O3k41J71ql0k2m7m8K0J06j80K48j48Q2n3Q0o0R2j6p1N0l3l1P4
$$ -120 13 71 53 116 -125 46 38 8 -14 -61 -109 -89 17 -163 85 -63 19 -34 46 -14 78 62 -9 41 8 -23 51
7644E1J2o2M8m9K8k6L2n0L3J12j12Lm9j06L0J11Q8j90P4J96k03O4j8O9k09N0R4
$$ 51 63 1 49 0 28 2 34 -16 17 129 17 20 -29 -135 -105 6 94 -96 -22 174 -29 35 17 86 -123 -73 21
7671B1n6J24j41R1j01J16Q0q8q8j31L07j57P5o0J05oj41k2K8m2J02m9J6Q4N7j62
$$ 21 -35 89 -52 39 -62 54 134 46 -42 -173 134 -23 52 -8 97 91 -50 -72 -44 -86 16 -33 -17 67 124 -38
7697c8PK8l7k3LJ15K0l4o9L7o3K5J67p5mQj8j0o8m0J8J1J0M3j25P8rk0K1M4N3
$$ -38 -31 -3 -40 -63 -60 55 75 41 -28 9 -54 -29 138 63 59 67 49 39 -29 -69 -51 -40 -30 13 -112 -34 -43 -63 -42 2 55
7728E5jr0k4J57k07K1K07k26J18l6K7k3m7P5K14j0k40Lk4J37l5n7qj17P6j8j6
$$ 55 54 -36 -60 97 -110 -89 118 -108 10 -26 1 -22 -69 6 220 210 -30 -27 -51 86 51 -6 -14 -131 -55 -73 -89
7755h9J92p0j37J74j21p4J80R7k02P4j50K85j30j31J52k7L2k27J03R5J00j27Q1
$$ -89 103 33 -104 70 -51 -125 55 152 -50 24 -126 159 29 -102 50 23 55 -172 -69 26 126 -1 80
7778H0k01L26k32n9qL04j68n1p2M6j1J03R9p5p1j36M5N7J70j17j53J93j96P2P4
$$ 80 -121 205 -27 -86 -94 210 42 -9 -81 -35 -46 57 156 81 10 -126 -81 -24 146 29 -124 69 -127 -55 19
7803A9J04q3M0q7J40o8k01oK30j23p7K04l15K26j31K38r2Q4k02L5oJ33o9L7mN4
$$ 19 123 40 80 -7 133 65 -136 -142 88 -35 -112 92 -223 3 -128 110 18 102 -100 -65 -71 62 -7 30 26 80
7829H0j05N7L2p7p7J13NN7Kj11J34j41%l4J68r6N1k24N4J8J01j36R9R8j22R1J69
$$ 80 -25 32 64 -13 -90 23 28 85 87 -24 110 -31 -31 -65 103 7 58 -166 -112 -94 7 -129 -30 68 -54 37 206
7856B06l13J13J01k10Q0J23j2k25J71o1O9j28Q8O9r7J57J4o0j54J23j16O6k8j00
$$ 206 -107 6 107 -103 -23 100 88 -137 34 -27 42 -86 2 71 -26 131 145 85 -69 54 -62 4 -24 -124
7880a24N9n7Q2J2Q4l8j37J50M6j10J22m7M9J3JMJ0j61J24q0p5K57p3l7j62K98
$$ -124 -65 -122 -40 -28 56 18 -119 31 77 -33 89 42 91 104 105 109 119 -42 82 2 -73 184 111 74 -88 210
7906B10k59L7p1rPn1J43r9O7J28k07K33j02j0m2J71j55mK0j8L8J6lr4K35q9j69
$$ 210 -49 -12 -83 -92 -85 -136 7 -92 -25 103 -104 129 27 17 -25 146 -9 -13 7 -11 27 43 40 -54 181 92 -77
7933g7M9R8j13n7J2O0r7L84l20OP3q7J70j70L6J05Q2j97j15K69r1k2o7J65p9r
$$ -77 -28 70 -43 -100 -88 -28 -125 259 -61 -55 18 -69 101 -69 -33 72 154 -43 -158 111 20 -2 -69 96 17 8
7959Hn8O5j9N9L5n7O8nn9R4j52L4K6n4J59l44K80j27O5nk8Q8K1j52R7L4k08r0
$$ 8 -50 15 -4 55 90 33 101 96 37 131 -21 13 39 -15 144 -200 80 -47 18 13 -15 73 94 -58 39 73 -135 -225
7987b25J33P3P1L1l1j9j13J66N8j35j78J64l4R5r2Q4q7j3M6j7Kk7N9m3Q2l4O7
$$ -225 -92 -19 52 83 52 33 -80 86 144 9 -169 -5 -39 56 -36 48 -39 -52 -6 -23 -21 -48 11 -32 50 16 83
8014H3M0mJ3K9o7j49J04O6k03J30R3Nk41R4l7O2j28P2n5Q1n2qR3j52R7j9J48j12
$$ 83 123 119 132 161 94 -55 49 115 -88 42 135 140 -101 -7 -44 18 -110 -38 -93 -12 -64 -72 21 -131 -34 -53 95 -17
8042a7qj6q3J9Q9r2K77j16Lm9n2O8r2l9R9O5M6k23L27j40k85L24l1Po5j17M6j1
$$ -17 -25 -41 -124 -105 -16 -108 169 53 56 7 -45 23 -69 -108 -9 56 102 -121 206 66 -219 105 74 81 16 -101 -55 -66
8070f6L7O6o5K9n0N2K4p2O4l9P2Q8j15K1j27J5K25q3r6J66j07j3N9j8p2p1L6L2
$$ -66 -29 37 -28 1 -49 3 27 -45 19 -20 52 140 25 46 -81 -66 159 76 -20 146 39 26 85 67 -5 -76 -40 -8
8098hOn8J62o2p2RJ01p0o4K22j63O1l4N9rj25M4J44p3j37J43j9o2o7P9k0l5n1
$$ -8 -2 -60 102 40 -32 -23 78 8 -56 166 3 64 30 89 80 -45 -1 143 70 -67 76 57 -5 -72 7 -13 -48 -99
8126i9Kp7J82j40P3R5L0k10J07K1K31j94J01j73J01%K1j00Q4N1l8p1L8K4m7r7
$$ -99 -97 -174 8 -132 -59 36 66 -144 -37 -16 215 21 122 -51 50 50 71 -29 55 106 68 -3 35 59 12 -85
8152h5Q2N4QNj7r2n6Q9p4j4L9Q4P5o3p3K09j81M1r3J32j80m2J67Q6j68j5J08K9
$$ -85 -3 51 59 64 47 -45 -101 -12 -86 -100 -61 23 98 35 -38 171 -10 31 -62 70 -110 -152 15 101 -67 -82 26 55
8180E5j25K19j73o1P3M7k8m4R9p0P4
$$ 55 -70 149 -24 -85 -12 35 7 -37 62 -8 66
8191F6
$$ Imaginary data points
##PAGE= N=2
##DATA TABLE= (X++(I..I)), XYDATA
0@%%%%%%%%%%%%%%%kJ0j6J6j6J6j9K7l2L3m1M8n6O4p2Q7r9J08j20J37j58J80j99
$$ 0 0 0 0 0 0 0 0 0 0 0 0 0 0 0 0 -2 8 -8 8 -8 8 -11 16 -16 17 -24 24 -32 32 -40 47 -52 56 -64 73 -85 95 -104
38a04K22k50K78l07L41l78M17m60N08n60O16o79P48q24R07j000J107j228J365
$$ -104 118 -132 146 -161 180 -198 219 -241 267 -293 323 -356 392 -432 475 -525 582 -646 719
57G19j520J701j918K178k497K899l426M152n213O910j0040J7628o8093p1623J75183
$$ 719 -801 900 -1018 1160 -1337 1562 -1864 2288 -2925 3985 -6055 11573 -56520 -128143 47040
72D7040K7607k7244O9212k3488p9271Q1649K5806j02004p569J0784r5722J514
$$ 47040 74647 47403 116615 93127 13856 95505 121311 19307 11738 22522 -73200 -71686
84g1686O6709m2361k5530M1670k4269Q332P6610j2976m7157L2981J9947j642K3547
$$ -71686 -4977 -47338 -72868 -31198 -55467 -47135 29475 16499 -30658 2323 22270 20628 44175
97D4175j9456l4124L1611J0104l4285J0575P627k6591J6892R754k8088K3409J3550
$$ 44175 24719 -9405 22206 32310 -1975 8600 16227 -10364 6528 16282 -11806 11603 25153
110B5153n7358l064L4564l1823j0900L0047k6072j477O2009r410l0193N7723J6947
$$ 25153 -32205 -35269 -705 -32528 -43428 -13381 -39453 -40930 21079 11669 -18524 39199 56146
123E6146m5537K3544J6289m1314K0265J6413o9142j0473M1515l8626k9126L3565
$$ 56146 10609 34153 50442 9128 29393 45806 -23336 -33809 7706 -30920 -60046 -26481
135b6481j5976j8162M8452P685j8954M9020J9843l7690K3174K9109l4021l823
$$ -26481 -42457 -60619 -12167 -4482 -23436 25584 45427 7737 30911 60020 25999 22176
147B2176J2176l4843k519K5003l2179k3602K7602m910k1543J5660l227j2873L1808
$$ 22176 34352 -491 -3010 21993 -10186 -33788 -6186 -11096 -32639 -16979 -20206 -33079 -1271
160a271J0553k5848J3919J6967j6871P485J3835j7905P20J2832j2552M692K1921
$$ -1271 9282 -16566 -2647 14320 -2551 4934 18769 864 1584 14416 1864 6556 28477
173B8477j4908j7240J3239k246r796Q214j4607j8127J8698N439j5185Q945K230
$$ 28477 13569 -3671 9568 7322 -2474 5740 -8867 -26994 -8296 -2857 -18042 -9097 -6867
186f867j2026J6537J1703j5649O706J5326j3021K820K1161j3200j3663J0739j0740
$$ -6867 -18893 -2356 9347 -6302 404 15730 2709 5529 26690 13490 -173 10566 -174
199a74r611J8466r661k3320J6622R299j3981J0852Q641j8707M202J8442j0203
$$ -174 -9785 8681 -980 -24300 -7678 1621 -12360 -1508 7133 -11574 -7372 11070 867
212H67k635J6147r731q694J7643k792j3432R710l471j5337Q788N991j3476J86
$$ 867 -1768 14379 4648 -4046 13597 10805 -2627 7083 3612 -11725 -2937 3054 -10422 -10236
226a0236P515o274P11Q664m974k597Q597j105rR788j428m079O865J52m630J346
$$ -10236 -2721 -8995 -8284 380 -4594 -7191 1406 301 292 10080 8652 4573 11438 11590 6960 8306
242H306l765n300R68j888m411K382q51o967K143N101l807J575M806m510K806R399
$$ 8306 4541 -759 209 -1679 -6090 -3708 -4559 -11526 -9383 -4282 -8089 -6514 -1708 -6218 -3412 5987
258E987k385j849N103k054k228N239q91n695K772J748o514P80N166n361m778J738
$$ 5987 3602 1753 6856 4802 2574 7813 6922 1227 3999 5747 -767 13 5179 -182 -4960 -3222
274c222k328k5L229l229k347M936L853p72P12K027o17k12J323o02r0M37l038k010
$$ -3222 -5550 -5575 -2346 -5575 -7922 -2986 867 95 807 2834 2217 2005 3328 2726 2636 3073 35 -1975
292a975J276M18j16k583k355K116K871P88J99p16J674L036Q96o80N6P04j640l595
$$ -1975 -699 -281 -397 -2980 -5335 -3219 -348 440 639 -77 1597 4633 5529 4849 4905 5609 3969 374
310C74L89P38k801k833k449j33K509M44k536k49K253K679J258J234J069j23J488
$$ 374 763 1501 -1300 -4133 -6582 -6715 -4206 -3762 -6298 -6547 -4294 -1615 -357 877 1946 1823 3311
327C311J599j124J118J407j883j993j73J054q16l476l148n45J146P13k711n46
$$ 3311 4910 3786 4904 6311 4428 2435 2262 3316 2500 -976 -4124 -4669 -3523 -2810 -5521 -6067
343f067K483N52L42J690J127O52pJ55J225P85q2k68p62P7J093N80q64k399o64
$$ -6067 -3584 -3032 -2690 -1000 127 779 772 927 2152 2937 2855 2587 1825 1902 2995 3575 2711 312 -352
362c52J042p87l60j152p57J718l07j188K372Q68k125L25J787K14k02k02j896l93
$$ -352 690 -97 -457 -1609 -2366 -648 -955 -2143 229 1097 -1028 -703 1084 1298 1096 894 -1002 -1395
380a395J768j422j985J605j599k175L743L09k724K584K076o84K841K625j915M30
$$ -1395 373 -1049 -3034 -1429 -3028 -5203 -1460 -1151 -3875 -1291 785 101 2942 5567 3652 4082
396D082K336k283r52K374m660l995L365k374m482L598j109m099N045K513l741
$$ 4082 6418 4135 3183 5557 897 -3098 267 -2107 -6589 -2991 -4100 -8199 -3154 -641 -4382
411d382L250L344m463K870O198n325k732O690l014l934O557k287n863N705P49
$$ -4382 -1132 2212 -2251 619 6817 1492 -1240 5450 2436 -1498 5059 2772 -3091 2614 3363
426C363n967M609K846o755K33L983m619m13M545n749k672N790k159k203N793j466
$$ 3363 -2604 2005 4851 -1904 -1671 2312 -2307 -2720 1825 -3924 -6596 -806 -2965 -5168 625 -841
442h41k659N754m68k072O703j077p176K956K427l759K602k42r155L259P441o710
$$ -841 -3500 2254 1786 -286 6417 5340 -1836 1120 3547 -212 2390 2148 -7007 -3748 3693 -3017
458c017P95O684p973k77J1951m532n638P755m739p124J1510R03j3365L207M036
$$ -3017 -2222 4462 -3511 -3788 8163 3631 -2007 5748 1009 -6115 5395 6298 -7067 -3860 176
473A76r098Q051Q435j5824j921J4887m468k099J0396q625p743J3796R77r014Q238
$$ 176 -8922 -871 7564 -8260 -10181 4706 238 -1861 8535 -90 -7833 5963 6940 -2074 6164
488F164j061j3196R642R385j2516J73O538j0529K688J1931j1286o670J0026m008
$$ 6164 5103 -8093 1549 10934 -1582 -1409 5129 -5400 -2712 9219 -2067 -8737 1289 -2719
502b719l702R430o069r151J2394L600r963O924L681j0231Q247R616j0646L93N477
$$ -2719 -6421 3009 -3060 -12211 183 3783 -6180 744 4425 -5806 2441 12057 1411 1804 7281
517G281j0376L428J1768j1009p362Q202m220l127J0957n589j1697R683K470p676
$$ 7281 -3095 333 12101 1092 -6270 1932 -2288 -5415 5542 -47 -11744 -2061 409 -7267
531g267R304J260j2829Q941P779j0901N489P785j3846J266J2842j0015m363J2482
$$ -7267 2037 3297 -9532 -591 7188 -3713 1776 9561 -4285 -3019 9823 -192 -4555 7927
545G927q505q229J5531l836j3082J3663J328j6275J2065R157j6322N454J1561
$$ 7927 -578 -8807 6724 2888 -10194 3469 4797 -11478 587 9744 -6578 -1124 10437
558A0437j5620J26J7089j0740q168J3939p746j1185J7906J192j7419P200L669
$$ 10437 -5183 -5057 12032 1292 -6876 7063 -683 -11868 6038 7230 -10189 -2989 680
571F80j1781J1214J0168j5393j759J0603m919K658J1099j0513q692R889k36k846
$$ 680 -11101 113 10281 -5112 -6871 3732 -1187 1471 12570 2057 -6635 3254 3018 172
585A72Q891n870j1075P743L260l596N508n560j1957Q575O552p612L317K137j0085
$$ 172 9063 3193 -7882 -139 3121 -475 5033 -527 -12484 -3909 2643 -4969 -1652 485 -9600
600i600O670J0918j0233q33J0285r567k107J6034o261j0163J2242l242j0957J3377
$$ -9600 -2930 7988 -2245 -3078 7207 -2360 -4467 11567 5306 -4857 7385 4143 -6814 6563
614F563J938j8424N786J0556j1935J882J0558j2882j268J5855r239q429J4983
$$ 6563 8501 -9923 -4137 6419 -5516 -3634 6924 -5958 -7226 8629 -610 -9039 5944
627E944k766j1619J1166J998j0963Q390M240j2648L946Q836j0328l01J0463o332
$$ 5944 3178 -8441 2725 4723 -6240 2150 6390 -6258 -2312 6524 -3804 -4105 6358 26
641B6k082Q396o898l759J1459l175r899N411R38l579O728r04p837N524L140q278
$$ 26 -2056 6340 -558 -4317 7142 3967 -5932 -521 417 -3162 3566 2662 -5175 349 3489 -4789
657d789L590N686q037n46M833m890K936P597q640m151R059j548l354O103l095
$$ -4789 -1199 4487 -3550 -4096 737 -4153 -1217 6380 -2260 -6411 2648 1100 -2254 3849 754
672G54m921R319J323q602N284L774r320J061M909o425J703N029q995R1J0412m772
$$ 754 -4167 5152 6475 -2127 3157 6931 -2389 -1328 3581 -2844 -1141 3888 -5107 -5016 5396 624
688F24o880N973n00l947O528m72p071O743M283q474K427N784o276J10M329n533
$$ 624 -6256 -283 -783 -4730 1798 1326 -5745 998 5281 -3193 -766 5018 -1258 -1148 3181 -2352
704b352J107P698m740n379O592Q00n246K078l28m248M410J240o408K871N619m229
$$ -2352 -1245 6453 1713 -3666 2926 3726 -1520 558 230 -4018 392 1632 -4776 -1905 3714 -515
720e15k083K386j829R62K678l466j051M878L21l101J598L15j472J536j258k354
$$ -515 -2598 -212 -2041 -1079 1599 -1867 -2918 1960 2281 -820 778 1093 -379 1157 -101 -2455
736b455M082J735l547N24K145j229Q83q74l796J558L132l536j811L610P5j992
$$ -2455 1627 3362 -185 339 2484 1255 2138 1264 -2532 -974 2158 -1378 -3189 421 496 -1496
752a496J116j633j408M119o98m088K943L211j866M82J448j724L88K138k888j224
$$ -1496 -380 -2013 -3421 698 0 -4088 -1145 2066 200 682 2130 406 794 2932 44 -1180
768a180L622K60k934R76Q29q60N09j657k692J835J755j868j020J268J138Mk54
$$ -1180 2442 2702 -232 744 1573 713 1222 -435 -3127 -1292 463 -1405 -2425 -1157 -19 -15 -269
785b69o48l04J111r45p95J793R79m53L52m27K63J452o11j859k27J124Q28m18k73
$$ -269 -917 -1221 -110 -1055 -1850 -57 922 469 821 394 657 2109 1498 -361 -588 536 1364 946 673
804F73N1M80M43j735r30J044n61j252N27N17O02K69j095k54Q20J86j61l57J90
$$ 673 724 1204 1647 -88 -1018 26 -535 -1787 -1260 -743 -141 128 -967 -1221 -401 -215 -376 -733 -543
823e43M34M96P28k92OP23n30n49O1J91K24j52q65M22P62n05j112n97K86N0n44
$$ -543 -109 387 1115 823 829 1552 1022 473 534 725 949 797 -68 354 1116 611 -501 -1098 -812 -762 -1306
844a306K44J73m3O11l22J96M02o22j76K13M32M15P07J43m8j51N83l46l15j20j81
$$ -1306 -1062 -889 -932 -321 -643 -447 -45 -667 -843 -630 -198 217 924 1067 1019 868 1451 1105 790 670 489
865D89K08K55n80P3K36p00j55l70j86k97j23r8k4M25L48l24N61K16j053P54N92
$$ 489 697 952 372 445 681 -19 -174 -544 -730 -1027 -1150 -1248 -1272 -847 -499 -823 -262 -46 -1099 -345 247
886B47o52K39P86l19P04P01o54m7Q16o87j128J246Q0j597M27K11j827Q90M96j946
$$ 247 -405 -166 620 301 1005 1706 1052 1005 1821 1134 6 1252 1332 -265 162 373 -1454 -564 -68 -2014
906b014k55J517p72K44J594r54p16K270J83j678J316P04k065P22J440j332M31
$$ -2014 -2269 -752 -1524 -1280 314 -640 -1356 914 1097 -581 735 1439 -626 96 1536 204 635
923F35M00j856Q07J682j466q87R36j93PJ005n92j198P88j24j230J352m62j510
$$ 635 1035 -821 -14 1668 202 -685 251 58 65 1070 478 -720 68 -56 -1286 66 -396 -1906
941a906J585j76j529K668M00k412R24J586j813R67J729k600m6L320k662j694M391
$$ -1906 -321 -497 -2026 642 1042 -1370 -446 1140 -673 294 2023 -577 -623 2697 35 -1659 2732
958B732r90l698L234N43l599L248J287m987Q47L592l321q52L464l585k051M992
$$ 2732 1742 -1956 1278 1821 -1778 1470 2757 -2230 -1383 2209 -1112 -1964 1500 -2085 -4136 856
974H56j332l223M600l06m210M067K359l398J277J654l212J781L454l634j665K842
$$ 856 -476 -3699 901 595 -3615 452 2811 -587 690 2344 -868 913 4367 733 -932 1910
990A910k093r26L526k165k848K608l72j720K821l44l163K164N56k084K712Q45
$$ 1910 -183 -1109 2417 252 -2596 12 -360 -2080 741 397 -2766 -602 -46 -2130 582 1427
1006A427l870J601K756l112Q35L157l686m36M429l416j226N082k549l250M573
$$ 1427 -2443 -842 1914 -1198 -363 2794 -892 -1328 3101 -315 -1541 3541 992 -2258 2315
1021B315r55m143M697Q77n819K344L130n423K093M717o198r06N839l809j653O402
$$ 2315 1360 -2783 1914 2791 -3028 -684 2446 -2977 -884 3833 -2365 -3271 2568 -1241 -2894 3508
1037C508l225n209O043O77m729M435R28o684L408N128n480O04M410n549m99O875
$$ 3508 283 -4926 1117 1794 -2935 1500 2428 -4256 -848 4280 -1200 -596 3814 -1735 -2234 4641
1053D641k891l746M272j917l217N046K39n164K208J072l945L087K951n444j45
$$ 4641 1750 -1996 2276 359 -2858 2188 2427 -2737 -529 543 -3402 -315 2636 -2808 -2953
1068b953L313k636J434L729m051j022L834j512j48L787k909l010M468o23k715
$$ -2953 360 -2276 -842 2887 -1164 -2186 1648 136 -12 3775 866 -2144 2324 1701 -1014
1083a014L729p73n010L929J765n063K890J901o617K387M982n972n75O078m039
$$ -1014 2715 1942 -3068 861 2626 -2437 453 2354 -4263 -1876 3106 -2866 -3441 2637 -1402
1098a402k540O800k614m731P075K82o492N061K412p365L741N014o870j96N725
$$ -1402 -3942 2858 244 -4487 2588 2870 -3622 1439 3851 -3514 227 5241 -1629 -1825 3900
1113C900m973j747O757k626n314M923L76m187M438Q19o052K711L842m172O10K804
$$ 3900 -1073 -2820 3937 1311 -4003 920 1296 -2891 1547 2366 -3686 -975 2867 -1305 -695 2109
1129B109m161L5L791j819j042K062k290p54L926r36k024K133j169j633M371n45
$$ 2109 -2052 -2017 1774 -45 -1087 975 -1315 -2069 1857 921 -1103 1030 -139 -1772 2599 2054
1145B054l301K456j17k614L439J030m556J578K136m502J131M171m459j676M314
$$ 2054 -1247 1209 1092 -1522 1917 2947 -1609 -31 2105 -2397 -1266 2905 -1554 -3230 1084
1160A084l056j972N829j319m596M488N93m122M583K355n446J145L855l569L16
$$ 1084 -1972 -3944 1885 566 -4030 458 1051 -3071 1512 3867 -1579 -434 3421 -148 168
1175A68M433m099l281M745j058k416L647j346m827L412K104l165J069J148l497
$$ 168 4601 502 -2779 1966 908 -1508 2139 793 -4034 -622 1482 -1683 -614 534 -2963
1190b963J210L618k131r07J740j872J41L776j387k219J764n19q55K887o77k580
$$ -2963 -1753 1865 -266 -1173 567 -1305 -1164 2612 1225 -994 770 251 -604 2283 1606 -974
1206i74Q90N41r51J636O9l140P50K057j456N17J253k608J89K819j443r37J790
$$ -974 -84 457 -494 1142 1211 -1929 -1179 878 -578 -61 1192 -1416 -1227 1592 149 -788 1002
1223A002j748r15K573o25k081J681R9j829J805J805k819N13K110j502M86J630
$$ 1002 -746 -1661 912 287 -1794 -113 -14 -1843 -38 1767 -1052 -539 1571 69 555 2185
1239B185k129o16K650r93j589J390l56k368J910O74k317P61J254k053K79K072
$$ 2185 56 -560 2090 1097 -492 898 542 -1826 84 758 -1559 -798 456 -1597 -1318 754
1255G54j336o33J200q59j55K020o03j406J247P04q02M21M99o71L25K94q11M50
$$ 754 -582 -1215 -15 -874 -1029 991 388 -1018 229 933 131 552 1051 380 705 999 188 638
1273F38P01r73o19J49l97L95J33j349o9N64L85j50K73k42j6O62j18m00J277q6
$$ 638 1339 366 -253 -104 -501 -106 27 -1322 -1391 -827 -442 -592 -319 -561 -577 85 -33 -433 844 758
1293G58j288M96R81l60N6n72p92P93R82m86p86N86L80l88K19j47q17K45j40o85
$$ 758 -530 -34 947 587 643 71 -721 72 1054 568 -218 368 748 360 579 432 -385 -140 -280 -965
1313i65L10O32l20q41m2O94N39J73o72m59J016P12m54k62M24J5R6k06o3N80k74
$$ -965 -655 -23 -343 -1184 -1226 -532 7 180 -492 -951 65 777 323 61 485 500 596 390 327 907 633
1334F33p75j23L81O57j54q46j33K06K75m74n46J8K93J79J39m58J41M57j28l51
$$ 633 -142 -265 116 773 619 -227 -360 -154 121 -353 -899 -881 -588 -409 -270 -728 -587 -130 -258 -609
1354f09K89Q28J34m01k12P24M83K3j099m76Q08m0n46q0o0J77J86k89j88K32K09
$$ -609 -320 508 642 241 29 753 1236 1259 160 -316 492 452 -94 -174 -234 -57 129 -160 -348 -116 93
1375I3p31j21L59M28L5j02o10K22Q60k93j027L59L55K40J34m82M85O77j86p30
$$ 93 -638 -759 -400 28 63 -39 -649 -427 433 140 -887 -528 -173 67 201 -281 204 881 695 -35
1395c5N27N00n12m32K81k05J19N45j006r1M44k77m10K5k89J43N72l84k94M02O08
$$ -35 492 992 480 48 329 124 243 788 -218 -309 135 -142 -552 -527 -816 -673 -101 -485 -779 -377 231
1416B31n36l77M83J05L20M47o32N26J149p61l05K12j73n08K55m42m80N35m1j145
$$ 231 -305 -682 -199 -94 226 673 41 567 1716 955 650 862 689 181 436 -6 -486 49 8 -1137
1436a137M88L86p56L07M02j063Q60J044j018j71J385l46n41J078m96q91J201R6
$$ -1137 -649 -263 -1019 -712 -310 -1373 -513 531 -487 -658 727 381 -160 918 422 -469 732 828
1454H28j488J270J003k008K25J290j342j63J106j194m04J645o33r68J315j01j251
$$ 828 -660 610 1613 -395 -170 1120 -222 -385 721 -473 -877 768 135 -833 482 381 -870
1471h70Q58M07j345O48P88j233J57J171j110J83O45q10K24R43j012j36J523m12
$$ -870 -12 395 -950 -302 486 -747 -590 581 -529 -346 299 -511 -287 656 -356 -492 1031 619
1489F19m94J018m65q39J398m92j598J508j33j492J420L67k345P83J336j967K27
$$ 619 125 1143 678 -161 1237 745 -853 655 522 -970 450 817 -1528 -745 591 -1376 -1149
1506a149J657j784n70K717p93j248K323r07k139L101O63k596J311J216k581J306
$$ -1149 508 -1276 -1846 871 78 -1170 1153 246 -1893 1208 1871 -725 586 1802 -779 527
1522E27K381k714j184J968j601p87K832j344k807K319N40j792K006M69k814J024
$$ 527 2908 194 -990 978 -623 -1410 1422 78 -2729 -410 130 -1662 344 813 -2001 -977
1538i77J963j432O27J360k368m8K507j167o99J426j620q83K496m09j374J530n50
$$ -977 986 -446 181 1541 -827 -875 1632 465 -234 1192 -428 -1311 1185 776 -598 932 382
1555C82j397J966K7j804Q71N99k215J097J739k190O2J777k075p3K628j685q41
$$ 382 -1015 951 978 -826 45 644 -1571 -474 1265 -925 -863 914 -1161 -1234 1394 -291 -1132
1572a132K296j486j363L192l78k730J989K08k368K096J930l221L24K306k186L73
$$ -1132 1164 -322 -1685 1507 1129 -1601 388 596 -1772 324 2254 -967 -643 1663 -523 -150
1588a50L021k713k011L286j219j904K835o29l410K116J655k594J062J473l065
$$ -150 2871 158 -1853 1433 214 -1690 1145 516 -2894 -778 877 -1717 -655 818 -2247
1603b247R19L503k172j086K654j441q24L007j156k522J998O21j765J230j1j933
$$ -2247 -1328 2175 3 -1083 1571 130 -694 2313 1157 -1365 633 1254 -511 719 708 -1225
1619a225R08J498j471O8O30j876N46J798j211n91O62j070N97J948j577j136J821
$$ -1225 -317 1181 -290 -222 408 -1468 -922 876 -335 -926 -264 -1334 -737 1211 -366 -1502 319
1636C19l44l91K306q54k617J841J123j759J484K33l450J234K962k417l80J960
$$ 319 -25 -416 1890 1036 -1581 260 1383 -376 1108 1341 -2109 -875 2087 -330 -710 1250
1652A250k420q14L689l89k950J955N1k266K536J365l504M91J907k155M24K587
$$ 1250 -1170 -1984 1705 1316 -1634 321 372 -1894 642 2007 -1497 -1006 901 -1254 -830 1757
1668A757k223j387K488k32j342K188j61k033J376O48j313R91P25j952K78J175
$$ 1757 -466 -1853 635 403 -939 1249 1088 -945 431 1079 -234 757 1482 -470 -192 983
1684I83j226l2J039j295n07J027m89k36R69r53n89J403k63n40J415n69j219J648
$$ 983 -243 -275 764 -531 -1038 -11 -500 -736 233 -720 -1309 94 -169 -709 706 137 -1082 566
1702E66M44q35O85Q4j657J146J094j436j15Q38j312l46J959q28j486J287m08j105
$$ 566 1010 175 860 944 -713 433 1527 91 -24 814 -498 -844 1115 287 -1199 88 -320 -1425
1720a425K060k23j766Q91Q16j236Q51R81j670m8J723p40q13J460o95p38J422k15
$$ -1425 635 412 -1354 -463 353 -883 -32 949 -721 -769 954 214 -599 861 166 -572 850 635
1738F35j227J168r0r93P03O98j155R0P19o87j17R04p65n44R64l05o81N41j32n40
$$ 635 -592 576 486 -507 196 894 -261 -171 548 -139 -256 648 -117 -661 303 -2 -683 -142 -274 -814
1758h14P90J7p39K92L82j58K41L06k98J81L06j83J71M50n48j15M88m47k24J70
$$ -814 -24 -7 -746 -454 -72 -230 11 317 19 200 506 323 494 944 396 281 769 322 98 268
1778B68m15m34N83l35m02M68k65m17O73L12p50N72L49l01P5N56m85L5L47l02j22
$$ 268 -147 -581 2 -333 -735 -267 -532 -949 -276 36 -714 -142 207 -94 -19 537 52 87 434 132 10
1799A0O73n33j67K70K36p30K34M57o16J29K86l65L7N0l22K8P8J3k47K68Nj53N3
$$ 10 683 150 -17 253 489 -241 -7 450 -166 -37 249 -116 -79 -29 -351 -323 -245 -232 -479 -211 -206 -359 -306
1822c06M19j67o0L36k08K24J11j58M3J72k92l9J94j9j84O0J80k57O3qK76k64p
$$ -306 113 -54 -114 222 14 238 349 191 234 406 114 75 269 250 66 126 306 49 112 104 380 116 109
1845A09j32j79l9l16n3K71j45j16O0P3L28R1lL80O0M5J98K2M5l14N3m8l43L1J4
$$ 109 -23 -202 -241 -557 -610 -339 -484 -600 -540 -467 -139 -48 -51 329 389 434 632 654 699 385 438 390 47 78 92
1870I2o8l16N3R5n3rj32J83l3J64m25K25L0j72J24l4j2L05O5k35M36O1P6K02J35
$$ 92 24 -292 -239 -144 -197 -206 -338 -155 -188 -24 -449 -224 -194 -366 -242 -276 -288 17 82 -153 283 344 420 622 757
1895G57l06l5Q5j36m94Q0j34j75L5k28n8L56m5j07K91L53q4k61J64Nl0l7j91j63
$$ 757 451 416 501 365 -129 -49 -183 -358 -323 -551 -609 -253 -298 -405 -114 239 155 -106 58 63 33 -4 -195 -358
1919c58K42N3k69K20J66j49L05J64j81M15l0j83l04K34j30j00M0n32K9M02m38
$$ -358 -116 -63 -332 -112 54 -95 210 374 193 608 578 395 91 325 195 95 135 -397 -368 34 -404
1940d04k89N65m2m02M90J12l88M35J24m16J7M80j97j55L59j84o9O31k33k53N25
$$ -404 -693 -128 -170 -572 -82 30 -358 77 201 -215 -198 282 85 -70 289 105 36 667 434 181 706
1961G06j33l84M24l88k13Q0j42o02O1L63n90J22O53m14rL84l59L86P39o34j70
$$ 706 573 189 613 225 12 92 -50 -652 -591 -228 -818 -696 -43 -457 -466 -82 -441 -55 684 50 -120
1982a20O48k59j21M88m72p35Q62K74q83M96L38q67M12O31j110J90R84j088l49
$$ -120 528 269 148 636 164 -571 291 565 -318 178 516 -351 61 692 -418 -228 756 -332 -681
2001f81J223n55q21Q47l2q65P58K16j110P71J009j196N1J123p06l31R24p82m25
$$ -681 542 -13 -834 13 -19 -884 -126 90 -1020 -249 760 -436 -385 738 32 -299 625 -157 -582
2020e82J331j31q49N37L09j025P01L35p00O2J96q08L27O83p23k74L29n62M92P13
$$ -582 749 618 -231 306 615 -410 291 626 -74 -12 184 -624 -297 386 -337 -611 -282 -844 -352 361
2040C61q20k32O95j13m0R64m98j005J022J95o80J072k26j440P36R57j109N94L56
$$ 361 -459 -691 4 -109 -149 815 317 -688 334 529 -151 921 695 -745 -9 948 -161 433 789
2059G89j915M25J611r15p98J033m84q75J785o6j678R47O83j747J385R78j724N8
$$ 789 -1126 -701 910 -5 -803 230 -254 -1129 656 590 -1088 -141 542 -1205 180 1158 -566 -508
2077e08J280q45k58J439j046r30J794l23j194J151J59j339R89N63j711N65R66
$$ -508 772 -73 -331 1108 62 -868 926 603 -591 560 719 -620 369 932 -779 -214 752
2094G52j289L6O90p31k0R14n12o40R70m31m34J257k16r27Q24J96n78P52m9j049
$$ 752 -537 -501 189 -542 -562 352 -160 -800 170 -261 -695 562 346 -581 243 439 -139 613 564 -485
2114d85N32M16p17N62M38j010K37R00j151j92J021p28o01J383q10p87J299k85
$$ -485 47 463 -254 308 746 -264 -27 873 -278 -470 551 -177 -778 605 -205 -992 307 22
2132B2j207J451J43j664J195R24j274P2J244j151q8J724j150j032J547m94p52
$$ 22 -1185 266 409 -1255 -60 864 -410 -338 906 -245 -333 1391 241 -791 756 262 -490
2149d90J241Rj862Q08J150j211P5R73j578j67J800o50m95N68p66j54J054L06r66
$$ -490 751 760 -1102 -294 856 -355 -280 693 -885 -1052 748 98 -397 171 -595 -749 305 611 -355
2168c55K51J87m37N10O30o93k71N38n00L95M81r43p3M05k88K41N31n71m32P70
$$ -355 -104 83 -354 156 786 93 -178 360 -140 255 736 -207 -280 125 -163 78 609 38 -394 376
2188C76l41m23Q20n86o44O60L21q58O35L01j073M65Q54r32K64J115r69k76J220
$$ 376 35 -388 432 -154 -798 -138 183 -675 -40 261 -812 -347 507 -425 -161 954 -15 -291 929
2207I29n90p61J151j50j131P93N73j288L54O68j078J36Q18p47l48J062p95k79
$$ 929 339 -422 729 579 -552 241 814 -474 -120 548 -530 -394 424 -323 -671 391 -404 -683
2225f83R08l00n40N01Q4m71M75N00m63K47K06m18L13R9l04k8L71n64j12L58j64
$$ -683 225 -75 -615 -114 -30 -501 -26 474 11 258 464 46 359 458 154 126 497 -67 -179 179 15
2246A5j20J92k69K4L69k02m92L53J38m50N23J34o91K45J77l35K47L17l39J21M14
$$ 15 -105 87 -182 -158 211 9 -483 -130 8 -442 81 215 -476 -231 -54 -389 -142 175 -164 -43 371
2267C71k36r0O45l47m92N26Ql40L65j45o02K35J89k01o0K39n38J56J79r4j69N75
$$ 371 135 45 690 343 -149 377 385 45 410 265 -337 -102 87 -114 -174 65 -473 -317 -138 -232 -401 174
2289A74k31m28L27O5j05K13K36m46M18Q9j04N2M3j94N5K45j41k78J23j33J1R2
$$ 174 -57 -485 -158 -93 -198 15 251 -195 223 312 208 260 303 109 164 409 268 -10 113 -20 -9 83
2311H3j50m00K29j08N6K65o1q6o0M27k63L0Q4p6j21K04n1j7K45l96K12J87k3N0
$$ 83 -67 -467 -238 -346 -290 -25 -86 -172 -232 195 -68 -38 46 -30 -151 53 2 -15 230 -166 46 233 210 260
2335B60Jpj45Q6J43k60j91R6k06j08K46j04k7j25K65o6LJ4L9o8%J30j9rJ5R6l0
$$ 260 261 254 109 195 338 78 -113 -17 -223 -331 -85 -189 -216 -341 -76 -142 -139 -125 -86 -154 -154 -24 -43 -52 -37 59 29
2362B9J16J02no3Q2j8k03J0Q1q0j01J21j07j36N4l4j12o2J9J0J13J35j13l8J09
$$ 29 145 247 242 179 261 243 40 50 131 51 -50 71 -36 -172 -118 -152 -264 -326 -307 -297 -184 -49 -162 -200 -91
2387i1M4K6L4Q5j0Q2k6J07j23L4N3m7Q1k67K4P9p1J10j46j19j20N5O0j64J66k2
$$ -91 -47 -21 13 98 88 170 144 251 128 162 215 168 249 -18 6 85 14 124 -22 -141 -261 -206 -146 -310 -144 -166
2413a66r0L6Q0j17K89M3j20MK05k18K9K22j37m8L09j03m9P0r9k2j47J83k68K08
$$ -166 -256 -220 -140 -257 32 75 -45 -41 164 -54 -25 197 60 12 321 218 169 239 140 118 -29 154 -114 94
2437I4j10l34L56J64l83k5J78r3n3K16l24J21J80M0j25J45M8k60L48J74l30j4
$$ 94 -16 -350 6 170 -213 -238 -60 -153 -206 10 -314 -193 -13 27 -98 47 95 -165 183 357 27 13
2459A3P5j89K94Q2p0Jl5k09m9N1k16jl2J15k26M12k44j30L73l2j86K03R1m95L52
$$ 13 88 -101 193 275 205 206 171 -38 -87 -36 -252 -253 -285 -170 -396 16 -228 -358 15 -17 -203 0 91 -404 -52
2484e2M62k47k93L89r9k78N92l20l11N96l83j93L95J11o09J72J94l58R9J81n58
$$ -52 410 163 -130 259 160 -118 474 154 -157 439 56 -137 258 369 -240 -68 126 -232 -133 48 -510
2505e10K78L73m67J84L65m92J16K99L2l29L88j63o9K52jk82n0L61m01M40rn24
$$ -510 -232 141 -326 -142 223 -269 -153 146 178 -151 237 74 5 257 256 -26 -76 285 -116 324 315 -209
2527b09K46R3l06J53J67m01j04M63o11K7O26l92j48N49o2o71Q37K26o80K45M19
$$ -209 37 130 -176 -23 144 -257 -361 102 -509 -482 144 -248 -396 153 91 -580 257 483 -197 48 467
2548D67p27N12M19n89k42O97n92q0P94n97o38M76K71m86M32R8r54K29Q31n92J13
$$ 467 -260 252 671 82 -160 537 -55 -135 659 62 -576 -100 171 -315 117 215 -739 -510 321 -271 -158
2569a58L82p03j8Q04k82k24L33N4o53O67K32n15K01P7l46L80J57m66j2L97m58
$$ -158 224 -479 -497 307 25 -199 134 188 -465 202 434 -81 120 197 -149 231 388 -78 -90 307 -151
2590a51J4M20l90k11L90r6l07O09l80l51N15o7m39N65m3n40M44M85q55N09M63
$$ -151 -137 283 -107 -318 72 -24 -331 278 -102 -453 62 -5 -444 121 78 -462 -18 467 -388 121 584
2611E84q75M46M76n99j66Q31n12m39P97m60n70O97l0q24P24K3q20N43N60q56l4
$$ 584 -291 155 631 32 -134 697 185 -254 543 83 -487 210 180 -644 80 103 -717 -174 386 -470 -504
2632e04O29k32k85P64l77o08P13L63p68O87P8q28N22M61o10J99M28p43k04O36
$$ -504 125 -107 -392 372 -5 -613 100 463 -305 382 460 -368 154 615 5 204 632 -111 -315 321
2652C21k42j64K32l66j88M00n7k97L30Ln27M95L3k89J98K36m48L04M35o23L27
$$ 321 79 -85 147 -219 -407 -7 -64 -361 -31 -28 -555 -60 -27 -316 -118 118 -330 -26 409 -214 113
2673A13J20l96K58N42n03l51O28k84m49Q16l42n66O58j15p31Q17Q7p71J47N06
$$ 113 233 -163 95 637 134 -217 411 127 -322 494 152 -414 244 129 -602 215 302 -469 -322 184
2693A84o00L8Q15o51k84P33k65l30O60On60K74L09o59L13N85n63r6L94k69k49
$$ 184 -416 -378 437 -214 -498 235 -30 -360 300 306 -254 20 329 -330 -17 568 5 -91 303 34 -215
2714b15O64m34l25M51j64k48J64J10k73P8J5j66K14L34m23O2K53k03J35J71j95
$$ -215 449 15 -310 141 -23 -271 -107 3 -270 -192 -177 -343 -129 205 -218 -156 97 -106 29 200 5
2735EO7K66k47r8L43r9l27K56j09K3N7Q7m46K79K6l39K45K07n85J43J92j98J30
$$ 5 72 338 91 -7 336 237 -90 166 57 80 137 224 -222 57 83 -256 -11 196 -389 -246 -54 -252 -122
2758a22J19k66n5M84j82k52L52R8n07N27J76l18L5K31r0k25M03l60j51K23k16
$$ -122 -3 -269 -324 160 -22 -274 78 176 -331 196 372 54 89 320 230 5 408 48 -103 120 -96
2779i6j03J67o7n5L0K57k61OQ5j39O3J46k20J13l3K6KK81k39K78M2p3j95J61R6
$$ -96 -199 -32 -99 -154 -124 133 -128 -122 -37 -176 -113 33 -187 -74 -107 -81 -79 202 -37 241 283 210 15 176 272
2804B72j46j74L18k39P9K7l33M7j22Q5N7j08M5o0J45l9l0J14kn3K07k36J20J96
$$ 272 126 -48 270 31 110 137 -196 -149 -271 -186 -129 -237 -192 -252 -107 -146 -176 -62 -64 -117 90 -146 -26 170
2828A70r1n2r2K42j95J04J25j21j9J0J05m5j62P7j37j1N3j11o2J1j24K13p5L1
$$ 170 79 27 -65 177 -18 86 211 90 71 81 186 141 -21 56 -81 -92 -39 -150 -212 -201 -325 -112 -187 -156
2852a56J27j77J64j32K13J25j07J3K1k15K26L6j09Q0k3K40j44kj36J98P4l70J24
$$ -156 -29 -206 -42 -174 39 164 57 70 91 -124 102 138 29 109 86 326 182 180 44 242 316 -54 70
2875G0k24m1J8J65k66P6J58o5j09K39q3q4J54k8l1J64Q3j98J76q6J84j91J03j79
$$ 70 -154 -195 -177 -12 -278 -202 -44 -109 -218 21 -62 -146 8 -20 -51 113 196 -2 174 88 272 81 184 5
2899EN6J7n4J67p8k6n1K6k6j86k9J1M3j7j37J69J5r9Q5J01J49j28mJ48p9N1J42
$$ 5 61 78 24 191 113 87 36 62 36 -150 -179 -168 -125 -142 -279 -110 -95 -194 -109 -8 141 13 9 157 78 129 271
2926B71k67J30j9M3j12Mr7Q1L5l8k2j0j17O2rJj7j4Jr2Q4n9j06K21n0P0K25j41
$$ 271 4 134 115 158 46 50 -47 34 69 31 9 -1 -118 -56 -65 -64 -81 -95 -94 -186 -102 -161 -267 -46 -96 -26 199 58
2954E8R5q5J22k7kO4q7k8n4J48k33J6K8L9j49n7Ml4J28m0k5p8J78k25J51J02q8
$$ 58 153 68 190 163 161 225 138 110 56 204 -29 -13 15 54 -95 -152 -148 -182 -54 -94 -119 -197 -19 -244 -93 9 -79
2981g9R3K9l1j82M00p5p1L9o5N4J62k1j96J99o6j80n8N7j02n4Q3R0k74J74K8k83
$$ -79 14 43 12 -170 230 155 84 123 58 112 274 253 57 256 190 10 -48 9 -93 -147 -64 26 -248 -74 -46 -329
3007c29L86p3k19K57k9j22K30m4j95R6Q0K4J54j72p5J19J80j95q6M88m44j25K61
$$ -329 57 -16 -235 22 -7 -129 101 57 -138 -42 38 62 216 44 -31 88 268 73 -13 475 31 -94 167
3030A67j47k57K25p2j72L75m6m69K70J92l81R8N76m61J0O10l79j64K20J69l07
$$ 167 20 -237 -12 -84 -256 119 73 -396 -126 66 -315 -217 359 -102 -92 518 139 -25 195 364 57
3051E7L2J82l15J10M20o97K15J62o4l19L68k50j50K64j36o6J10p1j48K96Q6k10
$$ 57 89 271 -44 66 486 -211 4 166 102 -217 151 -99 -249 15 -121 -187 -77 -148 -296 0 86 -124
3073a24R9J98k69K8J69j24J47J15j73N0P7n8k44L30j33k7J41k70L4L03k71l12
$$ -124 -25 173 -96 -68 101 -23 124 239 66 116 193 135 -109 221 88 61 202 -68 -34 269 -2 -314
3095c14M74k74k91K71K30m35J58L68m08j14N83o08P7P50l59k23N36k18m09L38
$$ -314 160 -114 -405 -134 96 -339 -181 187 -221 -335 248 -360 -283 467 108 -115 421 203 -206 132
3115A32L87o29J46L04m56pN80l72l45L28j71j04M71j47m88K76O0j85N3J31l56
$$ 132 519 -110 36 340 -116 -123 457 85 -260 68 -103 -207 264 117 -371 -95 -35 -220 -167 -36 -392
3136c92J94L85m06L28K58k49p5K53l19R3L26k92k11K24j06J00Kj59k06K76n1j80
$$ -392 -198 187 -219 109 367 118 43 296 -23 70 396 104 -107 117 11 111 113 -46 -252 24 -27 -207
3158b07K47M8m13L65j19o5K12l5k27j64N75l12J35J83m1l71L68J16l12J44J08
$$ -207 40 88 -325 40 -79 -144 68 33 -194 -358 217 -95 40 223 182 -189 179 295 -17 127 235
3179B35m21K07M59p08J44L16l32k5K90l06m33M78J71l65L92J0n40J97L91k61j7
$$ 235 -186 21 480 -228 -84 232 -100 -125 165 -141 -574 -96 75 -290 102 112 -428 -231 160 -101 -118
3200a18K91l63R0N07k32j63L08j83j01K05n0k69J40J53m13K47j4j85JK49m46K00
$$ -118 173 -190 -100 407 175 12 320 137 36 241 191 -78 62 215 -198 49 35 -150 -149 100 -346 -146
3222a46Q1j65P8L3k6O3Q9p1m8L07k17p0M60k84k44M67j36k31M04j06j80n1K59
$$ -146 -65 -230 -152 -119 -145 -82 7 -64 -112 195 -22 -92 368 84 -160 307 171 -60 344 238 58 7 266
3245B66l34n7L72k64l17M30j12l43M89k56j16P6J98j54N9J06j53LJ15j52Q2K35
$$ 266 -68 -125 247 -17 -334 96 -16 -359 130 -126 -242 -166 32 -122 -63 43 -110 -107 8 -144 -62 173
3267A73J05k69J32R5j65P2J99k92J31r0j51J27J01k72p7J17M6j54K57n0k89K17
$$ 173 278 9 141 236 71 143 342 50 181 91 -60 67 168 -104 -181 -64 -18 -172 85 35 -254 -37
3289c7l2KP2Rl14L22n8J5K12q3MN8j5K09j96J57k51L4N9r1j66K09k36j17L55j82
$$ -37 -69 -67 5 14 -300 22 -36 -21 191 108 112 170 155 364 168 325 74 108 167 76 -90 119 -117 -234 121 -61
3315f1j66r8N6J2J36J2r3oJ08j12K24K60j50n7L6R8j08J4J24j86K12q9m4p4N1
$$ -61 -227 -325 -269 -257 -121 -109 -202 -208 -100 -212 12 272 122 65 101 199 91 105 229 43 255 166 122 48 99
3340I9l02R4K44k49J37j2m5q2k6Q3kk32mJ73R5QR6n9M3J14j27J41o1l4jLK6l9
$$ 99 -203 -109 135 -114 23 11 -34 -116 -142 -59 -61 -293 -297 -124 -29 -21 75 16 59 173 46 187 126 92 91 94 120 81
3368H1L1r4J84o3j85J5N3K0j00K1p6R4q6n1QJ28k23J85P6j04J99l5q2R5K8l8J42
$$ 81 112 18 202 139 -46 -31 22 42 -58 -37 -113 -19 -105 -156 -148 -20 -243 -58 18 -86 113 78 -4 91 119 81 223
3395B23p7p1N6Nj70j04K84j22q6L2m9np9Q7p7K40j57r0N3R9m2n1K1R2j94J33K41
$$ 223 146 75 131 136 -34 -138 146 24 -62 -30 -79 -84 -163 -76 -153 87 -70 -160 -107 -8 -50 -101 -80 12 -182 -49 192
3422A92j51O9j11K25j10o8k3J06nj35j3P0k8o1o8J8l7l5Q7o6L9N7q8j8J46L7r0
$$ 192 41 110 -1 224 114 46 23 129 124 -11 -24 46 18 -43 -111 -93 -130 -165 -78 -144 -105 -48 -136 -154 -8 29 -61
3449f1J37k8j45O3K64l1j46KK9O4K0j59J36n8p3j01J36o6J24l2m9p0k00K1J64
$$ -61 76 48 -97 -34 230 199 53 55 84 148 168 9 145 87 14 -87 49 -17 107 75 26 -44 -244 -223 -59
3474e9l6j04R2K5R9j98P8J29k74J83K58k03RJ21l9M5J30j64n8J55j08K8Op1j6
$$ -59 -95 -199 -107 -82 17 -181 -103 26 -248 -65 193 -10 -1 120 81 126 256 92 34 189 81 109 115 44 28
3499B8n8n6j01J81q2RQm3M9k1L6j67K82j6q4K6K79j17j78J63m4j77K52L4k18L7
$$ 28 -30 -86 -187 -6 -88 -79 -71 -114 -65 -86 -50 -217 65 49 -35 -9 270 153 -25 138 94 -83 169 203 -15 22
3525B2P7k17NJ69j53l9R9k1P6m8o6o0P8L9q7J4J21l35L05N8o4m3K51o4k21J98
$$ 22 99 -118 -113 56 -97 -136 -37 -58 18 -30 -96 -156 -78 -39 -126 -112 9 -326 -21 37 -27 -70 181 117 -104 94
3551I4Rr9J97q2j91J30j25l7L2K53k59o2J17k6N4J03k81O7J38j53J43K6j56l1
$$ 94 103 4 201 119 -72 58 -67 -104 -72 181 -78 -140 -23 -49 5 108 -173 -106 32 -121 22 48 -108 -139
3575a39L06r6k6J15J8j23P6J03k56J75k64J0J90R9l40J93J39m04J77M4k47m3J23
$$ -139 167 71 45 160 178 55 131 234 -22 153 -111 -101 89 188 -152 41 180 -224 -47 -3 -250 -293 -170
3598a70k5p6K51l5k95K64K54k25J0K18m07K65J82j65j08M27k21j96J89Rk25J24
$$ -170 -195 -271 -20 -55 -350 -86 168 -57 -47 171 -236 29 211 46 -62 365 144 -52 137 146 -79 45
3620D5J68j98O5k5l12K68o0r3J04ll59K83J17k06P2J40q1o1J45P2p2J75m8j59
$$ 45 213 15 80 55 -257 11 -49 -142 -38 -41 -400 -117 0 -206 -134 6 -75 -136 9 81 9 184 136 -23
3644b3J77j17k39L13K2k45J24J37k76J53Q4k03M8ln5k42L45k16n9K49n4j80J72
$$ -23 154 37 -202 111 133 -112 12 149 -127 26 110 -93 -45 -48 -103 -345 0 -216 -275 -26 -80 -260 -88
3667h8K71k04J22Q5k85OL70j75j40L75k47l07L95M7k44K41k19j07R7J74k82R0
$$ -88 183 -21 101 186 -99 -93 277 102 -38 337 90 -217 178 225 -19 222 3 -104 -7 167 -115 -25
$$ [...]
8191E5
##END NTUPLES=NMR FID
##END=
