##TITLE=1H_DPAA0812-2
 CDCl3
 8 sc, 
 9.12.2021
##JCAMPDX= 6.0         $$ Bruker NMR JCAMP-DX V2.0
##DATA TYPE= NMR FID
##DATA CLASS= NTUPLES
##ORIGIN= UXNMR, Bruker Analytische Messtechnik GmbH
##OWNER= root
$$ XWIN-NMR		Version 3.5
$$ Thu Dec  9 11:38:07 2021 Russian Standard Time (UT+4h)  she@DPX200
##.OBSERVE FREQUENCY= 200.131346
##.OBSERVE NUCLEUS= ^1H
##.DELAY= (6, 6)
##.ACQUISITION MODE= SIMULTANEOUS
##.ACQUISITION SCHEME= undefined
##.AVERAGES= 8
##.DIGITISER RES= 18
##SPECTROMETER/DATA SYSTEM= spect
##.PULSE SEQUENCE= zg30
##.SOLVENT NAME= CDCl3
##.SHIFT REFERENCE= (INTERNAL, CDCl3, 0, 15.7039)
##AUDIT TRAIL= $$ (NUMBER, WHEN, WHO, WHERE, WHAT)
$$ ##TITLE= Audit trail, XWIN-NMR		Version 3.5
$$ ##JCAMPDX= 5.01
$$ ##ORIGIN= Bruker BioSpin GmbH
$$ ##OWNER= she
$$ F:/spectra/data/she/nmr/H-F/1/audita.txt
$$ ##AUDIT TRAIL=  $$ (NUMBER, WHEN, WHO, WHERE, WHAT)
(   1,<2021-12-09 11:36:33.75 +0400>,<she>,<DPX200>,
      <created by zg, POWCHK disabled, PULCHK disabled
       configuration hash MD5:
       00 E9 B6 7A A2 85 ED C7 34 08 36 98 17 FE 4E 26
       data hash MD5: 16K
       EC 96 E8 86 3E 5F 63 07 01 C2 F9 6C DB 1D 53 4C>)
$$ ##END=
$$ 
$$ hash MD5
$$ A1 81 4C 93 CC BD C7 BE 7A 74 8A F9 BD 92 76 85
##$RELAX= 
##$RELAX= 
##$RELAX= 
##$RELAX= 
##$RELAX= 
##$RELAX= 
$$ Bruker specific parameters
$$ --------------------------
##$DU= <F:/spectra>
##$EXPNO= 1
##$NAME= <H-F>
##$PROCNO= 1
##$TYPE= <nmr>
##$USER= <she>
##$AMP= (0..31)
100 100 100 100 100 100 100 100 100 100 100 100 100 100 100 100 100 100 
100 100 100 100 100 100 100 100 100 100 100 100 100 100 
##$AQSEQ= 0
##$AQ_mod= 1
##$AUNM= <au_zg>
##$AUTOPOS= <>
##$BF1= 200.13
##$BF2= 200.13
##$BF3= 200.13
##$BF4= 200.13
##$BF5= 200.13
##$BF6= 200.13
##$BF7= 200.13
##$BF8= 200.13
##$BYTORDA= 1
##$CFDGTYP= 0
##$CFRGTYP= 5
##$CHEMSTR= <none>
##$CNST= (0..31)
1 1 145 1 1 1 1 1 1 1 1 1 1 1 1 1 1 1 1 1 1 1 1 1 1 1 1 1 1 1 1 1 
##$CPDPRG= <>
##$CPDPRG1= <>
##$CPDPRG2= <>
##$CPDPRG3= <>
##$CPDPRG4= <mlev>
##$CPDPRG5= <mlev>
##$CPDPRG6= <mlev>
##$CPDPRG7= <mlev>
##$CPDPRG8= <mlev>
##$CPDPRGB= <>
##$CPDPRGT= <>
##$D= (0..31)
0 1.2 0 0 0 0 0 0 0 0.06 0 0.03 0 0 0 0 0.0002 0 0 0 0 0 0 0 0 0 0 0 0 
0 0 0 
##$DATE= 1639035393
##$DBL= (0..7)
120 120 120 120 120 120 120 120 
##$DBP= (0..7)
150 150 150 150 150 150 150 150 
##$DBP07= 0
##$DBPNAM0= <>
##$DBPNAM1= <>
##$DBPNAM2= <>
##$DBPNAM3= <>
##$DBPNAM4= <>
##$DBPNAM5= <>
##$DBPNAM6= <>
##$DBPNAM7= <>
##$DBPOAL= (0..7)
0.5 0.5 0.5 0.5 0.5 0.5 0.5 0.5 
##$DBPOFFS= (0..7)
0 0 0 0 0 0 0 0 
##$DE= 6
##$DECBNUC= <off>
##$DECIM= 32
##$DECNUC= <off>
##$DECSTAT= 4
##$DIGMOD= 1
##$DIGTYP= 9
##$DL= (0..7)
0 120 120 120 120 120 120 120 
##$DP= (0..7)
150 150 150 150 150 150 150 150 
##$DP07= 0
##$DPNAME0= <>
##$DPNAME1= <>
##$DPNAME2= <>
##$DPNAME3= <>
##$DPNAME4= <>
##$DPNAME5= <>
##$DPNAME6= <>
##$DPNAME7= <>
##$DPOAL= (0..7)
0.5 0.5 0.5 0.5 0.5 0.5 0.5 0.5 
##$DPOFFS= (0..7)
0 0 0 0 0 0 0 0 
##$DQDMODE= 0
##$DR= 18
##$DS= 0
##$DSLIST= <SSSSSSSSSSSSSSS>
$$ [...]
##$SUBNAM2= <"">
##$SUBNAM3= <"">
##$SUBNAM4= <"">
##$SUBNAM5= <"">
##$SUBNAM6= <"">
##$SUBNAM7= <"">
##$SUBNAM8= <"">
##$SUBNAM9= <"">
##$SW= 18.0517287032376
##$SWIBOX= (0..15)
0 0 2 0 0 0 0 0 0 0 0 0 0 0 0 0 
##$SW_h= 3612.71676300578
##$TD= 16384
##$TD0= 1
##$TE= 0
##$TE2= 300
##$TE3= 300
##$TEG= 300
##$TL= (0..7)
0 120 120 120 120 120 120 120 
##$TP= (0..7)
150 150 150 150 150 150 150 150 
##$TP07= 0
##$TPNAME0= <>
##$TPNAME1= <>
##$TPNAME2= <>
##$TPNAME3= <>
##$TPNAME4= <>
##$TPNAME5= <>
##$TPNAME6= <>
##$TPNAME7= <>
##$TPOAL= (0..7)
0.5 0.5 0.5 0.5 0.5 0.5 0.5 0.5 
##$TPOFFS= (0..7)
0 0 0 0 0 0 0 0 
##$TUNHIN= 0
##$TUNHOUT= 0
##$TUNXOUT= 0
##$USERA1= <user>
##$USERA2= <user>
##$USERA3= <user>
##$USERA4= <user>
##$USERA5= <user>
##$V9= 5
##$VALIST= <valist>
##$VCLIST= <CCCCCCCCCCCCCCC>
##$VD= 0
##$VDLIST= <DDDDDDDDDDDDDDD>
##$VPLIST= <PPPPPPPPPPPPPPP>
##$VTLIST= <TTTTTTTTTTTTTTT>
##$WBST= 1024
##$WBSW= 4
##$XGAIN= (0..3)
0 0 0 0 
##$XL= 0
##$YL= 0
##$YMAX_a= 330386
##$YMIN_a= -346665
##$ZGOPTNS= <>
##$ZL1= 120
##$ZL2= 120
##$ZL3= 120
##$ZL4= 120
##$ABSF1= 10
##$ABSF2= 0
##$ABSG= 5
##$ABSL= 3
##$ALPHA= 0
##$AQORDER= 0
##$ASSFAC= 0
##$ASSFACI= 0
##$ASSFACX= 0
##$ASSWID= 0
##$AUNMP= <proc_1d>
##$AZFE= 0.1
##$AZFW= 0.1
##$BCFW= 1
##$BC_mod= 2
##$BYTORDP= 1
##$COROFFS= 0
##$CY= 11.3945322036743
##$DATMOD= 1
##$DC= 2
##$DFILT= <>
##$DTYPP= 0
##$F1P= 2.36226072786647
##$F2P= -0.459571619588291
##$FCOR= 0.5
##$FTSIZE= 0
##$FT_mod= 4
##$GAMMA= 1
##$GB= 0.15
##$INTBC= 1
##$INTSCL= 1
##$ISEN= 128
##$LB= 0.24
##$LEV0= 0
##$LPBIN= 0
##$MAXI= 10000
##$MC2= 0
##$MEAN= 0
##$ME_mod= 0
##$MI= 1.114404
##$NCOEF= 0
##$NC_proc= 0
##$NLEV= 6
##$NOISF1= 3.799351
##$NOISF2= 2.8
##$NSP= 1
##$NTH_PI= 0
##$NZP= 0
##$OFFSET= 15.70392
##$PC= 1
##$PHC0= -15513.17
##$PHC1= 14.0008
##$PH_mod= 1
##$PKNL= yes
##$PPARMOD= 0
##$PSCAL= 0
##$PSIGN= 0
##$REVERSE= no
##$SF= 200.130013532006
##$SI= 16384
##$SIGF1= 3
##$SIGF2= 2
##$SINO= 400
##$SIOLD= 16384
##$SREGLST= <1H.CDCl3>
##$SSB= 0
##$STSI= 0
##$STSR= 0
##$SW_p= 3612.71676300578
##$SYMM= 0
##$S_DEV= 0
##$TDeff= 0
##$TDoff= 0
##$TI= <>
##$TILT= no
##$TM1= 0
##$TM2= 0
##$TOPLEV= 0
##$USERP1= <user>
##$USERP2= <user>
##$USERP3= <user>
##$USERP4= <user>
##$USERP5= <user>
##$WDW= 1
##$XDIM= 8192
##$YMAX_p= 0
##$YMIN_p= 0
$$ End of Bruker specific parameters
$$ ---------------------------------
##NTUPLES= NMR FID
##VAR_NAME=  TIME,          FID/REAL,        FID/IMAG
##SYMBOL=    X,             R,               I
##VAR_TYPE=  INDEPENDENT,   DEPENDENT,       DEPENDENT
##VAR_FORM=  AFFN,          ASDF,            ASDF
##VAR_DIM=   8192,          8192,            8192
##UNITS=     SECONDS,       ARBITRARY UNITS, ARBITRARY UNITS
##FACTOR=    0.0002768,     1,               1
##FIRST=     0,             0,               0
##LAST=      2.2672688,     0,               0
##MIN=       0,             -346665,         0
##MAX=       2.2672688,     330386,          0
$$ Real data points
##PAGE= N=1
##DATA TABLE= (X++(R..R)), XYDATA
$$ [...]
2071C881l751P0K209m457J145O390l856l512L252j182p20M798k679m932L630N27
2087H13l374K703O63m767J392L261k651R82K766m108J5N043k436j432L552k546
2103a24j160M510j930k747L501n58l243K504J112l101K367J208m195J623K706
2118B473l981J69K777m372K85M451l146j085L941k689j452M780r80l628L212L86
2134A141k949M406R68o010K067L203m283J689L285n608m74N633k542j610L986
2149B902l087l622N349K40m913K875R72m627L310L337n343P54L453l159O76L898
2165C015l369j000L833r83j790K505j340k860L259P55l051J103O36k267K311J063
2181A820l375J046Q83k458J719J086k590K19K156j700J18K722k311j589L835l82
$$ y = [3881, 130, 200, 2409, -2048, -903, 5487, 1631, -1881, 1371, 189, -531, 4267, 1588, -3344, 286, 813, -2561, 142, 805, -3962, -2570, 691, -1960, -978, 1788, -2320, -2305, 2738, 302, -1130, 2422, -124, -1284, 3226, 1296, -1451, 2050, 1492, -1751, 753, 1865, -1236, 1131, 2339, -1856, -233, 2473, -1508, -1339, 1438, -2934, -2649, 1802, -1344, -2429, 1512, -1177, -2629, 2151, 1171, -2457, 755, 1141, -1808, 2598, 3566, -2444, -377, 2826, -1457, 232, 3517, -2091, -2565, 3068, 526, -1084, 2902, -185, -3807, 1542, 1782, -3131, -256, 716, -3911, -601, 2736, -2607, -1853, 1600, -1559, -883, 3015, -354, -1354, 2479, 1496, -294, 2211, 871, -1989, 1270, 2025, -1026, 77, 713, -1554, 757, 1820, -1555, -509, 374, -2084, -365, 721, -1869, -1650, 506, -1194, -1076, 1646, -665, -2254, 1581, 1199]
2197A199k072K948r15k682L602L94m176K063J148l382J826K191l385KL058k267
2213d48j260L616j533k925L225p6k679K747j49l269K184J503k648R77J881j897
2229g51J53K655j472o16K071j164j646K247m76j782J600n58j274J615N8j625R30
2246c5O31j380M41N89j402M19J055j579j59J765j157o38J801o80j27J690o53m42
2264A39J470Lj148R98J19j425N64O2j436M66J018j882n32J727r46l74J451o95
2282d21q27J471n45n88J046l15j134J097M85r97O96J064j239N27J628r27m00J044
2300A665p09n41P81o79r23O98o56p10L82J29r72J62O88m86K96P20m33K3Q70k12
2320I3O4K42l34J35L51J11r6J89M6j02J72k6l06J41k52o73K91l0q26J32J28r77
$$ y = [1199, -873, 2075, 1160, -1522, 2080, 2474, -1702, 361, 1509, -1873, -47, 2144, -1241, -1239, 1819, -448, -1708, 1908, 375, -2550, 675, 599, -2080, 667, 518, -2751, -567, 936, -1712, -735, 1146, -751, -598, 2057, 585, -31, 2040, 876, -770, 1477, 1001, -781, 819, 261, -1013, 602, 660, -965, -35, 596, -784, -343, 246, -1156, -737, 318, -1261, -1420, 345, -812, -1450, 351, -329, -456, 1234, 581, 139, 1609, 1612, 464, 1462, 1581, 156, 720, 782, -654, -188, 830, -1052, -1584, 143, -803, -1177, 274, -421, -1248, 223, -322, -910, 136, -179, -1313, -216, 269, -728, -32, 1032, -207, 320, 1948, 1021, 621, 1665, 956, 415, 1196, 517, -406, 292, -364, -1074, -692, -563, -1535, -1373, -685, -1171, -875, -155, -588, -565, 305, 93, 157, 399, 65, 200, 551, 662, 566, 755, 801, 699, 871, 845, 539, 680, 428, -245, 46, 16, -810, -678, -550, -1527]
2342a527L71L07k04K32K10j19K96O32O9p9J42J29j04M39J04n18L15J15n11M69
2362G68Q5o63j10J78k08nk48k64N3n9rl52K22J0l24L01M49m61M01K50k16N3L69
2385B20L35k4l28K93M61j96J01k88K97P8l50k66J2m03r6k91j78J30k97l33K40
2406h83k05K72J37K52k03L53N79J00j15N46j03m23N58l58l35O09j87o54O07l5
2426E12l05Q0m6k91r2N00o03m17N91n32n67O27m66l10J127m70k69J142J01l32
2446b0O04L52m70l5N89o35j48O99q44k31J080n60n21R09r43l32R83j98q88N55
2466e4k18n41K98M14r81k81O04k25M10R13q15O0J212k96J73P52p92l47R74j75
2486A085m88K57o96p22O93K84j305L18L57j108J153Q79j742j5J116j118L98J131
$$ y = [-1527, -1156, -849, -1053, -821, -611, -730, -434, 198, 267, 188, 330, 459, 355, 794, 898, 380, 695, 810, 299, 768, 853, 190, 80, 258, 50, 45, -203, -467, -414, -473, -482, -834, -612, -602, -926, -625, -176, -637, -236, 14, -202, -149, 220, 555, 531, 203, 496, 957, 761, 862, 574, 871, 949, 599, 333, 345, -58, -154, -445, -623, -493, -790, -1123, -883, -1088, -816, -679, -427, -630, -277, 302, 402, 287, 833, 730, 307, 865, 507, 172, 781, 594, -60, 547, 512, 207, 287, 241, -50, -142, 358, -245, -662, -71, -603, -1170, -543, -1009, -1319, -192, -662, -931, 211, 312, -20, 584, 936, 466, 431, 1020, 385, 237, 936, 92, -139, 941, 381, -140, 769, -174, -506, 477, 279, -609, -54, -272, -813, -515, -101, -1082, -1363, -759, -984, -574, 339, -476, -416, 796, 500, 673, 1425, 633, 286, 1260, 1085, 597, 854, 158, -564, 129, 413, -892, -574, -217, -1325, -172, 707, -1035, -1050, 66, -1052, -654, 477]
2504D77j199m11J627m33o91J831m15j736J814P12j780J159L84k061Q97J513k157
2521d69k91J626j613l75J704j018r15J881n62j381J603P19k003R02N69j460R93
2538i0R70j833N24J381j365M9J439q12m53J084o96l63J728o14j765J013K27r36
2556e12J296n68j960J556Q43j570Q34P64k165M26J642j328K28J209j883k81K771
2573A302o08j737J837o93j007K873j49k729J747J103k447J078J270k662K59J559
2589I96k227OK392j952j545K808o51j569K051o34j759K736M31k760J554J535j913
2606e01P03J353j897M78K117k065o62K489j204j623K005p83j621J640l84j849
2622a804J858L26k057O39R35q05P70O93j916M47K176j326l85J407r32m98J910
$$ y = [477, -722, -1133, 494, 61, -630, 1201, 786, -950, 864, 1576, -204, 955, 1339, -722, 175, 1688, -469, -760, 866, -747, -1122, 582, -436, -1351, 530, -32, -1413, 190, 909, -1094, -192, 377, -1083, -90, 880, -953, -429, 952, -413, -364, 1075, 263, -190, 894, 198, -165, 1563, 949, -816, 197, 424, -512, 784, 216, -1744, -188, 655, -915, -81, 683, -1482, -1056, 586, -742, -514, 695, -1188, -1469, 1302, 694, -1043, 794, 101, -906, 1967, 1818, -911, 836, 1939, -508, 570, 1840, -822, -563, 996, -1231, -1225, 1167, -785, -2330, 478, -173, -1742, 309, -325, -2084, 652, 1083, -1677, -123, 1412, -501, 202, 1555, -342, 136, 2253, 188, -474, 2015, 811, -812, 1193, 410, -1211, 429, 45, -1804, 54, 380, -1677, -1038, -103, -908, -138, 555, -1361, -914, 1262, -64, -449, 958, 26, -472, 1438]
2639A438j053o24J963j477j274K456j67j601J311n70j732K120P28k857L94J524
2655E79k097J87K266k510k82K604j776p57L165j060k027K242Q70j950J627P99
2671A880k810J440K256k573n97K282j967n98K158j538r94J652o24j692J761K89
2687C25j997R01O46j231J048R44j710M34J551j152K33J157j258M22J154j466K60
2704B61J302q52n40Q83p85p03J166q49j227J367k0j932J268P78j643R18Q85j621
2722a344Q31J438j508j64J709q32l81J327p18j303J786Q3j843J521P12j697P76
2739C93Q84j632N61O83j330R1R74j034o98J050k91j088J160j63j220J400M36j226
2757a050J031Q68q15N58K63q45K44P05o98q3N10l64m28Q15k92o66O85n74m08R41
$$ y = [1438, 385, -239, 1724, 247, -1027, 1429, 1262, -339, 972, 402, -1330, 790, 1518, -1339, -945, 579, -1518, -1331, 935, -1575, -1857, 747, -1029, -1786, 1379, 319, -1708, 534, 1404, -546, 1081, 1880, -930, 510, 2766, 193, -404, 1878, -89, -687, 1471, -67, -1061, 591, -33, -1725, 36, 325, -1672, -771, -125, -1356, -308, 636, -1074, -640, 911, -241, -8, 1149, -109, 313, 1467, 1, 261, 1563, 711, 171, 1054, 269, -434, 732, -117, -1344, 23, 3, -1929, -661, 117, -1526, -608, 277, -1344, -513, 925, -583, -747, 962, 130, -251, 1076, 358, -945, 841, 924, -919, 602, 1314, -383, 393, 1277, -355, 206, 889, -441, -350, 624, -410, -1108, -58, -349, -1437, -277, -440, -1660, -260, 176, -1050, -19, 849, 34, 592, 855, 10, 254, 959, 261, 178, 688, 324, -104, 711, 419, -247, 438, -136, -544, 397]
2777C97j16p38J88J8n66N59L3j007K05L62j6L04O88m03J4R06L8n4N37n60m86P98
2799A101k80p51L20l96q84P60j21m86J70K97n30N31N53m82l37O20l70m32O03j84
2819b98l69N66J75l96M42L16k23J70L95k59N2L06l74j90K45l24n23J23k96j15
2839e77K47j96j64K25J58O1rJJ73J7K6j94K42J33k26o9K82k6R7j4m4J88J57k5
2863D63n7L25j77j03j68k67j82k51K87m29l1K84k39p4J71j6J01J05r7K53K40M9
2885A87p0J29j00K19p1pj65K7M62k42k8K80l90K0J47n63J04j6k30j27k9L9j14
2908e38o2MJ0J35K27j96K38M18k05K07M12l12O0J83k69l0K45j75n0K7pk31R8M2
2932B31o65L44l1n23K90J24l83K75K6k86M1J53J66L3R8M2K07K60p9M0K95j29m39
$$ y = [397, 281, -457, -269, -251, -817, -258, -225, -1232, -1027, -665, -681, -377, 311, -92, -78, 828, 866, 812, 1349, 789, 303, 1101, 821, 70, 390, -6, -890, -130, -251, -737, -567, -270, -800, -269, 284, -198, -535, 85, -285, -717, -114, -298, -667, -101, 74, -322, 120, 436, 213, 383, 778, 519, 571, 877, 503, 313, 558, 234, -289, -166, -462, -577, -330, -526, -690, -465, -307, -246, -255, -254, -81, -64, -38, -232, 10, 143, -83, -152, 130, 104, 201, 187, 143, 331, 488, 463, 406, 731, 554, 451, 283, 16, -166, -417, -130, -559, -590, -306, -545, -619, -448, -464, -363, -258, -355, -102, 138, 187, 117, 246, 146, 365, 294, 287, 122, 149, 611, 369, 341, 621, 231, 251, 398, -165, -61, -77, -307, -434, -463, -424, -538, -600, -596, -586, -451, -224, -420, -182, 236, 31, 238, 650, 338, 398, 581, 312, 282, 527, 352, 302, 329, 322, 91, 189, 231, -434, -90, -121, -644, -354, -230, -613, -338, -312, -598, -557, -404, -238, -205, -107, -65, 142, 402, 323, 363, 658, 529, 90]
2955I0O36O5p91N72p6n78L25p0m78J86n7l21k5K77k67j42M15k09m55P13j13m84
2977g87O60J67m15P67L36n90N05K07m53J4N06l92l24L27l7o49P19n63n91M59k72
2998d06k44N08l86m76M34P7j40K69K43l70K70N09k92L39M67o00MJ015r13J83M90
3019I81o86l01J016o45q00O28k19o70N35J70r79k5P66p16K78J087j238p2J421
3038E31q75l87J315k34q26J069K79p75O36L39r90L50M69r07L04Q49j280j2P76
3057F31j057k11R26p30o41P02j76m66P13K23q16Q15L38m95L88P63j156L33Q24
3076I08o38M08M91j157j38J087o57l66P69q10l70J028l60p72O83m35j089J272
3094a46J67j119M94L66j056J055J102j333PJ206j022K43J492j062q51J478k19
$$ y = [90, 726, 791, 0, 572, 496, -82, 243, 173, -305, -119, -176, -497, -522, -245, -512, -654, -239, -448, -903, -190, -303, -787, -127, 40, -375, 392, 728, 138, 643, 850, 397, 411, 917, 525, 201, 528, 491, -158, 561, -2, -593, -134, -406, -650, -142, -528, -1004, -570, -493, -633, -364, -121, -491, -221, 288, -4, 335, 802, 202, 206, 1221, 308, 491, 981, 295, -6, 1010, 365, -435, 193, -26, -696, -161, 9, -970, -995, -229, -945, -667, 420, -818, -890, 531, -344, -731, 584, 350, -476, 593, 872, 97, 733, 1072, 82, 432, 901, -6, 298, 1147, -133, -145, 631, -426, -637, 289, -441, -1082, -380, -556, -1022, -309, -86, -902, -87, 251, -244, 144, 907, -249, 84, 908, 270, 678, 1169, 12, -126, 961, 304, -62, 707, -103, -473, 555, 195, -577, 106, -329, -1418, -146, 21, -1098, -604, -238, -1294, -239, 863, -470, -463, 743, -279, -36, 1456, 394, -457, 1021, 802]
3111H02j023J357m14j559R93P38j563O46P02j772L81J260j139k32J133q96n70
3128a156J275K4r66R15K23j043P23P65j133P51P51j285L87P89o64J18L69p48l19
3147b24Q93m25o07N92o58k25Q35l22p64O60j78n11J136j23r15R20J16p78R61K76
3167F59j236M08J222j005j35J313j030l54J560r32j175J396k30j307J149K29j431
3184h99O59O86j371L38R53j341k78J735o68q14J188l25n13J471k4j488Q10M88
3202F07m77N45R6r32J78P57n33K1M69r20m74R40j08l16K16o53l86J109l04n19
3222f84J31j09J30O75K48j007K92N55m24M94N12p03J40P18o66K18P12j058m95
3241c21J010l38n17N91o03o11Q18J26r50L81N37j144M55O86q85K74Q55p99P1R09
$$ y = [802, -221, 1136, 722, -837, 156, 894, -669, -23, 679, -1093, -712, 548, -591, -823, 310, -586, -1156, 119, 143, -823, 92, 315, -728, -5, 760, -373, 378, 1129, -156, 231, 1020, 356, 474, 843, 95, -224, 669, 244, -363, 229, -429, -654, 181, -141, -905, -245, -423, -934, 202, 79, -836, 84, 200, -578, 383, 659, -577, -169, 1053, 48, -87, 1226, 196, -158, 1402, 470, -705, 691, 461, -846, 303, 532, -899, -240, 446, -925, -587, 366, -975, -1253, 482, -186, -1000, 188, -137, -650, 821, 797, -691, 119, 607, 130, 675, 771, -161, 17, 774, 241, 262, 731, -189, -663, 277, 169, -147, 69, -584, -970, 139, -165, -684, -553, -662, -532, 143, 391, -616, -324, 231, -193, 301, 813, 110, 250, 968, 302, 520, 1232, 174, -321, 689, 351, -166, 425, -178, -789, 29, 155, -795, -414, 123, -1021, -566, 120, -765, -491, 364, -435, -364, 545]
3261E45m61k06O66O9o97P93No44N89L23j079K22O68r23j30M34p62L15L39m14l35
3282f83L43M3j57J28k1j62K49L82o07N58M17o14K44M71k70K44J7m15K07K27p9
3303E22j59j63q3l7J70n03j17L22j25n46L47J10l98L40r5r9K41K79m02K02L97
3324B03k29L14J35n7mM92k78l24M30J52n82J21N8n46L05j18m31m4J54l38j08L9
3346f56J00n4J08m9K3M39M5l18M52L12j87M34j87M8M0R0k09J11J8j39l06R9n2
3369A62j10k35k53jP5ml41J10j04K10K0J85q9K11M47k18K76j27Q5m1J24j03K43
3392E22J19k07j49j12Q8j59J66k48k39K28j33m8l30O0Q8k43P7J01O3j3M5N4J63
3415a07NJ91K45j10k2K09J12m7Q9j01r0j13K60l67m2L5k67j26J66j27j55k8p1
$$ y = [545, 84, -122, 544, 613, -84, 709, 714, 70, 659, 982, -97, 125, 793, -130, -260, 174, -588, -273, 66, -348, -683, -340, -297, -454, -326, -347, -509, -260, 122, -485, 73, 490, -124, 120, 591, 321, 565, 582, 167, 374, 601, 522, 363, 200, 117, 80, 250, -253, -370, -48, -173, -719, -372, -262, -660, -320, -415, -514, -273, 6, -396, -194, 203, -26, 288, 423, 366, 362, 854, 576, 252, 682, 834, 252, 373, 431, -115, 190, 72, -359, -403, -249, -587, -695, -656, -556, -610, -502, -551, -528, -89, -44, -362, 90, 402, 215, 649, 462, 510, 550, 640, 431, 542, 560, 421, 115, 214, 162, 52, -183, -436, -437, -362, -366, -707, -597, -701, -491, -471, -286, -375, -164, 283, 65, 341, 214, 299, 258, 382, 279, 522, 641, 434, 285, 173, 261, 102, 268, 20, -219, 9, -124, -172, -502, -442, -354, -597, -520, -419, -356, -369, -324, -270, -107, -102, 89, 334, 224, 202, 411, 523, 476, 565, 464, 374, 261, 521, 154, 112, 147, -120, -246, -80, -207, -362, -390, -461]
3438d61J1Qo4L3J4P9Q5J12J69j32K22K35rp2M50k48J78r5k26L01r6k85M0l9k00
3463A0k41R8j44j07j71J91m7j8R1l33L79J84l57L88J44l25K52L42l02K32L9P8
3485C83O8qQ8l21J71J28n51K73k87m13L49R1m75K15J70l68M5L61k24j03K79m1
3507a70p3L19l7k02K68J12l73M80J30l17K49n3j50K26K39n60j35L82j79k58J68
3528F6m17m9L28k53l17N49m17j69N29qm51M98L52m11J65M51l17J53M67n19J11
3549C41N33n78l81P27l82k89L65j77p04N34J37o36K66J25o75K30K91m28R7O75
3569G1l41l55Q57j33j33M45j73k81M79Q9l97O08o3n33j22N58m77P7J64n71o8L59
3591F0j88k88M47m36j04L32p5m63N12pj66N07K3o11O04J99l79O64j90m66L14N09
$$ y = [-461, -450, -442, -506, -473, -459, -380, -295, -183, -14, -146, 76, 311, 302, 230, 680, 432, 610, 515, 289, 590, 494, 209, 249, 210, 10, -231, -133, -277, -384, -555, -364, -411, -429, -338, -671, -292, -108, -465, -77, 67, -258, -6, 336, 34, 266, 305, 383, 451, 443, 531, 210, 381, 509, -42, 231, -56, -469, -120, -29, -504, -289, -119, -487, -442, -81, -305, -408, -129, -170, -243, 76, 39, -163, 105, 217, -156, 324, 454, 137, 386, 333, 183, 409, 648, 88, -47, 335, 156, -102, 66, -351, -400, -72, -325, -642, -93, -510, -679, -150, -158, -609, -111, 241, -170, -5, 446, 129, 282, 749, 230, 341, 874, 296, -85, 642, 260, -29, 336, 159, -545, -11, 126, -510, -244, -119, -794, -564, -273, -701, -604, 71, -270, -625, 232, 99, -34, 411, 238, -43, 436, 525, 128, 736, 673, 140, 18, 576, 99, 176, 340, -231, -299, 60, -128, -416, 31, -405, -509, -177, -252, -715, -203, -210, -376, 131, 154, -457, 147, 346, -33, 631, 441, -25, 289, 798]
3613G98o35J22M48p71K73O07r37k89P29l34n22P41l99o93N88J55p61M05M89r62
3633i48L56J291j025j84P89l51P8J101l43q36M30L66n56Q50j22j043O3P92o37
3652G1j46J82q58k49P17pk34j21j25o6N66l8J01J9m3J02N89J22k42K61j60k00
3674B41L94K83n70N0k5m81M12J29p74M1L62p11j07P66m70n05P19M6o85R07J45
3695A67p12N94L89n69M18N54q84J0Q46o00j5O86o65n97J093j23o50K89Rr26N91
3716i5L12o65P4J44m91J46N03j95n27L64J64m9L25O4l51L35L14k26L32M3m91K70
3738C00J53l6J31j19k09N2l9l53J42k1n06K4J71l10r6M09l66j05M45j25pN52Q
3761I5k53N31K32l63M37J63m62L2L93n60q2N42o60l76N10j81n39L52j24l77K62
$$ y = [798, 163, 285, 733, -38, 235, 842, -95, -384, 345, 11, -511, 230, -169, -862, -274, -119, -880, -475, 14, -948, -592, 699, -326, -510, 279, -72, 6, 1107, 764, -72, 358, 724, 168, 1018, 896, -147, -84, 708, 71, -75, 107, -751, -1000, -283, -290, -524, -645, -770, -836, -270, -308, -207, -188, -231, -129, 460, 582, 340, 601, 441, 241, 635, 918, 348, 398, 373, -108, 304, 433, -341, -300, 62, -649, -756, 10, -460, -965, -246, -200, -885, 22, 167, -545, 49, 438, -131, 287, 841, -43, -33, 813, 213, 198, 884, 219, -378, 715, 592, -58, 231, 240, -686, -95, 217, -448, -374, -230, -721, -575, -72, -267, -794, -430, -266, -315, 10, 74, -277, 58, 372, 146, 478, 521, 30, 300, 453, 417, 548, 429, 220, 272, 233, -120, 22, 1, -505, -481, -310, -620, -716, -307, -673, -778, -333, -458, -465, 87, 95, -158, 373, 605, 242, 679, 842, 380, 412, 805, 245, 163, 705, 45, -331, 179, -2, -541, -189, -313, -690, -428]
3782d28K53l56J24L76m82J45N66m57N1L84j03j1L97O1m59M65j35k18J24j6k60
3803B1P2J58l46Q2j08nj52p3K5j0K3o9J10J64k47Q5J37RL4J50j72J12J82Lr7M05
3829D93k42q6K95j17l20K91J02k83OJ98j60l17J61k77j74L77k38j48N5K29j27
3850b82J04J15k22J61K37j75n4L86K26k67R0K79o9j55p2M7J4j12J1jk1l94o9P8
3874a45k05J8K16k95k19L39j29l6J6J83J42J16r5J17J10qO4K17j31R5J02j45k34
3897I3K07O9j02j27j39qj26j76n9O8J6n9k67K85N5L8j5L7QO0K64j29J5J64M1J1
3923B24J35J09p5q9K3j30J45M0k45K8k55p2M0l7k57K14l50Q4O7q4K10j07P0P6
3947b36J17O4RO9J67J31k1J86j01L1J58j0k07j40R1jj37j5p4j39M7k18k4Q5l29
$$ y = [-428, -175, -531, -407, -31, -513, -368, 198, -259, -208, 176, 73, 62, 459, 520, 61, 526, 391, 173, 297, 281, 21, 93, 251, -95, -13, -121, -126, -278, -351, -326, -336, -313, -382, -272, -108, -355, -270, -133, -124, -90, 60, -112, 0, 182, 185, 88, 493, 251, 165, 460, 343, 23, 314, 416, 133, 139, 337, 177, -140, 21, -256, -430, -53, -291, -439, -384, -155, -282, -178, -63, -285, -124, 113, -62, -116, 270, 496, 229, 319, 598, 529, 374, 302, 349, 363, 251, 262, 261, 240, -154, -223, -145, -350, -332, -116, -411, -630, -291, -420, -456, -440, -257, -115, 1, -94, 23, 133, 125, 189, 406, 275, 370, 472, 327, 93, 300, 369, 267, 140, 1, -7, -133, -309, -368, -300, -284, -343, -610, -325, -270, -232, -247, -210, -202, -142, 122, -7, 8, 172, 213, 224, 359, 468, 393, 304, 327, 197, 342, 382, 137, 165, -90, -162, -122, -159, -416, -202, -552, -468, -401, -485, -275, -382, -312, -236, -119, -55, -46, 23, 190, 321, 300, 486, 385, 416, 574, 564, 357, 217, 308, 307, 170, 155, 81, -58, -11, -229, -253, -168, -497]
3972d97r0O4p6K92k2l4J14K04J10j23K77J42p1R9M1o4O6R5k18R0N3l28R4j61q5
3997b8k78K25j74k52J56K4l50K65K57j50j59K82j65J41M18k77O3J33L1N8M50m13
4019B57RK98o8k1k29M0l66J58R1l65n5J9l22J11M0k44K83j37j85K84K77KL9K02
4043A18Kj0J55L9qK22K4k60K55R3m41J84P9n74J41l3k56P4J69l64k55M44k90M3
4067d49J80n0m49M87L00j53L05mk16J92N17l55J29J02l71K12L65m24l23K15j76
4088C4k27M73j7o48Q9J43l44K94J50n24jJ86r5J55K40j35n9L03R9J04K96k33j05
4111A78L80l5j28K49l31l69K44L1k24K60k15p01M24K71m01R7J31n66n9R31n20
4132c53j46N74l73r3Q96l49k36K98K73m85N44J43n75p7O54m84k14Q67r02l96M46
$$ y = [-497, -587, -523, -599, -307, -329, -363, -249, -45, 65, -58, 219, 361, 290, 389, 430, 366, 432, 527, 309, 399, 452, 124, 218, 57, -28, -306, -81, -255, -507, -351, -327, -677, -412, -155, -305, -464, -182, -347, -206, 212, -65, -2, 131, 162, 220, 670, 257, 266, 564, 496, 475, 246, 286, -80, 78, 169, -196, -251, -232, -554, -443, -403, -647, -364, -501, -686, -402, -125, -123, -84, 118, 120, 110, 265, 304, 296, 518, 542, 282, 537, 630, 189, 373, 452, -122, 19, -14, -270, -196, -27, -391, -646, -202, -492, -449, -269, -319, -768, -281, 19, -134, 171, 167, -49, 143, 660, 305, 434, 536, 165, 377, 742, 318, -5, 210, 34, -193, 280, 263, -385, -296, -153, -497, -203, -53, -577, -578, -392, -487, -332, -92, -227, -286, 17, 116, 220, 516, 283, 178, 558, 523, 395, 644, 313, -56, 188, 219, -5, 255, 40, -661, -237, 34, -367, -270, -139, -705, -764, 167, -353, -499, 75, -298, -391, 505, 156, -80, 218, 491, 6, 550, 693, 118, 41, 695, 211, -3, 864, -38, -434, 12]
4153A2j88l04M86j20p03M44M43n98K62J51m14Q0P31j72j75L60k81j25N07j53j59
4174H4M11j68o3J04Q6k82Pp8p0N8j15k36L29m10j69L19K4j87M6J30n24M20M92
4197B08n75K33L08m91J40O20j29m45N66r5m72P00K12r04L87K47p18L49L07m57
4217il39L66k66k92O17m16m66N63J51o23M67M71o16Q9P09k64L2K27l19M6L91j6
4239E03l13K56n4k36J11J68m84K3J25l46J71q9ok16j68J89o1J60j07K38j42rK19
4262f8K27k4l8R6k24L20K79j75k57L28l72lN47l77k30J17N7n61M11Mn53J10J31
4285b55l12m9O69m62l46Q12j55k96N82Jm57M91K71l14P2K36j32j81L12j51j11
4306B25L8o2l08J71o5k65j7M6k62P6k2P6p7o8J28LR1K19J45K3J30J21J52k32J39
$$ y = [12, -176, -480, 6, -114, -817, -373, 70, -528, -266, -115, -529, -449, 282, 110, -65, 295, 14, -111, 396, 243, 84, 495, 327, 264, 368, 454, 172, 179, 101, 31, 89, -26, -262, 67, -343, -512, -193, -169, -356, -310, -180, -704, -284, 208, -367, -134, 174, -317, -177, 443, 314, -131, 435, 340, -132, 568, 780, -124, 263, 510, -208, 141, 448, -9, -348, 18, -248, -540, 77, -339, -805, -242, -91, -714, -247, 224, -392, -303, 406, 142, 174, 401, 82, 128, 519, 503, 190, 446, 392, 156, 267, 435, -49, -26, 99, -247, -76, -165, -171, -387, -555, -366, -427, -267, -374, -136, -278, -287, -68, 159, 135, 97, 193, -31, 289, 568, 393, 136, 464, 92, 89, 636, 259, 29, 146, 203, -358, 53, 57, -496, -386, -255, -567, -616, 53, -409, -755, 57, -98, -394, 188, 189, -268, 223, 494, 180, 252, 488, 356, 175, 487, 336, 225, 263, 201, -107, 64, -1, -266, -283, -237, -499, -423, -445, -369, -446, -514, -386, -383, -292, -73, 72, 95, 225, 346, 498, 266, 405]
4331D05R2j25J79o7k30Q0j4j25j71J10m0l36J10n4k94K33q2j65n9J25m8Q4M62
4354G0k43m4L12lJ69J38J48l47K08O3j43J32l0l30N7N6j19n8j15k67o2K17k46
4377d37J5J57j9j84R7K9K98k32J94M2p0O1L13m8J29p1j4K04o7O5r6j56o1P5j45
4402G9j73m1k26J72j06J55k01Q8j24r2K51o8K2K1J26j43K26N4P6J90j30J69n3
4425B72P6J32lP3j97j06M1k4l66N5O7k61N3p0j49M8j47K55q3lM7P6J36Kr5K45
4451G4J41j23K88j72J00m6P1%o4j4m5j44P4m5j87l0r3q6K10j41j02M6K41k99K34
4476a12rj04J76q2J14K0RN0%J20j15L0QM5L2L24k49p5n5R9l02J84k40M0J2j09
4502a89j4j33J57j57j34K40q3j6K05l7M6M93k17j97K52J78j77j07L30k00NK36
$$ y = [405, 497, 372, 551, 484, 254, 334, 320, 195, 24, 134, 94, -242, -132, -186, -480, -247, -329, -494, -553, -428, -476, -392, 70, -173, -217, 95, 92, 261, 399, 547, 200, 408, 471, 328, 460, 430, 100, 157, 213, 94, 36, -79, -346, -408, -191, -437, -422, -265, -284, -468, -371, -342, -44, -276, -82, -40, -110, -49, 264, 216, 345, 274, 260, 464, 397, 462, 366, 210, 149, 224, 79, -94, -135, -361, -189, -295, -140, -341, -253, -377, -469, -218, -286, -264, -243, -117, -260, -34, 20, 96, 286, 156, 325, 272, 348, 480, 477, 550, 353, 247, 288, 264, -102, -47, 20, -241, -188, -258, -407, -359, -506, -251, -334, -337, -290, -214, -78, -76, -171, 74, 215, 92, 380, 208, 308, 262, 333, 333, 269, 255, 210, 66, 140, 95, -92, -122, -215, -301, -91, -232, -334, -288, -47, -346, -112, -121, -225, -49, -131, -17, 3, 12, 62, 62, 182, 67, 97, 105, 150, 182, 506, 257, 182, 127, 226, -76, 108, -132, -92, -80, -189, -203, -336, -179, -336, -470, -230, -313, -329, -124, -161, -115, 378, 161, -36, 216, 394, 217, 110, 440, 240, 245, 481]
4524D81l17J5P8j45j27M9j96j18J27l3j61K72k66jQ2K6K1j4P5K4J58J32L1P2m1
4549B24km7K28j47Q7P2k56J58K2k6l33k9p9RN0j07j74L2L15k43j59K01k97J58
4573c43L90m21K91L13j06j53M74K4l28K24r4k44M02P3m32L1K31m32q4M09m84r7
4595c56K26k09j95M79k90k61M02M7k66L72J52l65J4N14k07K2L73%l25K43j33J28
4617C65p7k4j01N6J5p2P0m08p5o4J77k68J42o1k85L01j6j69M19n8k92K43L55o2
4641A11n8L84k18j64M73k05j89M95k46o33O89m2m15J40j73n60K46N36m22k53K87
4662b17l65pP00k49m52M96J94n33O85K43p14L20N97m35J55K01l63j31K53k6m42
4683i0K64j74l03K28j45k87K24j16j27L02J7o4nJ00o4n8K05q6L00j6Q4J17M9k3
$$ y = [481, 164, 179, 257, 112, -15, 34, -162, -280, -153, -186, -347, -75, -341, -342, -260, -234, -213, -227, -152, -128, 30, 162, 193, 265, 224, 222, 175, 403, 256, 343, 415, 159, 317, 339, 313, -20, -49, -128, -119, -69, -176, -350, -318, -3, -246, -405, -204, -501, -343, 47, -374, -83, 230, 124, -29, 445, 469, 141, 365, 271, 27, 429, 502, 70, 101, 332, -100, -184, 225, -259, -356, -130, -339, -534, -55, -345, -606, -204, -157, -423, -51, 101, -264, -250, 264, 57, 79, 452, 452, 127, 370, 237, 365, 288, 264, 163, 219, 234, 162, 232, -176, -251, -315, -138, -406, -264, -325, -610, -309, -325, -494, -75, -133, -425, -182, 173, 111, 53, 437, 219, 55, 528, 323, 134, 629, 383, -250, 439, 397, -18, 122, -51, -611, -365, 171, -251, -504, -217, -582, -589, 111, -138, -590, -94, 100, -433, 252, 495, -219, 101, 698, 263, 418, 619, 256, 125, 378, 352, -90, 174, 0, -303, -75, -220, -507, -283, -399, -526, -224, -207, -271, -276, -176, -240, -298, -93, -179, 121, 105, 189, 306, 355, 332]
4707C32K54l3k88n2M63m71r9K11m50k81O48p2o86M39J5p34N73L43o03L1O04m11
4729b67J31M01m07k31P03n0l62O65k42l16K71J96k90n2M96n63j68M62m21l45L27
4750f2j95j79J83Ol65M44J10l96K18O1J91j13L11k09n1L44n7R8j8k50J58J69k91
4773A07K44j14l35K25J53k88J89q1l79L6K77j63m11L83k06j56M60p9k84K76J80
4794C4j16ML63k75nL38L7k09M14j83m32N32r4k72J4O7o57L07N24o22o3K98l17
4817c13l7K29J85n11K13J33k54L35J52j42J8J74k10j31M97k3j09L9j5M6p0P7j2
4840B71k07J16l09J51r0j82KN7P4K1j42j49K99k32K08P4J6j56J14J28p7J76Lp9
4864H7L1K48Qj22J54j50j79K41k31j63J55k45j08K67j64j14k56J81L0k4Q1k5O2
$$ y = [332, 586, 553, 265, 213, 676, 205, 106, 317, -133, -414, 234, 162, -524, -85, -70, -804, -231, 112, -491, -460, 144, -267, -136, 265, -142, -373, 330, 280, -82, 583, 341, 25, 296, 492, 202, 150, 646, 83, -85, 377, -44, -389, -62, -257, -436, -253, -247, -612, -168, -58, -454, -236, -175, 16, -97, 214, 5, -46, 298, 241, 339, 321, 71, 229, 398, 107, 351, 237, -98, 127, 280, -8, 181, 100, -279, -243, 34, -129, -540, -157, -363, -519, -59, -138, -422, -146, 34, -82, -78, 285, 10, 5, 343, 380, 171, 585, 402, -30, 502, 408, 136, 150, 217, -440, -133, 391, -231, -294, 4, -313, -350, -121, 64, -447, -234, -101, -355, -20, 132, -10, 8, 182, -28, -159, 338, 315, 206, 245, 230, 276, 206, 283, 271, 64, 180, -129, 22, -68, -250, -248, -191, -117, -96, -238, -387, -88, -320, -112, -38, -22, -178, -64, 64, -13, 163, 166, 87, 118, 366, 374, 252, 406, 256, 77, 318, 87, -76, 79, -166, -274, -7, -171, -285, -541, -360, -330, -354, -273, -298, -236]
4887b36K46O9j88O2K54o1j0J95j87J63Q5j45K7J7l9j51J68j22p8R2l28r1J3lj35
4912c83n8J55k8j26J02J37m7J15R1J99q4N8J61Q2l6Nk3j4Q0j11r4p7J20k41N1
4937C4Q5j03j15n6j75J32j1j60n7N5P8j23K10J28j34L17N8o3K6J13M3O6P0l2j07
4962B79j07P7n2j63Q0l13M1J35j75%J77j99o7J47q4J54j86J73l36RL53j01R7J16
4986E5j2J37Q6k2R0m5j3Q0l9L6j74J10k20k31j1N9k33L4J6k26K00j06Q2J83k3
5011a87k73K41PL1J99J60L7m3J39J02p6J45k42l9K37j31n9k6j57J5j29j13j06
5034b68r3M5Qo5J26o6j65K98O2q4L05J15j14L9J54o6K81l35kJ37o3j7j75K35j35
5059A57j97J10j00p5OL1j25J55k72P8J5j4n0J27O1j00J87R1j82J87J77k40J06
$$ y = [-236, 10, 79, -109, -47, 207, 146, 136, 331, 144, 307, 392, 247, 274, 291, 252, 101, 269, 147, 69, 161, -167, -258, -245, -248, -383, -441, -286, -314, -440, -338, -201, -248, -133, -42, 157, 73, 131, 292, 374, 338, 343, 320, 306, 386, 275, 181, 104, 224, -17, 34, 119, 16, -99, -155, -330, -198, -209, -369, -426, -371, -293, -416, -206, -78, -212, 105, 163, 100, 126, 239, 282, 348, 418, 386, 279, 172, 249, 197, 34, 114, -199, -158, -23, -198, -198, -21, -220, -287, -140, -224, -70, -256, -83, -419, -410, -57, -158, -61, 55, 43, 180, 266, 244, 334, 289, 276, 356, 317, 353, 179, 289, 69, -162, -173, -114, -347, -313, -297, -523, -323, -429, -347, -164, -187, -460, -219, -212, -181, 18, 178, 215, 172, 311, 413, 337, 482, 240, 201, 438, 307, 248, 222, 65, 80, -49, -162, -268, -361, -316, -308, -373, -247, -313, -478, -180, -118, -202, 103, 218, 104, 143, 297, 231, 512, 177, 175, 312, 249, 232, 57, 292, 157, -40, 70, -30, -105, -99, -68, -193, -38, -310, -232, -217, -231, -281, -154, -93, -193, -6, 85, -97, 90, 267, 27, 133]
5082A33K09l83K40J97n6l06L02k92l2J92l26j88M17j27j86R6J27k76J30K24m61
5103c66KM14l05R0L67k72m8L83k63j76L78J67l65Q6K62k71J0L63l84Q0K57m49
5125d0p7K28j86j19P7Jk24J00ll1J32k6K0r0L31l26J36J80p4J34K31l03K34%q6
5150B19KR7l78J33M00l19k96L86l56k92M58l14j50K61J38n80M53K15o75L53M24
5171A79l25K00L07m36j05P29j74l98N35r2l98L84K8o38L32J11l69J47J92m20q5
5192b96L04l20p5M55k75k42L13K2j41N1J66j29K46J47l00L4K95j96K87Mk98O5
5214A17J40j09J64J8l30l4J15k28OP4l20k24L93L4k77M25k28k07L42N5j57L06
5236G5J17l28K43M97n13j95N68l42j45N59j77o47M44L1m31L37L8n17K39J13m04
$$ y = [133, 342, -41, 199, 396, 340, 34, 336, 44, 12, 204, -122, -310, 107, -20, -206, -110, 17, -259, -129, 95, -366, -364, 50, -255, -165, 202, -70, -118, 265, 2, -174, 204, 371, 6, 92, 354, 83, 93, 456, 72, 152, 409, -40, -117, 111, -75, -194, -117, -116, -340, -240, -243, -274, -142, -168, -148, -238, 93, -233, -97, 83, 9, 143, 374, 71, 305, 305, 219, 221, 318, -60, 73, 473, 154, -142, 244, -112, -404, 54, -260, -410, -149, -11, -591, -138, 77, -598, -245, 179, -146, 54, 361, -75, -180, 549, 375, -23, 512, 420, 22, 406, 434, -204, 128, 239, -130, 17, 209, -211, -296, 8, -312, -387, 68, -207, -449, -136, -114, -255, -204, -38, -167, 79, 226, -74, -40, 255, 59, 346, 350, 52, 117, 257, 148, 312, 330, 0, -34, 81, -147, -141, -67, -387, -611, -218, -184, -461, -36, -264, -471, -129, -74, -231, 75, 192, -136, 107, 604, 91, -104, 464, 122, -23, 536, 359, -288, 156, 187, -244, 93, 131, -386, -147, -34, -438]
5257d38J82L49m92k39M84n9j51O06k37k70L09K78l27L20J77m12J52N5J33k25J69
5278C64l30L7J35K1m33J82k4k02R1o6j25R4j54Q7K94r8k21J78J96j9L04oj89J55
5302B71N8k61L76R9l22n7J49k29j27K52k15k90M12l03r9J50ll17K94l4j89J76
5324b09K05l38kM13k88J20M12k3k86M39k05j23L77N5m85J37k9j81m0R2k82M3J66
5347c2k10k13K39Q8k06K00J6o6N4j55J19K4J08Q8Q2k7R0P3p4j18N0Q0j30J01J24
5372C05j03k2j06o6j76P7J2n1j08O7j04j5Q4J4J11Pj18K04R7j58J02R6k4j15K20
5397B30O8j05P9P4k00Mj33m0J56j4k18M6o3q5K0J13k8j63k5J77j00O0L3Q1l0M9
5423a4N4kJ16r0p8J98q0K6J27j27j3J14j35j54K46j72j25Ll1j44K77k30j22K71
$$ y = [-438, -256, 93, -399, -638, -154, -213, -364, 242, 5, -265, 44, 322, -5, 315, 492, 80, 232, 287, 420, 195, 364, 34, 71, 206, 227, -206, -24, -48, -250, -159, -225, -350, -256, -410, -323, -29, -127, -348, -170, 26, 7, 311, 305, 116, 271, 329, 68, 444, 543, 221, 164, 313, 84, -43, 209, -6, -296, 116, -187, -286, -136, -139, -456, -162, -196, -385, -209, -4, -342, -344, 69, -219, -99, 313, 290, 4, 443, 238, 115, 492, 547, 62, 199, 170, -11, -51, 41, -241, -198, -32, -242, -455, -216, -128, -334, -134, -118, -184, -130, -285, -166, -142, -34, 54, 136, 109, 199, 272, 198, 80, 130, 210, 80, 181, 305, 202, 180, 74, 8, -168, -91, -79, -130, -238, -171, -275, -290, -206, -192, -81, -74, -192, 12, 109, -49, 53, 149, 125, 10, 230, 298, 193, 272, 346, 146, 150, 17, -23, 133, 119, -99, -53, -116, -201, -181, -68, -96, -259, -284, -107, -207, -147, -114, -33, -63, -14, 40, 38, 154, 64, -14, 184, 104, 130, 257, 130, 117, 231, 96, -58, 188, 16, -109, -106, -137, -281, -4, -234, -356, -85]
5447h5j91J10L1K80j49r4J57O2rR0j17j17K54p1q7P9Qk1J12n6r9p0qk6J3K5j93
5474a72J65o7q8r8O1R3p5P5L8M3J2l6l5L16j61qJ56J7M5j39L6R6j30j1J12q4k33
5501g2J09qo6j28N7j42R8r1k9J2nJ85j0k16J79J60j37M0J85k9N5K76k16k2K44
5526D29l08O6J36k08J7k5J2j64k3K1j50J41o9k56R8J88k91J00J26p5j23M10k2
5549C0O8Kn4PK19j50R1J40K8j48PKk82R3O1N0k90n9j11J99j93J78j63O7RpJ02
5576a04R2r2K20n4j51J35J35j22k5J51L8K33j07j40oJ48l14P4K4j46j8j43J33
5599c9l42M05k36j01Q9k8k43L30R6k50L39J36l13K59M12l22L9n6j05M2K93j77
5621B28k24K08J42n10K36j9k66J41j28KM6O1k03o6J18O5M0J31j51l2J36J61P8
$$ y = [-85, -276, -166, -135, 145, -4, -98, 59, 121, 112, 202, 85, -32, 222, 151, 64, 143, 151, 130, 242, 186, 87, 17, 9, -17, -4, 21, -172, -7, -74, -162, -260, -199, -106, -181, -106, -68, -25, -13, -49, -84, 232, 71, 63, 219, 236, 281, 142, 178, 274, 144, 133, 245, 161, -72, 37, 29, -37, -165, -108, -250, -152, -243, -272, -260, -265, -80, -90, -306, -127, 33, -104, -64, 121, 92, 147, 423, 207, 185, 429, 121, 187, 323, 115, 132, 107, 119, -45, -68, -47, -197, -56, -125, -381, -283, -95, -386, -286, -160, -235, -358, 52, 30, 98, 100, 46, 53, 272, 122, 213, 353, 381, 233, 240, 242, -40, 53, 114, 164, -126, -185, -296, -97, -290, -112, -275, -208, -199, -206, -104, -12, -104, 116, 62, -89, 46, 181, 59, 34, 185, 223, 456, 349, 209, 203, 351, 37, 111, 135, -11, -29, -172, -39, -381, 24, -212, -313, -224, -252, -495, -165, -69, -319, 20, 156, -157, 102, 514, 192, 231, 175, 70, 112, 405, 228, 4, 212, 354, -156, 80, 61, -205, -64, -192, -190, -144, -83, -286, -352, -234, -169, -129, 2, -149, -181, -45, 116, 194]
5644A94k4q9M7L59j23k06J41j04k27J37L39l39l39K98k01K0L41l87k38K56j7o8
5666b30L33j29k10K29j42nK15k5l05M35J42l31K05J79k80j70O26m52o8L43m46
5687h6q5K30j7j45J55l6l18J12J22k19J0L27m40J07N13k04l68L76j2j56M49j37
5709A78o4P8R8j22NK69m43K0J94Jj32J24n29l8L59j87o5K77k14j11K24n2p2R8
5733a04p5K1K63j56J34J84N8k42J36O3k21K82j43l96L10J21k45r5L25l06j68K45
5755ik13K1K68M9m76M48n7l09J82K42k90J43L18k98N8Jq8o1M17p2k00J44p9j20
5779A9J03K47m72J73J43l39Q7L40o47R1J10R0r5J63j20k61K58m7O3J10K1k75L20
5802H2M7q1K2R8j42K49p7j20J01o3p3J99j69q0j45K95l97kK38j11k43J80j0k05
$$ y = [194, 170, 81, 128, 487, 364, 158, 299, 195, -32, 105, 444, 105, -234, 64, -137, -117, 224, -163, -401, -145, -162, -230, 103, -26, -236, -7, -149, -154, 61, 36, -269, 166, 308, -23, 182, 361, 81, -89, 537, 85, 17, 360, -86, -171, 59, 42, -103, 52, 16, -302, -190, -68, -287, -277, 50, -390, -283, 230, 26, -342, 34, 22, -134, 315, 178, 114, 192, 290, 168, 173, 442, -1, 19, 213, 214, 82, 206, -323, -361, -2, -189, -254, 23, -191, -302, -78, -130, -202, -104, -179, -158, 105, -51, 83, 267, 325, 83, 219, 282, 61, 343, 200, -196, 114, 235, -10, -105, 220, -86, -254, -9, -222, -201, 67, 116, -360, 88, 31, -278, -96, 146, -144, -1, 317, 19, 77, 78, -10, -71, 346, 274, 74, 218, 139, 19, 122, 369, -103, 70, 213, -126, -39, 301, -346, -255, -145, -55, -150, 13, -107, -368, -110, -157, -94, 16, 37, -238, 82, 129, 48, 70, 168, 26, 275, 198, 78, 179, 116, 43, 242, 73, -7, -152, 143, -254, -256, -18, -129, -372, -192, -202, -407]
5826d07L61k61K2L36q8n2J50J13j07n8L32k93k7L13k00JK19k81j14J66J3k16L6
5849d2P8l09J77j37J8j41K70k27J23J05N1k58L26j09J7K90j81J16o2l1K12K2J17
5872D25l06P2J28k04j60L0j03pP3l46J78P6j05q2K43j92J12J19j48m4K07J45j82
5895g1J15K54q9q6J26j02J32j43J2J03K2l2j11j29k4l2j20k3pj45J91j42k3J33
5919a91l2O1J40j23P9Q5q4R9J08P1M8J1j79J9M4l3jL8pj96m0J33j22o0Km3o6J50
5947h9j52j6l7N7L6J32N5O2j5nj17L15j07Q5P1j03q5J59lj74q0j59Q2J09n1J74
5973A44j57j06m3o3j00J54j23N8J12j27J08J18m2J65j06l1R3O5J16j80K88Pj15
5996B35L2qk25R6k7Q4j90M6J0j78r1j4J83j74%j5J71qO9j82J99n0J01j68K94o3
$$ y = [-407, -46, -307, -285, 51, -37, -89, 61, 174, 67, 9, 341, 48, 21, 334, 134, 135, 354, 73, -41, 125, 138, -78, -42, 36, -273, -96, -233, -215, -356, -86, -313, -190, -85, -34, -292, 34, -75, -58, 232, 51, 167, 105, 74, 286, 308, 425, 119, 191, 319, 115, -45, -15, -118, -125, -52, -398, -220, -144, -249, -331, -88, -280, -168, -49, -197, -241, -34, 111, -71, 44, 298, 209, 123, 249, 147, 279, 136, 148, 251, 273, 241, 130, 1, -23, -55, -175, -198, -205, -350, -159, -301, -324, -191, -223, -162, -22, -145, -66, 19, -65, 34, 142, 213, 261, 272, 93, 112, 156, 123, 122, 160, 153, -43, -83, 50, -72, -132, -130, -173, -239, -89, -241, -257, -294, -237, -201, -69, -14, 48, 33, 28, -89, 226, 119, 204, 275, 172, 87, 246, 243, 69, -11, -170, -88, 21, -30, 144, -13, -119, -162, -225, -325, -171, -294, -236, -124, -251, -143, -25, -67, 98, -8, -39, 54, 119, 235, 55, 343, 350, 235, 267, 259, 34, 130, 103, 187, -3, 43, 53, -125, -216, -230, -47, -221, -221, -236, -65, -73, -4, -186, 13, -37, 64, -104, 190, 127]
6022A27M3L7l6J96k82J64r5j23q4Q6J09l53J73j40q3N8%L6K17j82K6K11j82r7
6046a74J87p4j47L40j99rP5J29n3j65K89r4j86J70M5k07L44k18j67J39j9k16K39
6069B9R3m77O4J65L8L3J7j86K35q5p5OK08N0k79k4K21OJ05KKJ2j5j42Q7N9K4m5
6097A28J61k51j72J85j31o7O6j50J55j5j95J27Q2l4j16K74m2q1K15N3k40K42P9
6120B73k38K11K64l80JM6k88K16O2l52O4J59J27l77J69%l34L72j09k73K43J45
6142Al35L25J04l19K55Q9k33J55L45k70j57J50J21l06J22J31j94Q6j79J28j20
6163a01qN0m4M7k27Q7R9k16J38K30q6j18J91j42Q9L16k12k2J64J19j60K22j76
6186B40j67K3K22m26K08J13j95j92L48m47J42J23l53P1K12o0j79L38r1j23K87
$$ y = [127, 170, 207, 171, 367, 85, 249, 154, 31, -53, 33, 142, -211, -38, -178, -261, -203, -203, -167, 50, -132, -106, 105, -77, -174, 13, -61, -208, 132, -67, -76, -1, 128, 75, -90, 199, 105, -81, 89, 134, -73, 271, 53, -114, 25, 6, -210, 29, 122, -355, -291, -126, -88, -55, -38, -224, 11, -74, -149, -143, 65, 115, -164, -188, 33, 39, 144, 146, 148, 160, 145, 3, 90, 149, 173, 128, 289, 38, -134, 51, -80, -147, -81, -231, -76, -91, -286, -159, -77, -111, -227, 47, 5, -76, 139, 192, -48, 194, 273, 35, 246, 510, 130, 131, 177, -111, 105, 167, -185, -121, 38, 165, -212, -43, -43, -377, -5, -114, -387, -144, 1, -334, -9, 95, -224, 31, 120, -113, 42, 387, 117, -40, 110, 231, -75, 47, 178, -16, 70, -109, 19, -101, -109, -59, -103, -56, -283, -196, -97, -313, -175, 55, -31, -149, 42, -100, -11, 305, 93, 71, 235, 354, 194, 416, 240, 73, 96, 318, -108, 100, 213, 18, -174, 174, -273, -131, -8, -361, -290, -78, -138, -317, 21, -70, -193, 94]
6207I4j2k18P0K71m4L2R5j91j69L56j60j20L07k94k56M30J2m07L05k16j51L7J08
6230a21j95J1M9k9J32J13l5L0K51j69M9J41k5M6J40k51j18K83m0l08O6J0op1M5
6255bk04J18K97n34j1L63m32J08L23k59L1K18m7j28L36k1j70L28L4l02J77R9k89
6278C3K19K77n31M4K37l70n0K58k98j17K90l4l45M29l2j61Q2P7j61K1O7J37j77
6301a05P7O2rK03l4j21K16k12Q6M7n9j47K8J79j84m8L0j18Q2Jk33m5K78j24J0
6326a40K02l97K14J43l00L16O1m8q5J62j0k8J56o5j31J92j09j52R2qj75k5J13
6349b2j36J76k11j0n5Q7n7j73L28j7j21K05L9k13J36J18R4N6R9k17k8MJ98j89
6373I1N4j16r6K53j60j81J85K4k06Q8Q5j18L4k3J51j43R2n2K7j59J98O2m1On7
$$ y = [94, 82, -136, -66, 205, 161, 193, 288, 97, -72, 284, 124, 4, 311, 17, -239, 191, 203, -204, 101, -115, -266, -229, -121, -316, -305, -256, -285, -153, -40, -75, -45, 206, 37, 86, 227, 202, 248, 388, 137, 19, 302, 262, -46, 20, 30, 24, -47, -2, -206, -88, 209, -325, -336, 27, -405, -297, 26, -233, -202, 16, -31, -159, 177, 156, -14, 314, 348, 46, 223, 322, 33, 252, 529, -2, 42, 279, -91, -141, 117, -181, -298, -8, -42, -387, 42, 10, -151, -69, 8, -153, -132, -65, 72, -105, -28, 34, 25, 228, 194, 73, 289, 77, 163, 210, 151, 4, 32, 211, 27, -21, 9, -109, -27, -26, -259, -304, -26, -150, -140, 62, -335, -121, 22, -278, 38, 99, 51, -34, 128, 118, 90, 246, 181, 50, 242, 133, -19, 73, 65, -110, -135, -22, -158, 18, -193, -203, -258, -171, -228, -401, -73, -90, -211, -6, 33, -180, -44, 74, 168, 224, 323, 106, 78, 82, 280, 91, 145, 29, -67, 186, 26, -155, 30, 54, -152, -64, 21, -97, -63, -86, 65, -78, 14, -38, -11, -170, 28, 90, 49, 55, -2]
6398bL7O3qR8N1k24J63j03q8K68j82m7r4K86m14J5K38kj94J30n9l3J63j25jJ03
6424C9j04K2oQ7q8M3J28j99J81m9Q5j10J4J43J8l4l0q2q1J04j88oJo1K3R1Mj75
6452b30J97j62Q7l7K8J37R4j15K25k06J60q5mj6J60k52P2N0K2j6O8J1k22M2j8
6477a0qq3l6m4J4p7K4P6M1J3o5k0K21Q9n1o8J26P7j46M7l3P3J23k37q8K02q3p7
6505@j63J17r8m2oJ00j9j13l4J23O9j32O0P3Q3r6J55J07j82J75k8m9J5j5K2K0
6531A42Q0k74J36k1j12J21l0j77J8J96k91K17j6k88J35j1J16n5J70k13O5J95m2
6554F1j37J64Jj81M33l81R2M1L6m4J55j48j41j17K47l29K06p6q7NJ41n0j53K99
6578C7j90L4Q4j1J16P8k33J74K6J19j89P8O7J9oj06J23j89n3J28r8l7j4k61L57
$$ y = [-2, 35, 98, 90, 188, 239, 15, 178, 75, -13, 255, 73, 26, -68, 218, -196, -181, 57, 55, -139, -9, -68, -101, 62, -63, -64, 39, -65, -43, -49, 38, -50, -7, 121, -78, 103, 54, 139, 29, 43, 186, 204, 170, 140, 58, -23, 81, -107, -113, -112, -173, -150, -59, -55, -230, -33, -195, -108, -145, -117, 20, 114, -1, 224, 18, 178, 93, 89, 73, 233, -19, 53, 103, 125, 109, 177, 188, -34, 8, -10, -18, -101, -137, -181, -167, -244, -220, -144, -103, -90, -155, -175, 46, 135, 84, 16, 142, 219, 73, 120, 87, 160, 283, 46, -42, 160, 77, 0, -163, -46, -144, -186, -192, -92, -111, -224, -258, -135, -66, -198, -138, -65, 18, -78, 77, 184, 2, 177, 149, 100, 115, 100, 122, 142, 222, -52, 84, 63, -49, 72, 42, -135, -117, 79, -212, 5, -11, -299, -164, -175, -59, -114, 56, -157, -92, 103, 61, -76, 88, 89, -92, 341, -40, 52, 93, 129, 85, 240, 92, -49, -166, 81, -248, -42, -118, -205, -200, -59, -109, -262, 37, -153, -119, -35, -46, 70, 148, -85, 89, 115, 234, 45, 123, 190, 209, 203, 97, 220, 31, -22, 106, 8, -29, -43, -304, 53]
6603E3j36R0r3o1q9J08K03k83J30J43k58J43O5Qj9L5m6L7K45j28j2p3p0J28J8
6628A38O4l50J66n9k02K74r7n8L1J73k58k2K80j61k5K26o9j15K55k38L5J85K7
6651B00m2q1Q5j48J09M5k63J01J86l39J68J06j66k09K42L4k91J46K7j1k07L79
6673G1Mk62K96j04O4Kj73J84J38l06K31R2l42J88M3n2j83J74oj69L5J6k15K97
6697B3r2o2L08k12k33J79J54k42J22N1l11K61J89n6k24L60j26k56L33K7k47K95
6719B41p7j67R0J76m11J44L10l28j71K80J8k70K59j43j49K58j38j01J53K0k10
6740b16LK46q7J24J76l11L0K43j02R8Kj79m3Q1R5k69J54J2j76J18p6j79K32m6
6764g0M7J8j17j59K87Q3j51J02n1N7%J87k29p9K60j84k40M18j42q3J60J50m36
$$ y = [53, -83, 7, -86, -147, -236, -128, 75, -208, -78, 65, -193, -50, 15, 23, 4, 39, -7, 30, 275, 147, 135, 62, -8, 120, 138, 202, -148, 18, -41, -243, 31, -66, -124, -93, 80, -178, -200, 80, -81, -106, 120, 51, -64, 191, -47, -12, 173, 200, 158, 77, 162, 14, 123, 168, -95, 6, 192, -147, 21, 127, -39, -248, -6, 28, -263, -117, -90, -101, -308, 71, 75, -187, 109, 5, 69, 71, -102, 82, 220, -86, 145, 237, -105, 83, 126, 74, -109, 65, 59, -110, -75, -59, -274, 23, -69, -131, 177, -35, -268, -89, 65, -177, -55, -4, -315, -54, 135, 79, -145, 215, 89, -167, 166, 193, -54, 241, 164, -3, 87, 263, -148, -4, 306, -22, -193, 87, 105, -165, 94, -49, -198, 60, -78, -179, -26, -6, -216, -213, 33, -54, 70, 246, -65, -35, 208, 106, 204, 206, 27, -16, 65, 160, -109, 45, 57, -119, -1, -77, -256, -24, -70, -23, -5, -122, -281, 6, 89, -62, 40, -11, 46, 46, 233, 4, -75, 185, 1, -239, 179, 37, -46, 114, 264, -172]
6787a72K45N2l57J27J51j44l1J12q6o6K50k38j19M77p7k81K73L5k66K39O6k44
6809e4J62k9k1m8J40k09N5R5m4R1lj59j26K91l17O0j10o8n8J21J97j11J40k07
6833b12J07Q6J62n5QM6l8J53k1l9k82K19j31J37q7q3r9J68M8j50ON3k99K38n1
6858a16j8j13K53L6j98J37j22O4N3J15j20K10J15k92K19J29k04N7p5l3n5j8r0
6881f6j34J4KP5K38k42j28M3J35j99O7O1k9L58j14j00Q8K0R5K2k3r7P6J08jj40
6907A29n6j8J9j21J13j31J73k72j78K42P1j55J21K4k06J72N8l6N3K6O2k7J0O7
6931A40l7J9M0j67J99q0j15K37j95j38J06M5k16J41j89q4J28R5jl8j24k3P1K16
6955C0P1k00J35J12k06qJ13N6j17Q1%l0l6j47J81J08o7j72Q1j21M1L1o2O8Q1j65
$$ y = [-172, 73, 125, -232, -105, 46, -98, -129, -17, -103, -169, 81, -157, -276, 201, 124, -157, 116, 151, -115, 124, 190, -54, 108, 79, 58, 10, 150, -59, -4, 91, 47, 138, 135, -24, -150, 141, -176, -116, -226, -294, -352, -231, -34, -145, -5, -212, -105, -19, 143, 88, 96, 142, 104, 257, 236, 197, -85, 134, 3, 140, 53, -30, -129, 39, 87, -63, -57, -4, -303, -65, -116, -134, -247, 6, 42, -156, -19, -141, -77, -24, 91, -29, 181, 296, 4, 223, 352, 148, 205, 130, 97, 42, 24, -66, -200, -186, -184, -109, 129, -113, -241, -198, -63, -262, -195, -134, -163, 195, 81, -19, 69, 89, 184, 206, 183, 86, 162, 270, 269, 129, 73, 55, 74, -47, 66, -65, 108, -164, -342, -100, -29, -184, -63, -39, -245, -73, -15, -51, 2, 28, 90, 63, 73, 140, 103, 122, 162, -5, 194, 114, -1, 236, 41, -97, 9, 54, -162, -21, -210, -294, -166, -71, -72, -110, -234, -257, -186, 30, 101, -99, 36, 148, -58, -66, 47, 103, -14, 67, 67, 37, 1, -146, 35, 143, 76, -96, -15, -136, -95, -64, -126, -58, 23, -142]
6981a42R8N8p8nJ93j42k7J0n2LN0J86k80P2J20k41J06K55k03J42o5j73J05M0O
7006C6k04R0J03j20l8O7j4L5m3p3K4j6p9Q2J40n8K4K56j49J9q8J01k6N9J28j63
7032I3K7Q4j35k42J58p6PJ85k39m5J31k7J43l50K44n6R8M0j02NL8J35m5k8j99
7057a56K49j90J20n7lM8n5J71j20p6N0K7L7o6L8n4J1P7k44J0K60m06J91J99j47
7082h6M7j2j3L6J32k12O3J31O8n0j04J52k57K60Kr0OO1m1r1M7j48M9P0l07K0J72
7109i5Q3j99J81Lk36K11J52o8j14R9K1Q8n2k4J30P3j68o2K3j53K68n6k90J82O1
7134E8P2j46J81j67l7M2m7k13J27R4j9Q1%o9J3J39k06Q8K85k07k80O34l53j34
7158f4K25j65L6J52j22p9l0J0j12N3J85k14n5O1O5q4K12j64k90L21Q4j81J81J34
$$ y = [-142, -44, 14, -64, -69, 124, -18, -45, -35, -87, -84, -34, 152, -128, -56, 64, -177, -71, 184, -19, 123, 58, -115, -10, 30, 36, -168, -78, 25, -95, -133, -66, -80, -45, -88, -161, -137, -153, -232, -150, -10, -68, -44, 212, 63, 82, -6, 95, 69, 128, 256, 93, 120, 204, 69, -173, -15, -91, -84, 101, -138, -183, -52, -79, 64, -286, -42, -98, 0, 40, -62, -57, -19, 116, 71, 43, -156, 93, -97, 23, -34, -37, 11, -44, 127, 7, -69, -19, 8, 45, -21, 17, -37, -26, 51, -193, -183, 77, -329, -138, 61, -86, -39, -51, -64, -28, 104, -108, -45, 86, 154, 104, 0, 152, -105, 155, 157, 67, 73, 134, 93, 2, 49, -99, -50, 20, -287, -267, -95, -12, -211, -30, -27, -263, -52, 100, 32, -82, 17, 38, 126, 74, 50, 180, 253, 85, 23, 46, -107, 161, 105, -185, -3, 58, 130, -16, 165, -2, -39, 3, -44, -257, -130, -36, -55, 26, 26, -43, -30, 109, -97, -9, 276, 69, -211, 423, 70, -64, 161, -4, 32, 184, 62, -17, -47, -37, -149, -96, 89, -125, -180, -119, -54, -138, 74, -90, -380, -59, 25, -156, 25, 159]
7182A59j28J17Nk6J04r9n7J33J16k65Rj15K4k00K26r5m7J87l40J71J75j12j31
7205a89P5Q7l6J3Kl6J40O2m1P2Q4j91Q2Lj41o4J86p1j64J37L9j86J59k47q7L38
7231B6j63orL28k94N3L06j99j57L23k55L7K17j88j81L47o6j05Q6p4j73J20J69
7254A42j52p5K44k37n0K10j94mJ5j7m5K47r7k2O7M0k21K11J34k97M1P4Q8kMj51
7280d7K69j69j08J20r0o8j01J64O0j83K62j92p4N1J20k99L09j0k83L08N7n4j30
7303h8m6J3R1J80r9m9R2j01l2J21ql58L24l0k85K28J81k39J0J46j08k13J61J22
7327A3j74K33pJ5o8M5j67J36l5q5%K43p3M4j42j13K26J06k91K08J2j79R4k3J71
7352A89j91m5M1j38K92j52j8P6n7m6K8k9o0J3J49k71M31j82j97J97Mj16r7M63
$$ y = [159, 31, 148, 153, 127, 231, 132, 75, 208, 324, 59, 68, -47, -23, -223, 3, -92, -139, 48, -292, -121, 54, -58, -189, -114, -27, -63, -50, -48, -84, 56, 118, 77, 149, 233, 42, 124, 127, -14, -78, 108, 37, -127, 10, 49, -137, 22, -225, -312, 26, -137, -143, -152, 176, -118, -65, 241, 42, -115, 208, -47, -10, 207, 19, -162, 185, 119, 14, 100, 26, -147, -27, 142, -10, -85, 159, -78, -128, 82, -112, -116, -101, -118, -163, 84, -13, -35, 32, 72, -149, 62, 196, -101, -60, 14, 102, 100, 104, -47, 222, 53, -55, 65, -25, -93, -194, -30, 30, -153, 109, -83, -157, -106, 14, -285, 24, 14, -269, 39, 96, 42, -88, -134, -121, -30, 150, 51, 2, 94, -7, -39, 82, 74, -284, 40, 10, -275, -47, 134, -105, -95, 51, -57, -270, -109, 13, -161, 72, 65, 80, 12, 57, -110, 26, -9, -94, -94, 149, 76, 120, -22, -135, 91, 197, -94, 114, 126, -53, 41, 18, 189, -2, -47, -6, -144, 148, -4, -22, 54, -3, -49, -21, -50, -110, -97, 52, -219, 212, 30, -167, 30, 34, -82, -179, 284]
7376B84k32m6J93k02n7L3q1J77N0j83J1l8n3Oo6K32r8j8Q2m9L0J09j20K6j4M5
7402B1O4j9j3N1l6O0o9Q8j8r3L9L2l4j08j03J46L4o1q7L8K6k47J40r1K80j54J68
7429E4qj46J79J10j17k9j4P8j06J76j64J2J58j43j68L19k66JQ8j3L1k80K90j27
7453h5r4L0j8J20J47q9j07O9r7L40j18j54j1J40J41m7k23J93j21n6K23j84K4J24
7477A47j33L0k3j49Q9j23Q1j4j47J43m0K27R8l08J38O8j25LJ44j0M2N0j22n8O2
7502G0j29m8J73L7k02J19k2l5m5j24K17J0k26J62m8J8M8L3r2K5kO7JlK29j31k73
7529a71L52j92n3J87o8j18N2J9j12K46j44j08Q1j1m4P1J08q5k28P1N2Q3Nj40J8
7554a29N4J80n6p0J83j1p8O1qJ3j80O9n0j07J03p4O1k1KJ96l31m1J8P6k0J05m4
$$ y = [284, 52, 6, 199, -3, -60, -27, -108, 69, 119, -64, -53, -91, -144, -138, -204, 28, -70, -88, -6, -55, -25, 84, -36, -10, -24, 21, 85, 66, 53, 104, 68, 128, 59, 147, 129, 36, 75, 107, 73, -35, -138, 8, 42, -19, -106, -68, -42, -289, -149, -240, 40, -114, 54, 46, -100, 79, 189, 72, 43, 29, 107, 1, 177, 13, 25, 183, 40, -128, 191, -75, -74, 14, 1, 32, -248, 42, -85, -179, -149, -167, -47, 100, 11, -96, -27, -124, 216, 98, -56, -67, 73, 214, 167, -56, 137, 16, -40, 183, -1, 23, 147, 14, 44, 21, -128, -39, -162, -81, -95, -242, -99, -139, 88, 186, -122, 16, 84, -41, -38, 106, 96, 138, 188, 66, 8, 70, -59, -107, 66, 103, -99, 20, -2, -37, -82, -206, 11, 21, -205, -43, -91, -73, -25, 8, -84, -59, -61, 6, 7, 4, 233, 102, -171, 181, -11, -64, 123, 55, -63, -11, 8, -104, 142, -2, -110, -29, -40, -84, -13, 95, 10, -218, -147, -95, -12, -7, -147, -129, -75, 105, 49, -21, 162, 151, 73, 134, 126, 139, -41, 28, -22, -129, -26, -100, -39, -60, -58, 138, -193, -234, -216, -140, -160, -55, -99]
7581i9LP1Km5J23o3k0J84n5MPK05l41o4K52j07K9l4r5k6q9J38k98K63j57P5LJ20
7609a4j52O6K00k33j5K60r1k90M25%j19M2l4r9l5J65l5O5Q0k16J05J59l46K8J02
7634A8n9L6rj42K11k4M1P5j87P8l8m1M9o1K0J14j11O2m7j6J43q1j79J50k8Q2p9
7661b3K9J84k91J00J03j41k8p2M8J4P7j99K26J28l09P5k4j22J56J24N9j23Q9j57
7685g7J51J61j74o5J44j8j72K41k1k92J30J51k82K97j79j1J4k6j41N7J79j77m3
7708a53J25J43j38L0M6j56K07M5k03K28J5k74J45Mo1n6L1j69K58p8n3p8J83r6
7732e5L8J15p2k30J79L6q1P0q3LLJ97l26K13J51k30J35J38j22j93L94j26j42R5
7756A07j02o8J68m6j41J96r5l5k9N3qj01P7j28O3K04q0j43M2Q4j60K56p2m0k6
$$ y = [-99, -96, -25, -23, -68, 55, -8, -28, 156, 101, 105, 112, 317, -24, -88, 164, 57, 86, 52, -43, -69, -158, -20, -318, -55, -212, -137, -134, -14, -166, -100, 100, -133, -148, 112, 21, -269, 156, 156, 37, 79, 45, -54, -89, 76, 41, 106, 186, -30, 75, 234, -112, -84, 18, -41, -5, -14, -156, 55, 31, 72, 147, -40, 38, 0, -41, 8, -53, -33, 81, -30, 32, -15, -31, 112, 31, -148, 2, -26, 56, -23, 6, 190, -101, -1, 102, -39, -67, -139, -91, -77, 0, -199, 27, 155, -154, -79, -103, -225, -69, 55, 114, -9, 80, -77, 74, 235, 61, -4, 140, 122, -50, 191, 170, -122, 8, 159, -123, 174, -5, -16, -2, -28, -169, -112, 67, -110, -153, -28, 115, -23, 7, 53, -103, 104, 149, -54, 174, 189, -85, 60, 64, 3, -53, -22, -191, 67, -11, -64, -142, 41, -55, -17, 98, 26, -204, -25, 11, -70, 0, -83, -80, -77, 120, -206, 7, 158, -72, 63, 201, 79, -114, 280, 154, 12, 107, 5, -63, 105, 59, -82, 114, 19, -16, -45, 8, 0, -101, -24, -152, -89, 115, 35, -108, -66, 18, -142, 114, 42, 2, -24]
7781b4Q4q9J45Mj79M9K9m1j04J66j34m5J1l3K4j3rJ28l0j70J82R5j11PJ50r2M9
7808D9R7P5k50k7K83j22p1Q0q1k02L11k85K8K21k12j0k9O1j21Q3K44l78K43L9
7832B6k31K01R6N2j8J2l0j16K20k45L7R4r3J13p7r2J49p0J24j78m2kM8N3j02m6
7858a17M2j0J27j55K2j10j8K17r7L6J29N5j48K79j80n6J41k08Kq1K08J04j23O
7882F5k31K08q4p2n8J97K8n7P7j22NL5r7R8KK6k44L48k46P6J51p4KK9N0j43oJ29
7910I2Q0j49p9P2O9k7j23%n7n6J57j44J32L6j41K99j45j20K00Mj66n3J28Q4o6
7935B7O1J3m4O1m3J04j29r7m8K73k88k3Q1n0oJ04j15J39m3k3n2J69n4M7j08M7
7961CM4M9p0j99K14j3q0O3j54K4K26Oj03j8P3j17N7kp9J22n1o2Oj03K69r6L7N5
$$ y = [-24, 60, -29, 116, 120, -59, -10, 19, -22, -126, 40, -94, -139, -128, -161, -137, -150, -159, -31, -61, -231, -49, 46, -65, -58, 92, 0, 49, 146, 221, -29, -56, 227, 105, 34, 114, 33, -169, 142, -143, -115, 106, -106, -116, -145, -84, -205, -122, 122, -256, -13, 26, -205, -4, 92, 144, 126, 138, 108, -8, 212, -33, 4, 98, 5, 118, 41, -51, 98, 28, 152, -26, -68, -70, -22, 31, -71, -117, -75, -85, 42, -113, -91, -201, -219, -2, -99, -63, 66, 121, -27, 252, 72, 16, 157, -51, -49, -130, 78, 182, 59, 65, -166, 42, -42, -114, -172, 25, 53, -4, 73, -49, -44, -9, -106, -8, -6, 20, -224, 124, -122, -46, 105, 31, 33, 62, 112, -31, -37, 92, 172, 23, -56, 16, 85, 58, -65, -65, -122, -178, -21, -165, -33, 3, -138, 161, 16, -104, 96, 100, -66, -119, 9, 93, 27, 88, 101, 57, 118, 75, 179, 50, -47, -95, 178, -110, -133, -52, -102, -108, -4, -119, 20, -23, -46, -98, 71, 17, 64, -44, 3, 47, 96, 26, -173, 41, 28, -52, 11, -143, -119, 107, 113, 10, -8, 65, -52, 5, 3, -76, 46, -5, -67, -61, -164, 105, 9, 46, 101]
7989A01j49r1K03K1P5rj73K8n2r2J81J9j34R3J58r7j37L2J96k44N2K08j18j89
8013a18J24j06mJ28k3N3j36LJ55k70P6K00j17J9n6J96P8l66K39l2j00J53R0k19
8037c3J13n7L0j07Q5j91J67K0k5n9n1J36j18j74K44M2l4m4m8J72j41P2P3J25m9
8062A48k09K38j06M3j30L4m8J30j02j06J08N5l44L65j32j9N4N3j45J3J27o5J2
8085b6m3J7K8R1j34j12Q8J4L5J45j28J08J02j29O8j43k3M8r3qJ9P7K8j45K9j30
8111b17J29Jq0K40j80k5l8P1O4l1J28j36L58k79j7L4K0L6Pj15m6J32J7k44L9n7
8137a89L9K40k07N4K0q9n8J44K10k19K9j7N3J03j65o6J94o9N1M3L5k03J56o7J23
8162A45j97j1k6m6J41k15K58k64K50l21J22K00p8o5n9N0J49Q3j07l4J18n0J3l0
$$ y = [101, -48, -139, 64, 85, 160, 151, -22, 6, -46, -138, 43, 62, -72, 21, 179, 82, -55, -23, 173, -71, -19, 189, 71, -118, 6, -100, -104, 24, 1, 54, -82, -79, 76, -194, -118, 82, -35, -16, -72, 124, 202, -164, 75, 43, -57, 96, 186, -33, 80, 23, 53, -54, 31, -160, 7, 27, 2, -57, -108, 28, -90, -264, -20, 22, -12, -56, -104, 68, -73, -1, 72, 197, 148, -61, 177, 71, 114, -16, 18, -30, 100, -2, -108, 0, 55, -289, 76, -56, -75, -21, 32, -113, -100, 27, -38, -26, -69, -52, -24, 67, -67, -179, -91, -77, -42, 103, -25, 83, 185, 56, 124, -19, -42, 6, -87, -95, -76, 1, 29, -116, -87, -217, -88, -87, -167, 73, -107, -132, -170, -99, -35, -66, 62, -74, 284, 5, -12, 22, 42, 78, 85, -30, -76, 56, 73, -171, -132, -189, -150, 90, -117, -63, -43, -132, -190, -46, 164, -55, -26, -43, 10, 113, -52, -118, 76, 7, 58, 101, 136, -67, 89, 22, 145, -52, -63, -89, -135, 6, -209, 49, -215, 35, -286, -164, 36, -42, -107, -166, -116, 33, 116, 9, -25, 93, 43, 56, 26]
8186B6J64k29RP2n9
$$ y = [26, 190, -39, -30, 42, -17]
8191a7
$$ Imaginary data points
##PAGE= N=2
##DATA TABLE= (X++(I..I)), XYDATA
0@%%%%%%%%%%%qJ6j6J6j6K3l1L2m0M8n6P2q5R8j14J32j52J74k00K30k62K96l34
34a77L78m26M77n34N98o66P39q22R13j009J116j232J358j499J651j818K005k210
52a158K435k686K968l288L651m068M558n137N831o688P772r195J1147j3997J8562
67A0707k6992M7439j83040j94779M71826O1191o3274J81499r4791j73073K62968
78B99681L0705k80249J8386J2405k58778M6192J48639j53900j9238J00849j42923
89a98231N3702K34648j01860j20166J26586J7567Q787J03510q1222r2548J16262
100F7035J3330q2696N7949m419p8709Q9254K6952r1467Q3346J3170j78687L6540
112d8402Q4731j38039k1007O8825q9403K7067J26201q3927k0855J76932j5458
$$ y = [0, 0, 0, 0, 0, 0, 0, 0, 0, 0, 0, 0, -8, 8, -8, 8, -8, 15, -16, 16, -24, 24, -32, 40, -45, 53, -61, 71, -81, 93, -107, 123, -139, 157, -177, 201, -225, 252, -282, 316, -350, 389, -433, 480, -529, 587, -645, 713, -786, 865, -953, 1052, -1158, 1277, -1409, 1559, -1729, 1922, -2146, 2412, -2725, 3106, -3582, 4190, -5005, 6142, -7855, 10707, -16285, 31154, -151886, -346665, 125161, 186352, 123078, 304577, 209786, 36713, 299681, 330386, 50137, 68523, 80928, -177850, -131658, 16981, -136919, -156157, -55308, -198231, -144529, 90119, -11741, -131907, -5321, 12246, 21033, 124543, 43321, -49227, 67035, 80365, -2331, 55618, 51199, -27510, 61744, 88696, -2771, 80575, 93745, -84942, -48402, 36329, -101710, -122717, -53892, -143295, -116228, 9973, -73954, -94809, 82123, 66665]
123F6665r1526J18785L1282o7138J05642j7474j77616P0636O9821j76265l4973
134a02161O4580j04519p327J09099n4385j3151J37628j7936o5445J17371M0570
145A04324p2452M9222P084p1392P8224K2943j43066O017P4549q1399l6160L8621
157b3485n3753R56Q8921l6444n5419O7145N116m1784N7625J157n9043N3318K6398
170C0708m2149O6143L8785q4972M455O0593l2813j0309J9032o0177j7345N7551
182B9502l0017m9309K4174k5674l3021N2030l289l6509N4383J4552l0658O3486
194B9650L4933n3894J1310L1095l0409J4721K4631n7854j3505M8768k9616k9495
206a9665K9556l4300l2971M9525r180l5602M8254O173m2281L8650K8201l7916
$$ y = [66665, -24861, 93924, 125206, 58068, 163710, 146236, -31380, 39256, 109077, -67188, -102161, -37581, -142100, -149427, -40328, -94713, -107864, 29764, 11828, -53617, 63754, 104324, 31872, 81094, 88178, 16786, 95010, 117953, -25113, -19096, 55453, -25946, -62106, -23485, -77238, -76282, 12639, -23805, -79224, -12079, -6963, -48747, 8878, 10035, -49008, 4310, 30708, -11441, 54702, 93487, 8515, 12970, 73563, 40750, 30441, 49473, -10704, -28049, 29502, -515, -49824, -25650, -51324, -84345, -32315, -35604, -72113, -17730, -3178, -33836, 29650, 64583, 10689, 21999, 53094, 22685, 37406, 62037, 4183, -9322, 39446, 9830, -19665, 9891, -24409, -57380, -7855, -17035, -52637, -4383, 1790, -40491, -1841, 26360, -11556]
218a1556J4815K5468l6550Q516M2970k8352j6203L3204k1427k4103K8247j8021
230b992k9634K6263n267k3053K8198N823k2395K2630J5628k2517Q688K3497j2883
243A1986j616J6429j2964k743J3517k1724j0933J4316j7307j0396J5549j2503
255a8389r251K1315k069j7170J2114J1943r531M151J2211l459R046J3556j2261
268A2206K878J7506j1460r449O308p315l913L186j1205j0112L211j41j2750p866
282b8916O258Q82l196M183N558J1463R274k185N734Q791J630K880o729p291O819
297A5155j759r064l763k942k57j665m961k053J057N995j957q175J0034R754m908
312D91n88O58K417Q413m222q317J595M069n76q690j825P092m095k626L939k120
$$ y = [-11556, 3259, 28727, -7823, 693, 43663, 15311, -892, 32312, 10885, -13218, 15029, -2992, -32626, -6363, -11630, -34683, -6485, -662, -23057, -427, 15201, -7316, 1372, 24869, 11986, 10370, 26799, 13835, 11092, 24609, 2885, -8048, 6268, -11039, -21435, -5886, -18389, -27640, -6325, -8394, -25564, -13450, -1507, -11038, -6887, 5324, 1865, 10911, 24467, 12206, 15084, 32590, 21130, 11681, 17989, 10674, 6761, 9947, -1258, -11370, -8159, -8300, -21050, -28916, -22658, -21776, -24972, -20789, -15231, -3768, 5506, 3321, 9055, 17846, 19476, 22356, 15627, 8336, 15155, 13396, 4332, 569, -2373, -2630, -4295, -9256, -11309, -10252, -4257, -6214, -14389, -4355, 5399, 491, -97, 561, 2978, 11391, 7169, -1148, 447, 4516, 3940, -4750, -6575, 517, -3578, -6204, -2265, -4385]
328d385N088N474n813n19N053M090K06o589J585N305k64p91o488j362O039q241
344a612q226J839k567j953k772l118N412K244J82K949j097N063P985j603l47M364
360F743N714L296k800L169K660l564K060n380q025M122q023j3108L698k538q983
375b0959K350R88l836M766J0748j216k243J4348N378m195J2032L28r652J0648
389A9485j93j3019M442j905j4734J334N268p828l915N773k214j587J0487j127
403B67m864Q857n060n659J2780o668j2442J0408j923p328J0829k330q188J3688
417B367N723j0836Q389Q812j4843N059J5563k1076m920K1706j7946j2481K4772
430A0289r925j5397K3244m415j7199K4307M218k6940J3725J4857k8026N93J9665
$$ y = [-4385, 703, 6177, 364, -155, 4898, 8988, 9194, 2605, 4190, 9495, 9231, 8440, 1952, 590, 6629, -1612, -9838, -7999, -10566, -12519, -15291, -18409, -12997, -10753, -10571, -7622, -8719, -3656, 4329, 2726, 2379, 6743, 12457, 15753, 12953, 16122, 18782, 15218, 17278, 11898, 3873, 7995, -28, -13136, -9438, -11976, -20959, -18609, -17621, -21457, -16691, -5943, -7159, -9402, 4946, 10324, 6129, 18161, 18489, 8837, 19485, 19292, 6273, 10715, 8810, -5924, -4590, 678, -7150, -11065, -5292, -7506, -9093, 1394, 267, -4597, 4260, -800, -6459, 6321, -347, -12789, -2381, -4304, -11632, -803, -3133, -11321, 2367, 8090, -2746, 5643, 14455, -388, 4671, 20234, -842, -5762, 15944, -2002, -14483, 10289, 364, -15033, 8211, 3796, -13403, 10904, 15122, -11818, 1907, 16764, -11262, -10669, 8996]
443H996k4254m232K3691k3737q888L7568q155j8628K6879L18j1211K8936K66k6786
457G63J6947Q771k6009R795J0656l5118j326K1599k3460j458K2905k8183q175
470c2293L7955o927j3710J9723j3897q512M0811k191l6507J5176J2452j7230K2337
483A7187J0473l9092N470K5568j9514J1391J9678m5403j1758L9291r871r785J6694
496A0329l4185j9139M9243M839l1214J7799m093k5062M5798K1393m9237J2231
508a298K5323l7495J8964L9002n1262j6248M3498k2318j1348M2930l1467m1638
520d3357N2039J0700m2990K8924P104m9626L6322L9538n1070L646L6315m0876
532a3331k343M7852k8689k4852L5175j4980k3558L7820l042l4650K5564M204l4163
$$ y = [8996, -15258, -19490, 4201, -19536, -28424, 9144, 989, -17639, 9240, 9558, -1653, 27283, 27549, 763, 17710, 26481, 472, 10267, 20923, -14195, -15521, 6078, -17382, -18840, 4065, -24118, -32293, 5662, -1265, -14975, 4748, -9149, -17661, 23150, 20959, -15548, -372, 12080, -5150, 17187, 27660, -11432, -5962, 19606, 92, 11483, 31161, -14242, -26000, 13291, 3420, -6365, 10329, -23856, -42995, 6248, 11087, -20127, -2328, -6421, -31483, 14315, 35708, -13529, -1298, 24025, -13470, 5494, 44496, -6766, -23014, 20484, -1834, -13182, 29748, -1719, -43357, 8682, 19382, -23608, 5316, 12420, -37206, -884, 38654, -12416, -8770, 27545, -13331, -15674, 32178, 3489, -21363, 13812, -1168, -24726, 13094, 10052, -24598, 966, 5170, -28993]
545b8993K6799J9023l1377J5419J5990l0300J6801K7419k6549R83J4788k9419
557i416N422L3059k7770j7165K5619k3641j3450M6478j7686m0980L8889L192l1511
570b8960M2404M868n4135L1508L4011m5641J1985L6708m5811r51N7767l2074k8657
583a6978M7471k2877l6462N6113m493n9016L2569J6931m0312L0108J8121n7412
595c6237R493M5156l0900p906L6609k4483r899M6262j5002k4749L6397j2520l1566
608a9345L5279L11l5168K1318O834k4930K4833R902m2046R772L2533k0913j493
621c113J6319l0022N558M1053k7178k0207L0821k0988j9647L9459n597k6634K6810
634F634m226k8404L6022J7886m2357K566K1487k0627J5342K2684m0171M05M1050
$$ y = [-28993, -2194, 16829, -14548, 871, 16861, -13439, 3362, 30781, 4232, 5215, 20003, -9416, -3994, 29065, 1295, -15870, 9749, -13892, -27342, 19136, 1450, -39530, -641, 2551, -28960, 13444, 18312, -35823, -4315, 29696, -15945, -3960, 32748, -13063, -14014, 43753, 11679, -16978, 30493, 7616, -28846, 27267, 22774, -36242, -3673, 13258, -27054, 3054, 21175, -36237, -26744, 18412, -12488, -20394, 16215, -8268, -18167, 28095, 13093, -11656, 24741, 12221, -19345, 15934, 16245, -18923, 2395, 9229, -15701, 9132, 19034, -23012, -13240, 19293, -1620, -3113, 13206, -16816, -11258, 29795, 2617, -17590, 13231, -7757, -27404, 12055, 6458, -20176, 6634, 2408, -25996, 10026, 27912, -14445, -11879, 9608, -11019, 4323, 27007, -13164, -12759, 28291]
647B8291k6428j5927L2854j7023j8726K9622q969j8074L2130n434l7928K2824
659b788J6804l2126O761J2002k7857J9347L1163l5770l560L7958j7905j2520K6724
672A8233j3113j2676K9240r898k4985L0339Q382l7248N511J5621k0732O994J1303
685F971k7145R154K9006k3038j1888K2462o673r270J0588j0558l953K4683j961
698H378k0018J3712J0394j2659L661J622j0367J3455M566k0408R770J7406j5276
711D236o040L077j1060O523J1677j9233p181K2959M81j4117P965J003q487J0001
725A804m017j5323J8962J1813k0248K532J4914p151n21L674j2286K294J7132p549
739F030j2232J3837N885j0638J023l413q010J0148q88j7416P441J3852p491m266
$$ y = [28291, 1863, -14064, 18790, 1767, -16959, 12663, 3694, -14380, 17750, 12316, -25612, -2788, 14016, -18110, -11349, 653, -27204, -7857, 23306, -12464, -16024, 21934, 4029, -8491, 18233, 5120, -7556, 21684, 11786, -13199, 17140, 25522, -11726, -6215, 9406, -11326, -4332, 6971, -20174, -11020, 17986, -5052, -16940, 5522, -1151, -10421, 167, -10391, -14344, 10339, 8378, -11640, 2072, 12466, -193, 3468, 5090, -5277, 8178, 12744, -7664, 2106, 19512, 4236, -1804, 1273, -9787, -3264, 8413, -10820, -18001, 4958, 5439, -8678, -713, 290, -8197, 1804, -2213, -17536, 1426, 13239, -7009, -4477, 10437, 3286, 2765, 6439, -5847, -3553, 13579, 6030, -6202, 7635, 13520, 2882, 3905, 492, -7518, 2630, 1742, -15674, -8233, 5619, -1872, -6138]
753f138K494k445L471L231r713j363J4080J695p519N765M694k468K249m942o995
768c904J0269M145j1213o67O360M11j448m811o387J901M753n243n494P334M843
783H49l509J51j79m27M532l225o319N944O550n00j659l86L061K894l085o203p22
800b233N514K82m661K067L283l93r42m724j584L068k927l686J922K008L468Q47
816A309k723p29K102J688l301k923L285K618j17R38q72K579K475n282k080L908
832B875mj610m98l2J738K28r16l232j788J777j643j860K560o2n6J935j654P2K062
851a08j844j061N38J553K799L23K77P2k67J310j395j447R28j721J081K184j492
868A730J225L83l922j63L36k501m60J94k40M41K186J344j559Q17M61l949K190
$$ y = [-6138, -3644, -6089, -2618, 613, -9100, -10463, 3617, 5312, -2207, 3558, 8252, 5784, 8033, 3091, -3904, 6365, 10510, -703, -1370, 4990, 5401, 3953, -858, -7245, -5344, -591, -5834, -11328, -3994, 849, -2660, -2509, -2688, -3115, 1417, -1808, -8127, -2183, 4367, 3867, 2208, 1822, 4883, 7777, 4692, -1511, -2233, 3281, 3563, -1098, 969, 4252, 3859, 2917, -1807, -3391, -323, -3250, -6936, -5014, -3006, 462, 1309, -1414, -2143, -41, 1647, -1654, -4577, -1292, 1326, 1209, 2147, 1275, 3854, 6329, 1047, -1033, 2875, 2871, 1261, 763, 731, 2469, 2697, 1781, -1451, -3239, -1462, -3105, -4965, -2405, -2467, -2523, -588, -2242, -2170, -108, -1952, -3013, -2475, -922, 1877, 2200, 2477, 2549, 2282, 3592, 2197, 750, 1678, -43, 1038, 3222, 1730, 2955, 3338, -584, -747, -411, -2912, -3372, -3178, -3418, -2977, -791, 553, -1006, -189, 272, -3677, -1487]
885a487L291m781P79M073j339P22K009j949J23Q34j144m27L620P89m449J467K605
902D736l678N34P0o817P73L155l038L09R07k690K042K781j759L33L506j832k478
919c146O717K545m156K137j178l777O983M21r100K595L311m537L109K068o980
934b988Q68M914n927k411P142m258o680Q291N09n700P618j541q335J0426M895
949F823r950M014N443o954L621O435r326j566R096p098o008J0731l364p819R271
964C349k886q341J2129O96j3122P874N144j0945M613O979r938Q90P640j0155j075
979g148J3288p378p502J2041l341n974J4157k628j2551J1755M173j1251O606L753
993H000j0884M261O414j0216J060P612j1595j345J2128q634o195J1251o718m733
$$ y = [-1487, 1804, -2977, -2198, 1875, 536, 1258, 3267, 1318, 1441, 2275, 1131, 704, 4324, 5113, 664, 2131, 4736, 1058, 1592, 1662, -5155, -4382, -1227, -4265, -3956, -3049, -5739, -3697, -916, -2675, -2342, 1164, -668, -3146, 3571, 6116, 1960, 4097, 2919, -858, 6125, 6546, -2554, 41, 3352, -1185, 1924, 3992, -2988, -2120, 2794, -3133, -5544, 1598, -2660, -9340, -1049, -540, -6240, 1378, -163, -8498, 1928, 6823, -3127, 887, 6330, -624, 2997, 9432, 106, -1460, 7636, 538, -5470, 5261, 1897, -5922, 3349, 463, -7878, 4251, 4947, -8175, -301, 4843, -6102, -1489, 5490, -4448, -3558, 4082, -6073, -7148, 6140, -1238, -8740, 3301, -40, -6014, 8143, 5515, -7036, 4719, 8892, -2359, 4247, 8000, -2884, 1377, 7791, -2425, -1365, 6247, -5348, -6693, 5435, -3199, -9394, 1857, -4861, -9594]
1007i594J4086o129r833J2644j08p970J1977j44j2543J1899P085j4218P184R293
1021A3629j7267L135J6219j6909m334J7490j4636q915K0836r771j6382J8781m59
1034A417j7385J5318M825k0858J2426J6424j9653K845J7450j7415n17K3690j3303
1047E264j1865J7117o776j0019J8351l266j8061R744M163j2040R422N641j6965
1060i290K451R519r645N255Q365j6332J385J4885r391o21J1256j2551l341J6671
1074H616n760q467J1771n014r498J6924O51j7393J1207L747j7764J3952J1629
1087A4601k4230J873J6432j3836J906J6915j7406r255K0669m510j2264J5728m367
1100B256j8035J7221O332j8272J1174P268k0501R385J6674j7039q34J4651j1498
$$ y = [-9594, 4492, -1637, -11470, 1174, 1066, -6904, 5073, 4929, -7614, 4285, 11370, -2848, 4336, 13629, -3638, -503, 15716, -1193, -5527, 11963, -2673, -11588, 9248, -523, -16905, 1876, 1417, -15968, -650, 4175, -16683, -4257, 12167, -7486, -4641, 12809, -4606, -5123, 18567, 5264, -6601, 10516, 3740, -6279, 12072, 8806, -9255, 489, 4652, -7388, 2034, 7675, -9290, -6839, 2680, -6965, -1710, 6655, -9677, -8292, 6593, -2798, -3419, 7837, -4714, -8055, 8616, 2856, -5611, 6160, 1146, -8352, 8572, 9223, -8170, 3037, 6784, -10980, 2972, 14601, -9629, -7756, 8676, -5160, -3254, 13661, -3745, -13000, 7669, 3159, -9105, 6623, 2256, -15779, 1442, 7774, -10498, 676, 7944, -12557, -3172, 13502, -3537, -4371, 10280, -1218]
1113a218k316J6763r643j0288J5863k556j2998J2340j318j5018J3178L353j8009
1126a1867Q115P543j5003N937J1051j3714o45J2714q467j240J4654q342r141J5328
1140F923l25q828J1240k565j1905J2724K122j4223P235L141j2957N830O806j2834
1154g616J174R996r743r27J1829q290m907J3282n019n620J3398n771r480J5015
1168G321p83j2972J1189L409j3781P255P296j3907K899J1877j2830l375J2639
1181F237r347m330J5128q078j0532J3323j054q469J2497K09j4603P827Q863r469
1195a798K159O350j2085j017J2525n842m520O875p497k863J2682k071o753N738
1209A883j886k505R853O02r319K396L310m400L172J121r177P91N337n833J824
$$ y = [-1218, -3534, 13229, 3586, -6702, 9161, 6605, -6393, 5947, 4629, -10389, 2789, 6142, -11867, -3752, 3791, -11212, -5275, 5776, -7938, -8583, 4131, -4336, -5576, 9078, 736, -8405, 6923, 6598, -2230, 9010, 6445, -5460, 7264, 9386, -4837, 2398, 5539, -7418, -1588, 5218, -7616, -6442, 3554, -6189, -7116, 4713, -3577, -8484, 4798, -221, -5841, 7557, 1786, -7694, 7321, 6538, -6434, 4755, 8164, -5617, 1638, 8934, -4973, -2074, 9803, -3027, -6402, 6237, -3110, -7440, 7688, -390, -10922, 2401, 1347, -7122, 5375, 5584, -9019, -1192, 7671, -1798, 361, 6711, -5374, -6391, 6134, 292, -4228, 2647, -4850, -7713, 4969, 2898, -3855, 1883, -3, -2508, 7345, 7947, -1372, 1024, 4334, -66, 3106, 4227, -4950, -4159, 1178, -4655, -2831]
1224b831N162q417o30Q182l108q24N419n709k409R744J0o942M229J793n547M948
1240C070L181q144K245O107o598l53N975m568k293L548m920j660N395l322n316
1255g653M877K511m622J357L130j964K644K243m094K327N264k707r87J108j662
1270A772Q54Q10m161j251L365o74l384J362K335j471L44n82k085K959J532m265
1286b540J41K749o91o7j066j927J859K435k349k188L491L516j849o59J542J14
1302B511J382j013l633J674K704k396j901J22Q37M99j902k579L17K655P3k947
1318c597M79L164L60n27j238j241K970O10l569M23L329J784m34j623J040K777
1334D707J08k946k277K162J758k458j699M48QP81k819k853J871J322j430j016
$$ y = [-2831, 2331, -6086, -6716, 1466, -1642, -2466, 2953, -2756, -5165, 4579, 4589, -2353, 1876, 3669, -1878, 3070, 6251, -1893, 352, 6459, -139, -492, 5483, 915, -1378, 2170, -2750, -4410, 985, -2337, -7653, -2776, -265, -4887, -3530, -400, -2364, 280, 2523, -1571, 756, 6020, 3313, 2326, 3434, 1772, 2626, 3436, -725, -1976, 1389, 715, -2669, -1307, 1028, -443, -99, -681, -2766, 193, 1725, -2540, -2399, 350, -341, -408, -1474, -3401, -1542, 893, -1456, -3644, -153, 3363, 1514, 855, 2397, 2511, 3893, 2880, -753, 921, 3625, 1229, -672, -550, 287, 786, -1116, -3695, -3378, -723, -650, -3597, -3118, 46, 406, -121, -1359, -2600, 370, 980, -2589, -2166, 1163, 2947, 2513, 890, 1930, 4707, 4815, 1869, -408, 1754, 3512, 1054, -645, -197, -189, 592, -2227, -5080, -3209, -1887, -3317, -4333]
1350d333Q50L489K075k114j279K117K513j294k759J031J854N7k72k001J6K962
1366B912j782l201Q03J584J255j027k248J216K806o35l807j391K975k04k085K46
1382b583O26J878J518k742o20L278m25j519m94O01K031J558j213j928J553K466
1398C985k489k706J644N29L79L80k073J412K754l211l444J266L79j100j156n75
1414d026M08K444O55k682Q21L084r44l02J651o04K377K354k869K01K794j633k655
1431A074l82j137j14J128j991k536L077J139m285N83J451k603J703K125l317K874
1447a211M384l019n21L971p91j624K043j216j766M305p91m722L221J143n499J030
1463a063J329m477K351K658m700R39M464k822o63L578k715j888M697j508l012
$$ y = [-4333, -3483, 6, 2081, -33, -1312, 805, 3318, 2024, -735, 296, 2150, 2207, 1935, -66, -50, 2912, 1130, -2071, -1268, 316, 1571, 544, -1704, -488, 2318, 1683, -2124, -3515, -540, -744, -2829, -2583, -1957, -79, 1439, -1303, -1923, 1355, 930, -589, -1083, -482, 1549, 3107, 1894, -34, 1519, 3985, 1496, -1210, 434, 963, 1342, 1722, -351, 1061, 3815, 604, -2840, -1574, -1195, -2295, -3451, -4026, -3618, -1174, -519, -3201, -2380, 704, -240, -542, 1109, 505, 2882, 5236, 2367, 2568, 5362, 3729, 1074, 692, -445, -559, 569, -1422, -3958, -881, 258, -4027, -3444, -1993, -4596, -2893, -768, -4085, -1211, 3173, 154, -367, 3604, 2813, 1189, 3232, 2016, 250, 4555, 3764, -958, 2263, 3406, -2093, -1063, 266, -4211, -1860, 798, -3902, -2963, 1501, -1321, -1984, 1594, -1121, -3009, 1688, 180, -2832]
1478b832O009J36o265M021K362n387K850J648o429K718N315n160k00M602m702
1493a314k071O291k434m485N423Rm136O416R27o864L168K106n307K582J680o796
1509d805N36N052l044M6K972m566j003O760j008k008M615k372k078P788r21o014
1525e0M101j563o207O344O24q295L199L394o714L013N721q338j083Q785m817k657
1541d543Q957n568n475J1671j283r409P654J653q086P021M877r951L123P361q027
1556b5k12P810q596m654R286m783n763Q363l494p104R287J621p448N009K960n029
1572b772N020L726p338J890N832o448r93N357o632j342O969n041k409P281l952
1587h52l325Q331j851n395O479m54o214O376J343q889L813M974q935R34O058p604
$$ y = [-2832, 3177, 3313, -2952, 1069, 3431, -1956, 894, 2542, -3887, -1169, 4146, -1014, -1214, 3388, -1314, -3385, 2906, 472, -4013, 1410, 1419, -2717, 3699, 4626, -2238, 930, 3036, -2271, 311, 1991, -4805, -4269, 783, -2261, -2215, 757, -3809, -4812, 1948, 940, -1068, 3547, 1175, -903, 6885, 5964, -50, 4051, 2488, -3719, 2625, 3249, -5046, -1847, 1547, -5167, -2154, 3567, -4771, -5854, 2931, -1886, -4543, 4414, -1154, -6629, 5042, 3759, -5650, 2004, 3657, -4429, 2592, 7469, -2482, 641, 8002, -25, -237, 7573, -1023, -5677, 3609, -1174, -6937, 1426, -2068, -9172, 115, 1736, -5712, -703, 2257, -2772, 2248, 5974, -1364, 526, 6358, -90, -1083, 4274, -2358, -3700, 3269, -1772, -4181, 3100, -852, -4177, 4154, 2303, -3092, 3387, 2933, -3281, 3095, 4438, -4451, -638, 4336, -4599, -3665, 2393, -5211]
1603e211J793Q922q647l020J0188l333l357P864m651p201Q677K591p215M980J437
1618C817r773O113Q375q087k61M310q431K720J0218q274o537O467l345k411Q753
1633C654m230r911O759M824n028N568J921r934M905R186n501K87L704q639P64
1648a671J0743m303o793L281k578k682P879r70q692K824K155l696N584J385q548
1663f082K154N004l850K966K832o261L74O369k574o44M292m564k054O973j986
1678B949m536N296j805n426N897N12p196M573K375p229L004M506o274P24O290
1693C660n741k070P449l353l984O571j682n561P157J020o691M001K335n604L266
1708G73L717n623M2M283l531l54N158l915l800M762n75k868L310j735l638L562
$$ y = [-5211, -3418, 5504, -3143, -6163, 4025, 692, -2665, 5199, 548, -6653, 2024, 4615, -2600, 2380, 3817, -5956, 157, 8532, 445, 184, 4494, -3937, -1217, 9001, 727, -5810, 657, -2688, -5099, 3654, -576, -10487, -3728, 1096, -3932, 1636, 3557, -6377, -1472, 7714, 2213, 2500, 6204, -2435, -1671, 9072, 4769, -2024, 1257, -1321, -4003, 3876, 2906, -5786, -2962, -807, -4503, 1081, 2466, -6082, -3928, 1076, -2774, 192, 3024, -3237, -2863, 3506, 932, 288, 4580, 16, -2038, 4935, 2949, -1587, 3709, 1904, -3522, 2375, 2887, -4309, 264, 2639, -4590, -1586, 2920, -3354, -2630, 3660, -2081, -4151, 3298, -55, -4039, 2532, 850, -4711, 2446, 3466, -3225, 776, 3111, -2493, 773, 4490, -1133, -1091, 3192, -339, -693, 4465, 550, -3250, 1512, 937, -1931, 1379, -356, -3994, -432]
1724d32O92k819K219l80l133L021J872l416J337K676k646P78L690k217j054L182
1740C370j953o03L187k723k500L781j154k808J914p09l019K664J262l944Q40K470
1756G5k516K23L238k459p21L200j449n56L420j207k176K871K19j500J155j37k253
1773e73J234J694k595n20J640j770n00J892j685p12J565j126l89J990k37j034
1789a126P57J74j85R80J44j284N05J187j142L32J106j519j66J250r67Q3R34p59
1807C04k74M79j00nM24p64p60R04J17j374K81P57j604K53Q20p42o8O17p09O37
1827h07R27m02O87R51l03p4R04R3r75K93J87j169J93O12j691j15N01q13L03J62
1847e36n47K85K63k91j01M17J12o19j01P81l61L90N17n82O74R52P5J00J14J64
$$ y = [-432, 260, -2559, -340, -720, -3853, -832, 1040, -2376, -1039, 1637, -1009, -231, 3459, 1242, 188, 3370, 1417, 814, 4001, 1278, -1222, 2559, 1405, -1403, 511, -198, -3217, -553, 709, -3235, -2395, 75, -2441, -2218, 1020, -1439, -2160, 1040, -409, -965, 2455, 1248, -928, 1943, 2162, 662, 1817, 1680, -573, 661, 2355, -240, -760, 880, -890, -1390, 502, -1183, -1895, -330, -1456, -1845, 145, -92, -1126, -369, -195, -380, 600, 744, -540, -35, 1152, 10, 342, 1448, -71, -237, 1013, 46, 129, 1063, 304, 30, 509, 409, 404, 828, 64, -696, 208, 325, -1049, -768, -11, -1615, -1362, -542, -1284, -1352, -735, -1444, -807, 120, -282, 405, 1356, 1053, 979, 1883, 1976, 1001, 1294, 1481, 312, 505, 1117, -574, -689, -188, -1001, -698, -536, -1083, -798, -535, -826, -927, -510, -398, -1017, -1118, -337, -698, -308, 209, -373, 301, 1253, 1328, 1428, 1542, 1706]
1867A706K83o86k64N9o19m34q82o51M58n05m98R4J85J189J14l72J075O00j31M36
1887A157p35QM29q79m79m0K74n3l98L76J76L92J255m84r97J880K57j392j59j89
1907C99m08j05j148p38O00P25q56n11J413O61l96J025m31j67J894p78k048J158
1925B89M39j086k17r5k68J234N23q56K31K140p04r55J278m87q00P87j948j343
1943a838J563q68k147J98N07K56J246k69p63K303K040j569l9J992p68l75Q23j729
1961E63K69J676k426j191K361m15j594O13p98k48K526q58k897J378J809j983k4
1978a239N76k237J435J896k926J177L793k036j209L415n59j066K139j711k157
1993g09L323J82m726J649J584l416J333J170l812J797L739l960j235M692j226
$$ y = [1706, 1989, 1303, 1039, 1098, 479, 45, -837, -1488, -1030, -1535, -2033, -1939, -1754, -565, -451, -823, 252, 852, 721, 1157, 422, 430, 859, -20, -499, -539, -265, -318, -716, -340, -164, 228, 1483, 999, 2, 1882, 2139, 747, 588, 399, -9, -114, -1262, -2000, -1400, -675, -1531, -2042, -629, 32, -364, 661, 230, 63, 1957, 1179, -869, 289, 728, -358, -575, -670, -938, 296, 819, -37, 194, 2334, 1630, 675, 1953, 1466, 666, 1453, -495, -1838, -275, -1143, -3290, -3092, -2585, -2329, -1083, -1352, -2115, 188, 2228, 659, 620, 2612, 1844, 1469, 2292, 563, 832, 2508, 82, -1109, 1252, 837, -757, -144, -942, -1190, 1336, 478, -2419, -1041, 768, -1215, -1239, -663, -2900, -1465, 431, -2495, -1318, 2475, 439, -770, 2645, 2086, 1020, 3159, 1448, -709, 2614, 2796, -1930, -281, 1303, -2113, -780, 390, -3422, -1625, 2114, -1846, -3081, 1611, 385]
2008C85k039K351j158j674L249r7l645L005J898l616J448K033k686P55K034l050
2024h07J145L118k790j812K239k60m59O47k576j537L904mk659J619n74k058L655
2041G91L79l942K409N20l477L331L561m081n62K865k141J395M057n011l558N842
2057B378N08l343K961j877m757M947J978n474J749J642m757K099N463m070k449
2072c002L168k298l37O088k708n355M466J657k002L898q51n332L354K844l532
2087E8J104J621m292k9M304k537j724K412l134j593M941j103l116L312n19k317
2103b612M069k52l887L065J180l723K077K495l237P63K545l349L09L952k985j438
2119a028L531k764j084M538k255l549L675j269l114M126J31m847K541K387l153
$$ y = [385, -1654, 697, -461, -2135, 1114, 1017, -2628, 377, 2275, -1341, 107, 2140, -546, 209, 2243, -807, 338, 3456, 666, -1146, 1093, 833, 374, 1021, -1555, -3092, 812, 808, -1851, -232, -806, -2864, 791, 1170, -2772, -363, 157, -3320, 11, 3572, -509, -1071, 1794, -347, 1048, 5105, 94, -3464, 2378, 2886, -457, 2504, 627, -4130, 817, 2795, -2679, -930, 712, -4045, -1946, 3517, -553, -3002, 166, -2132, -2469, 3619, 911, -4444, 22, 1679, -323, 3575, 2724, -2608, 746, 3590, 58, 1162, 2783, -1509, -1538, 2766, 229, -1495, 917, -2217, -3810, 1131, 28, -3088, 224, -295, -2612, 1457, 1205, -2682, 383, 1563, -2160, -83, 2412, -825, -62, 2483, -866, -557, 3395, 410, -1028, 2503, -261, -1345, 3193, 938, -2611, 1064, -205, -3319, 807, 938, -3909, -1368, 1019, -2134]
2134b134K387K600n613N08N272l333j116M522m288j879O436j237l895L305o63
2149H72l812M583K099n448J130L307m386J087L988m905j940M655k617j144L879
2164A348k352k306M221K97k892K075L43k749K653K077l490N82J953k206J051K007
2180B612l264%K308j858L05K011k594o44K433j653j214K188j356k527L418N66
2196G31l059K161P38k769K864J581l985J485K545k893L05L009l086j338L743j421
2212F11k500L271j43l400K896J605l303J472J190l547J320K244l177n93K627j734
2228a161o70K351p87j546K226j23j803K247P07k090J338O88j736J357M69k004
2244e37N93R55j095O4J041j027k2J287j047r04J408o03j927J612k14j472J313
$$ y = [-2134, 253, 2853, -2760, -2252, 3020, -313, -1429, 3093, -1195, -3074, 3362, 2125, -1770, 1535, 872, -2940, 1643, 3742, -1706, -576, 2731, -1655, -568, 3420, -1485, -3425, 1230, -1387, -2531, 1348, -1004, -3310, 911, 1208, -1684, 391, 734, -2015, 638, 2715, -775, -193, 1760, -446, 605, 2612, -652, -652, 1656, -202, 103, 2114, -480, -1124, 1309, -344, -1558, 630, -726, -3253, 165, 731, -2328, -167, 571, -2198, 666, 2247, -1738, -253, 2292, -601, -296, 2713, -373, -1711, 2032, 611, -1889, 1382, 1239, -2161, 735, 2340, -963, 509, 1699, -1848, -528, 1716, -1461, -2054, 573, -1161, -1831, 520, -267, -1813, 413, 290, -1513, 734, 1441, -649, 689, 1377, -359, 998, 1467, -537, 56, 1011, -84, -20, 1021, -6, -28, 1259, 212, -692, 716, 113, -1814, -202, -416, -1888, -575]
2261e75l4j619J840O06j210R14J098j124P32J094j103Q9J317j262j171J878q44
2278F26j313J095k26j292J441Q3j311P71K62j251N45O99j287O7R63j095j98J792
2296C71p20r91J547K75n99J378J20q35R92J0p41L02J60j261k26N61m65o32O17
2315a37o49m82P92j87m05N22l48k15R09r6k91M43j53L7L06L76l4J21N33l79N36
2336A199K62o10l1L30q40j02L77r04k91K59n07J60J34l95j01J40M39k78L40M83
2356F4n50K47O28m03K34K96m23K42J90L5J33n9L8jl9j42j82j13Q4m14l02L26n48
2379f59L2K01j98j73L10m0j30j75L17L32j57J21J56J11M59j12PN31n1j30K91r4
2401I49J4l03l24j0k96l08o5j89m50M0K95p6k59M49J32k53N37L07m15N73K34o66
$$ y = [-575, -609, -2228, -388, 218, -992, -78, 1020, -104, 628, 1722, 619, 708, 2025, 763, -408, 1470, 626, -687, 408, 182, -1110, 331, 414, -897, -126, 136, -1115, -570, 129, -1158, -1091, -128, -1223, -1421, 371, -349, -1340, 207, 482, -117, 1261, 1381, 546, 1538, 1548, 807, 1109, 1269, 8, -218, 343, -122, -754, -137, -786, -1268, -476, -663, -1068, -546, -894, -1109, -200, -296, -587, -144, -297, -260, 46, 422, 388, 509, 1042, 663, 1199, 1461, 851, 820, 1150, 310, 208, 585, -319, -610, -351, -858, -698, -564, -959, -1060, -920, -481, -759, -419, 64, -486, -239, 389, -14, 220, 516, 93, 335, 525, 560, 693, 634, 672, 671, 632, 490, 308, 195, 279, -135, -437, -111, -659, -627, -426, -624, -797, -487, -527, -657, -832, -515, -183, -340, -219, -63, 48, 507, 395, 402, 933, 882, 752, 1043, 949, 963, 660, 336, 326, 30, -278, -343, -532, -982, -942, -647, -723, -982, -533, -401, -654, -117, 190, -225, 348, 582, -84]
2423h4K52M39m75J51K02j02O3M75k38k70N44j53q46M35k11p34M84j92q59N05J87
2444d27o39K68K96m00K04O00m5pQ20l80m57Q67j25j009R10q0p62J036K77j092
2464a45P05L22o02K28L88p03n99Q19p03n89O68r33o24J319j97p34J015r6l89J197
2484C47M35n69O05j83m95Q11M09j063k01P17r37M68R29j760l82J546r56m50J446
2503G17j212r52J638q2j381J287k19j809J458J290j431K47J587j572K96K482j982
2520C62r28K114j090j066J720m83j497J402J46j892J255R75k024J39J682j404
2536e89J30J432j542m54J852j224o67J560q58p89J325k61n07J460n3j786J007
2553C6J226r97N41J44j923J113J594j819p1J270j786M0J820j030j161J534j245
$$ y = [-84, 168, 607, 132, 283, 485, 383, 446, 921, 683, 413, 957, 804, -42, 393, 182, -552, -68, -260, -1119, -614, -427, -1066, -798, -502, -902, -698, -98, -143, -150, 670, 290, -167, 700, 575, -434, 476, 396, -366, 670, 947, -145, 560, 882, 280, 508, 896, 193, -406, 413, -290, -879, -211, -1144, -1768, -449, -646, -1380, -365, -461, -850, 347, 782, 213, 818, 635, 140, 951, 1360, 297, 96, 813, -124, 344, 1273, -487, -869, 677, -279, -729, 717, -495, -1447, 191, 109, -1272, 15, -204, -2013, -555, 735, -696, -449, 1138, -434, -138, 2344, 362, -566, 1548, 458, -608, 1112, 629, -868, 534, 680, -1212, 43, 1018, -1006, -867, 815, -589, -459, 973, -569, -1023, 829, -395, -1062, 498, -360, -1149, 176, -85, -592, 868, 815, -971, 36, 1262, 265, 806, 950, -973, 140, 1734, -85, -156, 1114, -672, -632, 1188, 158, -1003, 531, -714]
2570g14j094K614j89k503J148M79j400K116N61k927J414K082j985L41K016k072
2586a13j26K361j535j026K222r69k153K103O16k746J470K48k229K010J077l129
2602a919O01K143k015lJ804j476n24K704j384j478K582O3k097K123L46j848J493
2619A115N25k073J103J252k862K37J774j182k73O85j574j07K125r99j318J531
2635d1l36r38J691l11j307J980p61j389K197O69k127Q38P73j432J498J435k866
2652d27j25K512j593o23K034j860j698K585p68k083K462m1l034J827J560k274
2668a546O41J680k299L41L068j798j449K737p30j242K291n06j775J948N0k177
2684g66J740L17j835M7J163j150J3R59j734O1J465r76q03J284n45l20J396p13
$$ y = [-714, -1808, 806, 617, -1886, -738, -259, -1659, 457, 1018, -1909, -495, 1587, -398, -57, 1959, -113, -239, 2122, 587, -439, 1783, 814, -1339, 764, 1380, -1366, 104, 352, -1877, 133, 1210, -1919, -1318, 825, -1190, -1193, 611, -865, -1389, 1315, -69, -1547, 1035, 1098, -999, 1124, 1470, -378, 1115, 1640, -433, 670, 1922, -940, -703, 1071, -111, -384, 301, -1273, -1380, 745, -254, -1572, -41, -377, -1315, 376, 65, -1242, 738, -23, -1412, 785, 1454, -673, 165, 938, -494, 1004, 2439, -427, -552, 1960, 367, -256, 1778, -82, -1780, 805, 37, -2046, 416, 375, -2659, -832, 728, -1546, -905, 775, -1524, -1183, 1885, 87, -1362, 1375, 645, -597, 1694, 1188, -587, 1361, 1411, -766, 974, 1291, -544, -497, 666, -484, -471, 488, -1246, -1185, 280, -696, -1499, -215, -760, -1080, 316, -397]
2702c97n08J685l33q64J399qq70J095R1j423J042N84j879M41J455j927l65J370
2720E88j690R8J502j292p71J983o22j046J501j44j272J410N78j854P88J341j800
2737g02L34J446j295n8J429r27l09J542n24j178J134R1j323N17K87j514P36P43
2755D29j737L14J021j024K79N73m93J6J035l95k15O17r8n35Q19O9r73M51J19l77
2775a05O64M16q75K79N44p38L09J67j107k5L37n49j47M07p64k79Q29J02m73N99
2795d09Q8j05J211P4n07K88K43n03J27L60p42j3L64l85j67M92n35n26O54Lm99
2816d87P10j28q35M98J69o30J56J4l67K12L50rJ36N26r2j75P85Ql22J00J24j53
2838E90k21J27m85O7m7l03m4K6J08j09J3L0J16J53j19l75L45j81k20J99j17k8
$$ y = [-397, -905, 780, 447, -417, 982, 974, 104, 1199, 1290, -133, 909, 1493, -386, 55, 1510, -417, -782, 588, -1102, -1004, 498, -794, -1565, 418, -204, -1250, 251, 107, -1165, 245, 823, -1031, -243, 1098, -702, -368, 1078, -217, -275, 1154, 227, -82, 1460, 936, -242, 892, 983, -340, 177, 464, -1050, -314, 429, -1308, -994, 27, -997, -718, -145, -638, -622, 413, 18, -197, 420, 322, -213, 606, 675, -298, 153, 272, -105, 559, 975, 100, 379, 923, 185, 494, 661, -446, -471, -134, -683, -830, -423, -1187, -1466, -637, -535, -1008, -409, -321, -426, 785, 859, 352, 640, 883, 380, 507, 867, 125, 112, 476, 91, -76, 416, -119, -645, 9, 12, -487, 223, 95, -740, -242, -73, -703, -547, -533, -900, -688, -338, -347, -211, 315, 223, 48, 833, 841, 519, 619, 743, 590, 369, 496, 11, 78, 31, -272, -316, -290, -182, -291, -278, -248, -132, 21, -98, -473, -128, -309, -529, -330, -447, -475]
2860d75M11q5n6L27R7R2J14J78q6J78J16k19l95M42l91n00J09o8n6j1l62J07L93
2883a40k49k4j2J01j9J74N8j48J11L28k01m5J86K71k32L22R2j55J92r7j08rQ1
2906D77q0m71J1j58k17J82m20O5K06k63L8M19l03NN32j62o1K91j6P3J15P4r8K70
2930E09Ok48K10K08l81J34P3m83K45n1o05J72J13k88q3k50J84K8j04K42j31K30
2952b70K03m84N11L18k25K75L11o14J48P12o22KM52l32j24L59l12l40M45k33q23
2973f43P13r4r11M03L36o57M44K47p18K40N35j18j15O96k53k64P01M23o63N70
2993H72j22o17M41J35m46J79L3q30L64J28n38N8J11n10Q0M71n50j16M63k39k13
3014h46J015l30n20J024j63l56J060m7o27L66N66r96L83N47j085P1Q56r15m99
$$ y = [-475, -64, -149, -205, 122, 219, 311, 425, 603, 517, 695, 811, 592, 197, 639, 248, -252, -143, -211, -267, -278, -640, -533, -140, -389, -413, -425, -324, -343, -169, -111, -259, -148, 180, -21, -66, 120, 391, 159, 481, 573, 418, 610, 513, 405, 396, 477, 397, -74, -63, -221, -438, -256, -676, -611, -405, -668, -630, -211, -514, -509, 23, -139, -200, 91, 75, 148, 263, 337, 239, 509, 515, 267, 477, 685, 304, 438, 511, 28, 273, 222, -383, -211, -98, -386, -469, -719, -535, -507, -611, -369, -500, -270, -67, -551, -40, 278, 53, 328, 639, 25, 173, 885, 263, 265, 717, 385, 261, 620, 308, -32, 413, 180, -643, 70, -24, -935, -532, -196, -853, -409, -162, -880, -640, -105, -223, -338, 358, 105, -159, 542, 965, 302, 872, 750, 133, 574, 709, 263, 442, 475, -355, 9, 137, -401, -343, -232, -742, -662, -191, -741, -857, -394, -633, -846, 169, -161, -681, 343, 180, -176, 884, 837, 210, 576, 1142, 146, 529, 1076, -9, 62, 918, 3, -496]
3033d96R58o24p33R84m28r64J264m6j082O40N61q26M33Q15r97J63Q97n32r1J286
3053A182o51n85J088l04o86J020k89j129P66k0p64L58K52j131J19O75o80J2P59
3072hr65n7R75l29j67Q86n56l59J258r8n87N25k47l97J234P2j143L97J95q95Q30
3093E64N54j526p9Q45j118J01J228j555n76J350m84k42J158l55j080J582L08j273
3111e98J051N62j565P36J301j431L1J208j452j04J448q46j120J374j98j294J300
3128D03K11j539N29P74j395L91Q00j155L60J026j053N4J152m97l58O83j95k19
3146b8P54Mp17O12j5o22P05q3r22N31J04r80Q45J15r75K86N25r95M57O39j215
3167i75LJ337m70p81J247l72r43J657j09j336J319O47j564J011P40j566K58J169
$$ y = [-496, 462, -162, -895, 89, -339, -1303, -39, -85, -1167, -527, 34, -792, -359, 456, -541, -378, 519, -13, -104, 1182, 531, -54, 1034, 730, 44, 1064, 775, -354, 412, 392, -372, -14, 238, -893, -774, -99, -779, -767, -8, -973, -1030, -55, -384, -551, 335, -221, -580, 678, 580, -7, 518, 271, -126, 1108, 1180, 37, 434, 629, -266, 564, 1118, -408, -487, 358, -760, -659, 569, -986, -1562, -212, -696, -938, 220, -135, -1215, 367, 675, -598, 453, 1015, -550, 186, 1487, 56, 87, 1295, -157, -261, 1187, 341, -779, 595, 397, -897, 403, 614, -925, -396, 378, -1017, -626, 174, -981, -621, 405, -648, -594, 558, 61, -297, 386, 191, -28, 726, 730, 13, 625, 610, -12, 693, 610, -312, 219, 323, -657, 188, 303, -672, -386, 139, -856, -399, 240, -975, -972, 365, -105, -886, 361, -11, -954, 703, 594, -742, 577, 1224, -340, 671, 1411, -155, 103, 1272]
3185A272j075o34J240q58q32J582l60j600J105J78j085R91K74j483N48J028m99
3202b08kN43q63J48R20k39l22O91n87j61Q44K02q35L27l77k55J027k90r12L7K83
3223b9k27M17j48q85J69O37o12J36P04p12j67J052m58n9P96o79n20J151J35o15
3243H6L60J74p34O77N33j158OP69j028j60R19o83k87O62p30k95Q43k49q78O17
3263e56L15m10N39K30l26K25P89q97J9J009m98m76Q87m94j10O81n47m51K57K32
3283D18o24k29L37k71j06K95m46J58L00l75j30N44r3qJ97j98J27M14j58P1J78
3304D01k33L53J68j77k20L59J6o61J88J72n51Q5j48k72K90K5m31p4M52k00n0J86
3326c22j07n5L29p6n0M73K26l81K74L34j26J65L9l04j4K22j27l10J61k86k28p1
$$ y = [1272, 197, -437, 803, -55, -887, 695, 335, -1265, -160, 18, -1067, -76, 198, -1285, -737, 291, -208, -210, 333, -530, -382, 538, 299, -23, 668, 81, -80, 764, 966, 131, 458, 81, -174, 853, 563, -349, -312, -29, -256, 161, 13, -872, -703, -66, -678, -542, 162, -550, -717, 335, -123, -182, 614, -65, -585, 566, 701, 86, 446, 620, -114, 563, 1096, -62, -56, 713, -315, -475, 444, -239, -526, 136, -594, -889, -46, -295, -1173, -556, -241, -651, -112, 118, -208, 17, 806, -91, -72, 937, 439, -37, 850, 356, 246, 927, 380, -71, 186, 418, -206, -435, -98, -369, -475, -180, -626, -468, -168, -543, -673, -129, -222, -230, -33, -231, -104, 310, 152, 223, 401, 168, 521, 689, 512, 292, 651, 667, 6, 194, 366, -185, -100, -248, -520, -230, -205, -636, -710, -258, -458, -508, -322, -429, -484, -155, -231, -281, 192, 418, 37, 311, 645, 519, 684, 723, 419, 405, 627, 500, 190, 351, 65, -163, -234]
3348b34p0n9j9M6n66Q0L60p4O5J13k7J68K29J8l9K27O3Q2L9K20j60J11o5j35J36
3373E09o8l49Q6k69k56K83k30j19j20J46k27j16K29Q8j83L05R0QJ85J15k27L91
3395B71J67m0N8j00N1l1J0J43k19k7m9j31o5M3k02n0j22k62J98n0j36Q2K27k13
3419d47L35j28P7O5J18L6J76J7K36j22J27j03NK00n6k45K19l01k58L29k35k6k32
3442b13Lj80m4q6j55j4K32m5l3K83J01k5J53J19J60P6L0P0J87j06m8l4p2q9r3
3467A77J59k55rK55n93oK11m56K55J78n36J26L94l36j2L02j1j73K57J72j28K70
3489B41K02m00L32K73l32J0J88l47M5O8j53j69K72l66r5o5L3r9J4L42m96J48L37
3512a7l80J62L39n92K39L65l28J89M03m11J28N17k09k14M90k45j99M25j86n31
$$ y = [-234, -304, -363, -382, -336, -902, -822, -462, -536, -471, -358, -385, -217, 12, 30, -9, 218, 281, 363, 402, 622, 462, 573, 508, 373, 509, 441, 92, 178, -91, -347, -64, -294, -413, -533, -387, -614, -730, -501, -413, -596, -291, -201, -193, -8, 107, -120, 271, 438, 398, 456, 356, 407, 376, 386, 529, 310, 283, 234, 103, 38, 81, -121, -171, -293, -555, -357, -407, -543, -461, -234, -447, -112, -240, -163, -98, 20, 56, 232, 249, 485, 363, 490, 387, 392, 592, 536, 291, 510, 209, -49, 280, 45, 19, -213, -210, -390, -434, -520, -675, -689, -457, -502, -535, -252, -151, -176, -23, 96, 256, 332, 362, 432, 619, 513, 465, 431, 359, 270, 177, 336, 81, 72, 327, -266, -272, -61, -517, -262, -84, -620, -494, -100, -436, -448, -146, -157, -330, -73, 99, -29, 241, 443, 43, 375, 648, 316, 326, 514, 167, 212, 280, 127, -42, 230, -136, -231, -296, -263, -362, -348, -6, -502, -354, -17, -397, -235, 104, -488, -249, 116, -212, -23, 380, -31, 97, 614, 405, 191, 681, 436, 237, 662, 476, -55]
3532e5K39j00l78K24j02l46K30Q4m67J6O23o95J56L71M8j00M40r8l96O72M2l83
3554B5L67K33m30N17O1o24j3N09n50l03N12l67n58O87k81n19M90kn36N22J68n13
3576f05L43L80m25K84K7j53K94N80m28kK46j73l76P52k58m33K07q8k59M40o4o95
3598d06M45p3m21L11J73o98K77J51l18O0M42l75Q5O24m98j49Q27m80N8O57j67
3619E25p65Q85J47p31M21J56r41M69O10q96j46M34o41j67J024p61p17N94J92m87
3639g95R87k16q98M90Q61n95M10N47r98L0J173j67m86L00k92m96R56j35o50K7
3659E3k91j11M46j54n75p1Q4j85N01Jl24O9K94j47O04M28p54K13M43k48K27N52
3681A055o74o3M58l49l32O42n95o66M88K91r59N14L88j166K84Q46p62JR18q86
$$ y = [-55, 184, 84, -294, -70, -172, -518, -288, -204, -671, -655, -32, -727, -571, -200, -152, -252, 188, 90, -306, 366, 408, 25, 392, 625, 195, 712, 773, 149, 136, 645, 95, -208, 304, -63, -621, 66, -215, -734, -244, -246, -782, -260, -92, -605, -262, 118, -307, -23, 4, -149, 145, 725, 297, 295, 541, 368, -8, 744, 486, 53, 260, 172, -87, 353, 289, -406, 39, -34, -455, -144, 29, -669, -392, -241, -559, -499, -57, -432, -347, 277, -221, -370, 457, -23, 35, 692, 525, -240, 645, 792, 61, 482, 638, -303, 166, 776, -120, -266, 168, -473, -640, 384, -377, -1094, -500, -308, -795, 192, -24, -922, -432, 429, -166, 244, 791, -207, -177, 996, 829, 343, 643, 351, -145, 811, 676, 26, 53, -238, -349, 97, -57, -632, -703, -619, -804, -303, -302, -626, -557, -263, -410, 194, 622, -132, 81, 524, 276, 503, 1055, 381, 318, 776, 427, 95, 737, 142, -524, -36, 255, -704, -190, 198, -968, -684, 162, -600, -599, 319, -567]
3701e67k39R71J52p39P26p1p32Q00N03p56J20L74o74L98O42p01j22K37k88M3K56
3722C33j72n19M7K01k30P8j81m69N47K29l73L21J37m13L57J47R3j15K60j79K23
3743C22K21k07L4K49j55j4K65l23l42L29l07m92K33n4n69M56p4l17K72R7l21J50
3765e47N21k66r1Q29j18j60O62k31m49N03J45o34L17jm10R8J03m23m5K67m75j75
3787e80M88k67l02L39nj82K67K22m66L71K58j46K4L69j12R2k1J27j65K93k65k57
3809H2K58n2m1j28k5j44K15k18j97M9j56J5K73j49n8J4Q7j83K18K39l79P6L76
3832A72k62K42K03p0l26N81J7l16K24o5k46J18O3j89k6mj36j86J91k08k57L25
3854a55l28p4L06q6p5J22J48O4k4L6J54J90M3J7J30J57j74j09L0j29Q4j11k04
$$ y = [-567, -806, 165, 317, -422, 304, 233, -499, 301, 804, 48, 168, 542, -132, 266, 908, 207, 85, 322, 34, 77, 333, 161, -358, -311, -110, -340, -262, -443, -912, -365, -136, -509, -188, -51, -464, -107, 40, 133, 18, 278, 99, 322, 543, 336, 370, 619, 464, 450, 715, 392, 50, 379, 72, -420, -187, -241, -810, -354, -428, -745, -473, -376, -697, -547, -26, -292, -383, 446, 328, 168, 830, 599, 150, 653, 798, 164, 481, 480, 70, 168, 271, -152, -197, 70, -405, -580, -92, -359, -661, -322, -327, -509, -242, -20, -486, -115, 143, -3, 21, 390, 278, 370, 349, 476, 311, 604, 339, 82, 340, 288, 247, 119, 94, -50, 165, -53, -250, -201, -357, -342, -69, -218, -276, -262, -175, -358, -140, 99, -280, -204, 172, -90, 152, 355, 285, -41, 540, 557, 241, 465, 400, 154, 272, 335, 146, 120, 116, -20, -206, -15, -223, -480, -155, -483, -557, -251, -337, -412, -290, -142, -78, -102, -66, 88, 278, 321, 338, 468, 625, 451, 342, 372, 243, 327, 216, 12]
3877A2o3K54J9l53j66JlJ7j24O2N6j28J35R6K08k01J91j08K06J33R4l3o3K27l3
3902D36Rl04K86m5j40j42j00N1j39n1k1j9k99K78o3l80L01J1J00j85J95J01k4
3925a44O5J22r5L07J19k10J78J6K2J04k13O5p8J44j94j19o7o5k38k9L2n1pj55
3949d91LL9Q2n8L28k42O5L47J8n1O4R9J58p1O6J48j18N7K2j47J02k01q2rk20j19
3975b11Q9k25Q1l1j74j8nQ8r9J01K75NJ66k8j3K20N5J67q9K52k94n9N06l28j40
4000B91J98k80k02j34J86k98j16Q5j4k66L59k72j6NNJ21K30r1J5K05J03K6J8J60
4024C18P8J49Jk30J77Pk76J4P8k67rlk28p6J09k92n2K52j66k59L39J8m2K50k0
4049a30j5R3M67m32L33L04l22J03J90j86j10K31o8n10K57k4k19P4j21n40K71L41
$$ y = [12, -51, 203, 222, -131, -297, -296, -299, -282, -406, -344, -288, -416, -281, -185, 23, -178, 13, -95, 111, 244, 338, 305, 242, 469, 436, 445, 141, 427, 382, 242, 100, 0, 51, -88, -139, -160, -179, -478, -200, -263, -643, -342, -331, -231, -416, -221, -120, -144, -79, 43, -52, 255, 374, 164, 342, 358, 380, 484, 271, 336, 258, 402, 208, 89, 22, -43, -281, -310, -278, -329, -336, -491, -488, -449, -367, -425, -97, -339, -274, 73, 91, 40, 104, 203, 361, 290, 356, 504, 386, 443, 465, 318, 420, 219, 137, 128, -92, -211, -122, -347, -266, -297, -471, -489, -494, -406, -505, -404, -129, -124, 42, 14, 1, 221, 276, 443, 354, 606, 312, 253, 759, 431, 291, 489, 209, 7, -127, 59, -239, -355, -270, -284, -550, -191, -463, -479, -474, -469, -348, -118, -209, -194, 11, 114, 140, 158, 318, 396, 545, 546, 316, 493, 500, 224, 238, 316, 49, 40, 37, -191, -267, -158, -450, -502, -250, -416, -675, -336, -318, -360, -110, -130, -145, -52, 415, -17, 316, 620, 298, 401, 591, 405, 295, 526, 458, -52, 205, 181, -38, 36, -85, -625, -354, -13]
4071a3n51n4L28m28J99M79k99j58M89j47%N10k25l6L65j8k52L55J44n34J5M12
4093E81o09K94J10m06k57L77r8k80O6n7k57L92k29r3N1P0k19K93J63K3K65n4j64
4116c8K71L54l23L10j01l32J73J81k90p2L9l45n2P02n13m81K59n3m08O87j9p53
4138h04K23M08n06N97M11p84J81P40l07K6O86l57o94P63J53o16M33j19n24J14
4158B4L20l42k45K68m04J9L13Q0n41L09j39j53L38K52l58R4O1J28p4K84R4k66
4180F2J34k15N55j09k09L9q0l8K07J5m40Q1P2n62K30M32o18j03M36l65j43P15
4202I6k39n01N79n4l55M23N76q46J73O57k77j44P12n23n07P44K8l91K28R4q34
4223c61M75K35n43o1L84n44k19P73l43k57K46j46j46M17R1j17j03L83j98K35L74
$$ y = [-13, -564, -618, -290, -718, -519, -40, -339, -497, -8, -155, -155, 355, 130, 94, 459, 441, 189, 544, 688, 154, 169, 581, -28, 266, 376, -30, -287, 90, -8, -288, -222, -279, -536, -144, -373, -466, -415, -345, -564, -271, -108, -85, 180, 126, -38, 233, 587, 264, 574, 473, 141, 314, 495, 205, 133, 172, -173, -225, 477, -36, -517, -258, -311, -719, -32, -51, -804, -581, -173, -679, -82, 329, -455, -274, 466, 159, 185, 871, 514, -180, 583, 736, 120, 553, 434, -90, 24, 344, 2, -243, 25, -379, -360, -47, 33, -508, -199, -338, -491, -153, 99, -259, -165, -104, 24, -50, 234, 328, 62, 196, -19, 536, 427, 218, 257, 177, 139, 346, 361, -79, 2, 74, -488, -258, 174, -444, -547, -111, -476, -619, 96, -143, -644, -65, -119, -474, -51, 525, -321, -148, 509, 232, 88, 800, 277, -230, 514, 542, 151, 379, 473, -361, 114, 349, -194, -255, 129, -415, -634, 139, -204, -461, -215, -361, -507, -90, 1, -116, -219, 164, -34, 201, 575]
4244E75k98k23M36k59J93K16n08j10J14N5mo0l40qj35l9J74j95l5LK31j96J22
4267b91J68q0j55M41M9k21N33r4m39M39L02m61J30L70m39j90L50k88l53N40n08
4288a97l46M07N4n02J90J38l61oO20k71k47M61l5j30N06l9l17K84J78k66J29N20
4310G70m67M5K71l45j01K77k13l86J8K0k03q7K03m52J08J50j24J44J43j60J07
4331b82k4K38J12M4J81L1MQ1K70j82r4k0M6k80L94k25k05k68K97l34j56M09n54
4354e17l2J61N5k43K31O2j08K67L22k31O9K52j37P1J86Q1k33M0M3k11J16R5j80
4377A59M9o0j57p5N7j06n0l8Ol30J85P4k4O2M9r0K55n4J82r1J75J26n6J70M2j13
4403C47o5P8l4j8r6j19j5j66L3j26NP6p4j60n5L4k03J30rL3K13q7M9K62l8M1J67
$$ y = [575, 277, 54, 490, 231, 424, 640, 132, 22, 136, 191, 187, 127, -213, -221, -356, -395, -221, -416, -451, -448, -217, -413, -291, -123, -203, -358, 83, 132, -89, 444, 350, -89, 350, 652, 191, 321, 691, 252, 62, 412, 124, -229, 311, -197, -543, -136, -82, -584, -394, -256, -617, -623, -3, -274, -521, -60, -95, -225, 281, 242, -75, 209, 387, 121, 250, 770, 303, 348, 619, 274, 173, 450, 237, -149, -131, -111, -314, -401, -198, -650, -542, -392, -516, -372, -229, -389, -282, -306, -68, 44, 88, 269, 300, 304, 385, 655, 473, 379, 359, 405, 125, 519, 294, 89, -179, 118, -216, -372, 37, -517, -549, -388, -333, -576, -345, -283, -391, -124, 198, -33, 36, 288, 151, 222, 408, 489, 256, 296, 339, 128, 244, 339, 159, 208, 148, -9, -84, -27, -133, -183, -221, -215, -545, -360, -286, -310, -248, -199, -289, -34, -88, 94, 3, 178, 304, 248, 418, 460, 347, 282, 360, 326, 308, 212, 93, 78, -88, -55, -181, -176, -100, -174, -334, -389, -355, -558, -428, -437, -404, -191, -278, -229, 33, -5, 36, 203]
4430B03J28J94k01OJ79l2R0k93J0j24L9k10O1k36j32r9K65j15o2N3r5%mK07j24
4455b92J49M7J57J01o3J37k10J59K47q7j63K51j10L9n9j05j32K8j62R6k31L2n3
4478b24J8O1j67J78q0L9L5L7q1K07l6j59L41j47L9K20N3k49J92J64j71Q0k7j02
4502B21r0J29m5m32J77j6k64K74j13o8n9J52l50Q9K53L3r7K72k44L7K52k7N1K54
4526C89j08KJ4O8j09J08j11n6M2j14j32j39J52j78r9J14r7n2Q1k07K80j8k90K35
4550b25K04o4K7J34j4J47J28p0R9r5Q4n7J61J05m60k4L67n58J77J6l56q2L28m14
4574d42J55K06l57m8K53J24l27J58K63k24J38M94l01j61M29N3k01M10k97l01N03
4595E27p5l98L03j90l89K18M7k52p3L09m38p3K01L0k07L85o1j40J46P0K5J57o2
$$ y = [203, 331, 525, 324, 330, 509, 477, 567, 274, 284, 160, 199, -11, 50, -186, -318, -417, -152, -267, -329, -276, -371, -371, -375, -168, -292, -143, -96, 61, 162, 99, 236, 26, 185, 432, 345, 182, 433, 323, 362, 303, 198, 66, 94, -68, 28, -203, -171, -224, -206, -145, -312, -134, -214, -175, -140, -103, -184, 23, -13, -172, 169, 22, 61, 281, 334, 85, 277, 441, 270, 350, 323, 221, 131, 260, 215, -217, -40, -56, -320, -46, -159, -227, -286, -134, -484, -395, -142, -109, -206, 66, -178, -141, 111, 84, 135, 389, 281, 283, 297, 365, 256, 364, 253, 197, 239, 125, -7, -146, 6, -172, -271, -157, -254, -306, -225, -432, -152, -170, -460, -225, -21, -85, -58, 76, 62, 209, 337, 267, 366, 271, 355, 298, 459, 564, 104, 80, 447, -111, 66, 82, -274, -356, -28, -442, -287, -81, -438, -486, -233, -109, -436, -278, -15, -239, -101, 393, 92, -69, 360, 413, 212, 622, 325, 24, 527, 452, 54, 357, 167, -222, -4, 43, -209, -282, 27, -411, -484, -283, -253, -460, -75, -136, -276, -130, -60, -35, 122, 60]
4618F0J1LK17O7k9J10j53K7J46l20J52r8l72L02k06k83K73j14m90K14L86l96j49
4641f42N72k62j76N83l4m19P15k21k91O36M66r02J60L71n71L69L12n62j02L60
4661C62j84l81M44k63o49L54K29l82k6M37p64K08O27j30k03M16j29k79O13K17
4681E17l83K98J01l66K37K00k87n7lj86P4J2k57n5j0m0K9j56k0J18m5j61P3J61
4705b06Mq5M23k27j39O96j55k45L66j67j83M28J94n82J44J17m66Q0L15m06l05
4726c99N89l59k37N68m28m21M94J93n63L31J95l45K45N45n00J02L22k89m5O61
4746F59k30l91M52n2k26N3J16m01L5R4k06k60K63L1k36j6J4k73M71L1p4j25Q1
4769a90J22L2K06j11N1r2J36R8j1j02J60j86J9M16l89k82K09j22j67K60pm43L8
$$ y = [60, 71, 74, 291, 358, 329, 439, 286, 313, 459, 139, 291, 193, -179, 123, -83, -366, -93, -207, -697, -483, -97, -493, -642, -70, -332, -508, 75, 41, -378, 337, 116, -175, 461, 927, 25, 185, 556, -15, 354, 666, 104, 2, 362, 178, -203, 241, -22, -671, -317, -88, -470, -496, -59, -823, -615, 12, -118, -321, 95, -34, -313, 300, 517, 134, 432, 533, 167, 404, 604, 317, 260, 257, 71, 145, 157, -100, -155, -165, -205, -176, -332, -352, -234, -279, -440, -367, -206, -202, -287, 136, -91, -230, 466, 311, 66, 432, 265, 82, 510, 704, 122, 266, 383, -83, -3, 312, -94, -399, 190, -169, -406, 162, -266, -687, -193, 0, -563, -232, -37, -382, -137, 408, -92, 10, 332, 43, -2, 659, 429, 38, 490, 438, 212, 265, 381, -20, 15, 109, -97, -357, -94, -63, -299, -315, -301, -574, -103, -72, -146, -271, -190, -68, -36, 170, 59, 110, 18, 154, 252, 241, 139, 299, 113, 132, 548, 159, -123, 86, -36, -203, 57, 50, -393, -355]
4792c55K05k90Q3L23l81j85O50k2k40J61P0l96M15N09m34j01M54m22K22L49l26
4813B89k45J54j35j42L07o6l91N2J84k33J05J32m02M4K27k99K72l6J45q4K0J76
4835G4N5l0n0J44M4P2l1k4O6k25N7J59j02n0j70k43J97L3j73Q1l9q5N0J45l32
4860c77J97j0k23J46J49O8%J52p9J11J48mj72K09N0j50r5K07j76J07rk33M8o9
4884ek8j62Loj81J55p7J6J36j09Q2Q5J29O4l40K38J36n6K44J7j0J14j33J67Qp8
4910D09j51n9p4j52P7k44p1pK3p2k74J95n9K57j20K04m4J89n7J66JN2k3K03j12
4935B57J05J25j30j18J46o9j34j45K28l10M8Kj98n1Nq2m3j0R4j20J53P2O5R6P2
4960E8R0k3K13n1M4l8J15j66O1j21j01p3J49n3LL4j06j94Q9mj78K97k27k0j01
$$ y = [-355, -150, -440, -357, -34, -415, -600, 50, 28, -212, -51, 19, -377, 38, 547, 113, 12, 466, 44, 266, 615, 289, 44, 198, 63, -79, 228, 162, -229, -177, 7, -226, -121, 11, -391, -347, -120, -419, -147, -183, -38, -122, -102, 74, 129, 99, 49, 193, 237, 309, 278, 254, 320, 95, 152, 311, 209, 159, -11, -254, -57, -24, -197, -116, -155, -240, -190, -45, -377, -180, -190, -413, -267, -118, -50, -50, 102, 23, 134, 282, 278, 106, 315, 365, 215, 120, 327, 151, 258, 249, 16, 64, -5, -33, -195, -192, -198, -379, -224, -301, -285, -149, -258, -176, -91, 38, 102, -238, 0, 136, 80, 324, 341, 331, 445, 312, 479, 487, 409, 258, 199, 125, -27, 50, -194, -265, -272, -249, -321, -595, -400, -459, -202, -322, -118, -162, 27, -30, 136, 137, 189, 166, 369, 257, 362, 487, 357, 239, 385, 316, 182, 37, 265, -45, 3, 5, -193, -244, -239, -321, -364, -374, -280, -400, -247, -175, -110, -14, 58, 148, 125, 338, 287, 331, 293, 408, 242, 303, 182, 81, 8, 157, 104, 107, 141, 35, -159, -70, -74, -252, 45, -182, -202, -303]
4985c03l0JJ51k05J22J99J9M8J83n0K39r5J23j01Q5no5j53O0l5n7N2k99J7l5k5
5011a59Q3j07j12j12K8K7K7J33r4J60k3J24r1L08J17q1J07J53j14rM7j7k36Nm3
5036A21r5K5n3l07J47j30j25O2J78k20J69R6k26L38j01p6K81J32K7n9NL3l6J33
5060C19j38j4K70k62k00J01L0P1j51nj31J41k09q9J6qj19J88R3k47J41L40k48
5083a11N4J49r3j12L08j33k70M93k4k64K84R0k20j29K23k43o4K99j53m10N06l57
5105a77l12N93j58l17K09P6m58K48M20l86k0M91k42m5L02p3k31M18j60k05J84
5126A57J96l25J15N5m2o8l7k08Q4n5j77N8J2q1o6K92l06K66j3j35N6L72k23J74
$$ y = [-303, -333, -332, -181, -386, -264, -65, -46, 2, 185, 135, 374, 279, 402, 301, 386, 381, 316, 163, 223, 188, 131, 183, -116, -99, -134, -159, -76, -183, -295, -407, -379, -352, -325, -192, -286, -126, -149, -25, -116, 192, 309, 228, 335, 488, 374, 365, 412, 395, 159, 164, 121, 26, 51, -2, -309, -162, -292, -417, -355, -177, -397, -228, -132, -358, -20, -121, -197, 84, 216, 243, 184, 189, 222, 186, 319, 181, 167, 437, 175, -25, 76, 106, 177, 26, 21, -110, 31, -178, -267, -251, -259, -378, -190, -97, -344, -203, 137, -111, -57, 92, -1, -113, 195, 62, -208, 285, 261, -3, 281, 371, 151, 22, 245, 2, -62, 237, 84, -326, 180, -177, -489, 104, -54, -371, -162, -86, -544, -296, 124, -262, -282, 209, -33, -78, 224, 151, -80, 338, 178, -27, 157, 353, 28, 143, 198, 156, 88, 51, -157, -73, -128, -305, -247, -235, -316, -382, -90, -396, -130, -143, -278, -222, 150, -73, 101]
$$ [...]
8191f1
##END NTUPLES=NMR FID
##END=
