##TITLE=1H_DPAA0812-1
 CDCl3
 8 sc, 
 9.12.2021
##JCAMPDX= 6.0         $$ Bruker NMR JCAMP-DX V2.0
##DATA TYPE= NMR FID
##DATA CLASS= NTUPLES
##ORIGIN= UXNMR, Bruker Analytische Messtechnik GmbH
##OWNER= root
$$ XWIN-NMR		Version 3.5
$$ Thu Dec  9 11:20:32 2021 Russian Standard Time (UT+4h)  she@DPX200
##.OBSERVE FREQUENCY= 200.131346
##.OBSERVE NUCLEUS= ^1H
##.DELAY= (6, 6)
##.ACQUISITION MODE= SIMULTANEOUS
##.ACQUISITION SCHEME= undefined
##.AVERAGES= 8
##.DIGITISER RES= 18
##SPECTROMETER/DATA SYSTEM= spect
##.PULSE SEQUENCE= zg30
##.SOLVENT NAME= CDCl3
##.SHIFT REFERENCE= (INTERNAL, CDCl3, 0, 15.7039)
##AUDIT TRAIL= $$ (NUMBER, WHEN, WHO, WHERE, WHAT)
$$ ##TITLE= Audit trail, XWIN-NMR		Version 3.5
$$ ##JCAMPDX= 5.01
$$ ##ORIGIN= Bruker BioSpin GmbH
$$ ##OWNER= she
$$ F:/spectra/data/she/nmr/H-F/1/audita.txt
$$ ##AUDIT TRAIL=  $$ (NUMBER, WHEN, WHO, WHERE, WHAT)
(   1,<2021-12-09 11:19:15.01 +0400>,<she>,<DPX200>,
      <created by zg, POWCHK disabled, PULCHK disabled
       configuration hash MD5:
       00 E9 B6 7A A2 85 ED C7 34 08 36 98 17 FE 4E 26
       data hash MD5: 16K
       50 5D 33 66 9F 35 D1 1B DA 59 92 F4 76 5B 9D 01>)
$$ ##END=
$$ 
$$ hash MD5
$$ D8 D8 2A C9 FC 26 60 7B AE FD 03 57 6B 42 F8 B7
##$RELAX= 
##$RELAX= 
##$RELAX= 
##$RELAX= 
##$RELAX= 
##$RELAX= 
$$ Bruker specific parameters
$$ --------------------------
##$DU= <F:/spectra>
##$EXPNO= 1
##$NAME= <H-F>
##$PROCNO= 1
##$TYPE= <nmr>
##$USER= <she>
##$AMP= (0..31)
100 100 100 100 100 100 100 100 100 100 100 100 100 100 100 100 100 100 
100 100 100 100 100 100 100 100 100 100 100 100 100 100 
##$AQSEQ= 0
##$AQ_mod= 1
##$AUNM= <au_zg>
##$AUTOPOS= <>
##$BF1= 200.13
##$BF2= 200.13
##$BF3= 200.13
##$BF4= 200.13
##$BF5= 200.13
##$BF6= 200.13
##$BF7= 200.13
##$BF8= 200.13
##$BYTORDA= 1
##$CFDGTYP= 0
##$CFRGTYP= 5
##$CHEMSTR= <none>
##$CNST= (0..31)
1 1 145 1 1 1 1 1 1 1 1 1 1 1 1 1 1 1 1 1 1 1 1 1 1 1 1 1 1 1 1 1 
##$CPDPRG= <>
##$CPDPRG1= <>
##$CPDPRG2= <>
##$CPDPRG3= <>
##$CPDPRG4= <mlev>
##$CPDPRG5= <mlev>
##$CPDPRG6= <mlev>
##$CPDPRG7= <mlev>
##$CPDPRG8= <mlev>
##$CPDPRGB= <>
##$CPDPRGT= <>
##$D= (0..31)
0 1.2 0 0 0 0 0 0 0 0.06 0 0.03 0 0 0 0 0.0002 0 0 0 0 0 0 0 0 0 0 0 0 
0 0 0 
##$DATE= 1639034354
##$DBL= (0..7)
120 120 120 120 120 120 120 120 
##$DBP= (0..7)
150 150 150 150 150 150 150 150 
##$DBP07= 0
##$DBPNAM0= <>
##$DBPNAM1= <>
##$DBPNAM2= <>
##$DBPNAM3= <>
##$DBPNAM4= <>
##$DBPNAM5= <>
##$DBPNAM6= <>
##$DBPNAM7= <>
##$DBPOAL= (0..7)
0.5 0.5 0.5 0.5 0.5 0.5 0.5 0.5 
##$DBPOFFS= (0..7)
0 0 0 0 0 0 0 0 
##$DE= 6
##$DECBNUC= <off>
##$DECIM= 32
##$DECNUC= <off>
##$DECSTAT= 4
##$DIGMOD= 1
##$DIGTYP= 9
##$DL= (0..7)
0 120 120 120 120 120 120 120 
##$DP= (0..7)
150 150 150 150 150 150 150 150 
##$DP07= 0
##$DPNAME0= <>
##$DPNAME1= <>
##$DPNAME2= <>
##$DPNAME3= <>
##$DPNAME4= <>
##$DPNAME5= <>
##$DPNAME6= <>
##$DPNAME7= <>
##$DPOAL= (0..7)
0.5 0.5 0.5 0.5 0.5 0.5 0.5 0.5 
##$DPOFFS= (0..7)
0 0 0 0 0 0 0 0 
##$DQDMODE= 0
##$DR= 18
##$DS= 0
##$DSLIST= <SSSSSSSSSSSSSSS>
$$ [...]
##$SUBNAM2= <"">
##$SUBNAM3= <"">
##$SUBNAM4= <"">
##$SUBNAM5= <"">
##$SUBNAM6= <"">
##$SUBNAM7= <"">
##$SUBNAM8= <"">
##$SUBNAM9= <"">
##$SW= 18.0517287032376
##$SWIBOX= (0..15)
0 0 2 0 0 0 0 0 0 0 0 0 0 0 0 0 
##$SW_h= 3612.71676300578
##$TD= 16384
##$TD0= 1
##$TE= 0
##$TE2= 300
##$TE3= 300
##$TEG= 300
##$TL= (0..7)
0 120 120 120 120 120 120 120 
##$TP= (0..7)
150 150 150 150 150 150 150 150 
##$TP07= 0
##$TPNAME0= <>
##$TPNAME1= <>
##$TPNAME2= <>
##$TPNAME3= <>
##$TPNAME4= <>
##$TPNAME5= <>
##$TPNAME6= <>
##$TPNAME7= <>
##$TPOAL= (0..7)
0.5 0.5 0.5 0.5 0.5 0.5 0.5 0.5 
##$TPOFFS= (0..7)
0 0 0 0 0 0 0 0 
##$TUNHIN= 0
##$TUNHOUT= 0
##$TUNXOUT= 0
##$USERA1= <user>
##$USERA2= <user>
##$USERA3= <user>
##$USERA4= <user>
##$USERA5= <user>
##$V9= 5
##$VALIST= <valist>
##$VCLIST= <CCCCCCCCCCCCCCC>
##$VD= 0
##$VDLIST= <DDDDDDDDDDDDDDD>
##$VPLIST= <PPPPPPPPPPPPPPP>
##$VTLIST= <TTTTTTTTTTTTTTT>
##$WBST= 1024
##$WBSW= 4
##$XGAIN= (0..3)
0 0 0 0 
##$XL= 0
##$YL= 0
##$YMAX_a= 507401
##$YMIN_a= -526308
##$ZGOPTNS= <>
##$ZL1= 120
##$ZL2= 120
##$ZL3= 120
##$ZL4= 120
##$ABSF1= 10
##$ABSF2= 0
##$ABSG= 5
##$ABSL= 3
##$ALPHA= 0
##$AQORDER= 0
##$ASSFAC= 0
##$ASSFACI= 0
##$ASSFACX= 0
##$ASSWID= 0
##$AUNMP= <proc_1d>
##$AZFE= 0.1
##$AZFW= 0.1
##$BCFW= 1
##$BC_mod= 2
##$BYTORDP= 1
##$COROFFS= 0
##$CY= 11.3945322036743
##$DATMOD= 1
##$DC= 2
##$DFILT= <>
##$DTYPP= 0
##$F1P= 2.36226072786647
##$F2P= -0.459571619588291
##$FCOR= 0.5
##$FTSIZE= 0
##$FT_mod= 4
##$GAMMA= 1
##$GB= 0.15
##$INTBC= 1
##$INTSCL= 1
##$ISEN= 128
##$LB= 0.24
##$LEV0= 0
##$LPBIN= 0
##$MAXI= 10000
##$MC2= 0
##$MEAN= 0
##$ME_mod= 0
##$MI= 1.114404
##$NCOEF= 0
##$NC_proc= 0
##$NLEV= 6
##$NOISF1= 3.799351
##$NOISF2= 2.8
##$NSP= 1
##$NTH_PI= 0
##$NZP= 0
##$OFFSET= 15.70392
##$PC= 1
##$PHC0= -15512.39
##$PHC1= 10.4008
##$PH_mod= 1
##$PKNL= yes
##$PPARMOD= 0
##$PSCAL= 0
##$PSIGN= 0
##$REVERSE= no
##$SF= 200.130013532006
##$SI= 16384
##$SIGF1= 3
##$SIGF2= 2
##$SINO= 400
##$SIOLD= 16384
##$SREGLST= <1H.CDCl3>
##$SSB= 0
##$STSI= 0
##$STSR= 0
##$SW_p= 3612.71676300578
##$SYMM= 0
##$S_DEV= 0
##$TDeff= 0
##$TDoff= 0
##$TI= <>
##$TILT= no
##$TM1= 0
##$TM2= 0
##$TOPLEV= 0
##$USERP1= <user>
##$USERP2= <user>
##$USERP3= <user>
##$USERP4= <user>
##$USERP5= <user>
##$WDW= 1
##$XDIM= 8192
##$YMAX_p= 0
##$YMIN_p= 0
$$ End of Bruker specific parameters
$$ ---------------------------------
##NTUPLES= NMR FID
##VAR_NAME=  TIME,          FID/REAL,        FID/IMAG
##SYMBOL=    X,             R,               I
##VAR_TYPE=  INDEPENDENT,   DEPENDENT,       DEPENDENT
##VAR_FORM=  AFFN,          ASDF,            ASDF
##VAR_DIM=   8192,          8192,            8192
##UNITS=     SECONDS,       ARBITRARY UNITS, ARBITRARY UNITS
##FACTOR=    0.0002768,     1,               1
##FIRST=     0,             0,               0
##LAST=      2.2672688,     0,               0
##MIN=       0,             -526308,         0
##MAX=       2.2672688,     507401,          0
$$ Real data points
##PAGE= N=1
##DATA TABLE= (X++(R..R)), XYDATA
0 0 0 0 0 0 0 0 0 0 -8 8 -8 8 -16 18 -24 32 -40 48 -56 72 -80 97 -116 137 -161 190 -219 253 -294 336 -384
31 -384 438 -498 563 -638 718 -806 903 -1010 1128 -1256 1395 -1547 1713 -1896 2093 -2311
47 -2311 2550 -2810 3095 -3408 3757 -4141 4569 -5046 5586 -6201 6902 -7719 8679 -9831
61 -9831 11243 -13014 15319 -18451 22981 -30148 43277 -75396 330330 327609 50367 435414
73 435414 201330 222261 323035 -116659 -360931 15464 -133803 -354036 -119767 -223976
83 -223976 -526308 -188914 -6110 -137048 66097 95355 -167723 148973 408749 70889
93 70889 -27683 100536 -23772 100186 248612 -44181 -86157 205235 90885 -27867 136369
104 136369 3637 -144357 34066 -59099 -196713 22703 -68523 -340233 -137909 -37735
114 -37735 -218652 -98181 -25430 -149037 95126 288716 69663 145049 383793 195309
124 195309 105683 229568 44298 -25536 136106 -95035 -276774 -36674 -84061 -286260
134 -286260 -141429 -139358 -262110 -49283 31472 -116049 64695 209739 26777 93275 257157
145 257157 89985 46014 136965 -18455 -11633 164518 -9784 -140148 42020 17243 -91510
156 -91510 -2816 -75629 -179158 -2857 25276 -129667 -37147 28331 -98496 -22588 69978
167 69978 -55411 -22403 74392 -23871 40199 199672 80602 6999 116364 71383 23898
178 23898 85761 -29176 -130310 -6134 -8686 -121143 -62773 -59142 -143952 -55604 -8941 -94565
190 -94565 -23395 47451 -25246 44320 146031 62669 48554 107605 40124 35273 99960 6297
202 6297 -52680 35184 9911 -53276 -80 -36457 -109481 -35945 -28287 -100329 -37597 -4702
214 -4702 -68093 -10774 49890 -8465 10852 60867 5952 17240 86835 39916 13920 72073
226 72073 38455 -3198 41409 8509 -52166 -14738 -22020 -68194 -27101 -16377 -58993 -23636
238 -23636 4247 -33146 -15533 17938 -8928 1143 37611 14209 15617 52192 24402 4848
250 4848 34618 16278 -6928 12831 -2476 -19245 7480 -2452 -33103 -16300 -8531 -33174 -28601
263 -28601 -18240 -28761 -10177 9529 -7376 4931 36801 24077 16126 31957 26226 24434 30622
276 30622 11693 738 13594 3884 -23753 -28917 -26238 -34068 -35123 -35311 -36204 -15411 -192 -7896
290 -7896 624 21186 25985 25138 20656 18741 29777 30912 14723 4692 8115 9107 -2755 -14823
304 -14823 -18804 -17341 -14242 -22595 -28487 -14302 -6226 -12916 -13670 -7521 4114 11698 4295 901 12800
319 12800 24128 21927 12122 13304 19915 17375 11831 5042 2172 6330 -1853 -15492 -14854 -10799 -14168
334 -14168 -22980 -28204 -19334 -9370 -8011 -10800 -9061 4664 13042 8924 10720 15783 18754 20301 13599
349 13599 12747 19553 13776 3619 -1805 -4984 -4457 -9869 -21921 -26824 -20421 -15434 -19812 -17662 -8477
364 -8477 -6643 1755 11141 7050 15548 25828 13502 13152 24562 13935 5017 6401 -5177 -11959
378 -11959 -2659 -10511 -27128 -15441 -6564 -17524 -5039 5636 -8253 5199 22622 6156 10239
391 10239 23220 3647 2128 18186 1594 -9587 4344 -4584 -14958 4856 1198 -16519 2037
404 2037 4144 -13820 5860 8082 -19655 -5058 5884 -16834 -6011 3086 -22386 -7629 17623
417 17623 -5234 -3334 24560 8477 7603 37416 13681 -2907 31543 10685 -22402 9065 -2854
430 -2854 -41839 -12204 -12080 -48311 -13293 2478 -38443 -8420 30383 -6734 3388 45355 11486
443 11486 8686 49967 7751 -12361 41470 10399 -35940 6069 -2520 -36276 9030 208 -51600
456 -51600 -4462 22257 -24762 464 25071 -27764 -8581 37378 -8485 -9124 28340 -24907
468 -24907 -26510 45669 11692 -26005 17228 -1819 -11963 54728 23494 -44249 6496 24317
480 24317 -18468 15700 10298 -62185 -21137 26961 -27408 -12658 16966 -50258 -25260 57950
492 57950 12755 -11623 28419 -14528 -9939 76738 30174 -44613 4381 5854 -22911 39040
504 39040 14954 -73691 -16918 24516 -31718 7880 26186 -62116 -24241 52784 -5153 -3674
516 -3674 40168 -33347 -26471 71678 19089 -36304 27745 -879 -34226 55899 27639 -62965
528 -62965 6708 24128 -48692 11066 29665 -66457 -21525 40894 -32774 -12846 47799 -30781
540 -30781 -31942 55194 1062 -28380 50207 7315 -37017 46865 26055 -35519 34288 24310
552 24310 -51334 8919 28126 -40426 4460 27755 -52078 -19342 35065 -29334 -18203 28460
564 28460 -45150 -37636 50753 2448 -23479 38032 -9612 -25925 68506 30753 -38240 28703
576 28703 21868 -30676 41926 36104 -60400 -11013 24377 -51689 -9016 31780 -66556 -42930
588 -42930 49121 -8508 -14262 46507 -26740 -36371 71010 27129 -41627 26125 13838 -32122
600 -32122 45216 34260 -56054 -1406 25960 -46544 1592 41262 -42919 -22553 39591 -14143
612 -14143 -3639 42321 -35484 -45359 40237 3459 -37944 17419 -3980 -25979 47081 21128
624 21128 -43221 22407 32622 -29287 16650 32107 -30782 6287 31547 -33511 -5779 31089
636 31089 -45696 -42448 28341 -7267 -19373 27365 -14081 -18273 58957 17984 -39106 20501
648 20501 17785 -25257 20842 14865 -35184 11902 19063 -44684 -7734 27581 -34087 -26251 19535
661 19535 -10946 4352 40964 -18224 -21168 47108 8985 -31700 12057 -975 -19106 29176
673 29176 8144 -30806 22786 23994 -35055 -2209 23941 -22092 -7527 14047 -23084 5705
685 5705 39627 -25672 -35234 21715 -2440 -22943 9095 -10242 -13650 37015 14918 -22342 22172
698 22172 26610 -19745 -1991 12598 -11573 9092 14453 -25033 -625 29971 -15019 -27028
710 -27028 2317 -7968 -7133 8467 -13740 -7322 31640 10578 -18736 5029 8603 -8635 1550
723 1550 -4815 -13484 18357 16673 -17746 319 17629 -7248 -8860 -3027 -13297 5954 17262
736 17262 -11772 -7021 23440 6852 -13859 -2467 -5339 -5322 10848 -5766 -15978 18161 18835
749 18835 -11482 -4976 3064 -7038 -557 -3515 -16307 4112 19344 -2946 -7327 11296 5609
762 5609 -4855 -1970 -8056 -2419 15266 2045 -10049 9626 13899 -2279 -6442 -8278 -7150 3595
776 3595 -530 -11961 -749 12980 3366 -5600 -2128 -2603 -2260 -1203 -8335 -1744 13792 7749 -1580
791 -1580 4294 7857 5542 90 -7346 -3666 7321 6863 -1948 -1640 4735 1961 -5192 -9281 -10806
806 -10806 -4852 -2062 -8190 -4178 6117 5910 1806 -1693 -1793 2571 1557 -3778 -2701 4671 8940
821 8940 4930 2155 3825 2887 529 -3896 -6907 -1068 2772 -782 -688 1880 2894 1740 -4001 -6847
837 -6847 -4571 -2323 -1941 -2781 279 4311 2619 1570 740 -684 759 -1003 -3211 1239 4015 3192
853 3192 2656 1054 1250 1368 -786 -2422 -2141 775 1988 1369 3224 1863 -1226 -229 -3107 -5431 -2697
870 -2697 -3893 -3642 810 1103 421 2661 1857 -1079 -741 656 -822 1070 3833 196 1059 5790 240
887 240 -2756 773 -3743 -4470 1426 -1104 -1816 5222 2514 -2938 2556 3503 -3751 -2449 -1235 -6331
903 -6331 67 5657 -5001 -4071 5812 -538 -1886 4466 -2313 -2589 7789 2373 -1952 7174 3029
918 3029 -6818 680 2476 -6480 -1777 -1480 -9729 2430 9659 -4966 -3162 5688 -1065 2659 7853
933 7853 -5608 -3870 8737 -240 -4916 5481 -2520 -10141 2337 -1050 -8379 5359 1155 -11141
947 -11141 7173 12152 -4944 2707 7130 -5921 5466 12093 -9436 -4652 11721 -4370 -6531
960 -6531 8706 -5713 -10456 8599 -3270 -12671 9873 1860 -15797 5607 6287 -12427 3721
973 3721 5260 -15118 2375 12933 -10882 -990 16604 -4995 -2709 16813 -1998 -3008 18732
986 18732 -2967 -13298 15082 3688 -14053 6707 -2857 -20860 4995 4924 -20107 -1767 6014
999 6014 -16910 974 17298 -9129 -3383 15774 -5862 303 23790 -3145 -11279 15927 2288
1012 2288 -7326 14471 -2767 -19287 9375 6205 -15423 4034 2649 -19983 4067 13365 -15060
1025 -15060 -2047 9350 -15633 1059 20639 -10773 -7829 16084 -6172 -3429 22965 -4320
1037 -4320 -15570 16732 2891 -12897 16960 2670 -23952 10262 11146 -21246 4204 9586 -24528
1050 -24528 545 19079 -18364 -6356 19718 -11589 -7129 24689 -5368 -14435 21685 2334
1062 2334 -15602 18633 3187 -24086 11125 11104 -20089 3765 6806 -23117 2915 18284 -15942
1075 -15942 -6434 14426 -10587 -2153 22139 -6189 -10689 17462 -1632 -7692 19941 -1595 -19140
1088 -19140 10954 3644 -12695 10808 -1041 -23507 7864 13054 -15239 543 6245 -18523
1100 -18523 4420 20812 -13674 -6051 16827 -9183 -872 26782 -5085 -14346 16564 -82
1112 -82 -7835 21224 -1433 -26276 8763 10205 -15967 4356 1858 -27820 678 16974 -17332
1125 -17332 -6062 12492 -16123 -3680 23818 -4921 -8699 17652 -2133 -6623 23627 4205
1137 4205 -16233 12198 7737 -12278 10496 4997 -21646 3505 11082 -18099 -3224 8150 -17204
1150 -17204 -4813 12354 -11969 -6671 14431 -6418 -7331 17717 1608 -7248 16171 4223 -9090
1163 -9090 14144 6680 -12002 8390 5309 -16065 2058 7004 -13525 -1804 4521 -15140 -2636
1176 -2636 12646 -7607 -6229 9254 -5682 -2934 16603 -1163 -9793 10479 1467 -5967 13276
1189 13276 1433 -14228 6320 7216 -8192 5186 4030 -14589 1241 11383 -9346 -4827 5660
1202 5660 -11575 -4431 13664 -4928 -9905 7471 -1192 -2943 15050 2281 -10757 7830 9065
1215 9065 -2515 6797 2932 -12406 522 7393 -9029 -5406 1410 -10793 -4533 7987 -3327
1228 -3327 -4536 4963 -2489 -456 12359 3466 -4577 5070 4893 968 6530 -471 -8986 1586 3146
1243 3146 -7257 -2640 27 -6599 -51 3263 -4836 -256 4170 -5682 -2717 6036 -83 -2441 2597
1258 2597 -950 104 7637 75 -6036 4543 5471 -1638 2819 3329 -871 4768 2724 -6299 -1160
1273 -1160 2815 -5803 -7066 -1921 -3128 -2221 374 -4208 -2636 5138 1369 -3709 3076 5281 2723
1288 2723 3811 2094 1351 5898 2609 -5181 -3042 1106 -1295 -3804 -3419 -2003 1790 2953 -2556
1303 -2556 -2521 3379 1965 -1998 -511 959 2792 2491 -2284 -2645 2211 960 -4541 -5061 -1112 1934
1319 1934 1306 -1021 -1290 3451 5176 -463 -2838 899 2218 419 -1752 -1995 2327 3504 -1254 -3896
1335 -3896 -811 2286 -212 -3514 -1709 2311 4235 1402 -2214 289 2872 -975 -4925 -4310 -500
1350 -500 1580 -1105 -2618 1356 4955 2965 -1447 -1273 3026 3974 1316 -682 844 4371 2102 -3506
1366 -3506 -3684 -1644 -2223 -4721 -6579 -3566 1646 1068 -2429 -1338 3341 3992 329 -1204 692 3751
1382 3751 4950 317 -454 3911 3328 -1686 -2997 -2250 -560 111 -2899 -3215 1713 3548 -1261 -3493
1398 -3493 -886 -420 -1329 -2105 -3743 -105 4780 596 -1451 2828 2937 1060 685 -878 640 5088
1414 5088 2374 -2069 1437 3700 -1335 -3130 -2773 -4760 -1680 -330 -5395 -1883 4481 318 -1602
1429 -1602 2162 657 412 2994 -884 -1317 5756 4047 -2361 919 2090 -2552 -829 -1646 -6533 -825
1445 -825 2661 -4393 -1887 3179 -1643 -1623 1718 -2900 -1556 4240 -338 -1075 7264 4600 -696 4225
1461 4225 2261 -2231 3244 547 -6654 696 2936 -4947 -1350 905 -6327 -2752 1279 -5780 -2740
1476 -2740 4585 -1980 -1751 7539 1817 -1707 5730 337 -3568 6189 2290 -5220 4264 4170 -3518 3541
1492 3541 2867 -7124 -701 3349 -6710 -2663 3158 -6739 -4379 5355 -4386 -5920 3934 -3626 -4740
1507 -4740 9014 3234 -3451 8834 6144 -1704 8737 5757 -7598 885 4795 -6971 -1404 2790
1521 2790 -11004 -5892 5588 -6230 -6953 3819 -5228 -3991 10748 2516 -4575 7350 3493 -3165
1535 -3165 8048 3529 -9285 506 4403 -4413 3749 4956 -9383 -1628 8583 -2503 -918 3840
1549 3840 -7952 -3001 9454 -2225 -6436 2800 -5408 -6675 6804 -69 -8342 4446 2831 -3736
1563 -3736 10812 8186 -6959 3757 7841 -5073 2835 4992 -11726 -4370 6732 -7866 -6880
1576 -6880 4757 -6624 -7125 8611 -112 -5500 10890 4530 -5712 9989 7594 -6397 4789
1589 4789 4411 -10152 469 5615 -9400 -2911 5130 -8816 -4856 8266 -2553 -4470 6237
1602 6237 -4008 -4928 11456 2691 -7974 2922 -128 -4867 8429 3710 -9818 1613 5980
1615 5980 -2035 6378 6863 -8668 -2026 7882 -2614 -1080 3110 -11739 -7990 7814 -1951 -7560
1629 -7560 759 -6394 -5175 11497 4295 -7190 4156 5338 -575 10682 7402 -8908 -45 6827
1643 6827 -3475 1787 3712 -11957 -5788 7709 -2519 -4542 2383 -7537 -5683 10283 1787 -7405
1657 -7405 3038 311 -4433 8687 4485 -8945 1879 5786 -3471 4624 6105 -7510 -733 8389
1671 8389 -2514 -1753 4305 -6150 -4902 6822 -1702 -7332 2495 -2111 -5867 5498 1823 -7087
1685 -7087 2299 3838 -3383 4065 4999 -4810 1023 5722 -2816 -331 4176 -3960 -2312 4315 -2741
1700 -2741 -3203 3997 -1822 -3919 3396 -691 -3590 3950 685 -4245 3139 1975 -3449 3085 2949
1715 2949 -4428 912 3472 -2943 856 3746 -4686 -1848 4804 -2157 -2977 2384 -3306 -3013 5318
1730 5318 237 -3935 2911 1426 -2266 4352 3004 -3762 1323 3407 -2153 1513 3220 -4293 -2218
1745 -2218 2846 -1903 -2004 977 -3750 -3058 3265 -49 -3057 1151 -84 -1715 2550 1450 -2281
1760 -2281 1319 1704 -1189 2019 2808 -1501 -76 2055 -1028 779 1839 -2262 -1275 1791 -753 -1696
1776 -1696 247 -1826 -2110 838 -852 -2317 929 423 -1680 1107 1419 -994 1165 1316 -841 1375
1792 1375 2138 -496 53 1763 -163 -510 570 -1151 -1451 601 -838 -2034 364 -344 -1366 213
1808 213 -90 -915 571 456 -545 770 1282 110 529 1052 -203 -234 350 -750 -616 353 -634 -599 743
1827 743 -66 -158 690 155 204 877 537 108 521 212 -421 -447 7 -1298 -1114 -442 -863 -251 436 -286 530
1848 530 1160 559 333 486 138 -102 -299 -424 -771 -412 -252 -941 -77 760 310 883 1241 1127 2045 1667
1868 1667 620 569 672 -314 -1282 -1860 -2172 -2008 -2210 -2284 -2068 -478 19 -539 753 1885 2143 2569 1885
1887 1885 1296 2297 1617 -162 -348 -136 -681 -1111 -1190 -1386 -528 422 -599 -806 1120 1135 49 124 -430
1906 -430 -356 498 -1416 -2588 -1100 -406 -1359 -887 219 990 1946 2176 1192 2384 3890 1324 198 1446
1924 1446 4 -498 -1078 -3431 -2960 -999 -2342 -3748 -1459 -389 -354 1230 1319 913 3261 3184 3
1941 3 1207 2782 -456 -893 -81 -1979 -412 458 -3095 -2197 1865 712 -1186 788 818 423 2811
1958 2811 658 -2186 730 1155 -2819 -1188 530 -2331 -559 729 -1507 1145 3458 -950 -931 3410
1974 3410 1986 -16 998 -1254 -1554 2375 -473 -4552 -884 -92 -3062 78 1066 -1232 1912 2843
1990 2843 -875 2339 4607 -615 -1299 1702 -725 -697 1060 -3306 -3138 2097 -961 -4010 511 -284
2006 -284 -1982 1933 354 -1624 3489 2544 -2757 884 3174 -1331 458 1612 -2720 629 4188
2021 4188 -1870 -1507 3512 -1479 -2675 2742 -685 -2533 1862 -2159 -4509 3460 2031 -5480 -1280
2036 -1280 540 -2620 2826 3616 -4350 -348 5449 58 763 4829 -2469 -2910 4225 709 -1365 2834
2052 2834 -2419 -5214 3451 2997 -4084 -1674 -1560 -3841 3088 3675 -4794 -2045 2616 -1080 1591 3542
2068 3542 -3413 -1981 3704 487 862 4332 -2305 -3599 3664 1587 -1772 1085 -3014 -4471 4237
2083 4237 2577 -4353 -55 347 -3280 2767 2942 -4755 -499 3508 -2100 754 4720 -2877 -2785 4109
2099 4109 -1045 -2413 4012 -1448 -3996 4792 1978 -4002 2403 1192 -4232 2002 2291 -5037 63
2114 63 3698 -3298 -571 3904 -2584 -1385 4506 -1934 -2515 4567 -319 -2594 3982 -222 -3935 2287
2130 2287 527 -4176 1219 750 -3978 1822 3476 -2974 182 3091 -2139 1078 4098 -2778 -1741
2145 -1741 3640 -766 -1204 2925 -2298 -3597 2606 -43 -3252 1470 -434 -3165 3198 2513 -3392
2160 -3392 446 1319 -3107 1575 2919 -3899 -778 3195 -1179 709 3725 -2317 -1960 4106 458
2175 458 -1230 2740 -1443 -3280 3638 1075 -4380 91 -587 -4070 1994 2230 -3872 117 2839 -1711
2191 -1711 1182 3890 -2343 -1692 3235 -541 -1141 2977 -1541 -3460 2736 901 -2794 1163 155
2206 155 -2683 2173 2220 -2338 604 1937 -2098 30 1942 -2135 -1489 1308 -1541 -497 2613 -921
2222 -921 -1566 2324 257 -874 1825 -536 -1820 1724 295 -2306 658 237 -2438 280 795 -1738
2238 -1738 778 1877 -1270 792 2892 -531 -58 2015 -851 -1000 1583 -1434 -2149 1037 -919 -2415
2254 -2415 723 14 -1865 1177 958 -1213 1454 2131 -1046 602 1746 -1189 -370 1080 -1357 -776
2270 -776 1103 -911 -1014 1440 353 -773 1027 562 -741 917 341 -1754 -51 47 -1627 -393
2286 -393 10 -1593 -167 511 -511 478 1572 384 675 1770 675 177 1081 -93 -968 421 -387
2303 -387 -1380 -84 -392 -1138 106 -363 -840 274 517 -222 419 619 -181 -109 454 -446 -529 356 -658
2322 -658 -670 632 93 -107 990 453 250 901 730 148 547 286 -444 -228 -11 -1061 -892 -338 -1008
2341 -1008 -819 -76 -486 -285 418 -76 222 818 455 200 407 256 185 97 -1 -50 114 183 -176 47 254
2362 254 -373 -12 138 -149 141 122 -466 -145 -24 -259 -441 -237 -140 26 149 71 -139 286 547 -169 143
2383 143 302 -225 261 172 -392 136 54 -146 -131 82 -34 -26 111 -92 -261 373 -12 -452 282 45 -299 99
2405 99 -132 -140 451 128 -211 155 401 -131 13 118 -288 -273 77 -446 -436 290 -87 -175 386 197 158 797
2427 797 374 187 664 683 -126 195 171 -549 -421 -418 -1118 -486 213 -835 -398 476 82 202 760 -189 89
2448 89 867 188 -166 399 -126 -679 319 40 -680 95 193 -635 686 992 -564 14 503 -746 -65 633
2468 633 -1130 -1044 431 -507 -476 739 -473 -1086 991 592 -439 906 334 -641 1250 1285 -1009 -60
2486 -60 372 -1358 57 884 -1371 -836 881 -413 2 1612 -498 -1318 1340 307 -538 823 -688
2503 -688 -1928 837 690 -1670 -47 9 -1808 187 1342 -1079 -95 1197 -775 392 2324 -398
2519 -398 -1099 1276 -100 -445 1656 -505 -1639 1051 484 -1339 837 198 -1455 422 651 -1440
2535 -1440 289 1044 -1927 -713 1103 -1036 -348 1170 -1293 -316 2278 -293 -278 2392 50 -1221
2551 -1221 1568 485 -1242 1163 -95 -2552 912 1308 -2406 -530 620 -2239 320 2057 -1931
2566 -1931 -941 2024 -1006 -824 2351 -313 -1783 1694 300 -1136 2320 594 -2484 1475 1938 -1482
2582 -1482 386 781 -2443 570 1825 -2215 -1077 1401 -1554 -1039 1524 -1028 -1179 1702 -449 -934
2598 -934 2325 236 -1679 1690 1024 -1375 1319 134 -2205 1253 1544 -2138 -332 1242 -1162 268
2614 268 1570 -1706 -491 2485 -927 -1037 2186 -723 -1725 1587 -420 -1446 1933 -493 -2616
2629 -2616 1639 1340 -1891 340 649 -1814 962 1921 -2375 -618 2092 -1486 -695 2340 -1074 -1188
2645 -1188 2098 -380 -777 2832 -150 -2480 1616 1324 -1488 1039 306 -2581 768 1774 -2469 -891
2661 -891 1176 -1867 -527 1845 -1076 -751 1861 -660 -821 2613 426 -1537 1245 842 -704 1595
2677 1595 244 -1960 1054 1164 -1582 -212 360 -1640 -101 750 -1652 -379 1325 -1149 -399 1607
2693 1607 -376 -605 1571 -132 -275 2104 -111 -1556 1390 450 -1334 831 -28 -1752 1231 962
2709 962 -1834 92 1197 -1402 -293 1396 -1510 -628 1396 -811 -965 1791 -524 -1604 1489 401
2725 401 -1029 1132 368 -1159 1346 1433 -1146 111 1061 -1410 -527 785 -1469 -883 867 -886 -617
2742 -617 1284 134 -513 1266 190 -321 1372 471 -654 706 99 -1251 -136 -204 -1357 -473 -300
2759 -300 -1407 120 968 -703 8 1180 -24 558 1562 -106 -133 1216 157 -239 554 -481 -1266
2776 -1266 391 114 -903 285 -157 -1119 299 801 -694 -190 182 -975 -245 593 -847 -726 338
2793 338 24 33 1057 248 -261 1246 1052 92 1124 524 -382 398 328 -955 -554 -495 -1243 -940 -376 -907
2813 -907 -645 150 -279 156 757 351 182 869 530 366 754 246 -280 342 40 -674 -62 -161 -421 -185
2833 -185 124 -212 150 369 -225 -11 299 -143 -445 60 -210 -236 154 -353 -188 241 130 78 310 407 356
2854 356 506 357 -78 212 300 -383 -285 -276 -479 -550 -154 -528 0 251 30 16 435 236 209 405 370 69 193
2877 193 346 -517 -364 -7 -660 -463 -259 -528 -15 -19 -15 78 396 226 150 453 376 217 360 46 27 301 51
2900 51 -407 1 -274 -263 -106 -220 -147 20 -38 -279 -150 -7 -211 -184 -126 -187 -42 171 -4 -41 471 172 36
2923 36 697 176 66 564 318 -30 245 -38 -360 -303 -113 -521 -368 -226 -618 -239 168 -265 -111 329 -45
2944 -45 109 455 109 -72 593 370 -191 381 276 -219 56 157 -436 38 178 -386 -215 264 -340 -221
2964 -221 309 -258 -165 391 -251 -278 277 -60 -192 418 71 -313 268 43 -398 137 316 -453 229 318 -467
2985 -467 133 399 -457 -134 387 -155 -28 284 -147 -274 598 -108 -286 723 80 -511 583 100 -692
3004 -692 496 71 -898 102 345 -816 -10 295 -665 -34 950 -401 -260 1038 -234 -191 900 -48
3022 -48 -910 793 93 -980 575 270 -1007 89 240 -931 -166 379 -956 -136 847 -591 -451 972
3040 972 -244 -426 1114 -16 -513 1032 244 -517 731 350 -598 441 431 -811 108 321 -845 112
3058 112 467 -898 -219 391 -689 -17 946 -582 -345 1006 -289 -184 889 -338 -721 1035 207
3075 207 -688 903 175 -1373 654 823 -1132 186 403 -1362 367 1557 -865 -502 967 -867
3091 -867 -338 1424 -546 -1472 866 -43 -895 1334 319 -1698 678 964 -952 573 658 -1461 122
3108 122 1372 -653 -241 711 -993 -342 1567 -103 -877 956 -159 -416 1559 171 -1160 506
3124 506 -23 -845 550 171 -1314 23 644 -909 157 626 -1247 83 1347 -487 -52 1129 -391
3141 -391 87 1291 -341 -679 970 -394 -800 848 -99 -1170 758 250 -1314 402 669 -1320 329
3158 329 904 -1324 56 1396 -1040 -257 1341 -917 -720 1325 -195 -701 1008 -161 -711 1392
3174 1392 340 -1532 473 628 -1096 412 550 -1649 123 1162 -1138 -283 687 -872 -341 1252
3190 1252 -176 -786 1022 16 -483 1370 47 -1267 302 522 -619 546 -14 -1458 210 1088
3206 1088 -528 -117 156 -890 305 1218 -431 -275 698 -478 86 1274 -131 -888 386 -94 -190
3223 -190 1145 -513 -1559 415 529 -462 238 11 -1241 494 1073 -679 125 794 -623 43 1328
3240 1328 -214 -462 701 -387 -242 1092 137 -1263 245 332 -584 270 -2 -1148 188 673 -786
3257 -786 -102 466 -429 -220 674 -274 -107 911 -168 -130 943 409 -243 327 -145 -409 444 170 -709
3276 -709 -82 100 -732 -61 193 -289 -38 172 -676 217 667 -290 -118 373 -27 29 661 -170 -440 530
3296 530 34 -436 349 205 -518 47 79 -298 88 -40 -806 -17 499 -231 -177 278 -205 21 708 -215 -72
3317 -72 604 51 -204 146 17 -297 63 -212 -650 169 78 -693 -122 315 -10 33 70 -224 229 483 106
3338 106 -138 538 110 -174 118 -180 -108 212 -20 -341 69 5 -347 -196 26 -119 1 -13 -339 -11 328
3359 328 -26 25 258 157 405 402 -19 252 374 169 16 288 4 -165 -120 -121 -355 -52 -250 -473 -522 -149
3381 -149 -235 -97 50 -85 221 505 110 298 440 112 172 313 142 -104 142 119 -124 7 -13 -376 9
3402 9 -28 -111 -67 -136 -89 64 -28 -175 -130 -126 -73 -24 168 199 181 273 239 127 227 166 128 94 -204 -116 -212 -28 -505
3429 -505 -338 -95 -262 -186 -69 -16 -84 352 290 339 563 143 111 328 44 77 188 -116 -310 -91 -279 -463
3451 -463 -128 74 -351 -111 270 -69 65 399 -47 66 407 -52 15 445 -104 -103 276 -71 -45 335 -7
3472 -7 -215 238 54 -446 108 166 -418 -203 -21 -478 -59 -90 -512 -318 257 -137 -14 309 181 260 696 215
3494 215 -25 577 179 -368 167 -143 -576 -253 45 -490 -265 -208 -641 -334 295 -178 -176 413 -124 228 503
3515 503 52 -221 404 82 -318 432 -67 -344 476 151 -100 373 89 -585 181 392 -240 87 72 -880
3535 -880 -285 472 -406 -319 288 -293 -42 976 -27 -374 629 189 -341 934 471 -978 268 343 -487
3554 -487 185 446 -1059 -196 833 -629 -233 761 -539 -379 978 -181 -446 651 -37 -551 776
3571 776 322 -705 405 151 -609 314 617 -665 -21 501 -684 9 720 -460 -42 613 -475 -120
3589 -120 914 -184 -497 506 -288 -439 787 132 -952 365 89 -599 525 123 -1052 -55 672
3606 672 -601 195 378 -1037 -119 1125 -167 -156 609 -680 -390 1585 216 -803 669 161 -614
3623 -614 1039 186 -1504 103 420 -727 323 543 -1263 -357 1147 -584 -386 623 -686 -409 1366
3640 1366 -19 -763 522 -44 -336 1101 261 -1158 330 532 -389 469 399 -1228 -237 970 -439
3657 -439 -155 202 -1009 -353 1168 -319 -564 425 -410 -91 1194 172 -689 284 274 -168 685 332 -829
3676 -829 82 389 -601 422 441 -1087 -76 667 -617 -137 780 -706 -69 1021 -215 -342 689 -255
3694 -255 -932 902 53 -1157 514 266 -1054 551 612 -876 353 816 -804 -67 1144 -420 -292
3711 -292 753 -522 -562 1224 -73 -1032 400 126 -620 850 212 -1089 31 253 -476 195 154 -989
3729 -989 -278 427 -204 -88 349 -628 -239 1090 266 -58 530 -126 11 897 312 -410 118 -45 -364 310
3749 310 -26 -1128 -392 -38 -458 138 329 -726 -27 855 -158 95 587 -228 -401 843 -10 -173 650
3768 650 -36 -470 661 294 -566 160 383 -461 79 230 -697 -197 321 -690 -453 358 -495 -217 572
3787 572 58 -168 591 254 -32 769 362 -283 265 330 -430 -239 87 -664 -300 202 -601 -363 -23 -326
3807 -326 79 428 73 -171 415 38 -190 117 205 -182 248 -53 -141 279 70 -628 -119 11 -283 18 122
3828 122 -252 -115 45 -273 -196 339 -302 -102 357 13 156 524 126 -98 562 270 -198 179 -104 -379
3848 -379 76 -84 -640 -194 66 -655 -600 46 -233 -182 319 47 179 584 286 279 464 200 104 246 142 66
3870 66 133 119 -358 0 70 -277 -380 -145 -435 -139 -43 -401 -153 180 68 -110 44 177 222 199 175 120 342
3893 342 368 -23 170 131 -60 -185 -117 -373 -34 59 -374 -350 -14 -67 -168 -14 -46 168 112 -72 125 448 266
3916 266 -52 -67 -25 -76 201 -37 -130 159 152 -128 -174 36 -108 -150 -153 -129 -96 143 -20 -378 54 17 -91 116
3940 116 -46 35 401 288 40 97 88 2 -81 -181 -220 -123 43 -348 -166 109 -104 -302 88 -2 -47 350 57
3963 57 146 260 208 -78 163 92 1 105 -23 -380 -163 86 -220 -236 209 -232 -65 136 -268 66 156 -129
3985 -129 -83 373 175 147 260 125 -101 385 -39 -235 319 197 -272 66 62 -454 -21 -19 -474 -90 180 -344
4007 -344 -273 124 -151 -258 423 83 -138 500 209 -412 263 298 -136 262 397 -208 140 318 -315 -60 173
4028 173 -80 -297 265 -480 -504 346 -149 -252 166 -296 -274 434 309 -119 302 54 -340 499 343 -308 -207
4049 -207 208 -320 -2 198 -539 -424 393 -147 -91 581 -376 -223 656 -45 -183 514 -153 -522 547 182
4069 182 -618 33 101 -704 425 639 -645 -201 710 -389 59 697 -471 -646 529 6 -665 365
4087 365 -87 -667 537 261 -459 345 526 -441 280 633 -588 1 486 -644 -359 419 -676 -427 437
4106 437 -174 -435 531 -87 -372 464 349 -427 543 291 -216 654 217 -646 105 284 -538 121 362 -540
4126 -540 99 420 -462 58 664 -401 -412 700 -361 -515 575 -187 -688 440 -220 -694 674 335
4144 335 -687 438 481 -503 533 605 -809 -166 669 -296 -458 494 -727 -845 779 177 -585 526
4162 526 -192 -813 788 584 -562 222 160 -613 246 759 -839 -471 390 -524 -121 885 -559 -477 768
4181 768 239 -119 628 -231 -676 464 229 -540 354 -66 -752 226 415 -507 37 112 -533 179 576 -570
4201 -570 -5 542 -493 -76 667 -392 -396 472 -326 -388 693 -39 -679 656 268 -616 550 527 -757
4220 -757 346 502 -688 35 487 -784 -261 625 -462 -385 777 -356 -465 779 65 -573 573 187
4238 187 -473 486 372 -505 331 533 -610 70 587 -279 -130 510 -349 -135 459 -225 -368 279 -146 -372
4258 -372 460 -34 -345 181 -6 -453 200 103 -283 30 191 -367 353 421 -345 37 343 -346 119 560 -354
4279 -354 -69 430 -250 -85 343 -223 -444 187 42 -445 169 -65 -502 274 439 -313 27 355 -201 87
4299 87 555 -200 -181 432 -291 -328 373 -75 -350 333 112 -431 454 168 -387 241 185 -217 165 159 -383 -105
4321 -105 135 -410 -41 277 -455 -140 254 80 97 417 -107 -73 217 14 -245 247 -120 -273 205 80 -51
4342 -51 91 79 -144 53 234 -128 -43 78 37 -50 179 -362 -462 61 -340 -64 97 -275 -210 217 94 -61
4364 -61 258 203 -41 271 107 42 12 116 -128 -3 248 -370 -320 88 -95 -63 136 -25 -33 76 236 -60 53
4387 53 -20 -236 -56 40 -176 -183 -9 -45 -22 332 -192 93 358 -115 251 173 215 117 269 -123 -228 -183 -67 -227
4411 -227 -147 20 -211 -65 29 -13 197 136 -95 -8 110 -74 -27 -54 -303 -112 90 -225 -145 91 206 37 260
4434 260 200 -84 234 115 -223 -31 -3 -190 -67 -183 -138 -200 -110 -315 -25 235 101 6 106 123 -10 260
4456 260 178 101 178 -159 -8 12 -98 -219 6 4 -1 100 262 -22 -55 84 -68 -158 121 -236 -31 24 -214 -165
4480 -165 51 -82 -94 76 45 201 259 183 -281 70 340 -106 -60 194 -275 76 123 -182 -69 89 -156 -120
4502 -120 305 -99 -19 121 -89 -146 239 -43 -366 -163 126 -161 -32 3 -211 108 98 -306 187 245 -152 25
4524 25 159 -64 26 278 -3 -32 478 30 -169 44 133 -292 32 -1 -467 29 -50 -459 -122 204 -268 -81
4546 -81 97 -344 -18 533 52 -145 498 302 -113 423 178 -335 361 106 -339 152 141 -420 -157 171 -300
4567 -300 -39 109 -497 -121 371 -282 -216 274 -223 -232 412 -95 -259 576 154 -85 498 86 -132 286 126
4588 126 -434 381 86 -596 -79 460 -538 -90 461 -622 -49 600 -266 -379 654 -107 -279 528 -132
4607 -132 -693 485 110 -573 408 245 -554 205 613 -402 103 461 -476 -112 727 -252 -359 434 -122
4626 -122 -401 394 -150 -587 250 49 -422 403 307 -595 246 377 -506 90 271 -717 -80 387 -184 -262 287
4647 287 -214 -218 523 -181 -221 435 -42 -252 481 1 -498 293 -181 -558 439 122 -606 181 325 -273 39
4668 39 254 -605 117 592 -517 -228 756 -242 -457 896 -270 -525 609 91 -402 601 210 -604 462
4687 462 501 -675 81 435 -855 -27 709 -616 -500 501 -505 -342 570 -187 -586 407 49 -385 589
4706 589 249 -547 336 522 -380 204 213 -516 -68 568 -332 -181 387 -410 -193 261 -188 -392 225 -164 -235
4727 -235 383 -16 -536 36 -41 -464 542 39 -506 341 320 -525 415 326 -401 317 462 -291 238 501 -395
4748 -395 -245 390 -284 -349 600 -184 -615 519 221 -574 546 48 -683 185 368 -263 219 281 -643 -21
4768 -21 687 -135 -223 463 -296 -196 694 19 -595 159 83 -285 545 21 -664 -49 206 -231 -38 22 -626
4789 -626 -140 279 -156 -115 198 -175 -55 483 14 -239 153 -80 -268 351 49 -318 224 10 45 174 163
4810 163 -254 85 194 -207 214 184 -348 75 356 -229 -25 185 -414 -192 218 -169 -91 193 0 -382 293
4831 293 179 -211 385 415 -225 8 253 -222 172 322 -264 -165 279 -202 -199 150 -39 -205 271 76 -371
4852 -371 274 122 -138 26 -31 -308 -5 -103 -388 117 -1 -55 22 353 82 -63 281 186 -35 306 24 -164
4874 -164 31 -219 -82 -117 -181 -286 208 -203 -103 16 147 -304 148 139 -71 -104 166 -157 -182 74 -436 -279
4896 -279 25 -58 -107 109 -73 -21 302 183 74 191 177 -104 -85 -6 -280 -260 -117 -258 -338 -44 -135 -102 168
4919 168 91 213 211 165 9 132 99 -77 111 -19 -104 -7 -38 -151 28 146 105 110 155 160 3 146 8 174 54
4944 54 -170 -289 -14 -1 -286 31 -154 -206 76 38 -74 105 113 -8 224 173 -131 149 -30 -150 -191 73 -11
4967 -11 -104 189 105 -114 249 45 37 223 229 37 143 -80 -250 -78 -150 -251 -58 36 -206 -142 137 -133 55
4990 55 295 87 218 516 222 -20 344 3 96 114 -75 -186 14 36 -353 14 38 -198 101 128 -149 32
5012 32 179 -84 -7 -30 -107 -134 75 -222 -92 244 71 86 405 129 103 362 232 1 251 87 -168 -101 -55
5035 -55 -233 -78 172 -196 -96 202 -247 32 174 -125 -191 154 -148 -157 44 19 -212 158 7 -183 416 48
5057 48 -382 -39 379 -172 152 197 -95 -189 302 -57 -190 124 -220 -363 172 -115 -474 91 3 -251 458
5078 458 220 -179 89 225 -31 295 238 -257 -125 280 -104 18 326 -201 -182 267 221 -194 333 -284 -237
5099 -237 205 -21 -234 126 -176 -308 348 186 -353 -13 265 -131 114 451 -518 -90 306 -421 -97 455
5119 455 -295 -231 447 60 -226 454 97 -346 525 341 -182 174 430 -381 136 466 -683 -111 342 -419
5139 -419 -343 186 -550 -59 452 -177 -444 413 96 -557 313 272 -307 274 289 -433 426 452 -322 40 399
5160 399 -361 -89 210 -256 -222 412 -151 -415 379 -1 -515 342 -143 -404 425 179 -501 260 212 -324 440
5181 440 383 -246 134 397 -76 420 617 -394 -275 462 -81 -314 266 -543 -374 476 -168 -492 167 -213
5201 -213 -479 514 394 -589 2 229 -213 436 591 -633 -224 509 -34 141 599 -381 -406 514 242 -264
5221 -264 130 -274 -668 252 365 -658 -51 150 -519 191 360 -413 -293 244 -185 252 569 -16 -164 483
5241 483 171 -94 259 -67 -266 121 89 -258 140 49 -375 331 253 -211 178 267 -435 -4 337 -140 -114 169
5263 169 -259 -300 373 -213 -217 270 -80 -340 524 155 -289 531 112 -254 243 209 -457 124 160 -273 96 345
5285 345 -314 -148 346 -158 -137 427 -163 -388 444 71 -278 267 -225 -724 38 160 -406 25 241 -274
5305 -274 122 594 -59 8 338 -85 123 455 -39 -230 170 -97 -226 80 -175 -329 64 -121 -448 -112
5325 -112 -1 -220 142 170 -205 -39 308 -161 199 238 -211 135 254 -211 74 350 -112 -48 354 113 43
5346 43 172 -14 -145 44 -98 -334 -119 -127 -314 -61 77 -395 83 147 -49 50 228 -56 -3 208 161 -29
5368 -29 146 56 19 24 96 -135 -20 28 -198 67 148 -90 -23 45 5 -39 83 114 -213 83 -110 -198 26 32 -90
5393 -90 53 96 -95 29 77 51 208 82 132 52 86 -134 86 158 -95 -31 -18 46 -84 8 -194 -149 4 23 -27
5418 -27 119 -140 -188 149 8 -23 143 154 -174 106 203 -104 -5 193 -33 84 177 -37 -136 106 -111 65 111
5441 111 52 -130 152 15 -144 -38 -9 -110 -104 -12 -190 -132 121 -108 29 136 -57 16 51 90 93 126 137 -20
5465 -20 21 85 8 138 7 -32 107 26 -139 143 82 -120 78 -86 -234 -80 -67 -114 -122 -27 -31 -171 141 -220 103
5490 103 203 -27 -5 196 -19 116 274 5 65 75 12 -121 -18 245 -108 -72 -102 -95 -249 146 -135 -120 42
5513 42 -86 -282 84 -5 -39 103 -6 -146 305 236 -43 99 104 -140 62 187 -147 -31 151 -47 -7 194
5535 194 -186 -43 178 -130 -150 -138 -86 -7 138 145 -176 16 73 -211 122 256 -61 131 199 -96 184 310 -120
5558 -120 -138 218 -7 -172 58 -152 -258 81 -95 -333 253 -15 -153 261 -17 -185 267 208 -118 59 34
5579 34 -381 1 135 -94 12 244 -164 -68 318 -11 -377 439 99 -316 413 197 -256 96 177 -204 55
5600 55 107 -346 114 193 -239 -361 145 -176 -250 434 -95 -328 184 -63 -277 183 67 -387 25 110 -289 168
5622 168 23 -226 206 434 -118 -23 161 -172 -68 259 -202 -279 99 -172 -181 94 -250 -369 229 102 -89
5643 -89 302 -245 -431 200 289 -231 178 -31 -304 -6 556 -153 -224 305 -382 -60 530 -180 -207 345 -72
5664 -72 -272 323 -189 -598 -87 76 -405 -12 152 -573 8 536 -129 104 363 -207 -14 378 42 -248
5684 -248 339 33 -280 493 125 -431 120 100 -424 173 140 -361 179 63 -265 -53 247 -292 -169 79 -249
5705 -249 -182 436 -147 -352 266 -14 -137 408 26 -232 312 -129 59 346 -56 -426 323 193 -258 56
5725 56 24 -421 -152 313 -131 -40 245 -365 -218 387 -230 -147 141 -126 -118 468 178 -397 208 276 -308 158
5747 158 278 -239 16 392 -357 68 476 -257 -249 266 -155 -352 30 -95 -348 232 138 -482 1 199 -335
5768 -335 154 133 -318 110 306 -284 26 138 -110 15 224 -68 146 122 -95 -101 175 -53 -279 63 -148
5789 -148 -297 85 -155 -397 119 91 -338 -42 136 -202 184 253 -221 90 395 -178 50 414 40 -176 282
5810 282 143 -19 336 53 -217 171 3 -329 52 152 -192 -117 86 -310 -94 303 -183 -289 199 11
5830 11 -217 163 -144 -105 227 318 -54 152 133 -118 170 195 -161 35 225 -221 113 146 -9 -308 53 -131
5852 -131 -64 35 -238 -206 -6 82 -108 110 -70 -99 28 -281 -221 92 107 -235 -12 230 -4 63 285 -64 209
5875 209 202 -133 -63 311 -125 -224 142 -184 45 160 29 -61 47 -77 -293 -8 -23 -131 -11 -26 -63 37 244
5898 244 -100 -187 100 101 -73 91 38 -75 131 235 -83 101 209 -30 15 -103 -152 -28 -127 -304 -115 -203 -151
5921 -151 -92 -181 -106 -2 261 192 157 374 0 -6 169 177 55 176 18 -55 192 127 -2 12 -138 -192 -40 -55 -64
5946 -64 -55 -110 -320 -164 -47 -163 -91 39 -83 8 91 55 77 203 79 17 158 159 -98 27 278 -165 -66 66
5970 66 -149 -139 -59 -224 -53 -30 -140 32 39 -11 -49 87 110 -106 -13 -8 -61 -153 155 10 -4 86 -129 156 -22
5995 -22 89 196 29 10 -28 53 -118 -43 85 74 34 39 -124 -100 215 -29 -95 -12 119 -106 -38 -2 -264 -57 -25
6020 -25 -94 76 49 -5 30 191 22 44 97 210 -21 288 -122 -41 106 195 -84 41 61 -302 -89 -62 -303 -92
6044 -92 87 -208 -82 80 -67 -49 49 25 -93 277 -329 -133 94 -98 -6 70 208 -23 83 166 32 162
6066 162 227 -19 26 173 -180 -117 89 -136 -180 -8 -12 -170 -43 -78 -41 145 140 8 203 82 17 152 153 25
6090 25 104 32 54 -5 281 -69 -59 206 -58 119 252 -205 -210 -3 -108 -286 107 -133 -295 174 -203 -398 137
6113 137 218 -202 154 275 -164 193 330 -105 -55 184 -16 -62 119 -172 -132 262 -81 -148 203 102 -242 171
6135 171 167 -239 85 45 -143 -26 69 -196 -185 127 -61 0 241 99 -38 234 101 -22 165 -74 -68 193 38
6158 38 -180 44 -166 -241 42 -81 -189 -27 1 -346 26 295 -146 -205 97 -134 152 305 -202 72 161 41
6180 41 -163 240 -24 -212 150 340 -25 355 310 -219 202 385 -353 -6 104 -258 -203 427 -147 -216 159
6201 159 -172 -347 222 108 -436 110 158 -176 141 107 -124 53 313 -273 227 301 -122 -13 72 -29 -59 295
6223 295 -57 -272 103 28 -221 151 -99 -484 187 34 -359 27 -24 -231 187 -12 -20 17 223 -127 47 234
6245 234 -52 5 262 -14 -154 378 -19 10 249 -76 -287 234 -86 -316 -56 -17 -269 60 215 -398 -155
6266 -155 160 -324 42 243 -84 -205 180 -30 -60 334 -104 -106 345 93 -35 33 203 -95 42 231 -215
6287 -215 -90 59 -356 -35 202 -243 -229 92 -311 -163 113 -34 -55 147 112 36 99 54 -180 190 194 31 158
6310 158 3 -157 53 89 -72 -7 107 -184 -61 28 60 24 89 -188 -95 196 -19 -118 96 -246 -245 108 -86
6333 -86 -96 202 77 -202 210 221 -156 58 366 -100 68 133 -248 -141 114 -76 9 241 -39 -225 36 13
6355 13 -249 -120 -119 -235 -70 -92 -252 29 102 -130 -32 155 -149 68 173 33 -149 222 -108 -112 102 33 -160
6378 -160 -60 161 -213 158 38 -4 -236 54 -117 2 -31 -383 -64 21 -335 -34 3 -118 50 189 -31
6399 -31 2 91 60 149 138 132 58 -31 56 -42 207 99 -148 -73 94 -65 -55 194 -137 -22 12 -114 2 -40 36 -163
6425 -163 -144 7 -28 154 29 -18 86 279 156 274 -9 140 49 -43 108 30 135 48 -322 43 -83 -146 -63
6448 -63 58 27 -14 -5 -59 76 -67 -139 -23 -109 35 -41 186 14 -72 236 156 92 198 19 63 176 69 59 86
6473 86 -150 -36 17 -244 -118 -154 -197 9 -63 -13 -66 8 222 -197 92 42 -14 -29 146 14 290 266 -4 70
6497 70 22 -51 81 108 120 -30 30 212 84 49 48 54 62 -35 -346 -87 -144 9 -25 102 -152 -73 -26 10 -13 66 143
6524 143 3 117 129 3 73 -2 -78 57 179 7 -98 100 58 79 -3 -11 150 130 -140 -13 3 -97 -262 109
6548 109 -105 -210 43 -5 -75 178 93 99 78 241 65 112 35 56 145 32 -102 -75 105 8 143 113 -194 -133 286
6573 286 -126 -57 -40 -147 -131 -76 -95 -131 -72 -35 -96 14 175 -23 19 81 66 -32 52 -30 -37 302 61 -139 170 -81
6599 -81 84 137 -24 -210 -7 -79 -193 -116 -26 -320 -64 22 -77 -266 82 -74 114 13 -6 199 298 58 20
6622 20 128 40 -21 161 -159 -207 213 -57 -120 125 -85 -244 119 60 -318 71 -7 -169 -185 176 -184 -92 83
6645 83 6 -145 59 146 -232 90 116 -199 54 27 -183 122 193 15 143 109 -30 -40 17 -6 -151 126 -174
6668 -174 -36 67 -209 -101 59 18 -132 203 -136 105 267 63 -73 60 182 34 -67 225 -5 3 200
6689 200 -173 61 128 24 -22 241 -158 -6 12 -111 -42 102 -1 -16 17 13 -69 93 145 -32 120 62 -184 117
6713 117 258 -84 106 299 -208 -37 336 -37 -57 272 -13 -150 272 -41 -181 -94 155 -389 77 58 -217
6734 -217 27 -35 -67 -87 217 -66 -117 -58 -84 24 301 -55 -192 139 78 -62 87 100 50 215 112 81 15 -85
6758 -85 -212 -48 95 -279 -61 -113 -162 -24 74 -187 21 134 -178 -45 229 -44 -71 170 53 -59 137 -104
6780 -104 -235 57 -5 -111 80 70 -71 48 224 -89 10 103 -157 -113 122 -215 -165 228 -222 -210 145 -34
6802 -34 -276 -109 147 -68 121 95 -102 156 111 -143 31 238 -109 8 217 70 -60 74 89 -3 335 164
6824 164 -59 -65 -87 -142 -74 -287 -208 -69 44 -120 0 52 -31 2 6 -12 65 174 -37 121 186 154 -149 123 13
6849 13 -14 207 -92 -240 -27 -106 -142 169 -31 9 49 194 -4 -36 92 -113 -103 119 22 -70 43 67 -8 182
6873 182 169 34 89 -139 173 260 47 -108 6 81 -162 -31 52 -93 -148 70 -17 -16 -4 -60 -43 9 20 -112 -28
6898 -28 33 0 -65 47 -101 -105 182 30 184 176 153 -47 163 -13 -226 95 -214 -70 -9 -71 -11 117 35 -74
6922 -74 -110 -168 86 -72 -48 -65 -82 -7 -59 22 89 21 88 53 -22 57 150 53 22 -22 26 88 77 -61 -32 -67 -12 -201
6950 -201 48 57 -183 -154 -96 -129 -32 30 -65 33 144 73 79 221 43 42 237 -71 95 223 42 72 -18 138 98 163
6976 163 46 -3 19 -43 -158 -76 -82 -167 74 -188 -172 -62 -174 16 -7 117 90 67 224 89 56 4 -65 211 169
7001 169 302 54 166 27 -44 47 58 26 25 103 -118 -172 -124 52 6 32 -47 -138 -133 2 -67 101 35 124 -78 -104
7027 -104 -75 122 24 58 -20 178 -61 141 126 -8 112 -31 -65 12 -69 -96 8 37 -183 -28 17 -111 -207 67
7051 67 7 46 129 -11 40 121 254 112 -126 99 146 63 123 -75 89 106 117 23 8 11 148 -19 38 -34 50 48 -129
7078 -129 -119 -95 -34 39 30 -199 -28 68 -11 -128 121 -136 133 178 -123 19 -132 187 21 74 -43 -65 141 105
7102 105 -7 49 -30 -160 -66 -21 57 17 0 -157 -126 146 -106 -125 24 -207 0 98 45 14 82 176 15 212 139
7127 139 22 151 -44 72 187 32 -36 36 29 -197 -198 65 -96 -82 -9 -68 -80 -117 129 -67 -7 -149 38 108
7151 108 -35 -17 -24 75 -113 138 185 24 -10 152 -215 13 151 29 47 69 -105 63 3 -92 -290 112 -119
7174 -119 -87 -47 -6 56 101 152 64 5 175 28 45 140 -70 203 119 42 -47 100 -55 56 156 -30 -244 101
7198 101 94 17 22 -3 -69 -180 85 -194 -127 104 -162 -40 63 83 34 -58 68 -6 28 15 22 123 -9 -203 97
7223 97 -26 -112 -271 -21 -93 158 -61 6 -3 -106 -37 -135 -39 -164 -64 153 -250 -200 61 10 70 35 -2 -48 128
7248 128 76 -121 119 82 -62 98 23 -33 91 243 -2 -49 -39 -152 -184 -35 -122 63 -13 -127 -86 64 54 -6
7272 -6 80 7 -31 22 107 -145 42 179 -119 -15 112 72 126 -24 11 90 -110 -127 -27 158 -31 -29 -130 107 -162
7297 -162 -68 117 -170 72 -146 113 -61 57 85 72 206 -53 78 248 43 250 128 -61 -65 6 22 75 159
7320 159 52 -156 -65 -58 -69 232 -71 -189 -44 -92 -172 -31 -33 -141 16 318 28 -142 8 -30 39 -41 104 -16
7344 -16 38 69 17 26 135 30 100 92 57 -30 20 -57 56 46 -58 -14 47 -173 -51 39 -21 -56 100 44 65 41 -10 -47
7372 -47 71 96 -33 63 102 138 81 -22 -137 70 81 40 -138 3 -2 4 34 -28 -38 -35 94 -137 -20 -24 -81 2 49
7399 49 105 190 -1 37 131 -1 0 126 41 107 -44 181 -61 -181 10 -178 -113 -45 54 -79 -14 24 -98 66 30
7424 30 -62 -130 29 87 129 27 21 88 -254 57 62 125 27 30 23 69 -95 100 4 -59 27 79 -177 41 47 -32 -7 -190
7452 -190 -55 -139 -102 47 -84 -71 95 -103 -161 63 36 -46 51 90 145 97 68 81 145 12 170 200 -101 -118 72
7477 72 -23 -9 -25 -38 -116 -113 118 -98 100 70 -78 -18 -238 -197 129 -74 7 120 -3 -77 108 40 3 97 -20
7502 -20 42 227 64 11 101 208 81 -77 88 -91 -128 105 -105 -125 -285 -96 -77 38 -166 -131 -61 162 177
7525 177 72 158 80 50 59 -13 2 -8 47 26 48 -73 -18 8 17 -17 -1 -82 -92 -55 -64 63 151 -94 -14 36 -34 -158 42
7554 42 85 20 -40 -22 -43 41 -6 33 -6 24 75 49 222 25 -64 0 128 -4 -6 -119 -209 -1 -20 -22 -22 -121 68 -34
7582 -34 8 -22 -129 -118 -61 -142 62 -45 38 47 -72 31 123 39 142 80 140 -98 -29 39 58 47 -72 -80 -47 -9 -111
7609 -111 -132 -28 -51 -269 84 -49 49 9 118 67 239 -162 45 -125 37 -78 79 63 -10 128 135 139 13 35
7633 35 -4 23 21 -87 27 20 49 -184 -35 -25 -62 13 12 -64 37 -70 -53 300 59 173 35 132 -73 72 68 95
7659 95 14 96 -4 24 84 35 -168 47 -163 -90 32 -38 -197 30 110 30 7 128 26 -47 110 -94 -91 136 -107
7684 -107 49 -54 -102 169 171 73 -10 179 -71 -39 60 127 -44 291 -131 -134 -4 -25 -128 11 111 -204 -35 -29
7708 -29 -148 -52 100 -104 77 194 -63 16 198 4 75 42 130 -15 241 8 22 -61 41 -47 -79 198 -171
7731 -171 -72 8 -246 -167 107 -90 -3 16 -75 36 77 75 -185 -41 -71 -88 -22 5 -40 116 119 71 115 26 10 -26 36
7758 36 7 -143 113 57 20 -237 -57 55 -1 -186 33 42 -126 -59 145 -84 12 -64 38 -73 -62 145 22 160
7782 160 86 41 249 71 -71 99 40 88 -76 83 35 -4 -88 -151 -158 -3 -74 -16 -52 -43 -97 8 -106 -123 28 73
7808 73 -40 -146 -10 51 42 128 51 -59 6 -130 97 70 117 -163 46 -14 -82 9 -65 3 -72 50 -199 -97 -23
7833 -23 -60 65 -201 -101 42 7 30 99 170 42 -2 162 121 -7 184 25 -6 65 131 -125 75 145 -133 -57
7857 -57 76 -36 23 119 52 -118 141 -177 -73 78 18 -29 -50 44 -145 -26 94 120 85 84 -91 6 98 -64 78
7882 78 -48 -24 -207 111 -44 -39 -75 44 -112 -182 20 8 21 67 63 -44 -17 -28 133 -34 -31 106 79 -61 127
7907 127 266 94 -122 50 -68 6 -22 -134 23 114 41 67 67 -32 -70 -102 -126 -39 -13 -107 -150 17 8 -133 50 -19
7933 -19 152 109 145 74 39 43 19 -101 156 -114 -77 -52 137 -37 -119 -66 7 -105 192 -81 -146 31 -143 17 15
7958 15 12 34 118 -12 -128 -71 -51 -3 130 -25 111 57 -84 27 57 31 -50 144 -5 -167 27 79 91 11 1
7983 1 122 -15 2 -117 -58 -67 -14 -61 -37 -6 44 35 32 2 77 12 -69 96 91 -60 -188 -2 106 126 221 -101 -15 -83
8011 -83 -54 -34 50 72 -18 -70 175 14 -50 120 -224 -78 68 -55 48 153 1 -85 20 -55 30 47 230 -109
8035 -109 -36 -39 187 125 299 76 106 -80 45 58 116 -14 87 -160 8 -108 -136 -1 90 17 112 126 1 84
8059 84 -67 25 80 21 154 126 98 22 82 105 -160 20 80 227 -31 59 -9 -35 24 -174 4 26 -148 -206 28
8084 28 62 72 -5 -43 16 -36 77 109 19 11 -37 102 33 187 53 127 87 84 -22 -6 -80 94 -21 -44 11 -96 -32
8111 -32 -112 114 30 -108 -138 63 133 0 -97 102 -90 129 93 73 144 9 -59 69 111 12 38 136 -48 38 53
8136 53 7 -3 92 -40 16 82 -68 36 1 38 -217 -92 -55 -3 -14 -120 101 132 42 115 39 61 -59 10 174 48
8162 48 65 115 -13 85 156 146 -137 -52 -99 -193 -32 115 72 -130 270 -271 0 0 25 -51 71 42 87 135 1 17
8188 17 92 32 15
8191A5
$$ Imaginary data points
##PAGE= N=2
##DATA TABLE= (X++(I..I)), XYDATA
0 0 0 0 0 0 0 0 0 0 0 0 0 -8 8 -8 8 -16 16 -24 29 -32 40 -48 56 -64 78 -88 102 -118 138 -157 178 -202 229
33 229 -259 293 -330 367 -413 461 -514 572 -633 701 -776 857 -946 1045 -1150 1268 -1396
50 -1396 1540 -1695 1872 -2063 2285 -2534 2817 -3147 3531 -3988 4545 -5239 6125 -7306 8959
65 8959 -11443 15563 -23608 44979 -218719 -491543 160729 250567 214158 467525 281344
76 281344 79983 507401 480717 68037 151091 100534 -301327 -128189 72776 -221746 -223670
87 -223670 -114265 -345686 -146953 176580 -139027 -289289 6675 12294 34846 200564 -24970
98 -24970 -136926 180567 143121 -69424 95721 101181 -51215 153020 208145 36550 193638
109 193638 190902 -124052 -17826 119362 -160075 -206224 -114651 -284530 -201605 -12843 -232424
120 -232424 -252073 55926 -15849 -110912 145206 160589 101564 325799 248567 42805 259078
131 259078 268541 -47725 -17379 18161 -192983 -118994 -34563 -245197 -187863 -8740 -173462
142 -173462 -173792 57588 -31115 -102320 82402 52704 25884 219046 119059 -57582 122963
153 122963 159258 -17720 31170 35086 -83121 47837 116694 -70521 -46746 57581 -78736
164 -78736 -85433 22809 -101130 -140538 -16584 -82161 -87468 71971 -7795 -110314 40452
175 40452 78874 18391 102467 82071 -494 128086 171271 23228 30408 59460 -56708 -43183
187 -43183 1960 -115641 -114060 -31104 -107100 -97525 13438 -51673 -90644 12767 5005 -8604
199 -8604 84350 53075 -2439 101970 118255 27811 60101 60958 -24569 20943 49803 -45882
211 -45882 -28737 17885 -61235 -55317 5063 -64221 -86845 -22479 -54297 -62590 19989 3631
223 3631 -32055 41155 50350 5450 54350 60404 1779 38693 62287 7087 22413 39774 -20385
236 -20385 -18363 9045 -40065 -51349 -15820 -39295 -46054 -4233 -15378 -27861 11666 2858 -20845
249 -20845 17532 22533 -3094 21949 28850 10931 34896 36538 672 9448 23829 -4921 -12972
262 -12972 -1013 -17512 -20401 -8001 -30137 -36044 -9594 -21671 -37314 -12242 -872 1699 20807
275 20807 20814 19382 42389 45154 22342 19537 26471 14534 2134 -3518 -14570 -14366 -13745 -34677 -40526
290 -40526 -23506 -22803 -27752 -23867 -15353 4080 16532 11136 11652 24997 32199 24135 15549 15918 16754
305 16754 14172 3716 -6383 477 2929 -13308 -21306 -17271 -12579 -11096 -20738 -25568 -13513 -3416
319 -3416 -5809 -11772 -5494 7801 10490 9361 12202 16833 24919 22393 11609 14376 20193 13350 1989
334 1989 -5370 -2282 490 -8301 -18442 -21563 -15678 -12401 -20982 -21711 -12519 -7932 -3780 -2478 1926
349 1926 15789 18248 13132 16057 20118 22519 20074 9955 5019 8215 6448 -5536 -13749 -12062
363 -12062 -17458 -21417 -17830 -23355 -20718 -6590 -11270 -9799 10930 12284 7725 18812 19018 13427
377 13427 21572 16887 -2870 329 7162 -11743 -15064 -5895 -21469 -19359 866 -12168 -14473 7176
391 7176 -671 -3777 18830 12116 -2244 13632 13563 -2346 10603 11627 -11528 -714 10816 -9333
405 -9333 1194 13676 -11596 -3616 18360 -3704 -5948 8473 -15462 -16190 8303 -14944 -29583
418 -29583 -1936 -9664 -21701 9786 5037 -13658 25013 29840 -2473 28898 40564 -1831 15450
431 15450 29334 -16152 -6982 12526 -37188 -35678 4416 -32257 -45010 3913 -13201 -29863
443 -29863 20933 9024 -17763 39880 37281 -17033 22203 39467 -8088 16098 24131 -35264
455 -35264 -9041 31144 -22042 -23238 16763 -24606 -25136 32707 -1683 -27267 19467 -9332 -32062
468 -32062 35789 16261 -45643 -2377 8575 -20221 29852 22248 -47683 971 50945 2211
480 2211 12346 32775 -28424 -6935 55107 -3403 -28209 12863 -36376 -42193 39510 610
492 610 -56931 -5358 -10259 -25021 51715 28937 -54948 1219 45227 2683 34923 36124 -50847
505 -50847 -10691 57551 -8843 -13910 24138 -49114 -39522 51644 -1476 -42860 14688 -24656
517 -24656 -43126 53455 23546 -58121 8574 25731 -25901 41352 45729 -53759 -698 58151
529 58151 -21735 -161 47842 -41028 -29346 55386 -12627 -38264 32554 -23429 -58052 33845
541 33845 6671 -55386 20255 15961 -48745 24857 40598 -38285 13318 42056 -37597 2973
553 2973 55394 -16458 -2825 46250 -24299 -20572 51230 -5255 -32410 25725 -22694 -46821
565 -46821 40952 7789 -57170 3662 -7369 -49080 32780 25348 -59983 3483 43214 -17750
577 -17750 29697 57605 -35473 -6714 63466 -9309 -10849 48541 -34336 -48817 51810 2821
589 2821 -53826 11019 -25257 -61377 42021 28067 -62586 3850 38340 -21401 29495 48309
601 48309 -46602 -13219 49668 -21987 -11747 48594 -25474 -35546 45708 3949 -24186 31033
613 31033 -17745 -48404 40837 25506 -44540 5023 13473 -32146 18811 16780 -59225 -7793
625 -7793 36114 -29764 -4645 41987 -15398 -751 49238 -8520 -10148 42104 -18508 -39685
637 -39685 37655 12082 -35873 8612 -8517 -37760 28560 11830 -58009 1560 35525 -16540
649 -16540 15310 37108 -17659 9297 38240 -26098 -14230 35364 -21241 -36540 21948 -186
661 -186 -16780 21812 -17774 -38965 31855 14394 -42523 4902 20457 -13166 22267 20109 -30024
674 -30024 8428 28891 -32263 -14434 32444 -10118 -13916 26118 -2472 -568 37891 -15645
686 -15645 -41769 22846 12362 -30164 1136 808 -19794 19101 9730 -37882 -1467 22339 -23965
699 -23965 -12635 23391 2028 7573 25226 -8619 -959 34464 -6128 -30608 7875 6332 -8895
712 -8895 6747 -5666 -11818 20962 5996 -30545 -5742 11839 -9134 -2458 5266 -5491 15552
725 15552 19307 -17754 -8490 17619 -7179 -16210 1846 -2768 5293 18466 -7272 -11713 18982
738 18982 5938 -21724 -6130 3395 -2478 9834 2505 -12118 14541 19802 -15811 -12854 6500
751 6500 -3343 -2822 2509 -7603 4600 19098 -4400 -15884 4633 2845 -12447 -6119 -2629 -327
765 -327 14659 6058 -10142 7390 14401 -5815 -9842 -2549 10 7552 5556 -6231 1369 13654
779 13654 1407 -11654 -5934 -2524 -4221 -1875 -4947 -2114 10467 3216 -9886 -3708 2250 -1755
793 -1755 -4525 -5699 769 12583 11702 2063 1651 8694 5817 -2640 -4057 -2455 2051 4355 -2359
808 -2359 -2374 5355 1025 -7376 -9503 -7681 -2845 -1956 -5310 -2628 5268 7780 2200 -2264 -8 423
824 423 -1770 -2665 -2441 3746 8164 3142 1438 4080 3553 673 -3723 -5454 -1347 1426 953 -454
840 -454 166 2303 -939 -4048 -3514 -4041 -2391 -1485 -2512 2051 5105 2065 90 -990 -1128 -379 -1383
857 -1383 -1889 -320 2447 4152 2681 2962 2496 -834 -18 218 -1832 1263 1750 -539 2139 1637 -2028
874 -2028 -1771 -2719 -5592 -4586 -1284 -693 726 3942 1462 490 5108 1451 -3873 749 -830 -3766
890 -3766 2721 2054 -1758 3391 2118 -4498 1 3844 -2731 -2500 2683 -667 1929 7578 -2840
905 -2840 -6453 3588 -1236 -7399 16 -3008 -5790 4709 3348 -3600 5067 5675 -4719 1385 7478
920 7478 -1779 -790 3685 -4711 492 8510 -6828 -9916 3067 -1780 -3727 4467 -3698 -4464 10744
935 10744 5235 -4299 6153 3580 -7050 2966 4191 -7944 746 2179 -12323 -96 9378
948 9378 -9538 -7294 5947 -4368 248 12118 -5067 -5581 15177 3805 -6811 9372 2170
961 2170 -9580 8616 4577 -11605 6812 7500 -14604 1834 11596 -11040 -3014 7696 -12767
974 -12767 -4173 12515 -10522 -11377 11057 -5759 -13103 10452 -149 -10503 13315 3639 -12653
987 -12653 16230 15841 -9619 7516 11410 -10967 7121 15334 -14686 -6375 10173 -13414 -8649
1000 -8649 12329 -12372 -17803 8672 -5108 -11113 15054 -1730 -17792 13265 11397 -8428 11351
1013 11351 6678 -14720 10654 17577 -11043 372 10581 -13247 186 17429 -12341 -11081
1025 -11081 10666 -10400 -7299 17652 -9015 -18282 12595 -968 -11882 15458 -289 -20975
1037 -20975 12519 12164 -13693 11055 12266 -19126 7098 22274 -14714 -1865 17981 -16359
1049 -16359 -6270 22050 -12924 -16778 17650 -6489 -18117 16978 -771 -22497 14601 10065
1061 10065 -18795 11388 13587 -19743 8088 22436 -15154 -2106 15941 -14765 -3336 20385
1073 20385 -13608 -16816 13073 -5799 -12182 15340 -4294 -19362 13080 6107 -12340 14125
1085 14125 5649 -18824 10434 15775 -10734 6057 8067 -17800 5510 19835 -14034 -8977 9353
1098 9353 -13314 -4016 18799 -13140 -18238 14012 -3819 -11098 19122 -2755 -22558 13263 10519
1111 10519 -9921 15999 7999 -21390 10554 24896 -9281 199 11912 -17118 -1357 23167
1123 23167 -12541 -16814 11425 -11277 -14608 16779 -5635 -22330 8829 814 -14745 14334
1135 14334 7284 -19407 7714 17026 -9224 6568 14986 -12789 3313 21554 -9218 -5846 15330
1148 15330 -8661 -9119 13677 -8004 -15062 9629 -5142 -17094 8480 793 -16857 6340 5941
1161 5941 -13189 7771 12295 -9914 6280 14892 -8553 2713 16359 -6072 -3226 10343 -8615
1174 -8615 -5971 12540 -5972 -13811 5850 -2946 -9665 10121 -423 -15066 6601 6465 -8443
1187 -8443 7246 5391 -13528 4328 13312 -6493 476 8442 -8996 -61 15626 -4725 -8168
1200 -8168 8523 -3675 -6316 12136 -2850 -16017 3686 1310 -9423 5696 324 -15537 3040
1213 3040 12051 -3631 2230 7009 -6075 3480 15502 -1661 -4437 6763 -3213 -4634 7697
1226 7697 -3408 -11885 -633 -3883 -7180 5033 65 -10133 1727 7202 1041 4853 3345 -4642
1240 -4642 4431 9910 -2035 -1176 4755 -2416 -991 4352 -4334 -4047 2619 -5210 -5327 5131 518
1255 518 -5460 709 -302 -2764 3329 -1217 -8582 1185 5297 -3572 -350 4594 184 3468 5113
1270 5113 -2387 1773 8477 620 -2694 3803 2405 -1023 9 -4197 -5988 -210 -2807 -9315 -2808
1285 -2808 2134 -1832 -655 1035 644 5023 4009 -2663 69 6041 3473 -721 88 924 1650 937
1301 937 -4339 -5243 974 603 -3955 -1049 2320 2972 2547 -876 -1369 3334 2598 -3159 -3661 942 2414
1318 2414 -196 -2743 -2806 563 2037 -3163 -4726 1008 3353 1045 -213 516 3493 3977 -1503 -4134
1334 -4134 -654 2013 -873 -3580 -864 3100 3329 352 -2644 217 3604 -105 -3460 -1158 2577
1349 2577 3101 -809 -3654 -781 1143 -2084 -5844 -4350 1017 2513 247 144 3135 6469 4471
1364 4471 -563 164 3478 2546 -587 -2227 -173 2654 -231 -5348 -4917 -1275 -1382 -4956 -5015 -945
1380 -945 2421 3059 -25 -786 4043 4228 -1259 -1582 1143 2523 2676 154 -662 3036 3597 -1740 -4027
1397 -4027 -486 722 -1166 -1542 -2229 175 3427 -1308 -5456 -1005 70 -3164 -2628 -1455 458 4537
1413 4537 3165 -695 2662 6117 1178 -1337 1276 208 1247 2646 -2434 -2265 3549 -1423 -6040
1428 -6040 -1874 -1555 -3264 -110 -699 -1656 4850 4645 -2346 518 4306 -453 -254 2190 -1783 1526
1444 1526 5616 -1794 -2651 3118 -1799 -5005 -732 -3459 -4320 1642 -1120 -4287 3078 2631 -4377 183
1460 183 2617 -1811 2982 4767 -2118 3713 8642 -383 -114 4243 -3045 -3101 2429 -4006 -4976 2754
1476 2754 -2353 -5898 2810 -180 -6786 845 521 -5241 3638 4483 -4926 2763 6956 -2719 1250
1491 1250 5117 -4197 -111 7824 -1066 -1264 7305 -1031 -3903 6013 -1685 -9268 993 -2667 -9221
1506 -9221 2683 286 -10298 830 3981 -5791 2718 6656 -5130 2208 12273 1488 1797 9721
1520 9721 -2168 -3308 8886 -2047 -10136 1479 -3351 -8738 4829 98 -11096 1088 3760
1533 3760 -5357 3532 5209 -7710 408 9569 -1245 526 5725 -7210 -4026 9676 -748 -5276
1547 -5276 4356 -2690 -2118 11592 2270 -7263 3436 539 -6187 4729 960 -11855 -1349 2647
1561 2647 -7850 1736 4975 -10116 -1643 10443 -1469 1581 10576 -3167 -864 13353 -25
1574 -25 -7186 5357 -2912 -10749 3511 -883 -12551 2031 2746 -10698 3157 8753 -6443 1901
1588 1901 10042 -4174 1839 12183 -2851 -3346 7910 -4080 -7066 7339 -1310 -9477 2750
1601 2750 -1232 -7149 8107 3935 -10711 365 4335 -4567 4419 3913 -11150 -2061 7769 -2690
1615 -2690 35 5272 -6973 -2921 11903 3131 -1389 6613 -2713 -3897 11942 3121 -9980 -1075
1629 -1075 -3018 -7620 4951 743 -14565 -3513 4126 -3869 3167 5691 -8523 -871 12537 1987
1643 1987 817 7554 -4644 -3366 12049 2149 -7419 1848 -3221 -5998 8020 2213 -11274 -934
1657 -934 2844 -5170 3559 3888 -10413 -2170 7601 -3144 -526 5880 -6068 -2787 10186 622
1671 622 -3612 5797 -427 -3361 8682 2866 -7299 2179 2238 -5841 2642 2411 -8909 -1798 4151
1686 4151 -4593 -796 3986 -5016 -1911 6338 -1213 -2087 5000 -949 -2565 5354 386 -3904 3808
1701 3808 785 -4810 2550 1389 -4469 2119 1835 -5124 890 3158 -3928 526 3473 -3780 -921
1716 -921 4915 -1621 -977 4261 -2357 -2276 5697 308 -3980 2544 -445 -3564 3798 679 -6299 264
1732 264 1788 -3926 867 2147 -4374 -342 4755 -578 339 4403 -1790 -1712 5157 1311 -2120 1801
1748 1801 -1014 -2696 3059 827 -4527 -426 352 -2858 606 913 -3591 -833 1775 -1773 84
1763 84 2303 -1830 -1190 2595 167 13 2526 -637 -541 3350 1155 -1098 1049 354 -1282 1272 443
1780 443 -2559 63 589 -2517 -605 666 -2298 -943 665 -1305 -30 1768 -637 -344 2147 519
1796 519 -124 1520 518 -363 1566 765 -996 832 745 -1487 -220 -313 -1669 -455 -103 -1405 -401
1813 -401 664 -253 -302 616 42 -190 1002 452 -188 940 123 -712 447 -121 -1080 -154 -457 -848 294
1832 294 573 -25 603 983 406 484 811 -40 -486 416 -280 -820 -104 -978 -793 160 -405 -550 286 449
1852 449 257 677 484 229 319 11 -882 -1060 -230 -1269 -1356 -699 -668 378 910 288 1116 2289 2178 1745
1872 1745 1725 1567 1227 205 -697 -1416 -1137 -1768 -3058 -2728 -1654 -1660 -1087 -661 -509 1348 1752 951 1248
1891 1248 2046 1799 1007 487 93 63 201 -1028 -1876 212 708 -672 121 510 913 1583 625 -988 321
1910 321 608 -1459 -2201 -1622 -1666 -1827 -1599 -2094 -757 1438 617 76 2801 3420 2682 2772 1393 1099 2553
1929 2553 284 -2592 -1517 -872 -2586 -2483 -2349 -2685 -802 378 -1512 -29 3124 1204 406 2476
1945 2476 1454 991 1743 -1496 -2281 1677 99 -3088 -1194 246 -603 1066 904 -1651 1253 3095
1961 3095 -905 -291 2029 -976 -1193 572 -1957 -1570 831 -2636 -3376 2051 2072 -809 1250 1225 556
1978 556 3824 2240 -2789 166 1883 -2336 -1342 307 -2980 -1438 625 -2870 -1163 2979 -836
1993 -836 -1694 3203 2301 724 3190 359 -1361 3391 1047 -4310 -207 405 -3114 -418 -46 -3183
2009 -3183 824 1706 -3672 -1051 3183 -870 -1014 2066 -1213 -395 4134 -925 -2749 3252 211 -2898
2025 -2898 3061 2062 -2019 2391 1146 -2936 3237 3153 -5324 -2601 2013 -2017 -208 1907 -5215 -3404
2041 -3404 4522 -554 -2904 2736 -1233 -3265 4869 3173 -1709 2737 852 -3249 4019 4916 -3946
2056 -3946 -2398 1536 -1340 2095 3676 -5102 -4001 3059 -608 -1679 1637 -3831 -3768 3737 1314
2071 1314 -1344 2367 -1363 -3302 4086 3647 -2285 546 295 -2321 4366 4111 -4915 -2026 1995 -2695
2087 -2695 521 2886 -4509 -2173 4263 -1009 -1701 3754 -2200 -4204 3885 945 -3468 2894 614
2102 614 -4320 3617 3372 -4617 566 3100 -3575 719 3903 -3494 -874 4778 -1961 -2635 3488 -1727
2118 -1727 -3602 3362 -605 -3943 3679 1579 -3350 3118 1961 -3751 1779 2668 -3523 231 2556
2133 2556 -3125 56 3355 -3601 -2663 2739 -1770 -1412 3495 -1575 -2290 4512 1331 -1662 2799 -194
2149 -194 -3288 2952 1901 -3215 518 1219 -3018 1707 2885 -3913 -1273 2516 -2129 -105 3013
2164 3013 -3129 -2218 3505 -904 -1970 2234 -2085 -3279 3733 1667 -2424 2217 985 -2219 3818
2179 3818 3255 -3767 -109 2134 -2602 799 2590 -4189 -2287 2694 -1865 -1651 2638 -1987 -2876 3465
2195 3465 1441 -1551 2578 514 -3160 2623 2320 -3317 -208 1161 -2531 1003 2312 -2309 -581
2210 -581 2569 -1113 -422 2582 -926 -1737 1812 -191 -1423 1783 -665 -2907 1297 852 -1751 1226
2226 1226 555 -1608 1873 1852 -1518 679 1461 -1867 -348 1292 -1832 -928 1179 -1921 -1253 2180
2242 2180 -455 -1171 2372 277 -350 2784 898 -1143 2034 862 -2298 235 594 -2562 -663 391
2258 391 -2183 -477 1485 -1201 -691 2035 -348 -661 2037 -149 -795 1496 121 -1415 1123 493
2274 493 -1501 201 758 -752 765 1372 -719 567 1734 -448 -243 562 -1300 -982 68 -1326
2290 -1326 -1282 81 -796 -1035 546 320 -161 908 880 149 1685 1247 -267 696 654 -758 46 203 -1183
2309 -1183 -397 44 -641 -384 391 -124 -332 621 183 -241 536 -122 -751 110 -127 -1043 -220 -182 -847 154
2329 154 402 -157 710 833 510 722 925 440 159 484 -101 -544 129 -468 -839 -96 -567 -818 -101 -377
2349 -377 -448 71 173 19 152 397 -23 83 288 -223 -215 397 20 -138 415 124 87 524 60 29 247 156
2371 156 -198 -156 -185 -151 2 -223 -488 -94 192 -403 -309 76 23 377 387 -1 183 289 -197 -137 82 75 3
2394 3 93 -32 -52 357 243 -357 180 348 -256 -42 -57 -332 187 187 -320 -86 334 -4 -162 370 209 -78
2416 -78 466 -177 -424 32 -281 -942 -242 -315 -774 -123 -4 -412 591 630 -173 456 688 355 279 579 -71
2437 -71 -155 460 -553 -874 176 -554 -984 143 -390 -579 565 429 -434 400 353 -607 396 549 -580
2456 -580 81 368 -427 110 932 -702 -436 972 -196 -22 1140 -320 -464 1034 318 -535 192 -627
2474 -627 -1528 311 311 -1356 -397 315 -806 712 1455 -928 -380 1082 -286 109 1270 -760 -1079 891
2492 891 -11 -676 854 -553 -1661 1041 1178 -878 709 633 -960 1228 1741 -1237 -467 691 -1323
2509 -1323 -359 1141 -1225 -1437 797 -619 -736 1350 -527 -1661 1045 737 -514 1377 392 -1462
2525 -1462 1086 1389 -1063 260 1082 -1119 346 1310 -806 54 1443 -1157 -970 1367 -690 -1412
2541 -1412 945 -1068 -1500 1411 -271 -1653 1257 362 -1609 1165 1478 -738 1082 1403 -1491 1114
2557 1114 2556 -1568 -1025 1662 -1197 -417 1938 -1611 -1901 1907 -538 -1938 1665 -31 -2665 887
2573 887 1121 -1603 991 953 -2563 461 2760 -1230 -397 1661 -1135 516 2695 -1011 -1368 2253
2589 2253 -399 -1361 1313 -618 -1897 940 -92 -1884 1083 580 -2376 752 1778 -1265 464
2604 464 1207 -1522 815 2125 -1747 -913 1599 -828 -462 1548 -1230 -1229 2118 -55 -1785 1824 257
2621 257 -2023 1566 1079 -1684 1474 358 -2452 1080 2367 -2194 -810 1176 -1296 175 2141
2636 2141 -1962 -1401 2445 -542 -1617 1858 -450 -2199 1701 375 -1739 1763 529 -2640 1156
2651 1156 2476 -1245 218 1384 -1588 613 2644 -1587 -1368 1753 -917 -1518 1664 -951 -2250
2666 -2250 1031 -275 -1769 1508 307 -2398 551 1314 -864 957 1042 -1446 949 2339 -1005 -234
2682 -234 1626 -765 -130 1537 -961 -880 1212 -819 -1540 1165 -564 -1567 778 -13 -1213 1363
2698 1363 227 -1706 1358 1454 -1375 608 1089 -1208 681 1548 -1647 -471 1687 -936 -784 1459
2714 1459 -723 -1143 1583 -203 -1285 1371 -53 -2006 783 720 -1550 105 677 -1265 615 1811
2730 1811 -1017 -367 1635 -460 -278 1402 -294 -758 1109 -320 -1178 660 -377 -1581 157 101
2746 101 -966 750 904 -411 719 1301 -332 688 1130 -322 -304 555 -795 -454 440 -1347 -1479
2763 -1479 189 -541 -708 663 -236 -403 1262 742 -122 948 475 -397 644 877 -670 -22 507 -833
2781 -833 203 1010 -601 -581 654 -320 -186 888 -412 -913 201 -299 -1016 -152 -465 -1321 6 350
2799 350 -550 300 874 13 966 1428 201 469 1027 -17 123 702 -340 -834 -351 -916 -1043 -237 -682
2818 -682 -1011 -23 130 -168 519 567 31 613 773 -35 158 325 -172 8 76 -292 -203 247 -183 -362 351
2839 351 50 -112 316 188 -214 290 -287 -345 -3 -367 -478 -372 -75 -279 173 276 110 152 626 143 124
2860 124 528 89 2 84 -414 -330 -112 -491 -595 -323 -132 -392 28 167 71 411 422 151 478 359 3 -63
2882 -63 5 -177 -187 -166 -452 -337 -314 -369 -407 14 -42 153 113 165 354 352 524 -35 -30 303 34 118 103 -148 87
2907 87 178 -213 -64 -54 -222 -216 -217 -196 -301 36 -282 -531 -50 -184 -391 47 89 -2 357 353 93 619 544 218
2931 218 281 386 125 -115 174 -155 -272 190 -273 -706 -63 -266 -725 -202 -125 -365 268 180 13 245 226
2952 226 -197 121 446 -106 139 505 -212 -76 348 -322 -317 275 -232 -412 246 -125 -362 119 124 -574 71
2973 71 161 -579 180 329 -433 -3 312 -240 0 465 -347 -65 519 -227 -350 357 -2 -295 387 -216 -486
2994 -486 493 188 -559 316 209 -613 460 580 -462 70 224 -674 -31 571 -705 -343 551 -579 -362
3013 -362 544 -348 -943 527 -18 -782 669 360 -840 801 771 -516 387 760 -748 103 951 -426
3031 -426 -229 683 -464 -571 948 -451 -949 570 -270 -921 463 1 -916 596 301 -674 308 488
3049 488 -580 364 954 -410 101 943 -295 -15 978 -494 -573 549 -513 -570 684 -386 -928 803
3067 803 -182 -795 643 5 -989 817 528 -707 473 553 -1040 274 1079 -902 -461 763 -956
3084 -956 -45 1383 -738 -1024 1084 -208 -696 1527 -216 -1632 806 785 -921 686 413 -1877 229
3101 229 1351 -977 -164 814 -1252 -25 1568 -573 -953 776 -459 -760 1287 -50 -1350 566
3117 566 341 -731 975 427 -1499 429 1216 -443 541 744 -951 117 1106 -720 -353 430 -971
3134 -971 -704 960 -567 -1039 595 -345 -754 1231 52 -1031 1029 488 -833 739 490 -1011 723
3151 723 779 -1168 179 901 -1109 -384 1187 -906 -589 1247 -583 -993 1153 -663 -1114 1186 180
3168 180 -1303 761 477 -967 872 740 -1436 234 1403 -670 -23 1085 -1030 -234 1588 -860
3184 -860 -1053 721 -335 -1000 990 -55 -1291 576 406 -773 673 361 -1242 326 1137 -231
3200 -231 249 436 -1129 371 1159 -677 -819 238 -438 -48 942 -456 -918 676 99 -266 972 10
3218 10 -1118 505 653 -357 740 -25 -1500 347 1177 -600 -330 103 -926 174 1332 -637 -683
3235 -683 778 -479 -420 966 -227 -939 569 168 -580 1268 484 -1187 185 1039 -265 211 450
3252 450 -788 28 866 -566 -473 427 -642 -705 362 -192 -641 434 -196 -946 469 613 -511 208
3270 208 430 -19 364 711 -174 376 750 -463 -194 584 -378 -357 85 -560 -177 629 -248 -630 152 130
3290 130 -226 282 21 -333 445 212 -251 417 489 -354 107 358 -233 188 233 -482 -78 529 -184 -363 35
3311 35 -157 -243 314 1 -428 369 212 -428 444 136 -79 347 125 -242 335 312 -415 -284 246 -231 -216
3332 -216 -122 -256 -316 296 -8 -485 397 279 -77 161 111 -183 261 192 -206 284 293 -179 28 -37 52 -78 -1
3355 -1 -443 -232 1 -313 -479 31 -111 -204 73 -329 -42 227 189 128 243 207 150 233 382 234 269 262 -162 -195
3379 -195 -132 -340 -471 -409 -432 -358 -172 -282 -71 166 22 -94 62 269 14 270 191 15 46 330 -146 -67
3401 -67 -17 -91 41 52 -140 -57 5 -139 -354 -33 -105 -227 -211 -107 -361 -66 87 -161 28 0 -95 299 311 101
3425 101 244 288 72 147 132 -148 -253 -117 -359 -284 -80 -171 -471 -149 9 15 354 218 194 433 288 60 328
3448 328 210 -140 -14 76 -352 -251 -11 -382 -209 52 -55 -48 403 -106 -120 347 34 -92 146 105 -155 262
3470 262 199 -60 172 210 -217 28 457 -66 -106 376 -105 -59 142 -533 -525 43 -280 -486 14 -99 -242 95
3492 95 174 -286 262 650 -38 297 639 76 161 510 -68 -116 335 -436 -391 259 -453 -713 80 -223 -198 305
3514 305 -1 -526 194 237 -209 492 258 -353 252 403 -320 161 246 -376 107 598 -107 -26 402 -436 -256
3535 -256 726 -401 -798 139 -253 -473 608 -146 -970 204 188 -600 455 484 -700 229 925 -250 146
3554 146 561 -588 -312 883 -311 -583 507 -453 -562 687 95 -782 305 320 -614 281 612 -625
3572 -625 123 629 -422 -7 694 -502 -247 540 -429 -298 800 -393 -431 484 -124 -328 614 193 -747
3591 -747 335 344 -313 620 242 -890 239 575 -387 315 635 -879 -34 800 -460 -200 451 -765 -465
3610 -465 1106 -230 -835 406 -295 -586 1016 89 -1202 353 478 -525 696 721 -1220 195 1147
3627 1147 -363 -59 697 -916 -706 1283 -395 -981 540 -446 -548 1035 56 -1318 286 376 -636
3644 -636 577 335 -1242 51 1060 -180 127 599 -799 -407 1327 -22 -515 528 -295 -530 1001
3661 1001 -207 -1140 229 -185 -396 612 88 -1107 62 551 -325 428 442 -921 18 945 -457 74
3679 74 567 -1004 -259 1056 -377 -506 645 -316 -662 873 136 -737 672 245 -831 813 721 -1071
3697 -1071 241 582 -799 82 937 -834 -503 854 -596 -439 953 -280 -796 665 -30 -624 1022
3714 1022 333 -1099 335 581 -486 483 601 -915 -5 974 -76 180 481 -698 -414 843 -166
3731 -166 -613 215 -411 -588 704 -9 -883 76 121 -276 929 429 -472 308 553 -108 415 733 -623
3750 -623 -127 500 -386 -114 321 -881 -612 324 -274 -643 295 -499 -474 708 200 -664 217 184 -432 402
3770 402 277 -429 157 604 -371 206 605 -184 -296 715 -243 -550 497 -248 -760 233 -152 -758 111
3789 111 125 -541 148 480 -275 363 664 -215 292 632 -202 79 656 -130 -310 198 -221 -407 -33 -299
3809 -299 -417 38 -115 -216 371 204 -132 321 483 -135 103 258 -457 70 279 -23 -38 120 -188 -78
3829 -78 186 -214 -302 156 -195 -337 10 -201 -335 146 -212 -295 82 170 -254 119 362 160 381 424 -32 97
3851 97 336 -210 -455 55 -137 -493 -201 -347 -596 68 -108 -446 1 211 35 162 187 119 270 199 -217
3872 -217 111 454 122 34 132 115 -155 196 -120 -161 -25 -124 -456 -239 -286 -223 -185 -78 0 44 136 -82 18 459
3896 459 331 115 226 238 403 257 56 64 -24 -24 -327 -171 -121 -199 -91 -141 -341 28 129 -271 -186 147 32
3919 32 269 187 -20 254 223 -64 -7 124 75 74 29 95 86 39 -89 -227 19 -8 -295 -168 -225 -167 266 -34 -248
3944 -248 190 216 146 69 39 21 105 219 -24 -99 129 20 -329 -12 -160 -316 17 -172 -117 301 204 -30 0
3967 0 296 -51 111 62 -127 -23 323 -70 -183 283 -316 -110 12 -222 -142 274 -124 -261 34 139 -445
3988 -445 0 75 -56 2 119 -233 280 400 -125 -9 343 -266 -123 241 -162 -276 416 -153 -456 172 -24
4009 -24 -650 59 -77 -441 122 88 -440 79 369 -330 -9 362 -126 146 374 -142 -165 450 83 -182 181
4030 181 -82 -89 431 14 -467 -105 -4 -514 221 229 -540 -118 25 -390 358 426 -327 -64 435 141 46 466
4052 466 -313 -210 392 79 -388 286 -448 -638 637 133 -539 301 -71 -381 650 496 -618 -164 394
4071 394 -217 60 708 -651 -468 663 -89 -137 474 -143 -515 615 305 -588 388 -21 -788 288 333
4090 333 -621 -154 444 -492 -89 733 -177 -184 866 -194 -247 612 -96 -336 327 -5 -935 180 18 -540
4110 -540 207 148 -566 252 501 -416 269 559 -519 89 587 -408 -143 523 -652 -330 555 -394 -336 668
4130 668 -170 -513 667 73 -431 740 325 -764 108 67 -871 145 473 -978 -158 687 -345 59
4148 59 710 -223 -36 1217 69 -382 804 -20 -791 764 197 -998 157 -11 -1051 382 618 -634
4166 -634 -149 461 -331 200 706 -467 -564 826 -101 -300 478 -674 -896 396 89 -590 336 85 -723
4185 -723 570 611 -232 162 251 -567 154 635 -477 -287 415 -396 -52 541 -489 -276 482 -184 -224 720
4205 720 -213 -647 393 110 -366 355 218 -799 359 431 -634 82 418 -718 105 797 -419 -132
4223 -132 644 -359 -450 820 -31 -384 553 43 -837 459 228 -777 378 296 -780 133 511 -409 57
4242 57 576 -582 -235 574 -295 -257 463 -131 -450 564 95 -452 200 27 -470 407 188 -474 -19 129
4262 129 -420 221 120 -443 -163 302 -117 70 381 -438 -299 416 -127 -259 478 -366 -265 551 147 -255
4282 -255 362 85 -297 397 247 -437 41 79 -436 -40 397 -519 -288 288 -383 -160 577 -46 -313 409
4302 409 -58 -183 227 88 -510 263 110 -452 146 95 -481 -44 265 -277 75 480 -169 -165 511 53 -41
4323 -41 192 -130 -552 326 -180 -258 59 -190 -290 254 252 -296 84 248 -229 12 171 -428 -178 35 -153
4344 -153 -139 257 -34 -106 323 121 -51 323 214 -160 252 103 -211 32 -77 -247 24 -92 -279 -116 -45
4365 -45 -75 -119 16 -18 139 205 252 62 258 163 -349 223 -139 -8 -33 -19 -218 132 45 -199 -2 54 85 15
4389 15 299 -95 -12 41 -81 -142 -30 -359 -293 42 -2 -58 238 176 -95 170 257 157 136 282 21 -92 27
4412 27 -118 -92 -101 -245 -26 101 -86 -41 284 -80 43 20 -128 -110 -69 -113 -60 -20 -245 -239 -47 148 -96 169
4436 169 178 9 219 372 62 145 245 125 -24 -23 -178 -416 -70 -89 -475 -27 -3 -31 25 59 -188 88 58 -35
4460 -35 253 59 17 61 -4 -172 93 92 -88 89 75 107 32 194 162 -181 35 -19 -238 37 -243 -340 0 -61
4484 -61 -91 6 7 -286 126 48 -133 -210 255 90 154 357 98 -182 98 -134 -150 224 -58 -74 144 30 44 247
4508 247 125 -379 -64 245 -29 139 282 -254 -47 108 -421 -122 130 -348 -382 64 18 -170 191 -45 -188
4529 -188 115 168 -356 216 139 -174 145 291 -216 127 406 -305 -202 294 -126 -116 156 -215 -300 231 -116
4550 -116 -568 140 0 -260 -46 379 -367 324 240 -247 150 314 -255 44 407 -190 -22 241 -310 -273 368
4571 368 -260 -403 165 -152 -451 83 -145 -639 213 -4 -501 177 238 -395 238 342 -374 324 477 -327
4591 -327 18 566 -235 -305 573 -133 -248 534 -157 -379 593 132 -546 216 41 -608 217 391 -532 126
4611 126 379 -599 15 529 -523 -320 535 -217 -196 768 -187 -493 424 -80 -430 356 94 -771 148 423
4631 423 -469 18 382 -651 -87 594 -261 -10 430 -267 -121 682 -169 -479 337 -174 -292 407 -208 -481
4651 -481 149 213 -455 468 345 -523 310 317 -343 427 350 -620 -126 599 -358 -456 449 -541 -360 568 -222 -388
4673 -388 634 -50 -473 637 -4 -803 467 222 -588 150 369 -620 243 819 -322 -226 622 -169 -175 1016
4693 1016 -225 -526 773 -30 -460 533 -56 -763 316 260 -620 17 127 -629 -67 694 -174 -149 385
4712 385 -429 -75 642 -51 -210 483 41 -109 516 -31 -372 240 62 -240 530 86 -513 154 224 -529
4732 -529 91 107 -601 -164 221 -499 -69 513 -483 -71 526 -155 38 542 -137 -366 601 38 -282 407
4752 407 105 -598 278 345 -617 406 256 -686 100 471 -317 -198 420 -390 -211 685 43 -700 224 80
4772 80 -338 569 97 -720 287 404 -114 260 352 -342 16 505 58 14 158 -275 -201 522 -26 -327 35
4793 35 -359 -187 343 45 -308 180 52 -232 469 105 -355 43 277 -101 136 185 -342 163 360 -129 -183
4814 -183 344 -185 78 376 -102 -183 206 -32 -228 277 -33 -508 20 101 -412 -79 108 -255 138 437 -219
4835 -219 -85 431 -75 -45 372 -276 -197 453 -25 -197 37 110 -178 233 -49 -195 73 322 -72 119 324
4856 324 -261 -63 160 -184 -203 114 -130 -191 -43 -69 -114 -16 -10 19 379 131 -50 377 211 161 229 68 -77
4879 -77 135 74 -229 -78 -107 -300 -35 201 31 -65 146 31 -26 130 7 -109 145 -55 -218 61 -179 -233
4901 -233 138 138 -193 128 173 -114 222 342 104 163 246 39 -68 -83 -179 -360 -120 -155 -171 47 24 -38 -48 144
4925 144 -25 179 145 118 38 110 -74 -16 92 -142 -244 -62 -61 -52 32 17 114 231 117 105 284 133 -18 -31 60
4950 60 -167 -139 -132 -277 -138 -31 -132 -18 36 -10 71 173 168 192 97 104 -32 -106 -97 -109 -74 94 -175 166 230 -91
4976 -91 49 183 44 276 494 -14 187 112 -309 -249 -158 -268 -424 17 -296 -196 51 -10 -145 100 270 41
4998 41 339 193 27 -83 -56 -81 43 43 -59 -42 264 -86 -64 87 -51 -27 270 -128 -28 132 -131 -287 16
5021 16 -241 -381 -214 133 -261 -93 -69 -198 152 103 137 41 391 -125 55 314 -191 10 142 -368 -294 46
5043 46 -181 -237 90 -101 -52 249 124 -370 199 231 -299 92 268 -437 -335 204 -204 66 457 -100 -283
5064 -283 246 133 -216 205 131 -297 157 18 -483 28 -25 -552 217 289 -335 -52 337 -104 114 310 -277
5085 -277 -312 279 127 -188 162 -37 -166 405 70 -284 179 15 -320 316 172 -327 77 -52 -300 272
5105 272 181 -377 9 349 -216 -36 549 -361 -353 297 -175 -433 426 -181 -411 353 -3 -366 153 211 -636
5126 -636 295 347 -474 -1 435 -303 -29 572 -286 -39 645 -224 -339 502 -38 -450 409 -24 -544 279
5146 279 35 -729 0 234 -470 -20 470 -361 136 466 -372 -121 559 37 -244 462 121 -80 431 160
5166 160 -352 387 271 -443 182 -9 -301 134 132 -555 -110 56 -401 -43 272 -416 -67 588 -111 97 466
5187 466 -208 -59 630 316 -286 414 -213 -481 639 191 -652 32 123 -496 230 310 -735 -391 462 -238
5207 -238 -55 444 -528 -648 556 115 -206 483 6 -457 744 501 -399 154 291 -331 454 559 -470
5226 -470 -325 494 -274 -107 451 -465 -476 266 -248 -166 393 -306 -418 311 356 -312 242 19 -301 188 318
5247 318 -214 184 315 -363 53 352 -159 -105 56 -396 -51 456 -105 -87 205 -57 -245 330 -72 -330 168
5268 168 -32 -554 219 219 -536 -1 175 -341 253 535 -502 -12 414 -199 -89 248 -17 -198 325 56
5288 56 -320 472 -67 -452 410 231 -173 236 157 -357 40 326 -327 -225 203 -384 -259 168 -314 -450 198
5309 198 23 -12 462 171 -152 532 304 -19 151 154 -283 182 1 -289 97 -36 -316 -68 61 -243 -104
5330 -104 248 -136 -109 81 -197 -239 133 38 -219 119 0 -125 238 199 -118 132 267 -120 338 282 -54 34
5352 34 246 -94 54 169 -519 -280 182 -192 -396 70 -148 -209 46 -7 -152 65 216 -31 163 269 36
5373 36 57 222 -133 60 269 -145 33 162 46 -132 149 54 -7 246 -63 -92 -29 61 -78 126 37 -230 -49
5396 -49 -84 -41 -15 27 -55 33 99 107 -7 71 94 -73 230 11 94 84 -105 -76 38 -166 -271 -28 94 -2 97 -99
5422 -99 1 -80 6 -310 -81 39 -113 -213 4 -167 -314 64 42 1 303 189 35 234 172 125 88 120 74
5445 74 45 40 -133 -8 27 -354 -146 16 -136 -254 -41 59 -204 -25 -88 -204 -73 -46 -5 -75 90 -42 55
5468 55 0 -74 209 240 50 45 98 -34 148 38 56 13 28 4 147 -37 -55 -252 6 -17 -329 -108 33 -6 -112
5493 -112 -32 -211 6 -15 21 78 302 -5 0 179 91 56 143 -49 79 204 36 -1 65 -86 -322 106 -135 -486
5517 -486 -18 -171 -156 -144 126 -175 -193 120 -175 22 215 56 -88 173 -11 29 180 -28 -195 189 77
5538 77 -48 85 83 -142 59 101 -235 -218 -41 -162 -66 72 -343 -123 36 -68 65 225 -73 88 271 213
5560 213 -10 167 104 -69 28 172 -335 -6 128 -358 -114 167 -372 -93 1 -277 43 265 7 13 173 -295
5582 -295 -201 312 48 -208 25 12 -313 119 -28 -407 153 332 -229 150 294 -214 -75 192 -147 -213 279
5603 279 -232 -254 347 191 -248 251 0 -267 207 128 -256 161 214 -242 63 330 -253 -63 42 -105 -58
5624 -58 312 -104 -93 297 166 79 528 77 -292 216 22 -172 300 -69 -524 -2 150 -322 -97 84 -442
5645 -442 -77 386 -62 -113 387 -353 27 639 -72 -318 369 -169 -9 468 -54 -420 232 235 -194 321 295
5666 295 -404 87 421 -573 -39 285 -371 -268 423 -205 -336 387 -304 -371 418 -17 -288 295 184 -385
5686 -385 198 274 -318 205 232 -224 67 332 -245 -61 274 -149 27 197 -62 -385 167 3 -85 192 47
5707 47 -274 7 135 -481 251 8 -366 -10 291 -253 303 158 -266 193 364 -187 -41 218 -233 -103
5727 -103 588 -159 -358 288 -39 -196 316 -54 -481 87 85 -324 1 142 -518 39 259 -422 -119 445 -328
5748 -328 1 437 -208 -120 270 34 -210 542 210 -224 206 79 -220 179 161 -345 27 308 -240 -53 125
5769 125 -258 -76 283 -289 -56 251 -90 91 223 -72 -221 207 186 -179 165 182 -63 342 263 -129 193
5790 193 80 -287 37 212 -186 32 62 -138 -65 167 -218 -257 164 -270 -417 290 -125 -311 258 38 -233
5811 -233 258 78 -398 197 377 -135 140 388 -151 52 202 113 -52 212 -67 -319 72 -41 -344 187
5831 187 89 -247 192 117 -367 -24 40 -29 -5 47 -64 -47 170 4 -118 191 -11 -153 167 5 171 204 33
5854 33 -166 316 32 -176 8 80 -144 188 -16 -79 81 54 -246 -13 24 -225 -122 -49 -262 -74 186 -70
5876 -70 -85 127 -17 5 158 47 -131 130 28 -163 36 92 -139 -62 106 -107 -4 50 -126 -230 149 -122
5898 -122 -250 108 -142 -180 -27 -159 -256 32 -5 -75 52 148 -87 210 234 67 163 166 232 87 134 -40 95 -223
5922 -223 -125 -191 -31 -83 -70 -71 17 -275 -14 130 132 85 -132 -3 158 1 -44 181 113 -5 44 137 77 -11 55 159
5948 159 60 20 -85 -115 7 -205 -39 -1 -56 -264 6 -55 -210 -88 31 126 80 211 123 111 346 139 -67
5971 -67 123 -38 46 46 -148 -103 111 -79 -100 5 16 -11 52 154 -49 -132 -63 -144 -132 -87 -99 -134 45 -206 -123 -117
5997 -117 40 -239 43 123 -56 166 140 9 117 39 14 153 -4 -118 65 74 -169 24 -9 -80 -15 -104 -3
6020 -3 -27 183 -248 -179 6 -166 -99 -202 -94 -244 -8 21 -164 138 193 -97 114 209 -27 -73 151 -167 -1
6043 -1 176 -28 -192 44 -221 -264 -87 -164 -233 -15 -125 -213 -1 225 -193 -13 -32 -114 -38 35 26 56 235 -22
6067 -22 -105 178 225 106 261 61 -156 191 72 -289 -39 -74 -283 13 45 -261 -110 -105 -47 50 75 -147 144
6090 144 217 -52 164 191 34 -32 371 40 24 163 -153 55 406 -112 -198 98 170 -114 104 -81 -220 -80
6112 -80 21 -401 -153 194 -259 -234 102 -53 48 324 11 2 423 139 31 224 250 -122 178 95 -203 44
6134 44 305 -146 -19 190 -172 -112 157 -108 -196 176 -63 -291 -19 -34 -265 141 -46 -442 190 130 -111 343
6156 343 103 -171 86 177 151 75 101 -96 -123 17 -19 -117 140 -289 -95 134 -33 -98 234 -16 -311 253 -3
6179 -3 -160 13 -97 -268 -53 119 -369 37 164 -231 72 330 -244 -37 272 65 -20 214 105 -416 240
6200 240 25 -213 118 4 -297 119 141 -160 53 135 -288 -111 153 -102 -115 282 -181 -108 156 9 -133
6221 -133 331 10 -60 209 237 -51 217 143 -211 135 -35 -224 38 27 -274 -65 35 -260 -201 65 -206 -77
6243 -77 170 -58 -337 118 -198 -154 326 33 29 252 -39 -74 290 69 -329 13 111 -82 40 198 -282 -124
6265 -124 181 -239 -180 163 -212 -227 285 -107 -201 110 -126 -347 165 275 -141 18 280 -212 221 481 -15
6286 -15 17 118 -114 46 219 -189 -151 193 -14 -156 98 -29 -296 88 -46 -193 -125 11 -321 -12 118
6307 118 -146 98 184 -32 -47 258 -58 45 176 -163 -1 286 97 7 192 -88 -191 95 -187 -22 122
6328 122 -144 -120 58 181 -324 -153 -56 -430 131 265 -124 88 245 -103 -117 158 -44 -189 233 31 -119
6349 -119 179 110 -118 201 157 -195 143 -26 -74 -31 118 -4 -11 35 -42 7 97 -163 -218 149 -2 -158 5 -87
6373 -87 -151 -12 43 -114 149 122 38 33 210 110 19 246 65 165 70 -29 51 209 -91 -148 -177 -258 -75 5 -120
6398 -120 -64 20 -5 19 76 86 -19 -34 -56 -53 81 90 -57 147 23 14 57 130 -5 -184 127 -73 -112 120 -131 -38
6424 -38 -86 -18 -187 -281 -90 -113 78 -3 -88 50 66 -122 78 195 187 119 173 167 -55 101 -20 -97 215 127 -49
6449 -49 112 6 -7 -49 -39 -68 -13 -16 30 229 -102 -258 9 -32 -37 -100 52 -34 -4 60 44 9 163 117 189 -5 293
6476 293 132 22 -66 63 -14 -61 -129 -162 12 1 -70 19 81 70 158 31 37 -53 -97 -110 -29 36 -101 -103 -86 -95 -91 160
6504 160 -19 -106 74 139 99 152 112 -100 82 -111 9 6 -93 -135 -51 -110 -242 -35 21 69 -36 -31 -168 -36 58
6529 58 -57 98 31 -35 -57 89 -148 15 -15 76 63 128 -53 -71 150 194 66 30 48 -186 -89 20 -41 23 58
6554 58 -215 -8 -50 -187 121 -13 -29 101 35 135 118 88 49 11 168 56 -31 217 95 39 -52 109 -70 2
6578 2 42 -247 -58 33 -140 -105 -19 -18 -143 52 -215 -49 65 -25 -4 273 22 -58 78 286 -114 54 144 -81
6602 -81 85 -2 3 157 143 37 -49 -61 -47 -99 -16 -103 -119 89 -98 -73 47 -27 -46 74 38 -52 134 -24 29 -20
6628 -20 38 -134 1 204 -93 55 195 -142 7 207 -189 165 51 78 -149 109 -62 -272 103 34 -114
6649 -114 -19 -66 -336 64 -33 -132 -7 165 -114 -80 27 -51 -23 272 10 -95 59 -31 -60 172 -110 -42 115
6672 115 193 -94 4 -93 -52 -94 85 -138 34 119 -81 -6 154 -140 -112 129 33 -55 118 -177 -58 -87 178 34
6696 34 13 -97 -118 51 -72 -132 -109 -34 -149 -24 -70 -92 -77 89 -93 -48 99 -76 -97 173 -323 -100 226 43
6720 43 -31 315 -22 -209 204 93 -62 226 -12 -145 222 171 -280 -69 224 -137 -62 238 -170 -223 124 36
6742 36 -16 11 -36 -244 37 -7 -125 57 211 -110 -50 324 37 88 127 -78 98 360 -120 -278 -30 142 59
6765 59 87 -56 -154 162 -137 -14 -6 -124 -253 183 102 38 -15 5 0 42 56 6 63 140 -173 54 210 -53 -73 175
6791 175 29 85 183 59 -235 76 73 -161 -25 107 -194 -20 15 -223 0 -3 -193 -67 98 -179 -28 72
6813 72 -1 -36 135 -8 -195 158 -44 -100 -41 11 -26 50 14 -111 -15 103 -52 72 72 -118 -111 199 -90 -216 -207
6838 -207 -108 -332 -33 -65 15 17 104 165 243 184 -29 79 -3 -21 142 242 -137 -96 -82 125 -91 43 -18 -84 141
6863 141 -147 -111 25 -212 -44 -81 -6 -262 56 -158 -165 -13 47 -58 -78 23 -29 92 227 64 180 164 -59
6886 -59 39 202 50 -145 -45 -2 -119 -65 -128 -97 -94 -49 -203 -14 -33 -1 -17 32 -72 -125 155 19 -13 -19 -126 -41
6912 -41 132 76 81 34 -32 23 137 30 -97 152 -71 -22 -98 -66 -57 -132 8 -200 45 -131 -69 -35 -27 -77 32 48
6938 48 -42 120 133 79 65 41 54 -8 -118 58 -79 42 44 -8 -69 -89 34 19 -107 -51 -183 -159 -149 -92 -147 -95 -191
6965 -191 -14 106 -17 15 151 111 175 -46 87 63 -25 81 48 184 104 -8 93 27 -172 32 -63 -89 -90 -151
6989 -151 -148 -101 -30 -129 -38 10 -41 157 2 -44 31 41 40 48 191 14 -21 -13 63 -92 15 -70 173 185 -161 114 90
7016 90 -20 71 99 -42 -290 -104 11 33 -243 9 -39 -45 90 114 -25 -75 42 -104 -38 51 4 30 -63 70 141
7041 141 7 -33 49 136 148 -67 122 79 122 -92 -192 12 -54 -146 -166 69 -19 28 10 116 65 158 -136 -128 109
7066 109 -44 -18 33 195 32 -15 72 -88 49 76 -109 108 100 63 7 -97 -74 -150 -29 -61 -101 20 -147 10
7090 10 97 -56 -213 60 137 9 104 115 -139 55 92 -173 -24 95 8 -37 24 69 -57 27 -93 19 26 12 -68
7115 -68 71 -243 -43 -11 -42 -163 -80 23 47 -3 -116 -57 54 73 -112 20 167 -22 113 -34 25 -84 39
7138 39 -43 -127 -98 -79 -142 -49 -128 -237 -92 -85 73 -94 -37 -103 38 -7 -192 -42 210 -38 99 236 -160 45
7162 45 154 129 -30 164 -72 -33 -17 83 -33 -8 -62 -80 1 -76 -11 -87 -84 -33 -140 -151 -59 -101 -25 30 -37 151 15
7189 15 -148 143 -9 47 183 2 73 75 168 112 120 146 -86 -42 -15 -12 203 -30 -44 -46 84 -31 -58 -146 -18 -116 51
7216 51 58 -175 42 -34 4 249 36 -77 40 30 -196 -193 27 -43 95 31 -167 52 17 -54 -116 5 -120 73
7240 73 71 69 -92 -70 34 -103 -8 52 -65 21 50 -63 -11 2 142 -11 219 84 -11 192 8 -12 192 63 -86
7265 -86 25 -53 -190 161 34 -94 -108 78 -9 -65 22 -244 -117 148 -196 -68 -55 -153 -14 150 36 9 123
7288 123 49 60 294 108 113 207 105 -186 -41 129 -191 -64 -27 15 -70 -52 80 62 -57 -125 10 -152 -8 -106
7312 -106 28 -200 -57 6 -118 11 162 180 -29 137 78 32 54 248 -54 83 156 -224 -186 96 -77 -109 -54
7335 -54 -144 28 59 -196 -233 -51 -38 -7 -30 75 -128 119 163 -34 -1 53 129 38 -34 -19 73 128 40 -20 170 -56
7361 -56 -50 65 -118 -107 -17 -126 -129 24 -64 -12 -85 -202 5 29 33 -6 -59 158 -75 -3 118 32 41 108 -127 7 -3
7388 -3 85 -180 136 10 -268 61 -32 -55 -39 -97 -143 -56 15 -92 -162 -96 -137 -85 63 0 64 177 133 48 -15 46 -83
7415 -83 88 -29 -6 117 182 -144 89 126 -267 -93 -73 -115 44 78 -131 69 -8 2 -36 137 -62 -49 -90 -41
7439 -41 -10 42 25 -69 145 129 -45 109 155 -150 188 20 -44 51 84 32 -133 23 55 68 -150 106 -22 7 -59
7464 -59 83 177 -98 -31 -80 99 1 -37 75 -98 -20 175 -10 7 57 22 100 37 92 42 3 4 -120 131 7 -61
7490 -61 -63 -79 -16 -115 65 -81 -212 -61 9 34 -59 -192 -49 73 151 55 177 1 4 71 50 -47 111 40 75 -48
7516 -48 -48 -38 -79 -15 -155 -123 -156 -29 -186 8 -120 58 -8 -99 27 -172 -152 53 43 157 79 -48 34 58 36
7541 36 39 -59 -116 30 -66 -3 10 -115 -142 49 72 -43 24 -22 -54 7 -149 -146 47 -82 -144 -43 -32 20 -69 -11 -94
7568 -94 60 68 153 46 6 -94 162 64 -88 89 139 31 48 -44 79 -67 -22 -80 -120 164 -67 -175 121 11
7592 11 -56 -41 87 -56 -69 137 -147 27 -28 41 31 108 62 -49 113 -92 -49 -6 -98 -2 -90 -55 0 -82 -125 -106
7618 -106 -18 -85 -54 -58 89 37 -56 3 -176 -25 31 -18 -141 36 -28 25 102 140 162 53 21 -61 -14 171 120 -44
7644 -44 -212 -174 119 -48 -14 -152 -34 -48 -86 -29 -71 -92 25 95 -83 154 32 79 126 54 -59 24 204 -65
7668 -65 -45 -63 16 33 -13 -32 30 -11 -83 -133 16 -3 180 -108 -48 -109 20 -130 -61 -14 -29 -157 95 121 -103 -58
7694 -58 -143 64 80 -29 52 62 98 -49 76 153 -133 33 36 -94 -149 50 -79 -102 181 1 -63 46 -31 -163
7718 -163 97 -23 -48 56 12 -94 27 118 90 -12 -24 -47 131 2 -125 120 145 14 23 40 71 -85 -67 -84
7742 -84 -167 41 -158 -93 -80 -191 -46 -95 101 12 -65 -44 -163 63 70 -112 12 173 75 15 -7 127 23 95 63
7767 63 110 36 93 -55 120 23 30 -20 -148 -151 6 188 -188 -46 5 -78 -121 3 -153 -129 31 144 200 100 40
7792 40 34 50 56 62 -42 5 -76 -54 107 37 -29 37 -173 -115 64 28 -220 55 -87 -96 38 60 -33 -192 47 0 100
7819 100 1 216 -66 148 108 38 100 34 -79 -47 -24 22 -7 -45 -130 126 -90 34 -57 -192 -56 34 -106 -241
7843 -241 20 -27 -88 89 88 -26 131 -81 63 174 36 55 158 192 -54 191 88 -29 140 27 2 49 10
7866 10 -125 -184 58 -97 -165 14 -98 -33 -60 72 125 77 51 -28 44 135 113 129 84 -40 53 99 216 7 5 -25
7892 -25 -76 75 -54 -143 -96 -101 32 -33 14 -83 -67 -157 -69 -4 -85 65 10 1 123 -101 -43 134 36 -115 81 36 120
7919 120 107 43 -134 70 -152 -66 97 -42 -9 27 -160 -136 51 10 -132 -84 5 15 53 -92 32 205 39 -16
7943 -16 16 27 -72 -45 20 -42 67 -47 -6 -11 66 -86 -29 -2 213 -64 -76 -46 -52 -88 -163 -151 -119 1 -133 -69 -47 -231
7971 -231 134 58 83 18 88 -55 21 14 53 -59 32 17 71 -71 -34 17 19 -97 -80 -39 -161 -51 -73 32 -236 -78
7997 -78 -155 -59 -2 -22 -48 26 84 -176 17 163 20 60 -109 -100 -12 -14 37 -21 13 104 30 58 -33 -67 73 -160 126
8024 126 -161 -30 -7 62 72 35 25 6 0 -135 -7 -55 -23 93 -23 25 -58 110 14 132 35 -151 118 -44 102
8049 102 17 52 -63 155 85 -93 21 12 -17 -83 84 -24 -90 33 20 -185 -12 -6 -222 -34 -6 -105 35 36 -73
8074 -73 -61 44 -94 135 -37 101 -109 -7 -198 16 -136 -65 -6 -3 -58 70 -61 -94 34 100 41 -37 -43 70
8098 70 49 -135 185 80 33 -2 191 94 71 -16 -170 65 -33 -190 -129 -56 -178 6 -52 52 26 -55 -153 40 -64
8123 -64 18 48 -21 -28 85 238 10 -101 28 6 -9 55 10 -31 -77 -43 12 68 139 -52 149 -121 -104 61 20 -80
8149 -80 -129 -54 -61 -93 -104 -90 69 282 -116 -92 161 44 -27 45 24 -23 42 94 115 213 81 -34 34 20 13 -10 39 -128
8177 -128 -41 101 -148 -277 42 -26 -154 -77 -45 -111 1 -20 -29 -39
8191c9
##END NTUPLES=NMR FID
##END=
