##TITLE=1H_DPAA0612
 CDCl3
 8 sc, 
 7.12.2021
##JCAMPDX= 6.0         $$ Bruker NMR JCAMP-DX V2.0
##DATA TYPE= NMR FID
##DATA CLASS= NTUPLES
##ORIGIN= UXNMR, Bruker Analytische Messtechnik GmbH
##OWNER= root
$$ XWIN-NMR		Version 3.5
$$ Tue Dec  7 10:50:39 2021 Russian Standard Time (UT+4h)  she@DPX200
##.OBSERVE FREQUENCY= 200.131346
##.OBSERVE NUCLEUS= ^1H
##.DELAY= (6, 6)
##.ACQUISITION MODE= SIMULTANEOUS
##.ACQUISITION SCHEME= undefined
##.AVERAGES= 8
##.DIGITISER RES= 18
##SPECTROMETER/DATA SYSTEM= spect
##.PULSE SEQUENCE= zg30
##.SOLVENT NAME= CDCl3
##.SHIFT REFERENCE= (INTERNAL, CDCl3, 0, 15.7039)
##AUDIT TRAIL= $$ (NUMBER, WHEN, WHO, WHERE, WHAT)
$$ ##TITLE= Audit trail, XWIN-NMR		Version 3.5
$$ ##JCAMPDX= 5.01
$$ ##ORIGIN= Bruker BioSpin GmbH
$$ ##OWNER= she
$$ F:/spectra/data/she/nmr/H-F/1/audita.txt
$$ ##AUDIT TRAIL=  $$ (NUMBER, WHEN, WHO, WHERE, WHAT)
(   1,<2021-12-07 10:49:37.26 +0400>,<she>,<DPX200>,
      <created by zg, POWCHK disabled, PULCHK disabled
       configuration hash MD5:
       00 E9 B6 7A A2 85 ED C7 34 08 36 98 17 FE 4E 26
       data hash MD5: 16K
       73 34 07 48 39 D6 3F FE 08 DF CC 5B D1 C0 C9 08>)
$$ ##END=
$$ 
$$ hash MD5
$$ 50 D4 F7 BD 9D 46 7B 56 68 7C A9 82 81 BB FD 2B
##$RELAX= 
##$RELAX= 
##$RELAX= 
##$RELAX= 
##$RELAX= 
##$RELAX= 
$$ Bruker specific parameters
$$ --------------------------
##$DU= <F:/spectra>
##$EXPNO= 1
##$NAME= <H-F>
##$PROCNO= 1
##$TYPE= <nmr>
##$USER= <she>
##$AMP= (0..31)
100 100 100 100 100 100 100 100 100 100 100 100 100 100 100 100 100 100 
100 100 100 100 100 100 100 100 100 100 100 100 100 100 
##$AQSEQ= 0
##$AQ_mod= 1
##$AUNM= <au_zg>
##$AUTOPOS= <>
##$BF1= 200.13
##$BF2= 200.13
##$BF3= 200.13
##$BF4= 200.13
##$BF5= 200.13
##$BF6= 200.13
##$BF7= 200.13
##$BF8= 200.13
##$BYTORDA= 1
##$CFDGTYP= 0
##$CFRGTYP= 5
##$CHEMSTR= <none>
##$CNST= (0..31)
1 1 145 1 1 1 1 1 1 1 1 1 1 1 1 1 1 1 1 1 1 1 1 1 1 1 1 1 1 1 1 1 
##$CPDPRG= <>
##$CPDPRG1= <>
##$CPDPRG2= <>
##$CPDPRG3= <>
##$CPDPRG4= <mlev>
##$CPDPRG5= <mlev>
##$CPDPRG6= <mlev>
##$CPDPRG7= <mlev>
##$CPDPRG8= <mlev>
##$CPDPRGB= <>
##$CPDPRGT= <>
##$D= (0..31)
0 1.2 0 0 0 0 0 0 0 0.06 0 0.03 0 0 0 0 0.0002 0 0 0 0 0 0 0 0 0 0 0 0 
0 0 0 
##$DATE= 1638859776
##$DBL= (0..7)
120 120 120 120 120 120 120 120 
##$DBP= (0..7)
150 150 150 150 150 150 150 150 
##$DBP07= 0
##$DBPNAM0= <>
##$DBPNAM1= <>
##$DBPNAM2= <>
##$DBPNAM3= <>
##$DBPNAM4= <>
##$DBPNAM5= <>
##$DBPNAM6= <>
##$DBPNAM7= <>
##$DBPOAL= (0..7)
0.5 0.5 0.5 0.5 0.5 0.5 0.5 0.5 
##$DBPOFFS= (0..7)
0 0 0 0 0 0 0 0 
##$DE= 6
##$DECBNUC= <off>
##$DECIM= 32
##$DECNUC= <off>
##$DECSTAT= 4
##$DIGMOD= 1
##$DIGTYP= 9
##$DL= (0..7)
0 120 120 120 120 120 120 120 
##$DP= (0..7)
150 150 150 150 150 150 150 150 
##$DP07= 0
##$DPNAME0= <>
##$DPNAME1= <>
##$DPNAME2= <>
##$DPNAME3= <>
##$DPNAME4= <>
##$DPNAME5= <>
##$DPNAME6= <>
##$DPNAME7= <>
##$DPOAL= (0..7)
0.5 0.5 0.5 0.5 0.5 0.5 0.5 0.5 
##$DPOFFS= (0..7)
0 0 0 0 0 0 0 0 
##$DQDMODE= 0
##$DR= 18
##$DS= 0
##$DSLIST= <SSSSSSSSSSSSSSS>
$$ [...]
##$SUBNAM2= <"">
##$SUBNAM3= <"">
##$SUBNAM4= <"">
##$SUBNAM5= <"">
##$SUBNAM6= <"">
##$SUBNAM7= <"">
##$SUBNAM8= <"">
##$SUBNAM9= <"">
##$SW= 18.0517287032376
##$SWIBOX= (0..15)
0 0 2 0 0 0 0 0 0 0 0 0 0 0 0 0 
##$SW_h= 3612.71676300578
##$TD= 16384
##$TD0= 1
##$TE= 0
##$TE2= 300
##$TE3= 300
##$TEG= 300
##$TL= (0..7)
0 120 120 120 120 120 120 120 
##$TP= (0..7)
150 150 150 150 150 150 150 150 
##$TP07= 0
##$TPNAME0= <>
##$TPNAME1= <>
##$TPNAME2= <>
##$TPNAME3= <>
##$TPNAME4= <>
##$TPNAME5= <>
##$TPNAME6= <>
##$TPNAME7= <>
##$TPOAL= (0..7)
0.5 0.5 0.5 0.5 0.5 0.5 0.5 0.5 
##$TPOFFS= (0..7)
0 0 0 0 0 0 0 0 
##$TUNHIN= 0
##$TUNHOUT= 0
##$TUNXOUT= 0
##$USERA1= <user>
##$USERA2= <user>
##$USERA3= <user>
##$USERA4= <user>
##$USERA5= <user>
##$V9= 5
##$VALIST= <valist>
##$VCLIST= <CCCCCCCCCCCCCCC>
##$VD= 0
##$VDLIST= <DDDDDDDDDDDDDDD>
##$VPLIST= <PPPPPPPPPPPPPPP>
##$VTLIST= <TTTTTTTTTTTTTTT>
##$WBST= 1024
##$WBSW= 4
##$XGAIN= (0..3)
0 0 0 0 
##$XL= 0
##$YL= 0
##$YMAX_a= 415691
##$YMIN_a= -395686
##$ZGOPTNS= <>
##$ZL1= 120
##$ZL2= 120
##$ZL3= 120
##$ZL4= 120
##$ABSF1= 10
##$ABSF2= 0
##$ABSG= 5
##$ABSL= 3
##$ALPHA= 0
##$AQORDER= 0
##$ASSFAC= 0
##$ASSFACI= 0
##$ASSFACX= 0
##$ASSWID= 0
##$AUNMP= <proc_1d>
##$AZFE= 0.1
##$AZFW= 0.1
##$BCFW= 1
##$BC_mod= 2
##$BYTORDP= 1
##$COROFFS= 0
##$CY= 11.3945322036743
##$DATMOD= 1
##$DC= 2
##$DFILT= <>
##$DTYPP= 0
##$F1P= 2.36226072786647
##$F2P= -0.459571619588291
##$FCOR= 0.5
##$FTSIZE= 0
##$FT_mod= 4
##$GAMMA= 1
##$GB= 0.15
##$INTBC= 1
##$INTSCL= 1
##$ISEN= 128
##$LB= 0.24
##$LEV0= 0
##$LPBIN= 0
##$MAXI= 10000
##$MC2= 0
##$MEAN= 0
##$ME_mod= 0
##$MI= 1.114404
##$NCOEF= 0
##$NC_proc= 0
##$NLEV= 6
##$NOISF1= 3.799351
##$NOISF2= 2.8
##$NSP= 1
##$NTH_PI= 0
##$NZP= 0
##$OFFSET= 15.70392
##$PC= 1
##$PHC0= -15510.23
##$PHC1= 8.2008
##$PH_mod= 1
##$PKNL= yes
##$PPARMOD= 0
##$PSCAL= 0
##$PSIGN= 0
##$REVERSE= no
##$SF= 200.130013532006
##$SI= 16384
##$SIGF1= 3
##$SIGF2= 2
##$SINO= 400
##$SIOLD= 16384
##$SREGLST= <1H.CDCl3>
##$SSB= 0
##$STSI= 0
##$STSR= 0
##$SW_p= 3612.71676300578
##$SYMM= 0
##$S_DEV= 0
##$TDeff= 0
##$TDoff= 0
##$TI= <>
##$TILT= no
##$TM1= 0
##$TM2= 0
##$TOPLEV= 0
##$USERP1= <user>
##$USERP2= <user>
##$USERP3= <user>
##$USERP4= <user>
##$USERP5= <user>
##$WDW= 1
##$XDIM= 8192
##$YMAX_p= 0
##$YMIN_p= 0
$$ End of Bruker specific parameters
$$ ---------------------------------
##NTUPLES= NMR FID
##VAR_NAME=  TIME,          FID/REAL,        FID/IMAG
##SYMBOL=    X,             R,               I
##VAR_TYPE=  INDEPENDENT,   DEPENDENT,       DEPENDENT
##VAR_FORM=  AFFN,          ASDF,            ASDF
##VAR_DIM=   8192,          8192,            8192
##UNITS=     SECONDS,       ARBITRARY UNITS, ARBITRARY UNITS
##FACTOR=    0.0002768,     1,               1
##FIRST=     0,             0,               0
##LAST=      2.2672688,     0,               0
##MIN=       0,             -395686,         0
##MAX=       2.2672688,     415691,          0
$$ Real data points
##PAGE= N=1
##DATA TABLE= (X++(R..R)), XYDATA
0@%%%%%%%%qJ6j6J6k4L2m0M8n6P2q8J05j29J57j82K17k57K98l46M02m66N38o18
$$ 0 0 0 0 0 0 0 0 0 -8 8 -8 8 -16 16 -24 24 -32 40 -48 57 -72 85 -97 120 -137 161 -185 217 -249 289 -329
31c29P04q00R06j025J158j302J461j637J825k033K264k513K785l083L409l764
$$ -329 375 -425 481 -544 614 -688 773 -864 961 -1072 1192 -1321 1464 -1619 1790 -1974
47a974M151m576N043n555O119o746P438q210R081j0068J1194j2492J4014j5823
$$ -1974 2177 -2399 2644 -2911 3208 -3538 3900 -4310 4771 -5297 5897 -6595 7419 -8404
61h404J8015k0742K4239k8906L5493m5576O3141j02562L56221L8129k47796K96502
$$ -8404 9611 -11131 13108 -15798 19695 -25881 37260 -65302 290919 329048 81252 377754
73C77754j94589j9433P6028l16482k56072K63680n5867j92691J56115M554k38683
$$ 377754 183165 163732 239760 -76722 -332794 -69114 -124981 -317672 -161557 -157003 -395686
84c95686K02131K06379p1252J02022Q5547j70529J36556K24358j70189j40346
$$ -395686 -193555 12824 -58428 43594 129141 -41388 95168 319526 149337 8991
94H991P4429o0658L2626J01377j73076r0387J81472k3672r4728Q5196o5718j25170
$$ 8991 83420 22762 55388 156765 -16311 -106698 74774 51102 -43626 41570 -24148 -149318
106a49318J09555k0459j22283J45310J8507k06887J09431J55476j08437N8739
$$ -149318 -39763 -60222 -182505 -37195 -18688 -225575 -116144 39332 -69105 -10366
116a0366J11751j21038Q5073K19094j31749q2932J87020q6142j90813P4352o8014
$$ -10366 101385 -19653 65420 284514 152765 69833 256853 170711 -20102 54250 -13764
127a3764j54449J20512k4661k16867J10057J52294j16700L8746J30516q9238M6973
$$ -13764 -168213 -47701 -72362 -289229 -179172 -26878 -143578 -104832 25684 -63554 -16581
138a6581J74747p4795j8515J54060p6969j07993J06540k5183j31216K6523m4843
$$ -16581 158166 83371 64856 218916 141947 33954 140494 115311 -15905 10618 -34225
149c4225j05699J03111K8190j50481M5722J05144n7083K7966M5069j00539L3137
$$ -34225 -139924 -36813 -8623 -159104 -113382 -8238 -65321 -37355 7714 -92825 -59688
160e9688J31654n8948l4733J00647l6053m2690J07790j4911q2292N5231k4696
$$ -59688 71966 13018 -21715 78932 42879 189 107979 93068 10776 66007 41311
171D1311q5037R1268M1321j27002r595M1172o8061K1828M1625j05183l364J05526
$$ 41311 -43726 47542 88863 -38139 -47734 -6562 -74623 -52795 -11170 -116353 -119717 -14191
183a4191k3967q132Q0573j5525j7986P7268o545m7737N5995n222p2268M6224J9804
$$ -14191 -38158 -46290 34283 18758 772 78040 71495 23758 79753 74531 2263 48487 68291
196F8291q0365P337J0037o7736K3293L5922p5250m352O9624k5015k230O6852k7160
$$ 68291 -12074 -4737 5300 -62436 -39143 -3221 -78471 -82823 -13199 -38214 -40444 26408 -752
209g52k5399O7057p485m2448N2828Q262n7781L4032K9868n5209J1985K2957o6446
$$ -752 -26151 40906 33421 -9027 43801 52063 -5718 28314 58182 2973 14958 37915 -28531
222b8531n443L8414m0231j2190L9391j8453j7110M2500L246k3647L0534R258k3691
$$ -28531 -33974 4440 -35791 -47981 -8590 -27043 -44153 -1653 1593 -22054 8480 17738 -5953
235e953K9793J5308k6946J6353J1239k8474J543N342k7211n136Q486k1374j911
$$ -5953 23840 39148 12202 28555 39794 11320 12863 18205 -9006 -14142 -5656 -27030 -28941
248b8941J9263j6817o620K4614l404m708J8526n606m833L0354M493k0466J5672
$$ -28941 -9678 -26495 -33115 -8501 -11905 -16613 1913 -3693 -8526 21828 26321 5855 21527
261B1527J1694j6747N381J111k2274L591Q724k1130p878J3818q845j7393O340
$$ 21527 33221 16474 21855 22966 692 4283 13007 -8123 -16001 -2183 -11028 -28421 -22081
274b2081j864q986J2197m89n975K3616J7909n451L165J2556M842P3l658j2004
$$ -22081 -23945 -32931 -20734 -21223 -27198 -3582 14327 8876 12041 24597 29439 29512 25854 13850
288A3850j964P084j0821j2953r72o93j436p046o145L494M931R62l765M921J3099
$$ 13850 11886 18970 8149 -4804 -5776 -6469 -7905 -14951 -21096 -17602 -12671 -11709 -15474 -10553 2546
303B546M195J552O42K758J0289l495j2863Q78K829k386q005q537P27N550l7p632
$$ 2546 6741 8293 8935 11693 21982 18487 5624 6502 9331 6945 -1060 -9597 -8870 -3320 -3357 -10989
319a0989l662P391N755m190k683L150L844K304l4k231O639P614n185l044L348
$$ -10989 -14651 -7260 -1505 -5695 -8378 -5228 -1384 920 886 -1345 5294 12908 7723 4679 8027
334H027K834k498j0597n505R18L59j613q014m63J0032O29j156J561J485P216J050
$$ 8027 10861 8363 -2234 -7739 -6821 -6462 -8075 -16089 -16552 -6520 -5891 -7047 -5486 -4001 3215 4265
350D265l708M399O011L273q8j105L614L147l76p874o460J293o111r742k124l776
$$ 4265 557 4956 10967 14240 14152 13047 16661 19808 19432 11558 5098 6391 280 -9462 -11586 -15362
366a5362m462L265j170l685R775P353n580O839J0876r71N761O402o118o15Q971
$$ -15362 -19824 -16559 -17729 -21414 -11639 -4286 -9866 -3027 7849 6878 12639 19041 12923 12308 21279
381B1279n548j2992K727m976j4768O437j562j5383Q300M919o656J2406R710p925
$$ 21279 15731 2739 5466 490 -14278 -7841 -9403 -24786 -16486 -11567 -18223 -5817 3893 -4032
395d032M834J2283n893q30J0123j2453q568J3032q186q914J3846p422j2655J9650
$$ -4032 802 13085 7192 6362 16485 4032 -4536 8496 310 -8604 5242 -2180 -14835 4815
409D815L063j6131J4041N619j9434J4302J0781k7754M892J9937k1721n033K1422
$$ 4815 7878 -8253 5788 11407 -8027 6275 17056 -10698 -5806 14131 -7590 -12623 8799
422H799j5127q421K8806p758j8753L0016J441k8254K1286Q858l0015Q579Q525
$$ 8799 -6328 -14749 14057 6299 -12454 17562 19003 -9251 12035 20893 -9122 -543 7982
435G982l1247M655K1112k6953m623K8998j2834n168K8156n299k273K8947j0346
$$ 7982 -23265 -18610 2502 -24451 -29074 -76 -12910 -18078 10078 4779 2506 31453 21107
448B1107k0690K5474M438k4474Q867p666l1690K1696Q901l7297J3389J5131l3650
$$ 21107 417 25891 30329 5855 14722 7056 -24634 -2938 5963 -31334 -17945 -2814 -36464
461c6464J7646L3770k8448Q70L1918k7397k700N2502k5623m1791M2352J804l1823
$$ -36464 -18818 14952 -13496 -12626 19292 -8105 -10805 41697 16074 -25717 16635 18439 -13384
474a3384L7415n688n6734L9699L8506n0486M349K9366m7624M992N6645l6678l2103
$$ -13384 24031 18343 -38391 1308 39814 -10672 -6323 23043 -24581 -19589 37056 378 -31725
487c1725L5708k2209j9224O1725m292n8106K5610J9751j8847M3128P872o3707
$$ -31725 3983 -18226 -37450 24275 19983 -38123 -12513 7238 -11609 31519 39391 -24316
499b4316J5228M1120k4052P130J3055n1378l078M5480k1714j4463K9323l4377
$$ -24316 -9088 32032 7980 15110 28165 -23213 -26291 19189 -2525 -16988 12335 -22042
511b2042j8465O0757p040l7825L4151r412k9682N8558J0162o4343K3366L2001
$$ -22042 -40507 20250 13210 -24615 9536 124 -29558 29000 39162 -25181 -1815 30186
523C0186m2763K2641L0872o8611l971N9069l6426j7384N1247l8470l6636O6028
$$ 30186 -12577 10064 40936 -27675 -31646 27423 -9003 -26387 24860 -13610 -50246 15782
535A5782j008m5940M4997j03n5103M7633L1794n2598K2531L2248n2194R988M5130
$$ 15782 14774 -31166 13831 13728 -41375 6258 38052 -14546 7985 40233 -11961 -1973 43157
548D3157m5409j0664M3355m3869k5356N4572j9430l0426M9558j7138m6107N2256
$$ 43157 -2252 -12916 30439 -13430 -38786 15786 -3644 -34070 15488 -1650 -47757 4499
560D499J4153m5217L6878J3509n9110L5546M6545n7457L516M2093m9083J744N9321
$$ 4499 18652 -26565 10313 23822 -35288 258 46803 -10654 -7138 34955 -14128 -12384 46937
573D6937m4220l2703N7630j6629l8635N1071j0562n9738M3720K1378m9110K8427
$$ 46937 2717 -29986 27644 11015 -27620 23451 12889 -46849 -3129 18249 -30861 -2434
585b434J8430n9150K4414N7163l9221j2461K8888l4261O615O0511l0549l5887
$$ -2434 15996 -43154 -18740 38423 -798 -13259 15629 -18632 -12017 48494 17945 -17942
597a7942L8028j1367k1002M1686j6274n0003K9949M819l4626M3767J7124n7882
$$ -17942 20086 8719 -12283 29403 13129 -36874 -6925 -2106 -36732 7035 24159 -33723
609c3723K1899L8239l6178J3869K5117n5179M464O3294l6252l4571M8280j5830
$$ -33723 -11824 26415 -9763 4106 29223 -25956 -21492 41802 5550 -29021 19259 3429
621C429k9598N3395j4516n7106M7782J7938n2988L4017L3355n6515M727M3556
$$ 3429 -26169 27226 12710 -44396 3386 21324 -31664 2353 35708 -20807 -16080 27476
633B7476l2970k92L8859m7175k3843O2928k988l6419K7090m199k6596L5317J57
$$ 27476 -5494 -5786 33073 -14102 -37945 24983 21995 -14424 12666 8467 -18129 17188 17345
646A7345m3040K4141J8550l5417J0722J9623k2914P590J1025l0787Q307L2116
$$ 17345 -25695 -1554 16996 -18421 -7699 11924 -10990 -3400 7625 -23162 -14855 17261
658A7261k5895j0254L6746o312j0481K2773k3994j5433M2694j3250m2853K7198
$$ 17261 -8634 -18888 17858 11546 1065 23838 -156 -15589 27105 13855 -28998 -1800
670a800J2739k7693J9608R256l4491J8796K3957m4237J808M4600k3098j8691L0563
$$ -1800 10939 -16754 2854 12110 -22381 -3585 20372 -23865 -22057 22543 -555 -19246 11317
683A1317r836r466L3294j7777l5437L5079J2052l7979J2489K0757j8024J1424
$$ 11317 1481 -7985 25309 7532 -27905 7174 19226 -18753 -6264 14493 -3531 7893
695G893J0870k9723P116K7114k6801j7715K5582j522q708J3963j0966o746K5607
$$ 7893 18763 -10960 -3844 23270 -3531 -21246 4336 2814 -5894 8069 -2897 -9643 15964
708A5964j0010k8623J6220J3200j1651O071J740j0774J6524P234k7891K966J9592
$$ 15964 5954 -22669 -6449 6751 -4900 1171 2911 -7863 8661 15895 -11996 -9030 10562
721A0562j4644p925J1696k879O017J4567j7798j1618K5044J565k2915N053M909
$$ 10562 -4082 -12007 -311 -3190 2827 17394 -404 -12022 13022 14587 -8328 -3275 1634
734A634n856J1686k323j6435J3521J1535k0884p978J2616k002k291N850o777M448
$$ 1634 -4222 7464 5141 -11294 2227 13762 -7122 -15100 -2484 -4486 -6777 -927 -7704 -3256
748c256J9419j0263j5792J1987M780r272Q10j459M2J5650O01j7762M052J1134
$$ -3256 16163 5900 -9892 2095 6875 -2397 -1587 -3046 -3004 12646 13247 -4515 -463 10671
762A0671r048p537Q48j532N255O680r673l867J5197o17j3617L258L094j788M909
$$ 10671 1623 -5914 -5066 -6598 -1343 5337 -4336 -8203 6994 6377 -7240 -3982 -888 -2676 2233
777B233l074m499J0832N474j0204m842O454J735l959k908k431M320R911m162p969
$$ 2233 -841 -5340 5492 10966 762 -4080 2374 4109 150 -2758 -5189 -869 9042 4880 -3089
792c089M493L616l705m512k571J629N397k59l501K905M585l323n138k905K019
$$ -3089 1404 5020 1315 -3197 -5768 -4139 1258 999 -2502 403 4988 1665 -3473 -6378 -4359
807d359L028j611k690L731Q221L57n976k185M61J462Rn283k49O985L090q37q50
$$ -4359 -1331 -2942 -5632 -1901 6320 6677 701 -1484 -1023 439 448 -4835 -5084 1901 4991 4154 3304
824C304Q64J15j979k014l098Q31K060l224NM117J325j441k693p24J491P67j518
$$ 3304 4168 4283 2304 290 -2808 -1977 83 -3141 -3136 981 2306 865 -1828 -2552 -1061 -294 -1812
841a812k700K828M656n32n25l25o75L97k08j257j52J518J450k46L27m67j948n70
$$ -1812 -4512 -1684 2972 2440 1915 1590 915 1312 1104 -153 -305 1213 2663 2417 2744 2277 329 -241
859b41j593n70R71n57J61J327P98j004p94j060j237J337J554j245J615J964o25
$$ -241 -1834 -2404 -1433 -1990 -1829 -502 296 -708 -1502 -2562 -3799 -2462 -908 -2153 -538 1426 801
876H01J205J900k616l067K365o33j630L683r78k043N912R70m205R08M18l805o90
$$ 801 2006 3906 1290 -1777 588 -45 -1675 2008 1030 -1013 4899 5869 1664 2572 2990 -815 -1505
893a505O33l543j02M858l047l518O381r95m235L713k96j769O184Q55l777M187
$$ -1505 -872 -4415 -4517 341 -2706 -6224 157 -838 -5073 -1360 -1656 -3425 2759 3614 -163 4024
909D024L087n213m1K421m155JK000n055R54P173m634n302N151r04k131N879m931
$$ 4024 7111 1898 1857 4278 123 124 2124 -2931 -1977 5196 562 -4740 411 -493 -2624 3255 -1676
926a676o037R683P55p529N080J818o816L784L850o322K916O775q766K46J1700
$$ -1676 -7713 1970 2725 -4804 276 2094 -4722 -938 2912 -3410 -494 6281 -2485 -2239 9461
941I461o233n586O853m862l142R291n672j0392R739M558r859N564L066r816P273
$$ 9461 3228 -2358 4495 -367 -3509 5782 110 -10282 -543 4015 -5844 -280 2786 -7030 243
956B43P312j2146L401J0231j1539j664J2077p815n585J0561q280p713J6281k890
$$ 243 7555 -4591 -1190 9041 -2498 -4162 7915 100 -5485 5076 -3204 -10917 5364 2474
970B474j3256J2374L740j3029R057O737j3851P275J1324j7358M7J7475j1906n288
$$ 2474 -10782 1592 5332 -7697 1360 8097 -5754 1521 12845 -4513 -4466 13009 1103 -4185
984d185J3517j0298q061J6530m783j3863J2837J031j4269J1090N898j4671O909
$$ -4185 9332 -966 -9027 7503 2720 -11143 1694 2725 -11544 -454 5444 -9227 -2318
997b318O842j2962O364J0622j3532m5J3794p594j888J1118j1381m165J7947o819
$$ -2318 4524 -8438 -2074 8548 -4984 -5029 8765 1171 -717 10401 -980 -5145 12802 5983
1011E983j1251J2893o749j1132J7856j413j8999J0839M070j7478J3394J2827k3071
$$ 5983 -5268 7625 876 -10256 7600 6187 -12812 -1973 2097 -15381 -1987 10840 -12231
1024a2231K907J8879j6363J406K2767j8567j1628K5949o071j7142K1897k961k3583
$$ -12231 -9324 9555 -6808 -5402 17365 -1202 -12830 13119 7048 -10094 11803 8842 -14741
1037a4741K0182Q441k5500R392J2197k1447M750J9382j9328o460K1771r583q309
$$ -14741 5441 13882 -11618 -2226 9971 -11476 -6726 12656 -6672 -13132 8639 -944 -9253
1050i253K0591q791j4860J8667kj2887J3142j039j6699J1476Q603j3217O526M601
$$ -9253 11338 2547 -12313 6354 6352 -6535 6607 5568 -11131 345 8948 -4269 2257 6858
1064F858j7437Q034J4038j6092O25J1987j6089J144J9183j3133p391J9211r754
$$ 6858 -10579 -2545 11493 -4599 -3974 8013 -8076 -6932 12251 -882 -8273 10938 1184
1077A184j1587K2003m368j9954J8112L163k0848J4736Q173k6249R097K1121k2593
$$ 1184 -10403 11600 7232 -12722 5390 8553 -12295 2441 10614 -15635 -6538 14583 -8010
1090h010l063J9596j8249l494K6990j3348j6119K2342j893j4899K1569L210k3632
$$ -8010 -11073 8523 -9726 -13220 13770 422 -15697 6645 4752 -10147 11422 14632 -9000
1103i000J1586R713j8645J0194J1211k4551N73J8468j2536k917J3521j4772o400
$$ -9000 2586 12299 -6346 3848 15059 -9492 -8919 9549 -2987 -5904 7617 -7155 -13555
1116a3555K1216o462j3299J5726k880j1511J7549J905j7034J2024O753j5535R987
$$ -13555 7661 1199 -12100 3626 746 -10765 6784 8689 -8345 3679 10432 -5103 4884
1129D884R652j9865J064J5426j3326q32J3774j6971o656K0316o170j2036J3945
$$ 4884 14536 -5329 -4265 11161 -2165 -2997 10777 -6194 -12850 7466 1296 -10740 3205
1142C205l915j2858J6493K650j6034J1783O276j6280Q003J1421j4526K614J1396
$$ 3205 -710 -13568 2925 5575 -10459 1324 7600 -8680 -677 10744 -3782 -1168 10228
1155A0228j3798k087J5087j0455o293J5915q427j1028J5957k638j0472J3552j792
$$ 10228 -3570 -5657 9430 -1025 -7318 8597 170 -10858 5099 2461 -8011 5541 3749
1168C749j5410J2163Q301j4307N433P973j4383M489J4587j3621m598J3754q640
$$ 3749 -11661 502 8803 -5504 -71 7902 -6481 -1992 12595 -1026 -5624 8130 -510
1181e10n548J4938p312j2936J2417J398j1154R575J483j3845Q310J1010r890J251
$$ -510 -6058 8880 1568 -11368 1049 2447 -8707 868 2351 -11494 -3184 7826 -2064 -813
1195h13P536r740K030J2982p288o426P065n665l058J0784n384j0233N833L92l513
$$ -813 6723 -3017 -987 11995 4707 -1719 5346 -319 -3377 7407 2023 -8210 -2377 -1985 -5498
1210e498O947j389r030O172N954o812L955L941q691L432P675p398K09O808p528
$$ -5498 1449 60 -8970 -2798 3156 -3656 299 4240 -4451 -1019 6656 -742 -533 6275 -1253
1225a253j592J0412l989p511O459r95m666Q326o65j1000M859N711q298P8M702
$$ -1253 -2845 7567 3578 -3933 2526 1531 -3135 5191 4526 -6474 -1615 4096 -4202 -4124 578
1240E78p226O75P578m510j544R052k898m963O794J434l630K412p15m500M285K316
$$ 578 -6648 -5973 1605 -2905 -4449 4603 1705 -3258 3536 4970 1340 3752 3037 -1463 2822 5138
1256E138p066k44L685l080p89Q95k497K335L685l600j221N631K84k836O20j663
$$ 5138 -1928 -2172 1513 -1567 -2356 -1461 -3958 -1623 2062 -1538 -2759 2872 3156 320 940 -723
1272g23j02L845l349m262M307K223k955m80J022r58J568J140l598J876N669k895
$$ -723 -825 3020 -329 -4591 -284 1939 -1016 -1496 -474 -1432 136 1276 -2322 -446 5223 2328
1288B328k734K832J51j020o10l391n93M257L79m977Q36L917j72r44j290j016K631
$$ 2328 -406 2426 2577 1557 947 -2444 -3037 1220 1599 -3378 -2542 1375 1203 259 -1031 -2047 584
1305E84J406l963j449L722J724k740r53p8J862J421k453j577L552K598j540j975
$$ 584 1990 -1973 -3422 300 2024 -716 -1669 -1747 115 1536 -917 -2494 1058 3656 2116 141
1321A41J112K202k93l082l387J724L186k164l081Q37K844J732k785k654J330L513
$$ 141 1253 3455 3162 80 -3307 -1583 1603 -561 -3642 -2805 39 1771 -1014 -3668 -2338 1175
1337A175J16k030M81L215J205j661k339k3J866j303l891m54L700J793k002j410
$$ 1175 1291 -739 -258 2957 4162 2501 162 139 2005 702 -3189 -3643 57 1850 -152 -1562
1353a562J197L453K87m094j363K603K208j973k484R21K568J90k426k601J238K047
$$ -1562 -365 3088 3375 -719 -2082 521 2729 756 -1728 -807 1761 1951 -475 -3076 -1838 209
1369B09k395j615J350K095J713j610j378K003K152j986l589J315L693j25o29j411
$$ 209 -2186 -3801 -2451 -356 1357 -253 -1631 372 2524 538 -3051 -1736 1957 1832 1203 -208
1385b08J086L516j117m414m50K855N37j718r14J21J304Q79m169j642K792K7k063
$$ -208 878 4394 3277 -1137 -1587 1268 1805 87 -827 -706 598 1477 -2692 -4334 -1542 -1515 -3578
1402c578L86K268J826J478q66j212L215J957l901j554J670P02M32j215k827J033
$$ -3578 -3192 -924 902 2380 1514 302 3517 5474 1573 19 1689 2391 2823 1608 -1219 -186
1418a86K441k879l768J505L24l00J272j399N22M199p74l270K027K190k950N1J525
$$ -186 2255 -624 -4392 -2887 -2563 -2863 -1591 -2990 -2468 1731 957 -2313 -286 1904 -1046 -995 530
1435E30j057K923K480m997m67M961l292l416K239r23j435L570r12l815M237K231
$$ 530 -527 2396 4876 -121 -588 4373 1081 -2335 -96 -1019 -2454 1116 204 -3611 626 2857
1451B857n683R77L515l666J346L073l288P10M917k977l024L893j820l149K638
$$ 2857 -2826 -1849 1666 -2000 -654 2419 -869 -159 4758 1781 -1243 2650 830 -2319 319
1466C19j249k340M191k06l753L265K057m620J270J739l640K703L110n113J889
$$ 319 -930 -3270 921 715 -3038 227 2284 -2336 -1066 673 -2967 -264 2846 -2267 -378
1481c78N790m051o83L568m709j803N700k827l617M644j400o182N579J446p351
$$ -378 5412 1361 678 4246 -463 -2266 3434 607 -3010 1634 234 -5948 -369 1077 -6274
1496f274L157K734n725N052O253o651N75P123m579j272O628n411m569P818j239
$$ -6274 -3117 -383 -6108 -1056 5197 -1454 -879 6244 1665 393 7021 1610 -2959 4859 3620
1511C620o246M816j290o879N871K938q675K473L914n736M100O500p813j091O940
$$ 3620 -2626 2190 900 -5979 -108 2830 -5845 -3372 542 -5194 -1094 5406 -2407 -3498 3442
1526C442m495q48O340n269n246Q482L99m538O968j381q266P440L877q530J824
$$ 3442 -1053 -1901 4439 -830 -6076 2406 2805 -1733 5235 3854 -4412 3028 6905 -1625 199
1541A99K880p393K615O570q936k211P553m981j996Q544l967m212R083k7m568P059
$$ 199 3079 -4314 -1699 4871 -4065 -6276 1277 -3704 -5700 2844 -1123 -5335 3748 3721 -847 6212
1557F212j081q788N955K964p961K150J739q213L994O905p842k1O961n267p38Q982
$$ 6212 5131 -3657 2298 5262 -2699 -549 1190 -7023 -3029 3876 -3966 -3987 2974 -2293 -3031 5951
1573E951m683l616R236m088o635Q791o27r564O522R83j0231N941O193r633K663
$$ 5951 1268 -2348 6888 2800 -3835 4956 4329 -5235 1287 2270 -7961 -2020 4173 -5460 -2797
1588b797Q393r695n97J1309n709m863Q273n088n514J1409o09j1250N991L798o643
$$ -2797 5596 -4099 -4696 6613 904 -3959 4314 -774 -6288 5121 4512 -6738 -747 3051 -3592
1603c592O631L919j0742K299Q110n901P4M431q215k967Q426k487m195M020n340
$$ -3592 3039 6958 -3784 -1485 6625 724 798 5229 -2986 -5953 2473 -14 -4209 -189 -5529
1618e529k792J0675J006o890L590m69k668R720J732r975K159L668n567N093M005
$$ -5529 -8321 2354 3360 -3530 60 -409 -3077 6643 8375 -1600 559 4227 -1340 3753 7758
1633G758j1712j223P554m916P8P401p856o153J1891O88p298O367j582q721R487
$$ 7758 -3954 -5177 2377 -2539 -2461 4940 -2916 -9069 2822 3510 -3788 2579 997 -7724 1763
1648A763M983j0797J751N728o889K462Q212q488l841R110k675l821P522l624p532
$$ 1763 6746 -4051 -2300 3428 -3461 -999 7213 -1275 -5116 3994 1319 -2502 5020 1396 -6136
1663f136P700J316n774L697K58o370M503M929n938Q57L717n238J855N254m687
$$ -6136 1564 2880 -2894 803 1061 -5309 -806 4123 -1815 -958 2759 -2479 -624 4630 -57
1678e7j958M719l314j957N520l011l715N641j161m638N198K77m931M911J439n878
$$ -57 -2015 2704 -610 -2567 2953 -58 -3773 1868 707 -3931 1267 1544 -3387 1524 2963 -2915
1694b915L132L904n248P58M634n291p35N919m204l034N493k618l716N386m10n494
$$ -2915 217 4121 -1127 -369 4265 -1026 -1761 4158 -46 -3080 2413 -205 -3921 1465 1055 -4439
1710d439L691J569m174L352K119o068K292M755l759J87L214l743l05N686k392
$$ -4439 -748 821 -3353 -1 2118 -3950 -1658 3097 -662 -475 2739 -1004 -1309 4377 1985
1725A985l170L490j558k729M392m06m840K461M24l144L412J936m971M50L637k189
$$ 1985 -1185 2305 747 -1982 2410 2004 -2836 -375 49 -3095 317 2253 -2718 -2268 1369 -820
1741h20L08K425l590p99M517j010k210K701o41j782K879m3l354J827R13k817J739
$$ -820 -512 1913 -1677 -2476 2041 1031 -1179 1522 881 -901 1978 1935 -1419 408 1321 -1496 243
1758B43J781k781r4J628j670O38J640k451n57K793o49j694J777l44j486K148q20
$$ 243 2024 -757 -851 777 -893 -255 1385 -1066 -1623 1170 521 -1173 604 260 -1226 922 102
1775A02j809J613N79k433J566J188j730R60R62j582O50J832j706l29J964p78r60
$$ 102 -1707 -94 485 -1948 -382 806 -924 36 998 -584 66 1898 192 -137 1827 1049 89
1792H9J217k02j875J669j11k389J289N42j376L83M30r51J23J096j191j16J776
$$ 89 1306 1104 -771 898 787 -1602 -313 229 -1147 -764 -334 -1285 -1162 -66 -1257 -1373 403
1809D03n82l03J163l50r8J080on49N05J40q44K61J42p59r9R2p90L28J32r11K29
$$ 403 -179 -482 681 331 233 1313 1307 758 1263 1403 559 820 962 203 104 196 -594 -266 -134 -1045 -816
1830h16M16j89K29L10l30l12N22j79l01L64O5l19J190K71l14J78N10m37J11p2
$$ -816 -400 -589 -360 -50 -380 -692 -170 -349 -650 -286 -221 -540 650 921 607 785 1295 858 969 897
1850H97n00l43N17m88o92N4k22l90K40P6l1N94K76r1N83P00l92j52j49J50j52
$$ 897 397 54 571 83 -609 -555 -777 -1167 -927 -851 -882 -288 -12 -103 480 1180 788 636 487 637 485
1871D85p00q75P3L65J63o09J04J001L77M33n1j16R27m0p87j73j7l33l77r44k47
$$ 485 -215 -1090 -1017 -652 -489 -1098 -994 7 384 817 766 650 1577 1537 750 577 560 227 -150 -1094 -1341
1892a341O33L91j098n1J384N33k47O0j77K11J122q26j357O65L30j018j9k91J50
$$ -1341 -708 -317 -1415 -1466 -82 451 204 264 87 298 1420 594 -763 -98 232 -786 -805 -1096 -946
1911i46J372K62p89R41J818o37j020O70J46m66m00j937r27J792j259k029Q80Q77
$$ -946 426 688 -101 840 2658 2021 1001 1671 1817 1351 951 -986 -1913 -121 -1380 -3409 -2529 -1652
1929a652P1N58O0O4J880J396j609j27K091p92j258K31j375P1J423j570k134K581
$$ -1652 -1581 -1023 -963 -899 981 2377 768 641 2732 1940 682 913 -462 -391 1032 -538 -2672 -91
1947i1Q19j447Q79L59m72J138j42k083J165J320k379j414J831o10J29O99j676
$$ -91 728 -719 160 519 47 1185 1043 -1040 125 1445 -934 -2348 -517 -1127 -998 -299 -1975
1964a975N98L591m11j681J347N57n21P05j148j878K135n7l301J109J773k782M68
$$ -1975 -1377 2214 1803 122 1469 2026 1505 2210 1062 -816 1319 1262 -2039 -930 843 -1939 -1471
1981a471J092j602J752K268l036n55M315o24k675J581j238j629L484j393m413
$$ -1471 -379 -1981 -229 2039 -997 -1552 2763 2139 -536 1045 -193 -1822 1662 269 -4144
1996d144L473J949l814J341L017k385P90K401l418m28M743k476l222L535K94k980
$$ -4144 -671 1278 -2536 -1195 1822 -563 227 2628 -790 -1218 3525 1049 -2173 1362 1656 -1324
2012a324K161l29k830L070P68m227J914L342k646p61J142j935J590K024l811j429
$$ -1324 837 508 -2322 748 1516 -2711 -797 2545 -101 -862 280 -1655 -65 1959 -1852 -3281
2028c281M173m62j097J972j849j035L880j142k187L340j057l301L298J938l504
$$ -3281 892 430 -667 1305 -544 -1579 2301 1159 -1028 2312 1255 -2046 1252 3190 -314
2043c14N72K72m088L558M539o454k578M818j283J13M548m703l719N675P65m240
$$ -314 258 530 -3558 0 4539 -1915 -4493 325 -958 -845 3703 -1000 -4719 956 1721 -2519
2059b519M018n5n659M083M250l748P82J766n837J337O750l940l659L176j638n40
$$ -2519 1499 1444 -4215 -132 4118 370 1152 2918 -2919 -1582 5168 1228 -2431 745 -893 -1433
2075a433M824k724n420M162J375k696K725N14m335K412K988l187J250J595m816
$$ -1433 3391 667 -4753 -591 784 -1912 813 1327 -3008 -596 2392 -795 455 2050 -2766
2090b766O76M742k984p71L167k992q52N836k627m070M323n71l563L992L44m474
$$ -2766 -2090 2652 -332 -1103 2064 -928 -1780 4056 1429 -2641 1682 1111 -2452 1540 1884 -2590
2106b590L435J525n277J730L616m439M03L823l897l87N390l240k127M324k537
$$ -2590 845 2370 -2907 -1177 2439 -2000 -1597 2226 -1671 -2058 3332 92 -2035 2289 -248
2121b48l385N256k63m101L505L45l669M158J886n590J279L607l758J132L725n460
$$ -248 -3633 1623 1360 -2741 764 1109 -2560 1598 3484 -2106 -827 2780 -978 154 3879 -1581
2137a581r48N793k760k776L988k787l514O100L68m939K983R78l851L895L111n867
$$ -1581 -2529 3264 504 -2272 1716 -1071 -4585 1515 1883 -3056 -73 905 -2946 949 4060 -1807
2153a807l56M244l106J53M613m258k246M990q74j980L112k083l468M115J261l240
$$ -1807 -2163 2081 -1025 -872 3741 -517 -2763 2227 1353 -627 2485 402 -3066 1049 2310 -930
2169i30J195N44l105K198J999l871N99K053k289J090L030l325p04L758k638l90
$$ -930 265 809 -2296 -98 1901 -1970 -1371 682 -1607 -517 2513 -812 -1516 2242 -396 -786
2185g86L482k889k485M047l84k704L073q3m091L299K604m513R37L169m132O37
$$ -786 2696 -193 -2678 1369 985 -1719 1354 1271 -2820 479 3083 -1430 -493 2676 -1456 -819
2201h19M096l560j399L865k471k840M157p25l603L266J183l211K483J459l332
$$ -819 3277 -283 -1682 2183 -288 -3128 1029 304 -3299 -33 1150 -2061 422 1881 -1451
2216a451R97K790k711p29K542j743p25K566j114j372K615p93j839K106k6j735
$$ -1451 -454 2336 -375 -1104 1438 -305 -1030 1536 422 -950 1665 872 -967 1139 1113 -622
2232f22J317nk127J612J62k282Q46J467k129Q41J524k037P04K142j818NK118j283
$$ -622 695 690 -1437 175 337 -1945 -1099 368 -1761 -920 604 -1433 -729 1413 -405 -400 1718 435
2250D35j010K122q30j752K505o00k557K009Q13k438P05J578j687P49J609k004
$$ 435 -575 1547 717 -1035 1470 870 -1687 322 1135 -1303 -598 980 -707 42 1651 -353
2266c53m78K421j893r16J627r10j229J403j87j131J622Q37j506Q46J491j496K49
$$ -353 -831 1590 -303 -1219 408 -502 -1731 -328 -515 -1646 -24 813 -693 153 1644 148 397
2283C97R55j122Q7J092j539l25Q00n21p98Q19k91o66J505j02r31Q80K52q68J56
$$ 397 1352 230 317 1409 -130 -455 345 -176 -974 -155 -446 -1112 393 291 -640 240 492 -376 -220
2302b20N31j072K21O87q44p4J124r15J37J006k52k25Q74o93J54K86j90m48K12
$$ -220 311 -761 -540 147 -697 -771 353 -562 -425 581 329 104 978 285 439 725 535 87 299
2321B99Q6r69L41l7o62L50M63l42L51N13m98K38N48m08l20M12m33l08M83n03k86
$$ 299 385 -584 -243 -280 -942 -592 -129 -471 -120 393 -105 133 681 273 -47 365 -68 -376 107 -396 -682
2342f82Q29l39k15L53K84l12L34M99n21L49M38m87k40M98o19k79j15O2l26J35
$$ -682 147 -192 -407 -54 230 -82 252 751 230 579 1017 530 290 788 169 -110 -225 -163 -489 -354
2362c54j31l30L98M9m39M25J75j95L21j9q9M12K52j27k30K55J04JP9n45R4L28
$$ -354 -485 -815 -417 -368 -807 -382 -207 -402 -81 -100 -189 223 475 348 118 373 477 478 557 12 106 434
2384D34k7o10K08K23l71j41k46R2L06L73q20M4N39l53j46L52k95J30M48k06o3
$$ 434 407 -203 5 228 -143 -284 -530 -438 -132 241 -579 -535 4 -349 -495 -143 -438 -308 140 -66 -129
2405a29N33M13q39O58K15l91k5R0o03L53L23o18l89O46o00m37L14m22J49Q29k97
$$ -129 404 817 -22 636 851 460 435 525 -78 275 598 -20 -409 237 -363 -800 -486 -908 -759 70 -227
2426b27p4L92M63o80K00l3l68l8N98o25p4Q11m76L64P26p93K76P70o14J46M25
$$ -227 -301 91 554 -126 74 41 -327 -365 233 -392 -466 345 -131 233 959 166 442 1212 598 744 1169
2447A169o01o58K87q6o90O7j81j090Q23Q23r12M27J046j150O59J171r59k23R99
$$ 1169 568 -90 197 111 -579 -512 -693 -1783 -960 -137 -1049 -622 424 -726 -67 1104 145 -78 921
2466I21m67l18J071o78j242O67K51r70Q92N79j971J302R24j152N86M99j537j24
$$ 921 454 136 1207 529 -713 -46 205 -765 127 706 -1265 37 961 -191 395 894 -643 -767
2484g67J369j051o45J238j068k82J894l00r01J262K58j486J474J24j964O87R69
$$ -767 602 -449 -1094 144 -924 -1206 688 388 -513 749 1007 -479 995 1119 -845 -158 811
2501H11j314L25J505k462q9J737r59J7J408j092r02K400n8j895J401j25j731J326
$$ 811 -503 -178 1327 -1135 -1224 513 -446 -429 979 -113 -1015 1385 1327 -568 833 708 -1023 303
2519C03M91k264J084J090k382O76J892j989j02J489j222M24K169j320j467K518
$$ 303 794 -1470 -386 704 -1678 -1002 890 -1099 -1201 288 -934 -510 1659 339 -1128 1390
2535A390p38j552K053m30j862K053L32k489J933J608l539L71K145k411J42K372
$$ 1390 652 -900 1153 723 -1139 914 1246 -1243 690 2298 -1241 -870 1275 -1136 -994 1378
2551A378l098p78L552j110k203L070J05k675K590R12k875K015J390l412R60L081
$$ 1378 -1720 -2498 1054 -56 -2259 811 916 -1759 831 1743 -1132 883 2273 -1139 -179 2902
2567B902k497j069J664k017J06K884j948j953K033J74j520J949m79k138J874N10
$$ 2902 405 -664 1000 -1017 -911 1973 25 -1928 105 279 -1241 708 229 -1909 -35 475
2583D75k078K238O39k763J156J670j936J576N59l328J425L147k326j339K395j849
$$ 475 -1603 635 1274 -1489 -333 1337 -599 977 1536 -1792 -367 2780 454 -885 1510 -339
2599c39p73L015j699l013L846l09l361L123J537l945J372K280l170J260K945m316
$$ -339 -1112 1903 204 -2809 1037 728 -2633 490 2027 -1918 -546 1734 -1436 -176 2769 -1547
2615a547r34M604j501k659K666q95j996L797k4l918K827J514l215J810J672k710
$$ -1547 -2481 2123 622 -2037 629 -266 -2262 1535 1511 -2407 420 1934 -1281 529 2201 -509
2631e09M49J723k439K84K585k471j230K639q23j379J700j232j061K981o60k542
$$ -509 -60 1663 -776 -492 2093 -378 -1608 1031 208 -1171 529 -703 -1764 1217 557 -1985
2647a985K044N09j985J864M25k759K084J816l193J264K679l324j81K484j683o00
$$ -1985 59 568 -1417 447 872 -1887 197 2013 -1180 84 2763 -561 -742 1742 59 -541
2663e41K638k068k411L762j36l501K290M21k908K591J172l486J328K961l105l70
$$ -541 2097 29 -2382 1380 1244 -2257 33 454 -2454 137 1309 -2177 -849 2112 -993 -1363
2679a363L078j708j058K857j828j187L080j283k372K267Q90k684J436O92k714
$$ -1363 1715 7 -1051 1806 -22 -1209 1871 588 -1784 483 1373 -1311 125 817 -1897
2694a897K194J195l095R38K284j987q2K026j728o48K294j754j465K755n35k243
$$ -1897 297 1492 -1603 -665 1619 -368 -450 1576 -152 -800 1494 -260 -1725 1030 495 -1748
2710a748J482N22j746J117P51k324J768J600k126M71K105j546m18J965j893j71
$$ -1748 -266 256 -1490 -373 378 -1946 -178 1422 -704 -233 1872 326 -92 1873 -20 -191
2726a91J897j362j430J689k43j254J355j04j575J668K15k257J441P69j864O72
$$ -191 1706 344 -1086 603 360 -894 461 357 -1218 450 665 -1592 -151 618 -1246 -574
2742e74J479j691K12J797k102l42K428r04j356K634j64j587K224k83k635J622
$$ -574 905 -786 -574 1223 -879 -1221 1207 303 -1053 1581 1417 -170 2054 1771 -864 758
2758G58M91k347K82J253j907l21J775j336pK010j140o21J893Ro28R25j07j391
$$ 758 1249 -1098 -816 437 -1470 -1791 -16 -1352 -1359 651 -489 -1110 783 792 164 1089 982 -409
2776d09J278J63j627N01Q4r12L08Q01o11O5Q36o42L12Q58p49n34J046p54p3O59
$$ -409 869 1032 -595 -94 -10 -922 -614 187 -424 -359 477 -165 147 1005 256 -278 768 14 -59 600
2796F00q32j004R96j06n46M66K44r21R38J385j221O19L82j105K92N94j019m25
$$ 600 -232 -1236 -240 -346 -892 -426 -182 -1103 -165 1220 -1 618 1000 -105 187 781 -238 -663
2814f63Q28k38p33Q25J44p31N57P49o12L92K32r38J33O50o22l99j4l44l93O19
$$ -663 165 -73 -806 19 163 -568 -11 738 126 518 750 -188 -55 595 -27 -426 -440 -784 -1177 -558
2834e58j55m72M52M44J49M19J78K8N49j39n22J99L07n31l13K24k79k99O5l57K64
$$ -558 -713 -1185 -733 -289 -140 279 457 485 1034 895 373 572 879 348 35 259 -20 -319 -254 -611 -347
2855c47J97L68m44K13M23j95J26j48o38L47J53n14j31N96m98L09K07j2L67K29
$$ -347 -150 218 -226 -13 410 215 341 193 -445 -98 55 -459 -590 6 -492 -183 24 12 379 608
2875F08n1nL72j78n18N6j50m4K2j17p66K39N16m81J79L37k14L55K22m46Q7J41
$$ 608 557 552 924 746 228 284 134 90 112 -5 -771 -532 -16 -497 -318 19 -195 160 382 -64 23 164
2897A64M4o04J19O1j56K32K0l05O70N0n83M38L63j23j32K90k11J9r1k89k68L70
$$ 164 208 -396 -277 -216 -372 -140 -120 -425 245 295 -288 150 513 390 258 548 337 356 265 -24 -292 78
2919G8m16K1j1r2j93L90K84n68O87k64J2Q5L7p9J0K56k82J95K05m75l2N66k93
$$ 78 -338 -317 -328 -420 -613 -223 61 -507 180 -84 -72 13 50 -29 -19 237 -45 150 355 -120 -152 414 121
2942A21J66K60m22o4N06j89p83L38K1n19P36rj017N38L36m41J57O91o94j65J026
$$ 121 287 547 125 61 567 378 -405 -67 -46 -565 171 162 -855 -317 19 -422 -265 426 -268 -433 593
2963E93o46o9P52j81p05J028j71q21L71M08j090P44K21q87L43N44p65k21J043
$$ 593 -53 -122 630 449 -256 772 601 -220 151 559 -531 213 434 -453 -110 434 -331 -552 491
2982D91o54j54L44k02k48M35j85k99N43m21N7P64k55o60O94J51o49Q26M3p69K02
$$ 491 -163 -317 27 -175 -423 12 -173 -472 71 -350 -293 471 216 -444 250 401 -248 578 621 -148 54
3003E4N55r72M89R01j324j91J508r34q11J630q79j365J765j53j493J212O15j761
$$ 54 609 -363 126 1027 -297 -488 1020 86 -725 905 26 -1339 426 273 -1220 -8 607 -1154
3021a154R57J222k107K57J699j168m59J803q05r54J822m16j472J888Mk034J066
$$ -1154 -197 1025 -1082 -825 874 -294 -753 1050 245 -709 1113 697 -775 1113 1117 -917 149
3038A49P28j565O38R09j878M43J436j561j12J189r03m53J712r47j044J875o56
$$ 149 877 -688 -50 859 -1019 -576 860 -701 -813 376 -527 -980 732 -215 -1259 616 -40
3055d0r40J711l43j327J322L46j425J494L94k077J143R02j641o0J575j905J91
$$ -40 -980 731 388 -939 383 729 -696 798 1192 -885 258 1160 -481 -541 1034 -871 -680
3072f80K322k053j029K322p81j390K095k12k214K033M36k240J930N35k537J062
$$ -680 1642 -411 -1440 882 101 -1289 806 594 -1620 413 849 -1391 539 1074 -1463 -401
3088d01J796k433M19J994k276j90K888j203j505K214q13j609K551j98k850J918
$$ -401 1395 -1038 -619 1375 -901 -1091 1797 594 -911 1303 490 -1119 1432 1234 -1616 302
3104C02Q22k485J323J518l090M41K529k096l29K141k085p65L101p85j670J927
$$ 302 1124 -1361 -38 1480 -1610 -1169 1360 -736 -1065 1076 -1009 -1774 1327 542 -1128 799
3120G99l34k066K758J42k367J008R69j556J073J311k390J62J230j084j34J839
$$ 799 465 -1601 1157 1299 -1068 -60 909 -647 426 1737 -653 -491 739 -345 -479 1360
3136A360j780o13K068j353j113K296j088j383K340o59j517K225r1j917K001P36
$$ 1360 -420 -1033 1035 -318 -1431 865 -223 -1606 734 75 -1442 783 692 -1225 776 1512
3152A512k860J315K337k886q7K285k485NL086k208k221L266m43k054K261J22l375
$$ 1512 -1348 -33 2304 -582 -669 1616 -869 -864 2222 14 -2207 1059 616 -1438 823 945 -2430
3169b430K625J839l318J225J370k610l8L350k310j206K251r50q85L132j140k534
$$ -2430 195 2034 -1284 -59 1311 -1299 -1337 2013 -297 -1503 748 -202 -1087 2045 905 -1629
3185a629J478R47o50R94l93k030J260J524j538kO11j850O81J732j612m2Q03j213
$$ -1629 -151 796 146 1140 747 -1283 -23 1501 -37 -39 572 -1278 -597 1135 -477 -519 284 -929
3203i29o7K553j172j767J708q80m49K646j090k170J851J005j671Q72O22k384J036
$$ -929 -996 1557 385 -1382 326 -554 -1003 1643 553 -1617 234 1239 -432 440 1062 -1322 -286
3220b86K171j990l57J967j714r30K710j049j963J604j89j458K253L29k604J009
$$ -286 1885 -105 -462 1505 -209 -1139 1571 522 -1441 163 -26 -1484 769 1098 -1506 -497
3236d97J563j545L27R26j604P5J893j251q11K040o75j056J535m98j047J230m05
$$ -497 1066 -479 -152 774 -830 -755 1138 -113 -924 1116 441 -615 920 422 -625 605 200
3253B00j443J667O49j483N21Q16j152N11M48j397M42J134j119o80J183l74m38
$$ 200 -1243 424 1073 -410 111 927 -225 286 734 -663 -221 913 -206 -886 297 -77 -515
3270e15O59p82n80K213l50j614J099M14o63N09L30j228O92P43j309K63J076p70
$$ -515 144 -638 -1218 995 645 -969 130 544 -119 390 720 -508 184 927 -382 -119 957 187
3288A87q02J075m69l70R22r12j139J792j79o92M72j44n36P47N37j436O54Q79o36
$$ 187 -615 460 -9 -379 543 -369 -1508 284 105 -587 -115 -259 -795 -48 489 -947 -293 586 -50
3307e0M2R87m48n93Q42o99l10J039l85q80L66K94l16J39j71n07O49L60r13j8P53
$$ -50 -8 979 531 -62 780 81 -229 810 425 -455 -89 205 -111 28 -143 -650 -1 359 -554 -572 181
3328A81j64j72m4Q2k1O08r42J16O31q3m37M40j55n3L75j58l07M20J0p01O7O08
$$ 181 17 -155 -199 -117 -138 470 -472 -356 275 192 -245 195 40 -13 362 204 -103 317 327 -374 -307 301
3350C01l63k18M89j68j23M03k36n30L39J27R8k24k83j34M64K51o86Q2R2Q4j41
$$ 301 -62 -280 209 41 -82 321 85 -445 -106 21 119 -105 -388 -522 -58 193 -493 -411 -319 -235 -376
3371c76O08j63k29O31j88k49O14k4k22j22L33l71j2m45j79L28Rj95j10j05L01
$$ -376 232 69 -160 471 283 34 648 624 402 280 613 242 230 -215 -394 -66 -57 -252 -362 -467 -166
3392a66N8J11n46k8N05J05k24L80k6k53L72K03j62M63o18k7K72K24l73j94J81
$$ -166 -108 3 -543 -571 -66 39 -185 195 169 -84 288 491 329 792 174 147 419 643 270 76 257
3413B57q1k22J36n11k71K58K43l05J98L95n92M54J55k43L91k87L5K34L9j66l9
$$ 257 176 -46 90 -421 -692 -434 -191 -496 -298 97 -495 -41 114 -129 262 -25 10 244 283 117 78
3434G8L01m04k42L80k60PP40m23n66P23m06mK99Kn69L45o9l23L33l9n07K63L05
$$ 78 379 -25 -267 113 -147 -140 600 177 -389 334 -72 -76 223 225 -344 1 -68 -391 -58 -97 -604 -341 -36
3457c6l30M62O5l11J9O68o71m6M63l62j33L28j43n24P80J13m44J26N24n69J65
$$ -36 -366 96 161 -150 -131 537 -134 -180 283 -79 -212 116 -27 -551 229 342 -102 24 548 -21 144
3478A44J90k11r5N5n45l2L42l27l29O48k51j11P23m92l67Q66M50j019J033J03
$$ 144 334 123 28 83 -462 -494 -152 -479 -808 -160 -411 -522 201 -291 -658 208 658 -361 672 775
3498G75r32N62M31r80r6P56o77k89J026r05m84J133j88p21J026l04j287J202N17
$$ 775 -157 405 836 -144 -240 516 -161 -450 576 -329 -813 320 132 -589 437 133 -1154 48 565
3517E65j059K44M79j069P44J094j421m56J294l05n09J482p45p36P44J08q81N96
$$ 565 -494 -250 229 -840 -96 998 -423 -879 415 110 -399 1083 338 -398 346 454 -427 169
3535A69J65j231Q86O08r32K93K89r41L88R38o98l25Q85p44q9J153j128n94J310
$$ 169 334 -897 -11 597 -335 -42 247 -694 -306 632 -66 -391 494 -250 -339 814 -314 -908 402
3554D02o06p09J245m12p77J072L31j171J063O71j499L44J616k104L28J369j515
$$ 402 -204 -913 332 -80 -857 215 546 -625 438 1109 -390 -46 1570 -534 -206 1163 -352
3571c52l09J872j400j065K069m00j917J131R09j800J145Q26j816L32J754j607
$$ -352 -661 1211 -189 -1254 815 415 -1502 -371 538 -1262 -117 709 -1107 -775 979 -628
3587f28J68J570j606l33K151m96r15J093p09q96J755p6j526K66q7o05J130L72
$$ -628 -460 1110 -496 -829 1322 826 -89 1004 295 -601 1154 1078 -448 -182 -269 -874 256 628
3605F28k031L61R08p73Q20R00k016P5J867p07k7J403j676j004K425P0j730J202
$$ 628 -1403 -1042 -134 -907 -87 813 -1203 -1128 739 32 5 1408 -268 -1272 1153 1223 -507 695
3623F95n94j685K407O03k687N06J177j698Q34K309k651p69K572j268m04K321j794
$$ 695 101 -1584 823 1426 -1261 -755 422 -1276 -442 1867 -784 -1553 1019 -249 -653 1668 -126
3640a26j361K067M61j636J239Q7k358J602J355k290K64J519j887K36K108j761
$$ -126 -1487 580 1041 -595 644 731 -1627 -25 1330 -960 -696 823 -1064 -828 1280 -481
3656d81p99J963q35p46K224j011j294K271k02j529J415J84j901Q21O69j640K52
$$ -481 -1280 683 -152 -898 1326 315 -979 1292 1090 -439 976 1160 -741 80 749 -891 -639
3673f39J148j835n9J743j325n04J868n09o62J776p96o96J820j62j486J295N43
$$ -639 509 -1326 -1385 358 -967 -1471 397 -112 -774 1002 206 -490 1330 1168 -318 977 1520
3690A520j715J022K35j822N24R82j525J75J097j620j98K276j659p24J996j323
$$ 1520 -195 827 1062 -760 -236 746 -779 -604 493 -1127 -1325 951 -708 -1432 564 -759
3706g59n06J979k2j897J661N28j489J521R33k463M04J967j977l5J438k199k15
$$ -759 -1265 714 692 -1205 456 984 -505 1016 1949 -514 -110 1857 -120 -155 1283 -916 -1131
3723a131J915r92j243J237k37j136J899P21j985P01J185j463J102R21j555m54
$$ -1131 784 -208 -1451 -214 -451 -1587 312 1033 -952 -251 934 -529 573 1494 -61 -515
3739e15J184q36J03Q66j492j80J043m25l20N94m83o29J462N9p54O23K88r47P99
$$ -515 669 -167 -64 802 -690 -870 173 -252 -572 22 -461 -1090 372 431 -323 300 588 -359 440
3758D40P91j726K98J126j425L89J184j644j18J467p53r77J068p05r07J535R8j106
$$ 440 1231 -495 -197 929 -496 -107 1077 -567 -685 782 29 -948 120 -585 -1492 43 141 -965
3776i65J164K44j529J061J146j116K82Q83p94P7P18o43o50R35o46j333R09R9r50
$$ -965 199 443 -1086 -25 1121 5 287 1170 376 453 1171 528 -122 813 167 -1166 -257 -158 -1108
3795a108N82J54r11M70Q88o49J37R85m82J60N72l94j55P65n39l86O14m14o96M89
$$ -1108 -526 -372 -1283 -813 75 -574 -437 548 66 226 798 404 249 1014 475 89 703 289 -407 82
3815H2l6j80L72n02o26R08j6n21J0N62q29M93N23p36M36N56o71j73J266p97l55
$$ 82 46 -134 238 -264 -890 18 2 -519 -509 53 -776 -283 240 -496 -60 496 -175 -348 918 121 -234
3836b34O74j61m46O52m5j121N23N52q47q2K39rM80K31o71J7R33m78k47K51J3o2
$$ -234 440 279 -167 485 440 -681 -158 394 -453 -535 -296 -305 175 406 -265 -248 685 207 -40 211 224 162
3858A62j01J01k95J91r6m04m7O49n17j3J46k42J27Q10k71l84M59q6r2p0O8J12
$$ 162 61 162 -133 58 -38 -442 -489 160 -357 -370 -224 -466 -339 471 200 -184 275 189 97 27 95 207
3880B07L62m1m21J79q2l41j91K44l80K92j89j80N6L41j35k13L00J05L20J55m02
$$ 207 569 528 107 286 204 -137 -328 -84 -464 -172 -361 -541 -485 -144 -279 -492 -192 -87 233 388 -14
3901a4L3M95J81p04p9K59N7MJ22m32J87J19j90k41L12j46P9j49m5N7J42l93l98
$$ -14 19 514 695 -9 -88 171 228 232 354 -78 109 228 38 -203 109 -37 42 -107 -152 -95 47 -346 -744
3924g44O27N29o35q6J84K95K54k15m16K89M74j12m22j89K99k11K27j02m43M70
$$ -744 -117 412 -223 -309 -125 170 424 209 -207 82 556 444 22 -167 132 -79 148 46 -397 73
3944G3o4l27K36R8j18j19k3J81l0J13m14O5M84j15O4m15J05j27L80j5j07J98K31
$$ 73 9 -318 -82 16 -102 -221 -244 -63 -93 20 -394 -329 155 40 104 -311 -206 -333 47 32 -75 123 354
3967C54j23J24n1j76J97n4o10K30L65m37K24K48o01J54L63o07O0P43o23q0K44
$$ 354 231 355 304 128 325 271 -339 -109 256 -181 43 291 -310 -156 207 -400 -340 403 -220 -300 -56
3988e6K53k29n5M79r00O73K42p10K74K40j69j16N01k70k34M06l06l93Q67l72p15
$$ -56 197 -32 -87 392 -508 165 407 -303 -29 211 42 -74 427 157 -77 329 23 -370 497 125 -590
4009e90M42Q0l81O17K7o49L70M16p11K67K31l16K43Jm54K32R26l94q58Q73k07
$$ -590 -148 -68 -449 168 195 -454 -84 332 -379 -112 119 -197 46 47 -407 -175 751 357 -501 372 165
4030A65k86R46k61r10L81K25q11O48K22j096M84Q57j034K02N66q63j78J483n71
$$ 165 -121 825 564 -346 35 260 -551 97 319 -777 -293 564 -470 -268 298 -565 -743 740 169
4049A69j047J151l15p76J648n37j135N38O52p17Q44N40j615J68J489p50j63N61
$$ 169 -878 273 -42 -818 830 293 -842 -304 348 -369 475 1015 -600 -432 1057 307 144 705
4067G05j094l22J467o78q13J035o76p57J507K42j296M63N47q31O42N61j246J24
$$ 705 -389 -711 756 78 -735 300 -376 -1133 374 616 -680 -217 330 -501 141 702 -544 -420
4085d20J130j036k9Q39q09k99J226m60l30R05l45m43Q01l72q80J167k42j369J028
$$ -420 710 -326 -355 484 -325 -624 602 142 -188 717 372 -71 730 358 -522 645 403 -966 62
4104F2J22j285J029Q72j473K65J118j195J76J453j367n84J559l66j125J285m44
$$ 62 184 -1101 -72 800 -673 -408 710 -485 -309 1144 -223 -807 752 386 -739 546 102
4121A02j409J437Q23j773P78R03j425O59J513j555n05J599j147o86J626q76j604
$$ 102 -1307 130 953 -820 -42 861 -564 95 1608 53 -452 1147 0 -686 940 64 -1540
4138a540J538J12j018Q11M44j692J197R48r50J89M07p31N89N84o59q21J021m18
$$ -1540 -2 110 -908 -97 347 -1345 -148 800 -150 39 446 -285 304 888 229 -592 429 11
4156A1l95J008l45j129J190j28o41J424n60j337R14L41j051N59L44j675J032J415
$$ 11 -384 624 279 -850 340 212 -429 995 435 -902 12 353 -698 -139 205 -1470 -438 977
4174I77j595kJ392j172k2J445q30j023K014o19j300J713j53k065J226R03j801
$$ 977 -618 -620 772 -400 -422 1023 193 -830 1184 565 -735 978 825 -1240 -14 889 -912
4191i12N20J393j995N31J532j371m88J420p22p25J602o76j149J345K58j600J070
$$ -912 -392 1001 -994 -463 1069 -302 -790 630 -92 -817 785 109 -1040 305 563 -1037 33
4208C3L94j167N21Q66j179O82P40j411K26J010j097R4J081p68l68J035n32n99
$$ 33 427 -740 -219 647 -532 150 890 -521 -295 715 -382 -288 793 25 -343 692 160 -439
4226d39Q64p7j246R87M19j061Q02n3j012P17M64j051N11R33j359M72P70q95l33
$$ -439 425 348 -898 89 508 -553 249 196 -816 -99 365 -686 -175 758 -601 -129 641 -254 -587
4245e87J304n71n90J255l8j482J136K52j114Q41J97j403Q16P48j234J62P48j020
$$ -587 717 146 -444 811 773 -709 427 679 -435 406 603 -800 16 764 -470 -308 440 -580
4263e80K0Q56o53n24J001m61n01J098K9r71P15N48o27K62M13n76nQ55r55j4P48
$$ -580 -560 296 -357 -881 120 -341 -842 256 285 -686 29 577 -50 212 625 49 44 899 -56 -70 678
4284F78o62n41P00j43o26Q56j12r55J044Oo40N22J82p98M54L57p98L06N05o58
$$ 678 16 -525 175 32 -594 262 150 -805 239 245 -395 127 309 -489 -35 322 -476 -170 335 -323
4304c23l7Q49o76L7N90m61k5N83k25m51M67j12o21N95O1r27P22K04o35M51M98
$$ -323 -360 489 -187 -150 440 -21 -46 537 312 -139 328 216 -405 190 251 -676 46 250 -385 66 564
4325E64p25L4O42n12j75O66q76l53P63l2q39R91o8n44N95L39o11K50O07o16J42
$$ 564 -161 -127 515 3 -172 494 -382 -735 28 -4 -843 148 80 -464 131 470 -141 109 716 100 242
4346B42L12m68k41K34k37k5j38N0l83N99Ll24K51R1k31M94o6p74N29J8P3L2P4
$$ 242 554 86 -155 79 -158 -183 -321 -271 -654 -55 -52 -376 -125 -34 -265 229 163 -611 -82 -64 9 41 115
4369A15k9k6K14j96K01J42j48k22L09p4m02J38J91n71n9L34l75j49O50l42M34
$$ 115 86 60 274 78 279 421 273 51 360 286 -116 22 213 -358 -417 -83 -458 -607 43 -299 135
4390A35n5j10O2K32k11l5R8l7k02Q7R4k57M1o5J10p5L29k38K16K01j43jj01J86
$$ 135 80 -30 32 264 53 18 116 79 -123 -36 58 -199 -158 -223 -113 -188 141 -97 119 320 177 176 75 261
4414B61j57M5l80N6o9K56m71P9N75n33N37m02J96j51K18j69J93J37l44m3K13J95
$$ 261 104 149 -231 -175 -244 12 -459 -380 195 -338 199 -203 -7 -158 60 -109 84 221 -123 -166 47 242
4436B42l37J28J17k53L73j22j8M1J37l15J97j42l65l1p3J38k12J81k53L62L06
$$ 242 -95 33 150 -103 270 148 130 171 308 -7 190 48 -317 -348 -421 -283 -495 -314 -567 -205 101
4457A01m59N04Q1j51J22J66m5k75jJ65k74K10j76k15M6J84j62Q3K92m34L25L02
$$ 101 -358 146 227 76 198 364 319 44 43 208 -66 144 -32 -247 -201 -17 -179 -96 196 -238 87 389
4479C89o97P7J33j40r7j55N94k79J49J19m98K65L64l29K78K42j64l4J05j34k71
$$ 389 -308 -231 -98 -238 -335 -490 104 -175 -26 93 -405 -140 224 -105 173 415 251 217 322 188 -83
4500h3M14m93j98J88K96l20L12k62J12M63l74j57P7J12m39O4J54o18N99J53o12
$$ -83 331 -162 -360 -172 124 -196 116 -146 -34 429 55 -102 -25 87 -352 -288 -134 -752 -153 0 -612
4521f12K84O56m08j27O52k40k06L72p6n91R05j93p21M27l9l95K77K91n94L43K48
$$ -612 -328 328 -80 -207 445 205 -1 371 295 -296 609 416 -305 122 83 -312 -35 256 -338 5 253
4542B53m52k87O57j04p07P66k15l45R73k72r78P99M70p35J23L19l09K34M56n96
$$ 253 -199 -486 171 67 -640 126 -89 -434 539 267 -711 88 558 -177 -54 265 -44 190 646 50
4562E0j1N05n67l55P29l64j18L89n70k74R00k51n90O67k50m30M33Q5m02O64K39
$$ 50 39 544 -23 -378 351 -13 -131 258 -312 -586 314 63 -527 140 -110 -540 -107 -22 -424 240 479
4583D79p35O7J070q57K1N14p19K1Q59o42m42Q22Pq36P02k10q93R28L15j107M97
$$ 479 -256 -189 881 24 45 559 -160 -139 720 78 -364 458 465 -371 331 121 -772 156 471 -636 -139
4604a39Q00j011q4Q77o44m50R87q31k42J389m97j160J300K7q01P89j4q65P20Q24
$$ -139 661 -350 -434 443 -201 -651 336 -495 -737 652 155 -1005 295 322 -479 310 296 -569 151 975
4624I75j232L05L86n29k93Q93o93n18R53k27l78P18J5p45O13l9n44N02j03r20
$$ 975 -257 48 434 -95 -388 505 -188 -706 247 20 -358 360 375 -370 243 204 -340 162 59 -861
4644h61O19P83j060O04Q1r89Q92O56r93l50J324m89m37J003l93q21R61l73r54
$$ -861 -242 541 -519 85 166 -823 69 725 -268 -618 706 217 -220 783 390 -431 530 157 -797
4663g97R42K09j184Q41N64j107L16J050j449J43J179r02m48J216o48p03J274m66
$$ -797 145 354 -830 11 575 -532 -216 834 -615 -472 707 -195 -643 573 -75 -778 496 30
4681C0n97M37N36r79Q56N12j221M62O81p44j51Q10q88l46R93o48n37J123n67n46
$$ 30 -567 -130 406 -573 283 795 -426 36 717 -27 -178 632 -256 -602 391 -257 -794 329 -238 -784
4701g84J109k44o35O46M15q05M63K56p22L98M48o36J01M59o33j64O93n21j26P91
$$ -784 325 81 -554 92 507 -298 165 421 -301 97 545 -91 10 469 -164 -328 365 -156 -282 509
4721E09m08l66Q21n93k76O09L07j097L68K64r97Q36M88j225L38P97p36P3J138
$$ 509 101 -265 556 -37 -313 296 603 -494 -126 138 -859 -23 465 -760 -422 375 -361 -288 850
4740H50p74m08J168o15p66J167j49j081P43M70r60O03J64j052O19P38q49o9L85
$$ 850 76 -332 836 221 -545 622 473 -608 135 605 -355 248 412 -640 -21 717 -132 -201 184
4759A84k89k03R67m91q15R26n25n3N61j11p65N43K24l71L04L01p68J33O63k76
$$ 184 -105 -308 659 168 -647 279 -246 -299 262 151 -614 -71 153 -218 86 387 -381 -248 415 139
4779A39j23L41n86K9P78o18j44N96m13m96Q41l24n85M45K56o28N04M55j051L41
$$ 139 16 357 -229 -200 578 -40 -184 412 -1 -497 344 20 -565 -120 136 -492 12 467 -584 -243
4799b43L76n30M50L99n98l30Q33k65m74Q99m88j94M54J63o28M97M4o79L13L26
$$ -243 133 -397 53 452 -146 -476 357 92 -382 517 29 -165 289 452 -176 321 365 -314 -1 325
4819C25l78l19N72n95L6P83o32k63P65k72k63L60r6O2L26r9l41L15k71k13L61
$$ 325 -53 -372 200 -395 -359 424 -208 -471 294 22 -241 119 23 85 411 312 -29 286 15 -198 163
4840A63p0n48M10L14k43n0L46j24k34J00J41l51L15o9l75M3L0j32J76K67m57M16
$$ 163 93 -455 -45 269 26 -24 322 198 -36 64 205 -146 169 100 -275 -232 -202 -334 -158 109 -348 68
4862F8p7k58J88J61Lo7K37k22Q5M89n75P8m9j80K8L82j05l15N10q4j56j05O7k0
$$ 68 -9 -267 -79 82 85 18 255 33 118 607 32 110 61 -119 -91 291 186 -129 381 297 141 36 103 83
4886H3j29J47k0l34P3n0l04N07P1k01P1L55k02J35J08k35J52J18m27j00M14l80
$$ 83 -46 101 81 -253 -180 -230 -534 -27 44 -157 -86 269 67 202 310 75 227 345 -82 -182 232 -148
4908a48p3L06nk79J75k89K95J41o3j7j37K51l83K18j24K2n6R1j25J61J70p3j13
$$ -148 -221 85 80 -199 -24 -313 -18 123 60 43 -94 157 -226 -8 -132 -110 -166 -75 -200 -39 131 58 -55
4931e5N48kk15j26K1r2L64l9m30P2k37k65K81J30m3j19K2k81M43K48l82J01N55
$$ -55 493 491 276 150 171 79 443 404 -26 46 -191 -456 -175 -45 -88 -207 -185 -466 -23 225 -157 -56 499
4954D99l83k35K37k23J01j09J1l14O53k74kL09J18lj79p7n4L2J70n0l14o5m2p6
$$ 499 116 -119 118 -105 -4 -113 -102 -416 237 -37 -39 270 388 385 206 129 75 107 277 227 -87 -152 -194 -270
4978b70N2k10L26O5J80k28K73K62n09L32k00j25K6j8k37p9M32k57K60L26k06m3
$$ -270 -218 -428 -102 -37 143 -85 188 450 -59 273 73 -52 -26 -44 -281 -360 72 -185 75 401 195 152
5000A52L84k84k68M34k13k77L25j4n76L73k09n00N43K72l33k68L40J02j66M76
$$ 152 536 252 -16 418 205 -72 253 239 -337 36 -173 -673 -130 142 -191 -459 -119 -17 -183 293
5020B93k58M6J59j70j72K83k93q3L79P7l85K38O0j25J69J30n63L6M86m15p2M05
$$ 293 35 81 240 70 -102 181 -112 -195 184 261 -124 114 174 49 218 348 -215 -179 307 -108 -180 225
5042B25l90j46K87j12k94O32j92n27O73L03k23%M7j53L7K79m43l2L69n88qL39
$$ 225 -165 -311 -24 -136 -430 202 10 -517 156 459 236 236 283 130 167 446 3 -29 340 -248 -256 83
5064H3j34j80K60P7m25K92N8l07qJ19l42N42j09n50O63J40n82L30K11l26pN17
$$ 83 -51 -231 29 106 -319 -27 31 -276 -284 -165 -507 35 -74 -624 39 179 -403 -73 138 -188 -195 322
5086C22l76k20O51r5n84M81m1l64J30K55l86J40K67l44o5O57n96l04P78o64J66
$$ 322 -54 -274 377 282 -302 179 138 -226 -96 159 -227 -87 180 -164 -229 428 -168 -472 306 -358 -192
5107a92L57j97l82L80R3m30K84kk72K49Q3j70L52J33p01L28M66k46j41J07m89
$$ -192 165 -32 -414 -34 59 -371 -87 -89 -361 -112 -29 -199 153 286 -415 -87 379 133 -8 99 -390
5128c90M1Q10m14j95M03j99n57N87l15l76O00J32q19M40N33p37M11M89p85L06
$$ -390 -349 461 47 -148 255 56 -501 86 -229 -605 -5 127 -692 -252 281 -456 -45 444 -341 -35
5148c5O16j020J19P77j80n11Q12o4p15L08j65m19O94K83r15J13M33l41R5M26q28
$$ -35 581 -439 -320 457 277 -234 578 514 -201 107 -58 -477 217 500 -415 -302 131 -210 -115 311 -517
5169e17L01L78j30j74M47m79k46O45l70J6M31j55l80M77K63o14L01J56n18N66
$$ -517 -216 162 32 -142 305 -174 -420 225 -145 -129 302 147 -233 244 507 -107 194 350 -168 398
5189C98J20n79k95O60l35j96N42o20j35P69r7n64P72p68r7L49K82m55L27K94q37
$$ 398 518 -61 -356 304 -31 -227 315 -305 -440 329 232 -332 440 -328 -425 -76 206 -249 78 372 -465
5210d65P25L46p35k87P06j44j50M78l94l74O78j93l54K45J29o51N41J71n85K10
$$ -465 260 606 -129 -416 290 146 -4 474 80 -294 384 191 -163 82 211 -440 101 272 -313 -103
5230a03M12n97n2Q28n35m67P51j28k53L65j99m89P68O5n91L85J07m23L45K34n80
$$ -103 309 -288 -340 488 -47 -514 237 109 -144 221 22 -467 301 366 -225 160 267 -156 189 423 -157
5251a57K19J71k73j96L32j86j10L18R9l85M01l73l50N56J43n14K8M00m91N64M8
$$ -157 62 233 -40 -236 96 -90 -200 118 217 -168 233 -140 -490 66 209 -305 -277 123 -368 196 244
5272B44o92O00K83m47P0N06o49J55L83l63j08J00k16k12M66M8n85N28n5l43K36
$$ 244 -448 152 435 -12 58 564 -85 70 453 90 -18 82 -134 -346 120 168 -417 111 56 -287 -51
5293e1M62o29J68K37m32M6K64m93j31O93j7l63K28M86p57O64jm18J02L10n02L86
$$ -51 411 -218 -50 187 -245 -199 65 -428 -559 134 117 -246 -18 468 -289 375 374 -44 58 368 -134 252
5315B52j55l96J77J73j21m0J13l20j26M34j30l27O47k21j1K65n5k53K86Jn02J69
$$ 252 97 -299 -122 51 -70 -110 3 -317 -443 -9 -139 -466 181 -40 -51 214 159 -94 192 193 -309 -140
5337a40L43l16L7K54j73N5J1J75L8m4k5l43N1k82K6K75K6m57M54J85l90J4K34
$$ -140 203 -113 -76 178 5 60 71 246 284 240 215 -128 -77 -359 -333 -58 -32 -489 -35 150 -240 -226 8
5360Hj30rK12k82J97K79k55n5M83m71j92M30j28l16M97k48j01J58J42m9j8n3k02
$$ 8 -122 -131 81 -201 -4 275 20 -35 448 -23 -215 215 87 -229 268 20 -81 77 219 170 152 99 -103
5383a03J67J04n99M04n1M7j62K44J20k93J45Q0j74Q9K25l7m4j04K6K98l05n1J88
$$ -103 64 168 -431 -27 -78 -31 -193 51 171 -122 23 103 -71 18 243 206 162 58 84 382 77 26 214
5406B14O8n67N06k09j2k21l6K14j89L16l47j58K70J86j28M8j26no0M54l78J56
$$ 214 282 -285 221 12 0 -221 -257 -43 -232 84 -263 -421 -151 35 -93 -45 -171 -176 -236 218 -160 -4
5428dJ23j80J07R3k9n5q6L25j69k41K93k98J83J23l54J42qj43j38K68n4%J06J22
$$ -4 119 -61 46 139 110 55 -31 294 125 -116 177 -121 62 185 -169 -27 -35 -178 -316 -48 -102 -102 4 126
5452A26j53J73l04m7J39L49l89K21j09j41J31o9L98l94J29n1J69K3M2k07l7j56
$$ 126 -27 146 -158 -205 -66 283 -106 115 6 -135 -4 -73 325 -69 60 9 178 201 243 36 -1 -157
5474a57L0K58k37O5Q3r6J63j48K5k62J11L94m75N62l55P8n1K8j36R4J84k7p2l3
$$ -157 -127 131 -106 -41 42 -54 109 -39 -14 -276 -165 229 -246 316 -39 39 -12 16 -120 -26 158 131 59 26
5498B6K1P4p4Pj22o2Q1r4P0J42J07l24P1L29j53k0j17k57L94j51j98J49n0J5J60
$$ 26 47 121 47 54 -68 -130 -49 -143 -73 69 176 -148 -77 252 99 79 -38 -295 99 -52 -250 -101 -151 -136 24
5523B4k2j8M03k28L8N2q3j15J51j26pJ04j70j86j05K96j33m1O7m55M03J88j58
$$ 24 2 -16 387 159 197 249 166 51 202 76 69 173 3 -183 -288 8 -125 -166 -99 -554 -151 37 -121
5546a21lK3J15j13O7P6j14j4L47j00j7J76o8R3J07n13L3L59l38j40L55l24o0K62
$$ -121 -124 -101 14 -99 -32 44 -70 -84 263 163 146 322 254 347 454 -59 -26 333 -5 -145 210 -114 -174 88
5570H8J10m75J14j84K62oJ66l59L19n3m2l5K73k36L0R6O7k78M98n9l53L6J57j35
$$ 88 198 -277 -163 -347 -85 -91 75 -284 35 -18 -60 -95 178 -58 -28 68 135 -143 355 296 -57 -21 136 1
5594Aq7L72l15RL76m61kK03k35jR0j03j76M36m3j99J37j65J2K85j77j30L75J01
$$ 1 -86 286 -29 -20 356 -105 -107 96 -139 -140 -50 -153 -329 107 64 -135 2 -163 -151 134 -43 -173 202 303
5618C03l31j78K85J35J9r2j81k0L97k27l88N21k78k47J31L53m10K34L7j70r4K89
$$ 303 -28 -206 79 214 233 141 -40 -60 337 110 -278 243 -35 -282 -151 202 -208 26 63 -107 -201 88
5640H8k64j9L67k44J15J92k40r6K61N0m31O27l98j40L84N0k55P3J46k99Q6J54
$$ 88 -176 -195 172 -72 43 235 -5 -101 160 210 -221 406 8 -132 252 302 47 120 266 -33 53 207
5662B07k35K51q1l23K9K07j02j21N00m70j99N85l49l42M92K0k11J46L89n76L30
$$ 207 -28 223 142 -181 -152 55 -47 -168 332 -138 -337 248 -101 -443 49 69 -142 4 393 -183 147
5683A47q7K08j79K99m89J56K44k56r3J45l35n0L96k29k51K54O5l42M09m2k0O0
$$ 147 60 268 89 388 -101 55 299 43 -50 95 -240 -290 106 -123 -374 -120 -55 -397 12 -30 -50 10
5705A0K75j52l52O40j57m91M96l06M8L10k11n77P64k1n59N07M6m35qN19n76jK87
$$ 10 285 133 -219 421 264 -227 269 -37 11 321 110 -467 297 276 -283 224 270 -165 -173 346 -230 -231 56
5728E6l61r3N50j87k13L61m59K77K60m31r7M05k06n6K82J43l65K84m2n1L14k02
$$ 56 -305 -398 152 -35 -248 113 -346 -69 191 -240 -337 68 -138 -194 88 231 -134 150 108 57 371 169
5750A69k08mL18m72K64J5j96J16k0j0k73K11j25r7K82l2l31N25Q5l37K29J6k64
$$ 169 -39 -43 275 -197 67 82 -114 2 -18 -28 -301 -90 -215 -312 -30 -62 -393 132 217 -120 109 125 -139
5773a39m9N00j77j33J6M2k36N13k35k56J60R7l20R3O6j54n3O9J84Q3j48q7J33
$$ -139 -188 312 135 2 18 60 -176 337 102 -154 6 103 -217 -124 -58 -212 -265 -196 -12 71 -77 -164 -31
5796c1J14k50N6J42P1j08J03R9k21Q8R9k86K72j8k75M36j82O3j13Kl02Q3N72l77
$$ -31 83 -167 -111 31 102 -6 97 196 -25 63 162 -124 148 130 -145 291 109 172 59 61 -241 -158 414 37
5820C7j85L59m49M2J38J90l15J80r2j66L48M0l30J78J98k92J63P7m2J18M6j41
$$ 37 -148 211 -238 -196 -58 132 -183 -3 -95 -261 87 127 -203 -25 173 -119 44 121 79 197 243 102
5842A02O8L27k43j50k02k77L72J82j04j34J53n9l79M27p0N0j49J62k74K15J64
$$ 102 170 497 254 104 -98 -375 -3 179 75 -59 94 35 -344 83 13 63 -86 76 -198 17 181
5863A81kk78P5J57p0K47j52r3j8K12l00R5j70J82j66K9R1q6R5l6K04n39M56j95
$$ 181 179 -99 -24 133 63 310 158 65 47 259 -41 54 -116 66 -100 -71 20 -66 29 -7 197 -342 114 -81
5887h1K37k17j17M4K75m5j66K56l63L11q5L4p5J40k63K30j15r9K26L7J05l02P2
$$ -81 156 -61 -178 -134 141 96 -70 186 -177 134 49 83 8 148 -115 115 0 -99 127 164 269 -33 39
5910C9oj97J23J27o5l0j45j56J90J07j25N5J02LJ04l23L25j19J81o0k34K26O3
$$ 39 33 -164 -41 86 21 -9 -154 -310 -120 -13 -138 -83 19 22 126 -197 128 9 190 130 -104 122 185
5933A85j13k56L22j57n1K56j11k46L8mJ44Q5q2P1q1m0k3J83k66q4N1K23R4k03
$$ 185 72 -184 138 -19 -70 186 75 -171 -133 -137 7 92 10 81 0 -40 -63 120 -146 -230 -179 44 138 -65
5957f5O2o6J25R3r2R0J17p4j43J16j30j48J16N5l12K49p4J83j72j34M78k94L1
$$ -65 -3 -69 56 149 57 147 264 190 47 163 33 -115 1 56 -256 -7 -81 102 -70 -204 274 -20 11
5980A1p8J33j84l2j8K13M9j49N3r9J16p6j4J65P2J4l13J42P0N4j16J10j38P7j37
$$ 11 -67 66 -118 -150 -168 45 94 -55 -2 -101 15 -61 -75 90 162 176 -137 5 75 129 13 123 -15 62 -75
6005g5J43J64l34Q0j59K43k29j2J16q8J71k6J6J86jj66j60K28m0m1P8k78P03m17
$$ -75 68 232 -102 -22 -181 62 -167 -179 -63 -151 20 -6 10 196 195 29 -131 97 57 16 94 -184 519 102
6029A02L0j15J7K56k18q0J14mk72P2j53J07J71k20Q6m4K00k81M25m22L42p3Ok73
$$ 102 132 17 34 290 72 -8 106 102 -170 -98 -251 -144 27 -193 -107 -151 49 -232 193 -229 113 40 46 -227
6053b27L47P9m00J40K08j78j14L12j52K10j08l1k98M01k51k3j38K10J8o6k0j22
$$ -227 120 199 -201 -61 147 -31 -145 167 15 225 117 86 -212 189 -62 -85 -223 -13 5 -61 -81 -203
6075b03P2R4K24j84J17M1l17R9M7J32N2k11O8O1q2L27k29J97k99J95l4l02K82
$$ -203 -131 -37 187 3 120 161 -156 -57 -10 122 174 -37 31 92 10 337 108 305 6 201 167 -135 147
6098A47J68j84M8k10l1L9o8n7q7L65l57J48M9O1k50K20m6J16N5N7j34L6L95q43
$$ 147 315 131 179 -31 -62 -23 -91 -148 -235 130 -227 -79 -30 31 -219 1 -45 71 126 183 49 85 480 -363
6122c63N08K29k69l5J78l45j24L92j25k17N0K4k91J71K95l31J75J28l45K43K46
$$ -363 145 374 105 70 248 -97 -221 171 46 -171 -121 -97 -388 -217 78 -253 -78 50 -295 -52 194
6143A94l15J73J10q5M2q2j52J2L40j89l12K92O5m58L37N4j19j9l0m2J09J4n9J13
$$ 194 -121 52 162 77 119 37 -115 -103 237 48 -264 28 93 -365 -28 26 -93 -112 -142 -184 -75 -61 -120 -7
6167gK69m15J8J30j60n1J11K46j8l3m0k19K52L97o30Q5K64k06qJ73k68J54K24
$$ -7 262 -153 -135 -5 -165 -216 -105 141 123 90 50 -169 83 480 -150 -65 199 -7 -15 158 -110 44 268
6190B68j28m02M62l76P1J37j25j56O7J59j16nJ37q7k5N6j90K50J62j39oM3n8l96
$$ 268 140 -262 200 -176 -105 32 -93 -249 -182 -23 -139 -144 -7 -94 -119 -63 -253 -3 159 20 14 57 -1 -397
6214c97N09j48o9M80L3k60Q0k29K0J17l50K80k01p1J13j2K10l39J87j5j1j05J79
$$ -397 112 -36 -105 375 408 148 228 -1 19 136 -214 66 -135 -206 -93 -105 105 -234 -47 -62 -73 -178 1
6237Am7N3J13p6k9L2J11R4q8j50Kl8n1j96J10L51ml43K52l79K70j71J57q9M6N0
$$ 1 -46 7 120 44 15 47 158 252 164 14 16 -22 -73 -269 -159 192 188 -155 97 -282 -12 -183 -26 -115 -69 -19
6263a9j78K48l5j52K47O2l38L49k2j38J68r3J47l0K7m62R7K60k26K16j36%k30
$$ -19 -197 51 16 -136 111 173 -165 184 162 24 192 99 246 216 243 -219 -122 138 -88 128 -8 -8 -238
6286b38J17K69k23P5r4J02j7jq0J43p7N4k40R5N2k22M64k41r0M5mQJ14J29k02
$$ -238 -121 148 -75 0 -94 8 -9 -10 -90 53 -24 30 -210 -115 -63 -285 179 -62 -152 -107 -111 -103 11 140 -62
6311f2N7J91k87J08Q6j49K4K86l67m5Q7k8R3J39j74l33M12N5k98J40J42l49K62
$$ -62 -5 186 -101 7 93 -56 -32 254 -113 -158 -71 -99 -6 133 -41 -374 38 93 -205 -65 77 -272 -10
6334a0L70n80L9M53l24l8M06k74n5M15n17J00L5Rr2k53K54j87L54k4j92J19n8
$$ -10 360 -220 -181 272 -52 -90 316 42 -13 402 -115 -15 20 29 -63 -316 -62 -249 105 81 -111 8 -50
6357e0j57K45k81K78N2J3l22L18l3R2q8J03j36K33m05K02K28l33J22r4j97J64
$$ -50 -207 38 -243 35 87 100 -222 96 63 155 67 170 34 267 -138 64 292 -41 81 -13 -210 -46
6379d6p4O9J1R9m7l10K49j1K5j49J69j56O6J80m6K91k93j22J56JK32m84J11O9
$$ -46 -120 -51 -40 59 12 -298 -49 -60 -35 -184 -15 -171 -105 75 29 320 27 -95 61 62 294 -190 -79 -10
6403a0K84m21J72J33r3M0j1N2ml78J47K06k17Q5p3L35k11K2j0J45k02j55L65k7
$$ -10 274 -147 25 158 65 105 94 146 142 -236 -89 117 -100 -15 -88 247 36 58 48 193 -9 -164 201 174
6427A74l04j0k9R3J82R9k95K19k59J14J31J15l1N3k41K35n29N53l08J62l24Q1
$$ 174 -130 -140 -169 -76 106 205 -90 129 -130 -16 115 230 199 252 11 246 -283 270 -38 124 -200 -119
6449a19K46j34J86l66K48J11o7n9k25K19r7J81k46J16O1N8J8P7l55K69p7L8p5
$$ -119 127 -7 179 -187 61 172 105 46 -179 40 -57 124 -122 -6 55 113 131 208 -147 122 45 83 8
6472HJ1k3q6J4q4J59k54J19j36K30n2K4Q3MO0l4j41L04m08L02j56QJ36K37m34
$$ 8 19 -4 -90 -76 -160 -1 -255 -136 -272 -42 -94 -70 13 17 77 43 -98 206 -202 100 -56 -48 88 325 -109
6497a09L9R5j01M13o05J95L8p4m8J59j17l99K81j1J64O9J52l86P3K36k19J79J62
$$ -109 -70 25 -76 337 -268 -73 -35 -109 -157 2 -115 -514 -233 -244 -80 -11 141 -245 -172 64 -155 24 186
6520A86q6j93K76j51J7j2j67K39Q4k46M3m1J40l6o3m6j39L11k82R9O7j26k75J10
$$ 186 100 -93 183 32 49 37 -130 109 193 -53 -10 -51 89 53 -10 -56 -195 116 -166 -67 0 -126 -401 -291
6544b91n1L81l1j3k02L56j27j37J16k0qJ99j63K56j66k21nJ09kj12J13K02o0n6
$$ -291 -342 39 8 -5 -207 149 22 -115 1 -19 -27 172 9 265 99 -122 -127 -18 -20 -132 -19 183 123 67
6568F7N3j41M2n1j94K89J36k34K2Mj09J04nR5J49n47L09M23l66r8K98L5k98Q8
$$ 67 120 -21 21 -30 -224 65 201 -33 -11 -7 -116 -12 -17 78 227 -320 -11 412 46 -52 246 281 -17 71
6592G1J05Q9k51k45J60J10J04Nl79L38l34J57J58q3pJ47rl50K67J3nj09PJ37j77
$$ 71 176 265 14 -231 -71 39 143 148 -231 107 -227 -70 88 5 -2 145 136 -214 53 66 61 -48 -41 96 -81
6617h1J94m8L2J47j26R2J51k89N9m6Rk54l4K50R3k63Q4j5j22N5p1jJ13j28r0M92
$$ -81 113 65 97 244 118 210 361 72 131 85 94 -160 -194 56 149 -114 -30 -45 -167 -112 -183 -184 -71 -199 -289 203
6643B03k64J3J18j04N7r6K12k06j7J66P5j71J86j2J41j40j62J28k63j11K90r5
$$ 203 -61 -48 70 -34 23 -73 139 -67 -84 82 157 -14 172 160 301 161 -1 127 -136 -247 43 -52
6665e2k14J17J44j84K40k34L4J07N9kk34K66J01j88R0r3j16K17O3o6j82M1J38
$$ -52 -266 -149 -5 -189 51 -183 -149 -42 17 15 -219 47 148 -40 50 -43 -159 58 121 55 -127 -86 52
6688E2j20M40l32k5J63k22k83N00l29k0K10p3m4J56p7k36L57j12q7k28M79j02
$$ 52 -68 372 40 15 178 -44 -327 173 -156 -176 34 -39 -83 73 -4 -240 117 5 -82 -310 169 67
6710F7L4j04K8l0mK24o8J23k11K2m7p1P9n1J73k63J22j78j10J51K41l59J68J6
$$ 67 101 -3 25 -5 -9 215 147 270 59 81 34 -37 42 -9 164 -99 23 -155 -265 -114 127 -232 -64 -48
6734d8j79K36k19l1J69J97r0n6J33j55J99o5Q7M8j52J71k92O2J31o7j03L1j9j43
$$ -48 -227 9 -210 -241 -72 125 35 -21 112 -43 156 91 178 226 74 245 -47 15 146 79 -24 7 -12 -155
6758a55o7L03p7j29K81j82k6J26l41M49r6p6rR5j21K4K36l4l75J75j11O4O0J32
$$ -155 -222 81 4 -125 156 -26 -52 74 -267 182 86 10 1 96 -25 -1 235 201 -174 1 -110 -46 14 146
6782A46k53L6J16j86K52n8k54J48J70l51L35N4j04n0K4k13L44p1k73M39r3k5l05
$$ 146 -107 -71 45 -141 111 53 -201 -53 117 -234 101 155 51 1 25 -188 156 85 -188 251 158 133 -172
6805a72J43J7J09m5r0Q9m8K32Qj75lj17J84j18k4Qnj10O1r6J21R1k38Q1M8J29
$$ -172 -29 -12 97 52 -38 51 3 235 243 68 65 -52 132 14 -10 -2 -7 -117 -56 -152 -31 60 -178 -97 -49 80
6831H0m5k5l03O60n39K77k98M2K90k46L10j38j15K02q8k4J29l93N1J63K0O5p9
$$ 80 35 10 -293 367 -172 105 -193 -151 139 -107 203 65 -50 152 64 40 169 -224 -173 -10 10 75 -4
6854dn4r2k2K5j91K45p9L31k87K55k85K61j13O0J00k30q5L50j09o7L4l2k70L86
$$ -4 -58 -150 -172 -147 -338 -93 -172 159 -128 127 -158 103 -10 50 150 -80 -165 185 76 9 43 11 -259 127
6878A27n0l05J76l49K74K13J15j64k24J76j0r3L9L50l49k48L20o2Q7j28m7K69
$$ 127 77 -228 -52 -401 -127 86 201 37 -187 -11 -21 -114 -75 275 -74 -322 -2 -64 23 -105 -152 117
6900A17J3l99K94n0J77k51L09j69Rj91L78k87K32j90k6k17J78L0L1%p4K13K69
$$ 117 130 -269 25 -25 152 -99 210 41 50 -141 237 -50 182 -8 -34 -251 -73 -43 -12 -12 -86 127 396
6923C96m18j28K34k9n2R8QP8k48J3J17k94L91j09Q3m1j97L0K93l46J8K15j82J69
$$ 396 -22 -150 84 55 3 101 109 187 -61 -48 69 -225 166 57 140 99 -98 -68 225 -121 -103 112 -70 99
6947I9l82P4K32j1l8J44j33k1k8l3L00mm75K49K21j39N6j60J1l5J16J52k69J52
$$ 99 -283 -209 23 12 -26 118 -15 -36 -64 -97 203 199 -276 -27 194 55 111 -49 -38 -73 43 195 -74 78
6971G8j29L1K29m31L51q6J81m7k29o4j07K20J10n4k43K88l9k98Q5mK28n6j28l9
$$ 78 -51 -20 209 -222 129 43 224 177 -52 -116 -223 -3 107 53 -190 98 59 -239 -154 -158 70 14 -114 -153
6995a53J16J13k4j10Q9qJ9n2o3j9pJ46n6Q0j37K7J16L1n9l02J21Q0M3K52l47k
$$ -153 -37 76 52 -58 31 23 42 -10 -73 -92 -99 47 -9 71 -66 -39 77 108 49 -253 -132 -52 -9 243 -104 -106
7021a06J71J07l4j36M7k6j62p1K23N6k44R4j2P1o3n0M01m61R1L07l43K30k25M4
$$ -106 65 172 138 2 49 23 -139 -210 13 69 -175 -81 -93 -22 -85 -135 266 -195 -104 203 -140 90 -135 -91
7045i1r6N6L21j69n9j15K98K0L3l21K03j02Q9k13L36J2j81J92k15L7j55K5K06
$$ -91 -187 -131 190 21 -38 -153 145 165 198 -123 80 -22 67 -146 190 202 21 213 -2 35 -120 -95 111
7068A11j10n7m1jOp6M5j37M02j37qk8rL48l44o5J30j03n8P6O0K1j13M3On8J36
$$ 111 1 -56 -97 -98 -92 -168 -123 -260 142 5 -3 -31 -40 308 -36 -101 29 -74 -132 -56 4 25 -88 -45 -39 -97 39
7095C9J18l21L10m21L38M5L3k43k8K51k29Q1q6J48m4k10J67J46r8M1L5P8k25K4
$$ 39 157 -164 146 -275 63 108 141 -102 -130 121 -108 -27 -113 35 -9 -219 -52 94 -4 37 72 150 -75 -51
7119e1J44nq4R6K7j1l0j28J11K7R2n2j65O1mm8k33K51k6j75O5mj20L86k06k8J64
$$ -51 93 88 4 100 127 116 86 -42 69 96 188 136 -29 32 28 -20 -253 -2 -28 -203 -138 -142 -262 124 -82 -110 54
7146E4j53r0J60J7r2N2O6p7K37m05K91j45L89l18q3L37j83k56K71n01L91J27k26
$$ 54 -99 -189 -29 -12 -104 -52 14 -63 174 -231 60 -85 304 -14 -97 240 57 -199 72 -429 -38 89 -137
7169a37J51j43j21J91K8k04K07J25qm9l0L1k34L27q6J22j09M3K7r8j68L13K9l34
$$ -137 14 -129 -250 -59 -31 -235 -28 97 89 40 10 41 -193 134 48 170 61 104 131 33 -135 178 207 -127
7193a27J39j41R1M0m3n1o2N6M6J15k5j36J15j32J20R1q3j41K91k07j01N89o14
$$ -127 12 -129 -38 2 -41 -92 -154 -98 -52 63 38 -98 17 -115 5 96 13 -128 163 -44 -145 444 -170
7216a70J76j08L4n2J51L2k17J33k47L43p0K75l35J83L7j07r8M8j32M4n2J8j5L72
$$ -170 6 -102 -68 -120 31 63 -154 -21 -268 75 5 280 -55 128 165 58 -40 8 -124 -80 -132 -114 -129 243
7240B43o1l18L76j64J50k92n4L71l1m10L75K7j63K43k96N8j80K6J86j96O6j16
$$ 243 182 -136 240 76 226 -66 -120 251 220 -190 185 212 49 292 -4 54 -126 -100 86 -110 -44 -160
7262a60N8m4N02l80l2P7J56k36K40m6k23LJ87Mj93J98k07L51l34J66j86J56J7
$$ -160 -102 -146 356 -24 -56 21 177 -59 181 135 -88 -85 102 106 -87 111 -96 255 -79 87 -99 57 74
7285G4l02L76r3k06M2P4K51j47j8k61R3J30j93K00M9j2N0K7k35K7M8R7q9J39j36
$$ 74 -228 148 55 -151 -109 -35 216 69 51 -210 -117 13 -180 20 69 57 107 134 -101 -74 -26 71 -18 121 -15
7310a5J22L4j29nj9K21q2k30K05L22m34j38L3j7J40L4k68J90J46m77K17K46J21
$$ -15 107 141 12 7 -12 209 127 -103 102 424 -10 -148 -115 -132 8 42 -226 -36 110 -367 -150 96 217
7333B17j47o7J8mR0j94J46j88K01j60K3L7J16M1k96J45k7j81K74M4k92N7j4M3
$$ 217 70 3 21 17 107 -87 59 -129 72 -88 -65 -28 88 129 -167 -22 -49 -230 44 88 -204 -147 -161 -118
7357a18O3%K0j54L22l1j58J6J22j77J55j25J75J7m55M57J02r6K17k11k93J28n5
$$ -118 -55 -55 -35 -189 133 102 -56 -40 82 -95 60 -65 110 127 -328 129 231 135 352 141 -152 -24 -79
7380g9J35o8J01q4O1j03k79J47J36j28J22L8K26m03J70q1K36j84J76j60K60k99
$$ -79 56 -12 89 5 66 -37 -316 -169 -33 -161 -39 -1 225 -178 -8 -89 147 -37 139 -21 239 -60
7402f0rJ26q8L29l72p1q6K53J9l76O22l25j08J2k3O6K8k0j59L69k20J11J52kl9
$$ -60 -69 57 -31 298 -74 -145 -231 22 41 -335 287 -38 -146 -134 -157 -91 -63 -83 -242 127 -93 18 170 168 129
7427A29o3j49J48q7J28K76k86r4k0j01J93o1J43p1p0j48j6J56p3Lk47L02k55J56
$$ 129 66 -83 65 -22 106 382 96 2 -18 -119 74 13 156 85 15 -133 -149 7 -66 -63 -310 -8 -263 -107
7451a07J11Nj0k19K43M6k36J76R3R5j8k35J9L0J02J8j69mJ73k22J26N7R9oj8r6
$$ -107 4 9 -1 -220 23 69 -167 9 102 197 179 -56 -37 -7 95 113 -56 -60 113 -109 17 74 173 167 149 53
7477E3r2J12j32K77k40l72J46J82r5K41j77J59j40J4L1kN6R3j93J06R9j03j93
$$ 53 -39 73 -59 218 -22 -394 -248 -66 -161 80 -97 62 -78 -64 -33 -35 21 114 -79 27 126 23 -170
7500a70L38j8P8k50l05K52N5j00J16J58j76N8k68K80k50O3o7L21k1k32L06K45
$$ -170 168 150 228 -22 -327 -75 -20 -120 -4 154 -22 36 -232 48 -202 -139 -206 115 94 -138 168 413
7522D13k58N8j06k91J7J95J94l13K1K06l07O5nJ87j50o8J84r0lL1J18j90K30k64
$$ 413 155 213 107 -184 -167 28 222 -91 -70 136 -171 -106 -111 76 -74 -142 42 -48 -51 -20 98 -92 138 -126
7546a26K06j3o3m3K0j1j10L0J9L08l49J1J55p7P8k8n6R9j16J00j19j58K37ml5
$$ -126 80 67 4 -39 -19 -30 -140 -110 -91 217 -132 -121 34 -43 35 7 -49 50 -66 34 -85 -243 -6 -10 -45
7571d5J37k59L17j89k08K29j2k1K18R9k75m5K35j59k1K01r2J70m0j31J65m93J32
$$ -45 92 -167 150 -39 -247 -18 -30 -51 167 266 -9 -54 181 22 1 202 110 280 240 109 274 -219 -87
7594h7L61k57l9q3R0m1J08o0p3J25K6o4N1o1o6L1J5j39l1r0J72N9j97M71m00K44
$$ -87 274 17 -22 -105 -15 -56 52 -8 -81 44 70 6 57 -4 -70 -39 -24 -163 -194 -284 -112 -53 -250 221 -179 65
7620F5p5j04K61k44J66J2j68K16k0l0OR7m50L82J20l08K01j22kj71J08R7j15J49
$$ 65 -10 -114 147 -97 69 81 -87 129 109 79 85 182 -268 114 234 -74 127 5 3 -168 -60 37 -78 71
7644G1j01PM3J02r0J6j2k01K69m0k87K14j3j78K85k92R5J88q3l2o3L9k67N95n26
$$ 71 -30 -23 20 122 32 48 36 -165 104 64 -223 -9 -22 -200 85 -207 -112 76 -7 -39 -102 -63 -330 265 -261
7669b61L36k15k4L01n0J1k25j9R2K27P9j39k61J92K92j55l35J27Q3m7p1J47j58
$$ -261 75 -140 -164 137 87 98 -127 -146 -54 173 252 113 -148 44 336 181 -154 -27 56 9 -62 85 -73
7692g3k15K45N3n6j85L33j58m4p7N24j30j09k96J31J6m0M65l46j58J27Q2l35K64
$$ -73 -288 -43 10 -46 -231 102 -56 -100 -177 347 217 108 -188 -57 -41 -81 384 38 -120 7 89 -246 18
7715A8n8K49l2k77J39M7k09p5L85n5m13L34j12m9kL9N5J3k02J41K91k24k1j07
$$ 18 -40 209 177 -100 39 86 -123 -198 187 132 -281 53 -59 -108 -110 -71 -16 -3 -205 -64 227 3 -18 -125
7739a25q9J22o5J26l2L22k61j8J00J01k38J17J31k12J94l10K95j48l0j31J72j20
$$ -125 -214 -92 -157 -31 -63 259 -2 -20 80 181 -57 60 191 -21 173 -137 158 10 -20 -151 21 -99
7761i9K22j22j35nK73K4j4k92J05R8j28J36K4j92K13Qq7L31l38J50k97M8n5K13
$$ -99 123 1 -134 -139 134 158 144 -148 -43 55 -73 63 87 -105 108 116 29 360 22 172 -125 -77 -132 81
7785H1P0k00J44j67J40k31j77K47k21J81K47j44Q1n4r0r8J05J01j3J9l1n6K20
$$ 81 151 -49 95 -72 68 -163 -340 -93 -314 -133 114 -30 51 -3 -93 -191 -86 15 2 21 -10 -66 154
7808A54k38K46j66J69k72J65J09j46j30M4o0K17j89N3k81L31O0j54KJ15P9j55
$$ 154 -84 162 -4 165 -107 58 167 21 -109 -65 -125 92 -97 -44 -325 6 66 -88 -86 29 108 -47
7830d7J44l09j1J46P9j27J31P5j04J19j04Q0j60J50j53M7j07J79j00L4J10m9j79
$$ -47 97 -212 -223 -77 2 -125 6 81 -23 96 -8 72 -88 62 -91 -44 -151 28 -72 -38 72 23 -156
7853a56j23K93O7j23J44l33K13J24L5j16k6j16J62J29j18L4M2mk02j87J98K15
$$ -156 -279 14 81 -42 102 -231 -18 106 141 25 -1 -117 45 174 56 90 132 128 -74 -261 -63 152
7875A52j0k66M5L61l69J40Nj07O8n5mM6r8q9J82Q3m0p4J20p5K9k03R4o2J49R0
$$ 152 142 -124 -79 282 -87 53 58 -49 19 -36 -40 6 -92 -181 1 84 44 -30 90 15 44 -159 -65 -127 22 112
7901A12l16K09J50j57R5k29J65j82K08M4j54J10j31R5j00L69j59k03j22j1J18
$$ 112 -204 5 155 -2 93 -136 29 -153 55 99 -55 55 -76 19 -81 288 129 -74 -196 -207 -89
7922h9k2J93jo8p8J41l4l9J07j71P5j06K04j45L15k65J54k56j33L38m8k86M8K54
$$ -89 -111 82 81 13 -65 76 42 3 110 -61 14 -92 112 -33 282 17 171 -85 -218 120 72 -214 -166 88
7946H8N2Ml79nL42%L4m01J91K28k00M2JJ68N9q7k6j23j35L11M3k89N8JJ85k90
$$ 88 140 144 -235 -240 102 102 136 -265 -74 154 -46 -4 -3 165 224 137 111 -12 -147 164 207 -82 -24 -23 162 -128
7972a28J01J4j24K18m00K37Q8J17o6k82L36j86j24J58m7j58J74J06l1m5M2J34
$$ -128 -27 -13 -137 81 -319 -82 6 123 57 -225 111 -75 -199 -41 -88 -246 -72 34 3 -42 0 134
7994A34r0j69Q7L19l37l4J3J75n0N0q2l42K66k0NJ63k49Q7m5L13k14j74P8M1K25
$$ 134 44 -125 -38 281 -56 -90 -77 98 48 98 16 -326 -60 -80 -75 88 -161 -74 -119 194 -20 -194 -116 -75 150
8019A50j12J8J79k24q4J33o3K26j74k1J26k43K03R8k36n5P6j36j7J20K02l54P4
$$ 150 38 56 235 11 -73 60 -3 223 49 28 154 -89 114 212 -24 -79 -3 -139 -156 -36 166 -188 -114
8042a14J96k38J36j9J16k13O1m0J44%O2k2P5kqj65rk9j68K52j24J7l2j47M48k48
$$ -114 82 -156 -20 -39 77 -136 -75 -115 29 29 91 69 144 142 134 -31 -40 -69 -237 15 -109 -92 -124 -271 177 -71
8068g1J36l63n4K79J45j38j17K80k39J06j08K90j30r6j39K06N0J9j7J20j84K38
$$ -71 65 -298 -352 -73 72 -66 -183 97 -142 -36 -144 146 16 -80 -219 -13 37 56 39 159 -25 213
8090B13j39j20j34K32j45J38r1J38J05j60J1J2J55k75p9P7m7J72j79j22K58J04
$$ 213 74 -46 -180 52 -93 45 -46 92 197 37 48 60 215 -60 -139 -62 -109 63 -116 -238 20 124
8112A24k97J97l9l01L44J38j90Q8p5J55J7n8J68l27M2j57N13k63j07J60j35OJ3
$$ 124 -173 24 -15 -316 28 166 -24 64 -11 144 161 103 271 -56 -14 -171 342 79 -28 132 -3 3 16
8135A6n7J39j69J7J5j12J04J99r4j75J57J32j31j1J08k12J60k52R7rM98m88J61
$$ 16 -41 98 -71 -54 -39 -151 -47 152 58 -117 40 172 41 30 138 -74 86 -166 -69 -78 420 -68 93
8158I3k5k67n9RP2kK18j96O3m0J64J50k22K4K9K83k33l02J88K15j44J61K7o8j88
$$ 93 68 -199 -258 -249 -177 -179 39 -157 -94 -134 30 180 -42 -18 11 294 61 -241 -53 162 18 179 206 138 -50
8183e0L79m43r5J39K02m9k90M23
$$ -50 329 -114 -209 -70 132 83 -207 216
8191B16
$$ Imaginary data points
##PAGE= N=2
##DATA TABLE= (X++(I..I)), XYDATA
0@%%%%%%%%%%%qJ6j6J6k2L0l2M0m8N6p0Q4r9J15j32J52j76K04k35K67l05L47l94
$$ 0 0 0 0 0 0 0 0 0 0 0 0 -8 8 -8 8 -14 16 -16 24 -24 32 -38 46 -53 62 -70 82 -94 110 -125 142 -163 184 -210
34b10M45n01N61o28P03p81Q69r68J073j185J311j450J599j762J942k139K357k597
$$ -210 235 -266 295 -333 370 -411 458 -510 563 -622 689 -761 838 -924 1018 -1121 1236 -1361
52a361K863l160L491l865M292m785N359o035O848p849R114j0768J3036j6345K1625
$$ -1361 1502 -1658 1833 -2032 2260 -2525 2834 -3201 3647 -4202 4912 -5856 7180 -9165 12460
67A2460l1347N4852k10256k18876N25176R7841k5461K07430j11580j98061K86042
$$ 12460 -18887 35965 -174291 -393167 132009 229850 204389 411819 300239 102178 388220
78C88220K7471l34196l969j322l17407M4223J90350j72602n6175J14204j15864
$$ 388220 415691 81495 77526 76204 -241203 -196980 -6630 -179232 -235407 -121203 -237067
89b37067P8104K62254j19485j55286J72627O1519o715J01657j09901j11899J90384
$$ -237067 -158963 103291 -16194 -171480 1147 62666 55951 157608 47707 -64192 126192
100A26192L2227j49836O0710J5980j15900J01224O1009j38715O3807M6219k32066
$$ 126192 158419 8583 69293 85273 -30627 70597 131606 -7109 56698 102917 -129149
111a29149O281J53651j60124q0775J08780r4485P619K25667o2565j05534K30782
$$ -129149 -122868 30783 -129341 -210116 -101336 -195821 -188202 37465 -25100 -130634 100148
122A00148N4372j54006J29942Q9853j24255Q6670L7196k33495J1434J31088j89618
$$ 100148 154520 514 130456 220309 96054 182724 219920 -13575 -2141 128947 -60671
133f0671j16794R1753r6803m9026J64230l3513o1256J76724J9373r1963J43054
$$ -60671 -177465 -85712 -182515 -231541 -67311 -100824 -162080 14644 34017 -57946 85108
144H5108P2229j11096L9298M5413q6847N9212M8705j66251j8258J10708q4932
$$ 85108 157337 46241 85539 130952 44105 103317 152022 -14229 -32487 78221 -6711
155f711o1747M2408q0180r430J30014m4241q4266R3546P038o8370R0118K4622
$$ -6711 -68458 -26050 -106230 -115660 14354 -29887 -114153 -20607 -13569 -81939 8179 32801
167C2801r3797N3712N0362n7462Q0725Q0673j12152k5550Q6985m3752k6269M2236
$$ 32801 -60996 -7284 43078 -14384 66341 147014 34862 9312 96297 52545 26276 68512
179F8512r3299m7957R4306l1849p6634M5811j2985n3170N9339K1325m8502N6550
$$ 68512 -24787 -72744 21562 -10287 -86921 -41110 -54095 -107265 -47926 -26601 -75103 -18553
191a8553M8711m5859M9534O6757o1220l812M7210n1189m929M2535p0236l8317
$$ -18553 30158 -15701 33833 100590 39370 35558 82768 31579 26650 69185 -1051 -39368
203c9368O4268k4277m9079M2446k0592n3523N2596J4944n0802M2318L8538m7614
$$ -39368 24900 623 -48456 -6010 -26602 -80125 -27529 -12585 -63387 -21069 17469 -30145
215c0145K6001N8518m0294l761M4975m2656j5676N4965k4372l3501L4651j4938
$$ -30145 -4144 54374 14080 10319 55294 12638 -3038 51927 27555 -5946 28705 13767
227A3767m0288K2633J603m2824J0127J7561k6912J7907L0611k2257J1492L0605
$$ 13767 -26521 -3888 -2285 -45109 -34982 -17421 -44333 -26426 4185 -18072 -6580 24025
239B4025j6273K884K3461j3447n238J7294j2311j1521J4528j5913k2933J4819
$$ 24025 7752 10636 34097 20650 15412 32706 20395 8874 23402 7489 -15444 -625
251f25n705k1342Q911k439j3047K1144Q409k2053J0716K2681j2223L413J6543
$$ -625 -6330 -27672 -18761 -21200 -34247 -13103 -4694 -26747 -16031 6650 -5573 -2160 14383
264A4383q985P105K1517j0179p358J7362l913k2129M41l35j7856Q4k544j6510
$$ 14383 5398 12503 34020 23841 16483 33845 29932 7803 8244 7909 -9947 -9863 -12407 -28917
278b8917Q524R482j6444n486J2778O509L97M328L755R603J8148K017p272O212
$$ -28917 -20393 -10911 -27355 -32841 -20063 -13554 -13157 -8829 -5074 4529 22677 24694 17422 23634
292B3634L692l912r373j0455k633k140p544q644j019Q149N1m073K200M191R813
$$ 23634 27326 23414 14041 3586 953 -1187 -8731 -17375 -18394 -10245 -10194 -14267 -12067 -7876 1937
307A937O61q747O571J1107P06l963k297L752O289k151q868m910L877J455r309
$$ 1937 2598 -6149 422 11529 12235 8272 5975 9727 16016 13865 4997 87 3964 5419 -3890
322c890p212J629K010j582j041n88N382Q629l704k645P458M529r32n392j447O898
$$ -3890 -11102 -9473 -7463 -9045 -10086 -10674 -5292 3337 -367 -3012 4446 8975 8043 2651 1204 8102
338H102J795k068n781k761P016l527r984k494k900N14j456o746K822O476K799
$$ 8102 9897 7829 2048 -713 6303 2776 -7208 -9702 -12602 -12088 -13544 -20290 -17468 -10992 -8193
353h193J202J501O773O425K488q13k61P523K250n244K237J470m885j439m001j0301
$$ -8193 -6991 -5490 1283 7708 10196 9383 9122 16645 18895 13651 15888 17358 12473 11034 7033 -3268
369c268r43l32j4104m090P556l939L78Q992J86L774J5471M788o125P922O723j0790
$$ -3268 -4211 -4543 -18647 -22737 -15181 -19120 -18742 -9750 -9564 -5790 9681 14469 8344 16266 22989 12199
385A2199L462K500j8284j64M168j4121PN438j1820j493J2913k224l282J2933j649
$$ 12199 15661 18161 -123 -287 3881 -10240 -10233 -4795 -16615 -18108 -5195 -7419 -10701 2232 583
400E83p666J6039J247j3137J1127j532j7549J2308O757k0726N298J3380j6465
$$ 583 -7083 8956 10203 -2934 8193 6661 -10888 1420 8177 -12549 -7251 6129 -10336
413a0336O161J9247k0421j662K7143j5126j4906K0741p967j9645K1512q21k6795
$$ -10336 -4175 15072 -5349 -7011 20132 5006 -9900 10841 2874 -16771 4741 3920 -22875
426b2875K1252J3777k8257J5681K5330k3727L401K3223k1589l715K4285k2916
$$ -22875 -1623 12154 -16103 -422 24908 1181 4582 27805 6216 2501 26786 3870
438C870k0954K2800j1654k4980J9257k307j6808K2407J206j9596K7575K2233j9743
$$ 3870 -17084 5716 -5938 -30918 -11661 -13968 -30776 -8369 -7163 -26759 816 23049 3306
451C306Q492J4539k1310J5198K0636l7504m859K2270l2710m963L2367k9041k0257
$$ 3306 11798 26337 5027 20225 40861 3357 -1502 20768 -11942 -16905 15462 -13579 -33836
464c3836L3433j3062j6719M6385q277m7873L9929K6446l9772J9724J4624n1269
$$ -33836 -403 -13465 -30184 16201 7924 -39949 -20 26426 -13346 6378 21002 -30267
476c0267K4330N2027m8793j8585M4801k6922j1666N8054k3116m9808L8193L651
$$ -30267 -5937 46090 -2703 -21288 23513 -3409 -15075 42979 19863 -29945 8248 11899
488A1899l1994M1831L431o9337J3579M1402k5342J3252J6898n6404Q142O2859
$$ 11899 -20095 21736 25167 -44170 -30591 10811 -14531 -1279 15619 -40785 -32643 30216
500C0216j7342j3665K3411l0706p444N3394j0861l6093K4318j4529l0808M9101
$$ 30216 12874 -791 22620 -8086 -15530 37864 27003 -9090 15228 699 -30109 18992
512A8992L277n7100K1674J5760l4620L8713K4524o4756R812N5803l3707l494M1866
$$ 18992 22269 -34831 -13157 2603 -32017 6696 31220 -33536 -23724 32079 -1628 -5122 36744
525C6744m8737j8761P0665j7554m2720M5632j4048n0260N4230J6541o4741K1750
$$ 36744 -11993 -30754 39911 22357 -20363 25269 11221 -39039 15191 31732 -33009 -11259
537a1259K2232n6544K7212M9183n3279j337M8894l7677p540N7136k6664k8850
$$ -11259 10973 -45571 -18359 30824 -22455 -23792 25102 -12575 -20115 37021 10357 -18493
549a8493M9853j7298l7704N3469J358n0435L3676K955n6105L5049L0670n5543
$$ -18493 31360 14062 -23642 29827 31185 -19250 14426 17381 -38724 -3675 26995 -28548
561b8548J1276L2751n1448J3322N9988m9145k1877N6842k7165k0421O1069k3978
$$ -28548 -17272 15479 -35969 -22647 37341 -11804 -33681 23161 -4004 -24425 36644 12666
573A2666m9029N6424R078n1512L7662J5343o0466K9859M4003n3311J551L3736
$$ 12666 -36363 20061 29139 -22373 15289 30632 -29834 25 44028 -9283 -7732 26004
585B6004n1021Q34N9237l8452l9836L7579j0962r537N6443j6255m8717M1646J6009
$$ 26004 -25017 -24183 35054 -3398 -43234 -5655 -16617 -26154 30289 14034 -34683 6963 22972
598B2972k9957L0944K576n2850K4155K8963l8014J8186K5981n9207K3N0717l3257
$$ 22972 -6985 23959 26535 -26315 -2160 26803 -11211 6975 32956 -26251 -26228 24489 -8768
611h768j2805L5487l5534q467O6987j9131n1317M6916J0086m4121L6116P065o2904
$$ -8768 -21573 13914 -21620 -30087 36900 17769 -33548 13368 23454 -20667 15449 22514 -40390
624d0390L2652M0282n4728R054M6268m9242j4300N5191k0581k3991L9450k5299
$$ -40390 -7738 32544 -22184 -13130 33138 -16104 -30404 24787 4206 -19785 19665 -5634
636e634l3427O0195J1561n3810J7162J6742l0394K3305J6376m1601J4754L4930
$$ -5634 -39061 21134 32695 -21115 -3953 12789 -17605 5700 22076 -19525 -4771 30159
648C0159l1924l357K9400k1640r611J6213k3773m348L3016j8685k2747L4845K690
$$ 30159 -1765 -5122 24278 2638 -6973 9240 -14533 -18881 14135 -4550 -27297 7548 10238
661A0238k5389J8137m397j9849L8458L946m4419K3357L0098l0306L242J8334l2946
$$ 10238 -15151 2986 -1411 -21260 17198 21144 -23275 82 30180 -126 3116 21450 -11496
674a1496J790L0405l5265j2994M7839j3443l3175L1266M339k2117K3681m301l7710
$$ -11496 -9706 20699 -14566 -27560 20279 6836 -26339 4927 9266 -12851 10830 6529 -31181
687c1181K7877K5801l8694K004L2708j7568m519J6420k2930k165L0689j7184k2403
$$ -31181 -3304 22497 -16197 -14193 18515 947 -3572 12848 -10082 -12247 18442 1258 -21145
700b1145K9467Q816j8026R091k590j4109J8020k843k9750J4284K2713j4513k593
$$ -21145 8322 17138 -888 8203 5613 -8496 9524 6681 -23069 -8785 13928 -585 -3178
713c178Q616r373P389R780k4282k909K5144j0160j4338J5027J930l551Q996j2707
$$ -3178 5438 -3935 3454 13234 -11048 -13957 11187 1027 -13311 1716 3646 95 9091 -3616
727c616j4816K2466Q110k4681L648J6735n181N411L373j5566P258J3514j9872
$$ -3616 -18432 4034 12144 -12537 -8889 7846 2665 8076 11449 -4117 3141 16655 -3217
740c217j1299J6817K258q465N171k484k319J3180q520j9533J1770J0378j0569
$$ -3217 -14516 2301 4559 -3906 1265 -1219 -3538 9642 1122 -18411 -6641 3737 -6832
753f832k73O037N15J0159J532j7829J252J5152p496r305O330L282K413M524q003
$$ -6832 -7105 -1068 -553 9606 11138 -6691 -5439 9713 2217 -7088 -758 2524 4937 9461 1458
768A458o831J1436P18j6428J367Q177k698K191J00m669Q369M778j1180n097Q275
$$ 1458 -5373 6063 6781 -9647 -8280 -103 -2801 -610 -510 -5179 3190 7968 -3212 -8309 -34
783c4L722n602j498J380M190O950m525r843M183N213m392k999P54L585N215M3
$$ -34 3688 -1914 -3412 -2032 2158 9108 4583 -5260 -1077 4136 -256 -3255 -2501 1084 6299 6342
799F342n157R52L060n002n536m89L538L249r67j923K743N469k031q516j786K496
$$ 6342 1185 2137 5197 195 -5341 -5830 -2292 957 -10 -1933 810 6279 4248 -4268 -6054 -3558
815c558R91N69l218J006P110K003l347k220L41P77j749o89k2K236L568j463n09
$$ -3558 -2567 -1998 -5216 -4210 2900 4903 1556 -664 -323 454 -1295 -1984 -2006 230 3798 2335 1826
832A826L384j36l628l520n90J598J12j211j830K595M228j265k951k76j03O71J49
$$ 1826 5210 5074 1446 -2074 -2664 -1066 -954 -2165 -3995 -1400 2828 1563 -1388 -1664 -1767 -1096 -947
849i47r83J128K019J346p86o44K47j324N22N40J25J605K94p54O29l66k500j793
$$ -947 -1930 -802 1217 2563 1777 1133 1380 56 578 1118 1243 2848 3142 2388 3017 2651 151 -1642
867a642j042o20J068J651j154N60K314q71q65R08k308k424K496J306k007K761
$$ -1642 -2684 -3304 -2236 -585 -1739 -1179 1135 264 -601 307 -2001 -4425 -1929 -623 -2630 131
883A31Q54k534L920K187n231O62K456j875M2L110m91j313M063j936n986L636m17
$$ 131 985 -1549 2371 4558 -673 -11 2445 570 612 3722 3231 1918 5981 4045 -1941 1695 1278
900A278p455J718J372l387M216J949m487K147M803l936q03N188j979o79L714k270
$$ 1278 -6177 -4459 -3087 -6474 -2258 -309 -4796 -2649 2154 -1782 -2585 2603 624 -55 3659 1389
916A389q58O311l542p228M779K359m267L187j156o294P670L912r262K207M149
$$ 1389 531 6842 3300 -3928 851 3210 -1057 2130 974 -5320 2350 6262 -3000 -793 3356
931C356p246M72N808n878j089P111n408l490J2238k642r093Q245Q21n561Q140
$$ 3356 -3890 -3418 2390 -3488 -4577 2534 -2874 -6364 5874 3232 -5861 2384 3205 -2356 5784
946E784j135j0925P879P182j1356o8O144r336J692R823j0091j635J2786p478n731
$$ 5784 4649 -6276 1603 8785 -2571 -2639 3505 -5831 -4139 5684 -4407 -6042 6744 -734 -6465
961f465J3652k665r694R958j367j0898J2693K143j6806P511Q029j4320K608J0969
$$ -6465 7187 4522 -5172 4786 3419 -7479 5214 7357 -9449 -1938 6091 -8229 -5621 5348
975E348j2329M83J4381j2253n371K0014n283j2143J4331k554j1613J4621J773
$$ 5348 -6981 -6498 7883 -4370 -9741 10273 4990 -7153 7178 4624 -6989 7632 9405
988I405j6534Q806P775j5206N142J0377j4925j53J1295j1483q48J2627j1195o027
$$ 9405 -7129 1677 9452 -5754 -612 9765 -5160 -5313 5982 -5501 -6349 6278 -4917 -10944
1002a0944J5283m087q543J1122m219p941J7129m45j4890J1595L298j2293J3520
$$ -10944 4339 252 -8291 2831 -1388 -9329 7800 7355 -7535 4060 7358 -4935 8585
1015H585N439k0829N892J1699j6266L990J5450k1176o669K2228j1017r856K1094
$$ 8585 14024 -6805 -913 10786 -5480 -1490 13960 -7216 -13885 8343 -2674 -12530 8564
1028H564j0486j8043K4884M068k2400J6528Q528k4154J3312J7710k4688M61K0037
$$ 8564 -1922 -19965 4919 8987 -13413 3115 11643 -12511 801 18511 -6177 -5716 14321
1041A4321j7412m830K1761j3967j4691K2751k731j7085J6904r90j9105J5774Q113
$$ 14321 -3091 -7921 13840 -127 -14818 7933 5202 -11883 5021 4031 -15074 700 8813
1054H813j7112P790P195j6167P127J4386j3590j301J0188j3259J147J7442j3688
$$ 8813 -8299 -509 6686 -9481 -2354 12032 -1558 -2859 7329 -5930 -4783 12659 -1029
1067a029p731J5342r032o358J9000p207j4928J7715q53j6866J7328M565k2561
$$ -1029 -8760 6582 -2450 -8808 10192 2985 -11943 5772 4919 -11947 5381 9946 -12615
1080a2615J2811J3234k0962O622J6335k1724J81K5369j8318j3800K1986r459j3396
$$ -12615 196 13430 -7532 -910 15425 -6299 -6118 19251 933 -12867 9119 -340 -13736
1093a3736K3310n990k4023J9195P615j9673J3489J0081k3716N513J9390j4901
$$ -13736 9574 3584 -20439 -1244 6371 -13302 187 10268 -13448 -7935 11455 -3446
1105c446R46J7421j8387n714K3996p037j2254J3760p832j1901J8305j004j9687
$$ -3446 -2500 14921 -3466 -9180 14816 7779 -4475 9285 1453 -10448 7857 6853 -12834
1118a2834J1500N289j5964J1228P761j8753O028J3680j4399K581J4736j5725m003
$$ -12834 -1334 3955 -12009 -781 6980 -11773 -5745 7935 -6464 -3883 10853 -4872 -8875
1131h875K0576p040q377J4867q932j1144K0045m67j8865J0439L273j5655J0793
$$ -8875 11701 4661 -3716 11151 2219 -8925 11120 10653 -8212 2227 5500 -10155 638
1144F38P732j7920M535J1998j5393J848J5489j2101l901J4533q460p213J6175
$$ 638 8370 -9550 -5015 6983 -8410 -6562 8927 -3174 -7075 7458 -1002 -8215 7960
1157G960m108j1913J4578j607j4534J3195M219j4658Q232M456j6147P873J2577
$$ 7960 3852 -8061 6517 4910 -9624 3571 7790 -6868 1364 5820 -10327 -2454 10123
1170A0123j4808j800J2512j0749j896J6539r631r962J5941k066r788J3665j042
$$ 10123 -4685 -6485 6027 -4722 -6618 9921 290 -9672 6269 4203 -5585 8080 7038
1183G038j5664J0974P172j3310L523O040j4369L476J2613j0955n425R379n393
$$ 7038 -8626 2348 9520 -3790 -267 5773 -8596 -5120 7493 -3462 -8887 492 -4901
1196d901k172J3594l894r776R206J631m367R392j268j1598N636M787o200K444
$$ -4901 -7073 6521 2627 -7149 2057 3688 -679 8713 7445 -4153 1483 6270 70 2514
1210B514N26r559K867P801p552j162O101p026J82R767n744l713Q104m105m407
$$ 2514 3040 -6519 -3652 4149 -3403 -4565 1536 -5490 -5308 4459 -1285 -4998 3106 -999 -5406
1225e406R871j214r304O073M321n865N468K873j0155L248Q791p488l334O162m676
$$ -5406 4465 3251 -6053 20 4341 -1524 3944 6817 -3338 -90 8701 1213 -2121 4041 -635
1240f35l255P173l890o006O970j434p323N500L767m667K080K909k614L514M698
$$ -635 -3890 3283 -607 -6613 357 -1077 -8400 -2900 867 -3800 -1720 1189 -1425 2089 6787
1255F787o165j201N711k530l218K138k015p23K840l151k759M998J301m529R54
$$ 6787 622 -579 5132 2602 -616 1522 -493 -1216 1624 -1527 -4286 712 2013 -2516 -1562
1270a562J233k4L381j068m541M134L029m519k247J092p56K10R34k728Q82N488
$$ -1562 -329 -353 3028 1960 -2581 1553 4582 63 -2184 -1092 -1848 -1638 -704 -3432 -2550 2938
1286B938k127l732L339K207k120P0j141J28M263l9n024J95L972j215k816m34l09
$$ 2938 811 -2921 418 2625 505 575 -566 -438 3825 3786 -1238 -1043 2929 1714 -1102 -1536 -1845
1303a845K350J504l138j273M147J793l680j890R02J127J91k380j982L598K092
$$ -1845 505 2009 -1129 -2402 1745 3538 -142 -2032 -1130 -3 188 -2192 -4174 -576 1516
1318A516k256j466J819K447m36j972o69K619L436k113l487J108J878n42l500l268
$$ 1516 -740 -2206 -387 2060 1624 -348 -1017 1602 5038 2925 -562 546 2424 1882 -1618 -4886
1334d886J705K761j72k207P16L481Q97k389j235N71K442o50k793M97M062L29k945
$$ -4886 -3181 -420 -592 -2799 -2083 1398 2295 -94 -1329 -758 1684 1034 -1759 -1262 2800 3129 184
1351A84k016J170J850p68l669l77L931K447j419k136K174K764n63k702k323J458
$$ 184 -1832 -662 1188 420 -3249 -3626 305 2752 1333 -803 1371 4135 3572 870 -1453 5
1367EK066k336k373J845J851J50j918j983J713J750k475k621J868L937m49k123
$$ 5 2071 -265 -2638 -793 1058 1208 -710 -2693 -980 770 -1705 -4326 -2458 1479 1030 -1093
1383a093m00M51K640r25l879R79M410J132j761m53J437Q96o0l251k249K765L65
$$ -1093 -1493 -1042 1598 673 -3206 -2227 2183 3315 1554 1101 2538 3434 3374 123 -2126 639 1004
1400A004l047n03J849K04p15j481j645K506K232k788q80L910K263L08k39j068
$$ 1004 -2043 -2546 -697 -493 -1208 -2689 -4334 -1828 404 -2384 -3264 646 2909 3217 2978 1910
1416A910O65K557k464l806J806J668k157M47n06j354K525j038m347J251K605k787
$$ 1910 2575 5132 2668 -1138 668 2336 179 626 120 -1234 1291 253 -4094 -2843 -238 -3025
1432c025l03K985n96J027K956m232j690N675j352m145L154J203j286K727j75m583
$$ -3025 -3328 -343 -939 88 3044 -1188 -2878 2797 1445 -2700 454 1657 371 3098 2923 -1660
1448a660K105K583n895r31M564k748n11L940k233q73N006k353l823M186N42m113
$$ -1660 445 3028 -2867 -3798 766 -1982 -2493 1447 -786 -1659 3347 994 -2829 1357 1899 -2214
1464b214K905J164k582K784J292m716J264K373m477o21L010k525L29M409m699
$$ -2214 691 1855 -727 2057 3349 -1367 -103 2270 -2207 -2828 182 -2343 -2014 2395 -2304
1479b304o78O014k997k893M326j719k224O248N86n298M406J224o391L208L553
$$ -2304 -2982 3032 35 -2858 1468 -251 -2475 3773 4359 -939 3467 4691 -1700 1508 5061
1494E061q405N81M436n444M04O008o534l462P864j769l973O924j085m942P956
$$ 5061 -3344 -2763 1673 -3771 -3367 2641 -3893 -7355 509 -1260 -5233 1691 606 -4336 3620
1509C620K553o818L696K425o944L329M143q396j194O515m628n2O562o567m079
$$ 3620 6173 -645 3051 5476 -1468 1861 6004 -2392 -3586 2929 -1699 -1751 4811 -1756 -5835
1524e835Q124j971m458O297k609o534P519L199p349L652J936q263N474P182q170
$$ -5835 2289 318 -4140 2157 -452 -6986 533 3732 -3617 35 1971 -6292 -818 6364 -1806
1539a806n7P496m948L74P569o910n922Q184k798o277O599j908p806P174K908p041
$$ -1806 -1863 5633 685 1059 8628 1718 -4204 3980 1182 -5095 1504 -404 -8210 -1036 1872 -5169
1555e169M541K961p216M656P235o586k58N395o266M52P439p678n037P121l737
$$ -5169 -628 2333 -4883 -227 7008 422 164 5559 -707 -255 7184 -494 -5531 1590 -2147
1570b147m535P781j410o241Q824J132q174P654M323r695L374N501r385J986Q471
$$ -2147 -6682 1099 -311 -6552 2272 3404 -4770 2884 7207 -2488 886 6387 -2998 -1012 7459
1585G459r399k668R468p245m464J1704k742q775Q394j76o833Q955K121j2395L016
$$ 7459 -1940 -4608 4860 -2385 -6849 4855 2113 -6662 1732 1556 -5277 3678 5799 -6596 -3580
1600c580P950p392J502O210r447l06J0795l973l403O590m256l808R311j4p336
$$ -3580 4370 -3022 -1520 4690 -4757 -5063 5732 1759 -1644 4946 690 -3118 6193 6179 -1157
1615a157K825j645m788P535R17j0617J174L137l094O201L483r876J268Q725l322
$$ -1157 1668 23 -4765 2770 3687 -6930 -5756 -2619 -5713 488 3971 -5905 -4637 4088 766
1630G66J356N646r053l319J0501j949n151N850m296p692J0152L220j0218K920
$$ 766 2122 7768 -1285 -4604 5897 3948 -1203 4647 351 -7341 2811 6031 -4187 -1267
1644a267L215q308O367P324j0537k003Q697m451j950Q003n902o182R419R84o897
$$ -1267 1948 -6360 7 7331 -3206 -5209 3488 -963 -2913 5090 -812 -6994 2425 3409 -3488
1659c488N926J60p795O122N052p661J178L028o066K223N814n927k060M953l014
$$ -3488 2438 2598 -5197 925 5977 -1684 -506 2522 -3544 -1321 4493 -1434 -3494 1459 -1555
1674a555j124O059l409l642O002j108l743N283n12n101M259J080n996L289K614
$$ -1555 -2679 3380 -29 -3671 2331 1223 -2520 2763 2251 -2850 1409 2489 -3507 -218 2396
1689B396o027K307L799n708O73N951m424j013N441l143l066O812j892m767N286
$$ 2396 -3631 -1324 2475 -3233 -2560 3391 -1033 -2046 3395 252 -2814 3998 2106 -2661 2625
1704B625j15m784M503J354o325K464L636n181J008K943n381k71N689l328k673
$$ 2625 2510 -2274 2229 3583 -2742 -278 3358 -1823 -815 2128 -3253 -3524 2165 -1163 -3836
1719c836M264k000j389N526r32m424L218J496l455L327J865n255J569K545l057
$$ -3836 428 -1572 -2961 2565 1633 -2791 427 1923 -1532 1795 3660 -1595 -26 2519 -538
1734e38J270K663m737j287M515j793j748K385k052j798M645n46l457K336Q72k432
$$ -538 732 3395 -1342 -2629 1886 93 -1655 730 -1322 -3120 1525 979 -2478 -142 730 -1702
1750a702J808J307l068J356J711k537J413K372k911o69K473j072o41J533j635
$$ -1702 106 1413 -1655 -299 1412 -1125 288 2660 -251 -920 1553 481 -160 1373 -262
1765b62j491K879K0k422J763K37j820K003K19k473J693N66j923N38J162j883L1
$$ -262 -1753 1126 1146 -1276 487 724 -1096 907 1126 -1347 346 912 -1011 -473 689 -1194 -1163
1782a163J404j668J2J956r94j163K533k85j481J477J16j153J210R89k006P87J306
$$ -1163 241 -1427 -1415 541 -453 -1616 917 632 -849 628 744 -409 801 1790 -216 571 1877
1799A877j584j62Q26r94l57P08q57p92R50J6j343P66M20j150J140J82n65P23N75
$$ 1877 293 131 957 -37 -394 314 -543 -1335 -385 -369 -1712 -946 -526 -1676 -536 -354 -919 -196 379
1818C79k07M84N20o50J57K42l01Q9J35m89j1K20n20j91L77k25n36K08J41m97K95
$$ 379 172 656 1176 526 683 925 624 713 848 359 348 568 48 -143 234 9 -527 -319 -178 -675 -380
1839c80k24k23N22O5n81j19N27J12R7Q14m97P50P42k83n00L81k54n34k20l24m54
$$ -380 -604 -827 -305 -240 -821 -940 -413 -301 -204 610 113 863 1605 1322 822 1203 949 415 195 -129 -583
1860e83j19n7m01L97O23r7k50P52M10M16m81m67J69L32j00j072n54L20j87M0k77
$$ -583 -702 -759 -1160 -763 -140 -237 -487 265 675 1091 610 143 312 644 544 -528 -1082 -762 -949 -909 -1186
1881a186k26J201M04l52O21L36K52K80m17m05N27j52j439k75P30r3r57J24K72
$$ -1186 -1412 -211 193 -159 462 798 1050 1330 913 508 1035 883 -556 -831 -101 -194 -1151 -1027 -755
1900g55O78J055m70j041J282Q11j281n39n0l38L84n44j309O44J174p3j074J302
$$ -755 -77 978 508 -533 749 1560 279 -260 -310 -648 -264 -808 -2117 -1473 -299 -372 -1446 -144
1918a44J529q8P58j37m58K002j006k244q0N64j347n97o84r44R67J219j337m28
$$ -144 1385 1297 2055 1918 1460 3462 2456 212 132 696 -651 -1248 -1932 -2876 -1909 -690 -2027 -2455
1936b455L010K29q40O29L35k14J265r00k079J686Q05k363l09J476r93O05P28j250
$$ -2455 555 784 -56 573 908 694 1959 1059 -1020 666 1471 -892 -1201 275 -718 -113 615 -635
1954f35J108K190j908j744K009L99j616j33j265q58K770o31k740J253J671n88
$$ -635 473 2663 755 -989 1020 1419 -197 -330 -1595 -2453 317 -314 -3054 -1801 -130 -718
1970g18R99K99q32K220J324k844K55K029k190j868J734j429J0J930k633j040M239
$$ -718 281 580 -252 1968 3292 448 703 2732 542 -1326 408 -1021 -1011 919 -1714 -2754 1485
1987A485M79l704K059J009j863K395M42m774K225L096l991r14L374k238j506K938
$$ 1485 1964 -1740 319 1328 -535 1860 2302 -2472 -247 2849 -1142 -2056 1318 -920 -2426 512
2003E12k094j055M754r41m055L824J828l560J188J217l009J483K158l899O44L870
$$ 512 -1582 -2637 2117 1176 -2879 945 2773 -787 401 1618 -1391 92 2250 -1649 -1005 2865
2019B865k801j705K055m40j13J996k582k115M224Mk781J124l85j979L198K56l249
$$ 2865 64 -1641 414 -26 -139 1857 -725 -2840 1384 1388 -1393 -269 -654 -2633 565 821 -2428
2036b428K475R72l079K696K868l511l92J784k657J681M545n140m056N834M95k504
$$ -2428 47 1019 -2060 636 3504 -7 -399 1385 -1272 409 4954 -186 -4242 1592 2087 -417
2052d17L382l069n035N687K346n538J862J968n115K192N368l981k124L267l018
$$ -417 2965 -104 -5139 548 2894 -2644 -782 1186 -3929 -1737 3631 -350 -2474 793 -2225
2067b225J09O799k207n802L970J458k559L775j789n727L596L343l524P75J425
$$ -2225 -2116 4683 2476 -3326 644 2102 -457 3318 1529 -4198 -602 2741 -783 -8 1417
2082A417m001J147M269l079j233K944l569n39N666k170l381L208j136j753M683
$$ 1417 -2584 -1437 2832 -247 -1480 1464 -2105 -2644 3022 852 -2529 679 -457 -2210 2473
$$ [...]
8191i
##END NTUPLES=NMR FID
##END=
