##TITLE=1H_DPAA0104
 CDCl3
 8 sc, 
 4.04.2022
##JCAMPDX= 6.0         $$ Bruker NMR JCAMP-DX V2.0
##DATA TYPE= NMR FID
##DATA CLASS= NTUPLES
##ORIGIN= UXNMR, Bruker Analytische Messtechnik GmbH
##OWNER= root
$$ XWIN-NMR		Version 3.5
$$ Mon Apr  4 10:13:59 2022 Russian Standard Time (UT+4h)  she@DPX200
##.OBSERVE FREQUENCY= 200.131346
##.OBSERVE NUCLEUS= ^1H
##.DELAY= (6, 6)
##.ACQUISITION MODE= SIMULTANEOUS
##.ACQUISITION SCHEME= undefined
##.AVERAGES= 8
##.DIGITISER RES= 18
##SPECTROMETER/DATA SYSTEM= spect
##.PULSE SEQUENCE= zg30
##.SOLVENT NAME= CDCl3
##.SHIFT REFERENCE= (INTERNAL, CDCl3, 0, 15.7039)
##AUDIT TRAIL= $$ (NUMBER, WHEN, WHO, WHERE, WHAT)
$$ ##TITLE= Audit trail, XWIN-NMR		Version 3.5
$$ ##JCAMPDX= 5.01
$$ ##ORIGIN= Bruker BioSpin GmbH
$$ ##OWNER= she
$$ F:/spectra/data/she/nmr/H-F/1/audita.txt
$$ ##AUDIT TRAIL=  $$ (NUMBER, WHEN, WHO, WHERE, WHAT)
(   1,<2022-04-04 10:12:22.04 +0400>,<she>,<DPX200>,
      <created by zg, POWCHK disabled, PULCHK disabled
       configuration hash MD5:
       00 E9 B6 7A A2 85 ED C7 34 08 36 98 17 FE 4E 26
       data hash MD5: 16K
       A6 98 F2 E4 91 CA 91 F1 F9 35 F9 9C F3 2A 1A 6C>)
$$ ##END=
$$ 
$$ hash MD5
$$ 16 8D 3A 0D 13 79 BA 28 6C F2 86 1D 4A D3 F9 4E
##$RELAX= 
##$RELAX= 
##$RELAX= 
##$RELAX= 
##$RELAX= 
##$RELAX= 
$$ Bruker specific parameters
$$ --------------------------
##$DU= <F:/spectra>
##$EXPNO= 1
##$NAME= <H-F>
##$PROCNO= 1
##$TYPE= <nmr>
##$USER= <she>
##$AMP= (0..31)
100 100 100 100 100 100 100 100 100 100 100 100 100 100 100 100 100 100 
100 100 100 100 100 100 100 100 100 100 100 100 100 100 
##$AQSEQ= 0
##$AQ_mod= 1
##$AUNM= <au_zg>
##$AUTOPOS= <>
##$BF1= 200.13
##$BF2= 200.13
##$BF3= 200.13
##$BF4= 200.13
##$BF5= 200.13
##$BF6= 200.13
##$BF7= 200.13
##$BF8= 200.13
##$BYTORDA= 1
##$CFDGTYP= 0
##$CFRGTYP= 5
##$CHEMSTR= <none>
##$CNST= (0..31)
1 1 145 1 1 1 1 1 1 1 1 1 1 1 1 1 1 1 1 1 1 1 1 1 1 1 1 1 1 1 1 1 
##$CPDPRG= <>
##$CPDPRG1= <>
##$CPDPRG2= <>
##$CPDPRG3= <>
##$CPDPRG4= <mlev>
##$CPDPRG5= <mlev>
##$CPDPRG6= <mlev>
##$CPDPRG7= <mlev>
##$CPDPRG8= <mlev>
##$CPDPRGB= <>
##$CPDPRGT= <>
##$D= (0..31)
0 1.2 0 0 0 0 0 0 0 0.06 0 0.03 0 0 0 0 0.0002 0 0 0 0 0 0 0 0 0 0 0 0 
0 0 0 
##$DATE= 1649052741
##$DBL= (0..7)
120 120 120 120 120 120 120 120 
##$DBP= (0..7)
150 150 150 150 150 150 150 150 
##$DBP07= 0
##$DBPNAM0= <>
##$DBPNAM1= <>
##$DBPNAM2= <>
##$DBPNAM3= <>
##$DBPNAM4= <>
##$DBPNAM5= <>
##$DBPNAM6= <>
##$DBPNAM7= <>
##$DBPOAL= (0..7)
0.5 0.5 0.5 0.5 0.5 0.5 0.5 0.5 
##$DBPOFFS= (0..7)
0 0 0 0 0 0 0 0 
##$DE= 6
##$DECBNUC= <off>
##$DECIM= 32
##$DECNUC= <off>
##$DECSTAT= 4
##$DIGMOD= 1
##$DIGTYP= 9
##$DL= (0..7)
0 120 120 120 120 120 120 120 
##$DP= (0..7)
150 150 150 150 150 150 150 150 
##$DP07= 0
##$DPNAME0= <>
##$DPNAME1= <>
##$DPNAME2= <>
##$DPNAME3= <>
##$DPNAME4= <>
##$DPNAME5= <>
##$DPNAME6= <>
##$DPNAME7= <>
##$DPOAL= (0..7)
0.5 0.5 0.5 0.5 0.5 0.5 0.5 0.5 
##$DPOFFS= (0..7)
0 0 0 0 0 0 0 0 
##$DQDMODE= 0
##$DR= 18
##$DS= 0
##$DSLIST= <SSSSSSSSSSSSSSS>
$$ [...]
##$SUBNAM2= <"">
##$SUBNAM3= <"">
##$SUBNAM4= <"">
##$SUBNAM5= <"">
##$SUBNAM6= <"">
##$SUBNAM7= <"">
##$SUBNAM8= <"">
##$SUBNAM9= <"">
##$SW= 18.0517287032376
##$SWIBOX= (0..15)
0 0 2 0 0 0 0 0 0 0 0 0 0 0 0 0 
##$SW_h= 3612.71676300578
##$TD= 16384
##$TD0= 1
##$TE= 0
##$TE2= 300
##$TE3= 300
##$TEG= 300
##$TL= (0..7)
0 120 120 120 120 120 120 120 
##$TP= (0..7)
150 150 150 150 150 150 150 150 
##$TP07= 0
##$TPNAME0= <>
##$TPNAME1= <>
##$TPNAME2= <>
##$TPNAME3= <>
##$TPNAME4= <>
##$TPNAME5= <>
##$TPNAME6= <>
##$TPNAME7= <>
##$TPOAL= (0..7)
0.5 0.5 0.5 0.5 0.5 0.5 0.5 0.5 
##$TPOFFS= (0..7)
0 0 0 0 0 0 0 0 
##$TUNHIN= 0
##$TUNHOUT= 0
##$TUNXOUT= 0
##$USERA1= <user>
##$USERA2= <user>
##$USERA3= <user>
##$USERA4= <user>
##$USERA5= <user>
##$V9= 5
##$VALIST= <valist>
##$VCLIST= <CCCCCCCCCCCCCCC>
##$VD= 0
##$VDLIST= <DDDDDDDDDDDDDDD>
##$VPLIST= <PPPPPPPPPPPPPPP>
##$VTLIST= <TTTTTTTTTTTTTTT>
##$WBST= 1024
##$WBSW= 4
##$XGAIN= (0..3)
0 0 0 0 
##$XL= 0
##$YL= 0
##$YMAX_a= 783411
##$YMIN_a= -868822
##$ZGOPTNS= <>
##$ZL1= 120
##$ZL2= 120
##$ZL3= 120
##$ZL4= 120
##$ABSF1= 10
##$ABSF2= 0
##$ABSG= 5
##$ABSL= 3
##$ALPHA= 0
##$AQORDER= 0
##$ASSFAC= 0
##$ASSFACI= 0
##$ASSFACX= 0
##$ASSWID= 0
##$AUNMP= <proc_1d>
##$AZFE= 0.1
##$AZFW= 0.1
##$BCFW= 1
##$BC_mod= 2
##$BYTORDP= 1
##$COROFFS= 0
##$CY= 11.3945322036743
##$DATMOD= 1
##$DC= 2
##$DFILT= <>
##$DTYPP= 0
##$F1P= 2.36226072786647
##$F2P= -0.459571619588291
##$FCOR= 0.5
##$FTSIZE= 0
##$FT_mod= 4
##$GAMMA= 1
##$GB= 0.15
##$INTBC= 1
##$INTSCL= 1
##$ISEN= 128
##$LB= 0.24
##$LEV0= 0
##$LPBIN= 0
##$MAXI= 10000
##$MC2= 0
##$MEAN= 0
##$ME_mod= 0
##$MI= 1.114404
##$NCOEF= 0
##$NC_proc= 0
##$NLEV= 6
##$NOISF1= 3.799351
##$NOISF2= 2.8
##$NSP= 1
##$NTH_PI= 0
##$NZP= 0
##$OFFSET= 15.70392
##$PC= 1
##$PHC0= -17306.68
##$PHC1= 11.40078
##$PH_mod= 1
##$PKNL= yes
##$PPARMOD= 0
##$PSCAL= 0
##$PSIGN= 0
##$REVERSE= no
##$SF= 200.130013532006
##$SI= 16384
##$SIGF1= 3
##$SIGF2= 2
##$SINO= 400
##$SIOLD= 16384
##$SREGLST= <1H.CDCl3>
##$SSB= 0
##$STSI= 0
##$STSR= 0
##$SW_p= 3612.71676300578
##$SYMM= 0
##$S_DEV= 0
##$TDeff= 0
##$TDoff= 0
##$TI= <>
##$TILT= no
##$TM1= 0
##$TM2= 0
##$TOPLEV= 0
##$USERP1= <user>
##$USERP2= <user>
##$USERP3= <user>
##$USERP4= <user>
##$USERP5= <user>
##$WDW= 1
##$XDIM= 8192
##$YMAX_p= 0
##$YMIN_p= 0
$$ End of Bruker specific parameters
$$ ---------------------------------
##NTUPLES= NMR FID
##VAR_NAME=  TIME,          FID/REAL,        FID/IMAG
##SYMBOL=    X,             R,               I
##VAR_TYPE=  INDEPENDENT,   DEPENDENT,       DEPENDENT
##VAR_FORM=  AFFN,          ASDF,            ASDF
##VAR_DIM=   8192,          8192,            8192
##UNITS=     SECONDS,       ARBITRARY UNITS, ARBITRARY UNITS
##FACTOR=    0.0002768,     1,               1
##FIRST=     0,             0,               0
##LAST=      2.2672688,     0,               0
##MIN=       0,             -868822,         0
##MAX=       2.2672688,     783411,          0
$$ Real data points
##PAGE= N=1
##DATA TABLE= (X++(R..R)), XYDATA
$$ [...]
2617G59k825Q75L388k633k325M340J095n351J433M612l990j010O030l186m731
2632c519O007Q7o553M226L498o866K518O899q973m062J0456k729n856Q261k354
2647A040q523R990L911j2163K359P684o965J379R216q469o105J1161j500p772
2661d757Q623l35j0122Q012O088j0655n1N507n236P04P879n425o851P597K437
2676C415o677K503K001n252M738M983o284k812L696L25j306K914j63m882J326
2691a475N719k825l809J901j127n72N676P20p329p50O010j299j919L702l684l749
2707d810Q459J222q592K487K790n768L945O019p664k632P375k540l887O711j503
2722A612o728P627L258q854K381M315o622J707N789o322j156P417k522o123L831
$$ plain form
2617 759 -2066 -1191 2197 -436 -2761 1579 2674 -2677 -1244 3368 -622 -1632 4398 1212 -3519
2632 -3519 2488 2575 -3978 248 3746 -3120 -602 6297 -2676 -6738 3718 989 -4867 3394 1040
2647 1040 -7483 2507 6418 -5745 -3386 4298 -2667 -1288 7928 -541 -6646 4515 3015 -4757
2661 -4757 3866 3531 -6591 1421 7509 -3146 -3197 2310 -2926 -2222 5657 232 -6619 978 3415
2676 3415 -3262 -759 1242 -4010 728 5711 -573 -3385 311 636 -670 2244 2081 -2801 -1475
2691 -1475 4244 1419 -2390 -489 -1616 -2188 3488 4208 -3121 -3871 2139 840 -1079 2623 -1061 -4810
2707 -4810 3649 4871 -3721 -1234 1556 -4212 -267 5752 -1912 -4544 2831 291 -3596 3115 1612
2722 1612 -5116 2511 5769 -3085 -704 3611 -3011 -1304 4485 -1837 -2993 4424 1902 -4221 -390
2737c90J012m006N147K103p310J148N139l143r41K062l695l40N619Q79m144j008
2753a868J056qK570K648m059k732L689J532j142j066k282j107K116L540j589m959
2769c661P63K043j026K961K78m777K200M215j496j947Q05j431k73M400N79n431
2785a798P41K998k954J117K084m880J005N319k270k328J248j473q39L178J6l875
2801b711Q08L303k139k91J575l120Q00M616j083k007J013o02L01J686p31j908
2817d90j23K066k04j801j95j488J24L014m1j694j52M37J101M72j068p84j66J703
2835G11J878k024j768L42k04J274M66j537l86J285J278J2j493k10n07P32K714
2852B563j499k241R84k73N91J021k045j097J524J541o3j408o65K7R78J745j151
$$ plain form
2737 -390 622 -3384 1763 3866 -3444 -2296 2843 -300 -1241 821 -2874 -3214 2405 3284 -860 -1868
2753 -1868 -812 -820 1750 4398 339 -2393 1296 2828 1686 620 -1662 -2769 -653 2887 1298 -3661
2769 -3661 -2898 -855 -1881 1080 1358 -3419 -1219 2996 1500 -447 358 -1073 -1346 3054 3633 -1798
2785 -1798 -1057 1941 -1013 104 2188 -2692 -1687 3632 1362 -966 282 -1191 -2030 1148 1164 -2711
2801 -2711 -1903 1400 -739 -1030 545 -2575 -1775 2841 1758 -249 764 162 463 2149 1418 -490
2817 -490 -613 1453 1249 -552 -747 -2235 -2111 903 862 -832 -984 -547 554 1026 -42 -826 -992 711
2835 711 2589 565 -1203 -861 -1065 209 675 -862 -1248 37 1315 1327 -166 -376 -883 -151 2563
2852 2563 1064 -1177 -193 -466 125 1146 -899 -1996 -472 1069 1006 -402 -1067 -1040 -62 1683 532
2869E32j601R28M45j75N22j781o72J692Q11K41o95r11J75P86J200p02j289P56
2887B62Q54J44l02j754j070J428P53j22r71r33P61J086k01l42q06K80J743O29
2905A439p24m89q45O17J226k5q29r21M13J101k76l70q02r45K095Q54j749j87l40
2924g57k09J172Pj185l50J377K19m19K58m92j140K230R12j864N97O07j098J203
2942A068O17k116m77J563N8p76M97q65j254J931P74k153O1J088p68P40J097j797
2960g12n32J603M57n18j16k11n19M55J288r06j177Q41P29o00O47k01j471L56J614
2979A027n67j161J146q5j725J693R97l233J110K340k368j42K392k042j171L121
2995A332p19k851K658J508l692J777K506m457J269L875l939j358M524k404j933
$$ plain form
2869 532 -1069 -141 304 129 651 -1130 -1802 -110 701 942 247 -664 -489 297 1497 795 -494 262
2887 262 1116 1260 958 -796 -1866 -438 315 193 -778 -1711 -950 136 -65 -407 -1213 -933 810 1439
2905 1439 715 226 -619 -2 1224 1199 370 -551 -138 963 687 317 -485 -1430 665 1519 -230 -417 -757
2924 -757 -966 206 213 -972 -1322 55 274 -145 113 -379 -1519 711 1623 -241 356 963 -135 1068
2942 1068 1685 -431 -908 655 713 -63 434 -431 -1685 246 1020 -1133 -1072 16 -752 -12 1085 -712
2960 -712 -1244 359 816 298 182 -29 -548 -93 1195 289 -888 -47 682 82 729 528 -943 -587 1027
2979 1027 460 -701 445 360 -1365 328 1325 -1908 -798 1542 -826 -968 1424 -618 -1789 1332
2995 1332 613 -2238 420 1928 -1764 13 2519 -1938 -669 3206 -733 -2091 2433 29 -1904
3010a904M013m94m376K770K459m042J005K971m805j29N492l235k083L825j847
3025c80k100L677N43l553P14K708j853l55L165k248k343L091M53k089J370K25
3041A025k363M15K849p91k822J499R50l049K378K610m675p64M409k422j381M791
3057B659j959m885M507K941n039J904L583o367N08P719n149l886O666l136m540
3072d474P806%p839L815L922o634K218O014p282k176Q483l350m198P321k435o112
3088d921O483J705o307K804L346n220J58N487l239l280N133r29m377M572J110
3103B525m756J662K554k795n07K805p11l151K129K310l996O42L940l740j123M613
3119B401j821l443L904J613n047J172M432n028n43P384m888m857P642j480n427
$$ plain form
3010 -1904 2109 1615 -2761 9 2468 -1574 -569 2402 -2403 -2532 2960 -275 -2358 1467 -380
3025 -380 -2480 1197 1740 -1813 -1099 1609 -244 -599 2566 318 -2025 1066 1519 -570 800 1025
3041 1025 -1338 -923 1926 1135 -1687 -188 762 -2287 91 2701 -1974 -2738 1671 -751 -2132 2659
3057 2659 700 -4185 322 3263 -1776 128 3711 -2656 -2148 5571 422 -3464 3202 66 -4474
3072 -4474 3332 3332 -4507 -692 3230 -3404 -1186 4828 -2454 -4630 3853 503 -3695 3626 1191 -4921
3088 -4921 1562 3267 -3040 -236 3110 -2110 -1952 3535 296 -2984 2149 1220 -3157 1415 2525
3103 2525 -2231 -569 1985 -810 -1317 1488 777 -2374 -245 2065 -1931 -1289 2651 -1089 -2212 2401
3119 2401 580 -2863 1041 2654 -2393 -1221 3211 -1817 -2360 5024 136 -4721 2921 1441 -3986
3134c986P527j20q730M745N447o472J69N404p235j919J0535k916p714O499q12
3149D22o298Q762K598j0431K176O010n009K140N260o961m328Q299J209n103L325
3164B071r82o759N806N482o074j480K689k679L79M547j491m678J079L183j489
3179c96O83K653m319k447M748J132k831J468Q01l403P76M772k460l524M271j394
3195E30m577O288K115p069J277K736m677K801N853o200m426O694l36l608N881
3210C282j081q456N656N921o303J096K828p378Q36R382l321n718L891r79k572
3225b916O483O5q536K235N855k930L8K822n720j094O181m38l499J484k55j762
3241a987K928J838m143j856L485P53r29J399j752k211K913K078k734j528K144
$$ plain form
3134 -3986 3541 3421 -5309 -564 4883 -1589 -1420 3984 -3251 -5170 5365 2449 -5265 1234 422
3149 422 -5876 2886 5484 -4947 -2771 3239 -1770 370 5630 -1331 -5659 2640 3849 -1254 2071
3164 2071 1089 -5670 136 5618 -456 -1936 753 -1926 -1547 3000 1509 -3169 -2090 1093 -396
3179 -396 287 2940 -1379 -3826 922 2054 -777 691 1492 -1911 -1135 3637 1177 -2347 1924 530
3195 530 -4047 2241 4356 -2713 -1436 1300 -3377 -576 5277 -923 -5349 1345 1009 -2599 3282
3210 3282 2201 -6255 -599 5322 -981 115 2943 -4435 -3599 5783 2462 -3256 635 -344 -2916
3225 -2916 3567 3632 -4904 -2669 3186 256 294 3116 -2604 -3698 2483 2045 -1454 30 -225 -1987
3241 -1987 941 2779 -1364 -3220 265 1018 89 1488 -264 -2475 438 2516 -218 -1746 398
3256C98Q67j288J311m25l439J959L494l159n60K614k588n10L468j820l580K777
3272d81K030k417J255J091m803J300N128l175k285L588q09r93L480j933m128L324
3288A72K748l071L44J618l045K30L425k757k415K899k36r91K597j030l348J579
3304a281K467p03n04O6r86R29K291j246k893R34J896M15L26j171j654M08J443
3321G37M59j491q27P13N68N08L89k219j436K314J391l38p41p28k82J526J325k054
3339a86j742J897R11J70O99k161j767K556O98j203N9j92j37J071O60j724j518
3356a909J080J404p2P89j403j974K300R06j328l72m49O15K001J45j721j665O51
3373a002J813k19j89p05r98J818Q06j602n84n28J030J739J22j197j214j59J834
$$ plain form
3256 398 1265 -23 1288 863 -2576 -617 2877 -282 -842 1772 -816 -1326 2142 322 -3258 -481
3272 -481 1549 -868 387 1478 -3325 -2025 3103 -72 -2357 1231 422 -571 2909 976 -3152 172
3288 172 2920 -151 193 1811 -1234 -1004 2421 -336 -2751 148 -88 -1079 1518 488 -2860 -1281
3304 -1281 1186 483 -21 45 -941 -12 2279 1033 -1860 -926 970 1385 1711 540 -1114 -706 737
3321 737 1196 -295 -1122 -409 159 667 1056 -1163 -2599 -285 1106 768 27 -701 -983 543 1868 -186
3339 -186 -1928 -31 880 1050 1749 -412 -2179 377 1075 -128 -69 -261 -398 673 1333 -391 -1909
3356 -1909 -829 575 503 1292 -111 -2085 215 1121 -207 -579 -1028 -413 1588 1733 12 -1653 -1002
3373 -1002 811 592 403 -302 -1300 518 1324 -278 -862 -1390 -360 1379 1501 304 -910 -1069 765
3390G65M90j142o60k09R93J265j251j593n54P63K035p2j413j78k0J344P83k017
3408f71j44R75M09J576q64k132n6O48J154r4j243j69J4J478M79k438k51P52K69
3427c08J613k89k684M70J055L18Qj152k9P00J410R46k431p90J496Q8J321L20k777
3446g15M61J130l53j70j465l46O81J033R66j755j698J706L54o8Q76j413J10J473
3464H07M55m79j834K41J404j93Q76n83k598J904J682j884r6K47r82J271J864j643
3482D59k366Q46J425p73P60M63l351J205L603k444j143J790j858P50L779j565
3498A580l145J271J259j206P53J055l294M15L843k392j687K119j575q07L480n90
3514A079k375J155J191j448J44J150j577o55L046o57k835J634N14j065R84L68
$$ plain form
3390 765 1255 113 -547 -756 237 1502 251 -1342 -1896 -1133 902 830 -583 -761 -781 563 1346 -671
3408 -671 -815 160 569 2145 1281 -851 -907 -259 895 801 -442 -611 -597 881 1360 -1078 -1329 -577 -308
3427 -308 1305 1016 -1668 -1198 -143 175 183 -969 -998 -298 1112 2058 -373 -1163 333 421 1742 2062 -715
3446 -715 -254 876 523 353 -1112 -1458 -777 256 1222 -533 -2231 -525 -171 -239 637 -776 -666 807
3464 807 1262 783 -1051 -810 594 401 1277 694 -1904 0 1682 -202 -298 -51 -1033 238 2102 459
3482 459 -1907 -1061 364 -409 351 814 -2537 -1332 2271 -173 -1316 474 -1384 -634 3145 1580
3498 1580 -1565 -294 965 -241 512 1567 -1727 -1312 2531 139 -1548 571 -1004 -1811 1669 1079
3514 1079 -1296 -141 1050 -398 -254 896 -681 -1336 1710 1053 -1782 -148 366 -699 285 653
3530F53j646J41K222J73k624M16J479j478J286J902l572q85L209o53j787K030
3546H66o44k631K945K538m592j92L470k882o5M292l420k990N199l06m207L001
3562C82R98m397L326L446n673l15N137k872j751M848l028l619N757Q24n450J886
3578e01J592l895K742L515m778k069M549m65j902K914j338l965L766L231l380
3593A6p51J432j978M88L534q30l808Q68K248j349L33J939l272j811M341L01l069
3610a368J580O41l721J845M096l746j644M620k695k949N885k70n458L854J974
3625B644n733L069M823o262j433N726l433k112P224l031o768N810K310n519L865
3640A180K185p614J663O982l976k537M355l504k665P026M81o487J941K211l565
$$ plain form
3530 653 -993 -852 1370 1543 -1081 -665 814 -664 622 2524 -1048 -1933 1276 623 -1164 866
3546 866 222 -2409 536 3074 -1518 -1710 1760 -1122 -1187 3105 -315 -3305 1894 1588 -2619 382
3562 382 1380 -3017 309 3755 -1918 -2233 2904 32 -1719 3129 101 -3518 2239 3063 -2387 -501
3578 -501 1091 -2804 -62 3453 -1325 -3394 1155 690 -1212 1702 364 -3601 165 3396 16
3593 16 -735 697 -1281 -793 2741 1911 -1897 -1029 1219 -130 203 2142 -1130 -2941 1400 1701 -1368
3610 -1368 212 853 -2868 -1023 3073 -673 -2317 2303 -392 -3341 2544 2274 -3184 670 2644
3625 2644 -3089 -20 4803 -1459 -2892 2834 -599 -2711 4513 1482 -5286 524 2834 -2685 1180
3640 1180 3365 -4249 -2586 4396 420 -2117 2238 -1266 -3931 3095 3576 -2911 -970 1241 -2324
3655b324L167L311n939j660M889o9j763K158j416l537K780L335k628j736K135
3670G03j363j118M041k63m172J060K588j698l31K521k559k843M656Q66m703K856
3686B41J755n084K247M382m704p45M937k660k906N378n75n545M241K242o229K727
3702b98L976o504N27N603m679j814N792k586l782M978P74m772K945K617n079J195
3718a107M540m361p30M348k720k057M090o33l126K212J032k594N80K272k079j534
3734a867K680l98k069K026l6k233J017J813j230p19J740j94j552K105J411l574
3750a080M78K805k455k01K527k245k071L296J14l067J431J425l113J090L699l792
3766a159r10M170k254j287L928k078k987L599R51l248J154J763k924M74L328k856
$$ plain form
3655 -2324 843 4154 -1785 -3445 1444 1375 -388 1770 354 -3183 -403 2932 304 -1432 703
3670 703 -660 -1778 2263 2000 -2172 -1112 1476 -222 -553 1968 -591 -3434 1222 2088 -2615 241
3686 241 1996 -3088 -841 3541 -1163 -1908 3029 369 -2537 2841 2266 -3279 962 3204 -3025 -298
3702 -298 3678 -2826 -2299 3304 -1375 -3189 2603 17 -3765 1213 1987 -2785 160 2777 -2302 -1107
3718 -1107 3433 -928 -1658 2690 -30 -2087 2003 1370 -1756 456 1488 -1106 -526 1746 -333 -1867
3734 -1867 813 415 -1654 372 336 -1897 -880 933 -297 -1016 724 530 -1022 1083 2494 -1080
3750 -1080 -602 2203 -252 -453 2074 -171 -2242 1054 1168 -1899 -468 957 -2156 -1066 2633 -1159
3766 -1159 -2069 2101 -153 -1440 2488 410 -2577 1022 1973 -1275 -121 1642 -1282 -808 2520 -336
3782c36j760L559j250j759L225j235k550K494P46k062N25O98j145P2K277q39k011
3799a351J756N43j346J152k25j490J103P87q44o30J97J24k74N3Q26j353Q6J742
3817H56p20m97J075p40k42J171M65j280n74J194l11o53J182j049j515K540j56
3834G46j992Q24L50j006J404M10j606j55J459o3j074J022p2j386K257O34j971
3851b19L01K71o98J351K64j590n38J112L51m72n43n01m92J431N46j314k02M00
3869e42J94Q29l8n30o3L45P85j28p69k12j86P24P91p26r25k3P29K13l54q79k78
3890a043N73J226p7j535o7M25K18O76n32p06O88J172j90n32l10k89J36J231J57
3909A221j374m26P46j00M99n72j527O20J678r1p88o20l09R22J071m01j017j58
$$ plain form
3782 -336 -2096 1463 213 -1546 1679 444 -2106 388 1134 -928 -403 295 -850 -778 1499 660 -1351
3799 -1351 405 948 -398 754 529 -961 142 929 85 -545 -348 -224 -498 -445 381 -972 -886 856
3817 856 136 -361 714 -26 -268 903 1368 88 -486 708 397 -256 926 -123 -1638 902 746
3834 746 -1246 -422 -72 -1078 326 736 -870 -1025 434 371 -703 319 247 -1139 1118 1752 -219
3851 -219 82 353 -345 1006 1270 -320 -858 254 605 133 -410 -911 -1403 28 574 -740 -942 -542
3869 -542 -348 481 443 -87 -150 195 980 852 83 -129 -315 409 1200 474 -451 -474 255 468 114 -765 -1043
3890 -1043 -470 756 679 -856 -923 -498 -280 396 -136 -842 -154 1018 828 296 -14 -303 -167 1064 1221
3909 1221 -153 -579 167 67 566 -6 -1533 -913 765 674 -114 -734 -1043 -121 950 549 -468 -626
3927f26Q82K38k39j97j031L68J471J4n37l93p45P64Q53k66q39n90Q99Q00k64q74
3947c12q62L04J391K14n98p32J80P83J50k24p57n85J056J090p91m85k93n22Q04
3966a89R65q34j102Q15P90n7J50o62j264J202K084j464p51O27p71L64J310j364
3984a51j496J820O89p81P5l69j372R55K010j169j220R74k03o4J653j277j971J625
4002b72J397l47q2n22j099N19J999r69j728J021M59o82J159n52k075R56J364O
4020E52q05j65L00l95P65Q50k291J05K378o96q46R72j365o59K458M02k455J57
4038g38J915r42m45K016k846j722M513m86k773K033p00k105K755J482l627j24
4054a794K954j174k41K450k550k740M601N75l335K001K03l190K649K077l685n10
$$ plain form
3927 -626 256 494 255 58 -973 -605 866 880 343 -50 -795 -31 822 556 -283 -873 26 826 562 -312
3947 -312 -1174 -870 521 735 137 -595 -415 368 518 294 -463 -1048 8 1098 307 -178 -471 -993 -189
3966 -189 776 -58 -1160 -345 445 388 538 -124 -1388 -186 1898 434 -317 310 -461 -97 1213 -151
3984 -151 -1647 173 862 81 156 -213 -1585 -630 1380 211 -1009 -35 -238 -302 1351 74 -1897 -272
4002 -272 1125 778 696 174 -925 -406 1593 624 -1104 -83 376 -306 853 301 -1774 -818 546 552
4020 552 -253 -418 -118 -513 252 1102 -1189 -1084 1294 598 -248 724 -641 -1300 1158 1560 -895 -738
4038 -738 1177 235 -210 1806 -1040 -2762 1751 1265 -1508 525 -175 -2280 475 1957 -1670 -1794
4054 -1794 1160 -14 -255 2195 -355 -3095 1506 2081 -1254 747 950 -2240 409 2486 -1199 -1709
4070a709K642o94o25J851j245k526K540J594k922O67J396j791M65J724k233r62
4086a828J949R36j456J56J155j453K3K648j986k144K678O00j452P81J23k949J002
4103a217L506j686k775K886j83k297M168m64n556K958L271l153M21K119m086m66
4119b554M945j197m245L534O87l644M246J419o157J715M124l370J39L038l636
4134i56j710M836n46m181K205J662l450K578K184m641J41M098k480p88K485j223
4150B14j899K565N32k945L88K484j354r75K151j015j867K905N47k943M70J952
4166A210q86l73J578j807k570L404J410l616J247J456l207J841L492l845k149
4181b815L961l62j827L058p65m887L377L691m496J76L211m480O81N136l283l423
$$ plain form
4070 -1709 933 239 -386 1465 220 -2306 234 1828 -1094 -427 969 -822 -357 1367 -866 -1828
4086 -1828 121 1057 -399 -243 912 -541 -518 2130 144 -2000 678 1278 -174 607 730 -2219 -1217
4103 -1217 2289 603 -2172 714 531 -1766 2402 1938 -3618 -660 2611 -542 -121 1998 -2088 -2554
4119 -2554 2391 1194 -3051 483 1170 -2474 1772 3191 -2966 -1251 2873 -497 -358 2680 -956
4134 -956 -2666 2170 1624 -2557 -352 1310 -2140 438 2622 -2019 -1878 2220 -260 -1048 1437 214
4150 214 -1685 880 1412 -1533 -1145 1339 -15 -990 1161 146 -1721 1184 1731 -1212 -742 1210
4166 1210 324 -49 1529 -278 -2848 556 1966 -1650 -403 1053 -2154 -313 3179 -666 -2815
4181 -2815 1146 784 -1043 2015 1250 -3637 -260 3431 -1065 -889 2322 -2158 -1477 3659 376 -3047
4197c047L953P6k669L337M61n069J963L777l773k60L067l104q12M286j397k967
4213b178K396N67k094J736J262k910J25L044j708j442K108n89j397J748O75k285
4229i42K02J731q47j012J350k01j577J768P92k542J94K263j526n62K252j269j979
4246a905K780M46k890J370J904k801P00K781l035j057L651j667k347L391n16k641
4262a836K598J002l514R10K831k757k51K821k654j295L707p60k646K234R4k137
4278a653K146J238k524k95K102p99n76J510r49j803J926P70j719N97J55j088Q26
4295a36J061o16j128N29P05n56L33N54j400l1J314m32r41P57o2p50R74R17j403
4314c11j48J351p90n43J500o37j443J748r3j642J174M98j658O53R89j285k24J433
$$ plain form
4197 -3047 906 982 -1687 1650 2111 -2958 -995 2782 -991 -1251 1816 -1288 -2100 2186 789 -2178
4213 -2178 218 785 -1309 427 1689 -1221 -1096 1948 240 -1202 906 317 -1080 668 1343 -942
4229 -942 -740 991 144 -868 482 281 -1296 472 1264 -1278 -1084 1179 -347 -909 1343 74 -1905
4246 -1905 875 1321 -1569 -199 1705 -1096 -396 2385 -650 -1707 1944 277 -2070 1321 805 -1836
4262 -1836 762 1764 -1750 -840 1991 -766 -1017 1804 -850 -2145 1562 802 -1844 390 484 -1653
4278 -1653 493 1731 -793 -1088 1014 215 -361 1149 200 -1603 323 1093 -626 -29 126 -962 -136
4295 -136 925 309 -819 -290 415 -141 192 746 -654 -685 629 197 -744 13 -49 -799 175 1092 -311
4314 -311 -459 892 102 -441 1059 422 -1021 727 634 -1008 166 664 -994 -341 648 -637 -861 572
4332E72m52j137J578P7j508J231L44j754J017P88j478L83R96q63m5Q47l15n88
4350c07L94L78o82L97N03j095K65P81q77J13r1k22K40N6O7lk15O04k41m34P07
4371C38k37l14M78j24j62P5j80J20l98L90L58n68L51L48q88P87M48j091K66K57
4391B54n97J82J10j62k18m3M88m50KP05o19J14J039p21M0L75m16j1N07o32q2N6
4413g9R6L60n35K60l75p6Q58n33m64Q61p20J40O43o85O3M3k38N78m42n5K12k59
4435c47O21J25m81M39K8k65O23o18k03k5O9M54o48k96N56k88J62M55q86o9P33
4456A39k4K35l16n9j68K55N88p40n01O80l96L05Q08j210m29J040K2j90J99l72
4476a34j78L15P29p02n30P34k88m66J321r52q87J170n1j36K59l40m79O87O10o70
$$ plain form
4332 572 120 -1017 561 638 -870 361 705 -1049 -32 756 -722 -339 657 -206 -251 596 281 -307
4350 -307 87 465 -217 180 683 -412 -147 634 -243 -130 -221 -443 -203 -147 -80 -83 -298 306 65 -369 338
4371 338 101 -213 265 141 -21 54 -126 -6 -404 -14 344 -224 127 475 -413 374 822 -269 -3 254
4391 254 -343 -161 -51 -213 -431 -474 14 -436 -434 271 -348 -234 805 84 124 499 83 72 579 -53 -135 -79
4413 -79 17 377 -158 102 -273 -349 509 -24 -488 373 -347 -207 436 -249 -186 -143 -381 197 -245 -300 -88 -347
4435 -347 274 399 -82 357 385 120 743 125 -78 -103 -34 420 -228 -524 32 -256 -94 361 -525 -594 139
4456 139 115 350 34 -25 -193 62 650 -90 -591 89 -307 -2 806 -404 -833 207 229 39 238 -134
4476 -134 -312 3 732 30 -500 234 -54 -520 801 -151 -1038 132 81 -55 204 -136 -615 72 682 12
4496A2q31P08M02l21N03k31r64Q49N84q79j20K20J07Q2M04j25q62LR95n49k30
4517b43N00r02qJ457l46j288K91O36l62M11O45j499k23K120p70j121J242m28r73
4536h61J945q3j990P42J191j377J78J669j701j210K490n11j740J460j53j450K010
4553F09O72k416N02J688j263m86J434q64p79K225k15k300J148O63j219Q02Q62
4570A063j567l43J584p5j078M13j40q10J242J174j977r59J628J23l87P57o34j387
4588a373J383J614j480j067J447p91m75K486q22k680J655J194k131J431R43k799
4604a465L73K997j441j811K330r52j875L137L32l701K228J837l418O55K178k495
4620a091l6K933j703j908K728J53k412J684Q84k910J335K717k715q44J813j180
$$ plain form
4496 12 -819 -111 291 -30 473 242 -722 127 711 -168 -288 -68 39 121 525 400 -462 -459 536 -13 -243
4517 -243 257 -645 -653 804 458 -830 -539 97 -265 146 791 -708 -931 1189 419 -702 540 112 -861
4536 -861 1084 1001 -989 -247 944 -433 -255 1414 -287 -1497 993 482 -1258 202 49 -1401 609
4553 609 1281 -1135 -633 1055 -208 -694 740 -124 -903 1322 1107 -1193 -45 618 -601 201 1063
4570 1063 -504 -847 737 662 -416 -3 -143 -953 289 1463 -514 -1473 155 278 -109 648 14 -1373
4588 -1373 10 1624 144 -923 524 -267 -742 1744 922 -1758 -103 1091 -1040 391 1334 -1465
4604 -1465 -1092 1905 464 -1347 983 31 -1844 1293 1625 -2076 152 1989 -1429 -774 1404 -1091
4620 -1091 -1127 1806 103 -1805 923 1076 -1336 348 1232 -1678 -343 2374 -341 -1185 628 -552
4636e52k77K604j282k116J270J527j168J1P65j827j86L108n97k575O62O86q36
4653g83J187J003k084p49K291O0j502Q64L52k316K125K171l128p63K331j165r02
4670a008K366j423k382L074J290l447R71J711k848J163L407l579j499L704j006
4685D94j841K801j105k968K914K062k933j72J835k365L99L857k514k521K905j07
4701G41j585J883m08k686J307K034j233q41J343j037q44K080N0j889J161Q09j488
4718f03O37Q25q69q57J407L4j541J048J328j973l83J664j145l07K596j236k480
4735a855J770J016j590Q44O77k659J35L735j497j830J814j189j368M070j1l654
4751a592J321J161j455J104J384l034q43L275k38j805J561j097j987L091R97k929
$$ plain form
4636 -552 -829 1775 493 -1623 -353 1174 6 17 782 -1045 -1231 1877 1280 -1295 -633 53 -783
4653 -783 404 1407 -677 -1426 865 925 -577 287 639 -1677 448 2619 -509 -1272 1059 -106 -1008
4670 -1008 1358 -65 -2447 627 1917 -1530 -559 1152 -1696 -533 2874 -705 -2204 1500 494
4685 494 -1347 1454 349 -2619 295 2357 -576 -748 1087 -1278 -879 2978 464 -2057 848 741
4701 741 -844 1039 631 -2055 -748 1286 53 -788 555 -482 -1326 754 804 -1085 76 885 -603
4718 -603 34 859 -10 -867 540 574 -967 81 1409 -564 -947 717 -428 -735 1861 625 -1855
4735 -1855 -85 931 -659 185 862 -1797 -1662 2073 576 -1254 560 -629 -1997 2073 2062 -1592
4751 -1592 -271 890 -565 539 1923 -1111 -1954 1321 1083 -722 839 -258 -2245 846 1843 -1086
4767a086M35J053j289Q15J442j701j116J698P10j524Q11K92j662J094J056j372
4783c44n6Q77l97j77M84qq78K52J216q87o63J197o35m87Q11l87j048J015R31r49
4803a33l28Q31o21l58J645n68j784J836M01j436Q39j30j147N92J680j118r97J034
4821B38l22n99J560k68k037J476P63j046M91K98j569L99J597j059q28Q28J48l10
4839b40O54L1j398M89J324q33K4K02p79M58P26k94n46l64N88Q0l4K51r43j28J018
4860B86J23o67L15k97K06L35K07n20o99O26M48n78J89n0n64O73N57p45J37L14
4880B96j10o1M80m44n25L90P45q16n8Q4p07O45M78q21j72M39L0K59K80m08m34
4901d30M81O67p69j35L44m19K22M53n34m58M12K74J07J60m93k0J81L63o5k91j22
$$ plain form
4767 -1086 -651 402 -887 -72 1370 -331 -1447 251 961 -563 248 540 -1122 -28 1028 -344
4783 -344 -400 477 80 -97 387 379 -499 -247 969 82 -581 616 -19 -506 305 -82 -1130 -115 816 -133
4803 -133 -461 370 -251 -609 1036 468 -1316 520 921 -515 324 194 -953 -361 1319 201 -796 238
4821 238 -84 -683 877 609 -1428 48 811 -235 256 554 -1015 -616 981 -78 -906 -78 70 -240
4839 -240 414 445 -953 -464 860 27 51 253 -526 -68 658 364 -182 -546 42 122 88 339 -604 -732 286
4860 286 409 -258 57 -240 -34 301 508 -12 -711 -85 363 -215 -26 -76 -640 33 590 -155 -18 296
4880 296 186 125 605 161 -364 26 771 -45 -103 -19 -726 -81 397 -424 -596 -157 -127 132 412 4 -430
4901 -430 51 718 -51 -186 158 -261 -39 414 -120 -578 -166 108 215 375 -118 -138 43 406 341 50 -72
4922g2k34Q4M32m55n02K51L30n1J46k79J65J71K20K89l77o1K64QP1n4n97K6K85
4945F0j12k53nJ59l9K01L60l63l10O38J4l82K41l34l57O71k73l19J65O3M3J08
4967b4L20m47p1O88k10j23M41m82m79Q15k10m69R7L2j53L01j4k97r7O05j89l0
4989DM81k60l92K34K80o14Q2L58k73j32K77j97k6q8M71k32l60P20j97j98N49m41
5011D6k53M80J29o49O4J54k11l24Q95k25r79J193M6q86R32J20j189P86M55p12
5031a28k6O41n93m46R05R9j121J018J35j297J054O07j360M70M74q84R3R10n46
5050Ep94P30K29p72N70O44j470M42J026q25O8N29l93l73N70L52n96j28O00m68
5070e4l76J045m59p90Q98L5o87L97M85p82l39J010l80q20J349j56j254Q32Q41
$$ plain form
4922 -72 -306 -222 210 -245 -747 -496 -166 -217 -71 -350 -185 -14 206 495 118 57 321 329 400 346 -251 -225 60
4945 60 -52 -305 -310 -151 -190 11 371 8 -302 336 350 -32 209 -125 -482 189 -84 -403 -238 -175 -132 -24
4967 -24 296 -151 -222 466 256 133 574 92 -387 428 218 -251 -154 -122 -275 26 12 -285 -382 223 34 4
4989 4 485 225 -167 67 347 -267 -185 173 -100 -232 45 -152 -178 -266 205 -27 -387 333 136 -62 487 46
5011 46 -207 273 402 -247 -183 -29 -240 -564 331 106 -873 320 366 -520 412 532 -657 129 584 -128
5031 -128 -154 487 -106 -552 353 452 -669 349 484 -813 241 848 -512 -42 432 -452 -359 551 5
5050 5 -789 -59 170 -602 -32 612 -858 -416 610 -215 -147 382 -11 -384 186 538 -58 -186 414 -54
5070 -54 -430 615 156 -634 264 299 -388 9 494 -288 -627 383 3 -817 532 376 -878 -46 795
5089G95j763Q34J015j539J38J520p99p92J423k56j448J280J062k270O11J280k253
5106a162O04K117k046p14J984p60q87J412q0j813J160J425j917J88J532j463k21
5123f41J862j161q66J509j43q57N95L84j045O3J344r98j007J132J04n66P64l21
5141A52j380R09J157n97j029O78J75p98J577M48k428L15J710j147L86J131j796
5158e37j168K533L81j887P78O13k176J525J979k809n46K477j331o29K399j456
5174A46j916K066L28j668J347R31k351N29K211j918p48K245r34j502K051l21j499
5191a003J724J43j969L10J793p48q65J261j035n92J670M11j903L00P43o70P45
5208C15Q51j262j209J178J134j057K93R8j770Q25K211j133j334J022J06p27J423
$$ plain form
5089 795 -968 -134 881 -658 -520 1000 201 -591 832 576 -872 408 1470 -800 -189 1091 -1162
5106 -1162 -558 1559 -487 -1201 783 23 -864 548 468 -1345 -185 1240 -677 -489 1043 -420 -641
5123 -641 1221 60 -806 703 560 -297 298 682 -363 -300 1044 46 -961 171 275 -291 473 152
5141 152 -1228 -319 838 241 -788 -110 65 -733 844 1292 -1136 -821 889 -258 128 1259 -537
5158 -537 -1705 828 1209 -678 100 713 -1463 62 2041 -768 -1314 1163 -168 -797 1602 146
5174 146 -1770 296 624 -1044 303 1234 -1117 -588 1623 -295 -1043 1202 268 -1234 817 496 -1003
5191 -1003 721 864 -1105 -795 998 250 -615 646 -389 -981 689 1100 -803 -503 240 -430 315
5208 315 1166 -96 -1305 -127 1007 -50 243 341 -1429 -604 1607 474 -860 162 268 -459 964
5225I64J64k370M57J944j263l23J684j726r43K374l50j839J548J1j562J410J440
5242A620k583R5J885j099p89K043j241j101K124l38j948J343Q61j414N13J058
5258A029j488k38J805r98j057J158Q4j103J135K84j670K75J122m48k42M79n23
5275c96j86R27N05j321j30J157m40Q8N95q51p21J104J44p21J6M13o45L40J076
5294I54p65j355J471K29r92P81qj600J075J177j363k14P29m48q2J368o34j319
5312i96J119P88j271P47L26j451Q89Q47j272l15Q54l61k79R39l90j118P25O92
5330D73p43J17L01n19K73R70p21p36M56J30r7L84k40m38K09P48j23p54L48j35
5350i7n5O97j00r34K03N54r0k80n8N0l73O92M20j235lO16k49L99M37r89p1Q23
$$ plain form
5225 964 1128 -1242 -785 1159 -104 -427 1257 -469 -1412 962 612 -1227 321 332 -1230 180 1620
5242 1620 -963 -868 1017 -82 -871 1172 -69 -1170 954 616 -1332 11 872 -542 -29 1029
5258 1029 -459 -697 1108 110 -947 211 295 -808 327 611 -1059 -784 338 -110 -352 127 -396
5275 -396 -582 345 850 -471 -601 556 116 204 799 -52 -773 331 475 -246 -230 183 -462 -122 954
5294 954 189 -1166 305 534 -458 323 315 -1285 -210 967 -396 -610 119 -329 -411 957 323 -996
5312 -996 123 911 -360 387 713 -738 151 998 -274 -589 265 -96 -375 564 174 -944 -219 473
5330 473 -270 -153 148 -371 -98 872 151 -585 -129 1 -96 288 48 -390 -181 567 444 -310 38 -97
5350 -97 -152 545 445 -489 -286 268 178 -102 -160 -110 -483 209 629 -606 -609 7 -242 157 594 -395 -466 357
5372C57J56o30J6R3j99L99N71j113k40Q97j55j6K54o96k15Q31J75m86k89J76l27
5393d41O00L06p29l37P24L8j68J63n14m6P10J79n30p5j60K30M64j00k38m34K80
5414g8M91l53n7k58O1L83J49k64k71j89M33J57l32J29k88n4Q36j51m75k79N1L72
5436A3M78k53m74pM56J12m57J74k47m8Q15k42m22o0J6J26L54j78m09k79O39R4
5458B01m06Q5k82O9O87J7o71J27m5K62N58l86m62O9M59K94n57Pj07j30N87j24
5480B52n62K84l5J80R7j97m03l4L46L16m72j20J84l7L20Q4m00j13M57K13j72k42
5502e4okR6O82m00n80M57m0k61K78k27l99N24L78m94j70j5j12J09N22k44n36M48
5525d6L41m41N09k36p72Q85L47k60l35Q2j17j1N19q5q58L67M67l50NJ16o62K80
$$ plain form
5372 357 513 -117 -101 -8 -207 192 763 -350 -590 307 152 136 390 -306 -521 310 485 -1 -290 -114 -441
5393 -441 159 465 -264 -601 123 161 -7 156 -358 -404 306 485 -45 -120 -280 -50 414 314 76 -358 -78
5414 -78 413 60 3 -255 -194 189 338 74 -197 -386 47 204 -128 1 -287 -341 495 344 -131 -410 -359 13
5436 13 491 238 -236 -243 213 325 -132 42 -205 -253 562 320 -102 -162 -146 -20 334 156 -253 -532 107 201
5458 201 -205 -120 -402 -333 354 371 -300 -173 -218 44 602 216 -246 -177 282 576 19 26 -81 -211 376 252
5480 252 -310 -26 -61 119 216 19 -384 -418 -72 244 -228 -348 -164 -201 119 203 -197 -310 147 360 188 -54
5502 -54 -60 -62 34 716 316 -264 193 153 -108 170 -57 -456 68 446 -48 -218 -233 -345 -236 286 42 -494 -46
5525 -46 295 -146 363 127 -645 240 587 327 -8 74 -43 -54 465 380 -478 -111 356 6 11 127 -535 -255
5547b55P01l67k68kJ60o2J42J70m90R3M79k31k39N12l11k70M89K7l31j23M88j04
5569B08l81M40l64n80R40R4q78L19N12p00L50N16q32k35R87p2o79P37k51p24P40
5590A47O77j217J57P49r05L59Q95r02n06J009p0p38P58K12j130K45R65j007j40
5609d42J009p77l36J150o74o79Q65J25o12L28L62m05k10P17k15p49Q09J08p43
5628c69M30K22p59M05N98m32m57N77O4o19M51M30j117J36J081q65k69J030p39
5647b02o83J203R3j165O78N83q21J22J286j319m96J489o01q34J364k60j326J238
5665C49L86j247L65R03j411J69J442q99r96J324k94r57J055L69j426P68M76r63
5683e87N13Q52q64k86Q04M6p81M27L90r56N11O22p43m24P36j85l75L06M13r27
$$ plain form
5547 -255 446 79 -189 -191 -31 -93 49 219 -271 -178 301 70 -169 343 32 -238 251 278 -53 -176 312 208
5569 208 -173 267 -97 -677 263 357 -521 -202 310 -390 -40 476 -356 -591 396 324 -355 382 131 -593 147
5590 147 824 -393 -236 513 -392 -33 862 -40 -546 463 393 -345 413 625 -505 -260 705 -302 -442
5609 -442 567 -210 -546 604 -70 -749 116 241 -371 -43 319 -86 -296 421 206 -543 266 374 -369
5628 -369 61 283 -476 -71 527 95 -362 215 279 -340 111 541 -576 -440 641 -224 -493 537 -202
5647 -202 -885 318 411 -754 -76 507 -314 -192 1094 -225 -721 768 167 -667 697 437 -889 349
5665 349 735 -512 -147 756 -655 -486 956 57 -939 385 91 -866 189 558 -868 -100 376 -587
5683 -587 -74 778 -86 -372 432 478 -303 124 514 -442 69 691 -52 -476 260 75 -300 6 419 -508
5703e08O3J015p26l90R07l95q21J262L3r29O24L12q88J72R96p54m70R71l44q84
5723g54J369J40j524R93L73j329N62Q66j111k61J303n80o99J187k34j363J250
5740A88M33j315P02M34j116M20J136q86m78Q70l10m95Q23J28r95L86O32n80O8
5759D5M82p93k31Q04q9o70K22K40k69J82M64n64m15Q02J09p44N51r0l85L42M87
5780D80m33j63O70l30p14R10J57j141Q05L67p84L6N25n43r4P32n51n74P96K06
5800C57r75N74K81q86Q21M82j155L23P46p53j52R00m76m30O65K40p71J25N35o29
5820a78K44N61p08k52M19q3j99K41k09l44L24M66l57l62M45l8k87M99r9m45L95
5841C3L37j27j82K3q1pM26J83o55k0K64j91J74J39o65r9Q01k61l64P6P9q6L50
$$ plain form
5703 -508 -445 570 -156 -546 361 -34 -855 407 440 -489 135 447 -441 -269 727 -27 -497 474 130 -754
5723 -754 615 755 -769 224 597 -732 -170 696 -415 -676 627 47 -652 535 301 -1062 188
5740 188 621 -694 8 442 -674 -254 882 -4 -482 388 78 -417 406 534 -461 -75 557 -23 45
5759 45 527 -266 -497 307 218 -452 -230 10 -259 -77 387 -177 -592 210 319 -425 126 36 -349 -7 480
5780 480 47 -116 554 224 -490 420 577 -564 241 608 -176 -140 385 -158 -252 480 -71 -645 151 357
5800 357 -618 -44 237 -649 172 654 -501 -178 568 -185 -337 563 87 -343 322 562 -209 -84 451 -178
5820 -178 66 627 -81 -333 86 3 -196 45 -164 -508 -184 282 -75 -437 8 -30 -317 182 83 -362 33
5841 33 370 243 61 84 3 -4 422 605 -50 -70 194 3 177 316 -349 -448 353 92 -272 -196 -117 -203 147
5864A47J20p29O8Q64m75j65O74o39q5N14j17j08m8j05o7K68L43m83k64O39k54
5885I8k92M37m54j28N09k1k05j96J47O3J21Q5l23j36L13K84k86k7q2o9L28J78
5907C44k79Kn6K18m4j31k06j04K17L54k71l59J44k4K52R6m18K31j61L75k9j32
5929A9j67o3J51L09j42m17K57M0p2M03k10l24M6N38K4k38m9j24mL19q4m17L3L08
5953A36j92N0k38j66K72J32R9k04M5o0J94J26j3l49L7L05nJ1j77j98K52L38k05
5976A90j73q9J37Q7J89l40k53JK37J16o6k11j46O9K46K21k78k59L19J92k26L2
5998eJ95k34J03L69l81j81J57j72K31J28l91j98L30J64q4K0p8l12K81K90m11j57
6020c36L45j91J08K20k99J2J50M1M5n6N1k26K43L45k83l57M76j32J5J34n19n8
$$ plain form
5864 147 267 -462 -394 470 -5 -170 504 -135 -220 294 177 69 21 -84 -151 117 460 -23 -287 352 98
5885 98 -194 243 -211 -339 170 149 -56 -252 -105 -42 79 164 -159 -295 18 302 16 -11 -93 -162 166 344
5907 344 65 67 11 229 185 54 -152 -256 -39 315 44 -315 -171 -195 57 153 -265 -34 -195 180 151 19
5929 19 -148 -211 -60 249 107 -310 -53 -13 -85 318 108 -216 -170 368 392 154 105 -19 -23 296 212 -205 -172 136
5953 136 -56 -6 -244 -410 -138 -6 93 -111 -66 -126 68 194 181 -168 -131 174 169 180 3 -195 57 395 190
5976 190 17 -72 65 152 341 1 -252 -251 -14 102 36 -175 -321 -252 -6 215 -63 -322 -3 189 -37 -5
5998 -5 190 -44 59 428 47 -134 23 -149 82 210 -181 -379 -49 115 31 51 -27 -339 -58 232 -179 -336
6020 -336 9 -182 -74 146 -153 -141 9 50 95 39 90 -136 107 452 169 -188 288 156 171 305 -214 -272
6042b72J05L67n6k59k6P1n9L89l34k26M9M02j39o9J14j51n3L10J33m56J41P8J68
6065B27M1Q9n13j25M96rl93M77m31p6K57J17n15o1O07m19Q8L70m55l17Q55k78
6087C2r8O7k2j51L43J39m22j07N95k08r8M48o55j35O27j54l32J49M5l08K43J15
6109A13m39k88M39K65l41K43j06j91L94J83k18j39J42l4M4J91k04l63QP10l70
6130C9j06L25m36j01N80j03n91L36L33m71J92L63o92J0R04o72m14O74j42m18N32
6151A42N9p26N60M48o87J15M95m60j3P19n97o48O85J56m25M37j61m77J34L46N
6172A07l22K07m4k47N71L9o59J45L53k86K42J22l28k79N41Q6k51l5J68l80L84
6193A34M17n16k68L96k1l19L53J4o34L00L76m59j25N36k48m64Q46j14o57P01l
$$ plain form
6042 -272 -167 200 144 -115 -141 -70 -129 260 -74 -300 -251 151 12 -57 57 -94 -147 163 296 -160 -19 59 227
6065 227 268 357 -156 -281 215 206 -187 290 -141 -217 40 157 -358 -419 188 -231 -143 227 -228 -545 310 32
6087 32 -66 1 -21 -172 171 310 -112 -219 376 168 70 518 -137 -272 355 201 -131 18 63 -245 -2 113
6109 113 -326 -614 -175 90 -251 -8 -114 -305 89 272 54 -85 57 23 67 258 54 -309 -301 409 39
6130 39 -67 258 -178 -279 301 198 -393 -57 276 -195 -3 360 -332 -322 582 -90 -504 170 28 -390 142
6151 142 201 -525 35 483 -204 -89 406 -54 -67 652 55 -593 92 248 -177 260 99 -378 -244 102 107
6172 107 -215 -8 -52 -299 272 311 -348 -203 150 -136 106 228 -100 -379 162 248 -3 -38 130 -250 134
6193 134 551 35 -233 163 142 -177 176 190 -444 -144 232 -227 -352 184 -64 -528 318 204 -453 248 245
6214B45o50L04M52m95LO92m70k64O40l36l33O09j70p29Q13J05o98J41M38n22N9
6235a66L32l45j64L58J76n68L85J23l21J77J45k13q2L93l18R0K53J1l06M9K89
6256B98k12k65K28R0k67K41p1l90K34K35j72n0J68l20j80O02O2n89L23R4j95M77
6278C41J46n89m4M82j00l50L88l17k26M88J83n78O3L07o08K40M45n18j38N11k24
6299i8j50N92m89j58Q9L91l16J17K87l50NM89k91j18K42j34l24M60Rk93nJ43j82
6322h4R5J30j86j17J36J06j57J44l7Kk2l8r6J73l9N5j51q2M51q7l23K68K2k34
6346g1K99n4j57K69j45k42L98j58k83m1K60j27k11L45j81j52L84r7k30K2L55l39
6368a56K11K01l61P7K03Q5k68n4J94r1M3Nj76J33kj44J87o6l1L4r9J21l9m6O0
$$ plain form
6214 245 -405 -101 351 -144 -141 551 81 -183 457 121 -212 397 227 -502 311 416 -282 -141 297 -225 -166
6235 -166 166 -179 -343 15 191 -377 8 131 -190 -13 132 -81 -163 230 -88 2 255 266 -40 9 298
6256 298 86 -179 49 139 -128 113 42 -348 -114 121 -51 -101 67 -253 -433 169 231 -358 -35 59 -136 341
6278 341 487 -102 -146 336 236 -114 274 -43 -269 219 402 -176 -113 194 -414 -174 271 -247 -385 126 -98
6299 -98 -248 344 -145 -303 -214 177 -139 -22 265 -85 -80 409 118 0 242 108 -216 244 253 -40 -45 98 -84
6322 -84 11 141 -45 -162 -26 80 -77 67 30 32 10 -28 -124 49 10 65 -86 -168 283 196 -127 141 163 -71
6346 -71 228 174 17 286 141 -101 297 139 -144 -185 75 -52 -263 82 -99 -251 133 36 -194 -172 183 -156
6368 -156 55 256 -105 -28 175 260 -8 -62 132 41 84 89 -87 46 44 -100 87 21 -10 24 -75 46 7 -39 21
6393B1k59J46m2M7k3N7k6Q1J75M6l35J09J44m3O8J19k80r6J95K3j93J20j00j1
6417e7r0J41J7k08J99kk04L8J46k98L67o8K2j3J2k2r0J05K6O7ok3j55L42N7l17
6443a4K74j34j54J64j58q0J03n8qj8j74J36P3M1j60Lj6K08J82j53j77K13L2J27
6467B52l9j56p6J23OK0k4q1q5K51k7k52J0j00J89q2K3J0r5J99j67n0O4r0J92P2
6493H7o1j26l1L02o6m1J49k60JJ91Pk84R7L0r2J62L6j86j45J40J01k2pJ14l29
6518b33N6L23k77j33L49j14m9K10j65k7O8J10J6r8J31j71Q1K89o9k78L1j08K36
6541A78j34m7j35K43k4J8l06N1K26k09J39M0l56L16K33j74k59K24M5k6J75k4k42
6564d8J20J89r7k06J99j47j12J67r4j24K13j2j33J18K4k90O7J89ON4j30j35L1
$$ plain form
6393 21 -238 -92 -134 -87 -110 -53 -79 2 177 223 -112 -3 141 98 166 285 5 -91 104 127 -66 54 -46 -57
6417 -57 -147 -6 11 -197 2 0 -204 -166 -20 -318 49 -19 3 -10 2 -20 -110 -5 21 88 82 59 -96 246 303 -14
6443 -14 260 126 -28 136 -22 -102 1 -57 -65 -83 -257 -121 -48 -7 -167 -164 -180 28 210 57 -120 93 125 252
6467 252 213 57 -19 104 110 130 106 25 -60 191 164 -88 -78 -178 11 -71 -48 -38 -133 66 -101 -151 -87 -177 15 87
6493 87 26 -100 -131 171 105 64 213 -47 -46 145 152 -132 -35 -5 -97 65 101 -85 -230 -90 11 -11 -18 96 -233
6518 -233 -177 146 -131 -264 85 -29 -78 132 -33 -60 8 118 134 36 167 -4 77 366 297 19 50 -58 178
6541 178 44 -3 -138 105 81 99 -207 -156 70 -139 0 40 -316 0 233 59 -200 24 69 43 218 194 -48
6564 -48 72 261 164 -42 157 10 -102 65 -29 -153 60 48 -85 33 57 -233 -166 23 29 83 -47 -182 -151
6587a51J88J77l08J57l4n6J47J65j03j82O7O9J08j29j06o1J1J19j02j1j6j57K24
6610A6j46N9j94J47K30k58K9J79j31M0K66j73j87K73o6J3j17K25j40k18L20j48
6632A9l62L74m8L8J11j61j64n1K80j81M8nj12J9K04q7j73L04n5PJ67j63q8Q7L08
6657C16k96L8K0o7q2J77O2k12P9o1R1j93K0q7J1J02R1r2p7J29J14J03m3J8m21
6682b60L71L8j79J5J08k17J52P8k3k34J70J32j63O2j03j29J29R5k16P8J27j46
6704a15o8K29k22j49L06P1m9J79K0l45J22K09l25J61Q1J5J7l5j34m2J58qp6J9
6728A9J6p9J00K6j31j17o4K26j92K00j06j33J66K01q9j13R6jLJ43j6k28P5J54
6752A56p3K7k6r8oJ0K59k42j15P3o3N2K00j40p2p0K05j90J27O7k58J34J22k80
$$ plain form
6587 -151 37 214 -94 63 29 -27 120 285 182 0 67 136 244 115 9 -52 -41 78 -24 -35 -51 -208 16
6610 16 -130 -71 -265 -118 112 -146 -117 62 -69 -29 237 64 -123 150 84 97 -20 205 65 -153 167 19
6632 19 -343 31 -17 21 132 -29 -193 -244 36 -145 -97 -102 -214 -195 9 -78 -251 53 -2 5 172 9 -79 8 316
6657 316 20 58 78 11 -71 106 168 -44 35 -26 65 -128 -108 -195 -184 -82 9 -83 -160 -31 83 186 143 161 -260
6682 -260 111 149 -30 -15 93 -124 28 106 83 -151 19 151 -12 50 -53 -182 -53 42 -174 -96 31 -115
6704 -115 -183 46 -176 -325 -19 52 3 182 202 -143 -21 188 -137 24 105 120 137 102 -32 -74 84 76 0 19
6728 19 35 -44 56 82 -49 -166 -230 -4 -196 4 -102 -235 -69 132 43 -70 26 25 28 171 155 -73 2 156
6752 156 83 110 84 -14 -20 -10 249 7 -108 -35 -98 -46 154 14 -58 -128 77 -113 14 81 -177 -43 79 -201
6776b01R2L71k99m4K06r6o5K72j15j8P9N1k44l0J51j43k2M6j96Kp3P3L7K34j23
6801e5k27K63j34M5J55P7j44j52Q2J76K4q0J01q9n4j29K54r0q7NQ8r6N2J6j67
6826a66J45Qo3n2K1o8J79mj54J81k5kJ09K5l6k19K10j2r4K70k39K9J05p6j82R5
6852a5M0p3qj32N8j68K05J85r0j40J13l7R4n0j22nK56j36O2rM2J11j43J94j69
6877F3m7J32j8l00J64K5m2n1Q2o5j69K07j41J8J45n8p1rP1l9N2M5o3J57l2K02
6903B58k54M8J94j97p3J43j40k7K15j10r4L4j84R9P4N7n4p5JM6p2J0K1K3O4m7
6929d0LQ5Oj47K60m3o9LO2l1q1J36n6r0J32K2k30K31j87k1kK9j44m4n6K62j94
6956b04J00P3q5k0q4J17Q0J28k4j3o1M2o4Q7QL4p9J30l5l7J2k74K53J3j07j55
$$ plain form
6776 -201 -109 262 -37 -81 125 29 -36 236 121 103 182 233 -11 -41 110 -33 -55 -9 -205 -203 -276 -203 -166 68 -55
6801 -55 -282 -19 -153 -108 47 124 -20 -172 -90 86 110 30 131 42 -12 -141 113 23 -64 -59 29 -67 -15 1 -166
6826 -166 -21 -13 -76 -128 -107 -175 4 0 -154 27 2 0 109 134 98 -121 89 77 -17 253 14 43 148 72 -110 -15
6852 -15 25 -48 -56 -188 -130 -298 -93 92 2 -138 -25 -62 32 -18 -140 -145 111 -25 37 28 70 181 38 232 63
6877 63 16 148 130 -170 -6 19 -23 -74 8 -57 -226 -19 -160 -142 3 -55 -126 -135 -64 -103 -51 -6 -69 88 56 258
6903 258 4 52 246 49 -24 119 -21 -48 167 57 -37 -3 -187 -88 -14 43 -11 -86 -85 -39 -111 -101 -80 -57 7 -40
6929 -40 -37 48 54 -93 167 124 55 58 120 89 8 144 88 -2 130 152 -78 153 -34 -55 -57 -28 -172 -216 -272 -10 -204
6956 -204 -104 -31 -116 -136 -220 -103 -23 105 81 68 7 49 -15 72 80 114 35 165 130 93 105 -169 84 97 -10 -165
6982a65J13k5J8p9K3Q0o8J90l5j19K0J5J65k9L5j04J28k4J1L0j41J38j26m5J28
7007A34j28J11K3Jp3j09M9j64P8oj1n3l3M6LK58n8j96K11o0n1O7M4q4J05N1j81
7034b6R1Q1j23l5J7J67k22J7K17k34n0RJ11k06J11O9j83K0R8J05j5J40k43J07
7058B3K03j61j13J58q2m6K73j47Lj45Q4n6l2M7j53J02J19j25rK39l63OJ74N8j34
7083g7J43J03k41j01J35J46j46J86k13Q3J0M4N7n1J31rj73j29L4J6P5l3j23Q5
7107d8j3j50J00Q3J4%m9J1j00J36J29l4M7Pn1l3K41j51q2JJ30m7L4M1j33k62K19
7134D0r7k6K5o0j70N06k30l38L15m1p0J16N2j85N5K79j27k07K20j3nr5J84j36
7158hk3j6J81j31p5j19P4K23l3j23o4L03k50m7J30Q5l23L02L5k85k7K18j33K2
$$ plain form
6982 -165 -52 -77 -59 -138 -115 -35 -103 87 52 -67 -47 -32 133 104 139 35 163 139 150 180 39 177 51 6 134
7007 134 6 117 140 141 68 -41 8 -156 -78 -84 -95 -148 -181 -135 -132 126 68 -128 83 23 -28 39 83 -1 104 155 -26
7034 -26 65 146 23 -12 5 172 -50 -33 184 -50 -100 -91 20 -186 -75 -6 -189 -169 -71 34 19 159 -84 23
7058 23 226 65 -48 110 28 -18 255 108 111 -34 50 -6 -38 9 -144 -42 77 -48 -57 182 -181 -175 -1 57 -77
7083 -77 66 169 -72 -173 -38 108 -38 148 -65 18 28 72 129 78 209 200 27 -102 -68 -52 23 -10 -133 -48
7107 -48 -61 -211 -111 -28 -14 -14 -63 -52 -152 -16 113 79 126 133 82 49 290 139 57 58 188 141 175 216 83 -179 40
7134 40 -57 -83 -58 -118 -288 218 -12 -350 -35 -76 -146 -30 22 -163 -108 171 44 -163 57 44 39 -56 128 -8
7158 -8 -31 -47 134 3 -72 -191 -117 106 73 -50 -114 189 -61 -108 22 107 -216 86 121 -164 -191 27 -106 -84
7182h4L48j92j54L57p7j27J73r7k23K20%j22p9K7j6j13L49l49J8K65m8l84J60
7205a48K38j79j99L68o0j63J17O6N6m2J60k84L1K92j54j27J71j12m9O7N2j07K0
7228A4K08m66J23K51j81m7K47j3m42L04k3j60L32o2k48J82K82j31l25K11P8j70
7250c6K73j93k77L56J68k89QP0k83Q6J07O9k07J26O6k57J47L18m11j92L81Nj68
7273a33K40o6l58M56J46l31K4K43r1K7m9K0j42L01l29j19J56K37l94K1J46j52
7295a47l5K91j07j46P4Q6j54J23K9k3J23k5o4Q8K09k60j40Q7J26j49Q3N5j00n8
7319c4J47j00q2O8m2j19Q9J83n10K63L3kj4J58j62J3K26M7m02M08j19q3K41j14
7343I3j76p9M49j74k75L29n4j46J25Q2l37L4J43n7J4J54k60Q3M2n1j1J10L7n0
$$ plain form
7182 -84 264 72 -82 275 198 71 244 147 -76 144 144 22 -57 -30 -46 -159 190 -159 -141 124 76 -308 -148
7205 -148 90 -89 -288 80 20 -143 -26 40 96 54 214 -70 -39 253 99 -28 143 31 -18 49 101 -6 14
7228 14 222 -244 -121 130 -51 -98 149 136 -306 -2 -25 -185 147 85 -163 19 301 170 -155 56 134 -36
7250 -36 237 44 -233 123 291 2 10 80 -203 -117 -10 59 -148 -22 44 -213 -66 252 -159 -351 30 35 -133
7273 -133 107 41 -317 139 285 -46 -22 221 130 157 108 128 -14 287 -42 -161 -5 232 -162 -141 5 -147
7295 -147 -182 109 2 -144 -70 16 -138 -15 14 -9 114 89 25 113 322 62 -78 9 135 -14 69 124 24 -34
7319 -34 113 13 -69 -1 -43 -162 -73 110 -400 -137 -104 -106 -120 38 -124 -111 115 162 -240 168 49 -34 207 93
7343 93 -83 -162 287 113 -162 167 113 -33 92 174 -163 -129 14 -43 -29 125 -135 -52 -10 -61 -72 38 75 25
7367B5n6K50l51p1L42j87O3P7j76R4J76m8k26qK19k25j80M40j59p7J02J7m3p5
7391g7J69q5j20PP6n1N4K5q5J18J7Jj17K13j18K0j23L2rR1Mk81L20J6j67R8J7
7418D5k64j3M71l29J4j4J33k09J73m2j21J44Q3j18J48O3k32O1Q7j06o0J59L1j78
7442g4O7Mj1m6L08k02j00n2J4m2K20j51j35N5J60n7n4r0J22oK57k26J31RM4J0
7468A55m3N5r4Or1J07j42L1Oj83J20J78j98J5nn8O0M7N2j10l6K20r0r0M6O3M4
7495F5k4pl3J3J28m2J9j08LQ0J7j45l2J34Jj31N5R9r7J45j68q7M1J00O7K8L9j30
7523C0m1n8K08j99J16J01j34KK52k61L6n4j20O9J03o0o4P6r2J30l32K67O2l77
7547c40L55j0N1k7j33J01J1R8pk60L2J00Q7J04r3j07R5R1k27J43K2n6j08K08j60
$$ plain form
7367 25 -31 219 -132 -203 139 -48 15 92 -84 10 186 138 -88 -96 123 -102 -282 158 -1 -78 24 41 -2 -77
7391 -77 92 7 -113 -106 -30 -81 -27 -2 -87 31 48 49 -68 145 27 47 -76 -44 -53 38 42 -239 81 97 -70 28 45
7418 45 -219 -232 239 -90 -76 -90 43 -166 7 -35 -156 -12 71 -47 101 164 -68 -7 80 -26 -86 73 104 -74
7442 -74 -7 -3 -14 -60 248 46 -54 -106 -92 -134 86 -65 -200 -145 15 -42 -96 -186 -64 -70 187 -39 92 101 145 155
7468 155 112 167 73 79 -12 95 -47 -16 -10 -193 -73 105 -93 -78 -83 -141 -81 -34 18 -92 -128 92 2 -88 -42 21 65
7495 65 41 34 1 14 142 100 119 11 14 94 111 -34 -66 68 69 -62 -7 92 -5 140 -28 -115 -74 26 93 121 160 30
7523 30 -11 -69 139 -60 56 157 23 25 277 16 52 -2 -122 -53 50 -10 -74 2 -90 40 -292 -25 37 -340
7547 -340 15 5 56 29 -104 -3 8 106 99 -161 -129 -29 58 162 69 -38 57 148 -79 64 86 30 -78 130 -30
7572c0j2K3rj02n0Q3j9j8J91k77K2K80m2p4L1p1oqL20k77N9K21k48J38L4j20j92
7599a53K25L3l9j48r2N8P9l8M5j66K47j86j67L84q6r3k0K71j89l9K66k23j55L60
7623A74r7j64J31N5j29P6J58k35J28rk67J69Q3Lk47m3K23l55M66j15k09J09K17
7646A22j97J17K07k29j26K55Q0k35m0K57j32j50K88L9m59L77k05l28L85P1l10
7667b13K6K68j16j64K60j44r1K61j00k06K77K68n57k3L98n4j8K27j82k67M70j49
7689A71l80J91K86m90N4M82m64o1L32k73k59N00q7j39r1L47l29J54L53m56r2M53
7711B02j92l1K53n0m73L18J99k51M4J15j44p5L08k36k87M79n1l63K64J87m81L8
7733b27L42k92j20N30r5m54K50K55k89P3K67m34J82L74l15j71L74lm83L68m3k58
$$ plain form
7572 -30 -42 -19 -28 -130 -180 -97 -116 -134 57 -220 -198 82 40 -34 -3 -74 -80 -88 232 -45 14 235 -13 125 159 39 -153
7599 -153 72 105 66 -82 -174 -116 -37 -75 -30 -196 51 -135 -302 82 -4 -97 -117 154 -35 -74 192 -31 -186 174
7623 174 77 -87 44 99 -30 46 204 -31 97 88 -179 -10 73 76 -171 -214 9 -346 120 5 -204 -95 122
7646 122 -75 42 249 20 -106 149 229 -6 -46 211 79 -71 217 256 -203 174 -31 -359 26 97 -213
7667 -213 -187 81 -35 -199 61 -83 -174 87 -13 -219 58 326 -231 -254 144 90 72 299 117 -150 320 171
7689 171 -209 -18 268 -222 -168 314 -150 -211 121 -152 -411 89 2 -137 -228 119 -210 -56 297 -159 -251 202
7711 202 10 -21 232 182 -291 27 226 -25 19 134 -10 -85 223 -13 -300 179 128 -235 29 216 -265 -227
7733 -227 115 -177 -297 233 138 -316 -66 189 -100 -27 240 -194 -12 362 47 -124 250 247 -236 132 89 -169
7755a69J32L28m16J2L36m08q9L32j4l32L25n8k13J54K73o00K61K62O9m89L19R9
7777A14k04K84l5m19K05K58k71J01O7j07j21J63Rk47K39or3q6L20l16j62K79P5
7800D7k06J30J69l03O3M53l50j25L12l68P6L28q4k91L82k0m57J93J23j44k0J94
7822A02j10k99N06j86l28L98Qm20K70L55l24p0J67j0q2J57P0n01M39J40k53J60
7844A89O9l35k5K21k00j61J14J37j39K53nl10R4K33k65P2J16k49K6K46j91J49
7866C9j75L92k64J18K28l47o5K72N6j62N1nk08LK51j80j80L58j65k30J39R3l36
7889c17L31L2l28K90lj05O6J09j42j83L20J65k51J48R3k98J09J05k25J6nK00j82
7912e5L71l69k35K03J83j71J29k23n2q5N07k45j19J72K7J10m1r6j58K75Jm4j08
$$ plain form
7755 -169 -37 291 -125 -113 223 -185 -274 58 44 -288 37 -21 -234 -80 193 -407 -146 116 185 -304 15 114
7777 114 -90 194 159 -260 -55 203 -68 33 100 -7 -128 35 44 -203 36 30 -63 -149 171 -145 -307 -28 47
7800 47 -159 -29 140 -163 -100 353 3 -122 190 -178 -102 226 142 -149 233 213 -244 -51 72 -72 -92 102
7822 102 -8 -307 199 13 -315 83 91 -329 -59 296 -28 -98 69 59 -23 134 204 -297 142 282 29 189
7844 189 258 -77 -102 119 -81 -242 -128 9 -130 123 118 -192 -98 135 -130 -58 58 -191 -165 81 -110 39
7866 39 -136 256 -8 110 338 -9 -74 198 254 92 143 138 -70 -67 184 4 -176 182 17 -213 -74 19 -317
7889 -317 14 46 -282 8 5 -100 -34 75 -67 -250 70 235 -16 132 225 -73 36 141 -84 -68 -73 127 -55
7912 -55 316 -53 -288 -85 98 -73 56 -167 -219 -304 203 -42 -161 11 38 148 107 11 -147 128 129 85 -23
7935b3N2mq2K98n6l46K16J53J7j84j0l52J72J82R6l29J77j38k2K68m2k06l4M31
7959B34k05K8R1k64J56K0R0l27J37J15N4k55J72j70j10L20l3j31N3j71J61j27
7981a62J10J7j76K42N6Nq5j49k4K30J88k82m6N1O3M5Q0k41j65L18Jq1J88j90k9
8006c6J99m2q7k04j7J39pj24J77k56J64J70N9k93K38j33p8L52j41j22J03L4q8
8029GJ30M0k76O8L51l55j54K08j76J42J72r0j99p9J62J1O7m7n4J9P2p6j62J79
8053d0P9j27K10q3k46J53J56J24k51j31K00o0n7J74j82m6J99M0j82J62k77N1K29
8076I5j12J6m7m0K5l6J70k03p5L41n8j13O2n8J27J58j56k05j46L39K0j07Q6j89
8100a06k08L59j5l03K30J0k02K69l6o2k19M10P2l06K63k4m10L49K84l92m6K86
$$ plain form
7935 -23 29 25 -57 241 185 -161 55 208 225 41 31 -321 -149 33 129 -200 -23 -161 -183 85 43 -163 -197 234
7959 234 29 57 148 -116 40 60 150 -177 -40 75 129 -126 46 -124 -234 86 53 -78 -25 -196 -35 -162
7981 -162 -52 -35 -211 31 87 92 7 -142 -166 64 252 -30 -76 -25 38 83 163 -78 -243 75 76 -5 183 -7 -36
8006 -36 163 121 34 -170 -187 -48 -55 -179 -2 -258 -94 76 135 -158 80 -53 -131 221 80 -42 61 95 7
8029 7 137 177 -99 -31 320 -35 -189 19 -157 -15 157 67 -132 -211 -49 -38 29 -18 -72 -53 19 -57 -219 -40
8053 -40 39 -88 122 39 -207 -54 102 226 -25 -156 44 -16 -73 101 -81 -127 72 112 -70 92 -185 -134 95
8076 95 -17 -1 -48 -88 -63 -99 71 -132 -207 134 76 -37 25 -33 94 252 96 -109 -255 84 104 -3 83 -106
8100 -106 -314 45 30 -273 -43 -33 -235 34 -2 -64 -283 127 199 -107 156 132 -278 71 355 -37 -83 203
8122B03l07K52O4J0l43K37O2n3j49k5k70J91L29l81L5J05n2o1L20j84j88K09j35
8145a31J06j29L30o7l89M37rl10K25J65k02o4N3q1l0K93j08k21J90J61l24K38
8167A33J3l70J49L13k68N2p0k26K60K84k79j43J24J59l03K55K47l08k46L73n8
8188I1k60J98k1
$$ plain form
8122 203 -104 148 212 222 -121 116 178 125 -24 -49 -319 -128 201 -180 -145 -40 -92 -153 167 -17 -205 4 -131
8145 -131 -25 -154 176 109 -280 157 148 -162 63 228 26 -38 15 -66 -96 197 89 -132 58 219 -105 133
8167 133 146 -224 -75 238 -30 22 -48 -274 -14 270 -9 -152 -28 131 -172 83 330 22 -224 149 91
8188 91 -169 29 8
8191H
$$ Imaginary data points
##PAGE= N=2
##DATA TABLE= (X++(I..I)), XYDATA
0@%%%%%%Qq%qQqJ6k4L2l2M0n3O1p2Q8j04J25j47J71k00K31k65L06l51L96m52N15
33B73n79O51p36Q25r19J025j141J270j411J563j728J907k106K323k559K821l106
50a627L420l769M158m592N078n628O257o988P844q856J0085j1615J3566j6154
64h821J9752k5088L3790n0247R1337l67673n61872J058559K05422j70210M48792
75F73741l42263n95144O86236L60841o87958j25627J49175n23572J67439O60709
85D23577m44737m83557L12640p1318m670N04386j67539m91280K60237L36304j02295
96G1748n7462J9229j15379M2777K18995l0057j65593O5182O9066r3922N183J75826
108B05593N2132j74503m1564O7315j96191n2179J86497k21958j54311L09921j01225
$$ plain form
0 0 0 0 0 0 0 0 8 0 0 -8 0 -8 8 -16 16 -16 24 -29 32 -40 48 -56 69 -78 93 -107 124 -141 165 -186 210 -242 273
33 273 -306 345 -391 434 -485 540 -601 669 -742 821 -907 1000 -1106 1217 -1342 1479 -1627
50 -1627 1793 -1976 2182 -2410 2668 -2960 3297 -3691 4153 -4703 5382 -6233 7333 -8821
64 -8821 10931 -14157 19633 -30614 60723 -306950 -868822 189737 395159 224949 673741
75 673741 331478 -263666 422570 783411 95453 -30174 119001 -404571 -237132 423577
85 423577 -21160 -504717 -192077 -263395 -268065 236321 68782 -422498 -162261 174043 71748
96 71748 14286 33515 -81864 -39087 179908 149851 -15742 49440 118506 24584 29767 205593
108 205593 257725 83222 41658 108973 -87218 -139397 47100 -174858 -329169 -19248 -120473
119a20473k35786L51686L9017m06074K01506L28563j49709J79397K46734m37680
129b819n7525N38133k14117l87822K86232j17386k91490M16454j6004n40248J93738
140a92854K28981l23201J49470L08021l49533q6524M21507q7056j70984K77756
150A75583j17320k13929L86905M9868m01308O9096J48577j26315J00759R5247
160A67163k28229l2018K23249n6498j76846M2189j5994n9857J40977N7405j23330
171f1789m0545K2020J9906M2263K4187n901l6927N1483J64845j7609j50769K4556
183C5720L6014n1233P0886J2294j79098R57J40854j08399r7973J21525n3521r4578
195a66552J80260O783j72349J30235Q4388j48837J06956J32301j68172J7400J70141
$$ plain form
119 -120473 -356259 -4573 34444 -371630 -170124 158439 8730 188127 434861 -2819
129 -2819 -60344 477789 263672 -124150 162082 44696 -246794 169660 153656 -386592 -192854
140 -192854 36127 -287074 -137604 170417 -179116 -265640 155867 68811 -102173 175583
150 175583 58263 -155666 231239 281107 -120201 -51105 97472 -28843 71916 167163
160 167163 -61066 -93084 130165 73667 -103179 -60990 -76984 -136841 4136 61541 -61789
171 -61789 -102334 -80314 -60408 -18145 6042 141 -36786 14697 179542 161933 11164 35720
183 35720 71734 20501 91387 103681 -75417 -74460 66394 -42005 -139978 -18453 -71974 -166552
195 -166552 13708 20491 -151858 -21623 62765 -86072 20884 153185 -14987 2413 172554
206A72554j34557q9031J45044n2700q2996J52122l2752j80773R9060O7078j56720
217i3671K0000O3763j11972O0865J39926j07622p0982Q6621j0453j3552R1809
228E4732j2222q2565O9104P7920n1520j7527k467n5026L3116N9833m0976n3344
240b0942j1881R234J3143p80r747k9790q386N1916K1935l8009k1227J1481J9761
253a3292L0992K8604k8913m6071M4476M3682m0710q724Q767k2007M2761L1841
265G1406o8597l3172K5499j1566r584J9114j7911k8711L4690K9292l2114l718
277b5372J2247j9302L6569N2786l1130k6399K1369Q897R986l330m2910j5629L2228
290A0010J4535k6003l1813k423J3175J2657J2695j5106j3602K1951P566L002Q786
$$ plain form
206 172554 37997 -51034 94010 41310 -41686 110436 77684 -103089 -4029 63049 -93671
217 -93671 -73671 -9908 -121880 -61015 78911 -28711 -99693 -13072 -23525 -37077 54732
228 54732 42510 -40055 29049 106969 55449 37922 35455 -19571 13545 73378 32402 -20942
240 -20942 -32823 -23589 -10446 -11226 -20973 -50763 -59149 -7233 14702 -23307 -44534 -33053 -13292
253 -13292 17700 46304 17391 -28680 15796 59478 18768 10044 18811 -3196 39565 71406
265 71406 2809 -30363 -4864 -16430 -26014 -6900 -24811 -53522 -18832 10460 -21654 -25372
277 -25372 -13125 -32427 4142 56928 25798 -601 20768 29665 39651 36321 -6589 -22218 10010
290 10010 24545 -1458 -33271 -35694 -22519 -9862 2833 -12273 -25875 -3924 3642 6644 15430
303A5430j8745P16J7610O371J5209k0007l1381J2098J1943Q412j1933l3912J3386
316a4803K2291m055q962k7697M211K9441m610k07n495j0678K3139M096q037Q723
330G357o964P954J4353l677Q056j2235j7763J5153L974l764j2232k3743J5853
343g678J2610j6302m273j5530K107K8400r238j1070O076m93J6307R990l591L709
357A1024K313J3108L000j0045J2359j1189k0338K0624m769k2136M811j3257q496
370b2991J2793j0527r952L613P039J0395n085N538J2938n138J7520Q221k0472
383C892J1729O980r782J939j3317j93K75j4016K0388r267k6777L1027j286j8717
397a7125K8128p120k3789J9563J3075j8848o281K4126j9403k6863N3220o038n3505
$$ plain form
303 15430 -3315 -2599 15011 21382 36591 16584 -14797 -2699 9244 17656 5723 -28189 -14803
316 -14803 7488 3433 -5529 -33226 -29015 426 -4184 -4391 -9886 -20564 2575 6671 -1366 7357
330 7357 393 8347 22700 19023 27079 14844 -2919 12234 16208 12444 212 -23531 -7678
343 -7678 4932 -11370 -15643 -31173 -29066 -666 -9904 -20974 -14898 -15391 916 10906 7315 11024
357 11024 13337 26445 29445 19400 31759 20570 232 20856 16087 -6049 -1238 -14495 -22991
370 -22991 -10198 -20725 -30677 -27064 -20025 -9630 -14715 -9177 3761 -1377 16143 24364 3892
383 3892 15621 22601 12819 14758 1441 1248 1523 -12493 7895 -1372 -28149 2878 1592 -17125
397 -17125 11003 3883 -19906 -343 12732 -6116 -12397 11729 -7674 -34537 18683 12645 -40860
410d0860N5831O663n7634N8998K1453o9176L1445M0635n5463k567M8724m1956
422c907l7556O0827j7930o2920P0897J0213q3299O1958M4227p4926L2362N0200
434E0146n7490Q233N4620m4611l4156N1952p716n4789K8868J1301m9522K5454
446a7710K9739m4965M450L7359j5129l995K8497N114k2733n651L3745K103l4213
459c389J4605R40l9727L7530L5663p1246j7793O4749k3292l1379P0522k1252q7477
472g1546P9244M0190j04024N6213N9631j36658K6635J32856r3415m1992J09783
483E6917p0176o5382J55444j361j40199R3460M4844j44404Q2231J05395j62800
494d6031q844J16698j07295j1848J46980r4717j21138J19407L0111p4577Q6795
$$ plain form
410 -40860 14971 21634 -36000 22998 44451 -24725 6720 47355 -8108 -10675 38049 -3907
422 -3907 -41463 19364 1434 -61486 9411 19624 -63675 -1717 42510 -32416 -54 50146
434 50146 -7344 889 55509 10898 -23258 28694 20978 -33811 -4943 6358 -43164 -17710
446 -17710 12029 -32936 -28486 8873 -6256 -10251 18246 23360 627 -5024 28721 30824 -3389
459 -3389 11216 12156 -27571 9959 45622 -25624 -43417 21332 -1960 -33339 37183 15931 -71546
472 -71546 7698 47888 -56136 77 59708 -76950 -50315 82541 -10874 -52866 56917
483 56917 -13259 -78641 76803 75442 -64757 28703 73547 -70857 11374 116769 -46031
494 -46031 -54875 61823 -45472 -57320 89660 -5057 -126195 -6788 23323 -51254 35541
505C5541J3637j43820N5121J22133p1181j1918N0933q7838p799J23388n458q3980
517a1241j0171K083P74N6855L0393q0367p1377M7132O5166q582k2569j3665m6299
530f1868J0336J11385K780j13905J1954M2626m3030P8780P3663j50556l7571J40805
542F5399m5380n0350J11290q0269j17604J64470M3588j57783O7023N8639j58204
553i9181O4195J48566j57307l6332J66918j03963q0855J75281n4771j30201J60536
564E2886J6019j65728J06627Q8431j53681L4011J09067j31699k333J55164r4505
575A4259r3238J11760l0842p4211J11993M495j15649M7896O3029n4674P803L4200
587B6821o1773p306R3536J3384o3665j6216J0123O73J2808J2830l1253m6174M5051
$$ plain form
505 35541 49178 -94642 -39521 82612 11431 -487 50446 -37392 -45191 78197 72739 -11241
517 -11241 -21412 -19329 -18555 38300 68693 -11674 -83051 -35919 29247 20665 -1904 -15569 -61868
530 -61868 -51532 59853 62633 -51272 -39318 3308 -39722 39058 112721 -37835 -75406 65399
542 65399 20019 -30331 80959 690 -116914 47556 91144 -66639 384 59023 -99181
553 -99181 -34986 113580 -43727 -80059 86859 -17104 -97959 77322 22551 -107650 52886
564 52886 68905 -96823 9804 98235 -55446 -21435 87632 -44067 -46400 108764 14259
575 14259 -78979 32781 1939 -72272 39721 44216 -71433 -23537 39492 -15182 -7379 26821
587 26821 -34952 -42258 51278 64662 997 -15219 -5096 -4423 8385 21215 -10038 -56212 -11161
600a1161O6541n5028l6775M5881l9122j3993J08991k4701j04218O9929L6777q2141
612c9020O2196M5933j43113K3265J50906q8569p3697J02743o0655n5664J67853
623I2178l0165j65556J15601O2845j37889O0394O3828j50702L4277J49978r7117
634b328n5304J12918p3361p9685J55286N367j34455Q2564N4043q8030N9206L0694
646F6915j31722J7124J08943m7942m8773M6789j4356l3306M9054l158o4540L3634
658b1338M8851l3916j686K5673j8691j4757J8376K4668j3249k6706K1878j77k4185
671a5259L3325j2133n5800N5678N8436o2121k8529M1132k3199j6388N5212l6198
683e844n6693R6775K7207j03006K6742L5087p9796L9040P4064p4682n200P7752
$$ plain form
600 -11161 55380 352 -36423 9458 -29664 -43657 65334 40633 -63585 6344 43121 -39020
612 -39020 23176 69109 -74004 -50739 100167 11598 -62099 40644 -20011 -75675 92178
623 92178 62013 -103543 12058 74903 -62986 -2592 61236 -89466 -55189 94789 -2328
634 -2328 -57632 55286 -18075 -97760 57526 62893 -71562 11002 65045 -22985 36221 66915
646 66915 -64807 -47683 61260 13318 -35455 11334 -3022 -36328 12726 9568 -54972 -21338
658 -21338 27513 -6403 -8089 17584 -1107 -15864 2512 27180 13931 -12775 9103 8926 -15259
671 -15259 18066 5933 -49867 5811 64247 2126 -26403 14729 -8470 -24858 30354 -5844
683 -5844 -62537 34238 61445 -41561 -14819 20268 -59528 -20488 53576 -21106 -26306 51446
695E1446m9536k8766P9344l9205q5338P6073N0369o1813J9605R029p8262M8746
707h308P4902q4709l2191O6195j0030j1653L0764l3779l2218N0209K3215l8666
719f269O857J6301m2465J709M1164j8580j3540J6654j563J3822J0607k9241k6997
732c1541O465L8962J4958l1406k919K1407N10l072k0006k6195J6108L4468K745
745B0484k4844R72J2929k1693M446J9676l3517j336L3877j1949N441J6462l9537
758a8589j5304M4184J9798k4314j4245J648l92K5551J0332m8380n264M8819r19
771B2925j5764j131k7227l817L0508J974j1571N321P02n790P369M316k3758j5436
785c1379K0811J9786J0742k03k8306q240K6298M922j6592j2348N642K5912J1891
$$ plain form
695 51446 1910 -26856 52488 13283 -72055 4018 54387 -7426 12179 21208 -57054 -8308
707 -8308 66594 -18115 -50306 15889 5859 -5794 24970 -8809 -41027 9182 32397 -6269
719 -6269 588 16889 -25576 -23867 17297 -1283 -14823 1831 268 14090 24697 -4544 -31541
732 -31541 -25076 13886 28844 -2562 -5481 15926 16436 13364 -6642 -32837 -16729 17739 20484
745 20484 -4360 -3388 9541 -12152 -7706 11970 -21547 -22883 10994 -955 4486 20948 -18589
758 -18589 -33893 10291 30089 5775 -8470 -6822 -7214 18337 28669 -19711 -24975 23844 22925
771 22925 7161 6030 -21197 -25014 5494 7468 -4103 1218 1920 -3870 3499 7815 -15943 -31379
785 -31379 -10568 9218 19960 19757 -8549 -16789 9509 14431 -2161 -14509 -8867 17045 28936
798B8936j4876j9505r091J1474J1252o319o230m200K283J0309n61o335p802m807
812a5472J5396J2944n923j1834j4413P415K4551J419j3604p361O695J6964l490
825A3287j9965j1106L665K2467J2846j1071q572o095K231R293r057j0297J043
838a1331N963J6566M712j4438j3154n991J2797J3413o906p646j195R100J4379
851A6269r134j6790j507O482J4768N300j3439r155K860R854N913q281p912J251
865c521O888P885o418j5961k887Q276J1101M519j1113q678L164O563L197p915
879d900p980R157J1598M964O8j3861j1650R620J0679l940o286PJ893P963Q108
894A5440j5166j8532J2692J2070l887N622p921j6572J7707J2213j9546l608Q241
$$ plain form
798 28936 14060 -5445 -14536 -3062 8190 1871 -4359 -8559 -6276 4033 3472 -2863 -10665 -15472
812 -15472 -76 12868 6945 -4889 -19302 -11887 12664 14083 479 -6882 -187 16777 13287
825 13287 -6678 -17784 -14119 8348 21194 10123 1551 -4544 -2313 6980 -2077 -12374 -11331
838 -11331 -5368 11198 15910 1472 -11682 -17673 -4876 8537 1631 -6015 -7210 1890 16269
851 16269 7135 -9655 -11162 -4680 10088 15388 1949 -7206 -4346 5508 11421 3140 -4772 -3521
865 -3521 3367 11252 4834 -11127 -14014 -5738 5363 9882 -1231 -9909 -6745 -182 3015 -4900
879 -4900 -12880 -3723 7875 12839 12907 -954 -12604 -2984 7695 3755 -2531 -2524 -631 7332 15440
894 15440 274 -18258 -5566 6504 2617 8239 318 -16254 1453 13666 -5880 -9488 -1247
907a247o336M637J6404j3052j9275J7152R126j0178J5043k602k5973J8322J7297
920A9318k2148l799R021p477O671J4630j6421j8712J7653Q997j5209N893N595
933D012j0599J1307R580j6799n508O553K25J345K904k417q292J09J4569p09j6294
948a0014K410P586j005J2427L591k4917l938K8569P72k0070Q767j612j9443K7023
962A0146J3680m2671N341K7381k8131Q411L3810l8880j8809M3538p874k4744L2561
975A3759n777m1163L7105K8528n2808O442L8470m0498N092M8106m1999j7542N1556
988B9271k0004l0652L8233j382l7044K5406J8370m1199O209L2578l3412o869L5680
1001A5185k3862j4733L4381o351j9539J4912M962q743P171J0278j1595j1559J7900
$$ plain form
907 -1247 -7583 -2946 13458 406 -18869 -1717 7409 -2769 12274 9672 -16301 2021 19318
920 19318 -2830 -6629 2392 -5085 1586 16216 -205 -18917 -1264 7733 -7476 -1583 4012
933 4012 -6587 4720 14300 -2499 -8007 -1454 -1229 116 3020 603 -7689 -7580 6989 6280 -10014
948 -10014 -7604 -18 -1023 11404 14995 -9922 -13860 14709 15481 -4589 4178 2566 -16877 10146
962 10146 23826 -18845 -13504 13877 -14254 -5843 27967 -10913 -29722 13816 5942 -18802 13759
975 13759 7982 -33181 3924 32452 -20356 -13914 24556 -15942 -10850 37256 -4743 -22285 29271
988 29271 9267 -21385 16848 15466 -21578 3828 22198 -19001 -12792 19786 -13626 -20495 15185
1001 15185 -8677 -23410 10971 4620 -14919 -7 4955 -3788 3383 13661 2066 -9493 8407
1014H407R172j8080o29R250j1888j373K0512p941k8606J5540J9058k7211P452
1027f337K6984m1314o178N3772k6232k8450M6550j6845l7951N5963J0368o1174
1039c0844K8510L5324n4931J4009N6083o0308k1479P2955l2575m0324O6291k0201
1051A2510n9856O1943J5222o5380L1209L1618n8993J2511N6822m6022k3208N6678
1063B5054k2606l1701N7331q452n1454L7064J6540l4759J6522J5376l2199j161
1075a4445K9511p853k0264J5185K485j9572J4089J5342j8391p747J3487M380j1009
1088d802N312J3356k4030m402L7591j8825k9018L6705k548l3336L4848Q778m8810
1101b9181K2186L7728m5616m097M8416l8018k3439O5030j9481n1484N5444L517
$$ plain form
1014 8407 17579 -501 -1130 8120 -3768 -5141 15371 7430 -21176 -5636 13422 -13789 -6337
1027 -6337 20647 -20667 -26845 26927 695 -27755 18795 1950 -36001 19962 30330 -30844
1039 -30844 -2334 32990 -21941 -7932 48151 -12157 -33636 39319 6744 -33580 32711 12510
1051 12510 -47346 14597 29819 -35561 -4352 27266 -31727 -19216 37606 -8416 -31624 25054
1063 25054 2448 -29253 28078 19626 -31828 5236 21776 -12983 3539 18915 -13284 -14445
1075 -14445 15066 7213 -13051 2134 4619 -14953 -864 14478 -3913 -11660 1827 6207 -4802
1088 -4802 510 13866 -10164 -14566 23025 4200 -24818 11887 9339 -23997 10851 19629 -29181
1101 -29181 -6995 30733 -14883 -18980 29436 -8582 -32021 33009 13528 -37956 17488 21005
1113B1005n5385M9561K3149p0388J9395M9510m8833l536N0164m3695k5691O3178
1125B8434j6080m7560M6094L130n0404L8050K5270m9430J1829L1525l5600J634
1137a3108L9258k2724k0593K9320k138j9807K1186M496k6601O809J5203j1896
1149e95N82R251j1568j3091P425J5439n116j2761O239m133p488K4355N940l0138
1163a5659K346K1726q726L423K2454k5584k4217L8278O417k7618K2548l466m1501
1176b9579L0683K9797m1824l375K3960k7747J757M3439k4088l4063L3924K226
1188E110k6206L4520N938m5274K1039K7809l2735O550K4431l0992m438L5261j2112
1201H901j8091K2275o279k4207K0644J1584k2272O404R054k0277L319J7151j2315
$$ plain form
1113 21005 -34380 15181 38330 -32058 -12663 36847 -11986 -15522 34642 -9053 -34744 28434
1125 28434 12354 -35206 10888 14018 -36386 1664 26934 -22496 -10667 20858 -14742 -13108
1137 -13108 26150 3426 -17167 12153 10015 -9792 11394 15890 -10711 -3902 11301 -595
1149 -595 -13 9238 -2330 -15421 -7996 7443 2327 -10434 -4195 -8328 -15816 8539 14479 -15659
1163 -15659 -13313 8413 -313 3110 25564 -20 -24237 14041 20458 -7160 15388 11922 -29579
1176 -29579 1104 30901 -10923 -14298 9662 -18085 -16328 27111 3023 -31040 2884 5110
1188 5110 -21096 13424 19362 -25912 -4873 22936 -9799 -3249 21182 -9810 -14248 21013 8901
1201 8901 -9190 13085 6806 -17401 3243 14827 -7445 -1041 8013 -12264 -8945 8206 -4109
1214d109p965J0115j738j833J0815K220j0588m421P559O015l71K219l978j0806
1228f866N922J2616p635j1835L594L894k018Q146J34j9005M568J6974j0251O63
1242a099J2979j5740m880J9390n586j4989Q263J423p284J4820N316k4507K28J9444
1256G778q447l236J0006j1684J474K0844r568j7036Q105L120n285P975L011j2066
1270e009O32J0028n622k317N602q089j577J4887R9j0273l240j011M902P041m171
1285A882r174P1R090K759q302m917L579O459O254m36n489j738J121J570N46k122
1301A153K80o33j26O663l048j2431k239K753O686O775p353p382O772Q015n38r689
1317d342m396P285O643M343m916r657M215L875k789K466k192l239M082J043J381
$$ plain form
1214 -4109 -12074 -1959 -3697 -5530 5285 7505 -3083 -7504 55 6070 5699 7918 3940 -6866
1228 -6866 -944 11672 4037 -7798 -4204 -310 -2328 5818 5952 -13053 -8485 8489 -1762 -1099
1242 -1099 11880 -3860 -8740 10650 5064 -9925 -1662 -239 -7523 7297 12613 -11894 -11666 7778
1256 7778 -669 -3905 6101 -5583 -4109 16735 7167 -9869 -1764 1356 -3929 4046 7057 -5009
1270 -5009 -4377 5651 29 -2288 3314 -4775 -6352 8535 8634 -1639 -4879 -5890 -988 6053 1882
1285 1882 -7292 -7221 1869 4628 -3674 -8591 -5012 1447 7701 7265 1776 38 1159 2729 3275 1153
1301 1153 1433 800 674 7337 4289 -8142 -10381 -7628 -942 5833 -1520 -8902 -2130 5885 5347 -4342
1317 -4342 -8738 -1453 5190 9533 4617 -5040 -825 3050 261 2727 535 -2704 1378 2421 3802
1332C802j428p130l97N618P023k7j2395n062P332L803k78p086l521J2061O505
1347H820m935o790n761N022P525m83l40o73K52K789k522k822k813n095L419P504
1363C097K925k398r017j680Q952K932m273n614j14J0744N091q878p486p13N907
1378e25N552l031n440j228K405K896k141l06J485k121N409O158n158m410l363
1393c818j261R519M833p871m730M242N342l494p348l901o97J2081O793j0988k751
1408d049M273k817J557M74o400J442O901K771j014j523k978m745O134R157n217
1423C966n322K399J045M728j90r872l151O108O802j946j0316k663L214J535M662
1438I99j505o198L719O138k003l652Q27j930j416J1910O269j1752m87M931p482
$$ plain form
1332 3802 2374 -4756 -5153 465 7488 7461 -4934 -9996 -2664 1139 861 -6225 -9746 2315 8820
1347 8820 3885 -2905 -8666 -3644 3881 3398 3058 2385 2637 5426 2904 82 -2731 -7826 -4407 3097
1363 3097 6022 3624 -5393 -7073 1879 4811 538 -5076 -5190 5554 10645 1767 -5719 -6432 -525
1378 -525 5027 1996 -3444 -4672 -2267 629 -1512 -1818 -333 -2454 2955 9113 3955 -455 -3818
1393 -3818 -5079 4440 9273 1402 -3328 914 6256 2762 -4586 -8487 -9184 2897 9690 -1298 -4049
1408 -4049 224 -2593 -1036 -562 -6962 -5520 1381 4152 3138 1615 -1363 -6108 26 9183 3966
1423 3966 -1356 1043 2088 6816 6626 -3246 -6397 -289 6513 4567 -5749 -8412 -5198 -3663 999
1438 999 -506 -6704 -2985 3153 1150 -2502 -1675 -3605 -5021 6889 13158 1406 919 5850 -1632
1453a632L843O079j4042r95J7478l302j1069M579m536q379J2858L124j6630O419
1467f205J3641j1753K36J0861j3634k058K0387n112j1351J0269j912r058J2875
1480G186L226j7911K941J3723p356k349N189j3547j723J8851o69j1229J801l19
1494b186k265O200J496j0113m000J0594O861l322j315l645n931O112J0302k759
1508F029r070L686N833n537K998L436j7597m22J8822p941p624J2668q031j0540
1522a3290J9110L093j9131R725J2393j6972M378J6046k2007m282K5526j3603j4419
1535a3433K2421p105j9206K1421K800k2784J4966J4585k0271M670J7552j9761
1547d145n578K2556j0352j2679J9685m097j6651J5986K581j9254Q586J0420j2108
$$ plain form
1453 -1632 2211 8290 -5752 -6747 10731 7429 -3640 939 -3597 -11976 882 4006 -12624 -6205
1467 -6205 7436 -4317 -4081 6780 -6854 -8912 11475 6363 -4988 5281 3369 -5689 7186
1480 7186 10412 -7499 -4558 9165 1809 -540 4649 -8898 -10621 8230 7561 -3668 -1867 -2186
1494 -2186 -4451 1749 3245 -6868 -10868 -274 6587 3265 1950 -1695 -7626 -1514 8788 6029
1508 6029 -3041 645 6478 941 3939 7375 -10222 -10644 8178 237 -7387 5281 -2750 -13290
1522 -13290 5820 8913 -10218 -493 11900 -5072 -694 15352 -6655 -10937 14589 986 -13433
1535 -13433 8988 1883 -17323 4098 6898 -15886 -920 13665 -6606 -1936 15616 -4145
1547 -4145 -9723 12833 2481 -10198 9487 5390 -11261 4725 7306 -11948 -3362 7058 -5050
1560e050J880J1146p217m663P627l162p720P108M921q481k033M822o96j107M860
1575B235M79p351J837J2666l054p108P944n896j0346J7586N578k1034J098P571
1589B205j3374O832J6770k0555j2267K4191p56j1764J9729n999k5801K2141J6455
1602A7807k2495P696J0957k6838M319K9318j6825j5312J8523q775j1760K7791
1614A4406j04k8714J0423J0857j6913J1122J4154k4797n523J9311o274l367J4014
1627H595j0122j4643J5066J1341p859L40P96j0234M691J5809l806j1102j266l08
1641b702J077O291K411r737j0268Q278J0036m781R97p58j3832O358J9071o876
1655E565j1036O541l298n459J6911K620k2273M096J4158j2288N011J4168k1347
$$ plain form
1560 -5050 -3170 7976 759 -3904 3723 561 -7159 -51 4870 -3611 -5644 -822 -1518 -2625 2235
1575 2235 2714 -4637 -2800 9866 6812 -296 7648 1752 -8594 8992 14570 -6464 -5366 2205
1589 2205 -11169 -4337 12433 -8122 -20389 3802 3046 -8718 11011 5012 -20789 1352 17807
1602 17807 -4688 3008 13965 -12873 -8554 20764 3939 -11373 7150 -1625 -13385 14406
1614 14406 14302 -14412 -3989 6868 -10045 1077 15231 -9566 -15089 4222 -2052 -5419 8595
1627 8595 -1527 -16170 -1104 10237 2378 2718 3514 -6720 -2029 13780 9974 -1128 -2394 -2702
1641 -2702 -1625 4666 7077 -2660 -12928 -4650 5386 605 1602 844 -12988 -6630 12441 5565
1655 5565 -5471 1070 -2228 -7687 9224 11844 -10429 -6333 7825 -4463 548 14716 -6631
1668f631o001K3226o794j0447J4589o328j5470J7490P929j9599M391J1587j5876
1681g934K874J7489j5231p321J7534o429q960J4440k786j2646R921M736j1267
1694e580L336P988q680j515R702m733m602P879j302n900N374J642m440J177K148
1709B494j815k073J973J595m019k33L990l591j790N238k219m638M825K588n948
1724c623R75O059n227q66Q746n842n023J0620k034p370P743K43q763O257M331
1739F226q982O54O855p245k713R634n234p117Q931o46o495P936J05p777N545M261
1755C938n876R30M745l512k006N866j908m178N319p89n306M410J205m017J232
1770E3O78k069P45J042j047j541O54J188j507R57J091j826q0J748P31l5q40J04
$$ plain form
1668 -6631 -12632 10594 3800 -6647 7942 1614 -13856 3634 11563 -8036 -3645 7942 -7934
1681 -7934 -5060 12429 -2802 -10123 7411 982 -7978 6462 3676 -8970 951 5687 -5580
1694 -5580 -2244 5744 -2936 -4451 5251 518 -4084 3795 2493 -3407 1967 3609 -831 346 2494
1709 2494 679 -1394 579 2174 -1845 -2078 1912 -1679 -3469 1769 -450 -5088 -263 2325 -3623
1724 -3623 -2648 3411 -1816 -2682 6064 222 -4801 5819 3785 -3585 4158 4401 -4362 1895 6226
1739 6226 -2756 -2102 4753 -2492 -5205 4429 -805 -7922 1009 363 -6132 1804 1909 -5868 -323 3938
1755 3938 -1938 -1008 3737 225 -1781 4085 2177 -2001 3318 2529 -2777 1633 2838 -1179 53
1770 53 731 -1338 -593 449 -598 -2139 -1485 -297 -1804 -847 244 -1582 -1662 86 817 782 -58 46
1788D6l53O23K703r99l357K291J261j884J204q29k729J893K039j746j055M88q26
1805a230o96K557m83l277K046J805j536J598K11l324J425K746j354m93j44j75
1821c24N14J032n07k431R57K135p13P01l18k390J830J680r01m96j078K1J343n68
1839D87j133j884n34K375M96k62o97j278J649J446l95R4r76N03K714j05j070j373
1857E7j664J909J518j043j151p41J371J780r48j141j359R03K583l50j937q68j483
1874b564J077J233j895q28Q61K52J626J009j342r70J331L060J334j061j100j027
1890I96J397J720l138l186R08R86O42J33l326j260K451J269J26m63J3L83R17J327
1908A895j117k698M51P54J330K073k430k657J707K103J022j473j625K153K057
$$ plain form
1788 46 -307 316 3019 2020 -1337 954 2215 331 1535 706 -2023 -130 1909 163 -892 -404 -1230
1805 -1230 -1926 631 148 -3129 -1083 722 -814 784 995 -2329 -904 1842 488 -5 -149 -324
1821 -324 190 1222 715 -1716 -759 1376 663 1364 1046 -1344 486 2166 1265 769 -309 -288 1055 487
1839 487 -646 -2530 -3064 -689 -193 -455 -1152 -2430 -781 665 270 364 -612 -109 2605 2500 1430 57
1857 57 -1607 302 1820 777 -374 -1115 256 2036 1088 -53 -1412 -509 2074 1724 -213 -1081 -2564
1874 -2564 -1487 -254 -2149 -2977 -2116 -1864 -238 771 -571 -1541 -210 2850 4184 3123 2023 996
1890 996 2393 4113 975 -2211 -1303 -317 325 458 -2868 -4128 -1677 -408 -282 -745 -732 -349 568 1895
1908 1895 778 -1920 -1469 -715 615 2688 258 -2399 -692 1411 2433 960 -665 1488 3545
1923C545K98j120m326m81K990n09k213r5o78p0J261K31j999l00L504N98Q96K698
1941D230l602l084N680R58l870L83j136j294M699O39p662j493N991P51q29K576
1957B937l919k604P102j40o223K772Q61l979M607K877p074k207L433m8J391L481
1973C267l351l823O242L492n942j125J095j144M300J635n808j854K875J200j967
1988i08p50J388p96P39M404k340m404J891R37j58K378k37n638j292O961l22o465
2005d612K499J047k477Q390J066j1556L048P411n403N64O327o172l605R260k489
2020C298r115O860J256r557Q194O318j2104J219Q538q655j027Q996o671l141J1385
2035E794j857j1088N899N231o742L350M116r562K907J0870o226n992M655j923
$$ plain form
1923 3545 3843 2723 -1603 -2084 906 397 -1816 -1911 -2589 -2659 -1398 -1167 -3166 -3466 38 636 1532 4230
1941 4230 628 -2456 3224 4182 312 695 -441 -1735 2964 3603 -4059 -5552 439 1190 361 2937
1957 2937 -982 -3586 3516 3376 -2847 -75 786 -3193 1414 4291 -2783 -4990 -1557 -1605 -214 3267
1973 3267 -84 -3907 2335 5827 -115 -1240 -145 -1289 3011 4646 -1162 -3016 -141 1059 -908
1988 -908 -1658 -270 -1066 -327 4077 1737 -2667 -776 161 3 2381 2144 -3494 -4786 2175 1853 -4612
2005 -4612 -2113 -1066 -3543 4847 5913 -5643 -2595 4816 -587 -23 6304 132 -3473 5787 3298
2020 3298 -5817 1043 2299 -7258 936 7254 -4850 -3631 4907 -3748 -4775 4221 -2450 -5591 5794
2035 5794 3937 -7151 -1252 3979 -2763 587 4703 -4859 -1952 8918 2692 -3300 1355 -568
2049e68j313P546k00q982j350M633r9P70J984n774m435Q265N716n682m998K54
2065d233M40L673P784k979j0712L517O994n036K292M169j0483m36J3066l172p431
2080b547N174l325q716J1608O623j4284J373R296j0832J461J2520j1175n716J4026
2094E486l698q510J1712L04j3516P007P953j0700L843J0202j3404l791J3456n414
2108I30n309J0352m071q794R355L705r144Q12L262o324K416R943n165p642M842
2123h32J77k138N085p5o158R81O650K73m618N98j05l940M887N546o897l222O370
2140B582j849l278O165j573p967O628O144r121n44P043p850j675J1914o468q197
2155h046J1460r56r776Q613K379j0819O748Q879j0833j124J0204p659m611J2160
$$ plain form
2049 -568 -1881 5665 5465 -3517 -4867 -234 -333 437 2421 -3353 -7788 477 6193 511 -4487 -4233
2065 -4233 -3793 -120 7664 4685 -6027 -2510 4484 -552 1740 5909 -4574 -5010 8056 4884 -2547
2080 -2547 2627 -698 -9414 2194 8817 -5467 -4094 5202 -5630 -4169 8351 -2824 -8540 5486
2094 5486 1788 -6722 4990 5294 -8222 -1215 6738 -3962 -119 10083 -3321 -7112 6344 930
2108 930 -4379 5973 1902 -6892 2463 6168 -2976 -2164 1098 -5226 -2810 7133 1968 -5674 -832
2123 -832 -655 -2793 2292 2217 -3941 -2960 3690 3963 -655 -57 -162 -4102 785 6331 -566 -3788 2582
2140 2582 733 -2545 3620 2047 -5920 708 6852 -2269 -2813 4230 -3620 -5295 6619 151 -8046
2155 -8046 3414 2458 -7318 1295 3674 -7145 -397 8482 -2351 -3475 6729 -930 -5541 6619
2169F619n188q512J2323N86j1132O481K713r467M742O935q419j753Q340l942m610
2184d284O883k889o744P579L006o529J628K440l574J774M467k564l723L489L121
2199D080k833p40J295l560L30N387j821m986J678K046k728Q58L142m798j678P958
2215C630j145n828M315p91n534O903L480q875J357O384m651l51N357n510l546
2230d805R263J01p430M418J541p396M977M576r056M75O444m622p69N114m425l394
2246d988O499J447n012K158J685m377K789L842n929p13M881j890j341K117j687
2261e19j588K594J578j639q05J980n26j045J801j244k364J434J344j299o75L9
2277i34k24n98K095k1l108J513L252j761k52J688k718J11L692j374k656J714J06
$$ plain form
2169 6619 1431 -7081 5242 5828 -5304 1177 3890 -5577 -835 6100 -2319 -4072 4268 326 -4284
2184 -4284 2599 -290 -7034 545 3551 -2978 -1350 1090 -2484 -710 3757 1193 -2530 959 4080
2199 4080 1247 507 1802 -1758 -1428 3959 2138 -2848 -1170 876 -1852 -994 2148 -2650 -4328 3630
2215 3630 2485 -3343 972 181 -5353 1550 5030 -3845 -2488 3896 -755 -1106 4251 -1259 -4805
2230 -4805 4458 4559 -2871 1547 3088 -4308 669 5245 -3811 -3336 3108 -1514 -2283 2831 -1594 -4988
2246 -4988 1511 2958 -2054 104 1789 -2588 201 4043 -1886 -2599 2282 392 -949 1168 -519
2261 -519 -2107 487 2065 426 -379 1601 1075 30 1831 587 -1777 -343 1001 -298 -973 -934
2277 -934 -1158 -1756 339 318 -2790 -1277 1975 214 -38 1650 -1068 -957 2735 1361 -1295 419 525
2294E25j447J805P94l386M59L617j773q05K335k823j111L822r81k682J306J1j291
2311a625J380M18k048k61K736j10j011J729j288n77K549m84j578R49k83j14O92
2328A074o08o50m05P08M51r00K68P4m05P04k6r33M96l91K82N26j159J46N8m15
2348a105J559o54o00J160k9n3P08n49m1K95N33J56j148K28J08q88P69l41j078
2367i70J046l39n76Q71l04p64J28J85J22K0L8J12k34Q45M56j004R26K42o35Q73
2387A038J32o31N69k18o46L90j42l28n42j68O01p97K91J92j006P07N32q13K95
2406e44j46J30N31k22L80o5m62J221l50n24J194j002k9J151J02o85m92K91J57
2425F36j027O78o69j668J980N33k222J416L9j323J915M62j704J35J538j2j569
$$ plain form
2294 525 -922 883 1677 -1709 -1250 2367 594 -211 2124 -699 -1810 2012 1031 -1651 -345 -334 -1625
2311 -1625 -245 173 -1875 -2136 600 490 -521 1208 -80 -657 1892 1408 -170 779 496 382 1074
2328 1074 466 -184 -589 119 570 -330 -62 12 -393 311 285 -648 -152 -543 -261 265 -894 -748 -690 -1105
2348 -1105 454 -200 -800 360 331 278 986 437 396 691 1224 1380 232 460 568 -320 449 108 -970
2367 -970 76 -263 -839 32 -272 -1036 -908 -723 -601 -581 -543 -431 -665 180 636 -368 558 800 165 1038
2387 1038 1170 539 1108 890 244 634 492 164 -378 -546 55 -742 -451 -259 -1265 -558 -26 -839 -544
2406 -544 -690 -560 -29 -251 129 64 -398 823 473 -51 1143 141 112 1263 1365 680 188 479 636
2425 636 -391 287 -382 -2050 -70 463 -1759 -343 -304 -1627 288 750 -954 -819 719 707 -862
2442h62J853l45k590K664J295l480J374J311k450J746J910k973l37K608n99j335
2458b10Q89m31k729K666K112m003O0J906k059R66K173k471j225K372J068q12K74
2475E46j32j239L32K744j255k298K146M6j287J569O9k189K04K560n22k980K028
2492C42O62l506K725J715n481J382M461l505j167L317k531j493O138m02o113L502
2508D6L871n195K287L696q052O45Q122m236l202M861m071l492P606M89p616K298
2524a943M025m423K309M666q635j201Q639k108l265L927k347l392N478J885n066
2539a451J33L613k429k6L820l020l953M030J485l037Q61R30k641J61L268j749
2555el993L651L463m390nL592m175l66O470m440m627P175N27n621L809K067q208
$$ plain form
2442 -862 991 646 -1944 720 2015 -1465 -91 1220 -1230 516 2426 -547 -884 1724 1125 -210
2458 -210 679 248 -2481 185 2297 -1706 -1646 260 -1799 -833 1340 -1131 -2356 16 1084 272 546
2475 546 414 -825 -493 2251 996 -1302 844 890 -397 1172 1241 -948 -744 1816 1294 -1686 342
2492 342 1004 -2502 223 1938 -3543 -2161 2300 -1205 -2372 945 -1586 -3079 3059 2657 -3456 46
2508 46 3917 -1278 1009 4705 -3347 -2702 5420 1184 -2018 2843 -1228 -4720 2886 3375 -4241 -1943
2524 -1943 2082 -2341 -32 4634 -4001 -5202 3437 1329 -1936 1991 -356 -3748 1730 3615 -1451
2539 -1451 -1318 2295 -134 -160 3660 640 -3313 717 2202 -835 26 956 -1685 -1524 1744 -5
2555 -5 -3998 -347 3116 -1274 -1279 2313 -1862 -2228 4242 -198 -4825 2350 2877 -2744 1065 3132 -5076
2572e076L308Q101p135k561Q127n573l707J0833l899j0206Q752L706p794M839
2586A715K303j0756L177J0946p573m942Q548l602m804J0384k156j0860O946M459
2600C785o846M109M149r259j19Q641k650m363M512j013l806O283J533q200L19
2615b925N370k526j086L097k028l123L262J663m785K36N424k614k767N378j073
2630A503n599N055K672o614K026N788n645q03P267o136n958J0232R52r000N675
2645A415K090r408O258O633j2324p12J0630m934l110Q542n321q204J0756K785
2659E096j0147N666M391j0283M717Q748j0064l182Q705k891k418O869l493q040
2673f326O592M797p695L75M356m500J900N383o202l973N133J718k125J281Q58
$$ plain form
2572 -5076 -1768 6333 -802 -3363 4764 -809 -4516 6317 2418 -7788 964 4670 -3124 1715
2586 1715 4018 -6738 -3561 7385 -188 -5130 3418 -184 -4988 5396 3240 -7620 -674 3785
2600 3785 -3061 1048 5197 -4062 -4181 4460 1810 -2553 1959 946 -2860 3423 4956 -3244 -2925
2615 -2925 2445 -81 -1167 1930 -98 -3221 41 1704 -3081 -2845 2579 -35 -2802 2576 1503
2630 1503 -4096 959 3631 -2983 -957 4831 -814 -1617 5650 -486 -6444 3788 4740 -4260 1415
2645 1415 3505 -5903 355 6988 -5336 -6048 4582 -352 -3462 5080 -241 -8445 2311 5096
2659 5096 -5051 615 5006 -5277 -560 8188 -1876 -5058 3647 756 -1662 5207 1714 -6326
2673 -6326 266 5063 -2632 -2257 2099 -2401 -501 4882 -1320 -5293 -160 1558 -567 714 1572
2688A572l908P46N693k275n135K320J635q69L475K15p039q70O777J23m307K659
2704H12o96m010O808K681r609J079N894m306Q75N928o459m592P753j47o106M947
2720H52J427p223N041N461q990j32P354m948j101O883m086l810P036j048p188
2735d472L358L756m039K353L241o887n24O704k756k914K988j812j262M910M6n229
2751b539j376K563R53Q20J693l536k444M583K585k180j313m09N40K581K005k043
2767B483n034M92L547j163j9O31m445J155M503k088k994J345M98N3L576M97n150
2784b113r0M434k166r71L001l247m25N291j911l762J782M39r23K593N73l937K17
2801a215L688j944k299J660j717n57M208j161l548J599P16l2J621k68j438P12
$$ plain form
2688 1572 -2336 -1590 4103 1828 -3307 -987 648 -221 3254 3469 -3570 -4440 2337 2460 -1847 812
2704 812 116 -3894 2914 5595 -4014 -2935 2959 -1347 -472 5456 -1003 -5595 2158 2011 -4095 852
2720 852 2279 -4944 97 5558 -3432 -3564 3790 -1158 -2259 4624 538 -3272 3764 2716 -4472
2735 -4472 -1114 2642 -1397 956 4197 -2690 -3214 3490 734 -2180 808 -1004 -2266 2644 2690 -2539
2751 -2539 -3915 -1352 -399 421 2114 -1422 -3866 717 3302 1122 -191 -600 -60 2521 4526 2483
2767 2483 -2551 -2059 1488 325 306 937 -3508 -2353 2150 62 -2932 -1587 -1089 -1036 2540 3037 -2113
2784 -2113 -2203 2231 65 -906 2095 -1152 -1577 3714 1803 -1959 -177 262 -661 1932 2505 -1432 -1215
2801 -1215 2473 529 -1770 -110 -1827 -2384 1824 663 -2885 -1286 -570 -602 1019 751 -687 25
2817B5K211p4j927l70Qj05K105J2l127r1P87K30O04j405m80J199J311J234j791
2836C56j977J188O73M15M31j676o68J348P54o27j571n9Q73N86J886q43k696J493
2854a14R56l19Q69j458j126J673J167r61j798l93Q02J102Q50p10k087J244J149
2871H46p00j2o53p42J639O46q71q30j011O53R82N65m43j070Q91J449q0n27r69
2890b37n91J971Q80r99r95o16L85Q52o66q37m43k6J553K23j040n67j80Q54J328
2909H49j86j090r3M23J238n10p33km72J639J002k193m80R01m47R75J87j684o7
2928g43J139L23j214k08q6r52J541J282k153r4J412r17O35J133j776l89K512p7
2946A368j006n1J6q74J238R46k191m86J607m87m29R64j505q42K063M04j072j94
$$ plain form
2817 25 2236 2162 235 -135 -127 -232 1873 1885 -1242 -1333 -546 -316 288 -1117 -1597 -398 913 2147 356
2836 356 -1621 -433 240 655 1086 -590 -1258 90 844 217 -1354 -1413 -540 46 1932 1089 -1607 -114
2854 -114 842 523 1392 -66 -1192 481 1648 687 -1111 -1504 -702 400 1250 540 -1547 -303 846
2871 846 146 134 -519 -1261 378 1024 153 -677 -1688 -1035 -53 512 69 -1001 -110 1339 1259 732 -237
2890 -237 -828 1143 2023 1024 29 -587 -202 650 -16 -853 -1296 -1322 231 454 -586 -1153 -1333 -479 849
2909 849 663 -427 -520 -97 1141 631 -102 -104 -576 1063 2065 -128 -608 293 -154 821 1008 -676 -743
2928 -743 396 719 -495 -703 -789 -1741 -200 1082 -1071 -1165 247 -670 -35 1098 -678 -1067 1445 1368
2946 1368 362 311 327 -547 691 1637 -554 -1040 567 80 -349 615 -890 -1732 331 735 -337 -531
2964e31L17l74N27J014q32j203R79R50j059K55L58j260N20J667o58j320Q27P32
2982I09j475O35J626k828k8L160j910j557K789j261k009K671L77l244J842K270
2998A967l343J51L562l587q10M763k913k695M762o82l422L435R03m176J708L504
3014C127l780o42L764k824k036N507j796l976L455K86l281K724J365m031K98L155
3030A315j539j403K916j109k784K929J735k843O27J261j812K61K443l79k870Q83
3046c69J946k403O94L087l809k001M805r54l308L554j86n225L290M300m997p10
3062b286M924m128j843P712k765o292O527M81o022N854K443q190J919O117n546
3077a095j293O672m836m740Q343n62o941N983P92p442N121M204o861Q30N032m334
$$ plain form
2964 -531 -214 -588 -61 953 121 -1082 -103 847 -212 43 401 -859 -339 1328 670 -650 177 909
2982 909 -566 69 1695 -1133 -1161 1999 89 -1468 1321 60 -1949 722 1099 -2145 -303 1967
2998 1967 -1376 -1225 2337 -1250 -2060 2703 -210 -2905 1857 1175 -2247 1188 2091 -2085 -377 3127
3014 3127 -653 -1295 2469 -355 -2391 3116 1320 -2656 799 1085 -2196 528 1893 -2138 -1840 1315
3030 1315 -224 -1627 1289 180 -2604 325 2060 -783 -156 1105 -707 -446 1997 1618 -1252 -369
3046 -369 1577 -826 -132 2955 -854 -2855 1950 996 -2312 1242 1056 -4169 -879 3421 -1576 -2286
3062 -2286 2638 -1490 -3333 4379 1614 -4678 1849 2330 -3692 2162 4605 -3585 -1666 4451 -1095
3077 -1095 -2388 4284 -552 -5292 3051 2489 -4452 1531 2323 -5119 2 4206 -2655 -1825 3207 -1127
3093a127j656N688j585n128M733J386n436L364L048n211P84L667k569j293K853
3108A518k94k905J200K979l290j088M229k197k818M114l79m111L216K610m616
3123a832m16N138l126k762O468k110o787O738J971p142M977K739q535K681P909
3138E911o209k747O319l763m004R607m58j0228M935L735p148N111M584j0519j41
3153e015Q734l727k109N596m610n162Q313L215p060J074K291n309L781O649o499
3168A62l726M616j040j019M040j575m708J217M227j162j420J745k487l051M945
3183G64J881l912M60J493k336j45M513j378m432L309J557m601M190L701p391l92
3199b719N237l358K3N663m904n694O681K413n718L325J294p695L735P709o460
$$ plain form
3093 -1127 -2783 2905 1320 -3808 925 2311 -3125 239 3287 -1924 -1140 2527 -42 -1335 1518
3108 1518 1224 -1681 -481 2498 -792 -1880 2349 152 -2666 1448 1069 -3042 174 2784 -1832
3123 -1832 -2248 2890 -236 -2998 3470 1360 -5427 1311 3282 -3860 1117 3856 -4679 -1998 5911
3138 5911 -298 -3045 3274 -489 -4493 5114 4656 -5572 -637 3098 -4050 1061 5645 -4874 -5015
3153 -5015 3719 -8 -2117 3479 -1131 -6293 2020 5235 -1825 -751 1540 -3769 12 6661 162
3168 162 -3564 1052 12 -1007 3033 1458 -3250 -2033 2194 1032 -388 1357 -1130 -4181 764
3183 764 2645 -1267 -807 686 -1650 -1795 2718 1340 -3092 217 1774 -2827 1363 5064 -2327 -2719
3199 -2719 2518 -840 -817 4846 -58 -5752 929 3342 -2376 949 2243 -5452 -1717 5992 -468
3214d68k466M857m633o21Q976k469q011L932K437l321L816J508q063J015P846
3229D335k742k988K826l159j768O411K80n159J356J484j962J724J741l488k235
3244c344L796J629k268J06j86k059K444K195k661k001K415J628k031K68O56k509
3260a922J421L701k919k310L151j005j538L394q73l750K606L002k825p01J813
3275A245l521p2N462k558m127L960N95k573K435m63m021L024L847k991j004K267
3291A505j897o87L642j596l193K938J174k347J201N6l415J348L057j206j723M83
3307f60k32N61J477j037k513J151K666r3p93p86j221R88J917j58j309n86J120
3324D92O91l86j57j537j071K381J535j606q92o46k9J565P56j896j434K073J738
$$ plain form
3214 -468 -2934 1923 -2710 -3331 5645 3176 -4835 -903 1534 -1787 2029 3537 -4526 -3511 4335
3229 4335 1593 -1395 1431 -1728 -3496 2915 3195 -1964 -608 876 -1086 638 2379 -1109 -3344
3244 -3344 452 2081 -187 -81 -267 -2326 118 2313 -348 -2349 66 1694 -337 -69 587 -1922
3260 -1922 -501 3200 281 -2029 1122 117 -1421 1973 1100 -2650 -44 2958 133 -568 1245
3275 1245 -2276 -2348 3114 556 -3571 389 984 -1589 846 383 -3638 -614 3233 242 -762 1505
3291 1505 -392 -1079 2563 967 -2226 712 1886 -461 740 796 -2619 -1271 1786 580 -1143 -660
3307 -660 -892 -331 1146 109 -2404 -1253 1413 1320 527 -259 -1480 -492 1425 1267 -42 -628 492
3324 492 1183 797 640 -897 -1968 413 1948 342 -550 -1196 -1225 340 1096 -800 -2234 -161 1577
3341A577r69l45r77j208K480J485j980l98N42j17N96J99j259j254J470J817r34
3358G25k55p11j581J981J441k026m70M29M39J318m82j897p03J228K010l26j133
3375a3l70m62J383P76j761p40M50O60J410n06j835l19N58J339R07j609k92O04
3393A80Q13N76j321j549N17J174J159o13j888j64L29P69N87j734m07J717L23N41
3411A009k90k177M32J636O22l18j303L4M83O60L42k106n95K308k7N51m18k407
3429a564L08J988k0n96q67j17Q15M88J26k102r95K324P37m0P07k201L19J997k43
3448A064n71n96j22J341L39k19j555j735J715O96o69L06q34m15J770R1j110q13
3466a317K82J850N3l63k71j709J139K268k015r91J244m25N90J373j533k066J295
$$ plain form
3341 1577 608 263 -714 -1922 558 2043 63 -335 207 90 686 885 -374 -1628 -158 1659 725
3358 725 470 -241 -1822 159 1600 -426 -896 -467 -28 1290 808 -1089 -1792 -564 1446 1120 -13
3375 -13 -383 -845 538 1314 -447 -1187 -737 -77 1333 827 -1008 -1327 -769 570 1477 -132 -424 180
3393 180 993 1569 248 -1301 -784 390 1549 936 -952 -1116 -787 -18 569 -1165 -1572 145 468 1009
3411 1009 719 -1458 -1026 610 1232 914 -389 -355 128 788 1130 -976 -1571 737 710 1261 843 -1564
3429 -1564 -1256 732 712 116 -751 -868 -53 435 561 -1541 -2536 -212 525 485 1192 -1009 -690 1307 1064
3448 1064 493 -103 -225 1116 1455 1236 -319 -2054 -339 357 -312 -6 -840 -1255 515 606 -504 -1317
3466 -1317 -1035 815 868 505 234 -1475 -336 1932 -83 -1074 170 -255 335 1708 175 -1891 -596
3483e96K047p31o10P98k551L28L601k179k651K459n19l36L050j568l418J772K428
3500A324j152J06J024k129k69L839j500l454K607j17j746K940j35l120R72J708
3516H98j096m65J343q64q39K462m2l074J194J671j532K41O00j506O5J801J43k547
3534a547K89K381j004m5J805k681j463L729o6k542J396N14k392J828K713m036
3550a121j528M288j381j975M173j902m000M566J587n063J766K676m044J082M344
3565C468m826j962N706j450l566M208j27m830M741K448n928O28L970l320L82L957
3581C499m085l173M924J048l561J541M05l702K875L906m208j725K247o24j26K955
3597B196o57m044Q40L469j037j054J760j927k150M216J178m036P32J677k842O54
$$ plain form
3483 -596 1451 720 110 908 -1643 -1315 2286 107 -2544 -85 -604 -940 2110 542 -2876 -1104 1324
3500 1324 172 278 1302 -827 -1096 2743 1243 -2211 396 279 -1467 1473 1338 -1782 -810 898
3516 898 -198 -663 680 -184 -1023 1439 1397 -1677 -483 1188 -344 -103 497 -1009 -944 857 1000 -1547
3534 -1547 -1258 1123 119 74 1879 -802 -2265 1464 1398 -1144 252 766 -1626 202 2915 -1121
3550 -1121 -2649 1639 258 -1717 2456 554 -3446 1120 2707 -2356 -590 2086 -1958 -876 3468
3565 3468 -1358 -3320 2386 936 -2630 1578 1451 -3379 1362 3810 -2118 -1490 2480 -840 -458 3499
3581 3499 -586 -3759 1165 2213 -1348 193 598 -3104 -229 3677 -531 -2256 -9 -633 -759 2196
3597 2196 1539 -2505 -1665 1804 767 -287 1473 -454 -2604 1612 2790 -1246 -514 1163 -1679 -1025
3613a025M149k830l465M425m85l965M568J355o156K150M260n132O47N738m923
3628f89l354O643j229l943N455l77p648M679N080o116N01M278o105l23P868l217
3644A503n183M533m24l671N895J386p149P65M477k885M89L393m606k760N800P66
3660B329l260J398l42k790K308L749k891k705K220L40j383K736L45m375O54L500
3676A833j198j560K277j184k989L755K189n192J051L275m376J49N153l848k632
3691c297M985p99l998M419J262n771K444M773n629J47N942n303k142O852l165
3706G20m083N484n66n152L928K473n370J270L929m325p94N290k921k956M974r53
3722I48l603L925M94l774J783K080k424l55K709j372j865K724L96k824J457Q48
$$ plain form
3613 -1025 3124 294 -3171 1254 769 -3196 1372 2727 -3429 -1279 2981 -2151 -1504 4234 -689
3628 -689 -4043 2600 1371 -2572 2883 2506 -5142 -463 4617 -1499 -998 3280 -2825 -3148 4720 1503
3644 1503 -3680 853 429 -3242 2653 4039 -3110 -2345 2132 -753 -264 3129 -1477 -4237 1563 2329
3660 2329 -931 467 125 -2665 -357 3392 501 -2204 16 356 -1027 1709 2054 -2321 -1667 1833
3676 1833 635 -925 1352 168 -2821 934 3123 -2069 -1018 2257 -2119 -1970 3183 -665 -3297
3691 -3297 1688 889 -3109 1310 2572 -3199 -755 4018 -1611 -1464 4478 -825 -2967 3885 720
3706 720 -3363 2121 1555 -3597 331 2804 -2566 -1296 2633 -1692 -2486 2804 -117 -3073 1901 948
3722 948 -2655 1270 1764 -2010 -227 1853 -571 -926 1783 411 -1454 1270 1666 -1158 299 1147
3738A147k717Q16J980j450j279J230L63j585R41J709k494n41L807j534j394K940
3754A939j285k045K860O48l188O01K106k501m53L748k847k589M405p36k956L680
3770A387l92l853L314J843l564M39K307k063o77L496k006k744L664J33l012K747
3786A019L06l045J763J692k360j45J293q88m46J750n16k290J514J409j760O13
3802i1P33j332Q15J279r00q04K54M85j81m63Q34j233o10J807m46j346J013o2p33
3821i81J174N93j325k83J369L62r28P91j68j634K005N20k500O03J079r75O80M84
3839H66j721j91J486l4j271L88N00j238J316J093k120j04J261o12Q84Q29j756
3856d24M4J219M43q85n71Jo4J019M28j844n56J130k82K65o1p57L3N32O53j70p17
$$ plain form
3738 1147 -1570 -754 1226 -224 -1503 -273 90 -1495 -554 1155 -1339 -1880 1927 393 -1001 1939
3754 1939 654 -1391 1469 2117 -1071 -470 1636 -865 -1318 2430 -417 -3006 1399 663 -2293 1387
3770 1387 995 -2858 456 2299 -1265 -826 1481 -582 -1259 2237 231 -2513 1151 1284 -1728 1019
3786 1019 1325 -1720 43 1735 -625 -770 523 -365 -811 939 423 -1867 -353 1056 -704 -91
3802 -91 642 -690 125 1404 504 -300 -46 439 258 -205 629 -604 -1214 593 147 -1199 -186 -248 -981
3821 -981 193 786 -539 -822 547 909 -19 772 604 -1030 975 1495 -1005 -402 677 -298 382 866
3839 866 -855 -1046 440 406 -865 -477 23 -1215 101 1194 -926 -1030 231 -381 503 1332 -424
3856 -424 -380 839 1282 397 -174 -173 -237 782 1210 -634 -1190 -60 -342 -77 -138 -895 -862 -330 323 153 -564
3877e64M5M76M14O91p03j038M38Q75L08n06r07K27Q69M04j19j680j36J015J72
3896B81k48l46o25L11J064m44o19j88K56N51Q64L5j387r5J105J62r5k40j145M02
3916d01J705l43j285m08Q6P22Q51p42r34O9J066L5m79j48n92N20J306k68j056
3935b96l11j78N76R44m13o98j93Q97Q95r49q68m41P08J392J9j566m71N66O45R6
3955C54o04l46l7R94J026j078j129N34j48O04R12r90j303Q84R51m00m90m05n37
3974a208J347J466j290j634J008N29j80J164q74j483J599J152j454n01R9q63P76
3991c47K064j260j649J115M10q76J275q08j957J685K005j409m89l45l93P09J650
4008A380n35j894O88J500q96L20P2k025J103J661p42r01j72R0o5M69O25j667m02
$$ plain form
3877 -564 -519 -43 371 1062 359 -679 -241 634 942 436 -471 -244 625 1029 910 -770 -906 109 281
3896 281 33 -313 -938 -627 437 -7 -626 -814 -558 -7 857 892 -495 -590 515 677 582 342 -803 -401
3916 -401 1304 961 -324 -732 -646 76 927 185 -749 -680 386 421 -58 -206 -798 -278 1028 760 -296
3935 -296 -607 -785 -209 735 322 -376 -569 328 1223 274 -594 -1035 -327 1065 1084 -482 -953 -387 258 354
3955 354 -250 -596 -633 361 1387 309 -820 -286 -434 170 1082 92 -1211 -327 624 224 -266 -671 -1208
3974 -1208 139 1605 315 -1319 -311 218 38 1202 328 -1155 444 1596 142 -359 -260 -1123 -347
3991 -347 1717 457 -1192 -77 333 -543 732 -76 -2033 -348 1657 248 -241 -586 -979 -270 1380
4008 1380 845 -1049 -361 1139 243 563 635 -1390 -287 1374 632 -269 -441 -351 -416 53 678 -989 -1391
4027a391K497m58j714J134n07p27J981M86k297j55K355n04j438J656j152j705
4043a939L763N64l816J295Q92k260K006J731l604r34L429k88k016J981r97k863
4059c056L930J977m299R66J799k886J554K675l516j079L002l2j816J337q9k494
4075b027K026K330l196j03K342j456n75J921j576j398K078J088j760q28J436p59
4091d57o27K418q29k724K633J617k372K87P53k141N73L346j219l718K254J545
4107A339k925K417R17n144K039M733l104j350K578k335j412M687k09n123K201
4122f91K553l818J649L024n620K37N970k906j864L417j975k484M504L34m548J458
4138g60L026l147K72K956l592j330M559j416k426K627n7k073J745J220k771j44
$$ plain form
4027 -1391 1106 648 -1066 68 -439 -1166 815 1301 -996 -1151 1204 700 -738 918 -234 -1939
4043 -1939 1824 2388 -1428 -133 759 -1501 505 2236 -1368 -2302 1127 839 -1177 804 -193 -3056
4059 -3056 874 2851 -1448 -482 1317 -1569 -15 2660 -856 -1935 1067 1035 -781 556 467 -2027
4075 -2027 -1 2329 -867 -970 1372 -84 -659 1262 -314 -1712 366 1454 -306 -1134 302 -457
4091 -457 -1084 1334 505 -2219 414 2031 -341 -54 699 -1442 -869 2477 1258 -2460 -206 1339
4107 1339 -1586 831 1748 -3396 -1357 3376 272 -1078 1500 -835 -2247 2440 2231 -2892 -691
4122 -691 1862 -1956 -307 2717 -2903 -2666 3304 398 -1466 1951 -24 -2508 1996 2330 -2218 -760
4138 -760 2266 -881 -609 2347 -1245 -2575 1984 568 -1858 769 712 -1361 384 1604 -1167 -1311
4154a311K611r05j656J831l54k058K144J234l060K14K760o52j334J313n72k255
4170b050K620K472m030n48L012k507L3L728l285k789M135Q87k965J993O22m401
4186c073K050M880m315j832M079k592j230N253k259m759L965J605l150J900J773
4201B295m670P22N040l044k236L728j681k517M239m22m110K142J812k371P53J811
4217A491k406m65K837q18k259J976O90j936J202Q94k267J62K054o16j574J136
4233A01P68j634Q70J584k644l85K658j117j489K047k84k446K262J329l036M05
4249a011K574k133o63L005j903j930L531k56l189K584Q01l139J811J856l337J77
4265a222L203j871j333K596j040k406L292M40l804J855J447k563J206J601k387
$$ plain form
4154 -1311 1300 395 -1261 570 216 -1842 302 1536 -1524 -1310 1450 798 -536 777 205 -2050
4170 -2050 570 3042 -988 -1536 1476 -1031 -998 2730 -555 -3344 791 1678 -1287 706 1328 -3073
4186 -3073 -1023 3857 -458 -2290 1789 -803 -2033 3220 961 -3798 167 1772 -1378 522 2295
4201 2295 -2375 -1653 3387 343 -1893 1835 154 -2363 1876 1454 -2656 -514 1298 -1073 -320 1491
4217 1491 -915 -1380 1457 639 -1620 356 1046 -890 312 1206 -1061 -899 1155 539 -1035 101
4233 101 869 -765 105 1689 -955 -1340 1318 201 -1288 759 475 -1971 291 1620 -1416 -1011
4249 -1011 1563 -570 -1233 1772 -131 -2061 1470 1214 -1975 609 1410 -1729 82 1938 -1399 -1222
4265 -1222 1981 110 -1223 1373 333 -2073 1219 1659 -2145 -290 1157 -1406 -200 1401 -986
4280i86p61K514l63r84J231l61j624J596J340k007k03J038r52M00J042r19j236
4297a235R28Q70l11k93N54q02l88J576l35j158M86M12r32M28Q59j276m08J488
4315D63l13q36J174o4j218J129Q50j794N79J297j537j87J438j085n65J134k50
4332B15j307J224O93j649O25J033j418L76J382j400k78R81o24l14O78qr46L88
4350c49Q38q21K99O47p41p2J095p33k58N99m26k9J19j91r9l59L92J93m77L57J10
4371I4o02O22J18n76L15J84k19J13k56M14m40p1P30q05L7Q91p64J65N82k61j91
4392H0L51j58l70K23J51l95m54N94n70n0R14n36n63R91n26J57P09n50k91L56J94
4413B57L08n31k3j01l06P24j87n73O78j38k37P08m11l91L05j12J91k10m98M52
$$ plain form
4280 -986 -1747 767 404 -580 651 290 -1334 262 1602 -405 -608 430 -522 -122 920 1 -1235
4297 -1235 -307 563 252 -41 513 -289 -677 899 564 -594 -108 304 -628 -200 659 -617 -1025 463
4315 463 150 -686 488 424 -794 335 1185 -609 -30 1267 -270 -457 981 -104 -669 465 215
4332 215 -1092 132 825 -824 -199 834 -584 -208 1174 -226 -504 477 -147 -461 217 209 -737 -349
4350 -349 489 -332 -33 614 -127 -199 896 163 -95 504 78 49 168 -23 -122 -481 -89 104 -373 -16 94
4371 94 -508 114 232 -344 -29 155 -64 49 -207 207 -233 -304 426 -379 -342 549 -215 -50 532 271 80
4392 80 431 273 -97 126 277 -118 -572 22 -548 -598 316 -220 -783 208 -318 -161 548 -2 -293 63 257
4413 257 565 34 11 -90 -396 328 141 -432 246 108 -129 579 168 -223 82 -30 161 -49 -547 -95
4433i5k23M49J6p78J86N25j68K43r8l88O19m3L71j83p90N95j38j70N34r50k23
4454g09Q84j20j16R3l69K15K97M23n76o95J078r5l77O26p95q55J405P5p38J90
$$ plain form
4433 -95 -318 131 147 -631 -445 80 -88 155 57 -331 288 245 616 433 -357 238 100 -70 464 -486 -709
4454 -709 175 55 -61 32 -337 -122 175 598 22 -673 405 310 -67 559 -236 -1091 314 389 -349 -159
$$ [...]
8191a64
##END NTUPLES=NMR FID
##END=
