##TITLE=1H_DPA3005
 CDCl3, 8 sc, 
 31.5.2019
##JCAMPDX= 6.0         $$ Bruker NMR JCAMP-DX V2.0
##DATA TYPE= NMR FID
##DATA CLASS= NTUPLES
##ORIGIN= UXNMR, Bruker Analytische Messtechnik GmbH
##OWNER= root
$$ XWIN-NMR		Version 3.5
$$ Fri May 31 12:24:06 2019 Russian Standard Time (UT+4h)  she@DPX200
##.OBSERVE FREQUENCY= 200.13155
##.OBSERVE NUCLEUS= ^1H
##.DELAY= (6, 6)
##.ACQUISITION MODE= SIMULTANEOUS
##.ACQUISITION SCHEME= undefined
##.AVERAGES= 8
##.DIGITISER RES= 18
##SPECTROMETER/DATA SYSTEM= spect
##.PULSE SEQUENCE= zg30
##.SOLVENT NAME= CDCl3
##.SHIFT REFERENCE= (INTERNAL, CDCl3, 0, 15.7039)
##AUDIT TRAIL= $$ (NUMBER, WHEN, WHO, WHERE, WHAT)
$$ ##TITLE= Audit trail, XWIN-NMR		Version 3.5
$$ ##JCAMPDX= 5.01
$$ ##ORIGIN= Bruker BioSpin GmbH
$$ ##OWNER= she
$$ F:/spectra/data/she/nmr/H-F/1/audita.txt
$$ ##AUDIT TRAIL=  $$ (NUMBER, WHEN, WHO, WHERE, WHAT)
(   1,<2019-05-31 12:22:31.90 +0400>,<she>,<DPX200>,
      <created by zg, POWCHK disabled, PULCHK disabled
       configuration hash MD5:
       00 E9 B6 7A A2 85 ED C7 34 08 36 98 17 FE 4E 26
       data hash MD5: 16K
       88 3B 01 39 66 7C 06 95 D3 B1 66 60 CC 96 D5 7C>)
$$ ##END=
$$ 
$$ hash MD5
$$ CA FD 06 C9 94 0C 59 99 4B 49 C5 50 72 D0 EB 58
##$RELAX= 
##$RELAX= 
##$RELAX= 
##$RELAX= 
##$RELAX= 
##$RELAX= 
$$ Bruker specific parameters
$$ --------------------------
##$DU= <F:/spectra>
##$EXPNO= 1
##$NAME= <H-F>
##$PROCNO= 1
##$TYPE= <nmr>
##$USER= <she>
##$AMP= (0..31)
100 100 100 100 100 100 100 100 100 100 100 100 100 100 100 100 100 100 
100 100 100 100 100 100 100 100 100 100 100 100 100 100 
##$AQSEQ= 0
##$AQ_mod= 1
##$AUNM= <au_zg>
##$AUTOPOS= <>
##$BF1= 200.13
##$BF2= 200.13
##$BF3= 200.13
##$BF4= 200.13
##$BF5= 200.13
##$BF6= 200.13
##$BF7= 200.13
##$BF8= 200.13
##$BYTORDA= 1
##$CFDGTYP= 0
##$CFRGTYP= 5
##$CHEMSTR= <none>
##$CNST= (0..31)
1 1 145 1 1 1 1 1 1 1 1 1 1 1 1 1 1 1 1 1 1 1 1 1 1 1 1 1 1 1 1 1 
##$CPDPRG= <>
##$CPDPRG1= <>
##$CPDPRG2= <>
##$CPDPRG3= <>
##$CPDPRG4= <mlev>
##$CPDPRG5= <mlev>
##$CPDPRG6= <mlev>
##$CPDPRG7= <mlev>
##$CPDPRG8= <mlev>
##$CPDPRGB= <>
##$CPDPRGT= <>
##$D= (0..31)
0 1.2 0 0 0 0 0 0 0 0 0 0.03 0 0 0 0 0 0 0 0 0 0 0 0 0 0 0 0 0 0 0 0 
##$DATE= 1559290951
##$DBL= (0..7)
120 120 120 120 120 120 120 120 
##$DBP= (0..7)
150 150 150 150 150 150 150 150 
##$DBP07= 0
##$DBPNAM0= <>
##$DBPNAM1= <>
##$DBPNAM2= <>
##$DBPNAM3= <>
##$DBPNAM4= <>
##$DBPNAM5= <>
##$DBPNAM6= <>
##$DBPNAM7= <>
##$DBPOAL= (0..7)
0.5 0.5 0.5 0.5 0.5 0.5 0.5 0.5 
##$DBPOFFS= (0..7)
0 0 0 0 0 0 0 0 
##$DE= 6
##$DECBNUC= <off>
##$DECIM= 24
##$DECNUC= <off>
##$DECSTAT= 4
##$DIGMOD= 1
##$DIGTYP= 9
##$DL= (0..7)
0 120 120 120 120 120 120 120 
##$DP= (0..7)
150 150 150 150 150 150 150 150 
##$DP07= 0
##$DPNAME0= <>
##$DPNAME1= <>
##$DPNAME2= <>
##$DPNAME3= <>
##$DPNAME4= <>
##$DPNAME5= <>
##$DPNAME6= <>
##$DPNAME7= <>
##$DPOAL= (0..7)
0.5 0.5 0.5 0.5 0.5 0.5 0.5 0.5 
##$DPOFFS= (0..7)
0 0 0 0 0 0 0 0 
##$DQDMODE= 0
##$DR= 18
##$DS= 0
##$DSLIST= <SSSSSSSSSSSSSSS>
##$DSPFIRM= 0
$$ [...]
##$SUBNAM2= <"">
##$SUBNAM3= <"">
##$SUBNAM4= <"">
##$SUBNAM5= <"">
##$SUBNAM6= <"">
##$SUBNAM7= <"">
##$SUBNAM8= <"">
##$SUBNAM9= <"">
##$SW= 24.9336996594482
##$SWIBOX= (0..15)
0 0 2 0 0 0 0 0 0 0 0 0 0 0 0 0 
##$SW_h= 4990.01996007984
##$TD= 16384
##$TD0= 1
##$TE= 0
##$TE2= 300
##$TE3= 300
##$TEG= 300
##$TL= (0..7)
0 120 120 120 120 120 120 120 
##$TP= (0..7)
150 150 150 150 150 150 150 150 
##$TP07= 0
##$TPNAME0= <>
##$TPNAME1= <>
##$TPNAME2= <>
##$TPNAME3= <>
##$TPNAME4= <>
##$TPNAME5= <>
##$TPNAME6= <>
##$TPNAME7= <>
##$TPOAL= (0..7)
0.5 0.5 0.5 0.5 0.5 0.5 0.5 0.5 
##$TPOFFS= (0..7)
0 0 0 0 0 0 0 0 
##$TUNHIN= 0
##$TUNHOUT= 0
##$TUNXOUT= 0
##$USERA1= <user>
##$USERA2= <user>
##$USERA3= <user>
##$USERA4= <user>
##$USERA5= <user>
##$V9= 5
##$VALIST= <valist>
##$VCLIST= <CCCCCCCCCCCCCCC>
##$VD= 0
##$VDLIST= <DDDDDDDDDDDDDDD>
##$VPLIST= <PPPPPPPPPPPPPPP>
##$VTLIST= <TTTTTTTTTTTTTTT>
##$WBST= 1024
##$WBSW= 4
##$XGAIN= (0..3)
0 0 0 0 
##$XL= 0
##$YL= 0
##$YMAX_a= 912984
##$YMIN_a= -913576
##$ZGOPTNS= <>
##$ZL1= 120
##$ZL2= 120
##$ZL3= 120
##$ZL4= 120
##$ABSF1= 10
##$ABSF2= 0
##$ABSG= 5
##$ABSL= 3
##$ALPHA= 0
##$AQORDER= 0
##$ASSFAC= 0
##$ASSFACI= 0
##$ASSFACX= 0
##$ASSWID= 0
##$AUNMP= <proc_1d>
##$AZFE= 0.1
##$AZFW= 0.1
##$BCFW= 1
##$BC_mod= 2
##$BYTORDP= 1
##$COROFFS= 0
##$CY= 11.3945322036743
##$DATMOD= 1
##$DC= 2
##$DFILT= <>
##$DTYPP= 0
##$F1P= 18.9103706918063
##$F2P= -1.10871071338519
##$FCOR= 0.5
##$FTSIZE= 0
##$FT_mod= 4
##$GAMMA= 1
##$GB= 0.15
##$INTBC= 1
##$INTSCL= 1
##$ISEN= 128
##$LB= 0.24
##$LEV0= 0
##$LPBIN= 0
##$MAXI= 10000
##$MC2= 0
##$MEAN= 0
##$ME_mod= 0
##$MI= 1.114404
##$NCOEF= 0
##$NC_proc= 0
##$NLEV= 6
##$NOISF1= 3.799351
##$NOISF2= 2.8
##$NSP= 1
##$NTH_PI= 0
##$NZP= 0
##$OFFSET= 15.70392
##$PC= 1
##$PHC0= -8659.963
##$PHC1= 13.40023
##$PH_mod= 1
##$PKNL= yes
##$PPARMOD= 0
##$PSCAL= 0
##$PSIGN= 0
##$REVERSE= no
##$SF= 200.130013532006
##$SI= 16384
##$SIGF1= 3
##$SIGF2= 2
##$SINO= 400
##$SIOLD= 16384
##$SREGLST= <1H.CDCl3>
##$SSB= 0
##$STSI= 0
##$STSR= 0
##$SW_p= 3612.71676300578
##$SYMM= 0
##$S_DEV= 0
##$TDeff= 0
##$TDoff= 0
##$TI= <>
##$TILT= no
##$TM1= 0
##$TM2= 0
##$TOPLEV= 0
##$USERP1= <user>
##$USERP2= <user>
##$USERP3= <user>
##$USERP4= <user>
##$USERP5= <user>
##$WDW= 1
##$XDIM= 8192
##$YMAX_p= 0
##$YMIN_p= 0
$$ End of Bruker specific parameters
$$ ---------------------------------
##NTUPLES= NMR FID
##VAR_NAME=  TIME,          FID/REAL,        FID/IMAG
##SYMBOL=    X,             R,               I
##VAR_TYPE=  INDEPENDENT,   DEPENDENT,       DEPENDENT
##VAR_FORM=  AFFN,          ASDF,            ASDF
##VAR_DIM=   8192,          8192,            8192
##UNITS=     SECONDS,       ARBITRARY UNITS, ARBITRARY UNITS
##FACTOR=    0.0002004,     1,               1
##FIRST=     0,             0,               0
##LAST=      1.6414764,     0,               0
##MIN=       0,             -913576,         0
##MAX=       1.6414764,     912984,          0
$$ Real data points
##PAGE= N=1
##DATA TABLE= (X++(R..R)), XYDATA
$$ [...]
$$ plain form
3607 -4821 9865 6913 -8476 -8634 6906 10206 -4950 -11305 2696 11872 -335 -12107 -2049
3620 -2049 11707 4375 -11041 -6640 9705 8517 -8183 -10294 6116 11363 -3994 -12415 1469
3633 1469 12656 955 -12552 -3488 11826 5682 -10821 -7972 9274 9714 -7461 -11352 5069
3646 5069 12175 -2820 -12902 66 12749 2296 -12444 -4881 11391 7091 -10000 -9043 8052
3659 8052 10661 -5868 -11794 3617 12565 -884 -12561 -1466 12330 4131 -11250 -6221 10125
3672 10125 8439 -8136 -9740 6375 11300 -3740 -11702 1593 12082 1056 -11689 -3360 11008
3685 11008 5619 -9657 -7516 8044 9125 -6199 -10380 3894 10999 -1712 -11368 -687 11042
3698 11042 2859 -10430 -5142 9226 6989 -7794 -8591 5959 9785 -3849 -10507 1694 10801
$$ packed form
3607d821J4686k952j5389j58J5540L300j5156o355J4001R176j2207j1772J0058
3620b049J3756p332j5416M401J6345j188j6700k111J6410N247j5357q421J3884
3633A469J1187j1701j3507R064J5314o144j6503K849J7246M40j7175l891J6421
3646E069P106j4995j0082J2968J2683j0453j4740P563J6272m300j7091R57J7095
3659H052K609j6529n926J5411Q948j3449j1677J1095J3796q199j5381N029J6346
3672A0125j686j6575j604J6115M925j5040p962J3295J0489j1026j2745Q329J4368
3685A1008n389j5276K141J5560J081j5324m181J4274P105j2711r656J0681J1729
3698A1042q183j3289N288J4368k237j4783p97J4550L826j3634o658J2201R107
$$ plain form
3711 10801 741 -10577 -2889 10040 5085 -8816 -6836 7469 8465 -5481 -9572 3523 10408
3724 10408 -1251 -10541 -852 10448 3356 -9664 -5361 8655 7312 -6985 -8788 5165 9907
3737 9907 -3006 -10657 655 10903 1611 -10638 -4029 9779 6089 -8603 -8036 6906 9500
3750 9500 -4982 -10715 2671 11347 -401 -11629 -2105 11188 4343 -10574 -6742 9080 8541
3763 8541 -7522 -10358 5381 11442 -3164 -12259 691 12456 1825 -12272 -4341 11431 6715
3776 6715 -10203 -8862 8465 10602 -6436 -11960 4123 12908 -1476 -13288 -990 13159 3772
3789 3772 -12482 -6132 11408 8606 -9555 -10333 7775 12178 -5182 -12955 2807 13783 131
3802 131 -13540 -2547 13393 5485 -12029 -7605 10670 10010 -8590 -11553 6492 12928 -3837
$$ packed form
3711A0801j0060j1318P688J2929m955j3901J980J4305R96j3946m091J3095O885
3724A0408j1659r290R689J1300p092j3020M303J4016j343j4297j803J3953M742
3737I907j2913p651J1312J0248r292j2249O609J3808l690j4692N67J4942K594
3750I500j4482n733J3386Q676j1748j1228R524J3293o845j4917L832J5822n39
3763H541j6063k836J5739O061j4606r095J2950J1765j0631j4097P931J5772m716
3776F715j6918J341J7327K137j7038n524J6083Q785j4384j1812J2298J4149r387
3789C772j6254O350J7540k802j8161p78J8108M403j7360p773J5762J0976j3652
3802A31j3671J0993J5940p908j7514M424J8275o60j8600k963J8045O436j6765
$$ plain form
3815 -3837 -13659 1145 13863 1649 -13559 -4468 12554 6769 -11386 -9224 9266 10742 -7382
3828 -7382 -12481 4566 13109 -2204 -13647 -825 13250 3305 -12669 -5946 11347 8136 -9583
3841 -9583 -10033 7630 11454 -5114 -12397 2765 12966 47 -12754 -2460 12312 5017 -11045
3854 -11045 -7113 9638 9100 -7636 -10483 5517 11641 -2987 -12048 507 12104 1976 -11574
3867 -11574 -4365 10616 6483 -9150 -8396 7264 9877 -5218 -10910 2784 11399 -342 -11457
3880 -11457 -2104 10945 4394 -9931 -6615 8410 8326 -6671 -9844 4434 10614 -2140 -11235 -364
3894 -364 11056 2793 -10500 -5113 9352 7099 -7869 -8830 5955 10199 -3656 -11018 1316 11349
3908 11349 1088 -11160 -3599 10497 5880 -9275 -7937 7654 9557 -5753 -10810 3399 11603
$$ packed form
3815c837r822J4804J2718j2214j5208R091J7022n785j8155K162J8490J476j8124
3828g382n099J7047Q543j5313j1443J2822J4075r945j5974O723J7293l211j7719
3841i583m50J7663L824j6568p283J5162J0201j2919j2801J0294J4772p295j6062
3854a1045L932J6751n38j6736k847J6000O124j4628r061J2555J1597j0128j3550
3867a1574P209J4981m133j5633P54J5660K613j5095n692J3694Q615j1741j1115
3880a1457R353J3049o551j4325L316J5025q4j4997l173J4278O180j2754r095J0871
3894c64J1420q263j3293N387J4465k253j4968r61J4785M244j3855p362J2334J0033
3908A1349j0261j2248P561J4096m617j5155J338J5591J903j5310n057J4209Q204
$$ plain form
3921 11603 -999 -11956 -1521 11721 3944 -11080 -6276 9741 8376 -8227 -10126 6180 11411
3934 11411 -3812 -12347 1355 12705 1239 -12545 -3762 11870 6241 -10677 -8379 9075 10394
3947 10394 -7007 -11729 4700 12884 -2057 -13260 -550 13311 3351 -12666 -5872 11590 8303
3960 8303 -9860 -10275 7899 11927 -5529 -13058 2885 13659 -131 -13711 -2578 13242 5308
3973 5308 -12297 -7850 10632 9852 -8777 -11821 6307 12879 -3961 -13768 974 13736 1528
3986 1528 -13653 -4398 12505 6718 -11393 -9073 9291 10674 -7306 -12284 4708 13019 -2256
3999 -2256 -13455 -439 13271 3097 -12547 -5491 11460 7719 -9798 -9474 7963 11161 -5500
4012 -5500 -11939 3233 12621 -554 -12531 -1748 12194 4255 -11140 -6350 9760 8299 -7977
$$ packed form
3921A1603j2602j0957J0435J3242p777j5024M804J6017j365j6603j899J6306N231
3934A1411j5223q535J3702J1350j1466j3784Q783J5632n629j6918K298J7454J319
3947A0394j7401m722J6429Q184j4941j1203J2710J3861r960j6017O794J7462l287
3960H303j8163m15J8174M028j7456p529J5943J0774j3790j3580J1133J5820p934
3973E308j7605M447J8482p80j8629l044J8128O572j6840r807J4742J2762j2208
3986A528j5181R255J6903n787j8111K320J8364J383j7980m978J6992Q311j5275
3999b256j1199J3016J3710j0174j5644P056J6951l741j7517L24J7437L198j6661
4012e500o439J5172R388j3175j1977J0783J3942p939j5395M790J6110j461j6276
$$ plain form
4025 -7977 -9820 5880 10799 -3723 -11589 1202 11608 1189 -11402 -3530 10423 5605 -9241
4038 -9241 -7553 7543 8972 -5576 -10184 3342 10813 -982 -10908 -1276 10590 3504 -9660
4051 -9660 -5629 8523 7486 -6732 -8725 4958 9963 -2603 -10270 474 10555 1971 -9887
4064 -9887 -3944 9223 6088 -7773 -7575 6300 9142 -4186 -9862 2102 10474 47 -10419
4077 -10419 -2279 9946 4382 -9082 -6456 7778 7942 -6143 -9378 4020 10221 -2096 -10821
4090 -10821 -290 10733 2447 -10343 -4582 9391 6540 -8122 -8328 6457 9729 -4423 -10643
4103 -10643 2328 11271 87 -11316 -2237 10972 4559 -10071 -6641 8808 8554 -6976 -9962
4116 -9962 5061 11207 -2814 -11817 310 11953 2054 -11664 -4442 10732 6624 -9534 -8735
$$ packed form
4025g977j843J5700M919j4522p866J2791J0406j0419j2591P872J3953m818j4846
4038i241J688J5096J429j4548m608J3526P471j1795r926R632J1866p086j3164
4051i660M031J4152j037j4218j993J3683N005j2566p667J0744J0081q584j1858
4064i887N943J3167l135j3861J98J3875K842j3328n676J1964Q372j0427j0466
4077a0419Q140J2225n564j3464K626J4234J64j4085l235J3398O201j2317q725
4090a0821J0531J1023q286j2790N761J3973k851j4662k06J4785L272j4152o220
4103a0643J2971Q943j1184j1403R079J3209o413j4630L430J5449k54j5530k986
4116i962J5023O146j4021r003J2127J1643r899j3718P222J5174m108j6158P99
$$ plain form
4129 -8735 7737 10203 -5843 -11507 3425 12147 -1033 -12473 -1565 12135 3915 -11363 -6276
4142 -6276 10177 8202 -8480 -9973 6519 11270 -4293 -12074 1892 12426 589 -12346 -2961
4155 -2961 11645 5205 -10591 -7322 9077 9084 -7241 -10453 5146 11389 -2962 -11956 554 11946
4169 11946 1820 -11378 -4051 10642 6203 -9186 -7857 7687 9532 -5558 -10408 3565 11205
4182 11205 -1112 -11153 -1003 11011 3409 -10065 -5226 9025 7175 -7330 -8540 5526 9675
4195 9675 -3516 -10289 1200 10321 886 -10179 -3099 9315 4942 -8260 -6734 6644 8010
4208 8010 -5053 -9031 2951 9587 -980 -9685 -1059 9472 3128 -8581 -4850 7525 6576 -5982
4222 -5982 -7573 4440 8662 -2439 -9005 663 9181 1462 -8699 -3141 8113 4993 -6973 -6292
$$ packed form
4129h735J6472K466j6046n664J4932Q722j3180j1440J0908J3700q220j5278N087
4142f276J6453j975j6682j493J6492M751j5563p781J3966J0534j1837j2935R385
4155b961J4606o440j5796L269J6399Pj6325l212J5599O243j4351q994J2510J1392
4169A1946j0126j3198P327J4693m439j5389J329J5544J845j5090m850J3973P640
4182A1205j2317j0041J0150J2014p602j3474M839J4251j850j4505j210J4066M149
4195I675j3191o773J1489R121r435j1065P080J2414m373j3202J526J3378J366
4208H010j3063l978J1982O636j0567q705Q626J0531o344j1709L731J2375r49j2558
4222e982j591J2013M222j1101o566R668Q518p719j0161N558J1254l120j1966O81
$$ plain form
4236 -6292 5634 7631 -3981 -8292 2267 8786 -326 -8861 -1471 8602 3339 -7860 -4907 6823
4250 6823 6450 -5503 -7533 3915 8436 -2135 -8909 345 8871 1514 -8671 -3407 7991 5023
4264 5023 -7020 -6691 5582 7689 -4045 -8756 2143 9096 -376 -9317 -1692 8996 3498 -8421
4278 -8421 -5267 7298 6828 -5988 -8017 4281 9028 -2463 -9580 624 9744 1396 -9476 -3305
4292 -3305 8834 5162 -7840 -6768 6499 8027 -4883 -9078 3064 9607 -1237 -9916 -811
4305 -811 9702 2661 -9306 -4540 8317 6082 -7087 -7453 5663 8523 -3945 -9221 2183 9680
4319 9680 -185 -9654 -1576 9292 3504 -8561 -5153 7557 6507 -6231 -7812 4571 8549 -2934
4333 -2934 -9185 1056 9292 680 -9167 -2587 8535 4181 -7631 -5737 6456 6997 -4951 -7962
$$ packed form
4236f292J1926J997j1612m311J0559O519r112q535P390J0073n263j1199K953J1730
4250F823l73j1953k030J1448M521j0571o774R254Q526p357j0185N264J1398k968
4264E023j2043L29J2273K107j1734m711J0899O953r472q941P625J0688n498j1919
4278h421L154J2565m70j2816k029J2298M747j1491p117J0204R120q348j0872O171
4292c305J2139l672j3002J072J3267J528j2910m195J2142O543j0844q679R105
4305h11J0513p041j1967M766J2857k235j3169l66J3116K860j2468n276J1404P497
4319I680r865r469Q078J0868n788j2065L408J2710j050j2738j581J2383L978j1483
4333b934o251J0241Q236q612r847O580J1122m354j1812J894J2193N41j1948l011
$$ plain form
4347 -7962 3385 8587 -1508 -8716 -162 8691 2046 -8133 -3599 7443 5201 -6138 -6365 4941
4361 4941 7286 -3385 -7995 1640 8142 -48 -8186 -1754 7583 3153 -7078 -4818 5826 5662
4375 5662 -4768 -6839 3103 7231 -1702 -7628 -33 7556 1473 -7139 -3060 6517 4315 -5491 -5371
4390 -5371 4358 6352 -2936 -6822 1528 7204 26 -7114 -1453 6789 2913 -6107 -4190 5138 5252
4405 5252 -4060 -6167 2670 6598 -1392 -7057 -270 6707 1553 -6600 -3151 5772 4222 -5074 -5472
4420 -5472 3764 6203 -2614 -6842 1037 7075 411 -6989 -1978 6609 3413 -5907 -4562 5050 5795
4435 5795 -3806 -6483 2454 7192 -903 -7257 -534 7250 2134 -6796 -3517 6289 4924 -5145 -5869
4450 -5869 4084 6795 -2559 -7263 1215 7594 422 -7438 -1830 7255 3376 -6455 -4679 5612 5788
$$ packed form
4347g962J1347N202j0095p208Q554Q853o645j0179M534J1042k242j1339k27J1306
4361D941K345j0671m610R635O502q190q138O432R337m430j0231K260J0644j64
4375E662j0430k071R942M128q933n926P595P589o083q612M079R577k202r806J20
4390e371R729J994r288l886Q350N676p178p140N661Q242l876r020J917R328J14
4405E252r312k107Q837L928p990n665O787O977n154q153L449Q923j550r296l98
4420e472R236K439q817m228P879O038o664p400N011Q587l196r320J345R612P45
4435E795r601k677Q937M738q095o354O723P784n116q930L279R806j365j0069p24
4450e869R953K711r354m704Q478O379p172p860N608R085l879r831J776J0291J76
$$ plain form
4465 5788 -4349 -6644 3040 7259 -1598 -7563 121 7546 1402 -7332 -2908 6615 4158 -5843
4479 -5843 -5360 4776 6231 -3487 -6978 2130 7256 -664 -7438 -902 7153 2346 -6691 -3601 5937
4494 5937 4881 -4884 -5795 3679 6579 -2293 -6990 1005 7199 516 -7001 -1891 6471 3275 -5860
4509 -5860 -4406 4860 5365 -3843 -6156 2553 6551 -1145 -6744 -188 6581 1480 -6252 -2793 5647
4524 5647 3945 -4793 -4819 3746 5527 -2553 -6031 1341 6156 -131 -6147 -1195 5795 2315 -5235
4539 -5235 -3442 4409 4237 -3629 -4939 2484 5314 -1466 -5685 119 5532 908 -5420 -2048 4787
4554 4787 2950 -4218 -3865 3272 4427 -2402 -4949 1365 5199 -201 -5175 -752 4970 1940 -4472
4569 -4472 -2744 4015 3763 -3076 -4283 2261 4849 -1065 -5043 149 5071 1021 -4881 -2058 4462
$$ packed form
4465E788j0137k295R684M219q857n965P684P425o144q734M424R523k457j0001
4479e843M83J0136J455r718l491R108N126p920o774O536Q055m807r037L090R538
4494E937j056r765r11R474K900q872m697P995O194o683p517N110Q362l196r135
4509e860J454R266N05r208k313Q709L998p696n599O556O769n101p732L459Q440
4524E647j702q738k6Q565J781q080l478P372M815o287o016M952O990l480p550
4539e235J793P851j72p866j310P423K830o780m219N804N413m624o328L372O835
4554D787j837p168L53P137J155o829k547O314L834n400m974M423N722l030o412
4569d472J728O759k52o839j207O544K588n914l978N192M922m050n902K823O520
$$ plain form
4584 4462 2930 -3812 -3768 2966 4416 -2090 -4929 962 5078 8 -5149 -1180 4884 2158 -4484
4599 -4484 -3167 3825 3851 -3034 -4516 2073 4999 -1035 -5213 54 5237 1003 -4991 -2045 4724
4614 4724 3027 -3926 -3754 3308 4560 -2286 -4889 1459 5306 -248 -5193 -685 5183 1803 -4718
4629 -4718 -2586 4314 3568 -3481 -4205 2738 4806 -1704 -5044 737 5241 395 -5186 -1346 4944
4644 4944 2342 -4496 -3298 3738 4035 -3015 -4592 1979 4976 -1132 -5244 -31 5175 1026 -5023
4659 -5023 -2009 4559 2946 -3944 -3762 3150 4397 -2282 -4840 1290 5053 -222 -5149 -725 4934
4674 4934 1853 -4530 -2663 3932 3432 -3128 -4043 2402 4529 -1488 -4791 514 4796 561 -4646
4689 -4646 -1401 4396 2325 -3794 -2999 3201 3655 -2394 -4086 1582 4325 -637 -4395 -276 4302
$$ packed form
4584D462j532o742M4O734J450o506k839N891M116n070n157L969O064k726o642
4599d484J317O992K6o885j482O589K926o034m178N267N183m234n994K946O769
4614D724j697o953J72P062J252o846k603O348L847n554m945M508N868l380o521
4629d718K132O900p46p049p24O943K068o510l340N781M504m846n581L840O290
4644D944k602o838J198P036K97p050j577O571K997o108m112N213N206m149o049
4659e023L014O568j613o890J82O912J247o679k558O130L763n275m927M424N659
4674D934l081o383J867O595n00o560r15O445K127o017l303N305M282m235n207
4689d646L245N797k071o119P95O200M54o049j692N668K743m962l758M119M578
$$ plain form
4704 4302 1089 -4044 -1945 3591 2598 -3125 -3226 2280 3645 -1647 -3980 710 4009 86 -4042
4719 -4042 -908 3768 1766 -3399 -2507 2835 3059 -2236 -3468 1472 3724 -678 -3809 -163 3808
4734 3808 982 -3622 -1755 3280 2441 -2789 -3015 2073 3462 -1308 -3715 530 3803 211 -3774
4749 -3774 -1110 3474 1739 -3164 -2492 2580 2949 -2068 -3435 1276 3570 -553 -3839 -303 3685
4764 3685 1003 -3493 -1727 3127 2336 -2661 -2934 2076 3235 -1437 -3597 652 3658 122 -3705
4779 -3705 -765 3474 1475 -3142 -2152 2737 2765 -2241 -3163 1584 3503 -770 -3581 225 3673 624
4795 624 -3503 -1319 3290 2058 -2843 -2483 2440 3115 -1685 -3349 1108 3661 -336 -3641 -353 3598
4811 3598 1095 -3338 -1792 2990 2453 -2550 -2926 1916 3280 -1272 -3548 590 3717 159 -3598
$$ packed form
4704D302l213n133K099N536r93n723j01N506J365n292k333M690L299l923m128
4719d042L134M676k002n165Q92N342K24n295j232M940K252m402l131L646L971
4734C808k826m604J867N035q39n230k26N088J389m770k407M245L273l592l985
4749c774K664M584j735m903O72N072L69n017j367M711K294m123l286L536L988
4764C685k682m496J766M854p91m997k73N010J159m672k160M249L006l536l827
4779c705K940M239j999m617R90M889K8n006r22M747J919m273k811L806L448l049
4795F24m127K184M609j232m901L60M923O75m800j664M457K553l997l305L288L951
4811C598k503m433J546M782n37n003l76M842J364m552k276M138L127l558l757
$$ plain form
4826 -3598 -872 3418 1612 -3078 -2141 2707 2695 -2122 -3070 1450 3340 -850 -3507 163 3469 540
4842 540 -3384 -1220 3060 1788 -2772 -2338 2272 2668 -1708 -3117 1040 3187 -494 -3227 -255 3160
4858 3160 858 -2973 -1468 2673 1904 -2258 -2357 1792 2737 -1262 -2929 601 3059 2 -2916 -529
4874 -529 2885 1254 -2534 -1717 2230 2134 -1769 -2522 1267 2766 -712 -2940 48 2845 471 -2793
4890 -2793 -1102 2523 1542 -2243 -2081 1660 2403 -1270 -2709 699 2825 -159 -2866 -493 2711 1095
4906 1095 -2512 -1555 2251 2026 -1699 -2354 1290 2657 -722 -2735 195 2758 415 -2698 -866 2538
4922 2538 1461 -2176 -1843 1812 2245 -1369 -2593 817 2726 -273 -2734 -234 2674 774 -2515
4937 -2515 -1284 2346 1788 -1942 -2117 1512 2508 -934 -2631 409 2786 95 -2659 -642 2625 1244
$$ packed form
4826c598K726M290j806m690R37M848j2m817r48M520J890m190k657L670L306k929
4842E40l924K164M280j272m560M34M610L96m376j409M157K147l681k733K972L415
4858C160k302l831J505M141p69m162r9M149R45l999j667L530K458l057k918K387
4874e29L414j631l788Q17L947r6l903p53L789J499l478k228K988K797k374l264
4890b793J691L625r81l785J62L741P43l673j439L408K126k984k707K373L204j616
4906A095l607R57L806k25l725o55L644J367l379k013K930K563k343l113J832L404
4922B538j077l637L33L655M33l614j224L410J909k999k461K500K908j900l289
4937b515J231L630n58l730j75L629R96l442j697L040K377k691k754K017L267j381
$$ plain form
4953 1244 -2391 -1659 2006 2144 -1611 -2402 1125 2700 -673 -2759 59 2812 521 -2716 -1107 2470
4969 2470 1548 -2151 -2083 1741 2391 -1294 -2674 760 2801 -185 -2882 -448 2856 898 -2597 -1484
4985 -1484 2232 1913 -1877 -2321 1453 2586 -961 -2756 374 2800 157 -2799 -761 2585 1291
5000 1291 -2286 -1644 1982 2133 -1504 -2408 1114 2600 -471 -2641 157 2646 516 -2502 -1013 2256
5016 2256 1411 -1952 -1818 1564 2090 -1159 -2372 698 2430 -229 -2467 -283 2415 795 -2249 -1197
5032 -1197 1961 1656 -1639 -1959 1232 2207 -739 -2358 282 2412 238 -2363 -725 2265 1207 -1969
5048 -1969 -1595 1663 1913 -1193 -2185 744 2349 -340 -2336 -164 2275 600 -2172 -1146 1837 1493
5064 1493 -1702 -1817 1226 2047 -762 -2264 312 2306 73 -2298 -554 2102 1018 -1944 -1374 1679
$$ packed form
4953A244l635P32L665J38l755p91L527J575l373k086K818K753k291l237J609L577
4969B470r22l699O8L824O50l685j380L434K041k986k697K434L304j958l495J113
4985a484L716l19l790m44L774J133l547j795L130K426k643k956K038L346j294
5000A291l577O42L626J51l637r04L522J486l071k170K798K489k130l018J489L269
5016B256q45l363J34L382N26l249j213L070J732k659k238K184K698j620l044J052
5032a197L158l05l295l20L191R75k946j619K640K130k174k601J638K990j058l176
5048a969L74L258K50l106r92K929J605k689j996K172K439j675k772J026K983l44
5064A493l195j15L043Q21k809j502K576J994k233k371J744K656j084k962N70L053
$$ plain form
5080 1679 1710 -1211 -2023 886 2181 -440 -2299 42 2249 432 -2144 -930 1931 1362 -1709 -1696
5096 -1696 1357 1910 -947 -2138 596 2226 -92 -2292 -417 2253 833 -2098 -1222 1858 1675 -1488
5112 -1488 -1930 1131 2210 -630 -2244 257 2460 314 -2277 -706 2353 1376 -1952 -1592 1665 2022
5128 2022 -1185 -2222 808 2409 -304 -2506 -139 2491 676 -2387 -1206 2063 1545 -1759 -1922
5143 -1922 1367 2154 -987 -2374 462 2493 -20 -2521 -541 2367 889 -2228 -1434 1875 1766 -1562
5159 -1562 -2081 1010 2302 -702 -2443 207 2421 299 -2406 -733 2197 1273 -1947 -1548 1597 1920
5175 1920 -1208 -2096 765 2351 -318 -2364 -166 2324 642 -2202 -1118 1951 1499 -1641 -1860 1242
5191 1242 2093 -790 -2290 328 2292 199 -2360 -689 2183 1024 -1928 -1500 1603 1807 -1298 -2122
$$ packed form
5080A679L1k921q12K909J295k621j859K341K207j817k576J214K861n69l071J3
5096a696L053N53k857j191K734J630k318k200J875K670j420k931Q76L080j83l163
5112a488m42L061J079k840j614K501K203k146k591J571L059r77l328L60L257L57
5128B022l207j037L030J601k713k202K367K630j815l063J181L269n18l304j63
5143a922L289P87l141j387K836K031k513k501J980K908j478l117P94L309j09l328
5159a562n19L091J292l004j741K650K214k122k705J673K930r24l220L99L145L23
5175A920l128q88K861J586k669k046K198K490j682k844J084L069m52l140k19L102
5191A242Q51k883j500K618J964k093k559J671K872j159k952M28L103K04l105q24
$$ plain form
5207 -2122 819 2154 -332 -2342 -140 2310 618 -2175 -1029 1925 1423 -1630 -1774 1205 2050 -807
5223 -807 -2140 371 2214 142 -2201 -531 2090 937 -1858 -1416 1634 1677 -1246 -1909 847 2094
5239 2094 -449 -2115 -29 2168 488 -2028 -946 1776 1244 -1530 -1651 1258 1924 -887 -2018 388
5255 388 2152 -3 -2126 -483 2054 971 -1848 -1364 1556 1687 -1263 -1971 835 2136 -392 -2309
5271 -2309 -9 2256 434 -2099 -937 2031 1345 -1653 -1748 1303 1950 -896 -2191 494 2246 -53
5287 -53 -2263 -430 2162 950 -2024 -1265 1739 1691 -1321 -1938 969 2095 -543 -2212 84 2187
5303 2187 306 -2223 -728 2003 1160 -1808 -1494 1498 1828 -1068 -2075 774 2123 -246 -2184 -212
5319 -212 2130 605 -2000 -1075 1755 1424 -1495 -1610 1163 1903 -758 -2059 369 2049 112 -2129
$$ packed form
5207b122K941J335k486k010K202K450j692k793J146K954n02l053j44K979Q45k857
5223h07j333K511J843k072k343J670K621j153k795M42L050M3k923o63K756J247
5239B094k543j666K086K197j680k516J082K722n32k774j21K909O66k811j131K406
5255C88J764k155k123J643K537j083k819M84K920J31k950p08K806J301k528j917
5271b309K300K265j822k533J162K968o86k998r5L051O47k846j295K685J752k299
5287e3k210J833K592j212k974P59L004m8l012o17K907J126k638j669K296K103
5303B187j881k529J495K731q43k968L14K992L30k896j007K849J349k369j938J972
5319b12K342j525k605R25K830l31k919j15K773P40k661j301K428J680j937k241
$$ plain form
5335 -2129 -607 1970 976 -1786 -1327 1547 1602 -1163 -1898 769 2005 -297 -2095 -47 2083 559
5351 559 -1962 -830 1799 1299 -1516 -1578 1169 1879 -762 -1980 398 2093 112 -2062 -424 1976
5367 1976 920 -1739 -1204 1455 1541 -1162 -1782 805 1926 -435 -2013 12 1936 448 -1905 -948
5383 -948 1744 1175 -1521 -1467 1104 1763 -754 -1867 342 1895 48 -1921 -494 1753 804 -1666
5399 -1666 -1145 1442 1466 -1130 -1705 711 1823 -307 -1958 -54 1909 446 -1854 -860 1662 1174
5415 1174 -1386 -1456 1096 1723 -754 -1871 399 1958 87 -1863 -485 1855 859 -1681 -1165 1469
5431 1469 1492 -1103 -1714 750 1902 -340 -2054 -71 1954 478 -1810 -854 1628 1155 -1452 -1476 1065
5448 1065 1650 -818 -1936 331 1890 1 -1928 -491 1754 729 -1701 -1197 1336 1494 -1088 -1650
$$ packed form
5335b129J522K577r94k762M59K874N5k765p35K667J236k302j798K048K130j524
5351E59k521J132K629n00k815o2K747P10k641j218K378J695j981k174J638K400
5367A976j056k659N35K659Q6k703o20K587J121k361j578K025J924j488k353R57
5383i48K692n69k696N4K571O59k517j113K209J553j847j969J427K247r49k470
5399a666N21K587K4k596n75K416J112k130j651J904J963j463k300R94K522m88
5415A174k560p0K552O27k477j117K270J559j871j950J378K340r96k540N16K634
5431A469K3k595o11K464J152k242j714J983K025j476k288R56K482m73k607k4K541
5448A065N85k468j118K267J559j889j929J437K245j025k430N04K533J58k582n62
$$ plain form
5464 -1650 693 1817 -410 -1878 25 1822 365 -1767 -753 1530 1078 -1373 -1426 1072 1585 -708
5480 -708 -1803 377 1792 -3 -1817 -410 1671 758 -1526 -1077 1305 1351 -972 -1558 784 1730 -298
5497 -298 -1768 26 1827 486 -1710 -824 1635 1081 -1320 -1466 1025 1624 -653 -1817 260 1893
5513 1893 133 -1826 -441 1694 803 -1555 -1143 1305 1412 -961 -1636 628 1743 -203 -1837 -87
5529 -87 1817 521 -1671 -836 1525 1208 -1270 -1426 1028 1647 -636 -1777 270 1831 92 -1820
5545 -1820 -491 1664 813 -1522 -1099 1270 1427 -987 -1680 624 1681 -303 -1792 -144 1734 445
5561 445 -1663 -773 1502 1166 -1233 -1361 1018 1544 -665 -1758 296 1799 67 -1780 -408 1706
5577 1706 809 -1514 -1122 1302 1354 -1030 -1516 749 1701 -296 -1777 39 1800 398 -1686 -790 1487
$$ packed form
5464a650K343J124k227j468J903J797j457k132J014K283m52k451n3K498N13k293
5480g08j095K180J415j795j814J407K081r13k284M49K382M6k323n86K342R46k028
5497b98j470J794J801j341k196Q86K459n54k401j46K491N99k277j164K077J633
5513A893j760j959J385K135q91k358M12K448J07k373o75K264J115j946j634J750
5529h7J904j296k192Q35K361l17k478j56K454O19k283j141K047J561j739j912
5545a820J329K155q51k335M23K369J57k414o93K304J057j984j489J648J878j289
5561D45k108Q90K275l36k399j28K379N26k209j093K054J503j732j847J372K114
5577A706q97k323L92K424N2k384m86K265R52j997j481J816J761j402k084Q96K277
$$ plain form
5594 1487 1022 -1237 -1266 1027 1542 -698 -1640 392 1756 21 -1695 -368 1644 652 -1448 -1056 1209
5611 1209 1225 -995 -1463 680 1534 -284 -1607 -106 1597 384 -1494 -644 1309 951 -1105 -1217 837
5628 837 1327 -572 -1399 195 1499 140 -1460 -454 1390 733 -1214 -1004 899 1200 -726 -1426 393
5645 393 1479 -77 -1506 -223 1440 552 -1388 -776 1106 1077 -960 -1306 635 1397 -331 -1533 -16
5662 -16 1497 344 -1448 -683 1277 929 -1162 -1223 926 1431 -519 -1514 256 1650 114 -1546 -450
5679 -450 1487 813 -1360 -1076 1078 1346 -849 -1544 563 1575 -181 -1704 -222 1587 513 -1580
5695 -1580 -827 1351 1090 -1155 -1403 869 1546 -536 -1633 203 1709 152 -1654 -457 1580 794
5711 794 -1356 -1179 1091 1356 -885 -1517 571 1652 -194 -1678 -88 1685 481 -1588 -735 1507
$$ packed form
5594A487m65k259k9K293N15k240r42K032J364j735j716J327K012r92k100L92K265
5611A209J6k220m68K143Q54j818j323J501J703j213j878Q50J953l58k056j12K054
5628H37M90j899q27J594J304j359j600J006J844o57j947K10J903L01j926p00J819
5645C93J086j556j429J283J663q88j940O12J882k9k037l46J941P62j728j202J517
5662a6J513j153j792P65J960l48k091o1K149N05j950r95J770J394j536j660J096
5679d50J937o74k173K84K154K68k195o95K107J012j756j523J482J809j074k093
5695a580P53K178k61k245k48K272O77k082j097J836J506j557j806J197K037p86
5711G94k150J77K270K65k241o32K088J081j846j484J590J773j204k069Q53K242
$$ plain form
5727 1507 1068 -1204 -1302 980 1539 -638 -1628 310 1667 30 -1661 -377 1595 720 -1413 -995 1228
5744 1228 1250 -939 -1431 719 1559 -298 -1550 14 1648 308 -1549 -594 1362 929 -1142 -1117 990
5761 990 1323 -645 -1426 371 1413 -49 -1439 -281 1355 579 -1287 -820 983 1008 -827 -1142 538
5778 538 1284 -270 -1308 4 1344 300 -1236 -615 1010 822 -915 -976 650 1119 -424 -1228 120
5795 120 1199 137 -1236 -429 1076 608 -963 -840 786 1022 -587 -1120 342 1201 -2 -1228 -228
5812 -228 1191 468 -1147 -773 895 995 -752 -1128 402 1189 -158 -1315 -113 1254 347 -1288 -674
5829 -674 1086 933 -913 -1125 668 1241 -431 -1415 130 1469 184 -1405 -454 1349 798 -1192 -999
5846 -999 982 1269 -748 -1302 428 1505 -130 -1539 -181 1481 495 -1395 -770 1299 1041 -1053
$$ packed form
5727A507m39k272r8K282N59k177r90J938J357j637j691J284J972q75k133M18K223
5744A228K2k189m92K150Q40j857j252J564J634j340j857R55J956m33k071K5K107
5761I90L33j968p81J797J042j462j390J158J636p76j866M67J803K5j835l15J680
5778E38P46j554j038J312J340j044j536O21J625j88j737o1J626M69j543q04J348
5795A20J079j062j373Q07J505m68j571J23J626K36j609n33J462Q59j203j226J000
5812b28J419p23j615L74J668J00j747l76J530P87j347j157J202J367r07j635O14
5829f74J760j53j846k12J793N73j672r84J545J339j285j589R51J803n51j990J93
5846i99J981K87k017n54J730J077j635j409J358J662r86j890O25K069k58k094
$$ plain form
5862 -1053 -1128 850 1424 -517 -1551 217 1642 -9 -1602 -398 1546 724 -1416 -1005 1163 1201 -995
5879 -995 -1417 683 1522 -373 -1650 71 1577 243 -1591 -603 1492 812 -1277 -1126 1090 1349 -837
5896 -837 -1515 567 1645 -173 -1654 -88 1599 451 -1462 -727 1366 1025 -1170 -1195 907 1425 -565
5913 -565 -1414 326 1506 68 -1543 -288 1352 649 -1233 -863 1031 1028 -834 -1270 536 1301 -311
5930 -311 -1348 32 1397 227 -1331 -573 1126 837 -932 -892 669 1144 -513 -1273 206 1206 65
5947 65 -1222 -363 1076 531 -1044 -789 853 1021 -628 -1102 329 1179 -53 -1234 -200 1141 534
5964 534 -961 -714 944 923 -672 -1041 497 1193 -209 -1263 -87 1208 377 -1142 -572 1014 804
5981 804 -824 -1092 575 1252 -358 -1302 61 1365 194 -1269 -530 1233 756 -1102 -987 844 1189
$$ packed form
5862a053p5J978N74j941j034J768J425j651j593J204J944q22k140M11K168L8k196
5879i95m22K100Q39j895j277J721J506j334j834R88K095o80k089J51K216K59k186
5896h37o78K082J078j818j481J566J687j148j913P35K093l41k195k5K102N18j990
5913e65q49J740J180j438j611J255J640p03j882L70J894lj862m36J806P65j612
5930c11j037J380J365j170j558P58J699k89j769M0J561M75j657p60J479J000j141
5947F5j287Q59J439n45j575K55J642J68j649m74J431Q50j232j181J034J341o07
5964E34j495K47J658k1j595l69J538O96j402j054J176J295q31j519N70J586k10
5981H04j628k68J667O77j610r44J363J304j171j463P39J763m77j858J15J831L45
$$ plain form
5998 1189 -659 -1334 329 1421 -87 -1506 -307 1457 573 -1331 -968 1167 1093 -934 -1308 679
6014 679 1501 -404 -1623 107 1616 206 -1617 -567 1502 893 -1324 -1085 1144 1274 -776 -1520
6030 -1520 585 1664 -240 -1694 -63 1723 428 -1581 -800 1463 1050 -1226 -1321 1116 1502 -727
6046 -727 -1631 391 1714 -8 -1734 -299 1674 588 -1502 -854 1352 1103 -1114 -1424 803 1515
6062 1515 -502 -1633 163 1678 66 -1623 -427 1464 714 -1327 -966 1109 1227 -814 -1348 603
6078 603 1372 -297 -1455 8 1468 345 -1327 -546 1284 854 -1001 -988 763 1190 -517 -1264 264
6095 264 1301 50 -1279 -301 1174 440 -1015 -678 894 887 -681 -1118 382 1083 -149 -1125 -73
6112 -73 1146 301 -1004 -591 847 705 -689 -879 474 962 -304 -1013 9 1031 207 -967 -455
$$ packed form
5998A189j848o75J663J092j508j419J199J764q84j904L63K135p4k027l74J987
6014F79Q22j905j219J730J509j410j823J050K069o09k217K39K229J30k050p44
6030a520K105J079j904j454J631J786j295k009P81K263m13k276r5K437L86k229
6046g27r04K022J323j722j726J435J973j086k090O48K206k49k217l10K227P12
6062A515k017j131J796J515j612j689J196J891p50k041L61K075J18k041n34J951
6078F03P69j669j158J463J460j123j672P81J830m30j855J3J751M27j707p47J528
6095B64J037j251j329R78J475p34j455L37J572pj568m37J500P01j232r76J052
6112g3J219q45j305M13J438j42j394j90J353M88j266p09J022J022q24j174N12
$$ plain form
6129 -455 872 643 -711 -851 535 980 -334 -962 90 1016 156 -969 -340 986 615 -850 -738
6146 -738 638 875 -406 -951 256 1071 8 -1105 -202 1117 492 -988 -633 866 896 -726 -1039
6163 -1039 489 1111 -254 -1256 31 1296 236 -1262 -563 1181 755 -1013 -957 903 1070 -637
6179 -637 -1308 372 1392 -82 -1434 -154 1404 472 -1318 -739 1187 935 -986 -1223 779 1323 -503
6196 -503 -1482 262 1436 87 -1507 -314 1396 574 -1303 -807 1206 1071 -870 -1226 672 1325 -418
6213 -418 -1390 174 1489 132 -1467 -382 1356 625 -1125 -829 1096 1124 -772 -1209 529 1292 -329
6230 -329 -1324 20 1344 162 -1268 -507 1132 724 -1037 -834 874 959 -634 -1114 411 1113 -192
6247 -192 -1180 -50 1131 212 -1058 -552 940 654 -769 -773 618 927 -416 -1001 156 1022 22 -926
$$ packed form
6129d55J327k29j354j40J386M45j314o28J052R26q60j125O29J326l71j465J12
6146g38J376K37j281n45J207Q15j063j113R03J319o25j480L55J499L0j622l13
6163a039J528O22j365j002J287J265j060j498O99J744m26j768N6J860J67j707
6179f37o71J680J020j474j352J280J558r32j790N79J926k52j921k37K002N44j826
6196e03r79J744J174j349j594J193J710q22j877M96K013j35j941l56J898O53j743
6213d18r72J564J315j357j599J085J738p31j750K96J925K8j896m37J738P63j621
6230c29r95J344J324j182j430P61J639m08j761K03J708Q5j593m80J525P02j305
6247a92r88J130J181r19j270N06J492k86j423mJ391L09j343n85J157Q66j000r48
$$ plain form
6265 -926 -233 891 431 -767 -570 669 729 -510 -831 370 822 -100 -812 -77 828 258 -767 -333
6283 -333 626 535 -485 -649 368 687 -151 -769 46 733 161 -765 -335 652 389 -497 -573 372 602 -238
6303 -238 -757 46 678 108 -754 -264 732 490 -553 -564 441 735 -314 -825 148 864 -3 -846 -209
6322 -209 861 395 -731 -464 728 709 -516 -832 428 944 -197 -1012 -65 996 188 -986 -419 952
6340 952 596 -776 -720 707 790 -550 -1006 349 1062 -138 -1103 -42 1114 286 -1086 -527 982 698
6358 698 -896 -847 743 1002 -539 -1136 240 1178 -50 -1161 -173 1149 369 -1165 -525 993 719
6375 719 -835 -848 672 1011 -433 -1044 332 1137 -161 -1106 -154 1124 288 -1037 -474 923 715 -814
6393 -814 -839 653 999 -489 -982 309 1062 -37 -1070 -111 1013 323 -1019 -444 844 632 -703
$$ packed form
6265i26O93J124m60j198J97J239O0j239l21J201M52r22p12P35R05n70j025M34
6283c33R59r1j020j64J017L19q38o18Q15O87n72r26M30R87k63q86p6R45K30q40
6303b38n19Q03O32n70q62M90R96k42j043j1J005K94j049n11R73P16q67q43O37
6322b09J070m66j126K67J192j9j225l16J260N16j141q15R47J061q08j174N67J371
6340I52l56j372N6J427Q3j340m56J355P13j200r65J061J156q28j372N59J509k84
6358F98j594M9J590K59j541n97J376R38j228j111R88J322p80j534O40J518k74
6375G19j554j3J520L39j444o11J376Q05j298r45R52J278q36j325N63J397k08j529
6393h14k5J492L46j488m93J291P53j099j033R59J124o90j342N75J288k12j335
$$ plain form
6410 -703 -807 579 805 -385 -960 266 975 32 -968 -120 869 336 -794 -409 721 604 -594 -624
6428 -624 370 729 -307 -755 111 790 83 -810 -233 730 292 -609 -412 475 508 -368 -587 246 696 -81
6448 -81 -595 -31 604 164 -556 -253 499 407 -340 -428 336 487 -101 -589 16 538 75 -557 -191 431 332
6469 332 -420 -402 320 473 -125 -485 75 538 67 -530 -126 522 249 -460 -373 362 484 -248 -564 138 601
6490 601 10 -691 -35 649 244 -600 -342 565 406 -448 -629 346 681 -191 -760 87 755 59 -785 -219
6510 -219 708 362 -703 -546 640 603 -507 -699 371 881 -171 -881 29 810 106 -902 -309 831
6528 831 461 -714 -610 679 716 -504 -836 355 904 -311 -971 40 986 80 -972 -252 856 458
6546 458 -936 -605 748 771 -640 -860 481 915 -309 -1008 123 1052 94 -1065 -300 932 452 -874
$$ packed form
6410g03j04J386K26j190n75J226P09r43j000Q48R89n33j130L85J130j17j198l0
6428f24R94L59j036m48Q66O79p07q93N77R63m38r01J97Q87L3q76k19Q33M50p77
6448h1n14N64O35m40p20L03P52r2p47q8P64J51n88m88O05N22m63o32L66O22r9
6469C32p52J8P22J53n98l60N60M63m71n97M04O48k73p09Q7P35J22p32l16P02M63
6490F01n91p01O56O84m05q44K58R07j59q54j81R75L35q72n69Q47O68o96q44N66
6510b19R27l46j065J57J186l7j110j92J070N10j052p10R10P81p04j008N93J140
6528H31l70j175J04J289L7j220l32J191N49j215o60J011R46r06j052P20J108l98
6546D58j394L31J353K3j411k20J341M34j224o99J131R29r58j159P65J232m80j326
$$ plain form
6564 -874 -570 795 805 -686 -861 523 978 -278 -1006 140 1045 -37 -1090 -156 987 438 -916
6581 -916 -660 796 773 -618 -813 476 882 -302 -959 79 969 -33 -1004 -179 879 412 -792 -526
6599 -526 718 645 -548 -800 431 779 -242 -871 51 836 109 -873 -176 743 377 -594 -472 562 658
6618 658 -405 -769 301 765 -153 -707 -52 769 258 -681 -311 602 454 -525 -573 342 642 -195 -731 30
6638 30 734 80 -689 -280 679 377 -548 -529 482 652 -327 -667 229 740 10 -780 -187 735 299 -654
6658 -654 -491 520 604 -513 -722 264 832 -136 -861 -119 838 227 -910 -372 746 592 -681 -755 508
6677 508 841 -367 -987 216 1014 48 -997 -220 1054 404 -909 -658 928 884 -678 -941 528 1118
6695 1118 -295 -1134 61 1261 212 -1235 -406 1162 678 -1054 -834 912 1017 -761 -1200 440
$$ packed form
6564h74L04J365J0j491j75J384M55j256p28J146R05j082j053R34J143n49j354
6581i16K56J456k3j391j95J289M06j184o57J038Q90j002r71Q25J058m67j204K66
6599e26J244p3j193k52J231L48j021o29R22P85p27r82O97R19l66r71J22J034R6
6618F58j063l64J070M64r18n54O55Q21n11r39L70R13j48r79m8R15L00q37n36P61
6638C0P04o54p69M09R59l02r25J9J011J70r79l40Q96N11p30p90N93R22m36r53
6658f54J63J011Q4j117k09R86N68r68p25P42R57o11j137N38J118j54j273p4J263
6677E08L33j208o20J203P98r66j045P77J274o50j313K51J586m4j562k63J469N90
6695A118j413q39J195J200j049j447Q29J568m84j732K20J746J05j778m39J640
$$ plain form
6711 440 1339 -207 -1369 -10 1406 295 -1387 -574 1250 806 -1146 -1056 933 1229 -742 -1390 459
6728 459 1481 -161 -1450 -115 1493 405 -1437 -711 1265 925 -1142 -1135 893 1367 -682 -1481 361
6745 361 1507 -47 -1540 -212 1516 548 -1402 -745 1267 1033 -1043 -1199 810 1352 -551 -1436 245
6762 245 1503 3 -1493 -322 1410 648 -1283 -876 1072 1122 -819 -1222 542 1364 -305 -1365 63
6779 63 1382 242 -1352 -477 1210 770 -1045 -1017 790 1244 -589 -1250 323 1313 -23 -1377 -306
6796 -306 1265 556 -1123 -760 996 963 -764 -1215 475 1254 -261 -1269 -73 1318 371 -1205 -633
6813 -633 1096 904 -895 -1012 675 1293 -372 -1298 111 1420 232 -1331 -488 1281 753 -1091 -1060
6830 -1060 943 1220 -663 -1338 395 1444 -98 -1460 -279 1506 543 -1471 -887 1220 1133 -1041
$$ packed form
6711D40Q99j546j162J359J416j111j682Q13J824m44j952R0J989K96j971o48J849
6728D59J022j642j289J335J608j088j842P26J976l40k067PK028M74k049p99J842
6745C61J146j554j493J328J728r68j950O57K012k34k076j56K009N42j903q85J681
6762B45J258j500j496J171J732p62j931M07J948N0j941m03J764Q22j669j060J428
6779F3J319j140j594Q75J687m40j815K8J807M54j833o61J573R90j336j354J071
6796c06J571p09j679L63J756l3j727m51J690P79j515j008J196J391r47j576N72
6813f33J729j92j799j17J687O18j665r26J409J309j188j563Q43J769n28j844L1
6830a060K003K77j883o75J733J049j542j362J181J785r63k014N84K107q7k174
$$ plain form
6846 -1041 -1367 741 1542 -419 -1688 135 1669 287 -1704 -579 1627 935 -1417 -1212 1223 1462
6862 1462 -941 -1730 556 1909 -255 -1884 -102 1871 498 -1801 -890 1672 1281 -1428 -1573 1192
6878 1192 1802 -841 -2021 436 2088 -1 -2081 -332 2096 805 -1857 -1165 1727 1555 -1415 -1840
6894 -1840 1055 2037 -587 -2183 284 2260 209 -2232 -671 2108 1039 -1904 -1362 1630 1765 -1280
6910 -1280 -1977 925 2111 -501 -2267 67 2207 410 -2169 -801 1980 1202 -1776 -1524 1413 1789
6926 1789 -1014 -2037 664 2094 -187 -2176 -172 2066 657 -1870 -1052 1731 1364 -1454 -1698 1085
6942 1085 1828 -722 -1975 290 1984 124 -1995 -616 1811 999 -1722 -1347 1403 1634 -1024 -1773
6958 -1773 664 1880 -225 -1973 -180 1867 565 -1798 -992 1504 1315 -1367 -1652 947 1801 -546
$$ packed form
6846a041l26K108Q01j961j269J823J534j382j991J125K206o92k352K05K435K39
6862A462k403p89K286J353k164j629J782J973j373k299R11K562l91k709j45K765
6878A192O10k643j180K457J652k089k080J749K428j291k662O92K892j72k970m25
6894a840K895R82k624j596K467J976k051k441J561K779j069k943N42K992J35l045
6910a280o97K902J186k612j766K334K140j797k579J368K781p78k978K52K937L76
6926A789k803j023K701J430k281j989K004K238j409k527Q18K783l67k818k44K783
6942A085P43k550j253K265J694j860k119J379K427q12k721L75K750K31k658p49
6958a773K437J216k105j748J793K047j302k363Q06K496j89k682k85K599Q54k347
$$ plain form
6974 -546 -1916 52 1917 338 -1853 -712 1710 1186 -1529 -1440 1232 1670 -774 -1879 408 1972
6990 1972 30 -1946 -436 1884 917 -1649 -1243 1463 1643 -1174 -1822 703 2024 -342 -2110 -48
7006 -48 2145 527 -2025 -1110 1791 1418 -1603 -1729 1171 2087 -845 -2302 344 2337 91 -2447
7022 -2447 -607 2227 1106 -2066 -1525 1811 1862 -1409 -2262 975 2474 -516 -2606 -3 2628 549
7038 549 -2580 -1025 2409 1551 -1993 -1911 1739 2311 -1190 -2533 790 2718 -156 -2888 -383 2810
7054 2810 940 -2563 -1410 2329 1880 -1993 -2269 1534 2602 -958 -2745 403 2863 97 -2876
7069 -2876 -723 2698 1241 -2530 -1701 2123 2087 -1717 -2438 1154 2651 -642 -2831 97 2793 441
7085 441 -2709 -959 2427 1466 -2196 -1936 1775 2254 -1332 -2523 797 2699 -241 -2660 -310 2671
$$ packed form
6974e46j370J968J865j579k191J141K422n24k715Q9K672M38k444j105K287J564
6990A972j942j976J510K320r67k566M06K706J80k817o48K525J321k366j768K062
7006d8K193j618k552R15K901l73l021j26K900R16k932j457K646J993k246k538
7022b447J840K834j121l172N41L336N1l271q53L237J499k990k090K603K631k079
7038E49l129J555L434q58l544Q2L650N72l501j343L323J928k874k732K505L193
7054B810j870l503J153L739m49l873k76L803J068l560j787L148K460k766k973
7069b876K153L421j457l771Q29L824l6l804p21L592J497l293k189K928K696k352
7085D41l150J750L386r61l662K60L711M79l586j191L320J902k940k419K350K981
$$ plain form
7101 2671 820 -2447 -1293 2218 1743 -1873 -2099 1407 2402 -907 -2497 347 2586 234 -2557 -710
7117 -710 2439 1251 -2104 -1656 1742 2003 -1346 -2352 809 2412 -321 -2405 -131 2432 728 -2220
7133 -2220 -1193 1972 1634 -1637 -2031 1168 2175 -735 -2393 114 2371 361 -2304 -877 2149
7148 2149 1265 -1894 -1685 1507 2002 -1066 -2247 600 2396 -50 -2428 -421 2359 916 -2170 -1430
7164 -1430 1834 1893 -1413 -2127 1023 2491 -445 -2567 -2 2604 588 -2494 -1107 2358 1657 -2023
7180 -2023 -2071 1649 2442 -1144 -2625 542 2827 -3 -2903 -635 2820 1172 -2575 -1730 2264 2210
7196 2210 -1758 -2600 1286 2890 -767 -3060 96 3129 469 -3044 -1130 2910 1685 -2551 -2173
7211 -2173 2064 2611 -1582 -2953 950 3147 -375 -3223 -206 3201 827 -3078 -1553 2644 2047
$$ packed form
7101B671j851l267J154L511m75l616k26L506R95l309j590K844K239k352k791J847
7117g10L149j188l355M48L398K61l349j006L161J603k733k084K274K563j704k948
7133b220J027L165l38l271l94L199J007k910j658K507K257k010k665J427L026
7148B149q84l159K09L192M95l068j181K847J796k446k378K007K780j443l086P40
7164a430L264N9l306p14L150J468k936k122K565K606k016l082J387L465p01l680
7180b023m8L720P93l586j481L167K285k830k900K268L455j648l747Q45L994n4
7196B210l968q42L886J604l657k293L156L033k660l513J914M040j225m236L78
7211b173M237N47m193j371L903K197l522k848L017L407k374l905J525M197n97
$$ plain form
7226 2047 -2393 -2472 1827 2844 -1248 -3133 662 3214 -20 -3186 -602 3042 1248 -2876 -1808
7241 -1808 2426 2254 -2024 -2640 1461 2904 -874 -3053 313 3081 403 -3017 -939 2828 1561
7256 1561 -2511 -2016 2138 2458 -1570 -2789 1049 3003 -442 -3041 -224 2970 763 -2762 -1326
7271 -1326 2457 1857 -2113 -2247 1568 2526 -1023 -2708 477 2798 -15 -2719 -713 2613 1248 -2239
7287 -2239 -1668 1930 2093 -1454 -2275 944 2501 -377 -2578 -110 2524 710 -2307 -1138 2139 1677
7303 1677 -1679 -1965 1270 2208 -773 -2356 315 2440 303 -2373 -768 2182 1224 -1971 -1689 1496
7319 1496 1989 -1093 -2229 601 2417 -116 -2461 -391 2402 937 -2216 -1403 1881 1830 -1530 -2100
7335 -2100 1133 2375 -642 -2536 -11 2567 576 -2441 -1077 2297 1496 -2005 -1908 1580 2309 -1161
$$ packed form
7226B047m440p9M299J017m092j885L795K552l234l166K584L644j794m124J068
7241a808M234j72m278o16M101J443l778k179L366K768k678l420K078L767j267
7256A561m072M95M154L20m028j219L838J954l445k599K817L194k207l525J436
7271a326L783o00l970j34L815R58l549j685L185K321k813k704K006L326j365l487
7287b239N71L598J63l547q21L219J557k878k201K468K634j814l017J169L277m62
7303A677l356k86L235R38k981j583K671K125k137k676J605K950r58l195K82L185
7319A496M93l082j136K830J816k533k345K070K793j465l153Q13L284n1l360n70
7335b100L233J242l017j894K525K578j991l017J364L374q01l501R7L488P29l470
$$ plain form
7351 -1161 -2551 638 2680 -77 -2803 -465 2674 1103 -2455 -1509 2094 1998 -1779 -2362 1347 2614
7367 2614 -817 -2909 254 2838 376 -2771 -904 2612 1377 -2308 -1939 1974 2256 -1494 -2642
7382 -2642 995 2802 -430 -2923 -97 2863 576 -2768 -1166 2505 1731 -2212 -2177 1733 2465 -1302
7398 -1302 -2727 681 2816 -159 -2886 -361 2726 859 -2640 -1431 2357 1835 -1994 -2245 1504
7413 1504 2558 -973 -2737 441 2878 31 -2820 -599 2719 1139 -2342 -1566 2057 2044 -1581 -2295
7429 -2295 1180 2557 -595 -2651 170 2649 467 -2507 -932 2332 1423 -1952 -1741 1646 2063 -1185
7445 -1185 -2294 747 2346 -179 -2397 -236 2269 717 -2160 -1208 1875 1601 -1499 -1885 1046 2043
7461 2043 -637 -2153 217 2172 243 -2036 -763 1870 1167 -1716 -1538 1342 1754 -952 -1969 532
$$ packed form
7351a161j390L189K042k757k726K338L139j571l558R46L603r6l777n83L709J267
7367B614l431k092L163K584k462l147J867L516j235l685L69L913K82l750j148
7382b642L637J807l232k493K826K960k287l344J602L671p74l943L5L910P32l767
7398a302j425L408K135k975k727K525L087j867l499J209L788n22l829k51L749
7413A504J054l531j764L178K437k847k851K221L318j580l481P76L623j3l625p14
7429b295L475J377l152k056K821K479k182k974J575L264r09l375K11L387M17l248
7445a185j109L041J599k525k218K161K505j552k877R52L083k74l100l86K931R97
7461B043k680j516K370J955j929k279J273K633p03k883J78K880M12k706j017K501
$$ plain form
7477 532 2025 -107 -2088 -347 2024 813 -1800 -1159 1715 1528 -1235 -1756 908 2068 -344 -2006
7493 -2006 0 2179 560 -2036 -899 1817 1370 -1537 -1655 1265 1959 -777 -2104 361 2195 68
7509 68 -2162 -624 2056 956 -1873 -1403 1647 1719 -1267 -2017 784 2154 -358 -2287 -43 2214
7525 2214 535 -2193 -976 1955 1432 -1740 -1783 1277 1987 -927 -2242 486 2329 14 -2364 -415
7541 -415 2284 894 -2097 -1336 1850 1673 -1517 -2011 1146 2208 -637 -2374 246 2457 258 -2381
7557 -2381 -680 2281 1109 -1992 -1577 1763 1850 -1331 -2170 1004 2394 -469 -2371 -54 2458 439
7573 439 -2313 -886 2084 1343 -1842 -1741 1519 1932 -1106 -2172 646 2344 -188 -2290 -317 2228
7589 2228 726 -2055 -1091 1865 1477 -1506 -1711 1225 1910 -806 -2040 407 2117 33 -2047 -486
$$ packed form
7477E32J493k132j981J741K371j211k613O41K874j87k763n21K664J160k412j662
7493b006K006K179j619k596J137K716m47k907j18K920O94k736j327K465J834k127
7509F8k230J538K680j100k829M70L050P2k986p50K801J370k512j929K244K257
7525B214j679k728J217K931n23l172m3L060P10k914j315K728J843k315k378J949
7541d15K699j390k991P61L186j77l190m94L157J062k845j737K620K211k199k639
7557b381J701K961j172l101M15L340Q7l181q39L174J390k863j902K317K512k019
7573D39k752J427K970p41l185J01L260M13l038j066K818J698k532k102J973K545
7589B228j502k781R64K956l88k983k05K936O85k716j234K447J710k084k080J561
$$ plain form
7605 -486 1957 878 -1797 -1174 1540 1489 -1200 -1681 804 1802 -408 -1870 90 1840 433 -1714
7621 -1714 -680 1612 1015 -1354 -1275 1034 1499 -752 -1626 407 1734 -29 -1729 -366 1581 666
7637 666 -1486 -978 1254 1196 -1029 -1456 683 1554 -359 -1679 -66 1560 351 -1612 -701 1380 965
7654 965 -1241 -1280 916 1431 -653 -1580 283 1642 68 -1554 -431 1575 771 -1406 -991 1149 1326
7671 1326 -812 -1490 592 1572 -259 -1606 -75 1679 520 -1495 -723 1465 1084 -1169 -1282 904
7687 904 1518 -519 -1718 259 1718 34 -1742 -431 1609 707 -1482 -1072 1294 1291 -1065 -1535 775
7704 775 1636 -403 -1817 22 1785 295 -1814 -682 1569 920 -1461 -1207 1277 1500 -971 -1685
7720 -1685 678 1767 -231 -1853 -96 1903 488 -1767 -785 1650 1109 -1448 -1415 1168 1634 -805
$$ packed form
7605d86K443j079k675O23K714n1k689m81K485R98k210j462J960J750j407k147
7621a714J034K292n97k369P9K309M65k251q74K033J327j763j700J363J947r15
7637F66k152N08K232n8k225m27K139Q71j913j320J613J626j209j963R11K081m15
7654I65k206l9K196N15k084r27J863J359j574j622J123K006q04k177M15K140J77
7671A326k138o78K082R80j831j347J531J754j159k015P72K188l81k253j13K186
7687I04O14k037j199J977J459j684j776J311K040r02k189M10K366lk356m70K310
7704G75Q61k039j414J839J763j490k109J132K251o49k381K54K484K23k471p14
7720a685K363J089j998j622J757J999j415k255R82K435n41k557L3K583M66k439
$$ plain form
7736 -805 -1782 534 1847 -63 -1904 -252 1794 565 -1659 -929 1547 1217 -1308 -1475 940 1578
7752 1578 -642 -1717 344 1723 -28 -1772 -384 1644 655 -1513 -906 1331 1210 -1051 -1448 745
7768 745 1439 -500 -1647 189 1564 165 -1548 -436 1398 789 -1226 -992 1111 1178 -808 -1311 483
7785 483 1453 -194 -1442 -48 1417 357 -1317 -671 1233 855 -1007 -1077 824 1231 -479 -1289 267
7802 267 1362 26 -1296 -299 1288 569 -1157 -826 935 966 -667 -1130 449 1172 -219 -1349 8
7819 8 1183 320 -1160 -537 977 793 -887 -997 595 1086 -426 -1229 178 1152 47 -1256 -335 1164
7837 1164 631 -976 -829 775 997 -580 -1131 400 1211 -141 -1294 -86 1233 345 -1188 -607 1035
7854 1035 799 -881 -984 725 1163 -478 -1302 193 1342 105 -1389 -323 1358 617 -1186 -800
$$ packed form
7736h05r77K316J313j910j841J652K046j229k224P30K476l30k525j67K415O38
7752A578k220j075K061J379j751j744J388K028r89k168O07K237j21k261l97K193
7768G45O94j939j147J836J375j399j713J112J834o09k015K34K103O7j986n03J794
7785D83R70j647j248J394J465j060j674O46J904l78j862p0J901M07j710q10J556
7802B67J095j336j322R97J587p19j726L31J761L1j633m63J579P23j391j130J357
7819HJ175q63j480O23J514j84j680j10J592M91j512q03J407R74j105j303R21J499
7837A164n33j607J47J604K22j577n51J531Q11j352j153J208J319q88j533N81J642
7854A035k36j680j03J709M38j641q24J495J149j237j494J066J681p41j803L86
$$ plain form
7870 -800 1075 1100 -859 -1222 594 1383 -386 -1517 70 1528 262 -1432 -548 1348 737 -1214 -995
7887 -995 1048 1276 -858 -1401 491 1515 -221 -1577 -24 1583 354 -1578 -655 1329 919 -1256
7903 -1256 -1126 968 1333 -734 -1465 555 1611 -148 -1616 -56 1637 435 -1456 -724 1381 962
7919 962 -1126 -1146 964 1333 -675 -1463 387 1552 -161 -1583 -223 1504 472 -1416 -710 1276
7935 1276 962 -1076 -1248 818 1342 -587 -1449 209 1544 17 -1573 -324 1417 518 -1313 -850
7951 -850 1130 1048 -893 -1190 669 1334 -396 -1385 87 1400 185 -1338 -434 1251 761 -1091 -877
7968 -877 899 1082 -626 -1212 410 1262 -140 -1258 -48 1239 411 -1135 -619 1038 813 -802 -933
7985 -933 647 1106 -341 -1142 103 1219 202 -1167 -396 1116 601 -893 -828 719 1044 -511 -1118
$$ packed form
7870h00J875K5j959l63J816P89j769j131J587J458j266j694Q84J896o11j951K19
7887i95K043K28k134n43J892J024j736j356J553J607j229j932R23J984m10k175
7903a256J30K094L65k067p31K020J056j759j468J560J693j202j891P32K105m19
7919I62k088k0K110L69k008p88J850J165j713j422J360J727j032j888P06J986
7935A276l14k038j72K066N24j929q62J658J335j527j590J249J741q99j831M63
7951h50J980q2j941k97J859O65j730r89J472J313j215j523R04J685m90j852K14
7968h77J776J83j708n86J622Q52j402j118J210J287q28j546N16J657k25j615j31
7985i33J580M59j447q01J245J116j017j369P71J512n15j494O5J547L25j555o07
$$ plain form
8002 -1118 371 1195 -37 -1156 -148 1232 467 -1086 -645 970 875 -749 -1105 583 1248 -247 -1242
8019 -1242 44 1302 233 -1293 -464 1225 769 -1065 -991 862 1178 -599 -1345 362 1357 -60 -1423
8036 -1423 -237 1454 466 -1320 -778 1203 1001 -1007 -1264 796 1406 -459 -1495 217 1551 73
8052 73 -1570 -404 1487 688 -1311 -978 1217 1195 -888 -1397 670 1547 -449 -1628 88 1594 331
8069 331 -1622 -576 1524 914 -1374 -1179 1141 1281 -839 -1526 548 1660 -272 -1653 -93 1648
8085 1648 404 -1650 -759 1519 910 -1263 -1250 1029 1447 -746 -1629 411 1719 -187 -1735 -167
8101 -167 1726 504 -1578 -846 1410 1155 -1184 -1325 938 1516 -587 -1596 397 1687 17 -1657
8117 -1657 -336 1542 707 -1440 -1005 1208 1241 -1058 -1433 700 1474 -401 -1612 82 1555 264
$$ packed form
8002a118J489Q24j232j119J008J380p65j553M41J615r5j624l56J688O65j495r95
8019a242J286J258j069j526Q29J689m56j834P4J853L16j777p46J707R95j417j363
8036a423J186J691r88j786N42J981k02k008k57K060O10j865j036J712J334j478
8052G3j643J166J891p99j999L33K195k2k083n09K067Q77j996j179J716J506j263
8069C31j953J046K100o10k288J95K320J40k120o87K074J112j932j381J560J741
8085A648j244k054Q91K278o09k173J3K279M18k193q83K040J308j906j548J568
8101a67J893j222k082P32K256k55k339j41K263N78k103j009J993J290j670j674
8117a657J321J878q35k147M35K213L3k299l75K133P74j875j211J694J473j291
$$ plain form
8133 264 -1477 -552 1391 858 -1209 -1139 948 1334 -705 -1401 379 1445 -45 -1452 -184 1448 544
8150 544 -1307 -775 1094 982 -845 -1182 637 1424 -308 -1418 92 1409 283 -1328 -509 1295
8166 1295 798 -1121 -1063 881 1243 -652 -1398 338 1430 -64 -1497 -347 1458 639 -1364 -911 1220
8183 1220 1148 -929 -1350 628 1510 -369 -1637 87
$$ packed form
8133B64j741R25J943n33k067P0K087L86k039o96J780J066j490j407J268J632r04
8150E44j851N32J869j12j827l37J819P87j732j110J510J317j126j611Q19J804
8166A295m97j919N8J944L62j895p46J736J092j494j433J150J805q19k003M53K131
8183A220p2k077m21J978Q82j879j268J724
8191H7
$$ Imaginary data points
##PAGE= N=2
##DATA TABLE= (X++(I..I)), XYDATA
$$ plain form
0 0 0 0 0 -2 0 0 5 -8 8 0 13 -16 13 -16 24 -27 26 -33 45 -49 53 -63 79 -83 94 -110 128 -138 156 -180 202
31 202 -219 247 -280 308 -338 379 -423 464 -510 570 -635 697 -769 859 -956 1061 -1190 1344
49 1344 -1520 1731 -2003 2347 -2794 3416 -4333 5788 -8374 13936 -30687 179944 850849
62 850849 166689 -666556 -93447 912984 588852 -443415 -332065 712143 813487 -174994
72 -174994 -462074 456733 895355 35898 -616391 75632 847762 308490 -600465 -303370
82 -303370 601943 454518 -491822 -543925 372340 587466 -311170 -734663 57390 645871
92 645871 -1928 -702789 -207949 570762 232438 -588468 -388138 491314 486046 -378160
102 -378160 -549025 272313 626468 -78725 -546359 57268 629938 141549 -524066 -170820
$$ packed form
0@%%%kK%Nj3J6qJ3k9K9k9M0n1N3n9P8r4J02j16J42j62J77k04K38k66K94l36L82
31B02m21M66n27N88o46P17q02Q87r74J080j205J332j466J628j815K017k251K534
49A344k864L251l734M350n141O210p749J0121j4162K2310m4623K10631O70905
62H50849o84160q33245N73109J006431l24132j032267J11350J044208J01344r88481
72a74994k87080R18807M38622q59457o52289O92023P72130n39272r08955K97095
82c03370R05313j47425r46340n2103R16265K15126q98636m23493P92053N88481
92F45871o47799p00861M94840P78711l38324q20906K00330Q79452n268q64206
102c78160j70865Q21338L54155p05193m67634O03627N72670m88389o65615L53246
$$ plain form
112 -170820 570232 379332 -403441 -402837 347955 498430 -203785 -490805 141049 543660
122 543660 -13834 -537383 -88747 541205 245490 -437249 -297593 396520 402826 -271868
132 -271868 -404574 242727 502497 -101554 -501188 7591 515901 126745 -460144 -213893
142 -213893 398723 270933 -363430 -363606 271046 402402 -213025 -490584 52980 449673
152 449673 5745 -477178 -143627 396645 170465 -415063 -302308 321270 350453 -267359
162 -267359 -434470 145296 443066 -57842 -446993 -22751 449970 114221 -433792 -206455
172 -206455 399376 302248 -329962 -376475 234763 402329 -171183 -448909 72177 451514
182 451514 -4520 -485244 -123327 443290 206847 -405584 -296451 334019 351188 -270476
$$ packed form
112a70820P41052j90900p82773O04P50792J50475p02215k87020O31854M02611
122E43660n57494n23549M48636O29952k95715o82739J39656O94113O306o74694
132b71868j32706O47301K59770o04051l99634N08779N08310l89156n86889K46251
142b13893O12616j27790o34363j76O34652J31356o15427k77559N43564L96693
152D49673m43928m82923L33551N40272k26180n85528J12755O23578K9183o17812
162b67359j67111N79766K97770n00908l89151M24242M72721l35749n48013K27337
172b06455O05831r7128o32210m6513O11238J67566n73512k77726N21086L79337
182D51514m56034m80724L61917N66617k36443o12431J09133O30470J7169o21664
$$ plain form
192 -270476 -399416 210505 465948 -99665 -474515 19624 503350 114688 -442608 -167428
202 -167428 435914 269702 -371931 -329723 323840 405937 -245117 -471313 123747 462989
212 462989 -63165 -503490 -67800 448241 105173 -479643 -246047 393156 293030 -362404
222 -362404 -394445 249570 411391 -187421 -454055 96245 469143 -8677 -473418 -83470
232 -83470 465424 195710 -397456 -247659 366288 337495 -271449 -354009 238109 433302
242 433302 -124086 -435737 50594 454859 53344 -428608 -134187 388779 190268 -369581
252 -369581 -280285 295032 319100 -250745 -392670 141593 391638 -79549 -413437 -12282
262 -12282 394157 74675 -390611 -162249 350664 232075 -300336 -294963 229393 332131
$$ packed form
192b70476j28940O09921K55443n65613l74850M94139M83726l88662n57296K75180
202a67428O03342j66212o41633M2208O53563Q2097o51054k26196N95060L39242
212D62989n26154m40325M35690N16041l43068n84816K33596O39203j00126o55434
222c62404l2041O44015J61821n98812k66634N50300L72898m77820m64741L89948
232h3470N48894k69714n93166J49797O13947k8793o08944q2560N92118J95193
242D33302n57388l11651M86331M04265m01515m81952K94421N22966j98511n59849
252c69581Q9296N75317K4068n69845j41925N34263K50045m71187l33888M01155
262a2282M06439l19482m65286K28362N12913j18589n32411N373N24356J02738
$$ plain form
272 332131 -159007 -353413 95309 376879 -13130 -372592 -57350 368746 149344 -316908
282 -316908 -200480 278741 260466 -214261 -290123 164776 330854 -89711 -345624 15532
292 15532 346136 62489 -321685 -125977 287918 178067 -252166 -231000 200284 270097
302 270097 -144824 -307068 65767 308077 -3364 -306632 -64669 284375 117773 -263483
312 -263483 -176736 225868 229497 -171731 -266062 110490 287470 -45807 -290396 -9774 292423
323 292423 74106 -275222 -128287 257985 197723 -200127 -226186 164247 273718 -90065
333 -90065 -272738 53662 302872 23992 -289470 -78702 281004 146978 -243979 -197395
343 -197395 199841 234435 -156673 -271685 100055 294503 -41741 -311330 -29608 303740
$$ packed form
272C32131m91138j94406M48722K81570l90009l59462L15242M26096k19402m66252
282c16908J16428M79221j8275m74727p5862M54899J66078m20565k55913L61156
292A5532L30604k83647l84174J95708M13895j09851m30233K1166M31284O9813
302B70097m14921j62244L72835K42310l11441l03268K41963L49044j66602l81256
312b63483Q6747M02604L629m01228r4331L76552J76980l33277k44589K80622L02197
323B92423k18317l49328J46935L86272o0262l97850k6059L90433J09471l63783
333i0065j82673L26400K49210k78880l13462K10768L59706j34026l90957M6584
343a97395L97236L4594l91108j15012L71740J94448l36244k69589K81722L33348
$$ plain form
353 303740 91950 -287158 -154255 251189 196120 -224924 -253710 166512 280114 -122099
363 -122099 -319634 43869 316908 11239 -318574 -75840 301657 132931 -276689 -186501
373 -186501 243919 241643 -188904 -275982 132167 299413 -72692 -312646 9522 310654
383 310654 46622 -308939 -116690 279191 169418 -247035 -222465 196152 254248 -150213
393 -150213 -285205 93466 301992 -37204 -313372 -29049 303282 87345 -283244 -140296
403 -140296 254005 187495 -214870 -222586 178131 264258 -116628 -276707 69116 295812 81
414 81 -280170 -42882 278113 103475 -249303 -145347 225418 195295 -179962 -227700 131704
425 131704 248828 -84157 -265785 27104 261991 14614 -269232 -80297 239108 115849
$$ packed form
353C03740k11790l79108J32903M05444n5069m21044k8786M20222J13602m02213
363a22099j97535L63503K73039l05669l29813K42734L77497j68726m09620R0188
373a86501M30420k276m30547q7078M08149J67246l72105k39954L22168L01132
383C10654k64032l55561J92249L95881j09773m16453K4570M18617N8096m04461
393a50213j34992L78671K08526l39196k76168K84323L32331k15937l70589J42948
403a40296L94301o6510m02365p716M00717Q6127l80886j60079L45823K26696k95731
414H1k80251K37288L20995j74638l52778J03956L70765l0123l75257m7738L59404
425A31704J17124l32985j81628K92889K34887k47377k83846J88935L19405j23259
$$ plain form
435 115849 -224712 -171015 175136 190303 -145872 -223783 95002 235265 -51159 -245906
445 -245906 -1628 240716 51541 -223101 -93256 200894 132315 -169007 -161211 137608
455 137608 191745 -90649 -203038 50933 215722 2913 -202154 -36194 198443 82836
465 82836 -173236 -113082 152152 147943 -116872 -171685 76017 181910 -39828 -190841 -3530
476 -3530 184594 38113 -179262 -78999 159767 112703 -133791 -140747 101190 159374 -67970
487 -67970 -173880 29367 176868 4029 -181755 -50061 164579 80470 -152081 -118754
497 -118754 120359 138585 -95808 -162517 60026 175331 -23890 -182782 -15863 180846
507 180846 56540 -166492 -88247 152151 123810 -122966 -144286 101059 174831 -56594 -179404
$$ packed form
435A15849l40561N3697L46151J5167l36175p7911L18785J40263k86424j94747
445b45906K44278K42344j89175k74642J29845K94150o8579l01322P796K98819
455A37608N4137k82394j12389K53971J64789k12809k05067J65960K34637j15607
465H2836k56072O0154K65234m209k64815n4813K47702J05893k21738j51013J87311
476c530J88124j46481k17375J00263K38766m7064k46494o956K41937N8184k27344
487f7970j05910K03247J47501j72839j85784J31694K14640q4109k32551L3327
497a18754K39113J8226k34393o6709K22543J15305j99221j58892J66919J96709
507A80846j24306k23032P8245K40398k8341k46776k1320K45345P3772k31425j22810
$$ plain form
518 -179404 27277 193960 21825 -181007 -50693 178044 92261 -156524 -122165 134078
528 134078 151485 -103633 -175350 64102 183895 -31878 -195447 -12460 187507 43122
538 43122 -187012 -88503 162805 115621 -144958 -149962 109831 167610 -78862 -183265 44810
549 44810 196158 -655 -189913 -29185 193778 79334 -165132 -99319 156798 140577
559 140577 -119159 -154765 96789 180632 -56065 -188537 19841 192404 18738 -187542
569 -187542 -55201 175862 88782 -158226 -118962 136020 147583 -103925 -165158 72490 180188
580 180188 -34332 -182637 1568 184658 37366 -173299 -67846 163139 105049 -134804
590 -134804 -124660 114371 151270 -77730 -159419 50142 170744 -14562 -172503 -22617
$$ packed form
518a79404K06681J66683j72135k02832J30314K28737q5783k48785L4359K56243
528A34078J7407k55118p1717K39452J19793k15773j63569J82987J99967j44385
538D3122k30134R8509K51308m7184k60579n004K59793N7779k46472j04403K28075
549D4810J51348j96813j89258J60728K22963j14444k44466O5813K56117j6221
559A40577k59736l5606K51554Q3843k36697j32472K08378J72563j73666k06280
569a87542J32341K31063q7080k47008L9264K54982J1563k51508o1233K37648J07698
580A80188k14520j48305J84205J83090j47292k10665J05453K30985n8090k39853
590a34804J0144K39031L6899k29000q1689K09561J20602j85306j57941J49886
$$ plain form
600 -22617 161251 48874 -155858 -87752 125479 100042 -114598 -131764 76424 135771 -56136
611 -56136 -152475 17464 147794 9475 -145054 -40018 133116 65905 -117146 -87721 98788
622 98788 108625 -72614 -120115 47839 129312 -18589 -128895 -6646 126324 32566 -117960
633 -117960 -57293 103412 76853 -87205 -95955 62938 104731 -42195 -113546 16652 114608
644 114608 7464 -111583 -30490 105564 55612 -89142 -71135 76109 90102 -52820 -97559
655 -97559 34976 107803 -9441 -108151 -13007 105950 36304 -97935 -57926 83780 73049
666 73049 -71647 -91977 47834 97071 -33275 -110759 2358 103535 12376 -107155 -41178
677 -41178 92611 55966 -84027 -75698 67454 91191 -45562 -97770 28478 108079 -889
$$ packed form
600b2617J83868j12377k04732O8106K13231k5437k14640j7166K08188N9347j91907
611e6136r6339J69939J30330j38319j54529J05036J73134o7211j83051K9425J86509
622I8788R837j81239m7501J67954Q1473j47901j10306J22249J32970r3758j50526
633a17960O0667J60705k6559j64058q750J58893M1793j46926p1351J30198R7956
644A14608j07144j19047Q1093J36054m9952j44754J8007J47244J3993j42922m4739
655i7559J32535P2827j17244r8710R5144J18957o9646j34239M0009J41706j0731
666G3049j44696k0330J39811M9237j30346p7484J13117J01177r1159j19531O5977
677d1178J33789l6645j39993Q329J43152K3737j36753n2208J26248P9601j08968
$$ plain form
688 -889 -103753 -16556 104152 40803 -94883 -60411 82409 76421 -69259 -93737 47229
699 47229 100021 -30742 -109494 6772 109484 13472 -108029 -34982 102080 56635 -88654
710 -88654 -71048 78262 90389 -55828 -95486 44026 112040 -13476 -105574 2452 116429
721 116429 31419 -99024 -39837 101714 69225 -80087 -78220 70399 95999 -50015 -106348
732 -106348 26809 107184 -12073 -116843 -18730 103766 28093 -109310 -60082 86798 66149
743 66149 -83879 -91266 56924 93014 -46554 -107624 20289 105962 -3963 -108989 -19377
754 -19377 102522 38113 -94065 -55351 82533 70846 -67471 -82316 51017 91072 -33300
765 -33300 -97639 11927 96412 4731 -96589 -26254 87183 39918 -81064 -57554 66812
$$ packed form
688h89j02864Q7197J20708o3349j35686L4472J42820n988j45680k4478J40966
699D7229N2792j30763p8752J16266J02712r6012j21501P3047J37062m5445j45289
710h8654J7606J49310J2127j46217l9658J39512O8014j25516r2098J08026J13977
721A16429q5010j30443N9187J41551l2489j49312J867J48619K5600j46014n6333
732a06348J33157Q0375j19257j04770R8113J22496p5673j37403M9228J46880k0649
743F6149j50028p387J48190L6090j39568o1070J27913Q5673j09925j05026Q9612
754a9377J21899o4409j32178L8714J37884j1687j38317j4845J33333M0055j24372
765c3300o4339J09566Q4485r1681j01320P0335J13437m7265j20982K3510J24366
$$ plain form
776 66812 68463 -53577 -78969 36742 84990 -19144 -86518 3073 87028 15393 -81135 -29182
788 -29182 76509 46795 -62813 -55377 54076 68825 -35540 -70849 24513 78154 -5427
799 -5427 -75774 -8590 74115 24350 -68222 -38962 57944 48831 -48881 -60071 34533 65760
811 65760 -21048 -69604 6823 71756 10261 -66500 -21425 64321 37611 -53074 -45761 45459
823 45459 57176 -31277 -62036 18714 66210 -3830 -66050 -9960 63811 23906 -57991 -35929
835 -35929 50445 47213 -39800 -55676 27353 60908 -15134 -65225 -241 63606 11881 -63201
847 -63201 -27342 55772 37539 -49426 -49340 38198 56552 -27309 -63052 13888 65782 -949 -67101
860 -67101 -13874 63499 25828 -60011 -39877 50489 48546 -43152 -59694 29393 64330 -18412
$$ packed form
776F6812J651j22040k5392J15711M8248j04134o7374Q9591Q3955p1635r6528N1953
788b9182J05691k9714j09608P436J09453J4749j04365l5309R5362N3641q3581
799e427p0347O7184Q2705m9765r2572K9260R6906r113r7712j1190R4604L1227
811F5760q6808m8556P6427O4933o1495p6761M5075Q5746k6710r0685P313R1220
823D5459J1717q8453l0759Q0750M7496p0040o2220N6090P3771l9905q1897K2062
835c5929Q6374l232q7013j5876Q3029L3555p6042n0091O4984O3847n1725p5082
847f3201L5859Q3114j8233q6965Q6Q7538J8354q3861l5743P6940N1894o6731o6152
860f7101N3227P7373l7671q5839K0134R0366j943r1698j6542Q9087L4937q2742
$$ plain form
872 -18412 -70411 2797 70017 9834 -69750 -24782 64540 37206 -58111 -49079 49065 59789
884 59789 -36646 -66211 25179 73062 -9204 -73300 -3126 74948 19544 -69838 -31985 65118
896 65118 45946 -55126 -55673 45449 65648 -31393 -70035 19814 76061 -2812 -74029 -8892
908 -8892 74821 25896 -66938 -36316 61630 49434 -50592 -57971 39739 65582 -26865 -70448
920 -70448 12830 72129 1096 -71285 -14595 68031 27834 -61983 -39323 53901 49152 -44573
932 -44573 -58245 31716 62238 -21246 -67560 6212 66290 4853 -66067 -18477 61395 30177
944 30177 -54442 -39450 47346 49670 -35596 -54287 26318 60276 -13049 -61417 1293 61194
956 61194 10739 -58696 -22890 52806 32272 -46752 -42040 37239 48341 -27868 -54130 16087
$$ packed form
872a8412n1999P3208O7220o0183p9584M4968Q9322k7334r5317R032R8144J0724
884E9789r6435k9565R1390M7883q2266o4096P0174P8074n5404q9382L7853R7103
896F5118j9172j01072n47J01122K0199r7041l8642Q9849N6247p8873p1217O5137
908h892Q3713m8925r2834L0622R7946j2196j00026p379R7710K5843r2447m3583
920g0448Q3278N9299p1033p2381N6690Q2626m0197q9817K2660R3224m749r3725
932d4573j3672Q9961L0522q3484m6314P3772O0078o1437p0920M7590P9872l1218
944C0177q4619J4992Q6796K324q5266j8691Q0605L3958p3325m8368O2710N9901
956F1194n0455o9435L5806P5696k0534p9024M712P9279J1102p6209k6262P0217
$$ plain form
968 16087 56189 -5255 -57241 -6851 54573 16980 -51301 -27801 44405 36019 -36892 -43281
980 -43281 27522 48474 -16702 -50778 6847 52308 5040 -49709 -14545 46848 24988 -40585
992 -40585 -33092 33249 39858 -24640 -45261 14366 47475 -4984 -49485 -6805 46826 15540
1004 15540 -44824 -26496 37744 33089 -32268 -41387 22602 45292 -14009 -49035 3393 49968
1016 49968 7412 -48036 -16635 45859 27374 -39452 -34802 33403 42891 -24146 -47916 14667
1028 14667 51688 -4011 -53034 -6746 52529 17955 -49350 -27835 45045 38182 -37172 -45535
1040 -45535 29184 52454 -18770 -56955 7590 58793 3301 -59799 -16195 56240 26381 -52503
1052 -52503 -37608 45094 46418 -36365 -53670 26359 59576 -14412 -62446 2328 63199 9918
$$ packed form
968A6087M0102o1444n1986N0390O1424l7593o8281K3500P2206q386p2911o389
980d3281P0803K0952o5176l4076N7625M5461m7268n4749L5164O1393k1860o5573
992d0585P493O6341O609o4498k0621N9627L3109n2459m4501M2680N3631l1286
1004A5540o0364J8328O4240m655o5357r119O3989K2690n9301l5026N2428M6575
1016D9968m2556n5448L1401O2494j8485o6826M650O8205R488o7037k3770O2583
1028A4667L7021n5699m9023M6288N9275l4574o7305K1515P2880o863p5354q363
1040d5535P4719K3270p1224l8185O4545N1203n5492o3100M3604P2435k9859p8884
1052e2503J4895Q2702J324q2783j7305Q0029L3217p3988m8034O4774O0871n3281
$$ plain form
1064 9918 -61919 -22711 56753 32923 -51535 -44338 41897 51822 -32602 -58853 20997 63195
1076 63195 -8320 -64277 -3343 64667 16804 -60610 -27650 56077 39107 -48080 -48124 39090
1088 39090 55462 -28377 -60801 16880 64013 -4415 -64370 -7743 63057 20258 -58578 -31144
1100 -31144 52606 41232 -44366 -49784 34299 55973 -23659 -60831 11254 62287 499 -62306
1112 -62306 -12940 59149 24210 -54351 -34885 47022 43785 -38304 -51228 27841 56176 -16595
1124 -16595 -59074 4851 59560 7092 -57442 -18324 53332 28996 -46811 -38008 38496 45071
1136 45071 -29066 -50820 17794 53168 -7336 -54608 -4588 52435 15156 -48858 -25233 43008
1148 43008 34177 -34975 -40874 26267 46220 -16088 -49230 5104 49443 4767 -48843 -16108
$$ packed form
1064I918p1837L9208P9464k3830q4458P197Q6235R925q4424k6251P9850M2198
1076F3195p1515n5957O0934O8010m7863p7414L2960Q3727j6970q7187m4Q7214
1088C9090J6372q3839l2424P7681M7133o8428n9955N6627P0800m2799p8836K7434
1100c1144Q3750j1374q5598n418Q4083K1674p9632l7172P2085N1033o1788o2805
1112f2306M9366P2089l4939p8561J9466Q1907l237q2089j2924P9069K8335p2771
1124a6595m2479O3925N4709n2468o4534L9118P1656k4336p5807Q803P6504O575
1136D5071p4137k1754O8614L5374o0504m7272N0020N7023l7279o4014K3625O8241
1148D3008q831o9152n899O7141J9953o2308l3142N4334M4339m4676n3610L2735
$$ plain form
1160 -16108 44012 24526 -39422 -33520 31537 39999 -22720 -44588 13377 47861 -2534 -47939
1172 -47939 -7311 46629 17482 -43120 -27167 36975 34579 -30439 -42058 20929 46235 -11564
1184 -11564 -49202 1353 50318 9912 -47813 -19211 45350 29936 -38518 -37508 31692 45076
1196 45076 -22313 -49994 12174 53075 -1376 -53824 -9830 52560 21142 -48209 -30724 43045
1208 43045 40678 -34269 -47246 25735 53754 -14242 -56589 3197 57906 8752 -56648 -20301
1220 -20301 52740 30972 -47043 -40706 39083 48762 -29621 -55035 18724 58855 -7306 -60894
1232 -60894 -5008 59748 16305 -57383 -28304 51383 37769 -44950 -47502 34965 53637 -25437
1244 -25437 -59589 13140 61374 -2056 -62777 -10903 60093 21954 -56343 -33236 49933 43141
$$ packed form
1160a6108O0120j9486o3948N902O5057Q462o2719k1868N7965L4484n0395m5405
1172d7939M0628N3940k9147o0602J5953O4142k396o5018j1619O2987K5306n7799
1184a1564l7638N0555M8965m0406n7725K8602O4561j5414o8454J010O9200J3384
1196D5076o7389k7681O2168M0901n4451n2448M3994O2390l1418o9351J7485P3769
1208D3045k367p4947j2977P2981K8019o7996m2347N9786N4709m9154o5400L6347
1220b0301P3041k1768p8015O337P9789R679p8383k5414P3759M0131o6161n3588
1232f0894N5886O4756m3443p3688K9079P9687j3614q2719k552Q2467J8672p9074
1244b5437l4152P2729M8234o3430o0721N1874P0996l8139p8297K3107Q3169o792
$$ plain form
1256 43141 -41246 -50412 32480 57949 -19872 -60244 9806 63767 4136 -61477 -14659 59721
1268 59721 27208 -53564 -36786 46890 46297 -37378 -53053 27344 58391 -15442 -60743 3831
1280 3831 61301 8255 -59386 -20058 54343 29722 -49083 -40324 39109 46077 -31100 -53286
1292 -53286 18822 55233 -8323 -56697 -3244 55547 15017 -50966 -24082 46638 34632 -37590
1304 -37590 -40543 30128 47285 -19108 -49924 9200 51689 1931 -50333 -12062 47589 22146
1316 22146 -42122 -30292 35721 37787 -27185 -42926 17981 46219 -8302 -48035 -2522 46383
1328 46383 11478 -44594 -21939 38785 29325 -32923 -36855 24595 41924 -15487 -45160 6082
1340 6082 46898 4615 -45558 -13870 43207 23739 -37728 -31558 31547 38824 -23137 -43637
$$ packed form
1256D3141q4387r166Q2892K5469p7821m0372P0050N3961n9631o5613M6818P4380
1268E9721l2513q0772J6778Q3676n93q3675j5675Q0397L1047p3833m5301O4574
1280C831N7470n3046o7641L9328P4401k4621p8805Q759P9433O968p7177k2186
1292e3286P2108L6411o3556m8374N3453N8791m0530o5983K6884P0720j2006p2222
1304c7590k953P0671J7157o6393l0816N9124M2489m9758n2264L8271N9651k5443
1316B2146o4268J1830O6013K066o4972j5741O0907K8238n4521l9733M5513M8905
1328D6383l4905n6072K2655O0724r460o2248l932O1450J7329n7411k9673N1242
1340F082M0816m2283n0173L1688N7077j9468o1467O170O3105P277o1961k0500
$$ plain form
1352 -43637 14155 47212 -4077 -48275 -6272 47081 16067 -44174 -25959 38303 33537 -32027
1364 -32027 -41256 22778 45676 -13870 -49490 2884 49890 7289 -49012 -17948 45161 27164
1376 27164 -40364 -36403 32457 42913 -24463 -49062 13910 51742 -3805 -53331 -7060 52372
1388 52372 18018 -48827 -27438 44233 37034 -36614 -44210 28202 50127 -18604 -54407 7248
1400 7248 55407 2859 -55986 -14889 52438 24657 -48359 -34760 41356 43039 -33037 -49646
1412 -49646 23565 54703 -12734 -57495 1495 57839 9632 -56520 -21084 52231 31109 -46366
1424 -46366 -40005 38968 48231 -28822 -52680 19941 57980 -6975 -57522 -2542 58372 15318
1436 15318 -53774 -24646 49507 34801 -41932 -42372 33398 48688 -23572 -53037 12637 54799
$$ packed form
1352d3637N7792L3057n1289m4198M2003N3353l1014o0241J8215O4262m766o5564
1364c2027r229O4034K2898n9546l5620N2374M7006m2601n6301L1064O3109j7997
1376B7164o7528L961O8860J0456o7376k4599O2972L7832n5547m9526M6271N9432
1388E2372l4354o6845K1389P1671p199p3648p596P2412K1925o8731l5803O1655
1400G248M8159n2548n8845M1097O7327k7781p3016J3599P6116J683p6076j6609
1412d9646P3211L1138o7437m4761N8990N6344m8207o6152L5436P3315k1122p7475
1424d6366O361P8973R263p7053k3858P2621L8039o4955n0547N4980O0914m3054
1436A5318o9092K9128P4153j4706p6733m40P5770J5290p2260k9465O5674M2162
$$ plain form
1448 54799 -2035 -54990 -9349 52065 18878 -48527 -29105 41332 35974 -34791 -43542 24681
1460 24681 46865 -16061 -50201 5073 50001 4559 -48709 -14210 45390 23519 -39522 -30444
1472 -30444 33618 37846 -24463 -41163 17044 45588 -6003 -44775 -1696 45504 12675 -40962
1484 -40962 -19700 37589 28403 -30500 -33927 23421 38633 -15346 -42010 5690 42130 2433
1496 2433 -42293 -12433 38409 19673 -34695 -27932 27637 32857 -21396 -38319 11929 39688
1508 39688 -4366 -41781 -5875 39227 13305 -37111 -22138 31687 28643 -25533 -33989 18686
1520 18686 38764 -9437 -39815 1827 41297 8060 -38853 -15767 36012 23671 -31008 -30625
1532 -30625 24291 35633 -17330 -40029 8411 41630 -49 -42173 -9035 40448 17393 -37260
$$ packed form
1448E4799n6834n2955M5641O1414l3187o7405J9422P0437n358p0765q751O8223
1460B4681K2184o2926l4140N5274M4928m5442n3268L4499N9600k1871o3041R078
1472c0444O4062M228o2309j6700N8207K8544n1591l8772M3079M7200l2829n3637
1484d0962K1262N7289r186n8903l427N7348J5212n3979k6664M7700L6440l9697
1496B433m4726K9860N0842j8736n4368O763N5569N220n4253j6923N0248K7759
1508C9688m4054l7415L5906M5102k5922n0416J4973N3825l044n4176q456N2675
1520A8686K0078m8201l0378M1642L9470l3237m6913K3086N1779j2341n4679L83
1532c0625N4916J1342n2963k2699M8440L3219m1679m2124L3138M9483k3055n4653
$$ plain form
1544 -37260 -25511 32083 32077 -26074 -38191 17925 41564 -10099 -44541 643 44664 8202 -43350
1557 -43350 -16943 40676 25703 -35244 -32394 29635 39195 -21407 -43286 13296 46439 -4092
1569 -4092 -47674 -5556 46609 14377 -44505 -23866 39429 31044 -34169 -38514 26057 43033
1581 43033 -18391 -47392 8486 48530 461 -48853 -10267 46622 19266 -42699 -27325 37588
1593 37588 35068 -29990 -40159 22821 45205 -13031 -46786 4592 48079 5601 -46050 -14021
1605 -14021 43393 22848 -38274 -29923 32318 36205 -24673 -40630 16386 43322 -8008 -44848
1617 -44848 -1601 43198 9127 -42141 -18604 36484 24210 -32642 -31713 24777 35177 -18276
1629 -18276 -38758 9998 40377 -1540 -39659 -5717 38790 14335 -34507 -20089 30969 27029
$$ packed form
1544c7260J1749N7594on8151j2117N6116K3639n1663l4442M5184M4021l6462n1552
1557d3350K6407N7619j4973o0947K850O2029R560o0602k1879N6582L3143n0531
1569d092m3582M2118N2165l2232n8882K0639O3295q385o5213m345O4571J6976
1581D3033o1424k9001N5878M0044m8069m9314L8586N6889k7356o1965J5374O4913
1593C7588k520o5058j0169O2980K2384n8236l3755N1378M3487m2478n1651L2029
1605a4021N7414k0545o1122Q351O2241L887o0878j5957N7016K6936n1330l6840
1617d4848M3247M4799l4071n1268K3537N5088j2274n6852R29N6490J0400n3453
1629a8276k0482M8756L0379m1917l8119L3942M4507k4455m8842J4418N1058l940
$$ plain form
1641 27029 -24178 -30652 18589 35026 -10158 -35586 3941 37184 5021 -34451 -10699 33125
1653 33125 18649 -27689 -23188 23357 28323 -16849 -31420 9877 32668 -3461 -33680 -4511
1665 -4511 31409 10323 -29605 -17247 24872 21820 -20276 -26217 14081 28756 -7761 -30306
1677 -30306 845 30033 5629 -28692 -12029 25804 17708 -21778 -22259 16987 26244 -10954 -28177
1690 -28177 5167 29761 1680 -28903 -7607 27728 13791 -24585 -18909 20849 23508 -15824
1702 -15824 -26805 10283 29110 -4221 -30222 -2254 29683 8188 -28449 -14607 25205 19494
1714 19494 -21681 -24681 16338 27933 -11098 -30795 4691 31791 1664 -31813 -8264 30437
1726 30437 14421 -27952 -20263 23681 24853 -19400 -29385 13040 31512 -7490 -33630 311
$$ packed form
1641B7029n1207o474M9241J6437m5184k5428L9527L3243l2163l9472K3752M3824
1653C3125j4476m6338M501M6545M966m5172j4571M1297K2791l6129l0219K9169
1665d511L5920k1086l9928J2358M2119l052m2096n941M0298J4675l6517k2545
1677c0306L1151K9188k4404l4321J6663L7833q096l9486m81L9246R257l7198j7223
1690b8177L3344K4594k8081l0583K1296L5335j3937l8376N676L9758K659l9332
1702a5824j0981L7088J8827l3331k6001K7968L1937k1495l6637J3842L9812n711
1714A9494m1175l000M1019J1595l9031j9697L5486K7100l0127l3477K3549L8701
1726C0437j6016m2373P689M3944J172m4253r985M2425J8472l9002k6140L3941
$$ plain form
1738 311 33450 6071 -32489 -12503 30122 18600 -26217 -23578 21740 27940 -16096 -31158 9849
1751 9849 32884 -3593 -33740 -3406 32670 9508 -30862 -15808 27657 21158 -23185 -25326
1763 -25326 18459 29237 -12267 -30972 6603 32404 114 -31885 -6064 30717 12047 -27920
1775 -27920 -17175 24521 22037 -19701 -25198 15167 28518 -8816 -29177 3727 30267 2800
1787 2800 -28854 -7913 27330 13403 -24257 -17952 20411 21618 -16154 -24681 10879 26227 -5923
1800 -5923 -27269 257 26719 4884 -25637 -10012 23097 14163 -20060 -18105 15994 20875 -11728
1813 -11728 -22944 6872 23903 -1846 -23737 -2832 22906 7696 -20610 -11572 18051 15253
1825 15253 -14290 -17740 10446 19702 -5929 -20409 1635 20423 2846 -19395 -6992 17383
$$ packed form
1738C11L3139k7379l8560J9986M2625j1522m4817K639M5318O200m4036j5062M1007
1751I849K3035l6477l0147L0334L6076k3162m0370J5054M3465o499m4343k141
1763b5326M3785J0778m1504j8705L7575K5801l2290l1999K5821L6781j8670l9967
1775b7920J0745M1696k484m1738n497M0365J3351l7334k0361L2904K6540k7467
1787B800l1654K0941L5243j3927l7660O305L8363J207l7772q527L5560J5348l2150
1800e923k1346K7526K6462k1835l0521J5625L3109q934l4223J955L4099M881l2603
1813a1728j1216K9816J7031k5749k1891K0905K5738j5210k8306R038K9623k798
1825A5253k9543l450K8186R256k5631j4480K2044J8788j7577k2241J2403K4375
$$ plain form
1837 17383 10390 -15213 -13949 11397 15445 -8653 -18032 3680 17476 -986 -18605 -4250 16412
1850 16412 6772 -15693 -10860 12448 12929 -10039 -15429 6452 16562 -2983 -17257 -761 17157
1863 17157 4554 -15846 -7635 14836 11333 -11711 -12904 9976 16237 -5370 -16064 3419 18247
1876 18247 1695 -16724 -4113 17022 8443 -14709 -11081 12909 13893 -9983 -16067 6521 17255
1889 17255 -3377 -18375 -700 17880 3932 -17468 -7860 15502 10620 -13829 -13793 10646 15535
1902 15535 -7907 -17463 4153 18069 -643 -18228 -2900 17781 6653 -16099 -9401 14730
1914 14730 12707 -11611 -14395 9221 16625 -5575 -17240 2525 17904 1207 -17382 -4351
1926 -4351 16485 7559 -14931 -10305 12848 12618 -10430 -14630 7395 15736 -4561 -16618 1248
$$ packed form
1837A7383o993k5603J264K5346M048k4098r379K1712J3796j8462j7619J4355K0662
1850A6412r640k2465M833K3308M81k2968n390K1881J0110j9545j4274J6496J7918
1863A7157j2603k0400Q211K2471l503k3044j193K2880O261k1607j0694J9483J4828
1876A8247j6552j8419J2611K1135q579k3152L628K3990R84k3876o084K2588J0734
1889A7255k0632j4998J7675J8580j3948k1400R608K3362m882k4449L6K4439M889
1902A5535k3442r556K1616J3916j8712j7585J5328K0681j1128k2752O698K4131
1914A4730k023k4318k784K3616P404k2200j1665J9765J5379j6697j8589J3031
1926d351K0836q926k2490M626K3153k30k3048m200K2025Q341k0297j2057J7866
$$ plain form
1939 1248 16565 1704 -16235 -4881 15043 7589 -13496 -10004 11509 12162 -9071 -13637 6336
1952 6336 14722 -3480 -15284 656 15226 2199 -14555 -4826 13515 7455 -11788 -9363 10054
1965 10054 11288 -7479 -12259 5296 13195 -2438 -13315 -22 13045 2355 -12376 -4806 10972
1978 10972 6670 -9588 -8432 7714 9697 -5550 -10443 3486 10960 -1098 -10767 -981 10414
1991 10414 2939 -9500 -4826 8269 6316 -6922 -7628 5126 8360 -3370 -8892 1477 8987
2004 8987 251 -8709 -2065 8103 3577 -7304 -5198 5797 5880 -4948 -7271 2815 7170 -1914
2018 -1914 -8027 -350 7361 1460 -7379 -3332 6473 4370 -5562 -5635 4386 6531 -2944 -6999 1639
2033 1639 7547 52 -7278 -1355 7354 3069 -6340 -4019 5903 5540 -4504 -6207 3468 7033 -1957
$$ packed form
1939A248J5317j4861j7939J1354J9924p454k1085L492K1513O53k1233m566J9973
1952F336Q386j8202j1804J5940J4570j3027j6754R729J8341o060j9243K425J9417
1965A0054J234j8767m780J7555P899j5633j0877J3293J3067j0690j4731P570J5778
1978A0972m302j6258J156J6146J983j5247m893J3929P474j2058r669R786J1395
1991A0414p475j2439M674J3095j953j3238p06J2754L234j1730n522J0369P510
2004H987q736q960O644J0168m526j0881K106J0995Q3j0828k323J0086M355r084
2018a914o113P677P711n901q839M047R805k103r932p3J0021K145r475m055Q638
2033A639N908p495p330N923Q709m285r409K321R922l63j0044j703R675L565q990
$$ plain form
2048 -1957 -7415 400 7341 853 -7509 -2714 6495 3578 -6312 -5364 4740 5758 -4201 -7124 2215
2063 2215 7037 -1388 -7859 -544 7417 1598 -7302 -3236 6723 4477 -5842 -5387 5114 6668 -3510
2078 -3510 -6821 2737 7986 -743 -7574 -52 8175 2034 -7321 -2903 7265 4583 -6140 -5441 5471
2093 5471 6741 -4048 -7273 3005 8004 -1483 -8358 24 8368 1399 -8225 -3031 7616 4276
2107 4276 -7099 -5717 6018 6698 -4862 -7663 3563 8394 -1970 -8634 609 9000 1196 -8546
2121 -8546 -2531 8362 4294 -7412 -5440 6590 6796 -5150 -7558 4019 8442 -2279 -8616 886
2135 886 9023 942 -8622 -2429 8210 3969 -7472 -5388 6296 6362 -5357 -7605 3605 7900
2149 7900 -2483 -8716 475 8475 779 -8543 -2677 7760 3936 -7153 -5471 5949 6468 -4813
$$ packed form
2048a957n458P815O941o488q362M795R209k917r890R48J0104J018r959k923R339
2063B215M822q425o471P315P961n819q900M066R959k246j0319M55J0501J554j0178
2078c510l311R558N249q729o831P522Q227o141r355M418J0168k682j0723O99J0912
2093E471J270j0789l225J0278M999r487o875Q382Q344o969r624N194J0647l340
2107D276j1375J382J1735O80j1560k801J1226M831j0364o664R243Q391p804r742
2121h546O015J0893m068j1706J972J2030K06j1946k408J1577M423j0721o337R502
2135H86Q137q081r564O193J0639m241j1441K084J1684O6j1719k248J1210M295
2149G900j0383o233R191Q000p696r322N866J0437l824j1089J682J1420N19j1281
$$ plain form
2163 -4813 -7434 3302 8071 -1755 -8379 159 8417 1627 -8032 -3171 7562 4780 -6449 -5953
2177 -5953 5343 7217 -3820 -7922 2287 8469 -559 -8580 -1284 8266 2808 -7826 -4599 6878
2191 6878 5928 -5648 -7231 4175 8088 -2407 -8630 709 8933 1210 -8542 -2916 8181 4780
2205 4780 -7005 -6111 5940 7643 -4261 -8451 2571 9159 -643 -9414 -1428 9121 3125 -8824
2219 -8824 -5258 7454 6689 -6444 -8426 4519 9119 -2995 -10179 589 10194 1283 -10351 -3555
2233 -3555 9529 5468 -8761 -7453 7303 9000 -5613 -10342 3632 11290 -1259 -11575 -885
2246 -885 11849 3478 -11067 -5534 10458 7938 -8766 -9525 7197 11348 -4897 -12320 2614 13203
2260 13203 147 -13164 -2607 12967 5283 -11918 -7636 10699 9950 -8776 -11779 6608 13101
$$ packed form
2163d813k621J0736M769r826o624Q538Q258o790r659M861J0733k782j1229M96
2177e953J1296J874j1037m102J0209O182r028q021P296R550n458j0634L227J1477
2191F878r50j1576j583J1406L913j0495o223R339Q224p723r752N626J1097l401
2205D780j1785Q94J2051J703j1904m190J1022O588r802q771P986J0549n996j1949
2219h824L566J2712p65j3133j982J2945M600j2114p184J0768R605q911j1634O796
2233c555J3084m061j4229J308J4756J697j4613m729J3974P658j2549j0316J0690
2246h85J2734q371j4545N533J5992k520j6704p59J6722M151j6245p423J4934J0589
2260A3203j3056j3311J0557J5574p684j7201M282J8335p49j8726l003J8387O493
$$ plain form
2273 13101 -4108 -14118 1290 14321 1448 -14360 -4440 13386 6867 -12299 -9473 10342
2285 10342 11460 -8179 -13095 5621 14232 -2781 -14756 -42 14819 3133 -14201 -5782 13155
2298 13155 8522 -11340 -10654 9417 12604 -6740 -13704 4190 14737 -1175 -14732 -1614 14465
2311 14465 4576 -13547 -7215 11982 9572 -10119 -11677 7682 12980 -5162 -14059 2186 14475
2324 14475 653 -14245 -3590 13489 6357 -12134 -8668 10324 10904 -8026 -12511 5562 13646
2337 13646 -2656 -14053 -164 14174 3187 -13350 -5857 12135 8427 -10340 -10428 8180 12128
2350 12128 -5496 -13281 2763 13853 388 -13678 -3134 13098 6116 -11616 -8376 9991
2362 9991 10664 -7473 -12144 5001 13254 -2071 -13823 -950 13602 3789 -12885 -6684 11359
$$ packed form
2273A3101j7209j0010J5408J3031j2873j5808R920J7826o519j9166K826J9815
2285A0342J118j9639m916J8716Q611j7013j1975J4714J4861j1686j7334Q419J8937
2298A3155m633j9862O86K0071L187j9344o964J7894J0547j5912j3557J3118J6079
2311A4465r889j8123O332J9197k410j9691j558J9359N298j8142q897J6245J2289
2324A4475j3822j4898J0655J7079p132j8491L466J8992N80j8930m485J8073Q084
2337A3646j6302j1397J3889J4338j0987j6537P493J7992l708j8767q8J8608L948
2350A2128j7624p785J6044J1090j3465j4066J0544J6232o982j7732L240J8367
2362I991O73j8137m671J7145Q253j5325j1752J2873J4552r813j6674O201J8043
$$ plain form
2375 11359 9088 -9577 -11325 7187 12837 -4517 -14087 1477 14252 1356 -14347 -4695 13097
2388 13097 7161 -12068 -10218 9718 11982 -7641 -14070 4438 14793 -1769 -15658 -1699 15274
2401 15274 4713 -14650 -7916 13108 10546 -11248 -13087 8643 14958 -5765 -16216 2698 17167
2414 17167 972 -16813 -4052 16636 7760 -14855 -10454 13235 13546 -10394 -15492 7484 17261
2427 17261 -4198 -18270 376 18170 2898 -18089 -6982 16379 9772 -15034 -13432 11807
2439 11807 15217 -9418 -17801 5277 18330 -2198 -19334 -2128 18500 5470 -17767 -9197
2451 -9197 15777 12216 -13283 -14869 10547 17113 -6971 -18225 3652 19200 481 -18709 -3856
2464 -3856 18358 7870 -16333 -10661 14617 13921 -11382 -15655 8683 17805 -4655 -18304 1429
$$ packed form
2375A1359k271j8665j748J8512N650j7354r570J5564J2775j2896j5703R652J7792
2388A3097n936j9229J850J9936K264j9623o429J8508J0355j6562j3889J3959J6973
2401A5274j0561j9363O734K1024k562k1794j839K1730O315k0723j0451J8914J4469
2414A7167j6195j7785J2761K0688q876k2615M401K3689L11k3940n098K2976R777
2427A7261k1459j4072J8646J7794j5272k0987J1107K3361o607k4806J602K5239
2439A1807L410k4635q383K3078J3053k0528j7136J7206K0628j3030k3237Q570
2451i197K4974l561k5499j586K5416O566k4084j1254K1877J5548j8719j9190J4853
2464c856K2214j0488k4203N672K5278o96k5303m273K4338R122k2460j3649J9733
$$ plain form
2477 1429 18853 2631 -17898 -5968 16895 9635 -14690 -12218 12411 14979 -9132 -16389 5918
2490 5918 17753 -2133 -17883 -1383 17534 4948 -16557 -8316 14534 11032 -12318 -13685 9207
2503 9207 15380 -6092 -16612 2545 16953 1013 -16568 -4378 15649 7748 -13717 -10442 11533
2516 11533 12925 -8605 -14611 5403 15583 -2091 -16088 -1447 15512 4642 -14576 -7958
2528 -7958 12661 10507 -10521 -12927 7522 14302 -4511 -15393 1038 15552 2243 -15220 -5618
2541 -5618 13940 8632 -12148 -11187 9849 13530 -6860 -14907 3867 15965 -326 -16131 -3017
2554 -3017 15588 6323 -14517 -9580 12307 12043 -10177 -14672 6861 15733 -4099 -17236 119
2567 119 17054 3133 -16827 -6857 15411 10007 -13522 -12758 11171 15500 -7554 -16593 5024
$$ packed form
2477A429J7424j6222k0529J1930K2863p260k4325K472K4629K568k4111p257K2307
2490E918J1835j9886j5750J6500J8917j2586k1505Q241K2850l502k3350j367K2892
2503I207O173k1472j0520J9157J4408j5940j7581J2190K0027p901k1465L275K1975
2516A1533J392k1530o006K0014J0180j7674j3997J4641J6959j0870j9218O618
2528g958K0619k154k1028k406K0449O780j8813j0882J6431J4514j3309j7463R602
2541e618J9558n308k0780R61K1036L681k0390q047J8774J2098j6291j5805J3114
2554c017J8605r265k0840M937K1887k64k2220m495K1533Q872j9832j3137J7355
2567A19J6935j3921j9960R970K2268n404k3529P64K3929M329k3054r039K1617
$$ plain form
2580 5024 18616 -289 -17703 -2266 18576 7248 -16044 -9369 15321 13625 -11655 -15154 9468
2593 9468 17934 -5219 -18525 1983 19410 2142 -18877 -5896 17816 9346 -16203 -12993 13128
2606 13128 15059 -10763 -18043 6442 18538 -3638 -20109 -1242 19030 4227 -18971 -8619
2618 -8619 16595 11287 -14785 -14656 11487 16575 -8506 -18570 4517 19121 -1038 -19519 -3106
2631 -3106 18611 6499 -17389 -10144 15222 13057 -12703 -15456 9682 17425 -6017 -18375 2573
2644 2573 18985 1421 -18312 -4787 17415 8445 -15459 -11374 13200 14002 -10140 -15788 6943
2657 6943 17103 -3305 -17567 -231 17405 3769 -16455 -7227 14748 10043 -12565 -12583 9731
2670 9731 14466 -6658 -15695 3413 16276 161 -15934 -3334 15231 6716 -13285 -9239 11635
$$ packed form
2580E024J3592j8905j7414J5437K0842j1328k3292O675K4690j696k5280l499K4622
2593I468Q466k3153j3306K0508J7427j7268k1019J2981K3712q470k5549L210K6121
2606A3128J931k5822p280K4485J2096k2176j6471J8867K0272j4803k3198J0352
2618h619K5214n308k6072J29K6143N088k5081j0064K3087J4604k0159j8481J6413
2631c106K1717j2112k3888P245K5366k165k5760k753K5138P743k3442j2358K0948
2644B573J6412j7564j9733J3525K2202q970k3904M085K4574Q02k4142n648K2731
2657F943J0160k0408j4262J7336J7636j3636k0224R228K1975m705k2608j8K2314
2670I731M735k1124r037J9108J2863j6115j6095J2600J8565q515k0001M046K0874
$$ plain form
2683 11635 11895 -8631 -13286 6059 14856 -2512 -14873 -364 14914 3835 -13817 -6666 12465
2696 12465 9259 -10416 -11512 7845 13010 -5225 -14323 1955 14358 873 -14541 -4227 13340
2709 13340 6795 -12159 -9616 10008 11578 -7794 -13465 4731 14392 -1957 -15102 -1462 14608
2722 14608 4198 -14109 -7558 12239 9776 -10637 -12425 7762 13812 -5174 -15303 1750 15475
2735 15475 1173 -15578 -4749 14425 7627 -13099 -10562 10900 12809 -8350 -14589 5499 16058
2748 16058 -1944 -16177 -996 16542 4832 -15161 -7546 14078 10841 -11744 -13050 9222
2760 9222 15036 -6319 -16542 2802 16813 294 -17289 -4187 15908 6838 -15239 -10575 12568
2773 12568 12411 -10707 -15205 7097 16071 -4427 -17473 607 17223 2580 -16984 -5966 15775
$$ packed form
2683A1635K60k0526m655J9345Q797j7368j2361J4509J5278j1079j7652P151J9131
2696A2465l206j9675j096J9357N165j8235r098J6278J2403j3485j5414J0314J7567
2709A3340o545j8954K543J9624J570j9372n671J8196R661j6349j3145J3640J6070
2722A4608j0410j8307O551J9797k463k0413j788K0187O050j8986j0129J7053J3725
2735A5475j4302j6751J0829J9174o798k0726K537K1462J909k1159o239K0088J0559
2748A6058j8002j4233J5181J7538j1710j9993P615K1624l237k2585j306K2272
2760I222N814k1355j0223J9344J4011j6519j7583J3102K0095r070k2077M664K3143
2773A2568j57k3118m498K2302Q974k0498j3046J8080J6616j4643j9564J1018K1741
$$ plain form
2786 15775 9091 -13848 -11627 11857 14244 -8719 -15571 6082 17146 -2217 -17012 -579 17325
2799 17325 4469 -15894 -7116 14923 10415 -12359 -12389 10291 14681 -6918 -15648 4082 16579
2812 16579 -558 -16383 -2502 15897 5735 -14471 -8553 12684 11073 -10262 -12986 7566
2824 7566 14344 -4695 -15278 1339 14972 1434 -14920 -4821 13303 7036 -12208 -9886 9563
2837 9563 11287 -7445 -12970 4411 13617 -1632 -13826 -1237 13480 4131 -12287 -6444 11101
2850 11101 8937 -8754 -10387 6952 12157 -3934 -12398 1773 13101 1440 -12305 -3674 11713
2863 11713 6384 -10155 -8315 8342 10026 -6334 -11562 3578 11929 -1405 -12614 -1703 11768
2876 11768 3772 -11415 -6596 9635 8178 -8140 -10384 5658 11347 -3464 -12289 680 12283
$$ packed form
2786A5775o684k2939K221K3484K387k2963o852K1653J1064j9363j4795J6433J7904
2799A7325j2856k0363Q778K2039m508k2774l0K2680M390k1599q730J9730J2497
2812A6579j7137j5825J3881J8399j0162k0206N918K1237j611k1335k724K0552
2824G566O778j9039j0583J6617J3633j3538j6354J0099J8124o267j9244K322J9449
2837I563J724j8732n525J7381R206j5249j2194J2589J4717r349j6418N843J7545
2850A1101k164j7691j633J7339N205j6091q464J4171J1328j1661j3745Q631J5387
2863A1713n329j6539J840J6657J684j6360n228J5140Q351j3334j1209J0911J3471
2876A1768p996j5187M819J6231j457j6318k244J6042N689j4811q825J2969J1603
$$ plain form
2889 12283 1830 -11999 -4480 11060 6892 -9525 -8894 7834 10739 -5307 -11723 3149 12739
2902 12739 -122 -12505 -2225 12411 5142 -11109 -7192 9974 9626 -7773 -10886 5899 12458
2915 12458 -3074 -12924 645 13370 2196 -12905 -4748 11951 7159 -10653 -9380 8702 11065
2928 11065 -6683 -12614 4007 13296 -1591 -13771 -1275 13382 3805 -12909 -6441 11496 8574
2941 8574 -9963 -10689 7742 12089 -5529 -13202 2903 13740 -230 -13749 -2334 13401 5075
2954 5075 -12201 -7374 10765 9533 -8887 -11188 6558 12440 -4170 -13247 1568 13432 1152
2967 1152 -13102 -3685 12349 6174 -10911 -8180 9355 10070 -7212 -11216 5040 12206 -2440
2980 -2440 -12550 30 12471 2547 -11779 -4801 10693 6867 -9153 -8624 7288 9919 -5304
$$ packed form
2889A2283j0453j3829P519J5540m168j6417O31J6728K905j6046o416J4872R590
2902A2739j2861j2383J0280J4636p269j6251L917J7166l48j7399l113J6785O559
2915A2458j5532r850J3569J2725j1174j5101Q157J6699m792j7812J273J8082K363
2928A1065j7748n931J6621R289j4887j2180J2496J4657r577j6714O468J7937k922
2941H574j8537p26J8431M347j7618p673J6105J0837j3970j3519J1415J5735q326
2954E075j7276M827J8139j232j8420k301J7746N882j6610r077J4815J1864j2280
2967A152j4254R417J6034o175j7085K731J7535P15j7282m004J6256P166j4646
2980b440j0110J2580J2441r924j4326O978J5494l826j6020N29J5912K631j5223
$$ plain form
2993 -5304 -10926 2910 11244 -812 -11483 -1789 10702 3639 -10153 -6045 8462 7217 -7200
3006 -7200 -8920 4919 9543 -3271 -10345 804 10097 1035 -9976 -3262 9083 5028 -7920
3019 -7920 -6657 6580 7912 -4746 -8739 3110 9466 -873 -9311 -882 9353 3090 -8302
3032 -8302 -4479 7507 6310 -5888 -7379 4523 8435 -2535 -8642 826 8965 1270 -8509 -2965
3046 -2965 7885 4675 -6851 -6251 5497 7393 -3883 -8234 2100 8648 -334 -8755 -1726 8371
3060 8371 3422 -7644 -5130 6611 6580 -5174 -7624 3693 8480 -1863 -8836 99 8963 1853
3074 1853 -8539 -3507 8034 5302 -6760 -6613 5698 7894 -3865 -8487 2408 9364 -344 -9178
3088 -9178 -1251 9232 3219 -8502 -4722 7671 6357 -6425 -7542 4973 8541 -3301 -9309
$$ packed form
2993e304n622J3836Q334j2056j0671R694J2491p063j3792M108J4507j245j4417
3006g200j720J3839M624j2814p074J1149R293r062j1011O714J2345m055j2948
3019g920J263J3237J332j2658l993J1849O356j0339q438Q429J0235o263j1392
3032h302L823J1986j197j2198j491J1902L912j0970o107R468Q139p695r779N544
3046b965J0850l210j1526O00J1748J896j1276m351J0334O548q982q421P029J0097
3060H371m949j1066K514J1741l1j1754k450J1317M787j0343o973Q935Q864p110
3074A853j0392N032J1541k732j2062J47J2311K196j1759m622J0895O956r708q834
3088i178P927J0483o013j1721L780J2393j314j2782j117J2515L568j1842o008
$$ plain form
3101 -9309 1530 9671 319 -9599 -2228 9182 3852 -8502 -5641 7160 6861 -6099 -8227 4298
3115 4298 8876 -2780 -9648 741 9511 1020 -9463 -3031 8746 4499 -7859 -6108 6639
3128 6639 7369 -5230 -8373 3537 8936 -1847 -9206 -78 9138 1734 -8793 -3500 7943 4913
3142 4913 -6978 -6326 5619 7198 -4371 -8118 2606 8344 -1116 -8633 -714 8203 2163 -7913
3156 -7913 -3806 6947 4922 -6052 -6192 4622 6825 -3423 -7585 1752 7677 -425 -7805 -1235
3170 -1235 7262 2490 -6791 -3990 5890 5050 -4856 -5923 3642 6505 -2340 -6947 806 7034 552
3185 552 -6816 -1919 6351 3195 -5608 -4323 4656 5227 -3526 -5807 2327 6309 -945 -6351 -410
3200 -410 6296 1679 -5763 -2869 5141 4005 -4277 -4820 3246 5490 -2004 -5804 847 6137 638
$$ packed form
3101i309J0839Q141r352r918P371J1410n330j2354K861J2801k99j2960k128J2525
3115D298M578j1656o868J0389Q770q491j0483O432J1777m247j2358J751J2747
3128F639P30j2599l143J1910N399j0783p359R128R216p404j0527N293J1443l030
3142D913j1891O52J1945J579j1569l747J0724N738r460p517P919Q917o040j0076
3156g913M107J0753k025j0974j40J0814K203j0248m162R337N925q102p380O570
3170a235Q497m772r281K801R880q40r906j067R565K863q845m607P753O228o482
3185E52p368M897Q270l156q803J285Q979N71q753k281Q134L982p254n406N941
3200d10O706m617p442K894Q010j136q282n43Q066K244p494l800O651N290n499
$$ plain form
3215 638 -5790 -1604 5652 3045 -4752 -3895 4226 4945 -2884 -5368 2052 5923 -553 -5969 -476 6059
3231 6059 1928 -5551 -2975 5190 4088 -4212 -4993 3387 5710 -2212 -6209 883 6370 300 -6464
3246 -6464 -1719 6123 2735 -5701 -4118 4811 4867 -4083 -5950 2818 6348 -1735 -7001 193 6913
3261 6913 943 -6894 -2505 6297 3592 -5824 -4877 4817 5772 -3775 -6564 2477 7145 -1159 -7369
3276 -7369 -278 7394 1723 -7047 -3022 6558 4449 -5645 -5492 4689 6478 -3345 -7058 2115 7650
3291 7650 -528 -7610 -760 7602 2273 -7049 -3620 6425 4867 -5422 -5826 4460 6738 -3034
3305 -3034 -7247 1816 7677 -258 -7597 -1126 7475 2568 -6844 -3833 6197 5007 -5262 -5964 4133
3320 4133 6793 -2834 -7257 1470 7611 30 -7531 -1480 7149 2768 -6660 -4153 5775 5088 -4785
$$ packed form
3215F38o428M186P256k607p797Q57Q121P19p829k484P420L871o476n416N493O535
3231F059m131p479K576Q165j102q300p81Q380K323p922l997P092N487o070o764
3246f464M745P842l388q436J583Q929N6q950j867Q768L530q083n266P194O720
3261F913n970p837M389Q802k705r416R47R694R55r547k789R041M668q304o210
3276g369P091P672n671q770M025R580k109j0094J53J0181J789r823l713R173N535
3291G650q178p082O850Q362n329r322L429J0045j558j0289m04J0286K278r772
3305c034m213R063N861p935p339O471Q601m907r412L011J0030j190j0269p02J0097
3320D133K660r627m423Q727O141p581p561O051Q629m381r428K507R928o87r873
$$ plain form
3335 -4785 -6152 3524 6676 -2276 -7248 767 7178 545 -7140 -2038 6610 3305 -5934 -4462 4878
3350 4878 5406 -3836 -6254 2473 6566 -1162 -6820 -298 6649 1684 -6289 -3033 5684 4177 -4677
3365 -4677 -5064 3658 5852 -2267 -6289 1063 6555 359 -6360 -1723 6115 2996 -5386 -4144 4555
3380 4555 5087 -3503 -5861 2234 6289 -915 -6582 -545 6413 1892 -6136 -3219 5502 4357 -4639
3395 -4639 -5442 3532 6274 -2258 -6748 932 7009 602 -7022 -1980 6685 3530 -6031 -4789 5152
3410 5152 5884 -3959 -6804 2606 7412 -1129 -7751 -515 7719 2017 -7432 -3578 6805 4999 -5836
3425 -5836 -6371 4611 7350 -3203 -8050 1664 8580 154 -8521 -1708 8360 3579 -7669 -5018
3439 -5018 6835 6615 -5416 -7634 4082 8612 -2338 -9105 576 9314 1244 -9202 -3161 8554
$$ packed form
3335d785j367R676L152q952m972Q015O411o633p685N102Q648l305r239J472R340
3350D878N28r242k418Q727M093p728n658O522O947m965p973L256Q717j507q854
3365d677l87Q722K194q119m022P352N492o196o719M637P838l119q382J242Q699
3380D555N32q590k358Q095M055p204n667O037O958m521q028K917Q721j145q996
3395d639q03Q974K742q532m490P680O077o407p624N042Q665l155r561J242R941
3410E152P32r843k845R410M806q541o622P236Q234n702r449L854J0383j806j0835
3425e836n35J0982K739j0553m847R714O916q426q675O813J0068m781j1248K651
3439e018J1853k20j2031k218J1716M530j0950o767R681Q738q070j0446O041J1715
$$ plain form
3453 8554 4756 -7790 -6413 6455 7636 -5073 -8743 3316 9358 -1688 -9866 -420 9692
3466 9692 2165 -9418 -4096 8539 5720 -7623 -7187 6208 8372 -4529 -9283 2878 9909 -875
3480 -875 -9978 -1021 9846 2915 -9248 -4659 8419 6409 -7116 -7677 5699 8836 -3904 -9559
3494 -9559 2097 9911 -126 -9925 -1853 9398 3618 -8776 -5491 7485 6713 -6235 -8175 4368
3508 4368 8721 -2777 -9517 650 9297 1047 -9294 -3174 8371 4631 -7424 -6326 6051
3521 6051 7416 -4465 -8282 2769 8848 -822 -8899 -931 8755 2910 -7904 -4428 7088 6018
3535 6018 -5679 -7061 4306 7983 -2491 -8503 700 8629 984 -8371 -2939 7782 4465 -6873
3549 -6873 -6070 5548 7065 -4233 -8146 2352 8546 -719 -8875 -1353 8474 3038 -8019 -4747
$$ packed form
3453H554l798j2546J377J2868J181j2709l670J2059O042j1046q178R446J0112
3466I692p527j1583N322J2635k819j3343M36J3395K164j2901m754J2161P031j0784
3480h75r103Q957J0867o931j2163M589J3078k010j3525n61J3376L137j2740n655
3494i559J1656P814j0037r799Q072J1251n780j2394L285J2976p72j2948j940J2543
3508D368M353j1498o740J0167Q647q250j0341O120J1545l740j2055J098J2377
3521F051J365j1881l817J1051O079r670q077P968R686n845j0814L476J1516j070
3535F018j1697j382J1367L677j0474o012R203P929p645r355N432J0721l317j1338
3549f873Q03J1618J517j1298l913J0498O194r265q156P522R827n436j1057L272
$$ plain form
3563 -4747 6994 6344 -5726 -7586 4212 8621 -2359 -9055 547 9359 1536 -9068 -3425 8581
3577 8581 5325 -7418 -6873 6128 8324 -4380 -9223 2562 10017 -397 -10026 -1609 10066 3870
3591 3870 -9194 -5708 8280 7657 -6645 -8960 5021 10186 -2918 -10879 771 11218 1477
3604 1477 -10973 -3761 10387 5904 -9309 -7872 7834 9533 -5963 -10857 3787 11583 -1610
3617 -1610 -12068 -856 11944 3171 -11452 -5574 10329 7546 -8955 -9464 7175 10864 -5108
3630 -5108 -11954 2775 12556 -349 -12724 -2167 12274 4607 -11498 -6931 10136 8852 -8329
3643 -8329 -10569 6262 11823 -3936 -12558 1452 12869 1149 -12637 -3544 11980 6037 -10613
3656 -10613 -8030 9182 10065 -7007 -11179 4812 12397 -2168 -12553 -203 12621 2865 -11813
$$ packed form
3563d747J1741o50j2070j860J1798M409j0980o696R602Q812p823j0604N643J2006
3577H581l256j2743N45J3001K196j2704m843J1785P455j0414r629Q417J1675o196
3591C870j3064L486J3988o23j4302k315J3981N165j3104p961J1650J0447r741
3604A477j2450P212J4148m483j5213J437J5706J699j5496m894J4644P796j3193
3617a610j0458J1212J2800q773j4623N878J5903k783j6501n09J6639L689j5972
3630e108o846J4729R781j2905j2375J0557J4441p667j6105M567J7067j284j7181
3643h329k240J6831N561j5759q622J4010J1417j1720j3786R093J5524n943j6650
3656a0613K583J7212Q83j7072m172J5991P585j4565j0385J2350J2824r756j4678
$$ plain form
3669 -11813 -5139 10822 7398 -9177 -9152 7205 10523 -5099 -11592 2668 11978 -349 -12042
3682 -12042 -2312 11331 4427 -10462 -6694 8819 8312 -7241 -9925 4973 10707 -2890 -11313
3695 -11313 431 11239 1908 -10806 -4067 9884 6205 -8541 -7761 6908 9309 -4842 -10138
3708 -10138 2818 10794 -426 -10751 -1731 10399 4004 -9425 -5973 8185 7775 -6478 -9020
3721 -9020 4595 10057 -2380 -10516 186 10540 2168 -10171 -4395 9200 6297 -7849 -8059
3734 -8059 6095 9352 -4143 -10399 1806 10863 401 -10871 -2935 10258 4966 -9311 -7157
3747 -7157 7717 8749 -6054 -10260 3849 11045 -1613 -11579 -914 11459 3315 -10916 -5610
3760 -5610 9902 7696 -8369 -9477 6525 10930 -4286 -11896 1920 12493 674 -12446 -3038
$$ packed form
3669a1813O674J5961l424j6575K5J6357L318j5622o493J4260R310j2327j1693
3682a2042R730J3643o904j4889L768J5513n07j5553k684J4898N734j3597q423
3695a1313J1744J0808r331j2714O739J3951l679j4746P80J4669K401j4151n296
3708a0138J2956P976j1220j0325R020J2130o395j3429L452J4158m10j4253k542
3721i020J3615N462j2437q136J0702J0354q372j2339N776J3595k903j4146k10
3734h059J4154L257j3495o256J2205R057j0462j1272P936J3193n292j4277K154
3747g157J4874J032j4803m206J4109P196j2658r966J0665J2373q144j4231N306
3760e610J5512k206j6065j108J6002M405j5216p610J3816J0573j1819j3120R408
$$ [...]
##END NTUPLES=NMR FID
##END=
