##TITLE=1H_DPA3005-3
 CDCl3, 8 sc, 
 31.5.2019
##JCAMPDX= 6.0         $$ Bruker NMR JCAMP-DX V2.0
##DATA TYPE= NMR FID
##DATA CLASS= NTUPLES
##ORIGIN= UXNMR, Bruker Analytische Messtechnik GmbH
##OWNER= root
$$ XWIN-NMR		Version 3.5
$$ Fri May 31 16:01:58 2019 Russian Standard Time (UT+4h)  she@DPX200
##.OBSERVE FREQUENCY= 200.13155
##.OBSERVE NUCLEUS= ^1H
##.DELAY= (6, 6)
##.ACQUISITION MODE= SIMULTANEOUS
##.ACQUISITION SCHEME= undefined
##.AVERAGES= 8
##.DIGITISER RES= 18
##SPECTROMETER/DATA SYSTEM= spect
##.PULSE SEQUENCE= zg30
##.SOLVENT NAME= CDCl3
##.SHIFT REFERENCE= (INTERNAL, CDCl3, 0, 15.7039)
##AUDIT TRAIL= $$ (NUMBER, WHEN, WHO, WHERE, WHAT)
$$ ##TITLE= Audit trail, XWIN-NMR		Version 3.5
$$ ##JCAMPDX= 5.01
$$ ##ORIGIN= Bruker BioSpin GmbH
$$ ##OWNER= she
$$ F:/spectra/data/she/nmr/H-F/1/audita.txt
$$ ##AUDIT TRAIL=  $$ (NUMBER, WHEN, WHO, WHERE, WHAT)
(   1,<2019-05-31 16:00:31.82 +0400>,<she>,<DPX200>,
      <created by zg, POWCHK disabled, PULCHK disabled
       configuration hash MD5:
       00 E9 B6 7A A2 85 ED C7 34 08 36 98 17 FE 4E 26
       data hash MD5: 16K
       7E 0A 99 9C 90 67 AA 3B 42 8F 61 AF EF DF 70 3C>)
$$ ##END=
$$ 
$$ hash MD5
$$ 94 FC E1 F4 A4 FC FE 8A 9C 57 CD 84 9D A2 FA D7
##$RELAX= 
##$RELAX= 
##$RELAX= 
##$RELAX= 
##$RELAX= 
##$RELAX= 
$$ Bruker specific parameters
$$ --------------------------
##$DU= <F:/spectra>
##$EXPNO= 1
##$NAME= <H-F>
##$PROCNO= 1
##$TYPE= <nmr>
##$USER= <she>
##$AMP= (0..31)
100 100 100 100 100 100 100 100 100 100 100 100 100 100 100 100 100 100 
100 100 100 100 100 100 100 100 100 100 100 100 100 100 
##$AQSEQ= 0
##$AQ_mod= 1
##$AUNM= <au_zg>
##$AUTOPOS= <>
##$BF1= 200.13
##$BF2= 200.13
##$BF3= 200.13
##$BF4= 200.13
##$BF5= 200.13
##$BF6= 200.13
##$BF7= 200.13
##$BF8= 200.13
##$BYTORDA= 1
##$CFDGTYP= 0
##$CFRGTYP= 5
##$CHEMSTR= <none>
##$CNST= (0..31)
1 1 145 1 1 1 1 1 1 1 1 1 1 1 1 1 1 1 1 1 1 1 1 1 1 1 1 1 1 1 1 1 
##$CPDPRG= <>
##$CPDPRG1= <>
##$CPDPRG2= <>
##$CPDPRG3= <>
##$CPDPRG4= <mlev>
##$CPDPRG5= <mlev>
##$CPDPRG6= <mlev>
##$CPDPRG7= <mlev>
##$CPDPRG8= <mlev>
##$CPDPRGB= <>
##$CPDPRGT= <>
##$D= (0..31)
0 1.2 0 0 0 0 0 0 0 0 0 0.03 0 0 0 0 0 0 0 0 0 0 0 0 0 0 0 0 0 0 0 0 
##$DATE= 1559304031
##$DBL= (0..7)
120 120 120 120 120 120 120 120 
##$DBP= (0..7)
150 150 150 150 150 150 150 150 
##$DBP07= 0
##$DBPNAM0= <>
##$DBPNAM1= <>
##$DBPNAM2= <>
##$DBPNAM3= <>
##$DBPNAM4= <>
##$DBPNAM5= <>
##$DBPNAM6= <>
##$DBPNAM7= <>
##$DBPOAL= (0..7)
0.5 0.5 0.5 0.5 0.5 0.5 0.5 0.5 
##$DBPOFFS= (0..7)
0 0 0 0 0 0 0 0 
##$DE= 6
##$DECBNUC= <off>
##$DECIM= 24
##$DECNUC= <off>
##$DECSTAT= 4
##$DIGMOD= 1
##$DIGTYP= 9
##$DL= (0..7)
0 120 120 120 120 120 120 120 
##$DP= (0..7)
150 150 150 150 150 150 150 150 
##$DP07= 0
##$DPNAME0= <>
##$DPNAME1= <>
##$DPNAME2= <>
##$DPNAME3= <>
##$DPNAME4= <>
##$DPNAME5= <>
##$DPNAME6= <>
##$DPNAME7= <>
##$DPOAL= (0..7)
0.5 0.5 0.5 0.5 0.5 0.5 0.5 0.5 
##$DPOFFS= (0..7)
0 0 0 0 0 0 0 0 
##$DQDMODE= 0
##$DR= 18
##$DS= 0
##$DSLIST= <SSSSSSSSSSSSSSS>
##$DSPFIRM= 0
$$ [...]
##$SUBNAM2= <"">
##$SUBNAM3= <"">
##$SUBNAM4= <"">
##$SUBNAM5= <"">
##$SUBNAM6= <"">
##$SUBNAM7= <"">
##$SUBNAM8= <"">
##$SUBNAM9= <"">
##$SW= 24.9336996594482
##$SWIBOX= (0..15)
0 0 2 0 0 0 0 0 0 0 0 0 0 0 0 0 
##$SW_h= 4990.01996007984
##$TD= 16384
##$TD0= 1
##$TE= 0
##$TE2= 300
##$TE3= 300
##$TEG= 300
##$TL= (0..7)
0 120 120 120 120 120 120 120 
##$TP= (0..7)
150 150 150 150 150 150 150 150 
##$TP07= 0
##$TPNAME0= <>
##$TPNAME1= <>
##$TPNAME2= <>
##$TPNAME3= <>
##$TPNAME4= <>
##$TPNAME5= <>
##$TPNAME6= <>
##$TPNAME7= <>
##$TPOAL= (0..7)
0.5 0.5 0.5 0.5 0.5 0.5 0.5 0.5 
##$TPOFFS= (0..7)
0 0 0 0 0 0 0 0 
##$TUNHIN= 0
##$TUNHOUT= 0
##$TUNXOUT= 0
##$USERA1= <user>
##$USERA2= <user>
##$USERA3= <user>
##$USERA4= <user>
##$USERA5= <user>
##$V9= 5
##$VALIST= <valist>
##$VCLIST= <CCCCCCCCCCCCCCC>
##$VD= 0
##$VDLIST= <DDDDDDDDDDDDDDD>
##$VPLIST= <PPPPPPPPPPPPPPP>
##$VTLIST= <TTTTTTTTTTTTTTT>
##$WBST= 1024
##$WBSW= 4
##$XGAIN= (0..3)
0 0 0 0 
##$XL= 0
##$YL= 0
##$YMAX_a= 104239
##$YMIN_a= -130536
##$ZGOPTNS= <>
##$ZL1= 120
##$ZL2= 120
##$ZL3= 120
##$ZL4= 120
##$ABSF1= 10
##$ABSF2= 0
##$ABSG= 5
##$ABSL= 3
##$ALPHA= 0
##$AQORDER= 0
##$ASSFAC= 0
##$ASSFACI= 0
##$ASSFACX= 0
##$ASSWID= 0
##$AUNMP= <proc_1d>
##$AZFE= 0.1
##$AZFW= 0.1
##$BCFW= 1
##$BC_mod= 2
##$BYTORDP= 1
##$COROFFS= 0
##$CY= 11.3945322036743
##$DATMOD= 1
##$DC= 2
##$DFILT= <>
##$DTYPP= 0
##$F1P= 18.9103706918063
##$F2P= -1.10871071338519
##$FCOR= 0.5
##$FTSIZE= 0
##$FT_mod= 4
##$GAMMA= 1
##$GB= 0.15
##$INTBC= 1
##$INTSCL= 1
##$ISEN= 128
##$LB= 0.24
##$LEV0= 0
##$LPBIN= 0
##$MAXI= 10000
##$MC2= 0
##$MEAN= 0
##$ME_mod= 0
##$MI= 1.114404
##$NCOEF= 0
##$NC_proc= 0
##$NLEV= 6
##$NOISF1= 3.799351
##$NOISF2= 2.8
##$NSP= 1
##$NTH_PI= 0
##$NZP= 0
##$OFFSET= 15.70392
##$PC= 1
##$PHC0= -8580.213
##$PHC1= 14.80023
##$PH_mod= 1
##$PKNL= yes
##$PPARMOD= 0
##$PSCAL= 0
##$PSIGN= 0
##$REVERSE= no
##$SF= 200.130013532006
##$SI= 16384
##$SIGF1= 3
##$SIGF2= 2
##$SINO= 400
##$SIOLD= 16384
##$SREGLST= <1H.CDCl3>
##$SSB= 0
##$STSI= 0
##$STSR= 0
##$SW_p= 3612.71676300578
##$SYMM= 0
##$S_DEV= 0
##$TDeff= 0
##$TDoff= 0
##$TI= <>
##$TILT= no
##$TM1= 0
##$TM2= 0
##$TOPLEV= 0
##$USERP1= <user>
##$USERP2= <user>
##$USERP3= <user>
##$USERP4= <user>
##$USERP5= <user>
##$WDW= 1
##$XDIM= 8192
##$YMAX_p= 0
##$YMIN_p= 0
$$ End of Bruker specific parameters
$$ ---------------------------------
##NTUPLES= NMR FID
##VAR_NAME=  TIME,          FID/REAL,        FID/IMAG
##SYMBOL=    X,             R,               I
##VAR_TYPE=  INDEPENDENT,   DEPENDENT,       DEPENDENT
##VAR_FORM=  AFFN,          ASDF,            ASDF
##VAR_DIM=   8192,          8192,            8192
##UNITS=     SECONDS,       ARBITRARY UNITS, ARBITRARY UNITS
##FACTOR=    0.0002004,     1,               1
##FIRST=     0,             0,               0
##LAST=      1.6414764,     0,               0
##MIN=       0,             -130536,         0
##MAX=       1.6414764,     104239,          0
$$ Real data points
##PAGE= N=1
##DATA TABLE= (X++(R..R)), XYDATA
0 0 0 0 0 0 0 0 0 0 0 0 0 0 -7 8 -8 8 -8 8 -13 16 -16 16 -24 24 -29 32 -37 40 -48 53 -60 66 -74 83 -93 101
36 101 -115 125 -141 155 -172 191 -209 232 -259 286 -319 356 -399 452 -512 587 -679 799 -963
55 -963 1196 -1551 2158 -3398 6894 -36248 -130536 -5590 85053 -6268 -84265 -9938 39654
68 39654 -28126 -68316 -3405 41833 4399 -48583 -59497 -26830 28424 30489 -47412 -86572
80 -86572 -9516 43847 -24180 -65609 14537 44344 -58370 -90017 34314 84748 -38560 -108692
92 -108692 -10462 60379 -4991 -56197 -10961 19567 -12654 -27940 -3428 12755 11598 -3161
104 -3161 -35258 -33511 29419 51725 -25974 -69750 6965 57702 -11697 -49542 26547 52555
116 52555 -38144 -63619 38333 77580 -15792 -68874 -6610 41320 14263 -9787 -4709 -7673
128 -7673 -6494 10456 6873 -6986 11129 18239 -28461 -42049 29887 60391 -21696 -68563 6118
141 6118 53462 -11414 -45720 19446 42501 -29418 -54394 15510 50506 540 -38259 -21303
153 -21303 3317 14430 15270 -7529 -28405 -5007 21063 -4636 -23945 16026 31072 -29835
165 -29835 -51442 24552 60216 -16122 -61467 4608 49589 -3644 -39097 7446 35513 -5541
177 -5541 -31572 -793 26554 15418 -7663 -19718 -8740 22451 28613 -11147 -28906 13877
189 13877 34752 -11882 -29354 27532 44093 -25744 -49447 27091 63330 -7381 -52932 1575
201 1575 46635 10400 -25503 -2455 22870 7374 -13400 -7360 12687 21079 2560 -24645 -14145
214 -14145 28245 28910 -21693 -31556 21130 33214 -22848 -35042 26585 41265 -26062 -49974 14739
227 14739 48839 -3473 -42323 -8158 26184 7356 -18141 -8989 9276 5924 -11025 -15989 2181
240 2181 19919 3146 -28628 -17500 25238 22351 -25670 -29417 20102 27776 -22165 -32640 17402
253 17402 32204 -15041 -34859 5687 29764 468 -23413 -5530 15031 6417 -9958 -7648
265 -7648 6847 10359 -4745 -15693 788 21927 7016 -24075 -13963 24360 21509 -19162 -22980
278 -22980 15956 24091 -11097 -21325 9737 21188 -5599 -18389 3202 17361 2225 -12398
290 -12398 -4153 9826 7806 -5391 -8826 4229 13269 -39 -15616 -3271 19115 10069 -17745
303 -17745 -14373 15240 17833 -9911 -16591 7288 15830 -3882 -12657 3830 12905 -925 -11340
316 -11340 -1008 10982 4961 -8569 -7867 6219 11186 -2322 -12517 -337 14914 5421 -13837
329 -13837 -8371 13004 11799 -10038 -13368 6587 13044 -4098 -12305 2175 11616 -326 -10733
342 -10733 -771 11377 3821 -10709 -7053 9227 10149 -7203 -13868 2630 14860 1249 -15059
355 -15059 -5203 14053 9035 -11004 -10476 8792 11761 -6234 -12318 3686 11913 -2366 -12662
368 -12662 44 13005 2740 -12582 -5120 12830 9587 -9987 -11985 7419 14460 -3493 -15476
381 -15476 -838 14634 4229 -12959 -6569 11445 9085 -8543 -9339 7624 11063 -5576 -12062
394 -12062 3669 13093 -1649 -14666 -2038 14539 5525 -13608 -9001 11562 12162 -7983 -13615
407 -13615 4332 13713 -1437 -13740 -2081 11758 3285 -11385 -5550 9932 6779 -9319 -8818
420 -8818 8016 10758 -6411 -13100 3267 13961 -491 -15035 -4017 13355 6776 -11810 -9756
433 -9756 8746 11090 -6027 -11712 3474 11741 -1504 -11847 -498 11696 2174 -12027 -4755
446 -4755 11366 7161 -10315 -9718 8339 12129 -4920 -12742 2022 13297 1861 -11882 -4478
459 -4478 10347 6891 -8093 -8069 6543 9644 -4122 -9507 3814 11779 -889 -11453 153 13488
473 13488 3700 -12373 -5799 11894 9374 -8296 -9800 6632 12132 -1457 -9643 740 10861
486 10861 3748 -7924 -4439 7933 7580 -5407 -8186 5109 10966 -2250 -10810 2371 13962
499 13962 1547 -13137 -2806 14060 6505 -11944 -8626 9102 9759 -5674 -9506 2759 8974
512 8974 265 -7398 -2012 6842 4123 -6649 -7339 4853 8871 -4819 -12762 1428 13184 -290
526 -290 -14879 -2683 13993 3699 -14262 -6598 11339 6501 -10728 -9617 5065 7432 -3233
539 -3233 -7880 -1426 4678 2112 -4821 -4933 3632 6035 -5444 -11334 2798 13250 -2018 -17104
553 -17104 -2828 15517 3937 -14897 -5505 12467 4651 -12103 -5847 9680 5891 -7816 -7650
566 -7650 2539 5923 807 -4618 -4114 2571 5562 -2671 -8057 3084 11396 -3282 -16048 724
580 724 18456 2298 -18807 -5254 16503 6018 -13649 -4999 11737 4007 -10282 -3978 8253
593 8253 4769 -4807 -5472 57 5154 5131 -3223 -8681 1843 11667 -673 -13698 818 16455 -495
608 -495 -19178 -826 21021 3720 -19724 -5550 16698 6276 -11805 -3783 9087 1699 -7625
621 -7625 -1350 6132 3580 -1837 -5598 -4701 5781 12223 -2064 -15706 -810 16876 1952 -16705
635 -16705 -297 18391 -994 -21235 -295 22533 3904 -19194 -5451 13982 4696 -8421
647 -8421 -1170 6192 -577 -5420 -1619 2030 4826 4579 -6385 -12929 4061 18791 84 -20364
661 -20364 -2485 19060 862 -19644 529 20066 -2579 -22778 -205 20686 1737 -17308
673 -17308 -3729 10362 1608 -6265 -1153 966 -1393 36 -2143 -6365 2265 10412 -5098 -18705
687 -18705 1897 21452 -761 -24020 -2839 20073 -284 -20118 953 17254 -5576 -20270
699 -20270 2722 17627 -1003 -14409 -3227 5100 1480 1028 29 -6710 -3676 6423 454 -10116
713 -10116 2152 14297 -5284 -21484 2950 24310 279 -22704 -1792 17530 -1846 -15172
725 -15172 5697 15128 -7391 -16355 3971 13588 1070 -5279 -2058 -3148 117 9441 3692 -10482
739 -10482 -3286 11324 208 -13475 4377 19431 -4114 -22097 3509 23587 -161 -18571
751 -18571 2300 15799 -3596 -11837 7001 11826 -5034 -7890 4130 4997 701 4194 800 -8885
765 -8885 69 15570 3679 -15025 -1439 17082 873 -15640 4793 20025 -4277 -19690
777 -19690 5992 21942 -1284 -15774 2338 12018 -1489 -4821 5665 3833 -4328 -120 3671
790 3671 -1597 2085 10054 -1836 -15277 1634 20327 2240 -18298 -809 17041 -1920 -15928
803 -15928 6754 19271 -6124 -19810 3784 18079 663 -10564 -466 4032 -1382 672 3737
816 3737 -1897 -1972 4430 -1180 -8502 4696 15333 -4026 -19151 2681 20420 -1377 -18417 3274
830 3274 17491 -5307 -17247 6544 17894 -4341 -15487 1974 11399 604 -4886 -602 -401
843 -401 176 4485 140 -6827 1282 9314 -3517 -12187 5840 15777 -6598 -18467 5937 19110
857 19110 -5009 -17902 4519 15314 -5327 -13550 5419 11864 -4565 -10308 1457 6276 1043
870 1043 -1415 -2889 -4346 2033 7114 -2157 -8645 3172 8970 -6708 -11730 8583 14456 -9187
884 -9187 -17244 6479 15942 -5048 -13480 4253 9975 -5385 -8652 4772 7121 -3188 -5683 -505
898 -505 1299 2111 2417 -3352 -6058 2955 7041 -4230 -7895 6022 8706 -8499 -11194 8450 12173
913 12173 -7930 -12730 5610 10435 -4737 -8153 3960 5677 -3626 -4056 2364 2172 -891 -538 -1577
928 -1577 -2367 2841 4476 -4141 -6594 4693 7830 -5040 -8257 5605 8455 -6129 -8802 5774
942 5774 8569 -5044 -8090 3361 6382 -1903 -4132 979 1996 -376 -460 -547 -822 1793 1776 -3949
958 -3949 -3939 5074 5968 -5548 -7770 4917 8298 -4348 -8272 3674 7505 -3676 -7548 2458
972 2458 6711 -1250 -5699 -486 3797 1641 -1912 -2502 137 3021 853 -4246 -2335 5176 3752
987 3752 -6110 -5550 6281 7303 -5339 -7884 4502 8173 -3346 -7879 2233 7310 -1155 -6696
1001 -6696 -146 5945 1881 -4401 -2895 3372 4518 -1514 -5324 56 6123 1405 -6813 -3127 6893
1016 6893 4554 -6619 -5670 6230 6994 -4812 -7200 3799 7427 -2574 -7451 995 6802 -32
1030 -32 -6709 -1559 6084 3187 -5043 -4442 4168 6083 -2462 -6941 760 7251 550 -7726 -2486 7092
1046 7092 3608 -6518 -4617 5863 5836 -4370 -6026 3433 6486 -2216 -6855 584 6469 449 -6580
1061 -6580 -2101 6006 3658 -4855 -4458 4144 5800 -2518 -6170 1101 6131 -140 -6466 -1549 5677
1076 5677 2417 -5158 -3206 4728 4492 -3376 -4768 2598 5430 -1448 -5918 -218 5430 1139 -5364
1091 -5364 -2464 4655 3627 -3330 -3739 2844 4623 -1380 -4470 454 4267 232 -4366 -1385 3827
1106 3827 2207 -3224 -2658 3089 3969 -1650 -3970 1103 4529 85 -4601 -1392 3923 2055 -3558
1121 -3558 -2926 2708 3571 -1508 -3461 942 3805 136 -3684 -1168 3079 1526 -3189 -2816 2078 3079
1137 3079 -1599 -3706 616 3924 414 -3862 -1485 3339 2100 -3147 -3292 1786 3212 -1554 -4019
1152 -4019 232 3801 333 -3965 -1295 3670 1926 -3622 -3053 2672 3289 -2475 -4460 863 4168
1167 4168 -308 -4732 -1369 3992 2105 -3820 -3507 2627 3884 -2203 -5007 672 4736 -410 -5650
1182 -5650 -1180 5022 1488 -5458 -2874 4593 3259 -4372 -4335 3150 4580 -2346 -5235 681 4912
1197 4912 386 -4945 -2032 4151 3049 -3598 -4100 2956 5234 -1949 -5833 1309 6826 111 -6813
1212 -6813 -902 7021 2202 -6299 -2650 6083 3853 -4625 -3829 4126 5071 -1762 -4296 923 4701
1227 4701 1226 -3648 -1931 3675 3534 -2898 -4253 3006 6030 -1752 -6437 1418 7541 7 -7188
1242 -7188 -503 7106 1224 -6632 -1884 5764 2414 -4703 -2904 3271 3208 -1589 -3158 6 2906
1257 2906 1307 -2932 -2931 2454 3945 -2474 -5354 1936 6199 -1537 -6877 992 7201 -312 -6979 -303
1273 -303 6217 607 -5280 -718 4269 869 -3088 -899 2142 1620 -265 -1662 -1363 1799 3297 -1165
1289 -1165 -4183 1144 5253 -812 -5527 1455 6763 -863 -6883 610 6975 477 -5429 -294 4167
1304 4167 105 -2659 780 2237 -288 -861 -8 -548 720 2821 -510 -4564 -69 5506 351 -5875
1320 -5875 -51 6253 -432 -6810 526 7024 -334 -6834 -425 5207 134 -3958 -96 2190 -563
1335 -563 -1188 307 -428 -229 1848 -441 -4089 80 5245 -458 -7017 -130 7495 -19 -8117 -308
1351 -308 7655 -75 -7425 111 6476 -691 -6128 184 4719 135 -2984 -473 663 344 1564
1366 1564 242 -2871 -102 4095 -498 -5469 1465 7573 -1338 -8921 1019 9820 261 -8370 402
1381 402 7602 -908 -6547 2018 6649 -1289 -5515 393 3666 799 -320 -165 -1756 -152 3428
1396 3428 417 -4076 729 5445 -1975 -7502 2251 9050 -1840 -9590 1189 8737 -1445 -7745
1410 -7745 1955 6743 -2698 -6508 2002 5076 -1478 -3622 200 767 -213 1186 -274 -3372 248
1425 248 4545 -1059 -6142 1336 6914 -2175 -7928 2508 8249 -2975 -8521 2846 8060 -2541
1439 -2541 -6882 2328 5189 -2415 -3526 2706 2536 -1965 -1027 970 -656 616 3484 -934 -5535
1454 -5535 921 6844 -696 -6750 1664 6835 -2880 -7111 4158 8228 -3641 -7941 2708 6414
1468 6414 -2143 -4139 2337 1990 -3211 -1285 2633 334 -1211 1315 -453 -3868 1029 5885 -1092
1483 -1092 -7204 569 6495 -2047 -6912 2773 6727 -4000 -7407 3725 7057 -3026 -5805 2306
1497 2306 3675 -2521 -2364 1909 332 -2013 499 690 -2276 255 3956 -900 -5139 1756 6340
1512 6340 -2230 -7061 2434 6954 -3120 -7090 3046 6281 -3354 -5414 3760 5073 -2928 -3661 2354
1527 2354 2306 -1270 -183 615 -1972 -645 3088 193 -3644 1109 4723 -2043 -5369 3488 7003 -3254
1543 -3254 -7268 2894 6523 -2961 -5455 3331 4494 -3668 -3831 3551 3572 -1924 -1776 903 -233 -225
1559 -225 2137 5 -3394 142 3613 -1362 -4202 2665 5237 -3387 -6074 3537 6382 -3304 -6032
1574 -6032 2890 4801 -3289 -4270 2919 3279 -2634 -2570 1607 1196 -741 156 -218 -1771 628 2627 -1552
1591 -1552 -3742 1976 4227 -2778 -4887 3145 5171 -3442 -5280 3451 5113 -3259 -4765 2662 3911
1606 3911 -2017 -2716 1596 1630 -979 -475 480 -251 590 1328 -1551 -2398 2430 3648 -2614 -4188 2960
1623 2960 4624 -2938 -4364 3445 4520 -3458 -4526 3074 4282 -2306 -3556 1484 2515 -768 -1296
1638 -1296 457 620 254 13 -1269 -911 2141 1764 -3040 -2906 3179 3507 -3272 -3737 3414 3919 -3372
1655 -3372 -3946 3197 3884 -2837 -3853 1935 3184 -1279 -2574 573 1933 304 -1040 -822 566 1751
1671 1751 218 -2474 -1015 2966 1608 -3418 -2224 3601 2807 -3379 -2858 3458 3288 -2820 -3049 2483
1687 2483 2933 -1958 -2790 1184 2402 -405 -1927 -279 1568 1311 -668 -1671 293 2317 303 -2763
1703 -2763 -854 2986 1265 -3225 -1732 3157 2158 -2711 -2096 2570 2340 -1973 -2166 1562 2125 -1042
1719 -1042 -2104 271 1845 454 -1445 -985 1159 1697 -527 -1981 193 2350 286 -2566 -805
1734 -805 2481 1149 -2409 -1529 2093 1737 -1687 -1831 1270 1872 -812 -1935 159 1661 212 -1649
1750 -1649 -892 1176 1187 -929 -1686 381 1784 -100 -2052 -513 1858 722 -1940 -1271 1533 1397
1766 1397 -1382 -1796 864 1832 -541 -2027 -100 1866 468 -1883 -1076 1514 1430 -1225 -1805 790
1782 790 2024 -323 -2168 -225 2066 653 -2004 -1156 1720 1510 -1420 -1836 1075 2168 -571 -2302
1798 -2302 176 2456 382 -2432 -918 2257 1380 -2044 -1838 1679 2228 -1112 -2364 711 2622 -8
1814 -8 -2522 -477 2484 1104 -2237 -1590 1943 2117 -1460 -2399 1092 2821 -362 -2763 -11 2955
1830 2955 758 -2705 -1198 2512 1723 -2074 -2070 1699 2493 -1039 -2536 664 2824 114 -2668 -543
1846 -543 2660 1159 -2407 -1684 2048 2098 -1654 -2463 1140 2696 -498 -2717 -45 2691 649 -2523
1862 -2523 -1227 2142 1579 -1909 -2126 1345 2317 -978 -2597 430 2661 21 -2669 -495 2552 911
1878 911 -2373 -1368 1978 1603 -1604 -1889 1037 2001 -466 -1935 17 1985 653 -1735 -1085 1611
1894 1611 1653 -1234 -1992 934 2291 -540 -2371 265 2502 170 -2288 -361 2187 742 -1725 -845
1910 -845 1290 908 -849 -966 287 876 158 -869 -685 796 1192 -636 -1576 488 1870 -387 -2192
1927 -2192 122 2164 -146 -2333 -190 2037 269 -1740 -326 1334 371 -791 -354 250 306 280 -373
1944 -373 -1032 157 1529 -29 -1960 -35 2352 205 -2433 -13 2804 228 -2764 -326 2559
1959 2559 412 -2113 -371 1621 323 -958 -18 646 303 251 -198 -921 277 1824 -81 -2463 -107
1976 -107 2896 166 -3164 17 3638 161 -3661 -115 3765 465 -3253 -487 2578 339 -1967
1991 -1967 -238 1294 276 -438 -228 -361 441 1507 -251 -2253 239 2964 -318 -3575 336 3967
2007 3967 -481 -4330 448 4415 -350 -4161 396 3772 -454 -3337 269 2505 -285 -1820 -150
2022 -150 511 68 423 -279 -1471 298 2086 -840 -3110 990 3704 -1441 -4648 1025 4494 -1290
2038 -1290 -4540 1240 3978 -1742 -3918 1589 3412 -1467 -2945 770 1589 -742 -616 451 -536 -452
2054 -452 1082 -163 -1872 834 2761 -1456 -3735 1571 4243 -1607 -4315 1689 3960 -2115 -3698
2069 -3698 2447 3520 -2333 -3044 2027 2247 -1607 -1066 1469 86 -1253 746 877 -1406 -178 2264
2085 2264 -429 -2982 960 3564 -1285 -3676 1766 3663 -2187 -3519 2543 3310 -2559 -2744 2523
2100 2523 2013 -2392 -1078 2353 365 -1976 379 1397 -1175 -581 2272 147 -3081 195 3550
2115 3550 -445 -3411 1194 3455 -1874 -3423 2390 3562 -2223 -2996 2123 2087 -2062 -921 2395 238
2131 238 -2340 260 1849 -872 -972 1926 308 -3000 -8 3719 -121 -3812 549 3640 -1324
2146 -1324 -3636 1946 3700 -2178 -3606 1916 2870 -1774 -1816 1827 810 -1917 -100 1634 -634 -1069
2162 -1069 1474 370 -2540 8 3322 -344 -3731 802 3916 -1309 -4010 1784 4045 -2019 -3818
2177 -3818 2063 3282 -2137 -2657 2121 1965 -1927 -1266 1454 414 -836 650 294 -1737 -39 2348
2193 2348 -449 -2855 1027 3169 -1851 -3743 2206 4082 -2288 -4127 2071 3463 -2273 -2924 2436
2208 2436 2398 -2521 -2174 1930 1544 -1170 -536 532 -591 -229 1420 -43 -1807 671 2169 -1447
2224 -1447 -2579 2264 3320 -2440 -3496 2552 3512 -2364 -2873 2688 2624 -2612 -2126 2616 2002 -1782
2240 -1782 -1086 1401 448 -646 614 505 -947 246 1541 -734 -1773 1605 2393 -1867 -2432 2377
2256 2377 2647 -2463 -2366 2831 2336 -2767 -2044 2653 1739 -2227 -1140 1905 607 -1454 -71 1039
2272 1039 -304 -346 783 -375 -1325 918 1789 -1278 -2039 1499 1985 -1864 -1884 2228 1822 -2451 -1864
2289 -1864 2241 1600 -1947 -1145 1572 449 -1526 -103 1199 -273 -840 420 46 -986 406 1310
2305 1310 -951 -1845 985 1738 -1422 -1860 1530 1596 -1990 -1808 1794 1529 -1779 -1453 1259 776 -1217
2322 -1217 -511 762 -116 -667 196 -30 -780 295 967 -868 -1493 943 1489 -1394 -1789 1403 1623 -1732
2340 -1732 -1826 1540 1577 -1599 -1559 1255 1139 -1165 -1040 682 598 -478 -442 -172 -121 395 353 -870 -785 1066
2360 1066 953 -1442 -1268 1549 1364 -1814 -1682 1610 1616 -1545 -1651 1275 1444 -1095 -1297 845 1161 -474
2378 -474 -966 18 638 377 -304 -723 13 1077 351 -1213 -407 1629 847 -1647 -921 1849 1280 -1615
2396 -1615 -1255 1618 1458 -1212 -1220 1181 1421 -634 -1074 512 1196 109 -800 -328 697 812 -333 -956
2414 -956 250 1378 162 -1394 -237 1664 596 -1553 -701 1568 898 -1404 -993 1239 1120 -964
2430 -964 -1127 699 1158 -333 -1062 29 987 323 -852 -627 649 915 -422 -1084 242 1280 79
2447 79 -1254 -220 1319 503 -1173 -616 1134 855 -875 -864 749 1052 -366 -941 239 1057 149 -879
2465 -879 -288 870 610 -662 -739 531 955 -244 -966 120 1086 194 -1010 -359 938 542 -856 -758
2483 -758 651 830 -513 -971 241 987 -53 -1027 -240 871 344 -926 -667 598 653 -593 -903 253
2501 253 832 -122 -935 -184 814 295 -866 -631 577 637 -611 -946 295 927 -161 -1002 -68 1000
2519 1000 292 -915 -461 782 588 -693 -773 422 800 -224 -822 52 900 300 -729 -371 750 670
2537 670 -560 -772 446 906 -229 -926 127 1050 216 -837 -185 982 605 -647 -542 644 813
2554 813 -332 -780 224 945 146 -780 -141 989 604 -646 -528 752 859 -441 -829 351 954 -71
2572 -71 -879 -57 917 377 -711 -453 698 746 -428 -823 251 919 -110 -1046 -162 989 281 -1044
2590 -1044 -530 907 635 -815 -795 551 781 -435 -890 84 735 34 -843 -469 553 567 -556 -910
2608 -910 260 971 -197 -1202 -49 1217 131 -1372 -426 1203 453 -1211 -655 935 601 -833
2624 -833 -710 538 707 -261 -724 -100 610 386 -569 -778 332 896 -398 -1285 171 1386 -158 -1652
2642 -1652 -81 1619 138 -1648 -316 1395 204 -1424 -453 974 285 -910 -581 293 382 -61 -486
2659 -486 -460 288 649 -462 -1174 271 1285 -464 -1798 145 1706 -284 -1890 131 1734 -217
2675 -217 -1695 164 1511 -117 -1237 -19 757 -80 -431 26 6 -5 378 -38 -689 292 1266 -164
2693 -164 -1450 325 1778 -253 -1734 470 1855 -515 -1735 726 1865 -424 -1318 673 1181 -406
2709 -406 -469 718 314 -481 202 485 -430 -35 1170 184 -1322 196 1844 24 -1613 483 1854
2726 1854 -576 -1719 878 1789 -792 -1403 954 1160 -831 -497 1122 254 -990 201 864 -620
2742 -620 -635 1085 381 -1584 -308 1827 100 -1963 120 1939 -500 -2072 612 1836 -861 -1769
2758 -1769 720 1078 -1065 -761 1016 187 -1181 89 844 -818 -820 1203 496 -1900 -604 1992 234
2775 234 -2260 -31 2234 -454 -2459 590 2354 -734 -2144 712 1565 -949 -1072 1111 638 -1105
2791 -1105 -202 921 -329 -554 1105 388 -1741 -268 2181 153 -2292 258 2495 -651 -2648 956
2807 956 2786 -989 -2595 1003 2117 -1131 -1583 1282 1134 -1306 -712 1065 169 -738 518 389 -1245
2824 -1245 -248 1677 -69 -2044 410 2248 -872 -2520 1238 2718 -1361 -2637 1439 2333 -1594
2839 -1594 -1939 1729 1597 -1679 -1190 1487 714 -1041 86 899 -595 -542 1156 305 -1337 317 1778
2856 1778 -750 -2048 1257 2414 -1300 -2209 1661 2099 -1806 -1679 2180 1575 -2130 -1272 1955 901
2872 901 -1558 -217 1339 -334 -1072 788 809 -986 -227 1231 -456 -1628 880 1875 -1214 -1972 1319
2889 1319 1646 -1703 -1410 1949 1112 -2211 -1027 1997 584 -1846 -176 1472 -492 -1425 728 1027
2905 1027 -1099 -730 1150 32 -1555 305 1625 -760 -1801 901 1533 -1296 -1388 1488 1060 -1793
2921 -1793 -986 1613 489 -1605 -157 1325 -446 -1308 704 1004 -1033 -685 1232 144 -1651 88
2937 88 1734 -454 -1900 571 1615 -972 -1494 1247 1355 -1385 -1171 1331 820 -1225 -415 1041 -150
2954 -150 -1029 416 798 -670 -415 988 29 -1266 408 1645 -579 -1767 734 1663 -1019 -1601 1228
2971 1228 1506 -1375 -1395 1371 1297 -1059 -791 1003 454 -842 -108 627 -174 -337 414 -57 -706 502
2989 502 1097 -617 -1137 998 1359 -1100 -1273 1393 1330 -1504 -1294 1536 1274 -1329 -951 1339 910 -978
3007 -978 -484 933 458 -455 -119 172 -67 236 393 -424 -461 840 722 -943 -590 1403 885 -1406 -814
3026 -814 1546 871 -1476 -727 1457 649 -1313 -497 1250 544 -863 -335 609 233 -251 -59 -56 -102 290
3045 290 122 -620 -194 890 282 -1089 -349 1237 418 -1230 -391 1219 294 -1230 -273 1118 248 -961
3063 -961 -185 767 152 -495 -19 337 -2 -83 65 -114 -59 368 120 -535 -130 719 201 -774 -156 836 163
3084 163 -832 -133 796 121 -725 -107 556 39 -456 -31 236 -96 -169 53 -81 -192 130 118 -355 -284 324
3105 324 167 -513 -308 384 144 -576 -298 373 103 -483 -257 243 75 -269 -146 37 6 -32 -79 -238 -116
3126 -116 206 42 -448 -238 409 234 -515 -346 463 358 -468 -434 370 415 -336 -481 149 407 -103 -414 -56
3147 -56 351 179 -278 -284 230 383 -162 -497 35 530 19 -616 -139 605 224 -589 -306 575 433 -493 -495 391
3169 391 559 -303 -641 151 639 -7 -614 -103 620 329 -503 -364 462 517 -340 -550 239 659 -85 -641
3189 -641 3 690 185 -581 -224 620 439 -463 -465 436 603 -293 -629 204 713 -31 -685 -59 693 234 -617
3210 -617 -327 550 431 -432 -508 301 554 -187 -581 39 557 97 -552 -248 478 342 -453 -459 309 490 -265
3231 -265 -579 158 583 -81 -589 -49 531 109 -540 -236 416 255 -374 -361 240 387 -148 -416 15 410
3251 410 76 -417 -210 355 250 -352 -378 222 374 -179 -423 88 405 -28 -392 -61 318 86 -326 -200
3271 -200 197 184 -174 -258 67 254 10 -270 -85 249 124 -235 -194 186 206 -167 -268 68 265 12 -214
3292 -214 -37 239 152 -136 -145 127 248 -37 -255 -9 287 115 -230 -99 263 208 -177 -149 220 262 -68 -201
3314 -201 40 219 64 -149 -104 150 197 -90 -228 91 346 -2 -378 -50 423 104 -410 -146 415 165 -380
3335 -380 -208 335 243 -236 -245 138 241 -9 -188 -100 166 190 -150 -323 111 446 -57 -527 -8 590 58 -606
3357 -606 -62 599 67 -630 -120 549 145 -496 -214 305 147 -210 -160 42 102 38 -184 -253 119 371 -180
3378 -180 -637 39 621 -107 -781 7 727 -135 -882 15 783 -47 -772 -68 533 -28 -479 -20 265 -63
3398 -63 -188 -70 -54 59 242 -114 -482 63 584 -114 -685 168 782 -245 -891 265 942 -226 -871 243
3418 243 803 -219 -593 317 531 -234 -324 197 151 -67 163 90 -337 -9 555 5 -588 201 795 -269
3438 -269 -865 381 981 -361 -897 434 816 -464 -642 612 622 -523 -418 496 260 -322 83 329
3456 329 -283 -245 488 195 -551 62 774 -183 -858 366 1044 -347 -960 462 868 -558 -685 735 662
3475 662 -719 -488 707 319 -556 19 544 -258 -479 475 407 -554 -168 741 -40 -899 225 1043 -300
3494 -300 -992 466 917 -593 -785 764 699 -822 -553 791 335 -689 19 679 -265 -606 493 522
3512 522 -603 -251 823 41 -995 164 1162 -217 -1088 395 1001 -579 -857 795 775 -857 -647
3529 -647 805 376 -742 -39 730 -274 -726 443 564 -628 -366 789 46 -1078 89 1183 -254
3546 -254 -1246 342 1090 -614 -1028 769 897 -943 -842 856 553 -829 -244 773 -111 -763 324
3563 324 645 -506 -416 706 132 -964 78 1193 -216 -1189 430 1186 -582 -1051 875 1048 -890
3580 -890 -877 957 737 -840 -354 891 134 -771 167 729 -284 -391 615 206 -791 91 1059 -197
3598 -197 -1065 453 1084 -634 -1008 913 1023 -1000 -931 1006 764 -948 -458 958 215 -927 -8 797
3616 797 -133 -547 386 261 -619 -23 845 -114 -904 354 916 -588 -885 862 902 -999 -854 1045 754
3635 754 -998 -483 1076 305 -998 -73 950 -7 -711 227 464 -395 -198 638 51 -708 215 745 -432
3654 -432 -696 724 737 -860 -698 969 584 -993 -421 1017 235 -1028 -104 944 -32 -781 171 541
3672 541 -392 -374 471 135 -604 9 552 -332 -623 503 577 -716 -594 749 436 -870 -369 835 139
3691 139 -945 -94 824 -69 -754 149 529 -346 -418 426 212 -564 -118 475 -169 -555 305 499 -536 -553
3711 -553 550 421 -669 -358 675 176 -766 -128 681 -20 -660 72 454 -265 -373 325 206 -433 -97
3730 -97 433 -87 -479 241 470 -410 -510 471 453 -542 -370 554 274 -576 -201 557 126 -462 -18 361 -89
3751 -89 -248 184 134 -241 -4 288 -127 -328 266 363 -362 -373 447 366 -507 -324 538 290 -558 -247 522 228
3773 228 -425 -155 356 109 -238 -21 154 4 4 71 -78 -63 271 154 -308 -132 456 223 -436 -145 568
3794 568 235 -493 -148 595 243 -444 -133 472 213 -302 -112 302 188 -103 -81 82 167 134 -74 -162 108
3815 108 320 -30 -347 50 447 8 -457 -14 492 63 -485 -81 435 91 -416 -142 316 122 -297 -174
3835 -174 150 158 -107 -196 -12 172 63 -198 -164 166 194 -180 -292 131 305 -117 -339 81 351 -26 -322 16
3857 16 340 56 -273 -59 250 120 -176 -135 154 175 -54 -151 49 207 44 -153 -60 173 122 -130 -134 128 153
3880 153 -105 -164 67 166 -48 -169 9 140 10 -157 -75 103 52 -101 -104 49 79 -50 -118 -27 47 3 -96 -59
3904 -59 15 26 -46 -85 -23 30 30 -63 -62 14 60 -10 -83 -13 72 29 -103 -41 58 49 -50 -61 51 89 7 -71 3 88 51 -69
3934 -69 -67 83 120 -47 -126 49 185 -10 -175 -7 201 70 -167 -70 198 127 -154 -139 152 190 -78 -170 70
3957 70 218 11 -187 -38 178 89 -162 -135 147 202 -110 -199 104 262 -44 -256 18 283 41 -284 -89 270
3979 270 121 -266 -178 236 228 -169 -246 139 280 -62 -295 -19 260 32 -279 -136 232 168 -202 -226 159 240
4001 240 -104 -281 53 276 -30 -323 -78 290 92 -299 -166 266 189 -215 -214 217 249 -160 -271 88 268
4022 268 -50 -271 -17 243 70 -197 -82 198 179 -130 -175 110 233 -15 -232 -21 246 62 -235 -69 265
4043 265 148 -218 -134 228 184 -169 -162 156 149 -115 -149 89 146 -39 -119 -9 89 55 -39 -80 12 101 11 -133 -45 152
4069 152 61 -185 -107 173 106 -156 -86 161 63 -149 -46 149 25 -134 -12 98 -29 -71 69 48 -100 -33 108
4092 108 9 -95 69 128 -81 -143 101 158 -75 -127 96 88 -115 -55 121 34 -102 13 74 -52 -31 151 18 -193
4116 -193 -29 216 9 -232 30 260 -80 -298 62 307 -61 -260 69 213 -78 -153 96 125 -94 -97 31
4137 31 -9 -12 102 -6 -179 -1 204 -50 -271 102 301 -183 -401 155 390 -185 -413 156 331 -199 -328
4158 -328 187 262 -196 -265 81 108 -101 -67 12 -107 -61 86 -43 -181 97 237 -204 -359 214 358 -261 -415
4180 -415 239 322 -342 -372 354 351 -340 -335 303 258 -232 -155 208 54 -178 -12 99 -48 13 150 -109 -228 190
4203 190 326 -200 -299 276 306 -348 -289 440 319 -439 -285 422 244 -354 -107 388 61 -344 5 287 -31
4224 -31 -150 112 39 -198 39 270 -98 -274 189 262 -294 -246 411 268 -448 -261 438 187 -429 -82 443
4245 443 18 -445 47 389 -87 -287 165 183 -257 -97 313 47 -307 55 298 -182 -272 299 312 -361 -266
4266 -266 390 200 -391 -83 437 12 -451 47 419 -104 -313 165 220 -300 -150 376 92 -380 5 369
4286 369 -114 -369 239 378 -302 -358 335 271 -349 -152 395 57 -411 10 386 -57 -298 172 212 -272 -135
4307 -135 362 75 -392 20 383 -127 -379 260 408 -313 -393 364 336 -385 -241 407 136 -424 -84 402 13
4328 13 -332 75 232 -200 -162 279 85 -340 -18 328 -137 -376 232 385 -335 -400 363 336 -410 -257 442
4349 442 192 -492 -145 459 77 -387 12 302 -104 -214 189 154 -217 -37 258 -76 -263 210 318 -302
4369 -302 -314 350 307 -389 -228 459 181 -485 -112 485 96 -413 -3 346 -61 -262 145 201 -176 -114 191
4390 191 2 -205 134 225 -215 -216 298 205 -338 -151 421 111 -448 -78 457 56 -420 18 371 -66 -310
4411 -310 126 271 -146 -166 170 80 -177 43 190 -136 -194 201 171 -247 -116 334 99 -355 -53 397 27
4432 27 -377 16 334 -76 -319 101 261 -131 -197 128 94 -151 -30 153 -72 -170 117 126 -205 -110 229 70
4454 70 -290 -44 302 18 -292 23 269 -66 -266 77 200 -133 -184 101 95 -120 -49 130 1 -105 89 103
4476 103 -122 -72 172 51 -192 -36 226 12 -208 23 231 -22 -204 55 181 -67 -140 72 90 -92 -57
4497 -57 84 -3 -104 26 57 -95 -75 111 39 -168 -52 151 3 -202 -21 163 -12 -177 29 146 -32 -126
4519 -126 34 83 -37 -50 30 1 -30 30 33 -62 -23 114 14 -118 -6 146 20 -135 -9 151 17 -116 3
4542 3 127 17 -97 -5 78 18 -52 -15 26 21 20 -21 -28 24 56 -45 -90 28 107 -31 -117 11 118 -16 -145 -15 107
4569 107 6 -115 -30 96 42 -76 -67 45 62 -35 -85 3 76 14 -79 -42 81 77 -62 -80 66 101 -49 -106 20 110
4595 110 -8 -125 -12 124 49 -106 -45 103 72 -72 -86 59 90 -55 -117 23 112 -3 -106 -24 110 45 -95
4618 -95 -57 74 70 -77 -110 24 83 -30 -97 -10 107 27 -118 -51 100 54 -88 -85 52 80 -59 -117 36 101 -24
4643 -24 -99 -4 107 23 -81 -39 77 52 -64 -55 37 82 -17 -79 10 79 23 -66 -26 65 32 -69 -60 37 60 -43 -72 12
4671 12 69 -14 -69 -12 53 20 -63 -19 51 28 -52 -39 18 23 -16 -31 10 32 17 -18 -15 10 19 2 -29 0 41 17 -33 -6 46 16
4703 16 -46 -18 51 23 -31 -17 35 17 -12 2 16 2 3 27 -10 -36 36 42 -40 -54 39 45 -40 -64 50 64 -51 -80 36 64
4733 64 -42 -58 20 12 -35 -40 -3 -5 -8 4 -43 -52 56 63 -63 -75 61 95 -90 -103 99 106 -103 -112 106 113 -80 -84 76 74 -56
4764 -56 -63 64 35 -6 -19 -12 -3 42 55 -53 -67 88 84 -116 -88 134 98 -159 -121 165 101 -163 -115 154 72 -151 -69
4791 -69 131 62 -104 -42 46 5 -14 2 -34 -42 27 45 -93 -51 139 63 -181 -84 191 91 -207 -79 194 45 -217
4816 -217 -52 214 37 -172 -28 136 7 -95 29 66 -38 -25 46 -30 -37 91 51 -138 -58 170 52 -177 -35
4839 -35 215 16 -236 3 246 5 -217 18 196 -52 -144 88 132 -73 -78 92 54 -68 23 79 -66 -91 118
4862 118 87 -123 -41 172 -2 -197 23 229 -12 -192 48 181 -69 -147 123 149 -131 -109 125 62 -120 -14
4884 -14 129 -39 -145 85 137 -92 -89 114 58 -183 -41 175 18 -184 -5 145 -59 -145 101 116 -144 -117 135
4907 135 54 -146 -17 152 -54 -177 75 172 -90 -143 136 110 -185 -87 197 60 -193 -44 167 -3 -137 51
4929 51 122 -87 -108 103 67 -101 -6 129 -55 -166 75 170 -115 -159 146 122 -195 -95 238 115 -225 -74 210
4952 210 42 -188 9 186 -27 -165 46 131 -60 -61 83 -8 -122 55 111 -78 -122 120 87 -193 -96 236 92
4975 92 -259 -72 243 47 -248 -6 241 -31 -222 26 197 -45 -146 54 85 -86 -34 85 -8 -75 59 59
4997 59 -136 -46 178 40 -226 -44 213 -4 -242 26 257 -68 -270 58 222 -71 -191 75 129 -119 -92
5018 -92 108 50 -111 -28 70 -46 -50 98 56 -152 -33 160 -5 -175 44 207 -73 -211 76 214 -95 -190 117
5041 117 159 -131 -132 141 98 -132 -58 108 5 -94 48 80 -83 -65 103 33 -129 -3 144 -45 -176 53 169
5064 169 -81 -160 92 116 -143 -105 146 93 -143 -54 132 1 -138 30 111 -70 -113 78 76 -125 -37 123 6
5087 6 -150 13 149 -24 -133 67 110 -90 -74 116 67 -130 -41 106 -10 -117 40 109 -77 -128 102 91 -106
5110 -106 -70 145 34 -153 -31 154 9 -148 14 123 -41 -119 61 77 -62 -58 51 18 -65 23 86 -58 -62 89
5134 89 51 -125 -51 139 22 -172 -32 160 -16 -174 0 148 -26 -136 36 120 -46 -89 40 62 -50 -22
5156 -22 30 -22 -39 31 3 -80 -7 86 -43 -129 5 120 -43 -145 42 141 -68 -169 43 122 -50 -122 51 87 -57
5181 -57 -85 21 42 -24 -25 -1 -22 5 44 -29 -61 52 69 -49 -89 64 98 -70 -107 77 103 -82 -102 73 100 -61
5207 -61 -71 50 80 -22 -45 30 28 2 -16 -7 5 31 23 -53 -51 43 47 -70 -59 60 48 -82 -71 65 47 -79 -60 41 23
5236 23 -63 -36 24 14 -43 -33 -1 6 -5 -2 -23 -8 24 14 -33 -8 45 13 -43 -23 42 19 -34 -14 46 19 -28 -9 38 18 -23
5267 -23 0 9 9 -2 5 2 -3 16 13 3 -9 22 15 -12 -11 13 13 -9 -25 9 17 -12 -14 2 23 6 -12 -32 12 1 0 -17 -17 17 5 -32 -15
5304 -15 13 20 -16 -21 9 34 2 -28 -2 26 10 -19 -8 18 28 -21 -24 31 29 -23 -30 17 34 -1 -37 6 26 17 -38 -30 23 22 -28 -44
5338 -44 14 24 -15 -50 -3 39 8 -59 -24 36 22 -44 -40 26 28 -26 -42 8 36 -7 -41 -10 29 6 -57 -27 29 34 -40 -38 33 49
5370 49 -10 -44 17 61 1 -51 -13 47 19 -45 -25 38 32 -18 -39 33 59 3 -47 -7 54 19 -48 -27 41 24 -41 -51 31 32 -31
5401 -31 -45 14 31 -16 -37 5 8 3 -32 -29 11 31 -15 -46 -1 50 2 -42 -14 58 10 -57 -12 59 22 -56 -23 39 9 -28 -11 15
5433 15 35 -1 5 -3 3 38 14 -39 -2 46 14 -51 -5 64 0 -59 18 74 15 -73 -2 60 -6 -44 18 38 -27 -26 3 7 -16 15 5
5466 5 -44 -26 30 10 -69 -29 63 -4 -84 4 69 -12 -79 12 75 -25 -62 30 53 -36 -40 35 7 -40 20 52 -35 -43 56 45 -51
5497 -51 -23 77 22 -100 -5 98 -4 -99 11 89 -26 -81 56 61 -62 -40 58 11 -61 19 55 -59 -67 51 42 -79
5523 -79 -49 98 25 -117 -15 126 6 -116 10 89 -46 -92 53 63 -62 -56 66 21 -73 11 76 -48 -78 74
5547 74 75 -83 -48 113 32 -125 -24 142 5 -148 11 125 -33 -120 58 96 -83 -81 54 35 -69 0 82 -37
5571 -37 -101 63 64 -89 -60 107 26 -154 -28 148 -2 -174 13 142 -44 -147 62 125 -91 -104 78 82 -90
5594 -90 -34 86 -19 -91 34 70 -67 -57 92 23 -138 -17 172 5 -162 38 153 -50 -141 69 131 -99 -134
5617 -134 102 79 -102 -43 102 -1 -104 19 101 -52 -61 82 24 -116 -10 139 -16 -163 34 142 -71 -141
5639 -141 94 144 -113 -121 116 87 -119 -72 114 25 -125 -6 110 -25 -80 58 48 -110 -23 121 11 -136 19
5662 19 124 -49 -125 88 120 -112 -117 119 102 -128 -72 135 31 -142 0 124 -26 -106 57 77 -79 -56 100
5685 100 35 -121 -10 107 -16 -118 72 121 -84 -113 103 85 -106 -60 115 23 -127 4 132 -22 -118 52
5707 52 84 -73 -65 107 49 -113 -33 127 -9 -125 41 124 -67 -113 71 87 -78 -63 99 36 -104 -20 105 -20
5731 -20 -95 34 70 -71 -52 89 51 -114 -30 126 -6 -126 29 119 -51 -144 53 107 -62 -95 76 67 -95 -53
5755 -53 89 16 -90 -1 51 -39 -58 61 27 -87 -21 97 -17 -117 39 110 -61 -129 68 95 -88 -104 84 81 -94
5780 -94 -66 89 50 -77 -31 54 -7 -39 26 19 -43 -26 50 -14 -68 40 77 -54 -108 65 79 -82 -84 86 70 -103 -63
5807 -63 100 60 -87 -40 69 18 -63 3 55 -7 -44 19 3 -48 6 46 -37 -57 61 69 -73 -57 84 45 -95 -43 99
5834 99 34 -94 -38 74 12 -96 -22 68 -8 -65 18 32 -28 -35 16 -11 -42 12 32 -36 -35 52 27 -72 -44 73 24 -76 -17
5863 -17 65 -6 -79 14 52 -11 -67 14 43 -35 -25 28 12 -47 -9 25 -6 -31 17 21 -40 -28 31 7 -49 -3 49 6 -45 2 42
5894 42 -15 -50 5 15 -43 -26 17 -5 -54 -9 29 -15 -43 23 41 -32 -35 33 27 -28 -31 36 12 -45 -23 14 2 -9 -1 13 -1 -6 8
5927 8 -5 -14 9 25 -29 -26 33 28 -27 -31 26 39 -32 -30 45 24 -36 -29 24 25 -22 -29 -7 15 -2 -20 -21 5 16 -15 -42 -20 27 -9 -43
5962 -43 -13 39 17 -42 -22 46 20 -49 -25 27 21 -32 -34 20 18 -17 -37 11 36 0 -22 -16 33 22 -22 -33 34 38 -7 -43 16 44 6
5995 6 -26 1 45 8 -29 -9 37 26 -32 -20 25 37 -10 -21 15 33 6 -38 -8 33 13 -30 -16 33 21 -32 -34 22 31 -16 -10 -6 43
6028 43 -4 -33 -11 5 14 -23 -18 18 29 0 -14 3 23 5 -16 -8 30 10 -16 1 36 13 -13 -10 19 9 -6 -5 7 1 0 -26 -7 3
6062 3 3 -17 -17 4 12 -18 -15 4 15 -1 -14 -5 2 -17 -18 -19 2 -3 -10 -13 -12 3 7 -2 -17 4 7 4 -4 -1 3 -3 -23 -3 2 2 -5 -2 3 13 13 1 -8 12
6106 12 19 -13 -14 6 12 -2 -20 16 19 -3 -19 -12 13 -11 -23 -13 8 5 -10 -20 -9 32 11 -24 -17 12 5 -34 -21 10 7 -30 -26 27 10
6141 10 -32 -26 9 7 -14 -24 2 16 11 -13 -9 8 21 -9 -30 -8 25 2 -61 -2 51 10 -44 -13 51 16 -46 -9 44 6 -34 -6
6173 -6 23 10 -26 -10 -2 -6 3 -13 -4 0 46 -18 -59 -1 47 -1 -67 -2 54 -36 -77 11 49 -6 -63 -12 20 -16 -21 5 0 -13 -3 15
6207 15 -17 -3 20 -3 -38 14 56 -3 -55 14 59 -19 -57 27 69 -31 -58 38 58 -35 -45 32 25 -38 -10 26 -1 -33 23 13
6237 13 -38 -9 37 -4 -63 18 48 -31 -79 30 52 -57 -62 45 43 -56 -29 54 -6 -54 -11 41 -23 -55 29 25 -48 -31 57 2
6267 2 -81 -5 63 -26 -65 29 74 -47 -63 47 49 -67 -38 57 12 -66 0 63 -16 -41 41 48 -56 -22 82 23 -88 -9 89
6296 89 -13 -80 44 85 -57 -74 60 66 -64 -52 78 11 -83 -5 53 -23 -60 39 40 -85 -27 73 17 -100 -1 99
6322 99 -14 -96 47 97 -68 -101 65 67 -81 -53 80 31 -82 -12 70 -6 -65 30 34 -71 -34 76 14 -87 -6 97
6348 97 -26 -100 62 95 -77 -99 72 69 -94 -61 84 46 -99 -25 91 -5 -71 23 45 -51 -31 67 24 -77 -2 87
6374 87 -20 -107 33 87 -72 -94 79 72 -92 -76 101 39 -110 -20 101 14 -80 7 63 -41 -62 65 33 -67 -10
6399 -10 71 -17 -88 36 94 -60 -75 84 72 -104 -57 93 39 -112 -28 109 1 -106 13 89 -46 -70 50 41 -78
6424 -78 -28 63 -4 -80 25 70 -55 -73 62 64 -84 -50 82 27 -112 -24 99 5 -105 11 87 -41 -68 52 52 -52
6450 -52 -33 59 14 -80 28 69 -39 -76 47 59 -67 -44 84 31 -101 -33 97 6 -94 16 80 -29 -76 39 43
6475 43 -64 -45 51 5 -69 -6 59 -31 -65 31 47 -65 -50 69 28 -82 -23 76 -10 -90 -1 68 -20 -66 38 37 -55 -37
6503 -37 34 5 -57 -11 40 -33 -69 41 68 -52 -38 67 27 -65 -28 63 2 -76 -7 57 -14 -55 26 42 -38 -33 39 20 -38
6532 -38 1 39 -22 -48 19 35 -55 -39 49 21 -55 -28 69 13 -67 -6 58 -11 -47 7 43 -25 -36 20 25 -32 -1 22 -15 -26 18
6563 18 28 -38 -21 48 14 -55 -17 40 10 -62 -7 55 -9 -63 5 50 -17 -37 8 24 -24 -10 14 3 -17 13 10 -23 -16 30 4
6594 4 -41 -17 56 -1 -61 2 54 3 -53 7 52 -3 -47 9 43 1 -23 4 14 -21 6 12 -23 2 4 -7 -29 8 24 -10 -37 5
6626 5 40 -8 -51 11 47 -19 -46 7 34 -5 -32 7 19 -6 -21 4 9 -16 5 -1 -7 0 32 -12 -23 8 19 -14 -42 7 30 -15 -31
6659 -31 12 32 -30 -28 5 12 -21 -12 -9 -6 -4 -2 -7 -5 1 9 -14 -17 13 8 -23 -24 2 7 -14 -25 1 5 -8 -21 5 1 -9 -19 0 -4 -17 -5 1 -22
6699 -22 -7 7 -5 -20 15 12 1 -10 15 19 -1 -10 5 25 7 -12 10 4 7 -8 -17 -1 -7 -5 -11 -8 21 5 -1 -25 11 12 -13 -24 1 18
6735 18 -19 -34 -17 9 -6 -23 2 16 5 -10 -22 6 9 11 -9 1 17 20 -21 -6 34 15 -23 -13 28 11 -14 -29 19 17 -10 -8 5
6768 5 25 -3 -15 2 22 20 -8 -10 13 24 -9 -23 10 33 9 -25 -14 21 12 -20 -8 19 15 -19 -16 25 23 -17 -13 -15 9 -5 -17 -12 12
6803 12 18 -16 -24 15 30 -10 -22 -2 24 -4 -22 11 16 8 -28 -13 13 4 -12 1 25 16 -5 -15 18 9 9 -12 1 15 5 -12 -2 6 14
6838 14 -9 -15 8 20 -4 -24 -2 6 -11 -26 -2 1 -5 -24 -15 -1 -3 -14 -14 -2 -3 -5 -15 -10 -5 -21 -20 -16 -9 0 -1 -16 -17 12 4 1 -5 -1 5 -12 -11 5
6880 5 5 -6 1 11 2 6 19 14 11 4 15 2 -5 13 7 -7 -25 -2 8 -2 -4 13 17 2 -16 10 22 0 -22 8 14 -17 -14 7 10 -1 -1 -7 -18
6919 -18 -1 13 -15 -23 4 24 -12 -27 8 18 -11 -30 20 32 -17 -31 8 37 -24 -16 5 22 -5 -5 4 6 13 21 -2 -8 27 23 -10 -16 16
6954 16 45 -24 -24 32 22 -33 -41 29 23 -19 -32 27 13 -18 -19 14 9 -15 -15 1 -12 -11 9 -21 -30 15 24 -36 -23 32 31 -25 -28 35 31 -47
6990 -47 -33 47 17 -30 -13 40 15 -25 -11 26 -7 -14 12 14 -7 2 10 -13 -17 25 29 -34 -16 53 33 -46 -23 46 6 -43 2 59 8
7023 8 -44 0 31 -20 -30 25 21 -30 -5 22 -4 -34 11 23 -43 -33 25 20 -48 -22 53 19 -54 -6 53 1 -50 11 40 -30 -35 20
7055 20 23 -40 -2 32 -3 -39 2 50 -18 -40 29 49 -43 -34 52 24 -48 -18 63 -2 -45 12 46 -21 -35 30 32 -35 -24 33 -2 -49
7087 -49 11 40 -22 -63 37 27 -56 -32 56 27 -53 -26 64 -4 -66 -7 43 -29 -44 24 37 -42 -16 46 -5 -53 5 47 -32 -54
7117 -54 57 37 -51 -19 66 35 -68 -21 71 26 -57 15 54 -2 -45 31 40 -27 -15 39 4 -42 17 45 -35 -35 52 39 -53 -33
7147 -33 70 22 -69 -15 72 1 -69 6 64 -14 -60 15 43 -51 -42 27 22 -54 -19 35 -7 -48 25 29 -48 -26 50 1 -69 -21 75
7178 75 8 -78 13 76 -4 -73 26 66 -22 -30 32 29 -32 -9 40 1 -43 24 33 -36 -20 43 23 -70 -6 67 2 -72 13 65 -24 -58
7210 -58 18 61 -31 -43 34 29 -39 -22 35 -2 -29 10 33 -20 -19 42 6 -42 -4 43 -3 -64 14 55 -16 -49 29 41 -22 -39 35
7241 35 17 -35 -2 36 12 -28 20 26 -10 -12 32 25 -35 3 44 0 -42 11 46 -17 -39 18 45 -15 -28 25 33 -14 -4 29 4 -31
7273 -31 7 24 -22 -29 31 5 -33 2 35 11 -35 7 51 -8 -46 16 34 -16 -35 22 24 -19 -17 7 5 -17 -2 29 -6 -14 19 8 -22
7306 -22 -3 30 -4 -31 3 38 -4 -28 17 31 -11 -27 17 30 -18 -16 17 15 -15 -2 19 -4 -4 7 8 -4 16 27 6 -24 14 21 -12
7339 -12 -36 10 37 -25 -28 24 37 0 -22 31 33 -13 -12 3 15 -5 6 0 4 11 18 -4 -10 24 27 0 -19 19 32 -19 -18 15 14 -25 -25 17
7375 17 17 0 -8 14 12 -9 4 9 7 11 1 5 -2 6 13 -14 -4 20 26 -13 -11 15 12 -25 -21 13 22 -15 -19 3 12 -10 -8 -7 -4 -5 -10 -3 2 6 -6 -3 2 12
7419 12 16 -11 -12 19 7 -31 -8 21 3 -21 -7 13 8 -6 -9 3 1 -5 -8 -10 10 4 0 -3 -8 11 10 -9 2 15 5 -17 -11 1 -6 -19 -3 15
7457 15 -10 -9 -4 -7 -8 -4 -1 -8 -1 14 0 -20 -7 6 7 -24 -10 2 9 -15 -8 18 -16 -20 -6 15 12 -9 6 13 20 1 -4 -2 -7 8 -2 -12 0
7496 0 13 6 -3 -6 16 8 -15 -10 19 7 -5 -12 15 2 -6 -2 10 7 -9 -1 -5 2 4 -2 -13 2 13 4 -27 6 15 0 -10 -1 17 6 -12 -2 28
7535 28 -9 -15 -11 25 10 -9 -2 -6 13 8 5 7 -8 15 0 -20 1 27 14 -11 10 22 6 -32 8 22 14 -20 -3 28 1 -21 -7 6
7569 6 -3 -6 9 -1 -4 8 -6 -14 -1 17 -3 -26 9 19 -12 -36 -9 27 -5 -32 -4 21 4 -31 -2 16 -5 -8 5 7 -8 2 7 5 2
7604 2 22 15 -10 3 15 -11 -21 19 18 0 -28 4 30 -15 -21 5 22 -13 -11 10 13 -10 4 9 -4 5 18 -4 -28 -4 16 -6 -22 9
7638 9 16 4 -32 4 17 -16 -27 -5 21 -12 -16 7 14 -17 -17 5 0 -10 8 19 -20 -8 13 4 -9 -18 7 -9 -23 2 28 1 -9 14
7672 14 24 -9 -21 7 21 -12 -17 25 9 -9 2 8 -13 -13 10 11 -21 -15 21 0 -32 -2 24 5 -33 -10 16 -5 -23 -2 24 -6 -23
7705 -23 4 11 -6 4 21 -1 3 19 7 -20 -11 17 9 -29 4 39 3 -26 10 41 -4 -27 5 34 2 -26 16 32 -6 -16 18 10 -5
7738 -5 -2 14 -5 -5 29 16 -17 4 21 7 -32 -6 33 -5 -32 -2 34 -21 -41 15 37 -8 -32 5 12 -10 -19 11 18 -11 -2 -5 -14 -8 18
7773 18 1 -25 -6 38 2 -28 9 45 13 -44 10 51 -4 -31 16 41 -20 -21 18 14 -7 -2 14 10 -7 7 15 -10 -16 36 8 -30 16
7806 16 39 -6 -30 14 46 -10 -37 24 27 -15 -30 38 25 -29 -16 31 11 -22 -9 21 -10 -21 16 6 -29 -2 38 -4 -35 4 36
7837 36 3 -26 21 30 -18 -31 31 31 -27 -8 29 6 -22 8 39 -2 -27 25 26 -30 -17 36 6 -27 -2 43 -8 -37 7 37 -16 -39
7869 -39 20 22 -33 -17 22 12 -24 -6 18 -16 -29 19 9 -27 -12 20 11 -29 -5 44 -2 -44 13 35 -20 -37 9 21 -31 -26 21 9
7901 9 -25 -6 30 -10 -21 24 29 -17 -2 41 16 -38 -12 36 0 -46 8 55 -9 -33 15 41 -15 -30 27 27 -21 -14 19 -2 -32 0
7933 0 12 -17 -21 12 1 -39 3 31 -5 -58 4 28 -21 -41 18 28 -30 -37 31 29 -40 -13 12 10 -22 -8 26 -8 -13 20 -2 -18 1
7966 1 37 -2 -27 25 20 -13 -41 20 34 -39 -34 29 17 -39 -14 34 16 -30 -4 25 8 -14 1 7 -25 -16 18 -8 -31 2 23 -14 -30
7999 -30 19 11 -30 -26 19 11 -29 -12 22 13 -19 -5 23 -2 -21 4 4 -17 -5 6 2 -11 2 25 -12 -15 13 22 -26 -5 21 15 -15 -12 16
8034 16 1 -17 -18 17 2 -11 1 13 -11 -6 11 -1 -23 12 20 -12 -15 11 15 -13 -13 16 9 -9 -13 10 1 -15 1 11 5 -17 3 8 0 -2 -1
8071 -1 7 -9 7 7 -16 -11 10 17 -3 -24 13 26 -20 -25 11 12 -14 -11 14 9 -9 -10 8 16 13 1 5 0 1 6 5 4 10 16 -6 -14 25 19 -15 -8 23 13
8113 13 -11 -20 21 13 -18 -10 9 12 -5 -12 -10 -5 5 -15 -17 7 4 8 -11 -6 13 3 -7 -9 21 11 -12 -7 21 17 -14 -7 26 22 -2 -2 6 11 -9 -17
8153 -17 -6 2 -3 4 -8 -2 15 7 -9 -5 9 4 -15 -4 15 3 -19 -1 17 1 -13 -15 19 -2 -9 -10 1 9 -4 -6 3 -3 3 -10 -8 -1 9 2
8191B
$$ Imaginary data points
##PAGE= N=2
##DATA TABLE= (X++(I..I)), XYDATA
0 0 0 0 0 0 0 0 0 0 -8 8 -8 8 -9 16 -16 24 -24 32 -33 40 -48 56 -65 73 -88 97 -113 129 -145 164 -185 209
32 209 -234 262 -292 327 -361 401 -448 496 -547 606 -671 744 -823 914 -1014 1131 -1263 1416
50 1416 -1597 1813 -2079 2413 -2846 3435 -4292 5645 -8122 14135 -57984 -26719 104239 -10877
64 -10877 -94284 -31442 39051 -23883 -53253 5773 39150 -20548 -58657 -36402 9288 31794
76 31794 13165 -49009 -58020 21093 62488 -15774 -57240 25171 62563 -38156 -74141 44572
88 44572 96086 -27235 -96242 7330 83132 12977 -42595 5106 35707 -2857 -14098 22644
100 22644 33056 7311 -12600 -19445 -512 46303 45686 -32177 -59780 28883 79127 -2747 -55521
113 -55521 19682 60287 -20539 -52947 36298 69426 -21884 -65209 7693 51813 8042 -20476
125 -20476 -618 4209 -5817 4377 10499 761 6462 6502 -29016 -30911 38173 58678 -29633 -74978
139 -74978 9998 68465 822 -48770 8019 38587 -20962 -40023 26180 48205 -12793 -42762
151 -42762 -3715 25258 15817 2930 -8076 -14129 6353 23398 -2500 -19070 19580 34191
163 34191 -24355 -45350 30027 66457 -11140 -60271 6325 56669 5567 -33034 9535 33954
175 33954 -8210 -26637 13954 35374 6032 -20081 -13215 9737 28527 18353 -19962 -26583
187 -26583 20895 38897 -13064 -35842 20353 43169 -21151 -47593 22277 55912 -12307 -53285
199 -53285 3545 44454 1695 -32436 -1307 23257 -2241 -23728 -5613 18381 14535 -12227
211 -12227 -30681 -9183 31362 23550 -30936 -39074 18215 35714 -19539 -38334 16802 33768
223 33768 -24786 -43091 18196 43021 -13644 -44565 637 32984 1882 -26607 -6834 17545
235 17545 7267 -15497 -15478 8220 23369 2430 -28513 -15230 28015 25992 -21706 -28550 18032
248 18032 28424 -15685 -24982 19482 28363 -17472 -28832 16638 33842 -5909 -28507 752
260 752 25409 8209 -15298 -9410 11245 14956 -2896 -15246 107 20987 8895 -19587 -12292
273 -12292 21093 18715 -16693 -18396 16358 19777 -14080 -18340 15024 20923 -11804 -21642 7986
286 7986 22939 130 -18853 -6064 13483 10904 -6067 -11671 1345 12245 2340 -12281 -4247
299 -4247 13665 6832 -14557 -9502 14737 12355 -13248 -13666 11981 15202 -9543 -15831 6858 16467
313 16467 -2926 -16295 -2567 13377 6863 -9389 -10120 4352 11016 -232 -10461 -1999 10199
326 10199 3197 -10902 -5028 10945 6048 -12365 -9583 10864 11657 -9237 -13976 6032 15221 -1944
340 -1944 -14933 -2202 13238 5508 -11289 -9160 7239 9975 -4918 -11312 2010 11556 265
353 265 -11345 -1442 12443 3986 -12544 -6605 12062 9301 -11165 -12994 7752 14864 -3963 -15619
367 -15619 12 15554 4672 -12861 -6949 10882 9176 -8355 -10548 5657 10566 -4622 -11996
380 -11996 2398 12722 -253 -13385 -2214 14120 6029 -13154 -9697 10703 12193 -8225 -15103
393 -15103 3323 14714 -343 -14730 -3326 13072 5677 -11302 -7229 9812 8477 -8683 -10283
406 -10283 6627 11011 -5595 -13346 2372 14028 710 -14311 -4313 13515 8144 -10993 -10583
419 -10583 8201 12256 -5035 -12815 2080 12473 123 -11962 -1813 11861 4052 -10891 -5332
432 -5332 11053 8433 -9162 -10266 7706 13016 -4230 -13969 1075 14654 3090 -13132 -5646
445 -5646 11919 8748 -8576 -9034 7290 10657 -4253 -9943 3377 10912 -1086 -10796 -509 11604
459 11604 3779 -10591 -6029 10259 10019 -6874 -11201 4938 13450 -969 -13057 -1543 12673
472 12673 4067 -11435 -5839 10002 7316 -8009 -7638 6974 8829 -4982 -9365 3004 9837 -1087
486 -1087 -11289 -3374 9696 5876 -9198 -10134 5607 11437 -3329 -13102 -239 12020 911
499 911 -13302 -4417 10567 3413 -12236 -7086 8827 6260 -8910 -8855 5224 8081 -4139 -10190
513 -10190 -812 8047 2015 -9832 -8217 5731 9250 -5255 -13367 774 12968 647 -13719
526 -13719 -3169 12021 2630 -12930 -4493 11251 3962 -12126 -6908 9268 7906 -6235 -8653
539 -8653 2151 8049 1719 -6532 -4732 5087 7160 -4383 -10306 2899 13138 -512 -14520 -1557
553 -1557 15223 4180 -13086 -3498 12839 3561 -12151 -3218 12609 5379 -10492 -7117 7098
566 7098 8986 -631 -6660 -3125 5002 7012 -1970 -7946 1991 10681 -1328 -12978 1164 16442
580 16442 1525 -16843 -2747 17085 4674 -14640 -3687 13992 3879 -12392 -3917 11126
592 11126 5945 -6906 -6584 2164 6989 4426 -4101 -8388 1713 11384 667 -12246 -570 13944
606 13944 -28 -16046 814 19357 996 -20351 -3087 19474 5399 -15697 -5372 11598
618 11598 3742 -8833 -2693 6648 3516 -3015 -4962 -2627 5386 9638 -2764 -14459 -1075 15389
632 15389 2242 -15389 -1090 15929 -1935 -19592 2085 22893 949 -22870 -5196 17872
644 17872 6114 -11979 -4774 6224 671 -5137 -897 2445 2365 1580 -5092 -9243 3953 15112
658 15112 -1698 -19227 -2027 18029 386 -19223 685 19687 -3313 -23186 1246 23133
670 23133 1433 -20459 -4667 13361 3653 -7608 -2291 1738 -1144 234 767 -3354 931 7563
684 7563 -3091 -13362 3944 19400 -2128 -22543 38 22726 808 -20752 1129 20079
696 20079 -2465 -18977 4098 20073 -147 -15019 -1260 9513 3276 -31 825 -3917 -2578
709 -2578 7105 4317 -5852 1799 11833 -3742 -16244 6841 24806 -1236 -23946 -162 22334
722 22334 1865 -15711 4020 16106 -4847 -14109 6752 15821 -162 -7680 -179 1620 1452
735 1452 7570 3865 -8370 -3158 10788 2605 -10191 4496 17538 -4561 -20780 5523 25459
748 25459 -393 -21327 860 18166 -1002 -12275 5670 11667 -5524 -8308 6235 7078 -1868
761 -1868 -101 1226 -5381 0 12048 1911 -14553 -1618 16369 771 -16481 2805 18889
774 18889 -4512 -20740 4763 21553 -2786 -19069 641 12913 -1773 -7506 3862 3192 -6582
787 -6582 -2447 4827 -72 -1498 4136 -3209 -12709 2276 17623 -1052 -20813 -2046 17887 -786
801 -786 -17451 3455 17332 -6622 -20206 3994 18272 -1675 -14323 -1193 5941 -1628 -1743
814 -1743 3210 -1334 -4132 1663 -36 -5795 3518 11266 -6003 -18437 3560 20550 -2248 -20794
828 -20794 1136 17824 -3937 -17504 5120 16682 -5842 -16654 3029 12664 -1699 -8599
840 -8599 -527 2037 -572 1384 -442 -5557 439 7203 -3615 -11409 4874 14130 -7096 -18611
854 -18611 5477 19018 -5246 -19221 3415 15592 -5016 -14068 5217 11603 -6308 -11514 3447
867 3447 8479 -1018 -5051 -2602 -1325 2714 5335 -3008 -8557 2684 8961 -5369 -11144 7303
881 7303 13318 -8808 -16404 7102 16359 -5403 -14330 4414 10849 -5491 -9059 5843 8004 -4869
895 -4869 -7366 1319 4238 1841 187 -3568 -4522 3751 7253 -3680 -8159 4759 8630 -6855 -10061
910 -10061 8041 11463 -7937 -12010 6885 11257 -5413 -8946 5023 7102 -4285 -5307 3236
923 3236 3755 -1358 -1786 -904 -827 2970 3968 -3724 -6100 4419 7921 -4289 -8230 4717 8070 -5514
939 -5514 -8103 6025 8171 -5867 -8105 4866 7515 -3047 -5745 1516 3571 -479 -1628 -638
953 -638 -243 1599 1526 -3222 -3341 4547 5460 -4997 -7170 4713 7955 -4203 -7896 3881 7325 -4000
969 -4000 -7171 3746 7316 -2315 -6598 688 5443 1339 -3202 -2527 1116 3334 743 -3844 -1955
984 -1955 4855 3631 -5176 -4712 5938 6486 -5337 -7174 4862 7622 -4125 -7692 3314 7660
998 7660 -2096 -7233 910 6996 1214 -5528 -2757 4070 4194 -2298 -5389 232 5706 1073 -6260
1013 -6260 -2547 6452 3822 -6328 -4721 6356 5888 -5773 -6887 4625 7151 -3787 -7860 1966
1027 1966 7542 -474 -7142 -1018 6702 2915 -5394 -4166 4238 5299 -2984 -6444 1223 6602 -194
1042 -194 -7153 -1200 7349 2726 -6839 -3669 6709 5215 -5580 -6249 4095 6564 -2966 -7221 1031
1057 1031 6858 362 -6391 -1521 6115 3105 -4953 -3866 4262 4713 -3449 -5784 1907 5839 -1121
1072 -1121 -6443 -357 6498 1969 -5716 -2861 5368 4276 -4111 -5116 2666 5215 -1788 -5773 185
1087 185 5420 861 -4947 -1551 4906 2876 -3825 -3293 3311 3925 -2608 -4765 1101 4517 -375 -4754
1103 -4754 -929 4467 2194 -3525 -2727 3023 3530 -2128 -4142 835 3814 -609 -4490 -859 3857
1118 3857 1329 -3754 -2203 3299 3002 -2500 -3640 1410 3668 -841 -4363 -1016 3418 1401 -3437
1133 -3437 -2666 2412 3148 -1590 -3461 735 3567 -26 -3740 -1078 3144 1346 -3348 -2549 2464 2957
1149 2957 -2027 -3609 1199 4117 -137 -4200 -888 4069 1743 -3888 -2928 2976 3339 -2397 -4003
1164 -4003 1364 4183 -388 -4149 -461 4193 1606 -3738 -2484 3372 3482 -2659 -4387 1790 5109
1179 5109 -638 -5361 -246 5829 1735 -5152 -2246 5241 3565 -4011 -3640 3762 4607 -2315 -4414
1194 -4414 1787 5114 -51 -4487 -594 5010 2707 -3697 -3105 3976 5183 -2300 -5469 2013 6960
1209 6960 -154 -6734 -529 7208 2071 -6197 -2260 6228 3426 -4917 -3373 4621 4394 -2977 -4482
1224 -4482 1651 4600 -49 -4374 -1523 3883 2775 -3493 -4136 3009 5354 -2344 -6536 1247 6886
1239 6886 -634 -7437 -605 6712 595 -6881 -1508 6043 1780 -5498 -2623 4175 2993 -2770 -3476
1254 -3476 787 3161 614 -3217 -2394 2753 3676 -2329 -4791 2077 5901 -1451 -6358 1242 6934
1269 6934 -629 -6893 217 6634 324 -5757 -415 5088 865 -3790 -869 2904 1555 -1150 -1814
1284 -1814 -656 1931 2658 -1358 -3935 987 4854 -673 -5230 1030 5919 -1266 -6731 875 6889
1299 6889 -322 -6427 -388 4895 115 -3650 174 2447 -583 -1800 -215 -93 307 1644 -872
1314 -872 -4151 -112 5004 314 -5798 -569 5684 -370 -6517 485 6682 -873 -7258 -64 6105
1329 6105 135 -4879 -308 3120 -157 -1758 234 230 -231 1218 -162 -3224 111 4756 -76 -6085
1345 -6085 88 7222 159 -7607 2 7901 39 -7513 330 7189 -397 -6373 605 5833 315
1360 315 -3750 -311 1960 797 885 133 -2296 -246 3709 182 -4523 1026 6506 -1309 -7998 1476
1376 1476 9543 -392 -9166 117 8064 -728 -7199 1457 6677 -1732 -6354 639 4617 362 -1970
1391 -1970 -734 -1182 -295 2634 371 -3957 -313 4307 -1555 -6481 2103 8086 -2425 -9640 1459
1406 1459 9180 -1468 -8565 1498 7169 -2464 -6849 2179 5739 -1731 -4368 700 2037 -243
1420 -243 360 136 -2310 129 3921 -501 -5158 1298 6520 -1797 -7321 2605 8301 -2755 -8453
1435 -8453 3087 8642 -2491 -7535 2373 6154 -2089 -4090 2679 2954 -2418 -1652 1716 310 -255
1450 -255 1937 -841 -4511 963 6194 -880 -6885 1169 6767 -2407 -7082 3591 7714 -4108 -8510
1465 -8510 2873 7128 -2380 -5386 1909 2661 -2993 -1547 3127 773 -2252 178 293 -2570 747
1480 747 4715 -1369 -6827 741 6851 -1367 -6778 2474 6965 -3349 -7091 3947 7418 -3249
1494 -3249 -6460 2544 4603 -2443 -2862 2372 1352 -2017 201 1684 -993 19 3213 -509 -4382
1509 -4382 1563 5846 -2077 -6822 2424 7240 -2635 -7020 3163 6962 -2847 -5533 3766 5300 -3315
1524 -3315 -4248 2805 3030 -1913 -1327 987 -806 -551 2651 609 -3168 638 4271 -1578 -5026 2909
1540 2909 6294 -3522 -7446 2898 6957 -2778 -5951 3071 4854 -3503 -3993 3840 3719 -2945 -2903 1320
1556 1320 758 -632 1039 -74 -2916 18 3515 -782 -3931 2084 4771 -3141 -5858 3394 6260
1571 6260 -3423 -6359 2885 5255 -3114 -4437 3218 3724 -2893 -2939 2273 2035 -1183 -628 205 -918
1587 -918 531 2262 -1118 -3213 1901 4186 -2259 -4546 3038 5208 -3111 -5123 3504 5243 -3265
1602 -3265 -4779 3172 4454 -2303 -3206 1996 2332 -1232 -1037 827 252 159 798 -1115 -1830 2169 3192
1619 3192 -2503 -4008 2770 4510 -2825 -4484 3097 4308 -3517 -4490 3327 4373 -2807 -3986 1965
1634 1965 3127 -1140 -1968 583 961 -128 -396 -885 -531 1753 1383 -2666 -2429 3142 3343 -3106 -3612
1651 -3612 3296 3786 -3357 -3864 3331 3845 -3125 -3871 2538 3671 -1584 -2874 1049 2424 4 -1446
1667 -1446 -595 797 1340 -122 -2155 -685 2716 1401 -3077 -1867 3554 2567 -3388 -2730 3504 3022
1683 3022 -3234 -3218 2687 2985 -2327 -2952 1595 2720 -707 -2166 42 1794 899 -1051 -1567 338
1699 338 1931 7 -2545 -634 2789 1008 -3069 -1402 3269 1945 -2986 -2116 2714 2220 -2402 -2394
1715 -2394 1712 2142 -1331 -2208 584 1975 161 -1594 -767 1227 1320 -839 -1869 258 2015 -80
1731 -80 -2521 -560 2470 859 -2564 -1363 2293 1628 -1989 -1906 1421 1850 -1109 -2040 338 1725 10
1748 10 -1688 -646 1315 1013 -1045 -1443 611 1649 -309 -1914 -168 1961 551 -1945 -944 1822
1764 1822 1379 -1493 -1607 1181 1925 -643 -1962 217 2019 381 -1797 -746 1735 1337 -1258 -1520
1780 -1520 1066 1936 -527 -2015 134 2156 424 -2020 -801 1995 1426 -1554 -1658 1352 2144 -759
1796 -759 -2225 376 2434 203 -2392 -648 2351 1203 -2034 -1499 1936 2073 -1333 -2195 1026 2538
1812 2538 -375 -2591 -189 2572 822 -2385 -1342 2175 1967 -1644 -2248 1306 2688 -627 -2753
1827 -2753 155 2843 397 -2809 -976 2575 1422 -2303 -1873 1955 2288 -1426 -2538 885 2702
1842 2702 -337 -2857 -404 2636 842 -2609 -1557 2161 1871 -1859 -2314 1329 2533 -839 -2719
1857 -2719 201 2645 234 -2693 -956 2309 1342 -2119 -1887 1656 2271 -1167 -2490 695 2677 -144
1873 -144 -2679 -298 2602 734 -2431 -1129 2153 1503 -1738 -1686 1397 1984 -740 -1925 322 2032
1889 2032 325 -1896 -876 1715 1416 -1444 -1878 1063 2190 -677 -2339 370 2422 -32 -2376
1904 -2376 -266 2183 483 -2004 -819 1458 789 -1163 -993 568 921 -113 -927 -444 861 963
1920 963 -741 -1463 511 1731 -444 -2095 191 2160 -121 -2223 0 2200 268 -1824 -236
1935 -236 1578 343 -1087 -341 566 344 -12 -345 -631 353 1383 -52 -1734 56 2260 208 -2375
1952 -2375 -120 2621 129 -2786 -287 2651 371 -2311 -332 1914 352 -1280 -111 885 172
1967 172 -269 -320 -598 243 1337 -264 -2243 -52 2708 167 -3057 -111 3380 54 -3677 -163
1983 -163 3650 190 -3605 -533 2852 335 -2338 -295 1636 219 -943 -310 19 319 875 -456
1999 -456 -2017 139 2556 -354 -3387 199 3706 -453 -4208 406 4311 -501 -4382 300 3878
2014 3878 -585 -3712 273 2850 -395 -2315 -30 1121 106 -73 -258 -1055 206 1754 -594 -2670
2030 -2670 836 3354 -1267 -4233 1221 4600 -1127 -4501 1295 4281 -1489 -3918 1770 3762 -1551
2045 -1551 -3241 1151 2380 -615 -1023 631 68 -371 949 311 -1381 562 2381 -1079 -3181 1623
2061 1623 4107 -1525 -4250 1729 4223 -1833 -3734 2421 3717 -2377 -3302 2250 2773 -1730 -1620 1545
2077 1545 577 -1333 418 1144 -1060 -509 1868 -74 -2580 724 3317 -1092 -3599 1550 3694 -1985
2093 -1985 -3577 2443 3490 -2559 -3065 2569 2467 -2402 -1514 2368 719 -2155 43 1754 -750 -994
2109 -994 1740 366 -2694 37 3360 -274 -3480 802 3399 -1572 -3433 2215 3537 -2357 -3377
2124 -3377 2155 2589 -2051 -1510 2172 492 -2462 -3 2127 -572 -1458 1339 581 -2507 -158 3385
2140 3385 -87 -3830 257 3668 -975 -3635 1663 3659 -2170 -3767 2061 3320 -1809 -2372 1735
2155 1735 1264 -1890 -411 1820 -271 -1410 1036 737 -2015 -166 2964 -175 -3532 577 3818
2170 3818 -1072 -3972 1582 4046 -1962 -4024 2034 3586 -2103 -2973 2122 2288 -2043 -1628 1705 848
2186 848 -1169 89 541 -1239 -190 2086 -170 -2605 726 2996 -1448 -3419 2138 3978 -2272
2201 -2272 -4164 2184 3882 -2092 -3142 2386 2675 -2455 -2212 2352 1977 -1480 -1010 900 24 -300
2217 -300 1142 203 -1556 407 2057 -964 -2235 2022 3052 -2343 -3392 2585 3629 -2364 -3163 2541
2233 2541 2776 -2629 -2315 2699 2113 -2222 -1544 1606 776 -1024 83 547 -838 -194 1190 -548 -1700
2250 -1700 1148 2041 -1832 -2536 2056 2498 -2501 -2621 2545 2263 -2899 -2268 2623 1797 -2550 -1534 1976
2267 1976 764 -1793 -417 1169 -221 -801 406 -141 -1136 591 1473 -1234 -2067 1299 1966 -1767
2283 -1767 -2025 1944 1743 -2457 -1945 2276 1651 -2197 -1486 1656 699 -1634 -341 1289 -167 -1129 226
2300 226 364 -757 135 1067 -797 -1691 904 1768 -1256 -1888 1396 1666 -1810 -1742 1870 1639 -1850 -1533
2318 -1533 1506 1091 -1255 -645 985 216 -725 146 320 -450 192 878 -578 -1246 937 1537 -1141 -1629
2336 -1629 1422 1753 -1523 -1686 1705 1756 -1526 -1514 1491 1389 -1190 -1043 992 865 -544 -487 220 249
2354 249 384 334 -581 -501 1078 970 -1184 -1040 1581 1394 -1608 -1427 1812 1771 -1475 -1527 1526 1668 -1085
2373 -1085 -1259 1111 1339 -566 -970 357 925 317 -357 -445 275 1040 320 -1002 -272 1537 722 -1538
2391 -1538 -790 1824 1170 -1663 -1187 1710 1443 -1356 -1270 1287 1395 -872 -1246 591 1156 -186 -1013
2408 -1013 -247 734 562 -519 -894 271 1142 -52 -1402 -226 1488 359 -1650 -679 1542 759 -1531
2425 -1531 -979 1336 1059 -1136 -1160 821 1150 -521 -1146 150 1019 130 -917 -491 746 777 -521 -987
2443 -987 347 1197 -81 -1278 -166 1288 351 -1280 -562 1166 739 -1021 -888 800 971 -573 -1032
2460 -1032 268 960 -83 -1006 -281 820 392 -811 -721 543 789 -455 -1021 118 948 -67 -1154
2477 -1154 -350 914 372 -980 -739 688 746 -637 -982 300 925 -200 -1067 -173 881 241 -958
2494 -958 -562 729 638 -606 -777 434 889 -184 -898 -33 903 239 -846 -477 736 677 -553 -754
2512 -754 491 992 -144 -909 115 1071 229 -917 -326 900 575 -680 -632 621 867 -249 -737 220
2530 220 939 188 -770 -300 781 558 -639 -694 541 884 -280 -869 241 1047 96 -903 -159 935
2548 935 401 -822 -569 636 665 -508 -832 275 886 -43 -867 -144 869 352 -862 -628 625 616 -680
2567 -680 -933 296 814 -299 -1010 -65 816 132 -890 -494 611 486 -677 -910 232 765 -304 -1101
2585 -1101 -147 933 139 -1125 -494 883 518 -925 -806 593 713 -574 -919 191 758 -95 -855
2602 -855 -302 670 485 -584 -751 389 917 -248 -1111 39 1196 80 -1310 -310 1269 432 -1215
2619 -1215 -570 1060 636 -875 -642 698 705 -419 -729 59 650 215 -639 -635 410 816 -392 -1118 263
2638 263 1324 -178 -1550 14 1625 96 -1651 -276 1478 213 -1443 -348 1191 350 -949
2653 -949 -421 647 525 -125 -396 -169 428 592 -343 -880 403 1287 -318 -1493 379 1851 -99 -1689
2671 -1689 313 1925 -59 -1606 308 1716 -40 -1309 138 1117 81 -474 182 348 97 324
2687 324 121 -383 293 1098 -122 -1290 323 1703 -196 -1699 438 1871 -396 -1694 749 1909
2703 1909 -490 -1534 612 1305 -494 -809 575 388 -627 -68 510 -292 -242 830 123 -1253 -8
2720 -8 1599 -95 -1790 148 1643 -607 -1847 679 1698 -923 -1696 814 1243 -960 -916 879 261
2737 261 -1180 -143 804 -523 -880 725 392 -1471 -449 1643 117 -2013 -105 1852 -438 -2110
2753 -2110 471 1874 -843 -1921 718 1377 -923 -967 1004 438 -1154 -78 1002 -464 -857 1001
2769 1001 653 -1569 -550 1986 468 -2104 -106 2284 -177 -2302 592 2482 -631 -2248 767
2784 767 1914 -766 -1260 1084 902 -1093 -391 1068 0 -690 736 474 -1425 -300 2031 280
2800 280 -2218 40 2400 -449 -2570 839 2745 -1021 -2746 988 2353 -1058 -1848 1204 1355 -1328
2816 -1328 -936 1225 468 -890 161 533 -898 -312 1512 132 -1855 250 2169 -609 -2336 1126
2832 1126 2660 -1298 -2687 1437 2539 -1476 -2101 1704 1809 -1677 -1355 1645 1014 -1225 -299 975
2848 975 -340 -725 906 457 -1260 -21 1545 -548 -1912 1025 2250 -1298 -2372 1438 2138 -1770
2864 -1770 -1934 1945 1573 -2250 -1515 2007 1032 -1837 -642 1354 -161 -1288 509 894 -987 -634
2880 -634 1003 -201 -1507 603 1692 -1154 -2034 1185 1762 -1555 -1589 1782 1202 -2173 -1131 2094
2896 2094 786 -1956 -421 1624 -205 -1487 602 1213 -951 -912 1106 370 -1356 138 1598 -552
2912 -552 -1749 845 1689 -1089 -1462 1412 1229 -1650 -1023 1738 782 -1576 -305 1499 -112 -1278
2928 -1278 638 1220 -841 -821 1143 431 -1409 17 1759 -228 -1790 553 1839 -700 -1489 1191
2944 1191 1496 -1287 -1237 1415 1044 -1248 -591 1167 168 -982 368 1012 -474 -543 893 294 -1052
2961 -1052 262 1507 -481 -1706 674 1752 -826 -1585 1189 1608 -1249 -1379 1473 1416 -1176 -1003
2977 -1003 1052 640 -906 -253 763 -6 -442 335 193 -479 376 976 -523 -1094 857 1282 -1037 -1313
2995 -1313 1282 1312 -1444 -1280 1579 1349 -1384 -1081 1374 960 -1128 -676 955 451 -729 -332 304
3012 304 8 40 248 -340 -446 634 610 -899 -682 1158 703 -1470 -917 1434 783 -1566 -853 1420
3030 1420 642 -1427 -600 1266 469 -1123 -494 672 229 -486 -213 27 -90 102 50 -489 -192 740 216
3049 216 -1032 -353 1135 344 -1295 -453 1182 296 -1249 -298 1161 246 -1051 -227 849 154 -657
3066 -657 -118 380 -28 -234 -6 -79 -113 208 37 -505 -177 583 108 -786 -216 747 75 -933 -223 747
3086 747 61 -843 -188 572 0 -591 -111 263 -111 -278 12 -8 -185 45 120 -309 -263 295 193 -466 -282
3107 -282 408 177 -531 -239 462 188 -452 -194 370 171 -240 -107 161 87 -26 -32 -82 -9 249 114 -292 -103
3129 -103 489 282 -420 -246 535 385 -434 -358 459 461 -333 -426 271 497 -94 -364 57 435 163 -274 -191 277
3151 277 346 -177 -430 122 551 16 -524 -22 650 232 -557 -223 623 406 -510 -449 483 553 -330 -574 248
3172 248 674 -24 -580 -9 660 243 -543 -317 502 462 -395 -536 299 617 -162 -640 59 676 102 -633
3192 -633 -203 607 335 -554 -463 431 515 -370 -633 228 665 -126 -717 -30 671 123 -677 -288 565 356 -525
3213 -525 -500 360 510 -271 -596 85 561 32 -579 -182 521 273 -481 -413 380 471 -292 -533 221 578 -121
3234 -121 -591 11 568 58 -540 -172 479 249 -383 -308 313 367 -212 -408 75 416 26 -430 -148 370 226
3255 226 -327 -313 283 387 -201 -395 150 424 -52 -406 -29 359 79 -321 -144 265 209 -166 -212 150 294
3276 294 -1 -239 -19 275 118 -231 -139 244 219 -149 -216 152 298 -7 -210 11 248 122 -171 -131 165
3297 165 221 -76 -238 32 310 75 -246 -93 260 162 -227 -187 189 187 -135 -244 37 198 0 -197 -78 144
3319 144 141 -119 -214 86 277 -51 -377 -43 375 52 -431 -142 392 147 -401 -190 352 219 -300 -247 175
3340 175 227 -88 -248 -69 151 129 -179 -281 116 368 -108 -519 4 547 18 -622 -82 577 46 -634 -128
3361 -128 568 107 -558 -206 378 168 -273 -167 109 116 -28 -186 -161 142 304 -176 -529 102 636 -68 -698
3382 -698 59 761 -63 -787 91 854 -13 -761 11 687 54 -475 54 416 17 -186 46 133 134 203 -42
3403 -42 -319 143 598 -31 -587 182 774 -159 -797 322 986 -183 -863 283 884 -184 -648 321 600
3422 600 -243 -400 260 281 -95 32 98 -221 -21 479 41 -547 119 712 -231 -819 345 952 -363 -939
3442 -939 399 873 -433 -714 554 638 -579 -522 519 347 -411 -77 327 -185 -282 395 237 -514 -67
3461 -67 651 -127 -821 290 964 -361 -1017 401 914 -522 -799 632 669 -750 -579 704 399 -645
3479 -645 -156 519 -184 -547 366 446 -530 -302 640 58 -840 145 979 -273 -1044 358 951 -528 -852
3498 -852 688 742 -817 -635 808 449 -730 -170 670 -150 -655 384 554 -562 -415 701 137 -929
3516 -929 54 1080 -208 -1152 302 1042 -497 -936 665 800 -857 -754 824 510 -793 -241 700
3533 700 -157 -752 349 638 -568 -501 677 189 -954 15 1136 -176 -1253 280 1167 -481 -1055
3550 -1055 703 953 -875 -869 918 729 -820 -378 830 95 -737 265 754 -390 -514 632 301 -796
3568 -796 21 1132 -122 -1192 343 1225 -458 -1074 756 1077 -873 -952 969 833 -896 -535 885
3585 885 242 -833 28 754 -246 -573 437 279 -713 -59 925 -153 -1089 294 1060 -553 -1049 760
3603 760 1001 -986 -1001 999 842 -1007 -640 928 320 -967 -124 866 -70 -688 248 408 -488 -141 751
3622 751 -44 -897 217 899 -459 -887 734 898 -938 -901 1029 817 -1042 -635 1030 388 -1041 -209
3640 -209 977 7 -866 100 570 -338 -353 512 104 -713 45 711 -328 -757 550 684 -844 -772 892
3659 892 626 -1013 -544 972 284 -1069 -188 962 8 -920 63 608 -333 -483 397 221 -586 -82 557
3678 557 -183 -596 385 575 -639 -614 712 504 -831 -440 836 227 -901 -117 898 9 -804 98
3696 98 647 -250 -468 383 306 -494 -168 532 -13 -504 235 548 -419 -518 563 501 -595 -380 685 264
3716 264 -712 -123 756 72 -638 83 588 -136 -382 334 328 -357 -132 473 42 -420 197 496 -297 -452 475
3737 475 507 -465 -383 578 350 -546 -214 601 181 -499 -61 440 -6 -269 163 219 -184 -51 287 -26 -285
3758 -285 229 377 -279 -347 440 411 -438 -324 546 333 -501 -242 575 266 -448 -167 434 168 -276 -37 220
3779 220 38 -58 49 -11 -36 207 124 -261 -132 407 197 -421 -166 519 203 -523 -186 548 207 -516 -188
3800 -188 472 191 -394 -166 286 136 -211 -148 75 105 -7 -144 -172 47 204 -101 -366 17 372 -40 -483
3821 -483 -22 445 -10 -524 -102 428 58 -457 -152 348 123 -310 -175 204 157 -133 -183 48 189 32 -196
3842 -196 -122 167 185 -157 -236 162 308 -111 -302 111 362 -42 -328 25 338 31 -290 -48 274 108 -201
3863 -201 -124 182 153 -100 -161 45 178 -17 -203 -74 139 64 -176 -143 117 117 -131 -167 70 134 -79 -188 -12
3886 -12 136 -19 -179 -52 106 38 -121 -86 64 92 -46 -91 -1 100 6 -87 -42 65 56 -30 -41 27 66 41 -34 -28
3912 -28 63 76 9 -53 24 101 42 -53 -7 93 71 -33 -36 72 90 -21 -58 23 111 34 -63 -40 91 103 -51 -103 56
3939 56 160 -26 -161 -6 185 28 -195 -70 197 118 -170 -121 163 164 -97 -182 74 205 -24 -200 -20 194
3961 194 63 -174 -112 172 164 -134 -193 106 230 -84 -260 17 265 -3 -295 -71 273 111 -274 -163 233
3982 233 203 -214 -256 154 255 -110 -297 19 267 15 -285 -88 271 149 -206 -196 185 247 -123 -262 88
4003 88 267 -50 -295 -18 313 92 -263 -101 294 199 -219 -181 220 237 -170 -253 134 281 -50 -242 40 288
4025 288 56 -197 -61 216 139 -155 -167 110 202 -67 -242 -8 256 49 -220 -73 239 114 -253 -162 216
4046 216 155 -225 -204 138 145 -151 -153 98 150 -67 -138 11 101 30 -64 -82 5 84 -5 -114 -32 136 54 -181 -89 182
4072 182 110 -167 -103 153 59 -150 -51 152 33 -147 -42 106 3 -72 53 55 -90 -37 106 18 -117 22 115
4095 115 -65 -135 84 156 -104 -157 75 93 -102 -72 117 34 -124 -28 78 -42 -55 104 12 -181 -37 200 16
4118 16 -232 7 237 -46 -278 76 312 -53 -288 53 220 -93 -183 84 124 -104 -120 62 46 -34 48 -21 -160
4141 -160 -7 185 -58 -263 57 258 -172 -370 148 385 -189 -419 165 371 -183 -329 186 283 -210 -279 133
4162 133 181 -112 -91 53 -25 -41 115 26 -125 74 212 -139 -273 227 391 -215 -366 263 393 -256 -313 382
4184 382 397 -322 -328 350 330 -236 -173 242 127 -158 0 190 9 -17 114 -36 -158 170 305 -180 -307 247
4206 247 317 -298 -287 405 314 -434 -306 444 272 -382 -155 371 82 -362 -15 324 -8 -212 77 99 -155
4227 -155 19 251 -61 -269 150 280 -228 -247 367 267 -425 -252 444 238 -426 -137 433 49 -450 23
4247 23 431 -51 -339 119 249 -195 -129 303 89 -318 7 310 -125 -284 247 297 -335 -313 374 237 -387
4268 -387 -168 411 41 -467 13 450 -66 -374 132 265 -243 -185 321 127 -388 -51 376 -56 -381 190
4288 190 387 -275 -369 330 341 -327 -197 366 109 -398 -14 428 -19 -337 122 256 -230 -180 327 121 -374
4309 -374 -37 395 -75 -381 197 404 -315 -410 333 376 -361 -287 384 194 -416 -96 435 49 -367 31 275
4330 275 -139 -191 242 128 -327 -51 339 -58 -353 195 404 -282 -394 359 378 -383 -297 431 224 -466 -157
4351 -157 485 125 -418 -25 358 -39 -251 175 210 -191 -76 248 -3 -266 161 310 -252 -317 331 319 -382
4372 -382 -259 414 204 -466 -135 494 108 -443 -52 374 -41 -306 105 239 -170 -170 177 51 -193 72 228
4393 228 -173 -240 260 221 -330 -179 378 131 -434 -108 445 52 -452 -18 395 -44 -346 86 274 -140 -212
4414 -212 142 110 -177 -18 180 -96 -193 162 192 -218 -160 293 109 -353 -95 371 19 -404 -20 339 -55
4435 -55 -340 75 284 -128 -235 112 148 -154 -78 137 -42 -172 87 141 -188 -128 214 101 -248 -43 294 36
4457 36 -296 3 295 -46 -266 77 222 -94 -192 119 157 -119 -63 126 27 -127 45 96 -98 -90 137 42 -201
4480 -201 -45 212 15 -231 6 227 -26 -221 44 189 -74 -173 59 115 -92 -76 85 18 -95 19 88 -72
4502 -72 -81 90 62 -140 -45 148 28 -167 2 169 13 -144 20 166 -16 -112 49 119 -19 -55 45 37 -23 22
4526 22 45 -33 -3 95 29 -93 -7 135 13 -138 3 133 3 -142 -12 112 4 -109 -21 93 1 -65 -32 24
4550 24 20 -7 -37 -28 28 40 -37 -80 34 83 -38 -105 16 112 -28 -127 -5 123 6 -114 -33 110 31 -79 -55 62
4576 62 62 -46 -65 32 83 22 -80 -31 96 49 -69 -81 64 90 -60 -104 48 129 -20 -120 -1 120 30 -107 -48
4601 -48 100 49 -94 -94 42 85 -64 -112 23 102 -5 -119 -23 103 24 -97 -56 78 57 -87 -83 44 96 -29 -107
4626 -107 7 109 30 -101 -31 107 52 -89 -77 75 81 -67 -80 49 101 -25 -109 1 103 13 -86 -43 70 41
4650 41 -68 -67 44 72 -39 -59 18 84 17 -75 -15 65 30 -79 -38 48 38 -36 -67 12 65 -8 -72 5 72 7 -66 -12 59
4679 59 28 -49 -23 40 41 -4 -23 21 43 2 -22 -15 39 31 4 -34 10 46 8 -44 -13 56 24 -52 -21 44 15 -49 -20 25 15 -39
4711 -39 -14 6 -9 -16 5 -14 -24 13 25 -35 -60 27 55 -49 -74 49 59 -60 -82 51 63 -48 -61 36 36 -26 -17 17 14 2
4741 2 12 -16 -27 36 67 -51 -74 70 88 -79 -90 99 114 -105 -85 125 125 -82 -97 83 83 -67 -42 44 50 -25 -27 6
4769 6 5 35 32 -61 -61 82 61 -104 -81 126 76 -159 -122 154 113 -169 -110 153 82 -159 -70 142 71 -112 -59 75 35
4796 35 -30 6 -4 1 41 40 -73 -46 118 61 -153 -74 197 94 -194 -78 203 80 -193 -36 223 54 -184 -21
4820 -21 171 25 -96 32 91 -30 -40 58 8 -25 61 63 -101 -47 162 66 -182 -53 204 39 -211 -9 243 -2
4844 -2 -238 5 206 -18 -151 64 134 -78 -105 89 77 -65 -7 80 -55 -88 100 80 -129 -57 143 20 -193
4867 -193 2 208 -25 -217 21 190 -66 -179 93 143 -134 -148 122 89 -134 -59 118 -35 -141 50 122 -88
4889 -88 -125 96 69 -139 -53 173 25 -194 -9 180 -21 -141 83 130 -126 -124 125 82 -146 -32 146 -22 -171
4912 -171 72 189 -83 -145 121 135 -151 -98 186 79 -206 -54 188 33 -149 31 141 -58 -123 93 93 -108
4934 -108 -38 109 -31 -170 46 167 -106 -178 105 130 -181 -117 212 82 -242 -115 205 56 -206 -20 175
4955 175 -29 -175 34 145 -54 -89 61 24 -112 33 116 -78 -134 100 101 -163 -94 223 81 -242 -93 255
4977 255 69 -246 -31 224 -15 -234 25 207 -31 -161 36 93 -81 -53 98 8 -92 20 56 -106 -42 164
4999 164 45 -217 -31 216 12 -239 14 237 -52 -258 61 238 -56 -215 77 163 -89 -105 120 86 -112
5020 -112 -36 81 -20 -52 86 62 -124 -55 164 6 -160 31 203 -52 -219 76 225 -89 -202 96 165 -139
5042 -139 -156 130 102 -150 -85 121 28 -112 20 94 -75 -80 84 56 -114 -22 142 -24 -172 44 169 -62 -169
5065 -169 72 130 -118 -109 143 104 -144 -81 148 23 -131 11 123 -46 -112 76 90 -89 -53 125 27 -134 10
5088 10 161 -24 -136 66 130 -70 -86 106 82 -110 -41 131 10 -122 26 105 -68 -122 80 102 -104 -81 115
5111 115 44 -149 -31 155 23 -147 11 132 -34 -106 58 93 -65 -81 62 32 -66 5 74 -44 -74 72 67 -110
5135 -110 -57 131 26 -152 -15 169 -1 -179 -12 159 -18 -151 29 135 -47 -119 35 72 -41 -36 36 9
5157 9 -35 24 22 -48 5 90 -7 -111 17 126 -42 -149 34 141 -54 -141 63 142 -48 -123 63 116 -39 -80 32
5182 32 63 -18 -15 14 -1 17 26 -16 -37 52 72 -40 -90 62 92 -58 -89 72 109 -72 -107 72 102 -70 -90 53 63
5209 63 -39 -58 28 34 -31 -34 -6 -9 12 13 -42 -38 37 26 -67 -47 74 50 -76 -72 68 52 -67 -57 52 42 -59 -46 56
5238 56 33 -24 -32 23 18 -10 -4 -3 1 22 10 -41 -10 46 14 -43 -9 66 27 -38 -14 48 24 -34 -21 34 23 -20 -14 13 0 -12 -2
5271 -2 12 -14 7 11 -5 -23 0 -1 -22 -13 13 8 -28 -27 6 1 -14 -25 -4 12 -7 -15 3 2 21 -1 -19 6 31 11 -20 -11 25 11 -17
5306 -17 -26 28 29 -6 -26 0 13 -3 -35 -11 34 22 -29 -19 28 31 -24 -40 17 28 -17 -45 5 38 0 -41 -13 24 23 -39 -39 22 34
5339 34 -13 -51 1 40 -6 -54 -23 41 21 -44 -25 34 43 -25 -35 25 45 -4 -36 7 49 12 -37 -22 55 24 -40 -40 24 39 -16
5370 -16 -43 20 52 -13 -68 -2 48 9 -40 -19 32 30 -30 -43 17 32 -18 -54 -9 44 8 -54 -29 46 25 -41 -42 51 31 -36 -44 27
5402 27 36 -15 -26 -7 29 15 -24 -15 29 27 -7 -37 23 57 13 -41 12 59 14 -49 -4 75 28 -43 -21 51 32 -34 -16 33 27 -9
5434 -9 -10 7 7 26 -17 -48 -22 36 2 -61 -18 49 -2 -56 -12 67 3 -74 -1 49 2 -61 10 33 -12 -31 5 6 -21 1 9 -51 -32
5467 -32 34 20 -62 -30 60 1 -69 -1 81 9 -86 9 74 -3 -60 18 44 -34 -47 39 18 -38 3 42 -14 -31 52 50 -76 -23
5497 -23 67 11 -90 -21 96 -1 -101 0 97 -23 -87 31 65 -40 -49 52 31 -69 2 64 -32 -68 55 68 -58
5522 -58 -60 86 39 -98 -14 122 6 -121 6 110 -8 -96 54 90 -47 -69 62 47 -67 -2 68 -26 -75 56
5546 56 70 -74 -59 103 52 -113 -19 141 7 -147 -8 133 -22 -123 58 99 -73 -87 71 42 -72 -36 71
5569 71 -27 -85 52 83 -80 -75 103 27 -132 -25 143 13 -161 2 147 -39 -138 58 131 -72 -114 81 88 -74
5593 -74 -45 85 1 -85 34 90 -53 -60 81 27 -127 -22 151 5 -161 12 170 -45 -151 66 145 -90 -147
5616 -147 97 111 -88 -63 115 40 -98 14 109 -28 -77 77 51 -98 -14 133 10 -141 41 138 -49 -148 73
5639 73 141 -117 -137 119 112 -109 -79 123 41 -119 -11 132 -4 -85 48 73 -72 -31 101 18 -126 8 138 -22
5663 -22 -127 76 138 -100 -119 117 117 -124 -85 134 41 -135 -29 122 -1 -127 36 86 -76 -67 99 49 -109 -23
5687 -23 121 1 -120 59 125 -76 -106 101 99 -97 -54 115 30 -130 -13 134 -3 -103 41 101 -66 -71 102
5710 102 60 -111 -33 131 11 -107 37 122 -51 -128 66 113 -85 -72 91 46 -102 -27 103 -2 -93 21 81
5733 81 -52 -61 83 52 -119 -44 110 13 -129 10 119 -45 -143 52 108 -64 -115 77 69 -95 -44 90 23 -87
5757 -87 -5 74 -15 -46 50 31 -68 -34 96 2 -103 24 114 -67 -123 62 120 -85 -111 80 95 -91 -73 87 51 -89
5783 -89 -28 61 8 -54 11 32 -33 -28 65 6 -60 46 78 -43 -79 77 87 -83 -85 91 73 -98 -60 109 61 -99 -30
5810 -30 87 30 -73 -15 74 1 -44 21 20 -33 3 40 -31 -45 54 53 -65 -59 75 52 -85 -51 84 43 -111 -46 94 19
5838 19 -82 -10 64 -11 -65 7 47 -17 -45 23 6 -49 18 35 -36 -31 57 39 -61 -31 66 24 -78 -17 82 7 -77 -9 54
5867 54 -14 -62 11 41 -18 -31 35 16 -25 -2 30 -7 -28 12 29 -31 -21 39 17 -38 -17 45 3 -47 4 47 -12 -39 14 37
5897 37 -25 -26 20 7 -38 -4 36 -17 -35 28 50 -14 -33 29 35 -34 -25 43 33 -15 -10 40 21 -16 5 24 6 3 14 6 -17 18 27 -18
5931 -18 -11 41 39 -30 -30 51 29 -34 -27 35 26 -40 -34 25 30 -32 -34 20 19 0 -20 -2 5 31 -2 -38 2 32 0 -33 -13 51 18 -56 -20
5966 -20 49 21 -49 -23 38 29 -39 -25 29 37 -22 -30 16 42 11 -15 -1 30 21 -22 -21 32 41 -11 -30 27 50 -9 -40 3 37 28 -40 -12
6000 -12 26 10 -34 -27 23 21 -28 -36 -7 25 -11 -40 -5 34 21 -32 -12 29 21 -30 -24 26 30 -16 -28 28 32 7 -23 -6 25 9 -24 -18
6034 -18 24 32 -16 -30 10 23 -16 -30 -7 20 7 -20 -19 22 -1 -27 -11 12 12 -15 -13 -3 17 -19 -9 0 7 8 -21 -24 3 6 -15 -23 -2
6069 -2 11 -7 -15 4 3 -10 -11 5 -5 13 -4 4 -4 8 9 7 -1 6 17 -6 -2 3 9 3 13 11 4 17 -2 -5 9 -1 7 -6 -10 10 2 -21 -14 7 19
6110 19 -14 -20 11 24 -5 -12 6 2 5 -22 -11 6 6 -2 -14 5 17 11 -16 -3 24 17 -32 -15 34 30 -25 -17 33 16 -31 -22 20 7 -13 -16
6146 -16 17 12 4 -11 -2 21 34 0 -24 11 36 -2 -33 -11 47 7 -57 -10 30 7 -57 -19 37 4 -43 -11 30 4 -20 -5 6 -4
6178 -4 -1 -4 -21 -7 14 -9 -53 5 45 -10 -68 12 56 -17 -67 12 57 -3 -55 29 43 -13 -32 8 21 -15 -5 5 2 -8 22 -6
6210 -6 -29 8 38 -6 -53 28 61 -9 -52 28 67 -28 -59 34 49 -37 -43 47 28 -39 -19 29 4 -37 13 34 -27 -10 31 -5 -67
6241 -67 -3 58 -33 -67 29 62 -51 -65 62 43 -56 -41 73 20 -59 -3 69 -10 -43 21 46 -38 -25 52 16 -56 13 78 -2
6270 -2 -63 41 74 -41 -61 63 67 -58 -45 57 25 -74 -3 65 -7 -56 22 47 -49 -22 67 19 -78 -5 86 2 -82 17 77
6299 77 -47 -83 50 64 -65 -53 74 25 -75 -7 73 -17 -59 28 57 -38 -32 76 24 -87 -6 97 -14 -81 29 97
6325 97 -60 -98 73 79 -60 -53 80 38 -83 -8 82 -3 -78 21 47 -58 -37 73 15 -98 -8 88 -18 -95 32 107
6351 107 -51 -98 77 96 -79 -79 78 59 -85 -29 89 8 -86 4 64 -44 -40 61 29 -72 -13 90 -10 -80 41
6376 41 89 -62 -100 87 96 -79 -64 100 47 -103 -31 109 22 -87 16 86 -26 -69 38 45 -70 -30 62 -4 -83 22
6402 22 71 -73 -93 58 73 -100 -69 93 43 -114 -22 117 15 -122 2 85 -40 -71 43 55 -55 -24 69 14
6426 14 -63 33 66 -51 -74 66 73 -77 -53 99 44 -102 -18 105 14 -106 6 89 -27 -74 39 70 -54 -48 59
6451 59 9 -66 10 78 -30 -71 37 66 -72 -68 87 35 -88 -30 84 1 -103 -8 80 -25 -71 21 48 -57 -40 55
6477 55 20 -70 1 65 -27 -68 34 66 -57 -53 63 38 -73 -27 82 9 -91 -3 79 -13 -66 23 50 -44 -53 45 33 -56
6505 -56 -12 65 -17 -64 43 54 -37 -31 56 45 -73 -11 84 7 -76 -12 78 0 -70 6 55 -24 -29 31 19 -35 1 43 -8 -43
6535 -43 26 51 -43 -50 56 33 -61 -24 57 11 -61 -14 70 1 -55 8 63 -8 -50 25 37 -35 -21 21 -1 -43 2 35 -39 -34 27
6566 27 21 -55 -13 58 16 -64 -15 59 -6 -56 6 50 -7 -56 11 30 -12 -21 3 3 -21 4 15 -8 -4 36 7 -39 3 58 2 -47
6598 -47 -2 51 -3 -53 4 46 -18 -50 -3 32 -7 -35 5 15 0 -13 3 -8 -6 14 6 -27 -7 29 -14 -46 -2 28 -4 -43 10
6629 10 48 -12 -35 3 44 -10 -32 6 17 -13 -21 -10 0 -10 -8 -6 -5 5 17 -14 -23 11 31 -4 -26 6 36 -10 -27 14 31 -15 -23
6662 -23 4 17 -21 -18 9 1 -17 -6 -8 -3 4 -2 5 -1 2 12 -14 -20 11 15 -12 -11 5 9 -12 -6 22 23 0 4 16 5 3 2 14 5 9 10 12 -6 1 25
6704 25 -12 -6 11 18 10 -11 -2 19 -3 4 2 20 6 -5 7 5 7 -2 1 -5 17 12 -5 -7 16 19 2 -15 13 24 -6 -15 3 10 -6 -19 -2 8
6742 8 -2 7 0 11 19 -5 -13 -3 26 16 -25 3 22 6 -19 -14 19 17 -12 -25 16 10 -12 -19 5 26 -16 -15 -3 19 18 -7 -21 10 7 -9
6778 -9 -32 1 22 -8 -44 -11 18 10 -19 -11 22 16 -15 -4 18 18 -8 -19 -2 23 0 -17 0 13 9 -21 -3 27 26 2 -27 5 35 8
6812 8 -31 8 34 7 -20 4 24 15 -16 -4 19 18 -7 -9 11 10 1 -16 4 10 4 -12 -17 11 18 -33 -24 1 14 -13 -25 7 8 -11 -25 3
6848 3 21 10 -10 5 5 10 -14 -2 5 12 -7 -8 6 10 3 -5 -1 9 8 2 -5 2 18 10 7 9 8 4 -1 7 14 0 -5 5 12 5 -2 -1 7 7 5 3 5 7 12 -4 -7 -2
6896 -2 -4 11 -5 -17 5 4 -9 -5 -4 14 -9 -15 4 12 5 -7 -3 9 -2 -4 3 -8 6 -4 -3 -26 8 21 0 -8 7 18 -11 -22 13 39 -11
6933 -11 -19 8 27 -6 -26 2 20 5 -9 7 20 3 -9 -9 0 8 26 -7 -27 23 26 -21 -30 16 38 -27 -34 25 32 -30 -43 13 35 -27
6967 -27 -29 15 15 -16 -20 17 -4 9 15 4 -7 18 18 -24 -8 31 28 -20 -32 49 40 -30 -16 41 25 -38 -12 50 26 -30 -2 35 7 -20
7001 -20 6 9 -4 -6 20 -3 -14 33 15 -36 -33 47 39 -40 -29 51 30 -54 -12 38 8 -59 -1 41 0 -27 24 33 -17 -11 29 4 -33
7034 -33 13 30 -27 -38 29 37 -45 -18 48 15 -53 -5 55 17 -57 10 46 -15 -35 33 34 -34 -21 26 10 -47 13 31 -36 -51 25
7065 25 29 -45 -39 49 27 -58 -14 59 -1 -65 -4 43 -14 -51 27 34 -41 -27 39 9 -41 15 46 -16 -52 29 54 -37 -48 51 33 -56
7097 -56 -19 57 19 -58 1 45 -7 -41 25 41 -35 -12 43 22 -28 21 51 -22 -53 45 45 -43 -35 64 33 -65 -25 82 19 -50 -4
7128 -4 72 -16 -61 20 37 -23 -38 31 9 -31 -3 38 -28 -51 34 39 -39 -43 56 30 -67 -19 72 15 -77 -3 69 0 -66 22 48 -30
7160 -30 -42 34 28 -35 -4 52 -5 -57 21 32 -33 -22 46 23 -62 -10 71 8 -77 -2 68 -12 -75 21 71 -30 -32 45 49 -34 -3
7191 -3 28 -1 -31 14 31 -25 -28 37 16 -51 -10 57 -2 -70 8 64 -12 -62 25 54 -24 -44 32 31 -43 -28 34 6 -32 3 22 -7
7223 -7 -30 24 27 -36 -8 47 9 -53 5 66 -18 -55 12 48 -32 -42 29 35 -40 -24 30 5 -38 -4 34 -19 -30 15 16 -27 -14 46
7255 46 -4 -44 0 38 0 -59 11 33 -45 -33 27 23 -43 -17 33 12 -26 -3 24 -20 -26 16 15 -36 -24 43 3 -41 -4 37 -7 -43
7287 -43 17 40 -10 -38 15 27 -16 -29 22 14 -25 1 23 -11 -7 9 3 -18 -10 34 -3 -36 1 40 -8 -25 24 30 -26 -38 28 30 -8
7320 -8 -13 14 21 -27 -9 17 8 -9 12 8 -13 -9 14 -2 -28 2 21 -9 -42 24 34 -14 -37 15 37 -7 -18 20 20 -22 -18 14 6 -7 -13
7355 -13 -5 -13 -2 6 -9 -14 1 17 -18 -13 12 19 -26 -31 16 28 -22 -33 8 20 -4 -28 9 10 -13 -13 -5 10 -1 -1 -13 -11 4 1 -19 -11 10
7392 10 7 -26 -22 10 1 -20 -23 -1 14 -32 -13 1 8 -9 -25 7 -3 -6 -10 1 15 2 11 -4 -9 10 -2 -15 -10 17 16 -8 -16 25 21 -23 -10
7429 -10 16 2 -3 -9 10 10 1 -10 1 4 4 -5 -11 -5 -2 7 -22 -9 10 -6 -12 -17 8 0 -21 -12 16 0 -17 -9 -2 -4 -7 -20 -3 1 -10 -3 4 -3 12 0
7471 0 -9 -12 15 14 -10 -8 18 4 -14 5 17 10 -7 -5 8 13 -5 -9 13 12 7 2 3 11 23 -4 -16 -15 26 7 -7 -14 13 4 -28 -3 23 6 -12
7510 -12 -3 10 3 -5 0 17 0 2 -4 -11 -3 6 -9 -20 -3 40 4 -31 -7 18 6 -29 -2 32 5 -20 -7 5 12 -10 2 -2 11 0 -5 4 6
7547 6 8 14 -7 5 25 18 -35 -11 23 -8 -34 -4 24 2 -31 -9 22 -7 -21 -2 10 3 -12 6 -13 -9 0 -16 -18 -2 11 -12 -23 1
7581 1 17 -2 -34 -2 36 7 -19 7 33 9 -32 11 32 -7 -10 7 13 -3 -10 4 -2 5 8 7 -3 13 18 3 -15 7 32 -2 -26 5 34
7616 34 -3 -22 2 10 2 -5 6 16 -11 2 20 5 -14 -7 11 -15 -16 12 4 -15 -19 13 -9 -34 0 22 -10 -38 -7 14 -7 -24 5 28
7650 28 -8 -3 13 6 -9 1 24 -2 5 26 7 -19 -6 16 9 -17 6 29 -9 -21 -7 18 0 -22 13 11 -26 -20 15 4 -3 9 12 -8
7684 -8 -16 21 8 -9 -5 12 14 -22 -18 18 4 -22 -2 22 11 -25 4 14 4 -14 9 17 -12 -3 14 -5 -4 10 16 -10 -9 21 15 -15 0 41
7720 41 5 -25 12 45 10 -36 3 32 -6 -35 1 19 -15 -28 4 8 -22 -13 8 -1 -9 7 -14 -28 -13 26 7 -33 -14 20 6 -34
7752 -34 -3 38 -17 -35 5 27 -13 -36 -4 28 -17 -23 20 21 -8 -10 14 -13 -10 15 6 -21 -8 22 0 -28 8 43 3 -45 3 40 -10
7785 -10 -31 28 40 -13 -23 25 34 -26 -16 24 3 -17 -7 17 -18 -8 10 5 -25 -17 28 -13 -48 16 39 -16 -43 22 38 -36 -34 25
7817 25 19 -21 -20 28 9 -26 -7 27 -15 -16 25 20 -29 -5 26 6 -34 9 35 -10 -37 12 38 -16 -41 23 29 -29 -27 25 17 -19 -3 27
7851 27 -9 -26 23 36 -13 -15 27 8 -40 -7 37 2 -44 -3 35 -24 -29 18 28 -22 -20 31 11 -23 -14 21 0 -21 19 28 -38 -23 31
7884 31 21 -33 -8 28 -3 -46 0 43 -8 -30 23 28 -15 -31 18 13 -39 -16 30 -10 -19 0 18 -23 -14 29 3 -31 -6 31 -6 -37
7916 -37 8 38 -10 -48 16 43 -15 -28 22 28 -24 -29 21 6 -24 -7 17 -19 -15 8 10 -37 -11 29 7 -37 13 29 -20 -36 24 44
7948 44 -21 -36 20 34 -21 -25 22 12 -18 -12 11 -3 -28 18 4 -22 -3 25 -16 -26 2 30 -12 -34 17 20 -39 -34 13 20 -28 -30 15
7981 15 14 -39 -12 31 14 -20 0 19 -12 -17 11 2 -21 8 13 -11 -25 19 18 -27 -17 37 16 -37 -21 17 16 -26 -6 27 10 -24 4
8014 4 10 -7 -8 20 0 -17 -3 21 -4 -25 18 9 -19 -11 16 6 -29 -12 8 10 -27 -14 1 -12 -24 0 10 -17 -6 -2 1 -14 3 11 -6
8049 -6 -2 6 14 -26 -22 -2 17 -27 -23 9 2 -23 -11 16 -2 -14 -6 14 0 -3 11 6 -6 -1 9 -5 -8 7 8 -11 -25 8 23 -9 -12 23 18 -10
8087 -10 -7 20 14 1 -7 5 8 1 0 -10 5 15 3 -6 -11 19 5 -6 -10 5 11 -9 -4 15 19 -14 -9 19 27 -9 -7 4 8 -1 -18 4 6 -1 -2 -11 -1
8128 -1 10 6 -4 0 11 -5 -11 -8 8 -2 -27 -17 24 12 -20 -17 25 22 -16 -6 13 20 5 -1 5 15 5 -1 -13 3 17 -5 -20 -5 10 -2
8164 -2 -26 -17 13 6 -16 -5 14 5 -16 -12 2 -3 -19 -12 0 6 -13 -13 -5 1 16 10 -22 -2 11 3 -9
8191i
##END NTUPLES=NMR FID
##END=
