##TITLE=1H_DPA3005-1
 CDCl3, 8 sc, 
 31.5.2019
##JCAMPDX= 6.0         $$ Bruker NMR JCAMP-DX V2.0
##DATA TYPE= NMR FID
##DATA CLASS= NTUPLES
##ORIGIN= UXNMR, Bruker Analytische Messtechnik GmbH
##OWNER= root
$$ XWIN-NMR		Version 3.5
$$ Fri May 31 14:37:59 2019 Russian Standard Time (UT+4h)  she@DPX200
##.OBSERVE FREQUENCY= 200.13155
##.OBSERVE NUCLEUS= ^1H
##.DELAY= (6, 6)
##.ACQUISITION MODE= SIMULTANEOUS
##.ACQUISITION SCHEME= undefined
##.AVERAGES= 8
##.DIGITISER RES= 18
##SPECTROMETER/DATA SYSTEM= spect
##.PULSE SEQUENCE= zg30
##.SOLVENT NAME= CDCl3
##.SHIFT REFERENCE= (INTERNAL, CDCl3, 0, 15.7039)
##AUDIT TRAIL= $$ (NUMBER, WHEN, WHO, WHERE, WHAT)
$$ ##TITLE= Audit trail, XWIN-NMR		Version 3.5
$$ ##JCAMPDX= 5.01
$$ ##ORIGIN= Bruker BioSpin GmbH
$$ ##OWNER= she
$$ F:/spectra/data/she/nmr/H-F/1/audita.txt
$$ ##AUDIT TRAIL=  $$ (NUMBER, WHEN, WHO, WHERE, WHAT)
(   1,<2019-05-31 14:36:11.96 +0400>,<she>,<DPX200>,
      <created by zg, POWCHK disabled, PULCHK disabled
       configuration hash MD5:
       00 E9 B6 7A A2 85 ED C7 34 08 36 98 17 FE 4E 26
       data hash MD5: 16K
       78 86 C6 19 38 1D 53 D6 34 E6 6C B3 88 C5 22 59>)
$$ ##END=
$$ 
$$ hash MD5
$$ FE 51 6A 53 B9 01 14 AE CF BF 1C F4 DC 46 11 28
##$RELAX= 
##$RELAX= 
##$RELAX= 
##$RELAX= 
##$RELAX= 
##$RELAX= 
$$ Bruker specific parameters
$$ --------------------------
##$DU= <F:/spectra>
##$EXPNO= 1
##$NAME= <H-F>
##$PROCNO= 1
##$TYPE= <nmr>
##$USER= <she>
##$AMP= (0..31)
100 100 100 100 100 100 100 100 100 100 100 100 100 100 100 100 100 100 
100 100 100 100 100 100 100 100 100 100 100 100 100 100 
##$AQSEQ= 0
##$AQ_mod= 1
##$AUNM= <au_zg>
##$AUTOPOS= <>
##$BF1= 200.13
##$BF2= 200.13
##$BF3= 200.13
##$BF4= 200.13
##$BF5= 200.13
##$BF6= 200.13
##$BF7= 200.13
##$BF8= 200.13
##$BYTORDA= 1
##$CFDGTYP= 0
##$CFRGTYP= 5
##$CHEMSTR= <none>
##$CNST= (0..31)
1 1 145 1 1 1 1 1 1 1 1 1 1 1 1 1 1 1 1 1 1 1 1 1 1 1 1 1 1 1 1 1 
##$CPDPRG= <>
##$CPDPRG1= <>
##$CPDPRG2= <>
##$CPDPRG3= <>
##$CPDPRG4= <mlev>
##$CPDPRG5= <mlev>
##$CPDPRG6= <mlev>
##$CPDPRG7= <mlev>
##$CPDPRG8= <mlev>
##$CPDPRGB= <>
##$CPDPRGT= <>
##$D= (0..31)
0 1.2 0 0 0 0 0 0 0 0 0 0.03 0 0 0 0 0 0 0 0 0 0 0 0 0 0 0 0 0 0 0 0 
##$DATE= 1559298971
##$DBL= (0..7)
120 120 120 120 120 120 120 120 
##$DBP= (0..7)
150 150 150 150 150 150 150 150 
##$DBP07= 0
##$DBPNAM0= <>
##$DBPNAM1= <>
##$DBPNAM2= <>
##$DBPNAM3= <>
##$DBPNAM4= <>
##$DBPNAM5= <>
##$DBPNAM6= <>
##$DBPNAM7= <>
##$DBPOAL= (0..7)
0.5 0.5 0.5 0.5 0.5 0.5 0.5 0.5 
##$DBPOFFS= (0..7)
0 0 0 0 0 0 0 0 
##$DE= 6
##$DECBNUC= <off>
##$DECIM= 24
##$DECNUC= <off>
##$DECSTAT= 4
##$DIGMOD= 1
##$DIGTYP= 9
##$DL= (0..7)
0 120 120 120 120 120 120 120 
##$DP= (0..7)
150 150 150 150 150 150 150 150 
##$DP07= 0
##$DPNAME0= <>
##$DPNAME1= <>
##$DPNAME2= <>
##$DPNAME3= <>
##$DPNAME4= <>
##$DPNAME5= <>
##$DPNAME6= <>
##$DPNAME7= <>
##$DPOAL= (0..7)
0.5 0.5 0.5 0.5 0.5 0.5 0.5 0.5 
##$DPOFFS= (0..7)
0 0 0 0 0 0 0 0 
##$DQDMODE= 0
##$DR= 18
##$DS= 0
##$DSLIST= <SSSSSSSSSSSSSSS>
##$DSPFIRM= 0
$$ [...]
##$SUBNAM2= <"">
##$SUBNAM3= <"">
##$SUBNAM4= <"">
##$SUBNAM5= <"">
##$SUBNAM6= <"">
##$SUBNAM7= <"">
##$SUBNAM8= <"">
##$SUBNAM9= <"">
##$SW= 24.9336996594482
##$SWIBOX= (0..15)
0 0 2 0 0 0 0 0 0 0 0 0 0 0 0 0 
##$SW_h= 4990.01996007984
##$TD= 16384
##$TD0= 1
##$TE= 0
##$TE2= 300
##$TE3= 300
##$TEG= 300
##$TL= (0..7)
0 120 120 120 120 120 120 120 
##$TP= (0..7)
150 150 150 150 150 150 150 150 
##$TP07= 0
##$TPNAME0= <>
##$TPNAME1= <>
##$TPNAME2= <>
##$TPNAME3= <>
##$TPNAME4= <>
##$TPNAME5= <>
##$TPNAME6= <>
##$TPNAME7= <>
##$TPOAL= (0..7)
0.5 0.5 0.5 0.5 0.5 0.5 0.5 0.5 
##$TPOFFS= (0..7)
0 0 0 0 0 0 0 0 
##$TUNHIN= 0
##$TUNHOUT= 0
##$TUNXOUT= 0
##$USERA1= <user>
##$USERA2= <user>
##$USERA3= <user>
##$USERA4= <user>
##$USERA5= <user>
##$V9= 5
##$VALIST= <valist>
##$VCLIST= <CCCCCCCCCCCCCCC>
##$VD= 0
##$VDLIST= <DDDDDDDDDDDDDDD>
##$VPLIST= <PPPPPPPPPPPPPPP>
##$VTLIST= <TTTTTTTTTTTTTTT>
##$WBST= 1024
##$WBSW= 4
##$XGAIN= (0..3)
0 0 0 0 
##$XL= 0
##$YL= 0
##$YMAX_a= 85533
##$YMIN_a= -114132
##$ZGOPTNS= <>
##$ZL1= 120
##$ZL2= 120
##$ZL3= 120
##$ZL4= 120
##$ABSF1= 10
##$ABSF2= 0
##$ABSG= 5
##$ABSL= 3
##$ALPHA= 0
##$AQORDER= 0
##$ASSFAC= 0
##$ASSFACI= 0
##$ASSFACX= 0
##$ASSWID= 0
##$AUNMP= <proc_1d>
##$AZFE= 0.1
##$AZFW= 0.1
##$BCFW= 1
##$BC_mod= 2
##$BYTORDP= 1
##$COROFFS= 0
##$CY= 11.3945322036743
##$DATMOD= 1
##$DC= 2
##$DFILT= <>
##$DTYPP= 0
##$F1P= 18.9103706918063
##$F2P= -1.10871071338519
##$FCOR= 0.5
##$FTSIZE= 0
##$FT_mod= 4
##$GAMMA= 1
##$GB= 0.15
##$INTBC= 1
##$INTSCL= 1
##$ISEN= 128
##$LB= 0.24
##$LEV0= 0
##$LPBIN= 0
##$MAXI= 10000
##$MC2= 0
##$MEAN= 0
##$ME_mod= 0
##$MI= 1.114404
##$NCOEF= 0
##$NC_proc= 0
##$NLEV= 6
##$NOISF1= 3.799351
##$NOISF2= 2.8
##$NSP= 1
##$NTH_PI= 0
##$NZP= 0
##$OFFSET= 15.70392
##$PC= 1
##$PHC0= -8577.388
##$PHC1= 12.00023
##$PH_mod= 1
##$PKNL= yes
##$PPARMOD= 0
##$PSCAL= 0
##$PSIGN= 0
##$REVERSE= no
##$SF= 200.130013532006
##$SI= 16384
##$SIGF1= 3
##$SIGF2= 2
##$SINO= 400
##$SIOLD= 16384
##$SREGLST= <1H.CDCl3>
##$SSB= 0
##$STSI= 0
##$STSR= 0
##$SW_p= 3612.71676300578
##$SYMM= 0
##$S_DEV= 0
##$TDeff= 0
##$TDoff= 0
##$TI= <>
##$TILT= no
##$TM1= 0
##$TM2= 0
##$TOPLEV= 0
##$USERP1= <user>
##$USERP2= <user>
##$USERP3= <user>
##$USERP4= <user>
##$USERP5= <user>
##$WDW= 1
##$XDIM= 8192
##$YMAX_p= 0
##$YMIN_p= 0
$$ End of Bruker specific parameters
$$ ---------------------------------
##NTUPLES= NMR FID
##VAR_NAME=  TIME,          FID/REAL,        FID/IMAG
##SYMBOL=    X,             R,               I
##VAR_TYPE=  INDEPENDENT,   DEPENDENT,       DEPENDENT
##VAR_FORM=  AFFN,          ASDF,            ASDF
##VAR_DIM=   8192,          8192,            8192
##UNITS=     SECONDS,       ARBITRARY UNITS, ARBITRARY UNITS
##FACTOR=    0.0002004,     1,               1
##FIRST=     0,             0,               0
##LAST=      1.6414764,     0,               0
##MIN=       0,             -114132,         0
##MAX=       1.6414764,     85533,           0
$$ Real data points
##PAGE= N=1
##DATA TABLE= (X++(R..R)), XYDATA
0 0 0 0 0 0 0 0 0 0 0 0 0 0 0 0 -8 8 -8 8 -8 8 -16 16 -16 21 -24 25 -32 32 -40 44 -48 55 -61 69 -77 85 -93
37 -93 105 -117 126 -142 158 -174 193 -214 237 -265 295 -332 374 -424 486 -565 665 -800 995 -1294
57 -1294 1803 -2850 5815 -30921 -114132 -5143 83399 191 -95145 -38263 42214 6918 -61707
70 -61707 -37613 23224 13774 -51325 -67565 -4581 47604 -1489 -84374 -61951 37212 40868 -55302
83 -55302 -69018 25994 42245 -53506 -70084 33229 60253 -42206 -84653 6005 62616 -4331
95 -4331 -66446 -24832 38620 25752 -30901 -40977 8567 39260 -1442 -46098 -9234 48720
107 48720 12172 -62114 -27775 66191 45311 -59383 -58091 43203 60208 -22619 -44356 19194
119 19194 35475 -18536 -33097 16261 39342 -791 -40367 -22700 27972 39673 -10519 -47320
131 -47320 -5255 45973 10290 -49150 -16476 48744 17022 -54692 -27033 48742 28574 -46822
143 -46822 -35983 35950 38136 -24277 -40726 5553 34324 10373 -23019 -20072 11351 21834
155 21834 -7712 -23914 11238 34658 -9865 -46863 2313 56511 14356 -49917 -21670 40693
167 40693 24005 -28665 -16148 28883 18585 -23107 -19237 20222 29660 -1800 -25508 -7270
179 -7270 27855 25391 -16192 -27957 17281 41847 -3821 -38636 4185 45229 6845 -36228
191 -36228 -1754 41405 9688 -35615 -10313 37350 24455 -21478 -25309 10240 26970 5356
203 5356 -18109 -8617 16790 12223 -18721 -17610 22435 27817 -21484 -38641 13029 41432 -6233
216 -6233 -41953 -2183 35308 2593 -35657 -10953 27167 12017 -24833 -20948 12356 19712 -8476
229 -8476 -26279 -3262 25303 8974 -30024 -23331 22779 27739 -19103 -32913 10744 29116 -10583
242 -10583 -29921 8843 31628 -4807 -33668 -4106 30558 13469 -21869 -17846 13805 20189
254 20189 -6656 -20335 4046 26059 4138 -27377 -10279 29940 20662 -24629 -23743 22941 29349
267 29349 -16918 -30399 13687 35080 -3345 -31925 -3118 29385 11432 -21620 -13187 19338
279 19338 18781 -14749 -23640 10354 30877 -157 -31998 -8472 30279 15177 -26022 -17466 24577
292 24577 20743 -23154 -25710 19326 31170 -11169 -32859 2223 31123 5190 -28029 -10792
304 -10792 25926 17404 -22825 -24829 17208 31356 -8395 -33265 980 33365 5246 -32367
316 -32367 -10057 32370 16975 -29811 -24223 23736 29486 -14995 -30208 8179 30029 -2378
328 -2378 -29744 -2707 31101 10930 -29650 -19712 24709 26442 -17692 -29569 11986 31911 -6793
341 -6793 -34158 1226 36969 7633 -35921 -16375 31364 22801 -25405 -26816 19833 30052 -14576
354 -14576 -33930 7378 36903 2374 -35865 -11235 31912 17569 -27384 -22043 23455 26366
366 26366 -19516 -31795 12685 35425 -3827 -35382 -4166 33016 10244 -30266 -15267 28025
378 28025 21183 -24715 -28131 17787 32509 -9502 -33898 1614 32814 4248 -32065 -10337
390 -10337 30781 17120 -27977 -24803 21016 28788 -13992 -30922 6592 30165 -2024 -31246
402 -31246 -4524 30510 11155 -28599 -18806 22537 22650 -17069 -25353 11290 26130 -7506 -28920
415 -28920 938 29492 6037 -28295 -13436 23772 18053 -19018 -20901 15169 24021 -10713 -27125
428 -27125 4646 29046 3229 -27342 -9619 24148 14734 -19498 -16941 17378 21729 -12027 -24054
441 -24054 7193 26977 1051 -24686 -5923 22798 10759 -19191 -12844 18339 18309 -13270 -20557
454 -20557 9265 23940 -1449 -21797 -2466 20969 7035 -18812 -10206 18045 15937 -13588
466 -13588 -19149 9306 22452 -2183 -20878 -1134 20873 5267 -19918 -9070 18884 14076
478 14076 -15303 -17833 10267 19814 -4336 -18797 881 18754 3035 -18560 -7762 17084
490 17084 12321 -14798 -17419 9323 18591 -5831 -19977 1993 20322 1019 -21588 -6400 19643
503 19643 10048 -17905 -15190 11771 14947 -9735 -17742 4708 17848 -1559 -20292 -5581 18185
516 18185 10090 -16700 -15969 10955 15965 -10253 -19854 5666 19934 -4068 -23063 -2195 21156
529 21156 5824 -19616 -10542 14678 11299 -12857 -14967 7632 15646 -4291 -18177 -2049 17218
542 17218 6433 -16228 -10296 14851 13439 -13806 -17336 11030 20173 -7142 -21597 2147 20220
555 20220 1608 -17548 -3386 16303 6402 -14208 -9582 11812 14136 -6506 -16598 704 17181
568 17181 4492 -16165 -7615 16073 11107 -15167 -13846 14306 17242 -11244 -18720 7946 19084
581 19084 -4457 -18631 817 17764 3889 -15163 -8318 11279 12086 -6123 -13537 2420 14875
594 14875 333 -16914 -3253 19589 8020 -20392 -13306 18361 17211 -13986 -17799 10262 16808
607 16808 -7774 -16192 5273 16268 -1464 -16198 -4360 13776 9694 -10147 -14294 5436 16899
620 16899 -1824 -19652 -2580 20498 5823 -21095 -9446 19550 10888 -18788 -12950 16813
632 16813 14517 -14659 -17611 8843 18031 -2514 -16807 -4242 12639 7708 -10003 -10636 8509
645 8509 13643 -8506 -19284 5825 23880 -1666 -26861 -4163 25673 7754 -23233 -9837
657 -9837 20209 10682 -17736 -12165 14338 13720 -10143 -15565 4246 16189 1934 -16271 -8719
670 -8719 14827 14958 -12019 -19619 8498 21969 -5822 -22974 4241 23574 -3505 -25292 942
683 942 26083 3590 -24135 -8551 19150 12051 -12213 -12688 6417 12485 -2112 -12921 -1410
696 -1410 14943 6221 -16559 -11617 17407 18002 -15035 -21719 12263 24228 -7915 -23246 5211
709 5211 21786 -2447 -18833 1438 17713 1775 -15045 -4709 13236 10719 -7190 -13941 1452
722 1452 16708 5690 -15442 -8826 15550 11545 -14951 -11917 17263 15387 -16518 -17537 15344
735 15344 20665 -10091 -19719 5690 18010 -356 -13454 -2310 10483 6025 -6224 -7665 4609
748 4609 11803 -1144 -14459 -1036 18819 6275 -19620 -10078 19450 14245 -15251 -13616 13014
761 13014 12836 -10328 -10251 10405 11235 -7519 -11778 3189 12228 3948 -8871 -9155 4748 12770 -285
776 -285 -13611 -1470 15031 2686 -16500 -3617 18353 5842 -18541 -8098 17224 10309 -13853
789 -13853 -11144 9806 11341 -4620 -9702 224 7615 3475 -5376 -5752 4769 8583 -4824 -12325
803 -12325 4466 16998 -1704 -19782 -2158 19633 5295 -16985 -5963 14286 5097 -13012
815 -13012 -5063 12088 6865 -9648 -9631 4568 10915 1445 -10456 -7182 8169 10624 -6660 -13568
829 -13568 4868 14949 -4388 -17034 2632 17286 -2042 -18409 -635 16924 2075 -16119
841 -16119 -5869 11472 6767 -7869 -8421 2264 6729 -428 -7942 -3012 7876 4350 -11100 -9773
855 -9773 10337 12804 -10153 -17071 6022 16376 -4689 -16533 1921 13995 -1983 -14192 -981
868 -981 11788 2571 -10650 -6631 6347 8380 -2997 -10766 -1904 10763 4991 -11171 -8393 9925
882 9925 9553 -9877 -11059 9169 11783 -8845 -13244 7070 14088 -4109 -13712 481 11638 2486
896 2486 -8858 -4573 6272 6267 -4223 -8155 2497 10951 569 -12624 -3528 13855 7189 -13024
910 -13024 -9488 11737 11278 -9382 -11641 7318 11925 -4412 -10787 2448 10420 589 -9032 -3155
924 -3155 8042 6656 -5759 -9433 3050 11548 111 -11969 -1992 12490 3787 -12415 -4823
937 -4823 13015 7007 -12321 -9126 10519 10986 -7351 -11507 4134 11502 -687 -10575 -2058 10071
951 10071 5476 -8653 -8427 6893 11005 -4720 -12934 2340 14125 39 -14734 -2565 14542
964 14542 5188 -13169 -7225 11080 8402 -9026 -9392 6817 10199 -4660 -11479 1504 12184
977 12184 2223 -11799 -5708 10590 8526 -8970 -10608 7407 12423 -5694 -14153 3263 15205
990 15205 -190 -14984 -2749 13881 5431 -11952 -7464 9783 9338 -7191 -10883 4064 11675
1003 11675 -852 -11708 -1972 11324 4433 -10754 -6695 9973 8935 -8658 -11029 6459 12123
1016 12123 -4181 -12580 1877 12490 230 -12306 -2604 11734 5301 -10413 -8024 8031 9871
1029 9871 -5416 -11134 2663 11740 -55 -11969 -2592 11744 5415 -10536 -7716 8685 9299
1042 9299 -6571 -10223 4482 10860 -2241 -11001 -7 10971 2762 -9795 -4759 8532 6560
1055 6560 -6891 -7875 5397 9234 -3472 -10273 1218 10899 1503 -10379 -3716 9528 5728 -8237
1069 -8237 -7446 6596 8845 -4683 -10148 1930 10331 638 -9890 -3046 8804 4874 -7632 -6615
1083 -6615 6033 7880 -4368 -9149 1890 9163 10 -9063 -2028 8350 3520 -7759 -5169 6774
1097 6774 6728 -5417 -8198 3337 8723 -1549 -9178 -523 9024 2311 -8854 -4477 8003 6542
1111 6542 -6489 -8212 4337 9042 -2304 -9584 32 9422 1887 -9254 -4265 8165 6172 -6631
1125 -6631 -7690 4648 8406 -2881 -8940 975 8990 688 -9133 -2925 8313 4629 -7317 -6246
1139 -6246 5817 7313 -4368 -8245 2804 9063 -795 -9443 -1451 9177 3667 -8200 -5451 6967
1153 6967 7069 -5254 -8039 3763 9375 -1153 -9328 -829 9375 3378 -8053 -4760 7205 6458
1167 6458 -5559 -7266 4433 8653 -2071 -8531 665 8942 1678 -7874 -2751 7611 4561 -6434
1181 -6434 -5786 5460 7415 -3474 -8052 1863 8861 440 -8552 -1949 8653 4144 -7824 -5898
1195 -5898 6689 7510 -4860 -8362 2988 8862 -833 -8471 -699 8467 3006 -7280 -4572 6148
1209 6148 6287 -4224 -7156 2535 7788 -757 -7876 -555 8325 2558 -7736 -3843 7318 5484
1223 5484 -5998 -6385 4689 7070 -3238 -7627 1411 7796 684 -7360 -2667 6578 4587 -5312
1237 -5312 -6126 3879 7259 -2625 -8705 412 8900 1210 -9155 -3404 7969 4381 -7199 -5645
1251 -5645 5561 5856 -4792 -7162 2350 6813 -1033 -7469 -1822 6215 3074 -6027 -5276 4709 6378
1266 6378 -4158 -8272 2426 8932 -1324 -9914 -627 9627 1813 -9551 -3561 8600 5028
1279 5028 -7196 -6471 4982 7174 -2654 -7442 272 7158 1585 -7182 -3796 6772 5793 -6246
1293 -6246 -7984 4783 9231 -3300 -9879 1743 9738 -669 -9558 -473 9139 1798 -8339 -3330
1307 -3330 6960 4786 -5068 -5943 2939 6870 -613 -7391 -1615 7788 3940 -7568 -5815 7096
1321 7096 7298 -6474 -8523 5543 9289 -4450 -9859 2762 9764 -715 -8640 -979 7188 2497
1335 2497 -5365 -3499 3893 4656 -2455 -6007 865 7446 1278 -8137 -3091 8656 5104 -8066 -6124
1350 -6124 7534 6836 -6802 -7320 5746 7416 -4585 -7561 2817 7336 -534 -6353 -1616 5106
1364 5106 3875 -3213 -5457 1427 6577 148 -7354 -1250 8229 2579 -8336 -3170 8929 4730
1378 4730 -7875 -5081 7034 5731 -5132 -5328 3465 4860 -1600 -3986 136 3637 1846 -2913
1392 -2913 -3545 2504 5619 -1712 -7679 203 8618 862 -9325 -2346 8605 2640 -8071 -2922
1406 -2922 7235 2920 -6597 -3740 4785 3984 -2983 -4669 -174 3783 2209 -3240 -4312 2249 5497
1421 5497 -2013 -6887 1641 7899 -1501 -9151 556 9299 68 -9287 -1066 8426 1974 -6875 -2500
1436 -2500 5267 3191 -2962 -3196 1211 3621 802 -3826 -2428 4684 4945 -4533 -6771 4506 8907
1451 8907 -3006 -9108 2263 8993 -1557 -8198 1465 7781 -878 -7176 -176 6206 1822 -4205
1465 -4205 -3107 1803 3819 357 -4342 -2372 4435 3523 -5220 -5072 5508 6145 -5797 -7308 5410
1480 5410 7823 -4898 -8238 3573 7668 -2445 -7002 734 5412 468 -3857 -1572 2439 2724
1494 2724 -1187 -4076 -69 5597 1685 -6868 -3602 7255 5153 -6794 -5715 6387 5953 -5696
1508 -5696 -5495 5531 5663 -4584 -5626 3105 5361 -1043 -4425 -937 3211 2871 -1530 -4001 476
1523 476 5333 728 -6198 -1544 7048 2342 -7663 -3222 7746 4021 -7193 -4522 6228 4872
1537 4872 -4519 -4470 2958 3913 -1345 -3301 -217 2686 1718 -2350 -3503 1834 5317 -910 -6682 -58
1553 -58 7634 1136 -7798 -1893 7480 2203 -7078 -2533 6392 2812 -5488 -3268 4183 3841 -2229 -4005
1569 -4005 110 3815 1935 -3350 -3718 2657 4887 -2348 -6104 1969 7070 -1509 -7874 748 8237
1584 8237 257 -7926 -1276 7032 2044 -5837 -2714 4325 3169 -2824 -3613 1223 4082 581 -4289
1599 -4289 -2203 4544 3989 -4333 -5430 3956 6668 -3166 -7306 2314 7478 -1445 -7173 773 6863
1614 6863 180 -6201 -1145 5407 2480 -4011 -3594 2258 4308 -529 -4757 -1070 4936 2293 -5194
1629 -5194 -3530 5300 4689 -5078 -5761 4362 6324 -3538 -6712 2258 6355 -1292 -6115 -56 5320
1644 5320 1224 -4485 -2464 3391 3486 -2316 -4532 1023 5212 76 -5977 -1567 6056 2706 -5911
1659 -5911 -3697 5412 4399 -4671 -4767 3951 5141 -2932 -5412 1554 5266 -120 -4896 -1393 4100
1674 4100 2670 -3119 -3616 2307 4574 -1253 -5223 228 5599 760 -5786 -1858 5406 2621 -4960
1689 -4960 -3333 4200 3881 -3206 -4190 2043 4272 -925 -4249 -377 3876 1395 -3629 -2616 3052
1704 3052 3645 -2298 -4448 1450 5048 -440 -5194 -448 5153 1284 -4892 -2136 4384 2942 -3541
1719 -3541 -3495 2646 4065 -1349 -4099 350 4236 902 -3948 -1908 3656 2974 -3035 -3698 2405 4362
1735 4362 -1534 -4664 809 4955 206 -4845 -1115 4592 2080 -4015 -2892 3219 3537 -2363 -4091
1750 -4091 1323 4425 -253 -4601 -975 4399 2029 -4041 -3034 3336 3706 -2656 -4364 1701 4635
1765 4635 -803 -4822 -301 4596 1248 -4257 -2129 3695 2881 -3042 -3540 2256 4063 -1364 -4399
1780 -4399 349 4484 615 -4397 -1521 4161 2447 -3655 -3188 3090 3985 -2164 -4425 1201 4672
1795 4672 -183 -4684 -864 4474 1837 -4052 -2745 3446 3556 -2548 -4061 1625 4338 -724 -4489
1810 -4489 -321 4309 1130 -4122 -2104 3589 2840 -2939 -3422 2188 3865 -1384 -4188 464 4241
1825 4241 390 -4264 -1459 3862 2256 -3367 -3008 2683 3618 -1847 -4006 922 4223 75 -4214
1840 -4214 -1138 3832 1982 -3353 -2748 2673 3323 -1866 -3676 1067 3917 -142 -3900 -775 3617
1855 3617 1503 -3322 -2250 2796 2835 -2193 -3309 1534 3738 -647 -3842 -137 3876 973 -3699
1870 -3699 -1779 3343 2536 -2783 -3161 2110 3754 -1113 -3905 267 4043 783 -3810 -1639 3514
1885 3514 2566 -2909 -3239 2249 3836 -1318 -4018 578 4187 309 -4038 -1072 3807 1808 -3377
1900 -3377 -2525 2736 3075 -2008 -3490 1163 3737 -347 -3940 -685 3815 1527 -3720 -2574 3122
1915 3122 3201 -2657 -3919 1830 4209 -1108 -4532 61 4333 740 -4131 -1761 3399 2320 -2811
1930 -2811 -3017 1895 3389 -1076 -3764 111 3890 820 -3858 -1707 3613 2390 -3301 -2967 2909
1945 2909 3482 -2363 -3817 1804 4152 -890 -4079 86 3943 836 -3506 -1686 2988 2562 -2217
1960 -2217 -3266 1393 3894 -362 -4127 -502 4285 1375 -4169 -2112 3896 2749 -3404 -3217 2718
1975 2718 3474 -1890 -3437 1134 3370 -269 -3034 -489 2806 1388 -2345 -2232 1840 3068 -1087
1990 -1087 -3550 489 4040 300 -4082 -762 4249 1453 -3984 -1936 3649 2490 -2900 -2736 2097
2005 2097 2970 -961 -2762 67 2643 1061 -2197 -1872 1824 2705 -1333 -3327 890 3830 -396 -4066
2021 -4066 -35 4215 523 -4050 -919 3709 1280 -3217 -1609 2471 1776 -1764 -2055 837 2215
2036 2215 93 -2431 -1233 2386 2284 -2232 -3275 1758 3827 -1395 -4257 914 4308 -587 -4364
2051 -4364 57 4096 456 -3641 -1094 2751 1468 -1818 -1790 744 1871 98 -2113 -1024 2217
2066 2217 1776 -2405 -2670 2329 3234 -2296 -3786 1962 3984 -1726 -4179 1136 3954 -656 -3644 -79
2082 -79 2894 566 -2251 -1240 1378 1776 -592 -2487 -478 2937 1487 -3212 -2446 3085 2974 -2946
2098 -2946 -3242 2801 3330 -2681 -3406 2413 3479 -1780 -3262 1037 2826 -174 -2100 -504 1488 1215
2114 1215 -875 -1901 366 2752 367 -3369 -952 3921 1678 -4034 -2117 4087 2567 -3773 -2772
2129 -2772 3315 2906 -2519 -2661 1749 2388 -832 -1863 88 1607 909 -1119 -1795 692 2770 22
2145 22 -3299 -514 3698 975 -3691 -974 3909 1148 -3838 -1205 3801 1620 -3161 -1734 2401
2160 2401 1868 -1270 -1578 423 1493 651 -1188 -1454 1173 2480 -846 -3219 612 3910 -189 -4148
2176 -4148 -70 4264 443 -4012 -634 3636 882 -2968 -942 2208 989 -1461 -1122 607 1241
2191 1241 206 -1528 -1264 1565 2186 -1582 -3054 1316 3456 -1260 -3845 1029 3860 -1035 -4084
2206 -4084 564 3836 -172 -3529 -554 2611 922 -1742 -1396 612 1455 156 -1811 -1121 1900 1759
2222 1759 -2196 -2606 2128 3079 -2104 -3552 1780 3574 -1610 -3624 1141 3281 -864 -3046 284
2237 284 2467 152 -1998 -811 1289 1353 -680 -2093 -212 2537 950 -2981 -1822 2981 2306 -3002
2253 -3002 -2709 2816 2861 -2669 -3029 2267 3060 -1709 -2965 902 2565 -133 -2005 -555 1420 1160
2269 1160 -887 -1682 509 2346 35 -2854 -473 3331 1071 -3407 -1399 3475 1833 -3153 -1945
2284 -1945 2937 2256 -2257 -2156 1715 2251 -798 -1956 125 1871 834 -1423 -1528 1149 2359 -540
2300 -540 -2780 132 3146 363 -3176 -609 3177 864 -3069 -1085 2834 1334 -2394 -1578 1732
2315 1732 1640 -1044 -1654 331 1561 309 -1525 -1001 1464 1668 -1336 -2313 1085 2828 -731 -3127
2331 -3127 342 3240 76 -3131 -422 2944 855 -2437 -1104 1968 1450 -1262 -1588 640 1775
2346 1775 96 -1820 -762 1841 1455 -1690 -1944 1514 2336 -1267 -2620 983 2716 -753 -2873 249
2362 249 2698 79 -2596 -714 2053 1031 -1689 -1576 932 1709 -529 -2171 -337 2077 720 -2337
2378 -2337 -1543 2001 1828 -1955 -2366 1465 2452 -1194 -2683 588 2488 -243 -2436 -330 2092 733
2394 733 -1804 -1202 1414 1658 -895 -1918 476 2273 129 -2321 -534 2453 1121 -2271 -1421 2235
2410 2235 1979 -1732 -2062 1504 2454 -802 -2335 400 2450 359 -2113 -778 1961 1444 -1440 -1707
2426 -1707 1173 2201 -544 -2269 221 2531 398 -2396 -748 2355 1255 -2000 -1495 1767 1879
2441 1879 -1251 -1976 864 2197 -243 -2136 -234 2097 819 -1868 -1284 1608 1736 -1217 -2055 807
2457 807 2293 -303 -2362 -175 2328 644 -2173 -1093 1870 1405 -1565 -1763 1079 1926 -654 -2079
2473 -2079 117 2045 322 -2009 -804 1820 1192 -1611 -1597 1274 1860 -919 -2073 478 2184 -14
2489 -14 -2167 -410 2125 919 -1867 -1276 1607 1696 -1150 -1910 766 2129 -214 -2122 -203 2144
2505 2144 767 -1907 -1149 1694 1562 -1317 -1836 883 1985 -491 -2145 -49 2049 429 -2031 -969
2521 -969 1731 1255 -1545 -1713 1052 1809 -805 -2167 148 2020 115 -2191 -796 1825 1030 -1767
2537 -1767 -1577 1257 1729 -1020 -2109 391 2052 -67 -2228 -567 1962 866 -1860 -1365 1513 1646
2553 1646 -1182 -1917 768 2101 -291 -2125 -156 2117 647 -1943 -996 1815 1485 -1386 -1673 1144
2569 1144 2056 -573 -2062 242 2208 333 -2051 -691 1988 1218 -1630 -1497 1377 1897 -866 -1992
2585 -1992 497 2172 11 -2131 -442 2075 900 -1835 -1257 1586 1618 -1150 -1812 769 1987 -293
2601 -293 -2005 -143 1976 628 -1803 -1040 1571 1415 -1257 -1699 904 1912 -502 -2045 65 2050
2617 2050 342 -1974 -752 1762 1100 -1500 -1377 1144 1594 -774 -1763 314 1813 124 -1822 -594
2633 -594 1690 990 -1491 -1349 1271 1672 -946 -1867 632 2024 -237 -2045 -167 1948 562 -1752
2649 -1752 -885 1499 1237 -1101 -1433 749 1676 -235 -1723 -169 1788 675 -1665 -1037 1586 1468
2665 1468 -1279 -1646 1110 1933 -661 -1937 357 1975 81 -1822 -435 1640 823 -1328 -1141 997
2681 997 1481 -545 -1691 83 1821 359 -1889 -832 1745 1105 -1724 -1481 1453 1662 -1239 -1889
2697 -1889 816 1872 -471 -1874 -30 1620 327 -1512 -836 1148 1122 -908 -1540 490 1784 -127
2713 -127 -2011 -291 2075 605 -2113 -965 2015 1251 -1821 -1482 1526 1642 -1081 -1642 689 1658
2729 1658 -190 -1566 -282 1428 834 -1186 -1306 880 1721 -497 -1941 222 2120 68 -2214 -323
2745 -323 2214 570 -2153 -906 1840 1047 -1516 -1248 995 1220 -632 -1327 52 1250 370 -1315
2761 -1315 -1021 1077 1399 -970 -1870 656 2055 -498 -2298 175 2271 32 -2258 -374 1947 551
2777 551 -1637 -760 1228 895 -806 -1039 323 1184 225 -1263 -771 1242 1238 -1133 -1553 1089 1852 -948
2795 -948 -1983 917 2218 -645 -2206 387 2129 6 -1783 -273 1446 594 -962 -776 594 1150
2811 1150 -19 -1326 -448 1517 986 -1540 -1387 1523 1703 -1412 -1860 1313 2013 -1029 -1944 818 1873
2828 1873 -438 -1599 145 1320 201 -1014 -563 694 1012 -216 -1322 -164 1663 688 -1717 -962
2844 -962 1842 1230 -1866 -1420 1846 1628 -1643 -1715 1343 1772 -826 -1532 453 1339 39 -991 -415
2861 -415 752 866 -444 -1272 156 1691 244 -1888 -437 2133 759 -2099 -836 2154 1038 -1972
2877 -1972 -1112 1767 1226 -1353 -1132 1027 1201 -424 -1004 13 1058 692 -778 -1162 632 1717 -263
2894 -263 -1941 116 2226 165 -2226 -190 2361 497 -2143 -615 1963 841 -1452 -846 1013
2909 1013 845 -517 -806 92 850 406 -857 -893 844 1380 -771 -1781 599 1982 -538 -2209 308
2926 308 2195 -226 -2219 -89 1929 232 -1703 -524 1183 588 -849 -887 245 914 182 -1146
2942 -1146 -820 1037 1140 -1093 -1573 929 1666 -978 -1898 805 1887 -788 -2008 430 1754 -272
2958 -272 -1626 -127 1164 231 -946 -622 469 771 -221 -1194 -369 1271 656 -1550 -1209 1403 1335 -1492
2976 -1492 -1694 1203 1641 -1150 -1801 731 1563 -552 -1514 68 1099 111 -946 -598 486 805 -264
2993 -264 -1174 -165 1330 424 -1516 -721 1542 887 -1606 -1073 1569 1220 -1430 -1340 1197 1421 -812
3010 -812 -1316 483 1256 5 -1018 -306 903 813 -583 -1111 402 1534 -4 -1638 -185 1843 557
3027 557 -1740 -642 1766 895 -1517 -909 1380 1080 -990 -1034 755 1134 -283 -1002 -37 1038 524
3044 524 -872 -864 806 1257 -560 -1496 405 1744 -139 -1813 -58 1873 343 -1754 -561 1569
3060 1569 805 -1221 -944 862 1062 -435 -1076 48 1075 345 -1029 -708 938 1022 -828 -1294 656
3077 656 1451 -504 -1574 301 1592 -121 -1595 -129 1472 315 -1354 -615 1071 766 -809 -1027
3093 -1027 428 1136 -101 -1243 -321 1239 647 -1215 -999 1036 1223 -893 -1405 651 1496 -394 -1500
3110 -1500 144 1455 163 -1287 -406 1099 657 -849 -825 621 1036 -304 -1112 77 1272 287 -1246
3127 -1246 -496 1273 829 -1128 -1026 1011 1251 -707 -1316 502 1447 -103 -1341 -158 1314 544 -1051
3144 -1051 -770 864 1061 -538 -1190 300 1348 63 -1291 -259 1340 589 -1183 -748 1088 960
3160 960 -858 -1071 689 1223 -410 -1220 187 1294 161 -1197 -392 1159 728 -972 -961 797 1190
3177 1190 -531 -1317 261 1435 87 -1399 -354 1358 661 -1174 -895 967 1083 -704 -1208 417
3193 417 1275 -134 -1288 -172 1224 432 -1134 -691 963 891 -788 -1081 560 1185 -334 -1270 46
3210 46 1286 215 -1266 -507 1135 740 -984 -993 745 1156 -467 -1265 178 1305 128 -1279 -460
3227 -460 1157 697 -1003 -929 764 1081 -545 -1189 255 1226 -6 -1207 -269 1119 469 -1047 -709
3244 -709 862 855 -735 -1063 466 1114 -286 -1235 -40 1187 245 -1194 -588 1030 757 -938 -1037 633
3262 633 1126 -441 -1276 91 1250 154 -1240 -477 1066 679 -951 -946 667 1023 -459 -1168 151
3279 151 1168 64 -1166 -322 1093 555 -995 -778 820 906 -652 -1060 407 1141 -163 -1168 -69
3296 -69 1184 372 -1049 -604 931 866 -695 -1047 478 1190 -207 -1241 -65 1256 353 -1156 -554
3313 -554 1075 802 -859 -923 677 1057 -415 -1088 186 1119 98 -1026 -291 995 572 -822 -757 707
3331 707 972 -494 -1100 317 1225 -73 -1249 -131 1273 427 -1144 -595 1041 832 -787 -920 566
3348 566 1056 -262 -1080 -46 1060 383 -942 -621 854 888 -646 -1053 472 1188 -280 -1258 57
3365 57 1262 128 -1210 -346 1069 498 -933 -671 707 778 -480 -915 161 953 110 -995 -445 915
3383 915 685 -880 -955 720 1101 -641 -1304 380 1314 -204 -1339 -69 1170 214 -1089 -445 819
3400 819 562 -641 -781 303 814 -98 -984 -279 927 445 -1025 -754 909 878 -932 -1121 730 1166
3418 1166 -633 -1263 365 1173 -212 -1148 -84 945 283 -809 -597 515 774 -235 -976 -80 1042
3435 1042 343 -1122 -561 1149 771 -1107 -929 1023 1063 -822 -1076 648 1081 -383 -941 223 897
3452 897 99 -690 -310 602 670 -292 -839 139 1108 148 -1177 -265 1342 517 -1319 -618 1335 813 -1152
3471 -1152 -869 979 903 -731 -861 459 823 -153 -758 -192 623 514 -485 -815 250 1016 -130 -1231
3489 -1231 -20 1334 96 -1476 -293 1439 394 -1383 -558 1160 553 -981 -629 671 605 -428
3505 -428 -684 18 630 326 -620 -721 487 977 -415 -1225 294 1393 -197 -1494 81 1518 71
3522 71 -1420 -192 1246 304 -1003 -340 771 473 -436 -524 119 616 279 -618 -593 643 888 -579 -1069
3541 -1069 620 1280 -548 -1375 504 1482 -337 -1385 206 1265 -36 -1037 -71 830 262 -525 -393
3558 -393 274 615 94 -679 -384 823 724 -815 -883 894 1093 -850 -1172 849 1290 -682 -1230 581
3576 581 1178 -342 -954 218 849 72 -555 -263 370 585 -12 -733 -218 937 519 -986 -649 1119
3594 1119 853 -1108 -929 1129 1071 -948 -1035 793 1015 -538 -833 341 723 -56 -545 -191 395 536
3612 536 -166 -764 -26 1021 254 -1121 -376 1251 525 -1269 -605 1278 717 -1154 -752 989 746 -773
3630 -773 -711 504 633 -244 -593 -106 472 421 -369 -729 201 931 -93 -1156 -54 1232 91 -1374
3648 -1374 -266 1323 296 -1315 -470 1064 439 -914 -537 579 458 -387 -555 -6 481 270 -526
3665 -526 -646 389 847 -349 -1100 213 1186 -191 -1315 66 1276 14 -1253 -175 1072 235
3681 235 -893 -330 640 404 -395 -501 79 519 197 -603 -512 563 704 -583 -959 507 1034 -502 -1194
3700 -1194 355 1163 -290 -1195 46 1000 -7 -924 -227 617 245 -506 -490 174 520 -27 -710 -317 696
3719 696 478 -797 -719 714 801 -752 -959 620 971 -544 -1014 373 971 -190 -874 2 742 215
3737 215 -558 -388 391 602 -126 -713 -60 850 308 -879 -454 921 623 -863 -731 806 830 -663 -853
3756 -853 513 860 -307 -787 112 693 106 -606 -296 474 498 -351 -699 175 815 -22 -930 -145 965
3775 965 283 -983 -429 930 543 -826 -638 673 699 -484 -724 284 716 -44 -672 -167 616 394
3793 394 -493 -559 403 749 -229 -816 145 929 38 -914 -127 941 301 -835 -384 762 528 -561 -570 429
3813 429 676 -191 -650 5 701 259 -631 -411 585 634 -454 -750 337 864 -172 -895 24 899 125
3832 125 -845 -284 759 402 -625 -517 452 590 -284 -665 83 680 82 -688 -284 638 420 -610 -584
3851 -584 504 671 -400 -789 245 811 -107 -837 -71 796 234 -721 -390 613 522 -472 -629 305 719
3870 719 -106 -746 -69 752 249 -690 -402 626 559 -511 -628 417 720 -236 -739 118 773 70 -720
3889 -720 -190 697 386 -579 -489 473 634 -317 -715 162 780 35 -772 -198 740 387 -669 -530 534 644
3909 644 -397 -741 224 761 -72 -788 -138 719 274 -680 -438 531 526 -455 -649 267 686 -158 -744 -16
3929 -16 707 135 -727 -334 622 431 -571 -581 440 655 -305 -747 133 755 35 -757 -222 704 378 -609
3949 -609 -523 483 642 -317 -695 184 769 24 -718 -138 707 346 -603 -443 520 553 -383 -627 269 688
3969 688 -87 -682 -36 696 211 -632 -339 575 487 -466 -603 321 669 -165 -722 8 732 163 -701 -335
3989 -335 612 457 -527 -596 351 645 -234 -710 40 683 109 -662 -272 577 380 -523 -502 392 579 -303 -671
4010 -671 127 674 -18 -686 -130 656 244 -600 -367 517 493 -401 -584 248 652 -100 -673 -67 683 248
4030 248 -626 -392 566 544 -430 -627 305 697 -137 -695 17 697 135 -622 -251 556 397 -416 -471 319 567
4051 567 -169 -608 36 653 125 -635 -230 650 424 -550 -499 515 636 -346 -655 241 714 -71 -687 -70
4071 -70 675 266 -548 -400 442 542 -286 -603 144 669 7 -703 -154 683 268 -666 -408 569 447 -516
4091 -516 -537 367 533 -297 -606 110 562 -9 -581 -197 463 298 -456 -502 306 556 -223 -711 52 716 46
4112 46 -784 -217 717 314 -659 -420 519 453 -411 -521 238 524 -74 -510 -114 466 274 -389 -395 325 521
4133 521 -262 -608 188 688 -73 -743 -16 719 119 -690 -214 603 278 -503 -375 358 410 -223 -513 -31
4153 -31 464 148 -490 -373 408 475 -397 -627 285 673 -247 -780 90 705 -54 -723 -87 580 109 -538 -240
4174 -240 379 292 -273 -403 78 403 60 -477 -225 469 351 -502 -494 499 622 -436 -707 349 742 -237
4194 -237 -719 135 674 6 -570 -113 471 264 -305 -363 157 477 46 -504 -180 573 324 -587 -412 588
4214 588 527 -556 -586 492 634 -403 -603 313 581 -192 -540 64 487 126 -386 -286 266 424 -115 -538
4234 -538 -5 637 129 -704 -245 748 337 -740 -437 665 481 -561 -504 420 466 -309 -454 153 399 -4
4254 -4 -364 -180 253 336 -184 -469 93 556 -27 -676 -34 737 107 -789 -204 732 251 -675 -317 546 343
4275 343 -428 -363 267 389 -59 -357 -139 320 329 -232 -469 185 586 -104 -675 77 767 23 -756 -75 746
4296 746 168 -614 -157 559 235 -387 -219 297 299 -98 -301 -51 353 242 -314 -384 332 546 -290 -620 277
4317 277 730 -192 -755 134 741 -38 -664 -54 559 96 -443 -188 288 246 -151 -319 -51 356 203 -376
4337 -376 -340 382 435 -410 -541 391 595 -372 -657 294 664 -202 -619 109 551 -11 -461 -88 368 225 -212
4358 -212 -312 77 434 114 -468 -231 534 373 -534 -458 526 541 -479 -592 414 598 -313 -558 201 505
4378 505 -94 -436 -31 340 156 -255 -290 130 373 -30 -484 -77 546 160 -598 -262 609 318 -625 -412
4398 -412 550 434 -460 -461 329 425 -210 -425 58 351 63 -328 -245 218 348 -139 -464 45 534 31 -605
4419 -605 -108 602 164 -618 -229 550 260 -497 -322 374 316 -290 -344 135 324 -7 -344 -164 268 275 -270
4440 -270 -437 168 506 -122 -602 24 610 14 -634 -134 550 167 -508 -245 403 273 -291 -293 171 317 -14
4461 -14 -305 -107 313 217 -292 -335 264 417 -215 -482 184 537 -93 -550 43 537 48 -487 -103 431 178
4482 178 -327 -258 220 308 -110 -347 -28 359 133 -374 -272 332 357 -314 -442 253 468 -200 -511 108 491
4503 491 -40 -472 -75 412 135 -360 -219 275 290 -172 -348 54 399 52 -436 -162 447 267 -411 -345 382
4524 382 418 -303 -462 237 486 -120 -475 41 459 81 -395 -155 348 269 -245 -328 177 396 -80 -424 -10
4545 -10 445 113 -460 -204 428 270 -381 -328 320 385 -251 -409 146 417 -73 -421 -60 384 141 -360 -245
4566 -245 277 316 -219 -391 112 425 -36 -449 -64 441 131 -396 -222 352 288 -292 -340 208 371 -124 -387
4587 -387 19 383 71 -377 -175 316 250 -267 -321 179 373 -119 -403 30 414 60 -411 -149 364 203 -327
4608 -327 -298 239 331 -181 -378 73 370 17 -389 -114 356 188 -304 -269 243 317 -179 -369 96 392 -19
4629 -19 -403 -64 382 141 -345 -210 294 283 -228 -343 143 354 -71 -388 -19 381 118 -345 -196 318 271
4650 271 -263 -339 175 368 -106 -417 2 399 65 -401 -174 333 242 -312 -323 220 358 -147 -411 36 398
4671 398 28 -412 -134 378 210 -343 -290 272 342 -199 -389 107 403 -29 -409 -77 385 135 -358 -233 292
4692 292 298 -244 -343 151 378 -71 -390 -8 405 95 -376 -175 341 240 -289 -305 203 333 -152 -393 52
4713 52 373 29 -368 -109 323 196 -284 -280 208 329 -162 -376 62 372 -5 -392 -87 361 167 -327 -241
4734 -241 274 280 -213 -322 111 332 -56 -339 -42 334 135 -296 -207 260 266 -199 -328 132 376 -51 -385 -16
4756 -16 384 93 -348 -160 314 229 -260 -259 194 293 -102 -317 19 303 60 -289 -146 259 214 -225 -278 176
4778 176 329 -134 -374 48 369 0 -391 -83 341 115 -314 -183 246 211 -170 -268 83 297 7 -299 -105
4799 -105 287 182 -280 -263 256 319 -201 -368 146 398 -74 -387 18 370 42 -335 -99 295 169 -207 -235
4820 -235 130 266 -47 -305 -51 296 110 -327 -206 304 270 -315 -347 258 378 -204 -394 146 391 -58 -360
4841 -360 -9 314 85 -249 -160 187 229 -97 -274 18 321 68 -323 -114 359 200 -349 -238 350 294 -289
4862 -289 -306 258 309 -181 -292 123 277 -40 -255 -56 207 130 -147 -237 75 288 -31 -366 -46 382 96
4883 96 -431 -172 386 190 -371 -246 296 226 -250 -236 149 214 -89 -218 -23 172 100 -138 -190 91 260 -67
4905 -67 -321 14 374 17 -413 -64 427 109 -414 -124 359 159 -294 -158 247 188 -118 -176 27 182 83
4926 83 -156 -190 115 264 -75 -331 62 370 -35 -404 6 416 19 -387 -44 336 47 -299 -73 218 92
4947 92 -155 -132 50 128 46 -166 -150 158 226 -168 -311 152 362 -160 -436 122 431 -77 -430 36 378 -2
4969 -2 -319 -41 243 83 -163 -127 55 164 43 -187 -128 201 211 -226 -286 236 325 -248 -382 223 395 -202
4991 -202 -410 157 366 -125 -320 54 267 -2 -225 -85 131 137 -54 -218 -72 242 148 -301 -210 317 256 -324
5013 -324 -291 323 309 -282 -316 228 279 -182 -250 138 206 -67 -176 7 121 98 -66 -164 5 247 44 -286 -87
5036 -87 353 135 -363 -163 380 201 -355 -222 307 220 -251 -203 173 190 -97 -149 15 129 98 -84 -174 44
5058 44 223 9 -288 -40 317 68 -357 -90 344 97 -351 -125 305 118 -268 -128 190 122 -122 -120 35
5079 35 132 67 -110 -139 100 224 -60 -277 49 340 -7 -345 -13 358 42 -338 -61 304 91 -238 -91
5100 -91 197 94 -91 -108 33 128 57 -113 -131 132 189 -118 -239 123 291 -113 -314 81 354 -43 -339 17
5122 17 318 19 -283 -65 208 102 -143 -142 75 167 17 -183 -86 200 174 -189 -230 187 279 -169 -296 151 311
5145 311 -112 -308 82 291 -40 -251 -2 227 53 -170 -85 116 160 -55 -181 3 220 67 -240 -122 248
5166 248 174 -251 -229 225 236 -204 -261 145 256 -102 -241 34 206 10 -184 -67 116 122 -88 -163 31 205
5188 205 12 -227 -48 230 84 -247 -121 228 157 -223 -189 181 194 -146 -200 90 191 -44 -193 -37 158
5209 158 102 -142 -163 84 209 -57 -236 -9 241 34 -269 -85 233 108 -224 -144 178 140 -138 -157 90 154
5231 154 -40 -156 -22 155 65 -137 -105 113 143 -92 -186 59 206 -33 -236 -9 227 42 -230 -90 197
5252 197 123 -159 -156 110 161 -68 -180 10 166 46 -164 -95 152 126 -134 -175 85 191 -70 -215 19 218
5274 218 20 -213 -61 206 84 -186 -121 135 151 -109 -198 66 185 -16 -216 -46 200 101 -177 -150 157 190
5296 190 -120 -213 93 219 -31 -224 -27 216 62 -202 -102 172 127 -128 -159 99 177 -43 -182 2 186
5317 186 18 -175 -79 176 101 -156 -151 128 157 -107 -194 43 194 -18 -204 -28 195 78 -176 -133 148 144 -118
5340 -118 -176 56 180 -17 -201 -17 175 66 -179 -112 140 124 -127 -160 73 176 -48 -168 8 176 27
5361 27 -176 -75 154 99 -127 -132 92 166 -62 -177 13 175 31 -185 -66 169 96 -150 -136 98 158 -75 -172
5384 -172 33 166 6 -161 -44 146 82 -137 -106 91 117 -75 -151 36 158 2 -161 -29 149 54 -149 -99
5406 -99 129 115 -105 -131 70 163 -28 -162 -5 155 54 -142 -87 125 138 -102 -152 63 175 -21 -192 -25
5428 -25 178 46 -173 -85 148 104 -127 -143 95 136 -69 -166 18 165 20 -165 -69 151 99 -134 -135 104 161 -82
5452 -82 -188 40 193 -13 -198 -30 173 54 -176 -96 135 122 -101 -138 46 157 -6 -153 -35 156 72 -149
5474 -149 -105 134 142 -114 -159 88 171 -50 -181 20 170 3 -175 -41 139 58 -133 -101 78 128 -46 -149 9
5497 9 151 36 -167 -75 152 93 -165 -139 115 149 -105 -178 58 156 -34 -163 -13 162 36 -116 -87 87 93 -59
5521 -59 -119 24 141 10 -159 -44 163 81 -157 -111 146 124 -115 -135 109 145 -65 -127 23 129 15 -110 -51
5544 -51 78 95 -61 -116 24 142 8 -160 -31 181 68 -177 -86 159 87 -138 -111 119 106 -88 -119 38 96
5567 96 -8 -108 -44 94 78 -74 -117 45 152 -22 -172 13 192 27 -204 -51 188 72 -172 -92 159 106
5589 106 -122 -108 80 124 -6 -110 -20 112 69 -97 -120 79 156 -59 -175 38 197 -20 -213 -12 195 24
5611 24 -190 -40 164 55 -132 -78 90 76 -52 -113 -11 106 48 -111 -104 85 117 -102 -167 81 183 -62 -184
5634 -184 59 200 -27 -177 5 167 17 -129 -31 106 64 -60 -86 21 103 28 -95 -62 122 103 -117 -127 138
5657 138 151 -108 -164 103 184 -62 -171 46 141 -28 -125 -9 102 35 -66 -67 22 100 14 -116 -48 122 73 -141
5681 -141 -112 129 120 -140 -158 119 142 -93 -146 68 124 -43 -105 9 91 19 -52 -60 28 90 12 -108 -34 135 62 -143
5707 -143 -69 154 97 -143 -98 145 120 -110 -112 90 108 -51 -92 32 94 25 -66 -63 36 105 -21 -134 -6 152 33
5732 33 -166 -55 186 71 -181 -85 168 90 -154 -96 111 98 -82 -111 17 81 4 -97 -59 70 95 -50 -123 51
5756 51 152 -19 -179 11 182 7 -181 -19 175 47 -158 -56 127 70 -93 -84 58 81 -11 -91 -31 90 67
5779 67 -85 -94 79 131 -76 -163 48 159 -39 -188 22 157 -22 -160 -16 138 24 -106 -53 70 78 -43 -97
5802 -97 -14 95 37 -108 -82 101 105 -100 -124 92 152 -81 -157 55 150 -36 -146 9 143 21 -101 -45 79 75
5826 75 -51 -76 21 104 21 -122 -44 132 85 -107 -87 116 124 -81 -122 85 140 -50 -127 35 120 -12 -97 -27 77
5851 77 45 -61 -84 33 105 -2 -121 -33 129 56 -130 -80 134 104 -113 -116 92 122 -68 -121 41 101 -7 -107
5875 -107 -24 97 51 -64 -76 39 107 -35 -138 -2 140 25 -153 -47 140 67 -145 -90 116 107 -101 -115 69
5898 69 122 -30 -127 -18 123 43 -100 -72 81 101 -64 -129 37 144 -3 -153 -11 145 35 -146 -64 129 65
5921 65 -122 -95 84 99 -60 -124 19 119 6 -106 -48 112 80 -102 -99 85 130 -53 -148 21 146 -8 -140
5944 -140 -33 147 47 -124 -66 116 93 -72 -101 60 116 -18 -116 -16 108 40 -101 -79 95 107 -82 -123 37
5967 37 116 -43 -133 11 136 10 -135 -27 121 72 -86 -81 78 95 -57 -124 13 129 19 -110 -52 103 66
5990 66 -86 -93 62 109 -65 -125 24 106 1 -122 -31 94 47 -99 -68 79 76 -75 -106 23 111 -13 -123 -25 100
6015 100 55 -103 -66 87 81 -78 -118 54 118 -25 -127 -9 121 37 -111 -73 95 87 -77 -96 61 127 -31 -116
6039 -116 11 118 29 -119 -53 110 68 -86 -104 71 116 -48 -133 22 126 2 -130 -31 122 55 -103 -93 79
6062 79 104 -57 -132 23 121 -7 -134 -43 117 55 -123 -88 90 98 -79 -112 50 121 -28 -133 -22 120 15 -117
6086 -117 -63 91 74 -84 -101 56 109 -43 -121 5 128 17 -120 -60 116 70 -105 -108 75 100 -52 -138 23 121
6110 121 -8 -133 -38 114 48 -102 -85 81 91 -62 -123 26 116 -17 -125 -16 121 20 -111 -65 89 83 -77
6133 -77 -107 55 111 -26 -122 1 110 36 -108 -54 101 76 -75 -93 56 120 -26 -107 7 124 31 -109 -38 104
6157 104 66 -72 -97 65 108 -33 -102 14 110 18 -112 -49 92 55 -100 -90 71 98 -60 -121 20 131 -10 -130
6181 -130 -34 108 36 -99 -72 85 102 -69 -105 31 113 -5 -127 -19 134 52 -110 -71 93 97 -84 -113 60 109
6205 109 -47 -122 12 122 22 -116 -32 103 84 -85 -77 67 104 -32 -127 28 138 0 -134 -44 117 66 -115
6228 -115 -89 87 103 -63 -116 37 113 -8 -117 -24 106 47 -96 -78 65 105 -65 -109 33 121 -22 -147 -5
6251 -5 137 40 -125 -62 101 62 -108 -80 72 99 -43 -118 7 99 16 -107 -58 94 77 -90 -100 61 131 -49 -141
6276 -141 24 137 6 -133 -27 127 36 -117 -66 81 80 -65 -104 15 84 -2 -97 -38 84 56 -87 -92 77 99
6300 99 -65 -125 53 127 -38 -145 -7 112 10 -116 -40 99 50 -56 -82 31 93 -3 -97 -17 102 56 -91 -69
6324 -69 94 89 -82 -122 65 118 -51 -118 31 117 -4 -103 -7 91 36 -98 -60 67 82 -37 -113 2 104 20 -135
6349 -135 -59 105 72 -124 -100 103 113 -82 -122 56 119 -29 -116 0 108 22 -99 -63 71 77 -54 -102 28 121
6373 121 2 -123 -12 148 42 -125 -63 132 87 -105 -98 87 112 -66 -109 36 115 -8 -91 -16 86 58 -69
6396 -69 -85 45 104 -34 -131 3 131 -2 -149 -40 130 30 -125 -76 100 70 -79 -92 59 86 -35 -99 -6
6419 -6 83 29 -78 -68 57 88 -53 -121 49 118 -24 -142 7 162 28 -128 -23 127 53 -86 -50 78 80 -28
6443 -28 -74 23 96 31 -83 -47 89 84 -65 -98 63 122 -44 -123 40 126 -14 -119 8 105 22 -104 -38 69 51
6468 51 -51 -78 28 74 -4 -85 -26 84 55 -80 -93 80 112 -84 -126 54 117 -52 -130 17 110 -10 -105 -27 70
6493 70 40 -57 -63 54 83 -18 -90 -5 101 30 -106 -67 96 75 -96 -98 85 111 -78 -112 52 119 -15 -119 7
6518 7 111 33 -81 -51 68 74 -47 -105 13 96 9 -111 -30 101 57 -97 -74 107 84 -84 -102 57 113 -42 -101
6543 -101 23 92 1 -96 -35 68 64 -53 -95 31 99 -17 -121 -11 126 24 -132 -52 114 63 -98 -80 81 90
6567 90 -70 -97 33 103 -7 -97 -15 90 40 -79 -65 62 87 -59 -112 28 108 0 -127 -11 122 47 -118 -53
6591 -53 105 59 -92 -83 56 76 -36 -88 -2 84 18 -81 -49 73 64 -66 -93 39 99 -32 -109 3 114 13 -105
6616 -105 -27 92 45 -91 -65 66 71 -45 -79 22 89 3 -86 -32 74 62 -69 -75 57 88 -51 -108 31 104 -18
6641 -18 -106 -8 101 26 -99 -41 72 53 -53 -82 31 85 -16 -92 -11 97 31 -74 -42 83 68 -69 -96 46 81
6666 81 -43 -113 12 106 2 -104 -41 79 39 -76 -60 63 81 -32 -98 -2 91 3 -97 -34 96 34 -86 -67 55
6691 55 82 -69 -103 28 103 -14 -101 -9 89 28 -84 -61 63 60 -73 -92 28 87 -18 -102 -10 111 40 -106 -38 91
6717 91 55 -79 -80 57 87 -31 -107 16 96 -5 -91 -26 94 46 -74 -60 69 77 -34 -90 26 96 3 -97 -19 99
6743 99 39 -85 -59 56 68 -63 -71 40 83 -16 -102 8 86 38 -85 -38 63 62 -57 -73 43 89 -29 -82 -4 91
6769 91 15 -86 -38 87 58 -75 -69 49 73 -44 -87 10 85 -4 -88 -32 75 31 -78 -74 46 79 -49 -91 10 95
6795 95 -7 -103 -31 80 43 -92 -64 66 53 -54 -84 37 83 -25 -95 -25 70 44 -80 -63 74 81 -46 -90 44
6820 44 83 -27 -90 11 94 29 -93 -35 80 50 -71 -72 46 76 -34 -96 -3 92 1 -93 -42 79 56 -78 -55 60
6846 60 83 -54 -94 23 96 2 -88 -15 77 31 -79 -64 69 59 -31 -89 22 97 -13 -92 -21 98 38 -98 -48 76
6872 76 70 -65 -76 46 86 -24 -91 9 88 9 -80 -29 72 52 -56 -73 48 79 -29 -92 -1 83 4 -106 -37 89
6898 89 42 -82 -66 71 62 -59 -89 26 79 -16 -89 -17 72 26 -80 -49 51 55 -53 -86 22 91 -18 -97 -10 80 26
6925 26 -86 -38 82 52 -64 -52 54 70 -19 -68 9 84 12 -73 -24 72 50 -54 -62 54 86 -30 -90 18 111 6
6951 6 -89 -15 82 36 -82 -47 57 46 -47 -80 28 63 -3 -80 -22 64 37 -88 -74 62 70 -61 -92 26 82 -23 -95
6978 -95 2 89 -1 -92 -30 74 47 -60 -66 28 53 -17 -77 -9 76 28 -90 -54 77 59 -65 -81 48 85 -30 -111 26
7005 26 93 -21 -85 -12 77 23 -70 -36 47 67 -41 -68 29 76 4 -79 -33 85 37 -94 -68 67 68 -80 -91 51 85
7032 85 -36 -94 10 75 -6 -70 -23 63 45 -61 -64 24 74 -25 -101 -11 94 34 -109 -29 97 53 -86 -51 72 77 -66
7059 -66 -79 24 87 -16 -73 -7 62 27 -48 -55 40 57 -31 -81 6 92 -1 -105 -22 99 23 -94 -51 74 45 -82 -64
7086 -64 42 44 -39 -68 5 51 4 -60 -50 55 48 -37 -72 33 75 -35 -110 9 101 5 -115 -12 99 34 -78 -32 67
7113 67 59 -36 -57 24 75 -1 -62 -27 71 49 -60 -61 54 78 -47 -96 28 104 -23 -91 12 99 3 -85 -26 66 31 -61
7141 -61 -46 32 53 -9 -75 -13 70 25 -81 -54 68 64 -74 -84 53 82 -48 -100 20 83 -18 -89 -4 78 23 -69 -46
7168 -46 59 58 -35 -60 18 77 15 -73 -24 81 41 -87 -61 77 64 -67 -82 46 83 -36 -80 15 75 9 -77 -31 60
7195 60 27 -49 -57 24 75 -12 -100 -3 84 21 -91 -37 81 45 -83 -66 76 65 -45 -67 30 75 -7 -65 -1 62 43 -48
7223 -48 -37 45 49 -43 -78 24 88 13 -85 4 93 26 -68 -33 81 42 -58 -66 47 60 -25 -65 3 64 19 -53 -33 56 64 -40
7253 -40 -69 32 83 -17 -96 11 87 -5 -88 -11 74 26 -81 -42 50 51 -46 -52 23 63 -1 -63 -18 53 38 -59 -60 45 60
7282 60 -52 -88 30 90 -16 -85 1 85 25 -70 -35 57 40 -48 -59 27 67 -9 -67 -6 73 23 -69 -39 58 50 -55 -65 48
7311 48 65 -35 -80 28 87 2 -78 -2 76 31 -69 -48 44 54 -31 -77 21 70 4 -63 -27 84 45 -57 -44 66 64 -52
7339 -52 -64 29 68 -31 -75 5 74 4 -72 -24 60 41 -49 -46 52 68 -14 -66 0 76 17 -75 -24 72 40 -59 -57 59 60 -39 -63
7370 -63 22 67 4 -62 -5 62 34 -57 -48 44 38 -30 -58 10 63 -13 -66 -6 68 22 -68 -36 56 27 -65 -65 42 65 -37 -73 5
7401 5 56 5 -66 -31 59 32 -54 -55 44 66 -25 -58 12 76 7 -72 -11 72 30 -62 -37 48 47 -32 -50 15 63 -9 -72 -7 74 25
7433 25 -58 -41 58 57 -27 -58 23 62 -19 -71 -5 73 12 -58 -30 51 47 -53 -42 38 62 -10 -55 5 72 20 -56 -12 56 42 -51
7464 -51 -45 41 59 -24 -55 12 63 10 -53 -17 69 14 -53 -42 59 49 -36 -58 16 70 -2 -74 -15 64 27 -62 -41 47 39 -39 -63
7495 -63 21 57 -9 -64 8 55 6 -65 -32 64 31 -54 -42 39 61 -25 -64 10 67 4 -71 -10 64 38 -48 -46 43 50 -37 -65 22
7526 22 74 -5 -58 -8 65 37 -49 -39 50 47 -25 -44 19 50 -5 -65 -2 59 21 -56 -32 51 32 -36 -37 32 53 -10 -54 10 52
7557 52 4 -49 -5 47 24 -34 -51 31 59 -24 -57 9 54 4 -59 -14 64 36 -52 -40 32 49 -47 -64 11 46 -7 -64 -10 61
7587 61 22 -44 -23 39 33 -45 -47 13 48 -9 -57 1 67 -3 -71 -26 48 33 -42 -39 45 55 -12 -49 15 60 7 -50 -12 60 44 -41
7619 -41 -46 39 49 -18 -61 26 58 -7 -49 -6 58 19 -48 -29 52 41 -37 -44 19 57 1 -69 -11 43 4 -55 -33 49 31 -55 -53 25
7651 25 55 -24 -53 20 61 12 -57 -18 44 25 -54 -33 26 48 -33 -57 13 57 -3 -53 -12 72 29 -52 -32 39 47 -38 -39 28 45
7682 45 -22 -50 0 54 19 -44 -27 45 40 -38 -48 13 60 -14 -58 -3 57 0 -68 -28 56 25 -63 -47 28 33 -25 -46 16 47 -3
7713 -3 -35 -14 58 23 -45 -40 47 49 -32 -56 15 62 -12 -54 11 62 14 -53 -6 48 41 -26 -40 22 41 -10 -40 -15 50 28 -49 -33
7745 -33 40 53 -43 -52 33 59 -18 -53 23 69 -6 -57 -7 34 16 -32 -36 24 43 -18 -44 -12 42 8 -47 -20 57 33 -51 -36 39
7776 39 47 -26 -39 30 59 -17 -50 9 62 5 -37 -23 39 31 -25 -35 15 60 3 -61 -1 57 20 -52 -26 62 36 -57 -42 39 44 -15
7808 -15 -55 21 54 -6 -48 -5 45 15 -41 -40 17 38 -22 -57 4 54 -20 -58 -18 58 23 -61 -30 55 48 -35 -37 26 47 -20 -52 -2
7840 -2 51 14 -34 -18 44 39 -22 -45 30 64 -5 -68 8 67 12 -63 -18 58 18 -53 -27 38 25 -30 -48 6 24 -16 -56 -21 39
7871 39 28 -34 -44 34 42 -20 -48 8 57 -17 -76 -8 51 15 -60 -24 33 13 -31 -33 14 31 -8 -40 -13 43 14 -42 -44 33 47 -47
7903 -47 -53 38 62 -24 -53 15 59 0 -46 1 58 31 -27 -12 29 28 -3 -40 1 46 7 -54 -37 61 27 -39 -41 38 45 -33 -47 26
7935 26 61 -8 -51 2 36 9 -27 -29 28 28 -20 -39 5 36 -12 -53 -5 53 14 -51 -16 50 37 -40 -39 39 44 -36 -52 20 44 -6
7967 -6 -55 -2 47 26 -23 -24 34 52 -11 -47 9 52 2 -48 -13 59 31 -47 -25 38 24 -31 -43 18 26 -6 -46 -4 42 7 -44 -37
7999 -37 21 34 -27 -45 13 45 -21 -63 -1 51 -4 -59 -15 49 29 -50 -25 35 43 -6 -32 10 42 4 -34 -13 48 21 -29 -25 44
8030 44 54 -11 -44 24 55 -13 -58 2 64 12 -37 -9 39 27 -24 -28 23 49 9 -48 -6 47 35 -27 -20 45 34 -31 -45 9 40
8061 40 -27 -52 8 43 -3 -46 -15 47 24 -31 -34 22 28 -13 -44 3 34 6 -44 -26 37 21 -42 -36 35 46 -13 -42 18 46 -2 -44
8093 -44 -7 35 21 -32 -24 32 34 -28 -36 23 46 -9 -51 -5 35 21 -46 -17 46 38 -33 -35 33 40 -15 -38 13 45 -7 -39 -18 38 30 -28
8127 -28 -41 39 26 -10 -53 -7 50 -1 -39 -9 51 16 -42 -33 38 32 -19 -47 6 32 6 -32 1 43 9 -38 -18 36 25 -24 -45
8158 -45 15 46 5 -40 9 51 -1 -58 -17 33 26 -29 -28 24 46 -16 -40 12 46 -3 -51 -5 27 10 -36 -33 22 28 -31 -32 15 41 -10
8191a0
$$ Imaginary data points
##PAGE= N=2
##DATA TABLE= (X++(I..I)), XYDATA
0 0 0 0 0 0 0 0 0 0 -8 8 -8 8 -8 14 -16 16 -24 24 -32 38 -41 49 -57 65 -74 89 -98 113 -129 145 -163 184
32 184 -206 231 -257 288 -319 354 -394 435 -483 533 -590 654 -725 805 -894 996 -1112 1247
50 1247 -1408 1598 -1831 2126 -2510 3029 -3786 4985 -7182 12540 -51883 -29355 85533 -15724
64 -15724 -97982 -39236 48702 -3379 -69082 -34596 38423 18005 -47910 -57586 9332 47838
76 47838 207 -65218 -29356 56751 45269 -52557 -54835 46961 65213 -34622 -56745 39197
88 39197 63700 -33463 -61979 35317 79941 -6030 -67012 -7427 63571 39854 -23605 -29740
100 -29740 18446 40146 1231 -30955 8303 54567 11291 -57541 -18284 72613 48405 -53557
112 -53557 -48100 50709 58105 -30987 -46104 29037 45384 -18869 -38098 14125 36963 -3508
124 -3508 -33513 -7454 32678 26442 -22829 -42206 8700 53097 9286 -52085 -19416 47171
136 47171 21011 -44426 -16629 51892 23491 -51660 -30508 49140 45591 -26396 -41427 11074
148 11074 36824 6999 -20899 -8795 19166 19032 -11846 -21775 15244 37108 -5114 -39896 4131
161 4131 50573 8305 -47351 -10825 50238 23268 -37176 -21032 32496 24786 -18757 -15465 20641
174 20641 21761 -11043 -22702 5076 32798 17263 -25496 -29932 18138 40954 -4137 -37883
186 -37883 1504 37353 -1417 -39228 445 42717 5048 -43533 -15443 34395 19139 -26379
198 -26379 -23984 12810 20226 -8014 -24916 -5872 19478 9894 -22322 -21593 15546 21570 -20198
211 -20198 -31619 15852 34861 -16311 -45937 2462 41781 3784 -38404 -12592 26405 10280
223 10280 -23269 -12638 19855 17510 -15260 -25898 4141 30523 10125 -27506 -19296 23282
235 23282 25476 -17402 -25177 18705 31397 -13018 -31358 11307 35664 -1578 -29998 -296
247 -296 29852 7761 -23977 -10707 22674 20838 -11907 -22892 5132 26612 5105 -23315 -7334
260 -7334 25907 12831 -27142 -18726 28316 28559 -21912 -33718 13311 34311 -4762 -30493 161
273 161 27749 3575 -27064 -10525 23976 17932 -18560 -25128 9285 26937 -2871 -28644 -3375
286 -3375 29012 8053 -30881 -15920 28310 21799 -24086 -26244 17826 27086 -13726 -28897 8893
299 8893 31275 -1793 -32745 -8285 29816 17517 -23261 -23024 16858 26229 -11924 -29300 7576
312 7576 33766 -391 -36243 -8839 34400 16878 -29251 -21534 23996 24442 -19517 -27455 14746
325 14746 31445 -6985 -33175 -2148 31306 9623 -28071 -15312 24890 20154 -22507 -26576
337 -26576 17940 32792 -10304 -36149 1356 35404 5268 -34058 -11260 31951 16428 -30729
349 -30729 -24454 25283 30886 -17309 -34604 8050 34368 -1192 -33994 -5357 33036 11525
361 11525 -32537 -20437 27417 26791 -20814 -30937 13237 31864 -7790 -33236 1919 34315
373 34315 4881 -34755 -14149 30439 20694 -25116 -25723 18641 28014 -14097 -31547 7969 34350
386 34350 -258 -35465 -9243 32023 15983 -27635 -21178 22463 24312 -18674 -28794 12787
398 12787 32308 -4943 -33203 -3341 30955 9892 -27229 -14068 24494 18554 -21301 -23359
410 -23359 16718 28189 -8996 -29212 2300 28896 4296 -26211 -7798 26098 14159 -23004
422 -23004 -19255 19494 25341 -11691 -26501 5929 27329 411 -25688 -3989 26622 11095
434 11095 -23577 -16256 20238 22128 -12998 -23297 7845 24041 -2990 -24121 -1258 24842
446 24842 7400 -23140 -13129 19538 17757 -14085 -19505 9535 20107 -6457 -22240 1180
458 1180 22435 3840 -22368 -10845 18032 14344 -14337 -17356 9909 18319 -7752 -22073 1540
471 1540 21812 2432 -23006 -10102 17880 11821 -16102 -15653 11540 16247 -9930 -20579 3024
484 3024 19641 626 -21047 -8605 15445 9370 -15411 -14411 11261 15711 -10390 -21035 4022
497 4022 21209 -263 -22555 -6490 18148 7158 -18416 -11786 14826 13514 -13238 -18100 7300
510 7300 19174 -2047 -19469 -3763 17258 6827 -17019 -11739 14726 15459 -12378 -19512 7967
523 7967 21504 -2962 -20651 384 20870 3229 -19819 -6363 19031 11470 -14786 -14452 10155
536 10155 16882 -3643 -15218 1395 16922 3533 -16253 -6517 17776 13014 -14890 -16693 11935
549 11935 19783 -7197 -19251 5213 20334 -1257 -19087 -1264 18908 6171 -15485 -9232
561 -9232 11962 11886 -8015 -13913 4339 16370 559 -17666 -5668 17725 10867 -15464 -13654
574 -13654 13336 14996 -12098 -16587 10647 18651 -7669 -20234 2673 19635 3119 -15951 -6861
587 -6861 11942 9476 -8237 -11478 5484 14365 -2053 -17170 -2133 19235 7103 -19181 -10908
600 -10908 18492 14409 -16327 -16635 13512 18045 -9584 -17805 5714 16556 -2176 -15060 -1102
613 -1102 14235 5781 -12603 -11363 9310 16773 -3835 -19605 -1513 20186 5435 -19461 -7061
626 -7061 19828 9026 -19940 -11425 19314 14994 -15716 -16977 10895 17759 -4862 -16175 27
639 27 14718 5240 -12031 -9090 10279 13457 -7851 -16780 6383 21118 -3445 -24293 125
652 125 27049 5560 -25526 -9208 22653 11867 -17844 -11354 15257 12081 -12252 -13455 8861
665 8861 16808 -1539 -17301 -5809 16366 13446 -12198 -17121 9645 20144 -7175 -21634 6419
678 6419 24348 -3838 -25128 1859 26216 2453 -23929 -5235 21805 9846 -16103 -11999
690 -11999 10591 13991 -3575 -12979 -326 13811 4696 -14191 -7557 17473 14322 -17019 -19813
703 -19813 15046 24810 -9230 -24183 5710 22309 -3045 -18820 3358 18763 -378 -17078
715 -17078 -3076 15331 9135 -9428 -12485 3717 15021 2501 -15158 -6222 16162 10140 -15827
728 -15827 -12059 16613 14737 -15961 -16120 15694 18509 -13149 -19795 9119 19998 -2891 -16509
741 -16509 -1739 12074 5226 -7046 -6199 5020 8793 -3463 -12789 1181 17680 3659 -20255
754 -20255 -9173 19502 12930 -16577 -13716 13672 12309 -12518 -11725 10819 11146 -9223 -12365 4378
768 4378 11283 131 -10383 -6391 6579 10185 -3658 -14137 -809 14717 2271 -16390 -4365
781 -4365 16252 4074 -18420 -6528 18046 8428 -17044 -11901 11692 11767 -6924 -11068 1169
794 1169 7359 968 -6411 -4280 5009 6394 -6023 -11499 4326 14890 -2997 -18860 -1095 18785
808 18785 2938 -18754 -5595 15769 5191 -14570 -6116 11860 5716 -10806 -8195 6724 9276
821 9276 -2787 -11504 -4392 9687 8939 -8261 -13516 4658 13987 -4379 -15872 3103 16118
834 16118 -3668 -18770 677 18087 1322 -17372 -5150 12892 5964 -9550 -7410 4869
846 4869 6842 -2281 -8038 -1499 8132 3895 -9714 -7706 10050 10895 -10258 -14583 8542 16770
860 16770 -5978 -17272 3069 15763 -1249 -13714 333 12450 1338 -11057 -3758 9459
872 9459 7910 -4997 -10157 481 11496 4502 -10315 -6685 10238 8811 -9587 -9448 10579 12069
886 12069 -9008 -12778 8084 14323 -4712 -13151 2726 12722 842 -10160 -2894 8580 6279
899 6279 -4912 -7308 3274 9895 -202 -10908 -1379 13416 5079 -13732 -8046 13354 11362
912 11362 -10236 -11758 8057 11888 -5287 -10513 4066 10665 -1375 -10155 -1797 9166 5602
925 5602 -6652 -8335 3984 10364 -1174 -11202 -538 12407 2584 -12975 -4487 13046 6401
938 6401 -12444 -8199 11037 9646 -9079 -10931 6338 11832 -2676 -11657 -1130 10399 4195
951 4195 -9024 -7029 7313 9140 -6156 -11844 4048 13931 -1304 -15049 -1814 14650 4268
964 4268 -13486 -6127 11857 7286 -10458 -8832 8421 10242 -5696 -11191 2721 11772 621
977 621 -11557 -3626 11207 6741 -10246 -9687 8583 12071 -6340 -13535 4106 14497 -1622 -14733
991 -14733 -826 14635 3775 -13472 -6726 11130 8909 -8211 -10278 5208 10941 -2514 -11416
1004 -11416 -113 11771 3007 -11563 -5942 10465 8204 -9009 -9999 7280 11198 -5523 -12204
1017 -12204 3496 12932 -872 -12833 -1793 12023 4247 -10739 -6490 9114 8597 -7037 -10474
1030 -10474 4499 11955 -1239 -12167 -1643 11776 4252 -10777 -6302 9605 8213 -8002 -9863
1043 -9863 5894 11050 -3118 -11122 752 10794 1471 -10075 -3441 9231 5360 -8190 -7484
1056 -7484 6317 8936 -4211 -9903 2012 10268 40 -10488 -2306 10118 4473 -9420 -7019
1069 -7019 7415 8445 -5402 -9568 3019 9912 -829 -10050 -1545 9644 3900 -8659 -6189
1082 -6189 6745 7495 -4921 -8436 2966 8863 -1164 -9090 -683 9119 2886 -8320 -4693 7144
1096 7144 6118 -5781 -7247 4355 8204 -2760 -9032 817 9555 1649 -9084 -3698 8299 5607
1110 5607 -6968 -7107 5550 8456 -3678 -9531 1348 9935 1243 -9378 -3327 8539 5268 -7138
1124 -7138 -6589 5896 8015 -4034 -8908 2028 9360 222 -8941 -1915 8574 3790 -7555 -4994
1138 -4994 7008 6954 -5224 -7921 3734 9078 -1347 -8984 -262 9260 2548 -8502 -4101 8162
1152 8162 6602 -6121 -7673 4628 9102 -1995 -9031 284 9313 1989 -8699 -3785 8092 5928
1166 5928 -6394 -7064 4933 8160 -2914 -8314 1478 8635 241 -8618 -2140 8016 3836 -7135
1180 -7135 -5499 5695 6547 -4332 -7526 2792 8349 -1046 -9041 -1275 8791 3182 -8384 -5331
1194 -5331 6936 6530 -5775 -7799 4114 8606 -2201 -9019 -65 8616 2025 -7931 -4076 6321
1208 6321 5113 -5339 -6708 3490 7423 -1932 -8249 -166 8103 1655 -8057 -3447 7095 4187
1222 4187 -7014 -6099 5365 6632 -4336 -7883 1959 7577 -363 -7614 -1866 6596 3110 -6397
1236 -6397 -5594 4559 6587 -3611 -8538 1036 8552 325 -9085 -2429 8319 3512 -7997 -5250
1250 -5250 6394 5787 -5356 -6882 3205 6764 -1721 -7042 -254 6882 2302 -6319 -4209 5595
1264 5595 6132 -4271 -7382 3159 8537 -1816 -9212 668 9982 1166 -9777 -2701 9340 4631
1278 4631 -7724 -5772 5996 6703 -3882 -7218 1670 7436 583 -7386 -2855 7040 5000 -6331
1292 -6331 -6846 5478 8516 -4130 -9517 2755 10095 -1131 -9784 -35 9370 1294 -8522 -2375
1306 -2375 7710 3930 -6157 -5326 4282 6710 -1651 -7248 -673 7564 2899 -7487 -4746 7378
1320 7378 6456 -6983 -7989 6223 9213 -4838 -9614 3562 9850 -1636 -9020 99 8092 1715
1334 1715 -6402 -3082 4729 4313 -2938 -5221 1642 6662 198 -7669 -1931 8647 4108 -8599 -5872
1349 -5872 7797 6653 -7025 -7048 6209 7220 -5274 -7386 4033 7734 -1626 -6991 -674 5774
1363 5774 2926 -3970 -4592 2270 5950 -673 -6891 -471 8093 2092 -8333 -2987 8625 4007 -8358
1378 -8358 -4885 7420 5191 -6420 -5775 4282 5199 -2518 -4587 594 3543 703 -3285 -2692 2580
1393 2580 4247 -2553 -7020 843 8245 347 -9194 -1894 8803 2457 -8303 -2685 7697 2767
1407 2767 -7193 -3517 5708 3951 -3847 -4363 1361 4183 1222 -3374 -3081 2955 5055 -2124 -6261
1422 -6261 1874 7601 -1337 -8347 1152 9317 -209 -9160 -225 9314 1816 -7595 -2240 6188 3067
1437 3067 -3839 -2963 2194 3371 -261 -3639 -1402 4521 3814 -4659 -5995 4501 7918 -3714 -9073
1452 -9073 2541 8947 -2097 -8791 1438 8003 -1206 -7601 231 6543 830 -5330 -2511 3010
1466 3010 3372 -940 -4317 -1533 4400 3063 -4807 -4402 5240 5527 -5662 -6642 5765 7620 -5314
1481 -5314 -8215 4250 8122 -2847 -7247 1638 6231 -106 -4518 -810 3355 2267 -1798 -3427
1495 -3427 562 4928 1029 -6127 -2556 7171 4440 -7028 -5375 6815 6056 -5988 -5801 5539
1509 5539 5529 -5018 -5539 3976 5507 -2215 -5021 99 4018 2084 -2327 -3578 840 4606 177
1524 177 -5707 -1124 6576 1779 -7544 -2811 7850 3759 -7481 -4351 6662 4652 -5411 -4660
1538 -4660 3777 4153 -2286 -3774 482 2994 1047 -2439 -2629 2016 4317 -1421 -6000 535 7253
1553 7253 517 -7961 -1701 7643 2138 -7238 -2398 6659 2523 -6034 -2973 5012 3629 -3307 -4115
1568 -4115 1033 3911 972 -3542 -2874 2906 4207 -2579 -5497 2269 6696 -1744 -7585 1065 8081
1583 8081 -209 -8063 -732 7513 1570 -6562 -2384 5204 3066 -3510 -3405 1971 3835 -278 -4090
1598 -4090 -1287 4462 3033 -4573 -4809 4226 6198 -3529 -7092 2650 7348 -1881 -7286 1199 7067
1613 7067 -406 -6708 -740 5832 1824 -4735 -3135 3021 3851 -1474 -4577 -241 4898 1653 -5188
1628 -5188 -3021 5224 4142 -5190 -5282 4647 5934 -4099 -6608 2948 6635 -1788 -6333 542 5726
1643 5726 704 -4834 -1785 3948 2905 -2952 -4051 1725 4990 -427 -5664 -870 6062 2220 -5894
1658 -5894 -3097 5759 4068 -5102 -4621 4384 5058 -3417 -5308 2223 5337 -834 -5007 -501 4607
1673 4607 2052 -3662 -3196 2750 4189 -1722 -4924 669 5358 227 -5697 -1227 5724 2281 -5255
1688 -5255 -3026 4635 3699 -3619 -4004 2616 4178 -1551 -4263 359 4174 941 -3775 -2042 3397
1703 3397 3259 -2568 -3970 1943 4758 -970 -5134 79 5314 933 -5053 -1759 4667 2603 -3888
1718 -3888 -3138 3158 3782 -2074 -4134 877 4256 306 -4155 -1504 3749 2430 -3324 -3310 2745 4004
1734 4004 -2080 -4622 1148 4849 -303 -4993 -770 4622 1513 -4362 -2498 3623 3184 -2919 -3940
1749 -3940 1810 4290 -760 -4542 -418 4446 1435 -4270 -2518 3754 3401 -3082 -4151 2152 4548
1764 4548 -1185 -4722 250 4706 741 -4440 -1620 4084 2574 -3385 -3275 2636 3828 -1758 -4194
1779 -4194 882 4446 99 -4468 -1022 4376 2069 -3929 -2877 3342 3600 -2631 -4211 1697 4527
1794 4527 -780 -4772 -354 4637 1405 -4278 -2364 3699 3130 -3025 -3827 2094 4172 -1266 -4532
1809 -4532 149 4442 776 -4212 -1650 3821 2452 -3270 -3109 2620 3653 -1855 -4126 875 4233
1824 4233 -6 -4234 -911 4058 1835 -3630 -2591 3112 3378 -2289 -3896 1327 4135 -405 -4215
1839 -4215 -608 4047 1537 -3624 -2335 3111 3119 -2265 -3563 1431 3824 -579 -3896 -311 3773 1115
1855 1115 -3496 -1858 3135 2630 -2440 -3068 1857 3525 -1068 -3738 308 3887 517 -3827 -1371
1870 -1371 3589 2252 -3023 -2844 2456 3466 -1603 -3824 743 4013 215 -4013 -1278 3690 2137
1885 2137 -3211 -2956 2543 3498 -1826 -3953 961 4092 -203 -4232 -795 3880 1429 -3624 -2235
1900 -2235 2997 2729 -2460 -3322 1584 3612 -811 -3944 -268 3849 1083 -3809 -2087 3411 2858 -2960
1916 -2960 -3589 2281 4135 -1458 -4421 550 4445 359 -4216 -1207 3822 2055 -3110 -2621 2459
1931 2459 3322 -1413 -3540 624 3868 410 -3815 -1178 3818 2103 -3432 -2647 3210 3353 -2571 -3609
1947 -3609 2135 4008 -1338 -4106 559 4062 377 -3783 -1294 3284 2200 -2546 -2905 1814 3575
1962 3575 -903 -4033 -43 4258 931 -4301 -1797 4035 2475 -3636 -2976 3087 3357 -2336 -3480
1977 -3480 1554 3445 -700 -3219 -155 2894 938 -2555 -1771 2119 2644 -1495 -3325 809 3862
1992 3862 -76 -4098 -583 4146 1089 -4156 -1700 3841 2184 -3355 -2673 2508 2883 -1547 -2918
2007 -2918 452 2637 441 -2449 -1501 1975 2237 -1674 -3132 1047 3579 -657 -4014 109 4066
2022 4066 189 -4215 -764 3865 1050 -3567 -1546 2783 1664 -2145 -1945 1259 2063 -454 -2379
2037 -2379 -678 2428 1743 -2377 -2897 1951 3567 -1576 -4078 1117 4239 -807 -4399 324 4270
2052 4270 174 -3944 -837 3170 1280 -2289 -1643 1257 1800 -368 -2029 -564 2169 1413 -2336 -2273
2068 -2273 2345 2956 -2308 -3518 2157 3905 -1889 -4128 1459 4131 -866 -3794 303 3290 332
2083 332 -2547 -833 1881 1541 -966 -2114 124 2822 1072 -3042 -1934 3217 2796 -2963 -3051 2959
2099 2959 3376 -2696 -3324 2632 3530 -2026 -3314 1486 3111 -568 -2431 -97 1876 918 -1130 -1515
2115 -1515 643 2391 60 -3015 -608 3694 1343 -3979 -1872 4147 2407 -3948 -2675 3580 2872
2130 2872 -2896 -2758 2174 2541 -1286 -2132 475 1757 429 -1348 -1364 901 2304 -328 -3050 -267
2146 -267 3548 769 -3718 -999 3799 1060 -3883 -1178 3823 1372 -3560 -1700 2813 1822 -1869
2161 -1869 -1786 783 1514 100 -1358 -1086 1113 1888 -1080 -2922 716 3552 -476 -4146 -35 4180
2177 4180 209 -4224 -611 3767 645 -3421 -1009 2519 906 -1918 -1152 938 1074 -301 -1438
2192 -1438 -791 1476 1650 -1686 -2729 1398 3256 -1338 -3750 1066 3798 -1092 -4021 817 3964
2207 3964 -448 -3766 -218 3091 747 -2198 -1206 1131 1392 -231 -1629 -629 1860 1428 -2069 -2198
2223 -2198 2187 2893 -2096 -3329 1945 3581 -1703 -3603 1411 3506 -983 -3191 584 2787 -35
2238 -35 -2195 -438 1665 1087 -991 -1700 298 2380 614 -2759 -1392 3039 2153 -2929 -2462 2970
2254 2970 2834 -2712 -2890 2557 3133 -1946 -2996 1358 2851 -434 -2209 -145 1775 908 -1087 -1343
2270 -1343 769 2103 -163 -2558 -191 3158 829 -3325 -1183 3514 1655 -3314 -1875 3108 2157
2285 2157 -2592 -2194 2005 2219 -1286 -2120 488 1921 316 -1696 -1222 1276 1941 -867 -2620 273
2301 273 2935 86 -3214 -530 3164 699 -3200 -1025 2923 1186 -2660 -1511 2050 1586 -1444
2316 -1444 -1683 676 1613 -8 -1564 -669 1492 1333 -1391 -1995 1237 2582 -932 -2999 547 3244
2332 3244 -117 -3213 -253 3034 633 -2700 -999 2211 1258 -1657 -1560 911 1676 -302 -1843 -481
2348 -481 1781 1057 -1826 -1757 1549 2083 -1475 -2578 1058 2629 -931 -2875 446 2736 -154 -2715
2364 -2715 -438 2304 829 -1930 -1369 1281 1630 -741 -1960 80 2127 514 -2203 -1106 2235
2379 2235 1742 -1962 -2084 1774 2486 -1257 -2499 969 2659 -363 -2404 51 2380 652 -1853 -882
2395 -882 1700 1525 -1056 -1678 793 2182 -105 -2243 -268 2499 928 -2321 -1218 2314 1773 -1924
2411 -1924 -1966 1689 2314 -1138 -2397 623 2436 0 -2284 -576 2065 1120 -1707 -1561 1328 1981
2427 1981 -878 -2273 369 2402 75 -2500 -612 2343 983 -2215 -1410 1886 1680 -1533 -1966 1021
2443 1021 2069 -584 -2207 -42 2065 482 -2054 -1108 1722 1483 -1470 -1949 980 2150 -603 -2393
2459 -2393 16 2299 343 -2315 -922 1995 1238 -1750 -1644 1292 1832 -885 -2015 378 2063 78
2475 78 -2063 -586 1917 1002 -1734 -1402 1446 1735 -1084 -1954 726 2163 -234 -2181 -194 2177
2491 2177 697 -1988 -1116 1743 1495 -1401 -1811 971 2032 -503 -2160 -21 2130 475 -2059 -990
2507 -990 1767 1308 -1561 -1741 1070 1864 -750 -2136 161 2079 223 -2089 -744 1839 1079 -1699
2523 -1699 -1536 1274 1753 -959 -2030 455 2095 -9 -2111 -441 2040 935 -1782 -1270 1547 1701
2539 1701 -1108 -1881 738 2132 -167 -2077 -169 2170 802 -1843 -1040 1793 1615 -1256 -1713 1061
2555 1061 2081 -446 -2046 156 2230 479 -1975 -765 1953 1317 -1546 -1541 1323 1899 -846 -2033
2571 -2033 448 2168 55 -2141 -518 2030 966 -1799 -1354 1507 1692 -1127 -1960 676 2090 -257
2587 -257 -2160 -254 2102 675 -1956 -1081 1713 1443 -1385 -1734 966 1896 -545 -2003 62 1981
2603 1981 387 -1904 -832 1694 1235 -1435 -1576 1070 1823 -693 -1999 270 2047 134 -2025 -551
2619 -551 1879 931 -1656 -1258 1333 1498 -965 -1692 544 1804 -114 -1812 -342 1763 820 -1598
2635 -1598 -1180 1388 1517 -1104 -1765 792 1958 -430 -2043 53 2029 392 -1858 -712 1647 1090
2651 1090 -1287 -1318 942 1562 -508 -1712 39 1771 454 -1729 -854 1634 1251 -1452 -1557 1187
2667 1187 1784 -915 -1992 487 1951 -170 -1951 -304 1695 582 -1513 -1004 1148 1270 -823 -1654
2683 -1654 263 1725 96 -1908 -664 1783 932 -1774 -1314 1579 1553 -1382 -1823 1017 1871 -669
2699 -669 -1912 196 1742 176 -1567 -570 1342 995 -1027 -1333 722 1704 -284 -1893 -60 2064
2715 2064 457 -2089 -761 2108 1148 -1918 -1357 1702 1609 -1276 -1634 915 1656 -453 -1616 -48
2731 -48 1507 549 -1347 -1093 1022 1511 -693 -1862 335 2019 -113 -2209 -222 2206 416 -2237
2747 -2237 -770 1990 964 -1710 -1173 1255 1221 -837 -1275 326 1285 161 -1291 -694 1209 1231 -1014
2764 -1014 -1630 844 1994 -558 -2166 370 2328 -30 -2245 -167 2161 517 -1763 -619 1492
2779 1492 873 -975 -926 620 1168 -12 -1188 -439 1304 1060 -1151 -1373 1152 1761 -970 -1889 964
2796 964 2117 -775 -2213 528 2203 -167 -1963 -129 1652 473 -1187 -674 797 975 -313 -1232
2812 -1232 -204 1444 715 -1551 -1198 1552 1560 -1460 -1783 1380 1967 -1177 -1983 949 1931 -622 -1749
2829 -1749 286 1460 30 -1157 -364 880 819 -445 -1151 34 1516 447 -1701 -843 1792 1119
2845 1119 -1851 -1329 1879 1532 -1741 -1669 1534 1795 -1074 -1658 632 1440 -196 -1154 -221 875 640
2862 640 -593 -1066 337 1538 69 -1791 -316 2032 630 -2113 -793 2146 942 -2085 -1090 1908
2878 1908 1187 -1552 -1170 1193 1184 -717 -1109 225 1029 324 -957 -973 695 1433 -474 -1877 155 2062
2896 2062 -1 -2254 -218 2272 292 -2337 -624 2004 672 -1781 -929 1171 784 -819 -877 235
2912 235 749 80 -926 -743 779 1065 -882 -1660 600 1820 -632 -2173 367 2158 -319 -2268
2928 -2268 22 2038 108 -1885 -418 1415 530 -1079 -783 526 875 -50 -1065 -526 1082 985 -1092
2945 -1092 -1388 995 1626 -976 -1802 898 1891 -819 -1955 605 1888 -364 -1714 61 1405 181
2961 181 -1078 -424 694 700 -341 -991 -78 1242 514 -1424 -939 1506 1315 -1433 -1512 1375 1715 -1152
2979 -1152 -1702 980 1734 -617 -1501 348 1350 80 -971 -297 785 765 -311 -922 113 1336 372
2996 372 -1347 -506 1613 898 -1504 -907 1667 1235 -1421 -1195 1422 1467 -932 -1313 723 1366 -182
3013 -182 -1070 -103 1024 621 -700 -912 547 1359 -165 -1554 -57 1784 415 -1779 -572 1781
3029 1781 786 -1636 -905 1467 1017 -1194 -1056 879 1081 -510 -1076 123 1023 268 -982 -701 837
3046 837 1056 -700 -1407 477 1626 -274 -1796 29 1845 184 -1842 -476 1670 667 -1411 -903
3062 -903 1026 998 -678 -1078 227 1065 127 -1068 -537 980 861 -908 -1181 743 1366 -599 -1540 393
3080 393 1583 -231 -1615 -9 1527 215 -1423 -460 1218 688 -944 -904 639 1099 -250 -1196 -107
3097 -107 1265 512 -1206 -805 1156 1141 -946 -1296 821 1508 -487 -1472 301 1519 31 -1357 -255
3114 -255 1218 555 -959 -708 777 969 -452 -1039 216 1215 120 -1252 -379 1282 679 -1197 -923
3131 -923 1080 1153 -860 -1284 633 1406 -300 -1388 -25 1336 341 -1185 -653 970 933 -714 -1137
3148 -1137 421 1265 -132 -1317 -163 1327 429 -1266 -676 1134 843 -1000 -1047 767 1134 -548 -1232
3165 -1232 276 1257 -31 -1273 -308 1168 561 -1100 -877 866 1051 -689 -1298 379 1355 -122 -1456
3182 -1456 -248 1365 479 -1295 -812 1036 961 -878 -1183 527 1223 -318 -1326 -59 1223 290 -1211
3199 -1211 -599 1023 754 -911 -1018 654 1102 -476 -1261 173 1257 59 -1309 -378 1193 599 -1089
3216 -1089 -894 850 1066 -633 -1234 300 1282 -29 -1325 -314 1203 547 -1098 -845 864 994 -669
3233 -669 -1161 374 1199 -155 -1245 -164 1159 350 -1123 -624 952 773 -805 -965 587 1073 -386
3250 -386 -1184 118 1214 137 -1215 -427 1116 659 -984 -894 790 1087 -525 -1186 282 1288 52
3267 52 -1240 -316 1167 595 -1000 -798 815 1005 -541 -1076 354 1201 -11 -1152 -170 1151 445
3284 445 -1025 -631 931 856 -712 -971 560 1132 -262 -1129 77 1210 249 -1098 -482 1018 756
3301 756 -823 -952 617 1138 -326 -1204 112 1287 222 -1216 -441 1147 701 -969 -872 778 1023
3318 1023 -532 -1064 312 1113 -32 -1056 -171 1039 466 -904 -665 766 876 -592 -1037 406 1165
3335 1165 -187 -1242 -35 1263 278 -1230 -520 1088 698 -938 -901 665 978 -430 -1088 69 1049
3352 1049 198 -1038 -535 869 731 -770 -1004 534 1073 -413 -1264 144 1234 7 -1270 -273 1124
3369 1124 401 -1031 -606 801 690 -620 -881 303 936 -55 -1011 -286 939 547 -935 -830 799
3386 799 1020 -703 -1229 488 1296 -308 -1353 49 1256 125 -1148 -352 943 492 -754 -684 483
3403 483 800 -195 -911 -90 967 370 -976 -606 979 820 -918 -980 857 1175 -667 -1195 519 1248
3421 1248 -259 -1136 102 1087 205 -850 -406 704 719 -353 -840 113 1075 253 -1038 -415 1174 724
3439 724 -1100 -816 1117 1053 -911 -1046 776 1120 -490 -992 330 948 -32 -779 -179 666 522 -438
3457 -438 -751 231 982 4 -1143 -193 1263 386 -1347 -565 1328 708 -1266 -846 1053 861 -865 -913
3475 -913 585 824 -321 -811 -31 678 333 -560 -694 349 918 -216 -1139 36 1273 47 -1415
3492 -1415 -193 1468 352 -1420 -476 1281 557 -1074 -586 831 617 -538 -632 245 687 169 -605
3509 -605 -509 584 888 -419 -1089 370 1345 -226 -1431 165 1536 24 -1462 -96 1375 269
3525 269 -1103 -277 918 434 -578 -471 305 598 100 -599 -423 642 765 -595 -972 612 1182 -574
3543 -574 -1323 557 1455 -409 -1435 271 1348 -109 -1135 -8 951 164 -677 -307 439 499 -73 -642
3561 -642 -241 780 560 -816 -806 863 1007 -868 -1124 865 1240 -770 -1260 641 1211 -459 -1067 280
3579 280 895 -84 -719 -179 458 408 -203 -680 -121 822 344 -988 -613 1039 719 -1163 -919 1110 980
3598 980 -1063 -1103 836 1000 -694 -960 404 748 -239 -671 -109 438 325 -308 -689 33 860 96 -1108
3617 -1108 -364 1150 420 -1305 -602 1250 620 -1269 -778 1045 701 -940 -778 605 625 -422 -676
3634 -676 23 481 207 -463 -610 235 793 -186 -1084 -18 1159 32 -1347 -208 1335 247 -1360
3651 -1360 -413 1183 435 -1021 -499 739 493 -490 -525 183 511 134 -497 -460 459 768 -363 -976 297
3670 297 1160 -195 -1242 138 1301 -16 -1268 -69 1180 197 -977 -276 780 382 -527 -465 235
3687 235 512 55 -584 -368 594 611 -580 -857 531 984 -527 -1132 424 1177 -334 -1196 163 1101
3705 1101 -44 -965 -110 774 251 -559 -349 363 525 -82 -615 -131 734 426 -718 -578 798 812 -697
3724 -697 -848 734 1018 -547 -958 513 1051 -224 -882 148 849 133 -616 -260 505 539 -232 -639 64
3743 64 826 219 -839 -345 929 572 -886 -668 858 800 -744 -828 597 876 -411 -813 215 756
3761 756 -2 -672 -192 549 410 -404 -594 262 781 -83 -868 -57 967 241 -969 -340 978 510 -859
3780 -859 -583 779 697 -564 -704 395 757 -138 -685 -39 669 304 -553 -471 469 676 -300 -773 204 879
3800 879 -50 -927 -75 949 236 -891 -348 802 460 -655 -545 501 623 -322 -679 93 673 114
3818 114 -676 -340 602 509 -516 -709 390 801 -272 -891 73 897 47 -887 -228 791 334 -698 -489
3837 -489 526 555 -384 -639 162 671 0 -692 -174 680 353 -629 -497 556 629 -442 -732 333 834
3856 834 -169 -827 36 837 168 -762 -297 679 471 -516 -571 396 695 -179 -714 26 778 186 -710 -324
3876 -324 692 491 -574 -587 467 679 -323 -731 184 771 -19 -751 -136 705 302 -653 -444 524 559
3895 559 -408 -692 223 723 -83 -803 -141 747 285 -737 -479 597 578 -498 -721 301 737 -162 -794
3914 -794 -54 744 189 -710 -374 591 476 -507 -600 362 673 -217 -720 70 731 86 -718 -225 686 374
3934 374 -589 -507 514 636 -340 -683 227 781 -22 -741 -110 745 319 -637 -441 575 601 -383 -658 277
3954 277 752 -58 -732 -87 716 245 -643 -380 567 503 -454 -606 320 662 -172 -699 26 679 105 -676
3974 -676 -286 582 402 -539 -553 376 629 -261 -719 83 730 69 -737 -256 639 383 -577 -536 435 612 -301
3995 -301 -679 139 699 46 -672 -180 622 331 -562 -448 463 547 -338 -627 220 672 -71 -675 -30 682
4015 682 187 -626 -302 571 435 -459 -548 334 619 -165 -661 32 699 173 -643 -320 601 478 -499 -593 380
4036 380 666 -221 -698 87 710 78 -666 -198 608 340 -501 -445 386 526 -251 -595 99 620 43 -652
4056 -652 -185 632 343 -602 -469 533 565 -432 -665 288 680 -179 -713 -24 654 152 -637 -357 469 432
4076 432 -390 -595 175 606 -109 -721 -107 669 186 -706 -367 588 400 -582 -527 418 517 -366 -586 190 567
4097 567 -76 -586 -96 534 245 -470 -404 361 526 -257 -640 167 734 1 -750 -126 767 281 -690 -352
4117 -352 603 450 -464 -484 329 537 -148 -517 -7 493 198 -426 -335 358 452 -306 -577 203 653 -145 -731
4138 -731 24 727 65 -726 -174 633 238 -580 -343 429 390 -310 -481 89 487 90 -490 -274 456 421 -411
4159 -411 -559 353 670 -269 -735 181 770 -56 -704 -4 667 133 -532 -147 491 280 -300 -334 200 440
4179 440 30 -428 -117 513 333 -458 -395 544 581 -460 -633 424 747 -264 -713 199 725 -35 -597 -38
4199 -38 549 217 -378 -306 238 432 -35 -489 -107 542 263 -582 -371 600 472 -577 -575 527 602 -461 -630
4220 -630 355 593 -257 -568 126 518 29 -440 -195 333 352 -192 -491 49 591 65 -674 -175 747 296
4240 296 -753 -401 706 472 -607 -502 507 494 -368 -458 246 441 -68 -379 -76 307 252 -220 -389 138
4260 138 518 -47 -624 16 716 79 -744 -141 791 251 -693 -270 632 353 -488 -345 360 393 -153 -355
4280 -355 -23 369 243 -254 -387 239 559 -139 -634 119 747 -22 -760 -44 774 117 -671 -150 597 208
4300 208 -474 -226 359 251 -203 -311 18 322 146 -334 -330 313 458 -318 -599 273 660 -251 -754 156 741
4321 741 -109 -734 -9 612 56 -521 -166 362 219 -215 -291 42 340 119 -381 -280 390 385 -403 -482 399
4342 399 585 -371 -641 349 684 -243 -630 179 602 -57 -505 -25 420 144 -284 -271 153 383 10 -446
4362 -446 -176 506 296 -542 -422 528 505 -513 -579 443 591 -362 -596 238 531 -153 -475 34 385 81
4382 81 -316 -219 186 326 -100 -450 -32 517 113 -591 -215 617 294 -627 -366 598 422 -522 -455 382 448
4403 448 -274 -439 135 380 9 -349 -163 261 295 -175 -414 80 507 -8 -586 -74 582 124 -624 -201
4423 -201 601 240 -527 -296 437 314 -337 -347 197 327 -83 -343 -83 309 226 -266 -354 210 471 -133 -549
4444 -549 78 600 -4 -624 -69 608 154 -519 -193 462 282 -321 -263 232 315 -75 -317 -30 335 184 -295
4465 -295 -268 295 394 -236 -445 207 517 -129 -533 83 550 -11 -521 -92 457 150 -375 -237 281 276 -164
4486 -164 -326 39 372 90 -371 -213 361 310 -341 -405 298 465 -219 -497 162 504 -66 -488 -29 454 112
4507 112 -377 -172 314 266 -216 -311 117 391 4 -414 -80 445 222 -422 -296 395 383 -339 -436 275 485
4528 485 -180 -479 94 475 19 -440 -113 382 215 -313 -291 213 367 -124 -419 30 444 54 -457 -162
4548 -162 440 229 -411 -311 348 353 -296 -393 200 419 -101 -419 4 410 96 -365 -195 313 281 -238 -349
4569 -349 160 420 -76 -435 -9 448 99 -420 -181 404 270 -313 -299 266 368 -156 -375 68 388 25
4589 25 -371 -114 349 215 -296 -289 234 358 -165 -397 64 415 9 -414 -106 383 181 -355 -250 292 320
4610 320 -212 -366 124 384 -33 -381 -65 357 150 -335 -231 280 291 -213 -342 148 365 -65 -387 -13
4630 -13 389 112 -365 -185 308 247 -271 -316 192 348 -106 -380 20 378 73 -365 -142 329 230 -295 -317 218
4652 218 358 -132 -394 63 402 24 -394 -112 382 212 -326 -267 268 349 -181 -368 99 410 12 -404 -75
4673 -75 406 185 -350 -237 321 334 -224 -351 162 401 -55 -401 -10 407 124 -369 -186 345 263 -263 -329
4694 -329 195 355 -126 -392 27 393 56 -394 -138 364 217 -311 -288 246 332 -182 -369 100 389 -15 -389
4715 -389 -74 360 156 -318 -236 253 308 -185 -333 108 383 -26 -378 -45 376 140 -334 -187 304 263 -229
4736 -229 -292 176 324 -88 -342 9 336 86 -314 -158 279 246 -236 -291 174 346 -91 -376 29 392 57
4757 57 -389 -128 332 199 -299 -241 219 276 -159 -304 71 300 41 -300 -117 279 176 -235 -248 199 316
4778 316 -133 -336 99 375 -37 -383 -40 366 91 -319 -153 279 185 -218 -251 127 280 -50 -298 -57 297
4799 297 137 -291 -231 261 267 -221 -355 158 378 -123 -405 40 372 13 -357 -82 289 128 -263 -200 171
4820 171 242 -85 -288 4 303 91 -331 -172 324 234 -306 -305 284 359 -228 -386 174 399 -97 -361 39 351
4842 351 42 -294 -129 232 192 -141 -248 48 294 33 -330 -91 350 164 -361 -222 351 262 -334 -309 268
4863 268 292 -232 -306 157 280 -87 -275 -12 216 86 -189 -193 108 251 -62 -322 -12 369 59 -417 -135
4884 -135 397 182 -390 -223 343 230 -274 -227 210 235 -124 -212 39 209 75 -149 -138 126 240 -63 -286
4905 -286 49 364 6 -396 -40 425 95 -423 -122 398 144 -321 -156 267 176 -189 -174 77 169 28 -161
4926 -161 -147 127 217 -110 -295 69 348 -57 -401 15 409 -2 -417 -18 366 49 -325 -64 262 74 -189
4947 -189 -100 112 132 -19 -148 -96 158 193 -161 -270 168 353 -138 -397 145 434 -100 -439 62 398 -1
4968 -1 -345 -10 308 70 -197 -91 111 165 -1 -168 -81 195 178 -208 -235 230 296 -250 -358 235 383 -217
4990 -217 -401 182 373 -130 -352 77 294 -16 -238 -46 169 120 -68 -181 -13 227 113 -268 -172 298 239
5011 239 -313 -262 322 311 -278 -313 256 295 -204 -268 173 242 -90 -180 30 161 45 -99 -130 40 199 16 -255
5034 -255 -75 311 112 -358 -157 380 191 -374 -212 331 217 -277 -215 216 205 -140 -180 36 147 50 -102
5055 -102 -142 52 208 -13 -261 -16 310 66 -340 -68 367 104 -328 -90 342 135 -278 -123 242 135
5075 135 -153 -111 85 147 14 -105 -74 110 189 -68 -247 66 322 -24 -332 20 363 33 -358 -51 333
5096 333 62 -271 -92 226 94 -135 -94 73 112 7 -123 -76 130 166 -130 -225 112 275 -119 -306 94 330
5118 330 -69 -352 37 333 -1 -300 -50 242 84 -188 -123 108 155 -32 -179 -56 195 137 -201 -185 206
5139 206 266 -184 -282 173 309 -129 -306 105 304 -51 -266 31 244 31 -192 -54 146 119 -81 -156 25
5160 25 202 43 -227 -92 248 152 -242 -194 251 240 -210 -255 164 261 -124 -246 75 234 -16 -187 -44 158
5182 158 100 -111 -139 58 187 -9 -204 -32 245 73 -244 -96 254 138 -230 -166 202 183 -164 -190 119 206
5204 206 -68 -189 0 189 65 -151 -131 114 174 -68 -228 27 235 15 -261 -58 255 90 -223 -134 190
5225 190 147 -161 -155 109 162 -68 -158 23 160 38 -148 -86 129 121 -107 -157 79 199 -51 -217 10 239 34
5248 34 -233 -70 227 116 -170 -137 142 157 -84 -163 36 167 24 -163 -72 155 124 -137 -154 109 193 -68 -191
5271 -191 50 216 3 -209 -33 213 78 -184 -95 178 152 -118 -166 84 179 -24 -194 -14 199 76 -183
5292 -183 -123 179 165 -143 -189 96 217 -62 -235 19 214 35 -211 -64 179 124 -161 -155 113 155 -69 -190
5314 -190 37 191 17 -190 -46 193 101 -172 -123 154 167 -119 -186 86 191 -37 -203 -2 201 61 -188
5335 -188 -89 164 136 -127 -151 89 187 -31 -186 -6 209 48 -161 -80 161 123 -115 -140 103 167 -69 -175 17
5358 17 176 7 -170 -39 163 93 -152 -120 109 151 -80 -166 29 175 -2 -192 -46 177 85 -162 -119 126
5380 126 149 -87 -156 61 167 -12 -153 -29 153 56 -139 -91 127 122 -70 -131 60 167 -15 -143 5 167
5402 167 52 -145 -74 135 107 -108 -121 89 143 -41 -155 11 170 26 -152 -67 148 118 -108 -150 86 171 -49
5425 -49 -186 1 183 39 -171 -66 162 108 -145 -121 112 148 -74 -154 47 172 -3 -162 -31 159 83 -132
5447 -132 -113 133 155 -93 -162 64 192 -17 -194 -16 203 58 -172 -62 155 124 -111 -127 95 164 -34 -156
5469 -156 -17 171 55 -143 -85 142 131 -126 -140 100 168 -57 -170 33 186 -11 -189 -20 151 46 -142
5490 -142 -92 98 116 -64 -146 25 161 18 -161 -64 151 97 -149 -117 147 158 -104 -161 91 181 -43 -163 18
5513 18 152 37 -136 -57 109 103 -58 -106 50 149 -11 -142 -32 170 59 -162 -96 155 117 -128 -118 125 145
5536 145 -77 -133 46 135 -11 -120 -46 94 85 -67 -106 37 122 -8 -146 -33 174 48 -171 -74 165 91 -140
5559 -140 -112 134 110 -98 -114 66 122 -36 -116 -11 106 59 -77 -96 49 141 -23 -154 22 190 16 -198 -44
5582 -44 203 75 -177 -85 163 94 -137 -110 94 108 -42 -122 -18 95 54 -110 -112 72 135 -72 -174 47 189
5605 189 -33 -220 0 214 0 -207 -39 170 34 -160 -75 107 81 -79 -95 18 113 36 -114 -68 101 116
5627 116 -96 -146 93 187 -79 -182 72 203 -22 -168 25 169 21 -146 -25 130 48 -93 -66 45 100 -1
5649 -1 -107 -49 114 84 -118 -115 130 148 -123 -175 104 155 -82 -170 56 150 -42 -140 15 109 15 -83 -56 45 82 3
5675 3 -95 -35 111 64 -121 -90 128 113 -126 -124 131 144 -101 -126 90 143 -57 -128 37 105 16 -52 -35 54 82 -10 -105
5702 -105 -17 126 51 -133 -62 147 103 -144 -91 137 111 -131 -115 90 102 -75 -100 42 90 -16 -80 -53 42 83 -40
5727 -40 -120 1 139 10 -155 -38 184 51 -179 -66 181 96 -143 -89 132 95 -86 -90 49 91 -10 -75 -23
5750 -23 85 89 -61 -103 46 143 -36 -164 27 186 6 -190 -16 187 43 -175 -45 144 68 -113 -80 68
5772 68 79 -33 -87 -9 89 51 -92 -100 67 119 -68 -159 41 158 -55 -187 27 179 -15 -167 -16 143 25
5795 25 -124 -48 91 72 -55 -77 19 101 19 -100 -48 117 98 -102 -110 101 144 -89 -140 79 162 -48 -155 22 152
5820 152 15 -123 -30 104 61 -67 -65 30 92 5 -108 -40 109 51 -119 -97 114 100 -116 -124 97 119 -78 -129 37
5845 37 121 -27 -122 -20 94 40 -69 -71 34 90 -18 -115 -18 121 37 -121 -64 120 85 -100 -99 109 122 -84 -116
5870 -116 53 120 -27 -100 -1 99 30 -77 -50 62 90 -44 -110 6 131 13 -145 -32 146 60 -150 -92 132
5893 132 100 -115 -127 71 121 -61 -129 13 112 18 -113 -66 101 91 -71 -131 43 136 -27 -149 -3 145 29
5916 29 -152 -52 149 65 -125 -95 98 94 -71 -116 38 115 -14 -113 -17 118 58 -101 -93 98 124 -59 -131 49 143
5941 143 -6 -147 -8 156 51 -133 -60 130 84 -96 -93 55 101 -31 -127 10 111 21 -112 -65 98 75 -94
5964 -94 -115 73 118 -49 -135 35 135 -2 -130 -21 134 64 -99 -81 88 102 -52 -104 30 128 12 -118 -28
5987 -28 118 67 -99 -78 83 101 -54 -113 42 131 -3 -114 -9 122 33 -100 -49 93 92 -62 -87 53 108 -17
6011 -17 -114 -7 114 37 -114 -61 93 84 -89 -106 56 113 -39 -124 6 127 19 -112 -56 97 63 -103 -101 67
6035 67 91 -43 -121 6 129 18 -118 -38 99 59 -93 -85 86 112 -58 -112 39 135 0 -140 -19 133 61 -103
6059 -103 -75 104 104 -67 -116 44 135 -2 -125 -11 127 41 -120 -69 116 90 -92 -114 46 128 -30 -121 -5 121
6083 121 32 -132 -46 116 71 -95 -92 73 107 -53 -123 17 119 7 -131 -33 126 64 -118 -96 91 105 -57 -121
6107 -121 34 123 -14 -120 -18 122 56 -101 -80 93 88 -62 -102 52 124 -13 -128 -6 119 38 -117 -47 108
6130 108 85 -78 -96 74 109 -33 -113 17 114 29 -129 -43 110 65 -91 -98 68 104 -43 -117 19 121 1 -120
6154 -120 -34 100 58 -93 -75 75 85 -55 -110 18 105 5 -113 -20 100 59 -96 -67 82 95 -63 -93 54 118
6178 118 -17 -123 -12 120 42 -97 -43 99 90 -71 -100 55 118 -21 -117 -1 126 44 -118 -54 102 75 -87
6201 -87 -95 74 107 -45 -133 11 115 -2 -116 -40 93 52 -99 -81 58 96 -60 -124 24 120 -11 -146 -42 123
6225 123 55 -121 -74 94 88 -75 -114 38 114 -32 -119 3 113 41 -90 -67 88 92 -60 -105 49 128 -11 -122
6249 -122 11 142 22 -119 -42 123 77 -108 -76 89 107 -62 -96 30 111 7 -112 -45 100 72 -94 -93 73
6272 73 106 -59 -132 25 143 -13 -143 -25 126 26 -126 -79 88 57 -62 -85 40 86 -12 -98 -11 107 44 -103
6296 -103 -67 86 90 -78 -103 67 129 -37 -140 16 131 3 -116 -25 103 51 -77 -72 44 80 -25 -104 -13 102
6320 102 38 -108 -60 99 77 -102 -120 81 108 -58 -120 30 110 -16 -116 -17 93 15 -94 -55 58 71 -50 -104
6344 -104 13 110 22 -112 -42 130 74 -115 -77 135 104 -87 -118 86 132 -39 -109 24 116 13 -92 -25 87 67
6368 67 -59 -82 37 108 0 -122 -15 132 36 -137 -49 129 77 -128 -89 101 89 -71 -112 40 94 -20 -116 -15
6392 -15 85 32 -70 -83 55 88 -59 -124 0 127 -3 -148 -32 136 40 -132 -72 124 73 -90 -76 68 80
6415 80 -40 -88 12 94 27 -77 -42 83 85 -55 -92 61 129 -32 -134 22 139 8 -139 -5 129 49 -104
6438 -104 -54 98 81 -55 -72 35 83 0 -83 -32 83 67 -74 -95 55 97 -55 -130 45 119 -46 -147 3 115
6462 115 5 -125 -30 90 51 -72 -55 34 68 -22 -92 -23 81 43 -88 -66 92 93 -77 -109 63 110 -45 -112 30
6487 30 118 -16 -103 0 101 36 -74 -53 50 83 -34 -85 4 98 28 -107 -48 104 73 -98 -90 85 103 -77 -119
6512 -119 46 108 -31 -118 2 83 3 -94 -45 68 53 -40 -93 22 100 4 -112 -31 120 43 -114 -59 105 86 -98
6537 -98 -90 68 105 -52 -89 28 112 14 -87 -6 85 61 -52 -78 46 96 -13 -107 13 123 30 -118 -24 125 60
6562 60 -105 -72 95 86 -71 -99 50 101 -22 -88 0 90 26 -78 -51 56 75 -54 -101 31 111 -15 -115 -12 131
6587 131 13 -136 -45 105 57 -91 -70 66 69 -36 -86 27 92 5 -88 -25 76 57 -61 -69 59 101 -35 -104 22
6612 22 103 6 -103 -27 96 37 -95 -61 78 76 -66 -75 26 71 -6 -87 -19 75 43 -72 -61 59 67 -62 -111 38 98
6639 98 -25 -118 -2 104 10 -104 -37 84 48 -64 -62 43 81 -18 -100 -5 94 31 -88 -40 86 73 -69 -73 66 102
6665 102 -39 -94 23 108 -8 -116 -14 96 52 -87 -52 62 85 -56 -77 29 90 -1 -94 -20 96 44 -78 -61
6689 -61 71 79 -64 -86 34 88 -24 -100 -7 92 19 -87 -45 86 61 -59 -64 63 86 -21 -106 0 104 15 -100
6714 -100 -35 87 50 -74 -63 80 85 -37 -89 47 99 -3 -88 -16 96 44 -82 -53 78 79 -48 -84 47 97 -14
6739 -14 -102 3 93 41 -79 -50 86 75 -64 -69 57 87 -34 -89 1 90 21 -86 -41 82 60 -72 -66 51 82 -26
6765 -26 -94 21 87 1 -92 -31 93 46 -76 -63 61 77 -41 -88 26 86 -11 -87 -20 82 38 -72 -58 61 63 -51
6791 -51 -80 35 86 -16 -93 -19 90 31 -70 -40 67 77 -55 -80 38 82 -22 -75 -7 89 15 -83 -43 66 65 -65
6817 -65 -73 48 81 -31 -107 1 95 -2 -96 -31 74 49 -77 -69 42 76 -49 -90 6 88 4 -101 -25 83 46 -69
6843 -69 -65 60 86 -59 -78 42 98 -5 -88 -1 88 21 -77 -46 86 74 -53 -69 43 87 -24 -73 0 101 30 -91
6869 -91 -51 78 59 -68 -69 52 91 -46 -94 26 87 0 -97 -24 74 38 -69 -59 50 56 -45 -92 19 98 2 -102
6895 -102 -19 87 26 -91 -56 78 67 -65 -79 46 81 -29 -84 16 87 32 -68 -39 72 49 -56 -68 33 88
6919 88 -3 -85 22 101 27 -80 -22 83 46 -64 -48 64 71 -42 -74 11 70 7 -67 -24 56 29 -67 -55 52 74 -50
6946 -50 -90 22 95 -8 -111 -13 87 24 -90 -46 82 44 -68 -77 35 77 -1 -75 -10 78 39 -67 -48 65 70 -51
6972 -51 -80 48 107 -28 -96 18 102 7 -83 -13 92 27 -58 -41 43 64 -29 -55 10 82 17 -84 -40 65 51 -67 -88
6999 -88 63 77 -55 -98 41 93 -14 -94 -7 76 12 -77 -53 59 40 -55 -73 12 78 3 -85 -13 94 47 -95 -45 88
7026 88 64 -78 -63 69 91 -46 -93 43 91 -9 -67 1 78 41 -43 -52 35 67 -10 -74 1 108 15 -90 -28 94 37
7053 37 -100 -52 67 71 -69 -77 55 76 -42 -74 9 66 12 -69 -46 43 47 -43 -95 13 81 -11 -102 -15 107 9 -101 -39
7081 -39 95 54 -79 -50 63 58 -40 -54 10 72 12 -48 -22 64 59 -44 -51 48 88 -16 -92 24 119 -1 -90 -9 101 29
7109 29 -91 -33 71 46 -65 -52 34 57 -13 -64 -9 45 26 -57 -60 52 68 -57 -103 30 93 -32 -115 10 89 -7 -89
7136 -89 -30 75 36 -67 -59 41 47 -27 -52 7 72 17 -75 -30 78 55 -70 -62 62 93 -36 -84 48 114 -13 -84 6
7163 6 102 15 -63 -34 68 51 -32 -45 20 80 7 -72 -12 85 35 -76 -50 70 63 -74 -76 63 92 -60 -87 16 85 -11
7191 -11 -82 -10 57 29 -58 -61 25 79 -23 -83 5 92 17 -96 -35 83 38 -84 -65 71 57 -61 -65 48 68 -24 -64 3
7219 3 63 18 -50 -41 56 56 -35 -63 17 88 -15 -83 4 92 26 -87 -46 76 40 -62 -56 47 50 -32 -66 1 62 1 -53 -32
7249 -32 52 27 -52 -73 28 66 -30 -77 -1 90 -3 -91 -12 80 11 -63 -42 61 43 -53 -56 29 61 -16 -63 -14 66 40 -63
7278 -63 -40 43 56 -47 -76 30 79 -13 -90 11 89 7 -72 -34 58 38 -56 -40 29 58 -34 -66 0 60 10 -77 -40 59 47
7307 47 -59 -69 50 53 -52 -81 19 69 -18 -70 -13 70 18 -69 -42 56 48 -37 -57 23 62 -7 -74 -15 68 19 -69 -34 68
7336 68 53 -54 -54 48 67 -18 -70 25 71 4 -64 -9 68 45 -33 -50 54 60 -24 -54 10 70 6 -85 -11 72 29 -63 -43 56
7366 56 47 -48 -68 32 69 -20 -70 2 57 21 -60 -34 40 53 -46 -51 22 55 -17 -70 5 67 5 -78 -18 67 46 -60 -51 46 60
7397 60 -24 -61 10 73 -3 -55 -10 64 36 -47 -44 45 58 -21 -67 12 68 -5 -70 -5 71 24 -64 -25 58 44 -37 -54 36 64 -19
7428 -19 -64 -6 63 8 -63 -39 57 59 -52 -62 18 62 -23 -79 6 55 2 -57 -23 51 36 -52 -38 33 50 -33 -67 9 59 11
7458 11 -49 -7 66 37 -54 -30 35 60 -30 -52 30 69 -8 -58 -7 76 35 -64 -30 58 56 -34 -59 33 60 -9 -64 5 70 9 -57
7489 -57 -32 51 46 -51 -59 23 58 -24 -65 6 67 4 -62 -12 73 41 -57 -34 53 58 -29 -60 6 61 -1 -65 -16 54 37 -54 -37 50
7521 50 45 -40 -63 31 69 1 -66 -7 71 22 -57 -16 53 50 -28 -44 32 58 -7 -57 -2 62 1 -51 -22 49 42 -62 -50 54 49
7552 49 -37 -57 11 48 2 -70 -22 53 18 -47 -48 51 45 -26 -47 27 57 -5 -71 -18 53 22 -59 -26 36 45 -45 -54 23 55 7 -49
7584 -49 13 55 16 -46 -22 59 42 -29 -40 44 62 -14 -60 5 74 12 -48 -8 57 18 -49 -36 41 42 -42 -58 18 54 -1 -69 -25
7615 -25 47 16 -57 -43 42 42 -46 -57 20 45 -18 -56 -2 48 15 -52 -26 50 34 -38 -38 30 46 -21 -69 8 53 13 -70 -35 56
7646 56 31 -53 -36 37 46 -30 -49 18 58 11 -47 5 60 25 -44 -31 41 55 -35 -56 24 60 -12 -63 -12 54 29 -63 -33 41 36
7677 36 -48 -48 29 46 -37 -51 3 30 1 -40 -23 39 32 -46 -54 27 49 -18 -69 0 62 8 -59 -19 61 26 -44 -43 45 38 -30 -34 18
7710 18 57 -16 -42 -2 54 29 -31 -39 43 52 -37 -50 20 53 -11 -53 -3 52 6 -57 -19 53 33 -43 -53 16 25 -21 -53 -11 37 17
7742 17 -57 -38 33 25 -42 -43 25 49 -33 -63 16 65 -6 -59 -3 47 7 -41 -27 46 40 -12 -35 7 48 1 -47 -3 55 27 -46 -31
7774 -31 51 46 -37 -52 32 59 -10 -53 10 56 -2 -47 -21 40 10 -39 -57 22 50 -17 -65 -18 50 10 -68 -25 57 22 -65 -46 41
7805 41 39 -43 -58 18 46 -12 -67 -26 41 6 -57 -23 34 19 -21 -52 13 63 7 -56 -1 56 27 -57 -31 61 34 -50 -35 39 52
7836 52 -20 -40 11 49 11 -33 -17 40 40 -29 -45 30 52 -18 -63 5 67 1 -74 -22 51 13 -60 -28 31 24 -41 -40 13 32 -16 -47
7868 -47 -14 27 17 -37 -41 35 46 -45 -55 22 61 -22 -64 10 65 14 -51 -10 43 22 -33 -16 26 30 -3 -37 7 50 14 -42 -25
7899 -25 35 31 -32 -38 30 50 -24 -61 26 62 -6 -57 -4 35 6 -49 -31 18 29 -20 -48 7 40 3 -66 -33 46 23 -50 -42 44 50
7931 50 -39 -68 22 45 -19 -55 20 49 1 -44 -4 37 21 -31 -36 21 47 7 -37 5 64 22 -48 -20 72 39 -51 -32 52 45 -26
7962 -26 -40 36 61 -13 -46 -3 38 16 -40 -43 28 50 -39 -51 7 61 -8 -59 -15 48 22 -60 -25 40 21 -48 -51 21 37 -20 -50
7993 -50 -5 44 5 -34 -16 32 37 -24 -47 31 63 -12 -54 11 67 2 -48 -1 55 23 -43 -29 44 43 -19 -23 31 36 -7 -33 -3 50
8025 50 20 -36 -36 33 52 -17 -43 15 58 -8 -58 0 60 7 -45 -12 33 22 -37 -33 16 36 -6 -44 -9 39 1 -54 -26 38 23
8056 23 -35 -37 24 52 -14 -45 28 55 -3 -41 -10 36 7 -38 -24 20 40 -17 -34 9 42 12 -37 -8 46 30 -33 -25 49 49 -35 -44
8088 -44 22 39 -2 -35 4 45 11 -44 -37 30 31 -29 -38 12 40 -20 -60 3 41 5 -35 -27 40 24 -40 -49 19 38 -29 -54 10 46 -16
8121 -16 -36 4 49 24 -39 -20 26 53 -23 -51 19 41 -5 -46 -1 36 34 -35 -19 45 34 -14 -34 26 45 -5 -41 -4 41 -1 -54
8152 -54 -10 42 14 -23 -26 23 36 -14 -35 6 49 7 -47 -14 45 7 -47 -29 26 35 -27 -51 6 30 -13 -44 -15 33 18 -28 -23 28
8184 28 34 -34 -35 19 40 1 -51
8191e1
##END NTUPLES=NMR FID
##END=
