##TITLE=1H_DPA3005-05
 CDCl3, 8 sc, 
 31.5.2019
##JCAMPDX= 6.0         $$ Bruker NMR JCAMP-DX V2.0
##DATA TYPE= NMR FID
##DATA CLASS= NTUPLES
##ORIGIN= UXNMR, Bruker Analytische Messtechnik GmbH
##OWNER= root
$$ XWIN-NMR		Version 3.5
$$ Fri May 31 12:49:08 2019 Russian Standard Time (UT+4h)  she@DPX200
##.OBSERVE FREQUENCY= 200.13155
##.OBSERVE NUCLEUS= ^1H
##.DELAY= (6, 6)
##.ACQUISITION MODE= SIMULTANEOUS
##.ACQUISITION SCHEME= undefined
##.AVERAGES= 8
##.DIGITISER RES= 18
##SPECTROMETER/DATA SYSTEM= spect
##.PULSE SEQUENCE= zg30
##.SOLVENT NAME= CDCl3
##.SHIFT REFERENCE= (INTERNAL, CDCl3, 0, 15.7039)
##AUDIT TRAIL= $$ (NUMBER, WHEN, WHO, WHERE, WHAT)
$$ ##TITLE= Audit trail, XWIN-NMR		Version 3.5
$$ ##JCAMPDX= 5.01
$$ ##ORIGIN= Bruker BioSpin GmbH
$$ ##OWNER= she
$$ F:/spectra/data/she/nmr/H-F/1/audita.txt
$$ ##AUDIT TRAIL=  $$ (NUMBER, WHEN, WHO, WHERE, WHAT)
(   1,<2019-05-31 12:47:59.26 +0400>,<she>,<DPX200>,
      <created by zg, POWCHK disabled, PULCHK disabled
       configuration hash MD5:
       00 E9 B6 7A A2 85 ED C7 34 08 36 98 17 FE 4E 26
       data hash MD5: 16K
       11 07 76 E5 29 8F 4B 7D AE D4 70 A5 DB B7 42 A7>)
$$ ##END=
$$ 
$$ hash MD5
$$ CD A5 4E B3 1F 44 77 6A FF 1B DA 59 2D CA ED 7C
##$RELAX= 
##$RELAX= 
##$RELAX= 
##$RELAX= 
##$RELAX= 
##$RELAX= 
$$ Bruker specific parameters
$$ --------------------------
##$DU= <F:/spectra>
##$EXPNO= 1
##$NAME= <H-F>
##$PROCNO= 1
##$TYPE= <nmr>
##$USER= <she>
##$AMP= (0..31)
100 100 100 100 100 100 100 100 100 100 100 100 100 100 100 100 100 100 
100 100 100 100 100 100 100 100 100 100 100 100 100 100 
##$AQSEQ= 0
##$AQ_mod= 1
##$AUNM= <au_zg>
##$AUTOPOS= <>
##$BF1= 200.13
##$BF2= 200.13
##$BF3= 200.13
##$BF4= 200.13
##$BF5= 200.13
##$BF6= 200.13
##$BF7= 200.13
##$BF8= 200.13
##$BYTORDA= 1
##$CFDGTYP= 0
##$CFRGTYP= 5
##$CHEMSTR= <none>
##$CNST= (0..31)
1 1 145 1 1 1 1 1 1 1 1 1 1 1 1 1 1 1 1 1 1 1 1 1 1 1 1 1 1 1 1 1 
##$CPDPRG= <>
##$CPDPRG1= <>
##$CPDPRG2= <>
##$CPDPRG3= <>
##$CPDPRG4= <mlev>
##$CPDPRG5= <mlev>
##$CPDPRG6= <mlev>
##$CPDPRG7= <mlev>
##$CPDPRG8= <mlev>
##$CPDPRGB= <>
##$CPDPRGT= <>
##$D= (0..31)
0 1.2 0 0 0 0 0 0 0 0 0 0.03 0 0 0 0 0 0 0 0 0 0 0 0 0 0 0 0 0 0 0 0 
##$DATE= 1559292478
##$DBL= (0..7)
120 120 120 120 120 120 120 120 
##$DBP= (0..7)
150 150 150 150 150 150 150 150 
##$DBP07= 0
##$DBPNAM0= <>
##$DBPNAM1= <>
##$DBPNAM2= <>
##$DBPNAM3= <>
##$DBPNAM4= <>
##$DBPNAM5= <>
##$DBPNAM6= <>
##$DBPNAM7= <>
##$DBPOAL= (0..7)
0.5 0.5 0.5 0.5 0.5 0.5 0.5 0.5 
##$DBPOFFS= (0..7)
0 0 0 0 0 0 0 0 
##$DE= 6
##$DECBNUC= <off>
##$DECIM= 24
##$DECNUC= <off>
##$DECSTAT= 4
##$DIGMOD= 1
##$DIGTYP= 9
##$DL= (0..7)
0 120 120 120 120 120 120 120 
##$DP= (0..7)
150 150 150 150 150 150 150 150 
##$DP07= 0
##$DPNAME0= <>
##$DPNAME1= <>
##$DPNAME2= <>
##$DPNAME3= <>
##$DPNAME4= <>
##$DPNAME5= <>
##$DPNAME6= <>
##$DPNAME7= <>
##$DPOAL= (0..7)
0.5 0.5 0.5 0.5 0.5 0.5 0.5 0.5 
##$DPOFFS= (0..7)
0 0 0 0 0 0 0 0 
##$DQDMODE= 0
##$DR= 18
##$DS= 0
##$DSLIST= <SSSSSSSSSSSSSSS>
##$DSPFIRM= 0
$$ [...]
##$SUBNAM2= <"">
##$SUBNAM3= <"">
##$SUBNAM4= <"">
##$SUBNAM5= <"">
##$SUBNAM6= <"">
##$SUBNAM7= <"">
##$SUBNAM8= <"">
##$SUBNAM9= <"">
##$SW= 24.9336996594482
##$SWIBOX= (0..15)
0 0 2 0 0 0 0 0 0 0 0 0 0 0 0 0 
##$SW_h= 4990.01996007984
##$TD= 16384
##$TD0= 1
##$TE= 0
##$TE2= 300
##$TE3= 300
##$TEG= 300
##$TL= (0..7)
0 120 120 120 120 120 120 120 
##$TP= (0..7)
150 150 150 150 150 150 150 150 
##$TP07= 0
##$TPNAME0= <>
##$TPNAME1= <>
##$TPNAME2= <>
##$TPNAME3= <>
##$TPNAME4= <>
##$TPNAME5= <>
##$TPNAME6= <>
##$TPNAME7= <>
##$TPOAL= (0..7)
0.5 0.5 0.5 0.5 0.5 0.5 0.5 0.5 
##$TPOFFS= (0..7)
0 0 0 0 0 0 0 0 
##$TUNHIN= 0
##$TUNHOUT= 0
##$TUNXOUT= 0
##$USERA1= <user>
##$USERA2= <user>
##$USERA3= <user>
##$USERA4= <user>
##$USERA5= <user>
##$V9= 5
##$VALIST= <valist>
##$VCLIST= <CCCCCCCCCCCCCCC>
##$VD= 0
##$VDLIST= <DDDDDDDDDDDDDDD>
##$VPLIST= <PPPPPPPPPPPPPPP>
##$VTLIST= <TTTTTTTTTTTTTTT>
##$WBST= 1024
##$WBSW= 4
##$XGAIN= (0..3)
0 0 0 0 
##$XL= 0
##$YL= 0
##$YMAX_a= 797490
##$YMIN_a= -816842
##$ZGOPTNS= <>
##$ZL1= 120
##$ZL2= 120
##$ZL3= 120
##$ZL4= 120
##$ABSF1= 10
##$ABSF2= 0
##$ABSG= 5
##$ABSL= 3
##$ALPHA= 0
##$AQORDER= 0
##$ASSFAC= 0
##$ASSFACI= 0
##$ASSFACX= 0
##$ASSWID= 0
##$AUNMP= <proc_1d>
##$AZFE= 0.1
##$AZFW= 0.1
##$BCFW= 1
##$BC_mod= 2
##$BYTORDP= 1
##$COROFFS= 0
##$CY= 11.3945322036743
##$DATMOD= 1
##$DC= 2
##$DFILT= <>
##$DTYPP= 0
##$F1P= 18.9103706918063
##$F2P= -1.10871071338519
##$FCOR= 0.5
##$FTSIZE= 0
##$FT_mod= 4
##$GAMMA= 1
##$GB= 0.15
##$INTBC= 1
##$INTSCL= 1
##$ISEN= 128
##$LB= 0.24
##$LEV0= 0
##$LPBIN= 0
##$MAXI= 10000
##$MC2= 0
##$MEAN= 0
##$ME_mod= 0
##$MI= 1.114404
##$NCOEF= 0
##$NC_proc= 0
##$NLEV= 6
##$NOISF1= 3.799351
##$NOISF2= 2.8
##$NSP= 1
##$NTH_PI= 0
##$NZP= 0
##$OFFSET= 15.70392
##$PC= 1
##$PHC0= -8658.925
##$PHC1= 13.40023
##$PH_mod= 1
##$PKNL= yes
##$PPARMOD= 0
##$PSCAL= 0
##$PSIGN= 0
##$REVERSE= no
##$SF= 200.130013532006
##$SI= 16384
##$SIGF1= 3
##$SIGF2= 2
##$SINO= 400
##$SIOLD= 16384
##$SREGLST= <1H.CDCl3>
##$SSB= 0
##$STSI= 0
##$STSR= 0
##$SW_p= 3612.71676300578
##$SYMM= 0
##$S_DEV= 0
##$TDeff= 0
##$TDoff= 0
##$TI= <>
##$TILT= no
##$TM1= 0
##$TM2= 0
##$TOPLEV= 0
##$USERP1= <user>
##$USERP2= <user>
##$USERP3= <user>
##$USERP4= <user>
##$USERP5= <user>
##$WDW= 1
##$XDIM= 8192
##$YMAX_p= 0
##$YMIN_p= 0
$$ End of Bruker specific parameters
$$ ---------------------------------
##NTUPLES= NMR FID
##VAR_NAME=  TIME,          FID/REAL,        FID/IMAG
##SYMBOL=    X,             R,               I
##VAR_TYPE=  INDEPENDENT,   DEPENDENT,       DEPENDENT
##VAR_FORM=  AFFN,          ASDF,            ASDF
##VAR_DIM=   8192,          8192,            8192
##UNITS=     SECONDS,       ARBITRARY UNITS, ARBITRARY UNITS
##FACTOR=    0.0002004,     1,               1
##FIRST=     0,             0,               0
##LAST=      1.6414764,     0,               0
##MIN=       0,             -816842,         0
##MAX=       1.6414764,     797490,          0
$$ Real data points
##PAGE= N=1
##DATA TABLE= (X++(R..R)), XYDATA
0@%%%Qk4K6k6M0n7O9q4J13j46J71k04K55l11L65m31N17o07P02q18R52j092J247
26F65j429J633j847K086k359K658k977L330l729M159m623N141n712O331p012P769
42D084q604R520j0542J1694j2984J4438j6107J8042k0301K2986k6253L0320l5538
55a9245M2525n2432O7668r4362J54519n16515M0896R68734o33169p75461L25759
66d91083R17978k24620q14245K4213Q93649J75199p42229l67849O95022N25567
76E91602n11713o48653M37997P88260k33228q87368M8107Q98101J70875q37395
86a83415k96874P41103L89561o88291m95908N83654O06375m54411p04559K44526
96b58239P16921p9709p22405j08592O86518K70481o44002m64591N14563N80514
$$ y = [0, 0, 0, 0, 8, -16, 10, -16, 24, -33, 36, -48, 65, -81, 90, -114, 141, -170, 195, -236, 281, -326, 376, -442, 510, -582, 665, -764, 869, -978, 1108, -1251, 1407, -1570, 1760, -1969, 2190, -2433, 2708, -3004, 3327, -3685, 4084, -4520, 5000, -5542, 6152, -6832, 7606, -8501, 9541, -10760, 12226, -14027, 16293, -19245, 23280, -29152, 38516, -55846, 98673, -417842, -376946, 591788, -41381, -816842, -491083, 426895, 202275, -611970, -587757, 305892, 481091, -261138, -628987, 66035, 591602, 79889, -568764, -130767, 657493, 424265, -463103, -414996, 483105, 653980, -183415, -480289, 260814, 650375, -37916, -533824, 49830, 656205, 201794, -502765, -258239, 458682, 378973, -343432, -452024, 234494, 504975, -139027, -603618, -89055, 491459]
106D91459l76977o44958K48715O63231j60584p01222N0238P32782J14091o89831
116b73056k70976N87212L98325m35195m53069L20358N26370j68684n60624K2389
126c06950N83312J52563n27935k59992M83969L51233m42561m41286L92686N48529
136E33568k83542o21821J19811O05051J6715n49341j27135M72303K04017m18977
146d9351l13539L19902L99340k02982m59679P3880M77834K7142m99294j34979
156c61726N10062K66480m69680l88522L71380M59597k49910m68937J56954M70492
166B96190p2070m79000l5281M72388J69002m17305k86811L31067L71651k45034
176A04797m43316J55509N12694l8355n52915j02423N31035K20357m67613k92178
$$ y = [491459, 114482, -530476, -281761, 381470, 220886, -480336, -430098, 302684, 416775, -273056, -544032, 43180, 441505, 6310, -446759, -126401, 399969, 231285, -329339, -306950, 276362, 428925, -99010, -359002, 124967, 476200, 33639, -407647, -14961, 533568, 250026, -371795, -251984, 353067, 369782, -179559, -306694, 165609, 369626, -49351, -362890, -42988, 356352, 153370, -306309, -232429, 245405, 272547, -226747, -361726, 148336, 414816, -54864, -443386, -72006, 387591, 137681, -331256, -174302, 296190, 224120, -254880, -290161, 182227, 351229, -66076, -352887, -21820, 349831, 104797, -338519, -183010, 329684, 291329, -261586, -364009, 167026, 387383, -80230, -372408]
186c72408M07064L46496l56874m18553K78721M93547j51783n28949L934N11375
196B12570J22489m73933k30431M34963L43253l74810m54472K75609N31019j56919
206B29338n57427N8194N68325K9616n80563j34645N76113K69287n13356l89485
216d44603M02006M64613k82035n06752J71512N42284n5406n73025q7332N60843
226A92105K23369n12619l34692M45215M16245l84420n02866K99548N81709j75334
236B48260o19821L2563O02879R2040n54002j84881N11716K84508m54176l88055
246d28969L68211M83437k43271n30551J25509N53952j6835n67434r4545N68957
256B18461K23241n29052l44886M41683M22439l48177m71791K58136N09866j69458
$$ y = [-372408, 34656, 381152, 24278, -394275, -115554, 377993, 226210, -302739, -298805, 212570, 335059, -138874, -369305, 65658, 408911, 34101, -420371, -144762, 386257, 229338, -328089, -269895, 298430, 328046, -252517, -387162, 188951, 458238, -55118, -444603, -42597, 422016, 139981, -366771, -195259, 347025, 291619, -281406, -368738, 192105, 415474, -97145, -431837, 13378, 429623, 45203, -457663, -158115, 423594, 248260, -371561, -338998, 263881, 355921, -198081, -382962, 128754, 413262, -40914, -428969, -60758, 422679, 179408, -351143, -225634, 328318, 311483, -255951, -350496, 218461, 441702, -87350, -432236, 9447, 431886, 83709, -388082, -129946, 379920, 210462]
266B10462n55595M2416N62569R2117n29810k15716M62052L03773l99175l88148
276d15055L24289M69125k23185n27035R9552N40046J6937n18035j05788M95995
286A56846J96436m60562k91249L99849L85937k92861m34126J84721M54096q2822
296B16265m55647o951M59744J15891m34181k23741L72999L06834k93056l57258
306b99101K17724L93563j47047m33026N1183M45112N4503m22474j53576L62901
316F9762K15667l09112k71588K50516L25064j78562l73359P8080L83977K0095
326B10540l62895r6946L33953J62975l02530k31101K56434L01711j74215l37780
336b39854Q6428L44889n765l31555n6821L25068J33205k99207k12332K45216K77452
$$ y = [210462, -345133, -302717, 259852, 351969, -177841, -393557, 68495, 372268, -26907, -415055, -90766, 378359, 155174, -371861, -272309, 267737, 284674, -233361, -339149, 156846, 353282, -107280, -398529, 1320, 387257, 94396, -339730, -155009, 299087, 216265, -239382, -246333, 213411, 329302, -104879, -328620, 44379, 351213, 58157, -299101, -81377, 312186, 165139, -267887, -216704, 228408, 282911, -139563, -293139, 69762, 285429, -23683, -295271, -44755, 280309, 101747, -271612, -193532, 190445, 210540, -152355, -249301, 84652, 247627, -54903, -286004, -29570, 272141, 97926, -239854, -153426, 191463, 185698, -145857, -202678, 122390, 255595, -43612, -255944, -10728, 266724]
347B66724j66802l07819R3459L20411l0487l33535m2716L33405J26266l06072
357d7166k06987K44418K54267j83637k87240J23442L13621o0211l40433k7989
367b17915L35885J16563l01001j87509K51007K37149k04167k84522J50464L33559
377B29513p1267l58604j8831L52637J01686l22544j62431K94770K25481k56062
387A4348k89947J95512L44450j09435l65055K5495L62240M5803l54284j16435
397b47308L39740J95846l03093k74342K34340L24795j58954l53052Q7308L70319
407B15599j7967l87553o9354L81521J61657l44346k39811K87108K94335k29718
417E1471l39864J70003L86562q9817m15812n456M15377R9084l85720j72020L52360
$$ y = [266724, 99922, -207897, -114438, 205973, 175486, -158049, -200765, 132640, 258906, -47166, -254153, -9735, 244532, 60895, -226345, -102903, 210718, 150507, -189926, -217915, 117970, 234533, -66468, -253977, -2970, 234179, 30012, -254510, -104046, 229513, 158246, -200358, -219189, 133448, 235134, -87410, -249841, 44929, 270410, 14348, -275599, -80087, 264363, 154928, -210127, -184632, 177608, 223411, -130873, -247308, 92432, 288278, -14815, -289157, -54817, 269978, 111024, -242028, -154720, 215599, 197632, -189921, -259275, 122246, 283903, -60443, -300254, -13146, 281189, 51471, -288393, -118390, 268172, 178355, -237457, -242913, 172464, 271548, -114172, -286192, 66168]
428F6168K40485l11214l09529K52088L73570j65532m07860P3128M14415R872m09227
439a73636q7562L97934J72528l68204k60541L06429L26660k29490l67720J52035
449a31567L92373p9320m15055p313M19462J02625l94670j90163L43491K54124
459B93987k87402l04372K29983L52981j58196l90411O8753M01718K4663l82975
469a51271j01366L54883J68835l21325k35924K75155L02629k03289l46539J20308
479a37904L62762m3067l62963k5576L58604R8067l42080j76812K98009K42312
489B71352k34855k85106J66636L09307j04473l31206L2443L41225M9085l28459
499a14051j30107K88145J89669k40630k33969J93552K73438j39866l08551O9265
$$ y = [66168, 306653, -4561, -314090, -62002, 311568, 146036, -261824, -188696, 225719, 235591, -173636, -261198, 136736, 309264, -58940, -319481, -13052, 313608, 84118, -283602, -131567, 260806, 181486, -233569, -240882, 178580, 281205, -113465, -303628, 39863, 293987, 6585, -297787, -67804, 285177, 126981, -263430, -194677, 207041, 231704, -151271, -252637, 102246, 271081, -50244, -286168, -11013, 291616, 88327, -258212, -137904, 224858, 181791, -181172, -206748, 151856, 249923, -92157, -268969, 29040, 271352, 36497, -248609, -81973, 227334, 122861, -208345, -175902, 165323, 214408, -114051, -244158, 43987, 233656, -6974, -240943, -47391, 226047, 86181, -222370, -153105]
509a53105L23589R220l09821p5681K81424J29677k48173j78601K09165K29526
519B17220j49237k63745P8023K75371r081k67725m6349K58435J01865k42199j61258
530b08680K07263K13861j51442k43837Q9878K51812l6250k52829j7713K46822
540I8885P6838k25973j37698J81787J81073j30247k08714Q0296K29084l0917k47869
551a33455l0196K51021R7337k28559j52677J89059J88535j47131k12997J06470
561g2593K36841n4079k50947r699K45679P4043k20362j26401J90097J73239j55747
572C0071k20560J08773K61963m4623k81143k2916K76017P8332k60825j24146K43395
583D4338J71229k16607k21315J67829K59425j04050k77819L7117K80829K7114
$$ y = [-153105, 170484, 179704, -130117, -205798, 75626, 205303, -42870, -221471, -12306, 217220, 67983, -195762, -117739, 157632, 148551, -119174, -165523, 92912, 194777, -47422, -208680, -1417, 212444, 61002, -182835, -92957, 158855, 122605, -130224, -147937, 98885, 175723, -50250, -187948, -6161, 174912, 44665, -164049, -83753, 145331, 114414, -133455, -163651, 87370, 184707, -43852, -196529, -7470, 181065, 33934, -179063, -72593, 164248, 110169, -140778, -150477, 95202, 169245, -51117, -177518, 12579, 185818, 30071, -190489, -81716, 180247, 135624, -145519, -168435, 107582, 185914, -74911, -199057, 44338, 215567, -1040, -222355, -54526, 204899, 100849, -176970, -139853, 140976, 168090]
593A68090k77379r5357K61431J66315k25396k26176J74440K66561j22055k92202
603b01728P4764L16274j9668l31339m6901L26493J18424k93751j75919K46948
613A3597K20419j93665k56743J34037K86827o2668l01387j2525K96872P8503k84347
624h1080j37772K68282J96763k44244k59387J96106L06318j30999l27973O2746
634a51240L25376m829l15227n1139K98781J10849k69234j70233K23015K19577
644B15696j68345k56946J12674K90612m9305l15317k3528L20868R9378k99141
654g3354j57595K64315J97584k28170k27497J92890K58959j44744k83842Q2046
664a19408K92405j2800k83164n3660K61724J16936k30940j78187J84352K25849
$$ y = [168090, -109289, -204646, 56785, 223100, -2296, -228472, -54032, 212529, 90474, -201728, -126964, 189310, 169642, -161697, -208598, 117895, 236319, -57432, -233351, 13597, 234016, 40351, -216392, -82355, 204472, 141804, -159583, -172108, 124764, 203267, -81080, -218852, 49430, 246193, 1949, -257438, -61332, 244986, 113987, -213986, -151240, 174136, 169307, -145920, -197059, 101722, 212571, -56663, -226896, -3881, 215696, 47351, -209595, -96921, 193691, 144386, -170931, -194459, 126409, 225787, -73354, -230949, 33366, 230950, 2780, -224717, -31827, 227132, 82388, -201454, -119408, 172997, 160197, -122967, -176627, 85097, 202033, -28907, -207094, -22742, 203107]
674B03107j29094k55250P4324K66560l1920k76901j0629K83086N9327k77681j16001
685b11072K46111J61593j98045j91251J42798K07081q6865k15117K7902K13162
695I6297L1499j97323q0774J77411J20955j58642j57601J40603K00102j05693
705F6834k32799N5420K43876L31k27219m1769K00096P1846j71089r8068J40403
716G862J25538j01645j48171N6560J62633j2287j73223l4101J78404Q4574j71627
727b5483j36081J43009J71088j03234j84370O4699J81576l6497j77923P603J73844
738G8231K8628j61545p0481J36284J10051j00879j43445N9453J71322j0019j86549
749h8949m2810J84382Q9286j65382j17657J44962J35125j28229j52861J09105
$$ y = [203107, 74013, -181237, -106913, 159647, 127727, -149174, -159803, 123283, 182610, -95071, -211072, 35039, 196632, -1413, -192664, -49866, 157215, 70350, -144767, -116865, 96297, 127796, -69527, -150301, 27110, 148065, -10577, -168178, -27575, 172527, 66834, -165965, -110545, 133331, 133662, -93557, -135326, 64770, 136616, -34473, -132541, 7862, 133400, 31755, -116416, -59856, 102777, 90490, -82733, -116834, 61570, 146144, -25483, -161564, -18555, 152533, 49299, -135071, -70372, 111204, 74707, -103216, -95613, 78231, 106859, -54686, -125167, 11117, 121168, 20289, -123156, -63703, 107619, 97600, -88949, -131759, 52623, 141909, -23473, -141130, 3832, 138957, 10728, -142133, -33028]
759c3028J75514p3922j91634K3433J90519L0797j72912q0149J45828J23904j12450
770B5900j62024P1234J88431k8059k00737q793K05207L7847k10927p0089K13274
781F1264J12706j98423j57797J59390J89653j05575k01563N1693K01389k108j96570
792h5941m6391J87520R4905j71311j39334J50464J79433j26111k17594R4177K52076
803A71893m7524k71473r201K66541O2103k42113j02476K10211J33222j78273j63902
814a70992J40859J94355r4751k20088M0451K35610J6026k43350p5951K38800J36053
825A97022k17807j88765J79316K22680j35141k37711R5967K45244n9414k52416
835a51025J6141K54837L9325k40848r6693K09879J47434j67072j87341J20088
$$ y = [-33028, 142486, 68564, -123070, -99637, 90882, 121679, -51233, -131382, 14446, 138350, 25900, -136124, -64890, 123541, 95482, -105255, -114048, 91159, 129006, -81921, -152010, 61264, 173970, -24453, -182250, -22860, 166793, 61218, -140345, -88652, 112737, 110629, -85941, -132332, 55188, 150093, -21218, -160552, -10088, 169345, 43234, -174360, -80183, 171893, 124369, -147104, -156305, 110236, 172339, -69774, -172250, 37961, 171183, -7090, -170992, -30133, 164222, 69471, -150617, -110166, 125444, 141470, -101880, -177831, 60969, 197022, -20785, -209550, -30234, 192446, 57305, -180406, -84439, 160805, 101391, -151025, -134884, 119953, 159278, -81570, -178263, 31616, 179050, 11978, -175363, -55275]
845e5275K19446o7200k39133J2720K44498L7214k37058p6440K26510J11130k13763
856c7351j48304J90766J86846j49168k14144R4218K22978l7515k16588j3620K03233
867H1351O0642j85300j05264J60476J44464j30639j75882R9106K01780o5216k23366
878a37848K3624K34632K5368k27156p2053K01337J06638j67337j29364J32953
888i206J47786r7050j64520N4922J75339q400j76537l7388J69443P9415j56823
899b3019j20103J34252J55078j00731j77408O0077J81828k4418j75632m701J66757
910G1980L2575j56391o5366J36606R8756j04455j24457O5684J40153k5992j47913
921g8820j2393J49742N2055j40601q6559J22081J11709r8205j26556P5874J38509
$$ y = [-55275, 164171, 96971, -142162, -129442, 115056, 152270, -84788, -161228, 65282, 176412, -37351, -185655, 5111, 191957, 42789, -171355, -77137, 145841, 108326, -108262, -121882, 81351, 141993, -43307, -148571, 11905, 156369, 25730, -150152, -51046, 150734, 85518, -137848, -114224, 120408, 145776, -81380, -153433, 47904, 154542, -12795, -142159, -9206, 138580, 41530, -122990, -68068, 107271, 98871, -77666, -115054, 54389, 133804, -23019, -143122, -8870, 146208, 45477, -131931, -71854, 109974, 85556, -90076, -94777, 71980, 104555, -51836, -117202, 19404, 118160, 13705, -110752, -45068, 95085, 69093, -78820, -91213, 58529, 110584, -30017, -116576, 5505, 117214, 19009, -107547, -31673, 106836]
932A06836n1014j48775J8529J51783K1302j41147n9657J18314Q9955r1104j14184
943i9162O1584J33501k9369j47558p047J50804M0594j46129p0462J36309R7144
954A20209j22527j25210R8125J49022o2444j61776K0878J60925J7930j52383n2937
965a10188J40730Q8124j23127j22357R7083J51258o3586j69819K9338J81364O371
976A05191j86595m4698J83102Q6017j65030j21973J35758J47877j01642j65288
986a27281O7010J79089k8513j88781j6348J88099O2618j75612j04477J54213J39324
997A49341j28763j70358R6510J95195n6655k09722J1961K10374L0017k01901o8258
1008a42259J87922J05564j67276j42680J35760J74265r4466j94460N0135K04549
$$ y = [106836, 55822, -92953, -74424, 77359, 98661, -42486, -102143, 16171, 106126, 15022, -99162, -37578, 95923, 66554, -81004, -88051, 62753, 103347, -42782, -113244, 23065, 120209, -2318, -127528, -29403, 119619, 57175, -104601, -83723, 77202, 95132, -57251, -110188, 30542, 118666, -4461, -126818, -29735, 121523, 57937, -111882, -82544, 98820, 105191, -81404, -126102, 57000, 143017, -22013, -143986, -8228, 139649, 38007, -127281, -60271, 118818, 90305, -98476, -114824, 73275, 135893, -39719, -144196, 10017, 149341, 20578, -149780, -53270, 141925, 85270, -124452, -112491, 97883, 127900, -74001, -142259, 45663, 151227, -16049, -158729, -22969, 151296, 56830, -137630, -87495, 117054]
1018A17054o483k07568l6987K03910Q2238j89190j24001J63471J57776j31103
1028B9117j82303R6341K01578n7500k15075J2456K18039L5602k07618p9815J87111
1039C7933J17319j61834j50452J31239J79956r2999k01805M8000K11371k618k09895
1050i3785l9583K01156P9513j85708j18610J60119J52872j24379j76608Q3711
1060f1302J89499m3406j94909L098J94407L9073j84526q0443J63334J15420j34283
1071E962j41052J02676J59945o8904j73713L1054J79520R749j73635m7959J58094
1082D1737P9693j37568j06276J13661J29841q3921j47976M8115J56146j1010j54063
1093g1621k2738J45656N3084j33259q2333J14180J08680q7109j27399N5227J36138
$$ y = [117054, 110571, -96997, -133984, 69926, 152164, -37026, -161027, 2444, 160220, 29117, -153186, -56845, 144733, 87233, -127842, -115386, 102653, 138255, -69363, -149178, 37933, 155252, -6582, -157034, -25795, 154161, 61162, -140643, -92643, 118728, 116110, -93785, -133368, 67788, 147301, -38407, -157017, 3102, 155974, 31595, -145013, -61302, 128197, 84791, -110118, -107020, 87387, 126460, -58066, -138509, 24825, 140245, 5962, -135090, -32414, 127531, 58627, -115086, -84032, 95488, 105237, -68398, -116357, 41737, 121430, -16138, -122414, -8753, 121088, 37167, -110809, -62694, 93452, 82442, -71621, -94359, 51297, 104381, -28878, -111211, 2969, 111649, 24540, -102859, -47632, 88506]
1104H8506k3909j38363o015J35898L6516j27222o7295J09497R2979q4429j10488
1115i4325N7074J21089k9588j27416O3J28245L1783j19961o1609J02854Q5239
1126I3448q1097j02437N7786J16088l1415j24979O15J25837L1260j16771n9141
1137i0806J01614Q1660q3121j01133O0877J17702l2731j27266P23J27355L0135
1148H5009j19679n7216J07801Q2152r1445j05675O8276J24194l8581j34092P138
1159g2118J35623K2744j32186n1785J23779Q1343j07859j08605Q3589J29052n4625
1170D8952j41536K5013J48586N523j50969l8420J46048P2126j31361j01623J09475
1181h186J24728q3958j42710N5709J56842k2719j64644j4114J62978N0302j52453
$$ y = [88506, 64597, -73766, -79781, 56117, 92633, -34589, -101884, 7613, 100592, 16163, -94325, -37251, 83838, 54250, -73166, -73103, 55142, 86925, -33036, -94645, 8209, 93448, 12351, -90086, -32300, 83788, 52373, -72606, -71991, 53846, 85106, -31665, -90806, 10808, 92468, 9347, -91786, -30909, 86793, 54062, -73204, -72481, 54874, 85009, -34670, -91886, 15915, 98067, 6622, -99053, -30777, 93417, 54836, -79256, -72118, 63505, 86249, -45937, -97722, 26057, 107400, -459, -109064, -25475, 103577, 48952, -92584, -67571, 81015, 86538, -64431, -102851, 43197, 115323, -16038, -117661, -8186, 116542, 32584, -110126, -54417, 102425, 79706, -84938, -99052, 63926, 114228, -38225]
1192c8225q2762J36542J11717j16431j38613Q9543J60941n5925j74610J9003J78263
1203H9443J6853j74846n1303J65715Q5355j49062j17825J23240J44248r1000j62317
1214a21499N6186J73474k0213j79186j8275J77562N7852j65434r4161J44679J23138
1225A34123j19048j45450R1034J63309n8941j75253K2406J78307J5787j71427
1235f5153n1317J57262Q3094j38258j12101J12984J37058q1682j55010M6486J63380
1246I6743j2434j65526k0147J62462N1902j53861q3725J36326J11191j11199j31487
1257a19755Q1699J44171n0644j50973J7611J52125J6901j45034m9723J30963P8256
1268A05597j12478j01949R1837J23184o6814j40078L6766J48820m043j46710k5971
$$ y = [-38225, -120987, 15555, 127272, 10841, -127772, -38229, 122712, 66787, -107823, -88820, 89443, 106296, -68550, -119853, 45862, 131217, -17845, -135670, -12430, 131818, 40818, -121499, -65313, 108161, 87948, -91238, -109513, 68049, 125901, -39533, -133694, 10985, 134123, 15075, -130375, -39341, 123968, 65027, -110226, -87820, 90487, 106274, -65153, -116470, 40792, 123886, -14372, -126473, -13489, 123569, 41887, -113123, -66637, 96743, 84309, -81217, -101364, 61098, 113000, -40861, -124586, 11740, 122931, 11732, -119755, -38056, 106115, 55471, -95502, -77891, 74234, 91135, -53899, -103622, 27341, 105597, -6881, -108830, -16993, 106191, 39377, -100701, -63935, 84885, 80842, -65868, -91839]
1279i1839J36819N1290j22211p2876J03755R2180q0013j06825N2123J15023k2792
1290E4634j17448n910J15654L4704j09012o3163R4516Q7246p3574j03086M9759
1301c5680J10113k7868j12373O808J10982J5024j05068l8109R2152N9229p3185
1312B025p6326N0500Q9625k4588r7583l101R9238L1013r2774n3330Q2328P0681
1324G7708o9998q3771N7083R6054l9135j04906J6132J07076R996j00905l5477
1335g0143Q8193N8514p0735p8986M8519R4167k3873j03367o05J06892K1760j08636
1347c8300m2833J07656O5170j00903q9082Q3647J07491n8386j17358K9294J18003
1358F4399j296j13745k6035J05290N2505r2820p7541P6752R9954n7777j19302
$$ y = [-91839, 44980, 96270, -25941, -98817, 4938, 97118, 17105, -89720, -37597, 77426, 54634, -62814, -68724, 46930, 81634, -27378, -90541, 3975, 91221, 17647, -85439, -35680, 74433, 46565, -65808, -59000, 51982, 67006, -38062, -76171, 15981, 75210, 2025, -74301, -23801, 65824, 41236, -56347, -59448, 39790, 70803, -21971, -75301, 7027, 77708, 7710, -76061, -18978, 77076, 37941, -66965, -50833, 56243, 66239, -34666, -70143, 18050, 76564, 5829, -73157, -24638, 69529, 45656, -57711, -58316, 48576, 70336, -38300, -81133, 26523, 91693, -9210, -98292, -14645, 92846, 34460, -82898, -53604, 64399, 63103, -50642, -76677, 28613, 81118, -11702, -89243, -12491, 87463, 29686, -89616]
1369h9616L6297J36326r319j46179k1049J46372N2200j33784p6284J14895R4280
1380A04139r2379j06599O9280J17801m2664j26188J2502J30793K0750j30124n5839
1391i8528J22283Q9521j06829j19699Q2818J39560n6474j50028L0430J52130q527
1402G6657j52324j4791J48729M0658j39845o9654J21028R6614r4215j19040O1817
1413d4366J34845k6222j43222r287J43805M2084j37629o8034J29671R0622j20052
1424g785j11487J07654J33636q5084j50065N4198J57137j7678j50927j5926J37041
1435E0714M5890j18189p1061R7609R3508p5804j13068N2610J29708k8264j44151
1446h0498l33J51306L0877j49486o1754J34358Q4373j12580r8933Q6817J04698
$$ y = [-89616, -53319, 83007, 73688, -72491, -93540, 52832, 105032, -28752, -105036, 9859, 104139, 11760, -94839, -25559, 92242, 49578, -76610, -64108, 66685, 87435, -42689, -98528, 23755, 113276, 6447, -113252, -30434, 109126, 52652, -97376, -66946, 85184, 76657, -75667, -90458, 58271, 98929, -40916, -110570, 10458, 107072, 12857, -106183, -44366, 90479, 64257, -78965, -88252, 55553, 97637, -39992, -108026, 21645, 112267, -7785, -119272, -11618, 122018, 36934, -113131, -58933, 98204, 80526, -70401, -86327, 50714, 96604, -21585, -92646, 4963, 98471, 22667, -90401, -37791, 91917, 63653, -80498, -80831, 70475, 101352, -48134, -109888, 24470, 108843, -3737, -102670, -15853, 88845]
1457H8845o2705j08328L7775J09453j1640j09152j7166J05108M7578r5622p7180
1468i3034P9576J03070n6096j19129L0720J24491p245j20505r101J14615K3158
1479G0520j07372l7524R8099N5232q0943p2033N7151Q4746k7934r0839k321R0554
1491C7336L1004q3867n5274P2541P2118o0694q2733M9831R0269m0284r8315K5915
1503d2153J03176n859j01422j8637Q8439M0349o8046n6887M3693O6594k0286p2220
1515d3259j351P4922K0225p6126l7174P6589N4285p3719p1445O4932Q7214m7030
1527B8063r5508K4176R4603n7q4862j9785P1594L7101n6728n1881M1708O6440
1539E4864k5434p9634Q066R1168J1940r9232l4634J00071N7980r1315p7251P4033
$$ y = [88845, 26140, -82188, -44413, 65040, 53400, -55752, -72918, 32190, 79768, -15854, -93034, -13458, 89612, 33516, -85613, -54893, 69598, 62353, -58152, -67253, 47362, 70520, -36852, -74376, 23723, 78955, -1988, -74021, -16870, 67876, 39942, -50897, -53218, 37336, 68340, -15527, -70801, 1740, 73858, 13164, -69569, -19738, 70531, 30247, -68068, -42153, 61023, 55164, -46258, -64895, 23544, 63893, -4153, -61040, -17347, 49247, 28961, -43259, -44610, 30312, 50537, -25589, -62763, 13826, 68111, -5608, -77053, -12121, 75093, 28063, -67445, -43269, 51334, 51277, -33585, -53370, 18224, 55325, -1403, -53284, -11576, 54864, 29430, -50204, -42138, 49030, 60970, -38262, -72896, 27175, 85155, -6160, -83411, -9378]
1551i378Q7710n3775r1065L4177R0752j6033r0665m859Q9048K8894q3911n5251
1563g4356P2696P9811n6375j00935L5397J15868j2105j22969j1437J22018L1672
1574G9285j15586m8075J06849O3338r5561p9468P9403R6171n5618j08675K6007
1585e1930J14942O041j13404l6466J06358O3846r4435q6247P9884J04081o3817
1596B8853j17639M6790J28438k6868j35598K402J36097K4955j27354n1664J09968
1607A8380P3308q7720r0151O3507J02435l8671j11780J2854J17087J2616j18657
1618d6792l7839J16021O2056j08401q5221R4025J04259p2999j16059M8406J19781
1629G7237k3987j17621J384J12756K1008j05270m3848R4098O6512p8043q6289
$$ y = [-9378, 78332, 24557, -66508, -32331, 58421, 42388, -48277, -53136, 35912, 64806, -19105, -74356, -1660, 78151, 21776, -79159, -43762, 72106, 60001, -62968, -74405, 47613, 79285, -36301, -84376, 22473, 85811, -9750, -89218, -9815, 86356, 30738, -77937, -51930, 63012, 69053, -44351, -80817, 25541, 89387, -5048, -91295, -11411, 92670, 28853, -88786, -41996, 86442, 59574, -76024, -73622, 62475, 87430, -39924, -91588, 18380, 91688, 3968, -86183, -22676, 79759, 41088, -70692, -57838, 59249, 71865, -46792, -84631, 31390, 93446, -14955, -100176, -6151, 98108, 25109, -90950, -42544, 77237, 53250, -64371, -62987, 49769, 70777, -34493, -78341, 15757, 82269, 4226, -82063]
1640h2063N8410J02194l6023j12801J2170J17484J1731j15152l3224J07165N0863
1651H0754r5875o5172Q2345P7866o5884q8875M5051R6036k0991r7803l943R3756
1663C7265K7268q5542m8187P3669O5537n8642p8676M2132Q6641k5366r0799Q708
1675d5992R1692Q840q8539k6880P9611M3538o5173n6150M7532O4105k9112o8364
1687d4892J0980O9479P224o7290k4525O1540L9550n3082n1723M2529O1376k9742
1699B1424o8301J4535P0443K265o7343j7924N9688L1259m9815m2145L8178N1645
1711D3909k4549n9053R213O2838P120o2820k2568N9354L7136n2761n0054M2625
1723i610O0579k8964o6944J3549O9002K000o7799j7159O3906L2618n6935m7693
$$ y = [-82063, -23653, 78541, 42518, -70283, -58113, 59371, 71102, -44050, -77274, 29891, 80754, -15121, -80293, 2052, 79918, 14034, -74841, -29790, 66246, 45255, -52548, -56491, 37265, 64533, -21009, -69196, 4473, 70010, 11368, -67308, -25176, 61465, 36099, -54700, -45992, 45700, 54540, -33999, -60879, 18732, 62270, -2903, -59053, -11521, 52584, 23472, -44892, -33912, 35567, 42791, -24499, -49024, 12516, 52066, -1016, -52739, -10210, 51166, 21424, -46877, -32342, 38101, 40366, -26977, -44901, 14787, 46046, -3769, -45914, -7736, 43909, 19360, -39693, -30480, 32358, 39478, -23342, -45910, 13444, 50580, -2181, -52235, -9610, 50969, 22005, -44939, -31390, 37612, 39612, -28187, -45346, 18560, 51178, -5757, -53450]
1735e3450M5905O0459l1709o9670J5596P5220J055p7578j8543P5687L5938o9240
1747a0330n1930N8481O4716m5126p4563K9693Q1715j2176q5502p435Q4755K7438
1759E9736p9022m5717O9503O1777n7047p5109M1973Q6009k3895r2507M324R4447
1771D4472J5280r1609l4026Q5713N1908p5803o8292O1878Q1930m4428r1389K5160
1783c9206R6586n431r8357j4985R6385L5260r0099n4624P8845P1081o4810q4341
1795g3696M8128R4136k9694j00916R041J02918J2314j00096l2873R2825N1421
1806G3508q2351o7908O8835Q2301n1781r2900L2184R9373j1494j00774q618R8726
1818C9101K8678r2632m7551Q2707O4670o8273p7949N1427Q7364l2960r3199J3883
$$ y = [-53450, -7545, 52914, 21205, -48465, -32869, 42351, 43406, -34172, -52715, 22972, 58910, -10330, -62260, -3779, 60937, 15811, -58752, -29059, 52656, 40480, -45022, -52457, 32298, 59736, -19286, -65003, 4500, 66277, 9230, -65879, -23906, 62103, 38208, -54299, -49975, 44472, 59752, -31857, -65883, 19830, 71738, -4065, -72357, -10479, 71451, 27023, -64366, -39206, 57380, 51949, -46408, -61393, 34992, 70252, -19847, -74471, 4374, 75455, 10645, -73696, -25568, 68568, 38874, -62042, -53001, 49917, 62231, -37865, -70738, 22087, 73508, -8843, -76751, -7916, 74385, 22604, -70296, -38112, 61261, 49767, -51007, -59625, 39101, 67779, -24853, -72404, 10303, 74973, 6700, -71249, -19822, 67542, 34582, -58617, -44734]
1830d4734R5298O124r3169k5815Q6083M3361p5519n8233O2143O9870m6992p9168
1842f0751K9613Q4084j1157q5031p238Q1342K3857p4865l9027O5533N2284n3470
1854E174o3004L8707P0060k2660p3178O800P3226Q807p0200k3796O4264L7861
1866E2061n4657m9093M2827N7449k9522o2563J5931O5178j381o4459j3195O0203
1878A8779K6728n2649l7747M2810M6506l1625n3054J8721N6768m707n7181r287
1890c5938N3839K1657m8011l2406M0094M1422l0167m8428J8202N2268n263n2413
1902b5144p431M9563J9290m4134l0169L6470L9503k5869m6409J3753N0150j170
1914B8403n0917j1065M9439K3053m5355l4466L8062M4058k8044n0840J6284N4289
$$ y = [-44734, 50564, 56688, -36481, -62296, 23787, 67148, -8371, -66604, -4461, 65409, 18417, -60751, -31138, 52946, 41789, -43242, -50480, 30862, 54719, -20146, -59173, 6360, 58644, 5174, -57830, -19123, 50937, 28277, -44901, -38101, 35125, 43932, -26268, -50064, 14200, 52061, -2596, -51689, -8862, 48587, 19065, -43498, -27567, 37611, 36230, -28229, -41424, 18779, 45507, -7142, -44889, -2079, 44427, 12802, -40252, -21531, 35237, 30530, -26651, -35938, 17901, 39558, -8453, -40859, -765, 40657, 10490, -37938, -19736, 32532, 27269, -25144, -32575, 16988, 36278, -7856, -38025, -1555, 37948, 12079, -34330, -20577, 29573, 28403, -22514, -33579, 15860, 38913, -6442, -40908, -2846, 41212, 13168, -37672, -21388, 32901]
1926C2901l943n5330q981N3567K1928m8949l4387M0984M4998l1207n3455J9909
1938b1965N9982p298o4227o555O5232K1030o2084l4378N5682M5965m6509n5198
1950e0323L5724O2757k2471o7714P699O9885Q461o8631k4388O4412M0062n7047
1962a574n4722M6541O6852l3313p5495J8387Q0114l674q1723j1576Q0145K6510
1974E6472p5511m1689O6434N4993n3986o6404L8395P4470k1019p9541J987Q0654
1986C5255J6950p7705l4304P1775M9491o3441o2583N3700P4292m0634q2901K4931
1998c5174Q7949p097q7003j0380Q2169K7050p3493m1489O2272N4547m8672o5271
2010e4592L3809P3496j8040p9536J362Q2726J5852q2525l3301P7096M8336o7778
$$ y = [32901, 28958, -26372, -35353, 18214, 40142, -8807, -43194, -2210, 42788, 11581, -41874, -21965, 38017, 30719, -33508, -40063, 25169, 46199, -15885, -50263, 5419, 51384, 4875, -50323, -14599, 48158, 25687, -42027, -34328, 35557, 44018, -24613, -49001, 15411, 55473, -1574, -56296, -9755, 57097, 23784, -51711, -33324, 46790, 43116, -38607, -50183, 29962, 56472, -19039, -60728, 5706, 60699, 6713, -59691, -21296, 53174, 32155, -47386, -45399, 35255, 52205, -25500, -59804, 11971, 61462, -1979, -64562, -10862, 63430, 22796, -60105, -35174, 52775, 45678, -41325, -51705, 30464, 57514, -15979, -57468, 4804, 59351, 10679, -54592, -20783, 52713, 34673, -44863, -43501, 39225, 55077, -27448, -60749, 16347, 64683, -3095]
2022c095o0123N5070O7438m1706p1986K7124P3760j2023p3807m176P0958K0969
2034D8403o5241l7864N6328N3386m3851o5492K9173P3194j3930p5902N89P5639
2046C4432J1355p2925k2153O8400L3053o0364m3032M8868N1167l4044n6339J7197
2058b4385N8035J22n5819j6576N0183K9904m3020m0123L5853M7630k9376n4368
2070d1940K1661N9614j1553o2117o94N9273J2979n1289k3142M0026L0172k7308
2082E682l4355J5011L6963l371l8388p398L9799J8245m0182k9240L8436M0023
2094D1225l2697m8303K3323N2200j2180n0861J258M5573P623l8375j5356L0559
2106C989K2317k2843k9819J4016L7766l613m5130r359M9230K3569m8295l6212
$$ y = [-3095, -63218, -8148, 59290, 17584, -54402, -27278, 46482, 34459, -39348, -43524, 27434, 48403, -16838, -54702, 1626, 55012, 11161, -54331, -25158, 48036, 34106, -41796, -41207, 34432, 45787, -27138, -49291, 19109, 52162, -8202, -51234, -2366, 48801, 14757, -41582, -24385, 33650, 33772, -22047, -38623, 11560, 41464, -1556, -41679, -5826, 41804, 12428, -41940, -20279, 39335, 27782, -34335, -35029, 24244, 37223, -14066, -37208, 2818, 32990, 5682, -28673, -13662, 23301, 19930, -18458, -25856, 13943, 32188, -7994, -37234, 1202, 41225, 8528, -39775, -16452, 35748, 23568, -27293, -26035, 19538, 27161, -11214, -26570, 3989, 26306, 3463, -26356, -12340, 25426, 21813, -23317, -32676, 16554, 40123, -8172, -44384]
2118d4384M2099M4810l3263m8136K4356M8513j5853m7608P211M6577L737m4021
2130a5962j6691L8963L0937l0183m4168J8010N4745l701o0560j0903O1270K2860
2142D4617n8665l1564N4313L7589m9994m4222M3741N1180l3884n8055J8618O1149
2154C4823l42n9429j8579N2798L4945m3368m7694L3463N7288k4230o4672J6188
2166b8809P1695o951p7095m089P9965J8297p6785l2631O7981M5293n3775n3555
2178e0459L7627N8431k1292o0603N940O1984Q407o3276k3471O3723L9176o2094
2190e907n6004N5109P0162m3397p9783K7898Q2016j3264p9270K01P3528J0831
2202D2120o7471k2399O0463L5294n0979m8796L8196O1434k1675p0139L739P4450
$$ y = [-44384, -2285, 42525, 9262, -38874, -14518, 33995, 18142, -29466, -22255, 24322, 28059, -15962, -32653, 6310, 37247, 7064, -37104, -19094, 35651, 31950, -28610, -39513, 21757, 44617, -14048, -45612, 8701, 46290, -3704, -47926, -4185, 46995, 13111, -44944, -26326, 34823, 34481, -24948, -43527, 9271, 44216, 848, -46846, -13383, 43905, 19675, -44997, -28809, 42886, 35935, -41160, -45249, 34716, 53013, -23772, -56403, 11578, 56871, 3096, -50459, -12832, 45599, 24307, -36296, -30356, 31628, 40035, -23241, -46712, 17011, 56187, -5907, -61911, -6802, 63360, 19963, -59820, -31922, 50094, 36830, -42440, -42239, 31289, 42120, -25351, -47750, 12713, 48007, -2972, -51768, -13572, 47862, 26187, -43952, -40213, 34237]
2214C4237J4573p2832k9183O7917M0335o0509m7154N3632N2946m5698n8108L5672
2226a4172O2941k1575o5037M375O2437J3287n5133k9338M4245M1032l3062m9283
2238c9283K2235N4443j3971n9214N731O2695L102o4909j4181O2627K5539n5352
2250a0538l5139M3530M1013k9581m2955J6229M2505l716m0491p035L9083J7482
2262C0387l7042k7550L4572L8324k9104m7375K0715N2936r542n3098j097M8178
2274B0304R381m0901j4938L2933J9084k5664k3920J7453K8616q094l3193l440
2286b2379L5279J5058l4245k6252K9506L4329k2432l8546J4576L9053p541l7041
2298b0635J521L4779M783l1525j1826K7346K0524k0105k8548J0903L4964N70l7915
$$ y = [34237, 48810, -24022, -53205, 14712, 55047, -5462, -52616, 1016, 53962, 8264, -49844, -14172, 48769, 27194, -37843, -33468, 28969, 42256, -12877, -42215, 2030, 43062, 10000, -39283, -17048, 37395, 23424, -35790, -30059, 32636, 35738, -29171, -43352, 19275, 44814, -10538, -45677, -2147, 38866, 9285, -33670, -17441, 25064, 21348, -19143, -26178, 12905, 30387, -6655, -34205, 367, 38691, 9587, -37788, -17073, 35863, 26321, -26777, -27874, 20304, 29685, -11216, -26154, 6779, 25863, 199, -23721, -6268, 22348, 14254, -18939, -22379, 12900, 27958, -6287, -32539, -3033, 31296, 8864, -29682, -15106, 23947, 16406, -20635, -19114, 15665, 20448, -11077, -22903, 4443, 24967, 4862, -23686, -12783, 22181, 22751, -15164]
2311a5164j1810L7773K1756l4810k8839L0554L3495k5924l7206K0691M0313j4262
2323A6567m3213M779M3644O498m1416j8616L5204K9134k7210l7840J7770M3989
2335B9290q514m8219n20N0775R242n1812j7889N1325K7372m7890l6693M1184M5169
2348D2820l0536n0434J8075N2807m864n2183p529N0176J9422m6915l0875M2075
2360B039M2013l5861n1950K7038N9649j6392o5050L920O6046Q543o3629k0633
2372d4267N7681L0588n0117l9575M0793M7250l0298n3977J7989N8697m152o1027
2384c0415r891O0459K3906n6711l6119N0450M6588m1616n4036L2005N9146k1175
2396B2591o2000J0221O3222K016o1867j4766N7608K7287n0556l8530M1115M7376
$$ y = [-15164, -26974, 10799, 32555, -2255, -31094, -540, 32955, 7031, -30175, -9484, 30829, 16567, -26646, -21867, 21777, 28275, -13141, -31757, 3447, 32581, 5371, -32469, -14699, 29290, 20776, -27443, -27963, 22812, 32054, -19758, -37647, 13678, 41050, -6840, -43533, -2349, 42820, 12284, -38150, -20075, 32732, 27868, -24315, -31844, 18332, 37754, -9161, -40036, 2039, 44052, 8191, -43759, -16721, 42928, 26536, -38514, -34594, 31452, 39995, -23634, -44267, 13414, 44002, -6115, -45690, -4897, 42353, 12055, -41922, -23933, 34764, 30612, -30415, -40306, 20153, 44059, -12652, -48771, 1679, 48267, 6651, -47385, -15380, 43766, 22591, -39409, -29188, 34034, 36050, -25817, -40583, 17025, 44312, -6244, -44774, -3659, 43717]
2408D3717l0358n4456J8654N8536o851o0655n268N9937J6430n7411k7139N2291
2420G427L6695m4840m4930L4932N0817k3168n3860J1056N4548J116n2548j2460
2432c5215M9162K3495m3191l2778L6169M0667k7039m6301J7565M9863p046n0552
2444b5201l584M8783J3414m4196k2099L7682K8923l0077l4647K1245L8178j1909
2456A6512m0267J751L9676P622l7442j6587L2990K4005k7261l0318K0126L4368
2468B5175j2117l6316L914L6263M316l4329j1797L1053J9142k5763k4970J9232
2480f197K9770j1280l2377L615L3306M814l2344j2652K9642J9967k4985k6068
2492b4789J8903L0442j1937l3429M032L4425M082l3757j2631L0590K0177k5920
$$ y = [43717, 13359, -41097, -22443, 36093, 29242, -31413, -36681, 23256, 39686, -17725, -44864, 7427, 44122, -718, -45648, -10716, 40101, 16933, -36927, -25871, 28677, 29793, -22755, -35215, 13947, 37442, -5749, -38527, -2358, 38309, 11270, -35031, -17466, 32397, 25351, -25201, -28785, 19998, 33412, -10784, -32883, 4799, 33722, 3645, -31002, -9757, 28421, 16512, -23755, -22004, 17672, 25294, -12148, -28735, 4255, 28260, 999, -29319, -9193, 25175, 13058, -23258, -19344, 16919, 21235, -13094, -24891, 6162, 25304, -459, -25429, -6197, 23573, 12293, -20084, -16469, 16837, 21651, -10693, -23345, 6297, 26264, 1279, -24789, -5886, 24556, 12619, -20810, -16778, 17647, 21729, -12028, -24659, 5931, 26108, 188]
2504A88k6965J9440L1977j2162l5613L693L7224N212l6741j4065L4126K2371k9426
2517g41k9393K3401L5533j5521l9602O707M2077L174m1901j2527L9749K1972l5481
2530b553l0360K9487L7772k1548m3229J2177M6737k269m7938q095M6894J8242
2542C5317m3851k8164L8317L6742l1117m3918K2035M8826j2047n2147J250N2983
2554B4226R860n1459k1007M7625L1111m1592l9981L3839M7387k4392n2879J3793
2566b3469N6297k242n6986r458N5397K0748n1358l1306M5196M0843l6864m8614
2578d1816K6680N4184j5424n7481L533N8207Q650n6861k0520N2578L1459m6002
2590b813m1050L7514M8380k7387n3816J6315N6803m443n7270p473N4972J8999
$$ y = [188, -26777, -7337, 24640, 12478, -23135, -19442, 17782, 22994, -13747, -27812, 6314, 28685, -741, -30134, -6733, 28800, 13279, -26323, -19616, 22461, 25635, -16266, -28793, 10956, 32928, -2553, -32913, -3426, 34346, 12798, -30431, -18254, 28483, 26214, -21724, -29819, 17075, 35317, -8534, -36698, 1619, 38361, 7244, -36674, -14639, 34187, 22140, -30007, -28757, 24226, 34086, -17373, -38380, 9245, 40356, -1236, -41217, -7378, 40009, 15617, -37262, -23469, 32828, 30586, -26400, -35858, 19539, 40287, -11071, -42377, 2819, 43662, 6798, -41816, -15136, 39048, 23624, -33857, -30324, 27883, 36533, -20328, -40848, 11730, 43189, -2813, -43863, -6349, 42031, 14644, -39172, -22857, 33946, 29503, -27767, -35240, 19732, 38731]
2602C8731n0287k9379M3616L8450l4983m5688K4957N0802j3807n3393K391N3564
2614B4974Q696n1539j8912M7026K8414m0815l6350L2615M2366k3242m6361J3029
2626b0099M7959k377m7628q102M4908J8124m0190k6743L3803L3962k6393l9269
2638c2045J8124M3288r113m4884j21M4359R375m1257j7517L6398K4671k9855l0069
2651b8646K2038L4103j3395l6006M226L6162M680l4691j3254L1587K0877k6936
2663G45k7422K0541L1841j3201l4315N277L4294K123l2294r283K8615J5292k3507
2676a294k0609J7224K4723r976k7679K145K8994O286k8327j4187K5637K1068k1137
2689B868k6001J5666K9236r610l0823L227L0990L497k9653j0405K6425J7233k1883
$$ y = [38731, -11556, -40935, 2681, 41131, 6148, -39540, -14583, 36219, 22412, -30981, -28590, 24974, 33670, -17869, -36781, 10245, 38659, -2156, -38506, -5891, 36475, 13233, -33128, -20099, 27860, 25483, -22145, -30247, 14661, 32785, -7405, -34148, -345, 33617, 7224, -32045, -13921, 29367, 20254, -24630, -24751, 19608, 28983, -12274, -29791, 6607, 31278, 1423, -28646, -6608, 27495, 14100, -21906, -17680, 18482, 23162, -11529, -24783, 6804, 27681, 745, -26677, -6136, 25705, 12504, -21811, -16534, 17760, 19883, -12411, -21694, 6921, 22213, -1294, -21903, -4679, 20044, 10068, -17611, -15466, 13528, 19814, -8513, -22700, 2937, 24005, 2868, -23133, -7467, 21769, 12159, -18664, -15437, 15553, 19050, -10603, -21008, 5417, 22650, 767]
2702G67k3536J5433K8699p920l2402o34L3728Q837l3157j6302L0906K2352k7775
2715a004k7695K3634L2366j7937l6157J0532L8330j525l7965q007L5480J7258
2727B7310l0544k5222K4413L2213j7404l7393J0168M1557k421m4339n612M5620
2739A8346J4164m4332k3085M0238L1005l3316l7294K4204M0969j4321m2511L879
2751b2054M2370N722m1192j5589L9051K5188l5781l5038L0293M3763k2592n0021
2763c5880J3052N3043l065n2642n965M9955J4134m5556k1162M0248K8308l3323
2775A147l5039K5162M1267j4892m5754L399M8163Q680m7492j9892M4193K8891
2787C7833l9283l5401L3652M0008k8237m3892K1648M7036j3732m8873L448M7875
$$ y = [767, -22769, -7336, 21363, 13443, -18959, -19593, 14135, 22972, -10185, -26487, 4419, 26771, -1004, -28699, -5065, 27301, 9364, -26793, -16261, 22069, 20544, -17421, -25428, 10052, 27310, -3234, -28456, -4043, 28170, 10766, -26627, -16459, 25098, 22677, -21662, -27274, 18346, 32510, -11822, -34907, 5331, 36336, 3020, -34274, -10070, 30899, 16578, -25933, -22054, 20316, 26038, -15154, -30743, 8308, 33496, -2285, -37323, -7030, 36733, 14141, -35880, -22828, 30215, 27150, -25492, -31457, 18498, 32632, -12924, -34086, 6162, 34470, 1147, -33892, -8730, 32537, 17645, -28109, -24710, 23453, 32133, -15359, -35251, 8942, 37833, -1450, -36851, -3199, 36809, 8572, -35320, -13672, 33364, 19632, -29241, -25793, 22082]
2799B2082P690m3871j8374L6733K7123k8329l3557J9812L8016j2017m1416M849
2811b1259M4310K560m6113j0432M5914J8978m2460k6517L6037L2047k7063l4501
2823b8499J7363L4457q138l2623m4L0298P450k8321j4946K6161K2743k2867l0534
2836b7500J7167L6378r695l8844J644L7535M666l3588q846K8935J1471k4381j3785
2849a8843J9755J7033j4181k0333P324K3248J318k4071j0220K2857J8150j9121
2861B916k3217J4568K5630j0261k5809P370K5154n002k4770J724K3946L041k1896
2874f606r454J6857J5275r448j9676O76K0720O995k0084j2864J8284J6286j7249
2887b88j8862J6372K1397j4856k4262J1395K6526n262k6453k284K3619J0210j7797
$$ y = [22082, 29772, -14099, -32473, 4260, 31383, 3054, -30503, -10691, 27325, 15308, -26108, -21259, 23051, 25611, -20502, -30934, 14980, 33958, -8502, -35019, 1018, 33065, 6002, -28499, -11136, 23321, 15183, -17440, -17484, 12814, 20264, -8057, -23003, 3158, 25901, 3034, -27500, -10333, 26045, 16350, -22494, -20850, 16685, 21351, -12237, -21083, 7852, 19323, -5058, -18843, 912, 17945, 3764, -16569, -9245, 14003, 15321, -8750, -18970, 3887, 22037, 2916, -20301, -5733, 19897, 9636, -16173, -8803, 16351, 11349, -13421, -11697, 12249, 15290, -6606, -16060, 797, 16072, 6624, -13052, -12376, 8344, 15339, -4745, -17609, 675, 16961, -288, -19150, -2778, 18619, 3763, -20499, -9104, 17422, 12160, -14293, -16577, 7042, 17252, -545]
2900e45j6315J0805K0766l659k3008k030K4868O766k6542j1023K8449J6097k9244
2913d615k2178K7040K7905k1548l1833J3096L2259m421l0164l661K6313R961k3058
2926d904j6157J9977K2428j7053k9750J2745L6566o512m1705j424M3984R787m2372
2939a4390j6736L8320K2065l2371k5148K6728K7929k0494l0450J3898L3924n100
2951A8175l6395n319L7317J6769l5043k7234L0168L5190k4027m0183J7742M2509
2963B9669j2349m4112O888M4777r32m4805p106M2310J5938l7127k4804K8896L1557
2976B8800j8872l6128Q656L8433P64l9080q535L9166J5710l8364k2330L7255K9264
2989C4739l3317l5439K7243M0105j8267m1432Q863L9779L82l5960q122L1425J4866
$$ y = [-545, -16860, -6055, 14711, 11052, -11956, -13986, 10882, 17648, -8894, -19917, 8532, 24629, -4615, -26793, 247, 28152, 6604, -25229, -12133, 20126, 15705, -14459, -18120, 8193, 18154, -4904, -21061, -1084, 21344, 4291, -25459, -12714, 23852, 17340, -24365, -25789, 18195, 27982, -14390, -31126, 7194, 29259, -3112, -28260, -1532, 26397, 5903, -24547, -10649, 23275, 18175, -18220, -23539, 13778, 30547, -4496, -31730, -1562, 33628, 9601, -30582, -12840, 29669, 17320, -26792, -19904, 24873, 23941, -20864, -27970, 14340, 30278, -6849, -31653, -2757, 28800, 9928, -26200, -17544, 20889, 21653, -17427, -25962, 13204, 28914, -9450, -31780, 5475, 34739, 1422, -34017, -6774, 33331, 15064, -26368, -17505, 22274, 22656, -13304, -21426, 9999, 24865]
3002B4865k7094k1355K2464K7555j7419l4013J0787L8487l288m1176n050M0173
3014A4936J2004l7061j7804L2084K1155k6736k3741K1157K5481j5022k7362Q043
3026a2866K8727J35k8443q672K6676J6932k2569k3227J7537K7628j1954k9416
3038a9512P226K9929k815k9403j324K8308N884k5913j0978K1583J5494j5561j9070
3051a6152Q149K0565r87k0626n695J9053J0882j7199j5104J4691J8088j2005k0688
3064a7028Q747K2383m390k2746p21K1430O216j7784j0814J3191J4417p604j6468
3077a1171K547J7880K536j8323p131J8543J1633j7685j6049J5789J9824j2391
3089F002k2758P502K3791k136k3525l476K1398Q400j8783j3225J5154J7261j1240
$$ y = [24865, -2229, -23584, -1120, 26435, 9016, -24997, -14210, 24277, 20989, -20187, -25237, 14936, 26940, -10121, -27925, 4159, 25314, -1422, -25163, -4006, 21475, 6453, -20909, -12866, 15861, 15996, -12447, -21119, 5557, 22489, -80, -23307, -5770, 21858, 9904, -19512, -12286, 17643, 14828, -14575, -15899, 12409, 18293, -7620, -18598, 2985, 18479, 2918, -16152, -8003, 12562, 11575, -9051, -14746, 4307, 15189, -2010, -17114, -2423, 15665, 3660, -17028, -8281, 14102, 9712, -13034, -13755, 7675, 13891, -3893, -14707, -1516, 12901, 5297, -11171, -8624, 9256, 11792, -6531, -13662, 4881, 16514, -1171, -17220, -1431, 18393, 6002, -16756, -9254, 14537, 12401, -11124, -14600, 6798, 15198, -3585, -16810, -1656, 15605, 4365]
3102D365k1227O528K4320j266k6393m671K7175J0750k6005j6218K3366K1180j8900
3115C004k4470J4062K7051q027k8086K180K8723M597k7654j1373K5650J8279k2014
3128A922k4194J6992K9112j1217l2557M569L4069J894l4360q697L2559J4585l0048
3141e371k0738K5655K5609k0441l0235J3538L2887o236l4400j711L4180R271l2487
3154a0479j6314K9700K2659k5222k7851K0332L2418j4155l5019P839L6882l38
3166B0452l6366o604L4794J3878l1183j9989K6816K5507k1265k9611J4975L2656
3178B4060q183l4563R95L4559O061l3762j3014L0924J8806k7282k4357K1836K8174
3191B4254j6154l0991R375L2218k862l2346l923L0922J0355k8157j6229K4433
$$ y = [4365, -16862, -10334, 13986, 12720, -13673, -18344, 8831, 19581, -6424, -22642, 724, 21904, 3004, -21466, -7404, 19647, 11620, -16466, -14286, 14437, 19034, -8620, -19993, 5657, 23936, 1922, -22272, -5280, 23832, 12615, -19942, -15373, 18696, 20590, -13770, -22467, 10092, 24677, -5371, -26109, -454, 25155, 4714, -25521, -11983, 20904, 14668, -19732, -21443, 12737, 22008, -10479, -26793, 2907, 25566, 344, -27507, -7175, 25243, 11088, -23931, -16092, 20790, 20452, -15914, -22518, 12276, 26154, -5029, -25018, 1798, 27305, 6040, -23571, -8596, 24060, 15877, -18686, -17691, 16868, 22929, -10833, -23847, 7077, 25883, -1399, -25756, -3920, 24254, 8100, -22891, -13516, 18702, 15840, -16506, -20429, 10493, 20848, -7309, -23538, 895]
3203H95K1268j9359k4867J3984K7708p780k8652J858K8737M396k7027r598K4517
3216F080J4640k0781j8425J6352K1423j1257k3211N791K3778n76k3367m688K1461
3229G220R156j9251j3285J5552J6151j1771j8612P261J9585l070j9829j553J8931
3242F485N552j7101r312J4583J2309j1266j4553P894J6001l699j6436k4J6213
3255F646M128j4767p356J2826J0492r947j2711O829J4282l143j4816o91J4578
3268F350M206j3397p671J1230J0410q591j2828N044J4130j540j4909k425J4282
3281D291O084j3096r699J0978J2518q153j4852M659J6401o43j6957l189J6609
3294D951P408j5054j1041J3084J4533r733j7119O229J9164j930j9996k304K0192
$$ y = [895, 22163, 2804, -22063, -8079, 19629, 11849, -16803, -14945, 13792, 18188, -8839, -18437, 6080, 20720, -61, -18486, -2134, 19289, 8032, -15179, -9388, 14390, 13814, -9553, -14241, 7220, 16376, -2875, -16160, -608, 15543, 3772, -14840, -7579, 12006, 8936, -10893, -12446, 6485, 12037, -5064, -14376, 207, 12516, 1250, -13303, -5409, 10592, 6893, -9543, -9567, 6646, 10774, -3993, -11349, 1477, 11969, 2022, -10689, -3860, 10422, 7279, -7537, -8228, 6350, 10556, -2841, -10512, 718, 11128, 2537, -10291, -5247, 8883, 7343, -7566, -9991, 4291, 10375, -2721, -12420, -1442, 11076, 2923, -11929, -7270, 9131, 8488, -8469, -11658, 4951, 12359, -2695, -13736, -652, 13881, 4148, -12971, -6742, 12422, 10492, -9504, -11808, 8384]
3307H384O857j9234j1114J7355J4996j4600j8352J0885K0778o752k2697J995K3222
3320A1723K751k3057p876K1551J2389j9446j6852J6161K0580j2401k3663P760
3332a0380K5639k736k6480k517K6417P655k4856j2563K2658J7161j9018k0912
3344a9932J4807K4258r701k6218M230K7529J811k7444p684K6219J3378k3706j8311
3357b0764K0124K2420j6064k5621J1238K7734o037k9033K46K8734N373k7266j1227
3370b0143K4410J6084k0639k0343J5790K3705j0768k5961N342K7225R4k7583n378
3383a8165K6936J0672k5030j5322K2162J9384j7980k2209J3292K4123q018k4700
3395a4855K875K4435K281k3220p137K1385J2044j9004j6487J5595K0222j1443
$$ y = [8384, 15241, -3993, -15107, 2248, 17244, 2644, -15708, -4823, 15955, 9203, -13494, -11499, 11723, 14474, -8583, -16459, 5092, 17481, -1965, -18817, -2656, 17924, 5523, -18140, -10380, 15259, 12523, -13957, -16474, 9943, 17598, -7258, -19821, 2837, 19998, 980, -19932, -5125, 19133, 9432, -16786, -12556, 14973, 16784, -10660, -18344, 7875, 21253, -2453, -20764, -640, 21780, 5716, -19905, -8667, 19067, 13030, -16003, -15757, 12977, 18350, -8916, -20143, 4267, 20351, -288, -20631, -4841, 18864, 8096, -17865, -12523, 14702, 14796, -12787, -18165, 8771, 19443, -5587, -20909, 1253, 20637, 2657, -19552, -6260, 17863, 9845, -14855, -11980, 12455, 14736, -8484, -15621, 5764, 17808, -1196, -17683, -2088, 18134, 6691]
3407F691k2982O736K4235k164k4336k181K3128N970k1402r310J8671J2229j5480
3420a95j4774J1492J6710o895j7881J731J8198L244j7002p944J5110J1468j2440
3433H22j3832R804J5482p246j6315M607J6656j431j6162k060J4506N558j1592
3446a203q289P669J0080l470j0888m19J0785L714j0536o379J0008Q601r200j0819
3460a0346P974J2503n725j3601K786J3343O44j1777l979R137O640n841q450K699
3474c993R758Q1j0951k585J2314N189j3289q400J3419J1762j1992j4523R077J5865
3488A1732n381j5798J674J4443J709j2815m719J0849Q038r126j1560O748J5378
3501A1172l626j8796m53K1075N108k1537r570K0336J3078j7701j5137J4696J6284
$$ y = [6691, -16291, -9555, 14680, 12516, -11820, -14001, 9127, 15097, -6305, -15615, 3056, 15285, -195, -14969, -3477, 13233, 6338, -11543, -9812, 8386, 11630, -5372, -13316, 1794, 13262, 822, -13010, -3206, 12276, 5030, -11285, -6678, 9978, 8547, -7615, -9675, 4831, 10389, -1203, -9492, -1823, 8257, 4787, -6101, -6520, 4265, 7979, -2557, -8936, 1072, 9673, 473, -10346, -2372, 10131, 4406, -9195, -6409, 6934, 7578, -4199, -8178, 959, 7599, 1758, -6692, -3993, 5765, 5846, -5105, -7690, 4624, 9813, -3476, -11876, 1543, 13305, 1313, -13210, -4133, 11732, 6351, -9447, -7773, 6670, 8379, -4436, -9155, 1694, 9732, 606, -10954, -4206, 11172, 7546, -11250, -11703, 9372, 14480, -7057, -16627, 3709, 16787, -914, -16051, -1355, 14929]
3514A4929j1338j7150Q041J8258l697j9218j679J9318Q200j7866j4599J4854J9840
3527A7893j0694k3496O573K5265k986k6213j56K6492L091k6518o807K5350J0902
3540A8696k2789j5454J8087J9110j2116k1569N237K2272J188k2027o723K1312
3552E224J1187k0672j5333K0289J9615j8914k3869J6189K7526j1433k9035N689
3564a3537K8515O6k5639m601K2107Q472j8406j1756J5125J5617j1593j9664P182
3577h112K3571j831k6172m333K6821R918k5472j4439K2428J6870j9070j8037J5517
3590b341J8299j2377j8804Q469J9271l619j9474k488J8233Q859j5165j4513J0972
3603d678J8324o508j9968K987K0688n23k0704j087K0933L321k0442n890J8986
$$ y = [14929, 3591, -13559, -5518, 12740, 9043, -10175, -11854, 7464, 15664, -2202, -16801, -1947, 17893, 7199, -16297, -9724, 15541, 12555, -13658, -13814, 12678, 15769, -10749, -17556, 7794, 18696, -4093, -19547, -1460, 17650, 5534, -16035, -10798, 11474, 12662, -9365, -16088, 5224, 16411, -4261, -19594, 695, 20310, 1396, -22473, -6284, 21242, 9809, -19226, -13537, 14978, 15044, -10595, -15196, 6911, 15383, -3023, -14779, 346, 15963, 4370, -15294, -8112, 15459, 13628, -12544, -16877, 9944, 19862, -5610, -20049, 2379, 19249, 179, -17858, -2341, 15958, 3581, -15223, -6754, 12517, 8898, -10576, -13064, 5169, 14028, -1137, -15650, -4678, 13646, 7138, -12830, -9843, 10845, 10322, -10382, -11469, 9464, 12785, -7657, -13547, 5439]
3616E439R060j5494j1577J0666J3140n072j2854k43J1803M249j0214p355R238
3629G86R628r027j1994Q642J4403p476j6875M915J7670j572j6625j997J3602M239
3643H319r656n635N988N927l030o587N82P826K091r270n248J0183R002r815j2229
3658a1552Q017J4213m988j4289J988J2739N63j0276k298P880L697n752n557L711
3672a904P837j195j0536k294J2460O425j3168j0544J2011J3329r715j4752P093
3685d953J4588m845j3923K790J3373m21j2990k694J2130O862j0183j1136P255
3698d147J4814l087j7242r16J8270M569j8086p169J7425R274j6611j1047J5483
3711A530J3075j3482j5486J0207J7268n585j8095l1J7409N215j5783r750J3365
$$ y = [5439, 14499, -995, -12572, -1906, 11234, 6162, -6692, -6935, 4868, 9117, -1097, -8452, 786, 10414, 1387, -10607, -1965, 12438, 4962, -11913, -6998, 10672, 9100, -7525, -9522, 4080, 8319, -1337, -6972, -984, 4943, 1913, -4674, -4092, 3734, 5825, -3445, -8693, 1490, 10492, 677, -11552, -3535, 10678, 5690, -8599, -6611, 6128, 6691, -3585, -5883, 1997, 5694, -58, -5615, -1904, 5933, 4738, -5798, -8092, 4368, 10793, -2375, -12919, -908, 12421, 2706, -12046, -4953, 9635, 4790, -9133, -6343, 7030, 6609, -6381, -9075, 3055, 9917, -266, -11402, -4147, 10667, 7580, -9662, -10578, 7692, 12261, -5825, -12994, 4431, 13705, -2906, -13953, 1530, 14605, 1123, -14363, -4156, 13112, 7527, -10568, -10599, 6810, 12025, -3758, -13508, -143]
3724a43J3151j1199j6173R153J8763o967k1256M087K3183k50k3786m105K2801
3737G259Q542j9999j1892J6298J4600j1929j6145P836J7697l478j8648o91J9581
3750I031N534j9768j0222J8797J4943j6602j8705J3270K0932r489k1834N511K1589
3763A2987k105k0982j648J9686N225j8287r277J5525J3148j2360j6715Q054J9014
3776A2265l679k0308o03K0371M288j9698p355J8732J0128j7053j2428J5016J4862
3789A4538j1796j6409Q164J7581l559j7320o57J6427M853j4580q129J2603J1034
3802A2750j0415j3415Q075J5280n536j6682K427J7061O13j6693l993J4958O538
3815A0968j2802q729R665R938o894j0836L622J1215p40j1293k329J0892N143r826
$$ y = [-143, 13008, 1809, -14364, -5211, 13552, 6585, -14671, -10584, 12599, 12349, -11437, -15542, 7259, 15801, -4198, -16090, 208, 14808, 2879, -13266, -5430, 12267, 8789, -9859, -10550, 9031, 14565, -5203, -15425, 3372, 18315, 1713, -16992, -3722, 17210, 7721, -14113, -8602, 12987, 10882, -10100, -11748, 7938, 13163, -5124, -14401, 1124, 14272, 1912, -14803, -6749, 12265, 8586, -11722, -12325, 8046, 12334, -7364, -14719, 4013, 14141, -2912, -15340, -324, 14538, 2742, -13667, -5503, 12078, 8519, -8801, -9458, 6969, 11822, -2758, -10887, 1716, 12750, 2335, -11080, -3005, 12275, 6739, -9943, -7516, 9545, 10158, -6535, -10528, 4430, 10968, -1834, -10563, -898, 9040, 2146, -8690, -5068, 6147, 5407, -5886, -8215, 2677, 7820, -2006]
3829b006p675Q375R690o062j0772L808J1240j214j0579q17R849K970q292m495
3843e980O769O132m547p399K407Q321O3q552k603Q275M709p422o702N932P862
3858G265m405q788K358Q964o00r018j761Q395L734p454n994N765P782l859r148
3873f764J377J0026J148j0318l565J0090O019q942q084P645R943n533j1191L207
3887d942J2317l07j2522k539J2158N739j1010q498R248J1028p037j3067M274J4445
3901I287j226j5420j922J5369N062j4780q303J3239J1130j1300j3668Q383J5575
3914A1426n330j6858J761J7448J849j7307n528J6444R062j4745j2197J2462J5022
3927A3509r552j7131O337J8705k643j9353j019J9300M942j8323q578J6622J1941
$$ y = [-2006, -9681, -1306, 8384, 2322, -8450, -4642, 6598, 5384, -5195, -6012, 3837, 6807, -1485, -5980, 789, 6921, 2374, -5025, -2618, 5703, 5766, -2786, -5389, 2886, 7595, 173, -6529, -597, 7265, 2860, -5928, -3570, 5394, 4794, -4224, -5985, 2410, 6144, -1310, -7304, -1539, 6243, 2384, -6764, -5387, 4639, 5787, -4531, -8096, 1994, 8013, -929, -9013, -1368, 8575, 3042, -8149, -4942, 7375, 7068, -5454, -7993, 4165, 9904, -1106, -9604, -356, 10672, 3635, -9432, -5158, 9287, 8061, -7359, -9281, 6088, 11150, -3630, -11933, 1306, 12436, 1136, -12532, -4149, 11426, 6096, -10762, -9001, 8447, 10296, -7011, -12539, 3905, 12967, -1778, -13975, -1513, 13509, 3957, -13174, -6837, 11868, 9225, -10128, -11147, 8153, 13095, -5228, -13806, 2816, 14757]
3940A4757j4282j4798J1291J7096p805j8870M025J9630Jj9778m095J9038P820
3953A4030j7544j1320J5158J4411j2266j6936Q858J8585n014j9482J063J9578
3965I121K972j8787o841J7299J0370j4949j3388J2073J5826q647j7366M942J8346
3978A0971j178j8363k634J7565O173j6112r261J3787J2008j1145j4084P955J5391
3991A1073m726j6019J129J5979K126j5147n422J3784Q158j1796j0423R409J2233
4004A0358o708j3364L883J3959r41j3782j881J3184M456j1646o712R858Q714p543
4018A835j0053N003J1034k399j1259k30J0918K712j0104n036Q756O918p140q460
4032g505N014R315k802r719L59R411J827q533l996P049N691n286p050L149Q005
$$ y = [14757, 475, -14323, -3032, 14064, 6259, -12611, -8586, 11044, 11045, -8733, -12828, 6210, 14030, -3514, -14834, 324, 14735, 2469, -14467, -5609, 12976, 7962, -11520, -10457, 9121, 12093, -6694, -13535, 3764, 14134, -815, -14203, -2130, 13696, 5049, -12317, -7375, 10971, 9793, -8570, -11204, 6361, 12534, -3578, -12839, 948, 12956, 1811, -12273, -4318, 11073, 6347, -9672, -8543, 7436, 9562, -5585, -11007, 2777, 10935, -861, -11284, -1875, 10358, 3650, -9714, -5831, 8128, 7187, -6595, -8476, 4708, 9164, -2482, -9194, 664, 9378, 1835, -8218, -3215, 7819, 5420, -5839, -6069, 4849, 7561, -2543, -7579, 1177, 8095, 955, -7505, -2491, 6824, 4022, -5697, -5338, 4073, 5900, -2633, -6629, 420, 6111, 825, -6225, -3076, 4929]
4047D929q33q423j486Q260L899p473n876O276P598m500q609K475R293j95r144
4062c809k057Q587M386p460o367N824Q225l859r706J599J0634R19j1105l619J0833
4077C025O070j0089q311Q698R920o982j1259M708J2180k334j2683m16J2509L497
4091H533j1926o518J0531R386q598j1783O166J3776l548j4919P68J5715K067j5838
4105f188m778J5244P643j3979j0300J1964J2553r027j4375N587J5418j769j5698
4118g705k132J5300N736j4499r129J3166J2174j1422j5072R109J7351o098j8858
4131a2079K549J9372J051j8755m403J7271P556j5105j0159J2392J2618r318j4682
4144a1692O000J6492k239j7577j763J7903N896j7363r490J5781J2414j3507j4505
$$ y = [4929, 4096, -4327, -5813, 2447, 6346, -1127, -7003, -727, 6871, 2371, -6238, -3763, 5530, 5335, -3809, -5866, 2721, 7107, -353, -6720, -896, 7329, 3470, -6236, -4637, 5997, 6916, -4189, -7808, 3025, 9095, -994, -9305, -607, 9313, 2331, -8928, -4220, 7960, 5626, -7057, -7473, 5036, 8533, -3393, -9911, 620, 10006, 1408, -10375, -4209, 9567, 6019, -8900, -8132, 7583, 9650, -6188, -10966, 4278, 11921, -2058, -12358, -394, 12159, 3132, -11243, -5656, 9762, 7993, -7705, -9837, 5463, 11199, -3300, -12429, 737, 12911, 1489, -13583, -4474, 12877, 6779, -12079, -9530, 9842, 10893, -7862, -12265, 5006, 12562, -2543, -12702, -310, 12308, 2990, -11692, -5692, 10800, 8561, -9016, -10779, 7124, 13020, -4343, -13833, 1948, 14362, 855, -13650]
4157a3650J0930J5811q379j6556N529J6823k381j6767j322J5948N065j4149q847
4170a1945J1536J1827q441j4040N268J5389k431j6045j65J6455K660j6340n093
4183a1365J5635P658j3870r952J1436J1592p981j2329M252J2308p25j1377k391
4196g109J0275N058r247p397Q208R742p009j1881M998J3454k561j3937j53J2898
4210E339K369j1109m026Q860M812o626n527M524O247k433p019o9P776K806p864
4225a940n558P266P868n870r196M093R630k376q918J073Q046j66o946p69O134
4240B371K158m952l963L166N863o81p203k253P508M834o979o580N953P306n045
4255A503p586M285P644l587p862K197P916j01p603k576O314N354m107p648J373
$$ y = [-13650, -2720, 13091, 4712, -11844, -6315, 10508, 8127, -8640, -9962, 5986, 11051, -3098, -11945, -409, 11418, 2977, -11063, -5795, 9594, 7163, -8882, -9047, 7408, 10068, -6272, -11365, 4270, 11928, -1942, -11894, -458, 11134, 3153, -9176, -4924, 7384, 6659, -4718, -7109, 3166, 8224, -1023, -8420, -212, 9530, 2521, -9360, -4362, 9092, 6531, -7406, -7559, 5339, 7708, -3401, -7427, 1433, 6245, -381, -5908, -1384, 4863, 2430, -4589, -4658, 3118, 5924, -1940, -7498, -232, 7636, 1766, -7430, -3337, 6293, 3917, -5001, -3928, 4118, 3952, -2994, -3763, 2371, 4529, -423, -4386, -1220, 4643, 3962, -3241, -5494, 2014, 6848, -131, -6711, -758, 6548, 1503, -6083, -1798, 5846, 2259, -5603, -3406, 4510, 4409, -3194, -5770, 544, 5898, 1791, -5857, -4484]
4270d484Q987J443r522l523R542N063r495o130R576P357r184q877P906J0572n537
4285C694j1487K161J1325J505r970m783Q073P185o190r120M715J0874l489j2845
4299h352J973J4760J2j5968k851J6079N685j4792q209J2419R867r472j0532O382
4313b999J0904l722j1176J028J1850J964j2556n497J2776R369j1832j2886R830
4326b947J5259p136j6264M470J6236k408j5655N06J4963J565j4192m211J3016
4339C202P255j0767j0509P541J3018l734j4487j78J4872L584j4565o034J3958
4352C156P871j3290r609J2660J1286j1046j3084Q610J4315m929j4511J044J3335
4365E808K743j1339n651R225P777p223r624N761J1451m258j3380K344J4815J40
$$ y = [-4484, 4503, 5946, -3576, -7099, 2443, 7506, -1989, -8119, 1457, 8814, -370, -9247, -1341, 9231, 3694, -7793, -5632, 5693, 7198, -2772, -7555, 518, 7703, 1513, -7607, -2892, 7982, 4493, -8352, -6379, 8381, 8393, -7575, -10426, 5653, 11338, -3454, -11663, 756, 10623, 1151, -9381, -2999, 7905, 4183, -6993, -5965, 5885, 7849, -4707, -10204, 2572, 11941, 109, -12777, -2947, 12312, 5176, -11088, -6618, 9618, 7210, -8445, -7939, 7024, 8589, -5603, -9814, 3202, 10457, -310, -10819, -3278, 9740, 6006, -8481, -8659, 6213, 9797, -4768, -10802, 3156, 11027, -2263, -11872, 788, 12074, 1028, -12056, -3446, 10869, 5940, -8571, -7527, 5808, 8551, -2788, -8439, 786, 8563, 1340, -8284, -2523, 8928, 4670, -8710, -6366, 8449, 8589]
4379H589j5398k894J4621N258j2825o902J0219P800p826p942N357Q085l215q452
4393e525R01Q883J794r143m740Q749P573p474r660N663J0764l762j0675K252J0068
4408E668j097r261K07Q626R62p628k639O200M514m017n944J317O794J299o776
4423a775l492O078M911n276n672M476O059l979o363L121O589j939o533P6N747
4438B028J988m317l771K077M984J25n480k033N518L484n436m448N325N314n082
4453B76o184M427P127l200p568J284P507R87o607l022N160M832l535o072J980
4468b608P051m92q038q22Q843K274r335m086R447N870q695p506P112Q609m998
4483B626r164K685R178n14q905j719Q521L982q139o236P158Q629n863j0717L973
$$ y = [8589, -6809, -9703, 4918, 10176, -2649, -9551, 668, 8468, 642, -7300, -1943, 6142, 2927, -5525, -4624, 4259, 6053, -3090, -7830, 919, 8492, 1018, -8642, -2979, 7785, 4023, -6652, -4400, 5668, 4571, -4690, -4483, 4143, 5105, -2523, -5162, 1038, 5552, 1535, -4409, -3092, 3702, 5001, -1775, -5267, 811, 5722, 446, -5226, -750, 5309, 1330, -5033, -1912, 4677, 2738, -3795, -3719, 2028, 4016, -301, -4072, -1995, 2989, 3114, -2366, -4399, 1119, 4603, -833, -5281, 44, 5358, 276, -5908, -1481, 5646, 2446, -5122, -3838, 3669, 4656, -1951, -4973, 187, 5019, 1484, -4588, -2608, 4443, 3951, -4087, -4909, 3934, 6208, -3127, -7213, 2234, 8104, -591, -8097, -985, 7624, 2626, -6538, -3853, 5325, 4811, -4094, -5813, 2708, 6690, -1449, -7685, -527, 8102, 2239, -8478, -4505]
4498d505J2349j757j3112n83J3048K909j2463m861J1282O644r760q431P991R976
4512H727n703j1253K883J2315K43j2714l261J2291O251j1327q682R835J0823q229
4526B199j2268O412J3314m163j3947J686J4198R27j3736l695J2590O335j0855
4539a003q622Q658J0444o318j1808L727J2871j415j3325j151J3318L585j2948
4552c987o039J1879Q165j0202r962Q146J1125n832j1781L257J2044p82j1661j849
4566g479J1220M179j0063o475Q743Q494o983r889M898J1000k640j1332N32J1157
4580E362J693j0504l589R463N275q028o667O247P812m302q483K085Q673J2q467
4595c418k110P784L809o901n254N570O271m211p004K571P271j067p165n24O668
$$ y = [-4505, 7844, 6087, -7025, -7608, 5440, 8349, -4114, -8975, 2307, 8951, -809, -9240, -1249, 8727, 3024, -8229, -5346, 6969, 7212, -5502, -8763, 3528, 9779, -1548, -10230, -395, 10428, 2199, -10069, -3657, 9657, 5494, -8453, -6767, 7431, 8358, -5378, -9073, 3517, 9852, -1003, -9625, -967, 9477, 3159, -8649, -4922, 7949, 6534, -6791, -7942, 5376, 8961, -3987, -10026, 1853, 10018, -184, -10146, -2000, 9125, 3293, -8488, -5231, 6813, 6031, -5630, -7479, 3741, 7920, -2143, -8618, 125, 8619, 1636, -8253, -3355, 7645, 5005, -6327, -5795, 5362, 7055, -3449, -7038, 2425, 7700, -328, -6995, -748, 7064, 2762, -5721, -3636, 5037, 5049, -3418, -5528, 2256, 6065, -836, -6090, -520, 5751, 1540, -5464, -2893, 4378, 3311, -3854, -4378, 2290]
4610B290J995n926l253M816M358l577m954K196N419o69n471o56N275K004m646
4625g99l111L996M070k963m688J908N067o34n027p31M755K014m189l180L264M099
4641C851k177m842Q69N159N06n374j875M990L156m434m423L435N431k246o171
4656d145P98O473P30o448k419O185L923n309n412M286O703k883p517J229Q189
4671D383M96q302k311Q176M061p366n830O450P267n023q364L271R283j440r814
4686e063m51R705K534r284m612Q481O438p363p981N801R271m112j0249K107J0785
4701F007J0j0938k160J0578M217r757o157Q454P960o950r367N156J0301k995j0993
4716f634P47J1259J580j0964l871J0269O061r164p904P513R528n764j0516L638
$$ y = [2290, 4285, -1641, -4894, -78, 4280, 703, -4251, -2055, 3364, 2695, -2776, -3432, 1843, 3847, -799, -3910, 86, 4156, 1193, -3495, -1587, 3480, 2846, -2181, -2912, 1843, 3857, -332, -3512, -248, 3851, 1674, -3168, -2299, 2860, 3366, -2008, -3883, 1107, 4263, -171, -4594, -1159, 4272, 2026, -4145, -3347, 3126, 3856, -2592, -5011, 1174, 5097, -212, -5624, -1338, 5365, 2482, -5035, -3806, 4383, 4879, -3423, -5734, 2442, 6503, -863, -6693, -243, 7024, 2001, -6363, -3092, 6191, 4751, -5063, -5514, 4191, 6725, -2559, -7171, 1310, 7748, 385, -7596, -1795, 7476, 3364, -6885, -4778, 6007, 6017, -4921, -7081, 3497, 7714, -2043, -8200, 254, 8214, 1264, -8103, -2947, 7354, 4359, -6634, -5887, 5372, 6952, -4012, -7883, 2386, 8447, -717, -8621, -1108, 8420, 2656, -7860, -4222]
4730d222J1198j453j1401p96J1099L090j0361n247R190P169p686q660N729R890
4744G539l655j0577J485J0799P85j0683k787J0046M711r097o372P716P835o108
4758A637q780M171R394k140r609J54R286J782q595l702P729N188o593o607N235
4773a450P615l697q326K049Q549l85q345j231P831K579p008l806N950M809m680
4788D54n559L284O178j772o339K63O295J429n929k822N242M026m305m687L180
4803a062N233k145n322J002N268O7m903j179M255K270l339l271K141L778p53m110
4819b070o18M005J699l712k681L275L279k636l850J940M052r54m163j91L991J308
4835B674l309k466K446L499j337m063J32M418R64m506j790M514K691m453l507
$$ y = [-4222, 6976, 5523, -5878, -6674, 4425, 7515, -2846, -8093, 1097, 8266, 580, -8080, -2351, 7539, 3884, -6693, -5208, 5591, 6376, -4307, -7094, 2952, 7663, -1434, -7806, -90, 7745, 1637, -7143, -2972, 6422, 4282, -5327, -5173, 4113, 5895, -2700, -6402, 1327, 6515, -78, -6685, -1450, 6165, 2468, -5858, -3809, 4740, 4355, -3990, -5221, 2610, 5189, -1819, -5625, 325, 5134, 454, -5105, -1821, 4357, 2585, -3754, -3491, 2804, 4233, -1696, -4518, 724, 4750, 445, -4242, -1062, 4171, 2026, -3296, -2294, 2974, 3041, -1862, -3041, 1214, 3484, 145, -3126, -985, 2793, 2040, -2070, -2688, 1317, 3016, -696, -3377, -102, 3177, 541, -3309, -1369, 2683, 1729, -2434, -2625, 1366, 2674, -635, -3101, -655, 2844, 1507, -2556, -2424, 1994, 2958, -1548, -3338, 1176, 3867, -586, -4093]
4850d093M168M348l347n089K222N495q44n372o46M938K030m335l269L517M347
4865D070k784n393J918O368r12p271l00P715J715p746l146P080M541o050n494
4880e689M677O007l143o369J600O756M0p020j979P285L989p053o012O153P800
4895G042m761r060L283R640j713r758L06R537J053r245k425Q600M047p527n827
4910f808N985P398l888q642J524R342P54r415k698R162M299q756n635Q452O757
4925G831p783p999O698R188n046r861K858R779m02r131j653P871L506o668n081
4940e893N620O409m564p993L389R369j896j0477k9J1018J824j0485l594R345M806
4955F849p841n527O274N860m675o173L107O733j279p171r18P318L431o845n640
$$ y = [-4093, 75, 4423, 1076, -4013, -1791, 3704, 2860, -2512, -3158, 1780, 3810, -525, -3794, -277, 4070, 1286, -4107, -2189, 4179, 3267, -4004, -4304, 3411, 5126, -2620, -5766, 1314, 5855, -195, -5689, -1012, 4995, 1852, -4517, -2917, 3839, 3879, -3141, -5120, 2165, 6154, -899, -6911, -758, 7042, 2281, -6779, -3496, 6144, 4431, -5327, -5021, 4516, 5569, -3676, -6101, 2499, 6546, -981, -6808, -823, 6575, 2687, -5955, -4431, 4911, 5665, -3750, -6448, 2714, 7013, -1743, -7378, 1074, 7831, 48, -7951, -1253, 7935, 2889, -6972, -4114, 5665, 5263, -3868, -5521, 2350, 5856, -812, -5893, -273, 6136, 1572, -6421, -3032, 6337, 4441, -6036, -6065, 4953, 6777, -3708, -7302, 2043, 6849, -992, -6519, -245, 5615, 940, -5233, -2126, 4607, 3328, -3843, -4761, 2557, 5988, -857, -6497]
4970f497N796P314m467q041L134Q153k060q078J393P785n85p456n31O929J870
4985D659n750l389L961M563j936n251n6N195J677m938k808M785L333m722l917
5000d594M819M488m575n186L837N531k476n322Q60M497N74l045j527J652K024
5015A557n91k427r8L185N11l951j228M719K156m917l144M420L976l425m077J968
5031a366L623p33k599m32J790J158j090k025O23L144j87m367o06N523J792o023
5047a775l196N850M223m856m794L572M745k275m406J175M082q0m044j265M020
5062I76L071l753n056L005O796j743q096K56Q590J074q436k050P822K824p305
5077b025l317O638M099n770n090M352O338k395p190n5P457K555p010m639O259
$$ y = [-6497, -701, 6613, 2146, -5895, -2761, 5392, 3332, -4746, -3353, 4432, 3847, -3609, -4140, 2789, 4659, -1091, -4480, -519, 4044, 2108, -3143, -3199, 1996, 3673, -1265, -4073, 712, 4045, -677, -4594, 225, 4713, 138, -5048, -1211, 4320, 1844, -3478, -2618, 1879, 2453, -592, -2119, -467, 1557, 966, -1461, -1559, 1626, 2137, -1814, -3042, 1677, 3833, -1084, -4228, 192, 4168, 743, -3334, -1366, 2257, 1524, -1075, -1507, 283, 1441, 351, -1674, -1051, 2093, 1906, -2461, -3067, 2456, 4248, -1775, -4971, 879, 5102, 246, -4548, -976, 3769, 1494, -2912, -1737, 2345, 2265, -1779, -3044, 976, 4047, 294, -4762, -1757, 5039, 3296, -4800, -4544, 4046, 5120, -3316, -5366, 2456, 5280, -2025, -5342, 1296, 5395, -375, -5465, -1113, 5225, 2830, -4360, -4415, 3042, 5597, -1413, -6052, 207]
5092B07O207n489p297M947Q210m286r157L455R887k054j0270R4R990J927q899
5107b528l964P181N553n375o575L328P515j664q363QR194J645r773l656R891N644
5123H061r216p428P815Q674o043r087M135R003k241q644N39Q269J269p737l332
5138e963P214N379o061p354M482Q985k666r796Q10J0035P32r723j971R098K968
5153F169q429l972P529M953o214o058M519O842k480p250J84P135J805o608l464
5168e339N951M695n219n697M523O556l799p091K704P550j316p491j80O867J595
5183D309n734k795M370L665k974m127J587M558l04m876q00N007K044m911l209
5198d190M420M171l535m710K300M906j196m506L9L903R64l218j758K369K605j633
$$ y = [207, 6414, 925, -6372, -1425, 6785, 2499, -6658, -3203, 6684, 4630, -5640, -5546, 4444, 6371, -2528, -6492, 689, 6242, 867, -5708, -2380, 5135, 3471, -4892, -4884, 4310, 5955, -3818, -7474, 2417, 8061, -1155, -8583, -768, 7906, 1863, -7224, -3089, 5914, 3673, -4971, -4432, 3837, 5106, -2631, -5963, 1251, 6630, 569, -6785, -2303, 6682, 4016, -5780, -4970, 5065, 5797, -3926, -5897, 3201, 6169, -2260, -6232, 1297, 6250, 36, -6022, -1503, 5339, 2859, -4391, -4207, 2928, 4733, -1875, -5339, 612, 5307, 88, -5609, -1086, 5470, 1671, -5420, -2716, 4834, 3518, -3973, -4153, 2714, 4309, -1425, -4220, 150, 3815, 841, -3286, -1699, 2859, 2555, -2321, -3121, 1886, 3930, -981, -4190, 230, 4401, 866, -3844, -1544, 3362, 2166, -2340, -2301, 1602, 2566, -652, -2410, -41, 2564, 931]
5214I31l320O20L986M60m263j627M149K646l717l434K936L864j994m081J142L876
5230B174j40l723p86L405J867l015k964K328L932j333m743K30N242Q13n229j898
5246c840M955K893m429l721L889M285k890n005K005N350o26n580q50N455K513
5261D404n016l987M327N223l379o215K238O900j067p256k76P390J644p230l089
5276e389O613M471n791n631M350O732k952p425J236P771M61p818k189P516L853
5291E808o989n305O187O606n003p585L606Q444k051q705L34Q666J432q307l011
5306e873P700M503o612n800N329O959l879p851K312Q376o00q625j147Q514K686
5321E992p907m340P103N545o002o625M599P382l102p935J428Q151K68q005k019
$$ y = [931, -2389, -1769, 2217, 2677, -1586, -3213, 936, 3582, -135, -3569, -633, 3231, 1237, -2844, -1702, 2174, 2034, -1689, -2475, 930, 2797, -218, -3182, -854, 3078, 1745, -2998, -2768, 2474, 3287, -1942, -3840, 1115, 4008, -421, -4142, -253, 4032, 1142, -3863, -1858, 3492, 2866, -2714, -3564, 1891, 4404, -612, -4599, -272, 4951, 1572, -4643, -2405, 4495, 3428, -3828, -4104, 3286, 4930, -2300, -5389, 1224, 5695, -96, -5727, -1377, 5355, 2403, -5022, -3786, 3985, 4446, -3372, -5561, 1955, 5808, -1181, -6486, -299, 6307, 1304, -6281, -2675, 5769, 3718, -4987, -4653, 4013, 5445, -2862, -5873, 1827, 6330, -282, -6082, -753, 6206, 2327, -5524, -3212, 5164, 4564, -4061, -5208, 3306, 5992, -1915, -6255, 848, 6393, 391, -6234, -1635, 5747, 2645, -5290, -3862, 4289, 4557, -3448, -5467]
5336e467P644L420o716m936N688O182m440o974K945P562j349p793j80P718J707
5351E011p165l098O392M353n302n411M074O070k607o586J196O689K73o453j735
5366d299O099K854n333l982M391M830l399n319K080N685r32n661l32N436J537
5381C655n010k449M252L290l356m008K491M330j361m614L84M572O80m274j632
5396c050L831K417l154l048K299L567j499l736M71L736M85l586j349L144K129
5411B657k503k774J658L266q12l554j64L590J052l346j922K897K674k206l290
5426b777J379L823m54l969n34L883J626l530k541K952L490k262m174J379M680
5441B971l56m909p13M900J784m691k871M139L810l323m672K389N158j345n520
$$ y = [-5467, 2177, 5597, -1119, -6055, -367, 5815, 1375, -5599, -2654, 4908, 3559, -4234, -4414, 3304, 5011, -2154, -5252, 1140, 5493, 191, -5220, -1146, 4924, 2317, -4269, -3073, 3616, 3889, -2564, -4299, 1800, 4654, -679, -4661, -270, 4560, 1161, -4158, -2078, 3607, 2675, -2986, -3318, 2118, 3655, -1355, -3804, 448, 3738, 382, -3626, -1135, 3195, 1834, -2780, -2396, 2176, 2856, -1418, -3050, 781, 3198, 44, -3004, -705, 2862, 1363, -2373, -1902, 1834, 2319, -1267, -2616, 528, 2657, 154, -2620, -962, 2304, 1492, -2062, -2226, 1364, 2416, -930, -2852, 45, 2719, 513, -2777, -1398, 2425, 1971, -1998, -2532, 1351, 2977, -553, -3094, -142, 3348, 1086, -3088, -1709, 2971, 2615, -2294, -3007, 1893, 3677, -1014, -3885, 254, 4064, 741, -3931, -1542, 3616, 2271, -3249]
5456c249L3N665J193n562k492N167L690m577m764L726N692k629o369J519O748
5471C791k25o809j111O659K494o171l740N414M934m328n977L123O762j636p123
5486c943q7P492J556p301l056O804M546o176n762N169O788l898p624K337Q072
5501D917p05q118j083P838K603p102m235O201N588n069o753L708P677k144q306
5516d983M44Q710J146q602k753Q132M250p151n529O018O377m634o940L097P456
5531E038j577p502j91P447J932p054l597O341N083n299o295M090P080k824p549
5546d877J595P622k78p617r75P265K167o561l391N457M497m174n298K627N810
5561C869j037n961m58N759J809n569k907N168L984m735m801L830N593k836n785
$$ y = [-3249, -3216, 2449, 3642, -1920, -4412, 755, 4445, -132, -4896, -1170, 4522, 1893, -4476, -2957, 3791, 3566, -3243, -4354, 2305, 4799, -1372, -5112, 302, 5236, 908, -5069, -1946, 4816, 3180, -3943, -4030, 3462, 5018, -2283, -5339, 1465, 6011, -165, -5927, -758, 6030, 2132, -5492, -3155, 4917, 4212, -3906, -4989, 2849, 5452, -1650, -5885, 316, 5904, 835, -5918, -2210, 5467, 3323, -4983, -4539, 4171, 5317, -3285, -6038, 2094, 6344, -807, -6336, -318, 6059, 1425, -5515, -2418, 5038, 3461, -4041, -4232, 3215, 5147, -1907, -5504, 837, 5920, 621, -5674, -1584, 5496, 2672, -4877, -3282, 4340, 4062, -3555, -4530, 2735, 4902, -1659, -5050, 407, 4904, 730, -4568, -1941, 3869, 2832, -3129, -3587, 2172, 3981, -1588, -4495, 673, 4657, -78, -4879, -1049, 4544, 1708, -4077]
5576d077J434N762j40n183j048M390J979l309k772K336L466j414l952L87M423
5591B282P34m639j831M504K783m001l468L131L864k143l841J167L483k88l049
5606a312n97K579J508k186k386J499L299o15m073l70M355J506m375k281L879K766
5622C196l248l015K566L125j788l264J058L249L0l220j340L068K719k371m057
5637c292J549M962m94n469m37N574J290n453j867N172K507m834l221M149M058
5652D194l077m871J524N374K55n297k157M921L598m274m847L733N689l115o480
5667d830K405P322j681p765M45P952R56p481k518O497L855n089m824L500N468
5682D212k013n987P39O440O12o926k095P289L633p144n217O473O489n300p216
$$ y = [-4077, -2643, 3119, 2979, -2204, -3252, 1138, 3117, -192, -2964, -628, 2838, 1424, -2528, -2141, 2282, 3016, -1623, -3454, 1050, 3833, -168, -3636, -505, 3359, 1216, -2625, -1458, 2025, 1737, -1312, -1909, 670, 2178, -8, -2394, -895, 2404, 1789, -2284, -2654, 1701, 3207, -1168, -3449, 430, 3196, -52, -3067, -501, 2624, 836, -2428, -1370, 1879, 1909, -1311, -2651, 417, 3136, 765, -3292, -1743, 3219, 2725, -2744, -3181, 2393, 3683, -1770, -3637, 1535, 4042, -792, -4013, 136, 4194, 1117, -3754, -2230, 3144, 3399, -1898, -4055, 866, 4464, 190, -4657, -924, 4765, 1650, -4830, -2425, 4897, 3216, -4549, -4104, 3848, 4804, -2677, -5195, 1302, 5157, 68, -4756, -1256, 4212, 2199, -3788, -3049, 3391, 4003, -2923, -5018, 2271, 5904, -1240, -6457, 16, 6505, 1205, -6011]
5697f011L927P321k452p142J126O920q7o395j384O065K934n377m592M295O115
5712E263k858p226J193P868L48p906j555P535K502p174l140O596L954n969m804
5727e373M821N623l218o089J118O205Q06n723k517M921L800m195m698L504N532
5742D517l051o151K308O752j348p016R0O857J136o041k179M773K965l395l340
5757c123K148L589j040l779O3M126Q98m427j919M420L151m151m075L422M482k420
5773A365m374J477L930q88l389L65K861K02k551q89K049J733j302k715M07L305
5789A586O68l512j597L280K146k705k418K190K421j890k175J453K204q57k160
5804a366K6K062J055j553k130P77K898K98l302j118L335J723l142k032K949K213
$$ y = [-6011, -2084, 5237, 2785, -4357, -3231, 3689, 3602, -2793, -4177, 1888, 4822, -555, -5147, -852, 5263, 2405, -4821, -3628, 4240, 4588, -3318, -4873, 2662, 5164, -2010, -5150, 1446, 5400, -569, -5373, -552, 5071, 1853, -4236, -3118, 3087, 3893, -1830, -4347, 574, 4374, 179, -4519, -1015, 4517, 1466, -4685, -2377, 4375, 3027, -3989, -3899, 2958, 4094, -1947, -4126, 647, 3612, 217, -3123, -975, 2614, 1574, -2205, -2142, 1984, 2882, -1545, -3464, 956, 4107, -44, -4119, -697, 3785, 1365, -3009, -1532, 2398, 1510, -1879, -1514, 1347, 1549, -1002, -1891, 158, 1891, 589, -2126, -1719, 1586, 2254, -1258, -2855, 425, 2571, -134, -2552, -362, 2059, 169, -2006, -553, 1651, 794, -1366, -1340, 722, 1777, 224, -1906, -1129, 1769, 2067, -1235, -2353, 982, 2705, -437, -2469, 480, 2693]
5820B693k684k522K363K796j692l159P18L256N54l156j758K550K832j802l660
5835b671J061M052m53m340j07M721M84m929j142M960J950m584k832L808L580k608
5851I50m042J400M154k61m021q19M023J792l935k845L858L872l569m892L009N742
5867D416k085o209Q85O303J51n824j177N194K135m643k955L795L916k915m784
5882c797J814N554n28o089r47O223K369o015l482N397M426m725n031L923N462
5897D554l057n744J927O001p15o000o68N632K236n155l472M225M538l231n270
5912d199K179N820j248o177L04O304O76o284j649N953K713n314l542M357M250
5927D143l142m759K048M907q68m882k28M861J230m572k422M420L361l795m222
$$ y = [2693, 9, -2513, -150, 2646, 954, -2205, -1487, 1769, 2323, -833, -2591, -41, 2791, 989, -2671, -1610, 2442, 1989, -2351, -2458, 2263, 2747, -2182, -3324, 1636, 3586, -998, -3830, -22, 3558, 950, -3092, -1692, 2462, 2201, -1820, -2639, 1384, 3176, -759, -3604, 254, 4126, 557, -4335, -1326, 4416, 2331, -3878, -2993, 3310, 3461, -2363, -3540, 1654, 3789, -854, -3809, -14, 3902, 987, -3797, -1983, 3571, 3043, -3046, -3993, 2230, 4599, -1416, -4898, 499, 4925, 200, -4831, -908, 4554, 1497, -4247, -2320, 3681, 2966, -3034, -3702, 1930, 4166, -989, -4461, -236, 4302, 1071, -4199, -2020, 3800, 2552, -3625, -3321, 2983, 3659, -2625, -4274, 1679, 4392, -922, -4464, -107, 4143, 1001, -3758, -1710, 3197, 2329, -2553, -2781, 2080, 3310, -1262, -3684, 736, 4097, 302, -3920]
5942c920L033M767k081n070J047N139k10m834p14M454J416l852k221L109K950
5957C013k379l507J476L805l78m124n47L944J488l644k208L182K712k518l139
5972b824K010L234j248l277M83L229K87k819j195K528J793j765k309J138K564
5987A829m47k738j60K722P02k515j263K278J665j860k064J356K258p39k401Q7
6003a290K197P04k069j281J595J787j166k151N95K445q0k715m19K704J075k524
6019e93j653K094K228j621k646J004K963k46l020n12K940J364k684k149K420K880
6035B769j924l390J167L919m37m186l33M132J300m009k165L623K915l058l606
6050c283K222M154j352m544L49M681O26m731j611M489K635m086l563L483M235
$$ y = [-3920, -887, 3880, 1799, -3271, -2224, 2915, 2705, -2129, -2843, 1611, 3027, -825, -3046, 63, 3013, 634, -2873, -1397, 2408, 2030, -2094, -2641, 1303, 2791, -853, -3061, 121, 2833, 315, -2824, -814, 2420, 1172, -2105, -1622, 1607, 1894, -925, -2120, 408, 2201, 436, -1873, -735, 1829, 1382, -1356, -1516, 1206, 1908, -607, -1870, 408, 2073, 213, -1851, -495, 1763, 1024, -1377, -1290, 907, 1611, -458, -1739, -144, 1643, 477, -1674, -1079, 1366, 1286, -1429, -1848, 856, 1931, -593, -2246, -152, 2076, 455, -2191, -1187, 1776, 1530, -1490, -2002, 938, 2302, -382, -2531, -111, 2769, 845, -2545, -1378, 2541, 2104, -2082, -2415, 1717, 3017, -992, -3157, 466, 3381, 323, -3283, -1061, 3093, 1741, -2803, -2454, 2227, 2853, -1878, -3489, 1000, 3635, -451, -4014, -531, 3704]
6065C704k633m801J619N220o38n391l11N300J372m969k395M599L295l877m171
6080d077L081M762k041n199R87N568J51n603j206N394K270m934l329M398M100
6095D322l507m825K509N335j477n536J87N684Q29n339k087M986K991m299m015
6110d242L504M723k575n276J551N524l94n628p56N459J855n075k784M425L574
6125C885l524m306K674M754j583m996N24M977O64m887j522M474K472l865l228
6140c487L243L766k403m128J547M322o06m409j40M127J022l758j810L257K362
6155B905k617k875J908L208j177l400L89L339M24l333j072K963J633k515k153
6170b373J934K582j433k621P25K627n2k544m81K245J080j881j525J385J975p24
$$ y = [3704, 1071, -3730, -2111, 3109, 2471, -2920, -3231, 2069, 3441, -1528, -3923, 676, 3971, 94, -4077, -996, 3766, 1725, -3474, -2487, 3081, 3232, -2371, -3577, 1817, 4087, -847, -4176, 222, 4322, 815, -4010, -1501, 3834, 2357, -3179, -2992, 2692, 3521, -1818, -3905, 1081, 4072, -227, -4242, -738, 3985, 1410, -3866, -2315, 3209, 2815, -2813, -3569, 1890, 3745, -1330, -4114, 311, 3885, 361, -3945, -1271, 3483, 1900, -3096, -2572, 2405, 3069, -1818, -3340, 1134, 3606, -259, -3487, -244, 3522, 1119, -3009, -1462, 2860, 2254, -2155, -2295, 1832, 2854, -904, -2714, 543, 2905, 288, -2587, -679, 2529, 1352, -2048, -1659, 1680, 2104, -1229, -2301, 662, 2295, -220, -2373, -439, 2143, 710, -1911, -1186, 1441, 1389, -1155, -1636, 609, 1689, -192, -1717, -332, 1643, 919]
6186I19k285J69K295M23k114j077K072J430j612j781J100K018n60k141K1K029
6202I06O92j945j276J586J859j119k293M80K576P5k756n69K695J125k598j621
6218b183K212K114j798k550J251K801n05k943k68K919R92k665j749K345K380j905
6234D48k918J417L444r12l794L30M008M37m034j213L781K001l339k640K664L211
6250B891j932l562J088L777r8m081p36M148J717l999k760L770L505l083m319K384
6266a290M794j565m981N98N031K89m871j204M518K127l997l090L377L877k493
6281A120m600J420N137l46n322p36N225J671m976k454M671L090m156l773L555
6296d74M307k716m689J576M913l64m835p75M512J848l972k734L439L510k909m114
$$ y = [919, -1366, -1197, 1098, 1521, -593, -1670, 402, 1832, 220, -1561, -461, 1557, 997, -1144, -1123, 906, 1598, -347, -1623, -37, 1822, 703, -1590, -1110, 1466, 1541, -1215, -1784, 911, 2036, -562, -2183, 29, 2143, 345, -2205, -954, 1847, 1342, -1601, -1869, 1050, 2042, -623, -2372, -27, 2353, 448, -2470, -1053, 2391, 1479, -2315, -1985, 2023, 2460, -1574, -2787, 994, 2995, -344, -2984, -320, 2891, 959, -2603, -1515, 2262, 2164, -1917, -2653, 1495, 3212, -787, -3547, 223, 3728, 645, -3674, -1290, 3504, 1939, -3042, -2444, 2587, 2876, -1995, -3199, 1319, 3446, -551, -3641, -264, 3613, 1120, -3480, -2060, 3077, 2731, -2591, -3327, 1898, 3569, -1407, -3861, 810, 3900, -256, -4029, -474, 3833, 1117, -3572, -1996, 2917, 2553, -2282, -3057, 1455, 3303, -669, -3403, 36, 3546, 637, -3477]
6312c477K284M686j589n081O97N253K37n073j152M667J889l920k537L062K937
6327B883k248l247J412L595o45l817m05M100J281l896k413L556L141k983l526
6342c212K199L762j575l633Q75L556l27l370k99L133J016k606j744K001K425j110
6358A091k948K24L141N14k981j118K916J328k555j645K451J747k111k091J752
6373b85K207j006k301J46K008O75j501j298Q96J660l84j921N8K047J37k241l40
6390a443K355P02k385j101K108J567j606j721Q44J652P8j447p90J111J318q33
6406D09j643N75K139m76k548K07L049J76l339q29L209J516k632k075J987K232
6422A957j147k294L64K232L45k367r92K436J765k520k665K347L607j876m256J147
$$ y = [-3477, -1193, 3493, 1904, -3177, -2480, 2773, 3010, -2063, -3215, 1452, 3341, -579, -3116, -54, 2883, 635, -2612, -1200, 2395, 1750, -2067, -2472, 1628, 2909, -987, -3400, 156, 3297, 314, -3212, -1013, 2749, 1174, -2459, -1584, 1972, 1645, -1725, -2024, 1109, 2125, -481, -2225, -224, 2201, 1091, -1857, -1633, 1508, 2022, -959, -2077, 839, 2167, -388, -2033, 418, 2165, 54, -2037, -285, 1922, 916, -1385, -1239, 769, 1444, -57, -1355, -459, 1201, 817, -1104, -1046, 1001, 1138, -1103, -1443, 912, 1614, -771, -1872, 236, 1803, 197, -1524, -680, 972, 1050, -397, -1187, -76, 1242, 409, -1234, -659, 1480, 1004, -1544, -1337, 1712, 1888, -1451, -2280, 929, 2445, -187, -2262, -275, 1957, 810, -1484, -1120, 1112, 1457, -910, -1902, 534, 2299, -221, -2886, -539, 3068, 1192, -3064, -1917]
6438a917M625l99m521l17M132R59l759j260L155J898k708k533K085L324j237l922
6454b395J01M316J085m386k160M151K937l746l508L409L808l025m107K424M518
6469C422j766m676O50M677N73m298j852L620K930k753l675J843M271j098m677
6484b809M14N070L20n445j073N434K151n248k961M470L709l404m206K385M206
6499C013j091m277J34M097Q52l991j940L835K930l437m095K910M889k038n387
6514c596J018N529k14n161n31M690J232m265j795L740K323k996k944K044L597
6529B671r21l989k71M096J314l868k109L479K788l110l170K722L357k255l551
6544b817J680L722r69l674R0L343Q75k826j657K029K228j275k541M81K853j8k949
$$ y = [-1917, 2708, 2309, -2212, -2529, 1603, 2562, -1197, -2457, 698, 2596, -112, -2645, -560, 2764, 1527, -2395, -2294, 2022, 3107, -1279, -3439, 712, 3649, -97, -3605, -196, 3612, 587, -3520, -1096, 3422, 1656, -3020, -2370, 2307, 2880, -1418, -3270, 350, 3280, 527, -3148, -1305, 2966, 1868, -2809, -2395, 2675, 2995, -2450, -3523, 1911, 4062, -1186, -4147, 323, 4032, 628, -3578, -1193, 3013, 1922, -2355, -2221, 1876, 2728, -1263, -3203, 632, 3562, 125, -3970, -1060, 3829, 1791, -3596, -2578, 2951, 2737, -2424, -2955, 1735, 2967, -1298, -3093, 647, 2970, -26, -2970, -926, 2671, 1750, -2239, -2510, 1586, 2900, -968, -3077, 402, 3190, 80, -3090, -368, 2989, 734, -2817, -1137, 2585, 1616, -2058, -1968, 1375, 2250, -576, -2233, -204, 2024, 749, -1792, -1311, 1542, 1524, -1425]
6561a425n45L083J025l019j602K801K172k387k469J596K581p51k331r8K037P80
6577A448j602j292J183J798q96k178M91K604M6k948n90K959J207k689j620K055
6593b4K033j446k201Q06K113j12k003n32J939J142j738j891J553K420j090k919
6609a950M46L371J56l402q08L210J255k771j711K305K096j823k374J172K762m10
6625A524l068m61L075J482l073k223K627L016k164l605J536L933q38m202K62M190
6641B011M77m125j277L804K141l313k974K630L640j637m204O30M491L74m486j302
6657c120M424K185m202k923L642L780l086m357K325M760j337m969L60M837P88
6672C107m642j749M123K631l605l386K860M113k072m702J176M966k20n084p56
$$ y = [-1425, -1970, 1113, 2138, -881, -2483, 318, 2490, 103, -2366, -770, 1811, 1060, -1271, -1369, 668, 1448, -154, -1446, -263, 1535, 639, -1539, -1048, 1556, 1602, -1346, -1936, 1023, 2230, -459, -2079, -24, 2009, 563, -1638, -832, 1281, 1169, -834, -1366, 573, 1715, -23, -1914, -361, 2059, 969, -1950, -1504, 1867, 2023, -1379, -2187, 1023, 2278, -493, -2204, 101, 2197, 374, -2000, -828, 1934, 1524, -1544, -2005, 1070, 2552, -521, -2744, -117, 2899, 735, -2870, -1334, 2599, 1761, -2441, -2179, 2011, 2488, -1637, -2914, 890, 3031, -282, -3256, -626, 3014, 1377, -2827, -2197, 2294, 2668, -1818, -3120, 1304, 3489, -713, -3636, 6, 3786, 700, -3657, -1332, 3428, 2091, -2878, -2518, 2319, 3107, -1535, -3284, 839, 3470, -135, -3521, -661, 3452, 1380, -3322, -2146, 2820, 2600, -2484, -3240]
6687c240M965J692m706k487M112L305l489l724K562M184j624m473P23M515L48
6702B663m424j370M155K290l639l061L035L806k328m158J458M420o34m476k40
6717b503M372J013m009j891L604K499k879l145K134L520j272l806L76L887M75
6732B375l687j368L415K014l011k485K357K994j782l284J049L364k20l405l83
6747b057L051J184k791j631K282K040j585k476J035K652m69k631k44K647P73k393
6763f13j271K068J742j673k025J188K155m98k342NK156N55j847j116J566J557
6779A607j180j948P65K044j51k202l22K126Q67j936j416J622J784j116k156O64
6795i48K341j12k367n94K418J066k146j639J747K254j363k616P31K915j16l027
$$ y = [-3240, 1725, 3417, -1289, -3776, 336, 3641, 152, -3572, -1010, 3174, 1550, -2923, -2200, 2315, 2663, -1761, -3131, 1024, 3314, -325, -3386, -351, 3455, 1127, -3031, -1573, 2847, 2213, -2263, -2503, 1869, 2882, -1127, -3018, 586, 3085, 206, -2939, -805, 2715, 1443, -2363, -1987, 1900, 2375, -1312, -2680, 735, 2749, -262, -2747, -390, 2604, 822, -2462, -1413, 1951, 1731, -1674, -2057, 994, 2178, -613, -2244, 38, 2078, 493, -1983, -948, 1704, 1235, -1396, -1640, 1007, 1780, -613, -1884, 184, 1926, 253, -1772, -584, 1571, 1073, -1269, -1264, 892, 1447, -400, -1516, 50, 1607, 427, -1521, -756, 1288, 1137, -1065, -1387, 739, 1606, -330, -1746, -124, 1660, 544, -1612, -948, 1393, 1281, -1086, -1680, 738, 1804, -342, -1981, -234, 2020, 657, -1959, -1228, 1687, 1571, -1456]
6811a456n64K973J260k815j842K466K459j958k907J335L213o10l422j50L521Q56
6827B359l307j687L073K333k548k994K075L412j383l733O64L916J27l970q90L730
6843A177J652l410k372K934L062k396l510J650L861p80m169o3M230Q92m075j748
6859c065L711K574l304l216K687L752j912m227J176M345j60m439p48M275J654
6874C103l910k461L379L267k717l821J936M284j191m513L13M625N60m449j534
6889c129M155K304l606l036K993L512k168l924J293M127m14m206l86M087J176
6904B778l797k050L389K774k869l335K251L613j416l810O93L883K4l676q15L473
6920A110J466l134k030K551K578j929k858J152L113l82l263k45L111R19k904j508
$$ y = [-1456, -2020, 953, 2213, -602, -2444, 22, 2481, 523, -2384, -1049, 2164, 1554, -1868, -2018, 1503, 2359, -948, -2635, 438, 2771, 223, -2771, -696, 2716, 1333, -2400, -1736, 2180, 2307, -1663, -2553, 1177, 2829, -581, -2953, -19, 3043, 647, -2863, -1213, 2648, 1868, -2301, -2364, 1866, 2758, -1317, -3065, 646, 3220, -84, -3300, -613, 3139, 1227, -3000, -1824, 2521, 2361, -2078, -2826, 1449, 3103, -807, -3268, 111, 3378, 661, -3160, -1224, 3060, 1869, -2644, -2331, 2294, 2854, -1595, -3129, 1026, 3330, -276, -3312, -319, 3193, 1025, -2899, -1606, 2521, 2107, -2099, -2485, 1602, 2778, -1019, -3069, 320, 3094, 225, -3110, -859, 2754, 1338, -2472, -1779, 2104, 2128, -1548, -2363, 1110, 2576, -558, -2588, -37, 2541, 612, -2246, -1094, 2019, 1637, -1626, -1871, 1240, 2159, -745, -2253]
6936b253K585J931k156k264J611K575j061k690L84K647K72k444r06K095J482j682
6952A26j823J111K131o11k368J54K414M38k398r29K200J372j834j762J368K026
6968A615q17k021K18J881L86j712r02J458J336j106j792Q67K026m05k355j10K519
6985A086N54k271j226K086J489j575j714J068J895o55j906n2J992O16j952j177
7001a742J758J909j549k442J186K802n87l048J4L072M93k907q66K591J361k326
7017b81j769J817K310j284k667M56L099L18l128j308L141J993k797k646K474L119
7033B847k094l449J502L771r73l943K70L879O00l704j460L210K302k527k952J836
7049h85L357j012l696K04L950N15m087j165M077J957l925k698L569L298k926l666
$$ y = [-2253, 332, 2263, 107, -2157, -546, 2029, 968, -1722, -1338, 1309, 1581, -863, -1769, 326, 1808, 126, -1697, -586, 1545, 934, -1434, -1280, 1134, 1572, -826, -1755, 445, 1817, -17, -1779, -411, 1615, 798, -1223, -1005, 876, 1262, -450, -1352, 106, 1442, 336, -1456, -589, 1437, 1032, -1323, -1433, 1086, 1640, -631, -1857, 229, 1718, 143, -1571, -503, 1392, 737, -1169, -1221, 771, 1387, -565, -1742, 16, 1925, 376, -2066, -880, 1922, 1335, -1713, -1699, 1373, 1866, -1041, -1907, 684, 2045, -281, -2050, -233, 2077, 793, -1874, -1418, 1681, 1999, -1129, -2437, 704, 2697, -100, -2746, -272, 2847, 753, -2696, -1194, 2577, 1604, -2339, -2069, 1810, 2410, -1294, -2754, 456, 2758, 231, -2721, -885, 2472, 1460, -2236, -2032, 1918, 2433, -1654, -2819, 1258, 3215, -710, -3408, 161, 3459, 533, -3133]
7065c133K116L748j197l637K50L553N00l384j226L056K166k805k935K297L572
7080B941j580m172Q58M409j31m360o76M212J184l773j669L347K078k786k567K176
7096e09K928j313l241K15L601O13l316j659L100K268k591k818K223L252j889l443
7112b579J445L659q89l722J99L421O41l034j352K409J921j708k278R33K534l17
7128A283k593l03K772P05k854j163K778J772k666k087K009K506j497k458Q74K161
7144A239k10j906k37J566O54j335r46J002J538p66j919K63K325K31k436p64K283
7161E82J147j949j324J536J307j051j270O77J241l32j196k62J216Q58j074j533
7177a427P53K090l04k412j40K419N42k166q97K018J034j773j267J521J465j081
$$ y = [-3133, -1017, 2731, 1534, -2103, -1853, 1700, 2200, -1184, -2410, 646, 2812, 7, -2928, -631, 2941, 1361, -2811, -1953, 2456, 2325, -2035, -2711, 1501, 2685, -1088, -2757, 590, 2668, -118, -2685, -509, 2419, 1106, -2135, -1920, 1681, 2294, -1022, -2681, 419, 2687, 96, -2722, -499, 2753, 864, -2579, -1134, 2525, 1636, -2086, -1887, 1534, 2175, -859, -2211, 198, 2119, 411, -1867, -934, 1600, 1283, -1310, -1613, 1159, 1864, -990, -2153, 625, 2397, -269, -2356, -347, 2159, 662, -1796, -922, 1239, 1029, -877, -1114, 452, 1106, -229, -1175, -173, 1365, 599, -1320, -1057, 1268, 1499, -937, -1701, 582, 1729, -220, -1544, -8, 1299, 248, -1022, -345, 896, 564, -632, -894, 322, 1180, 106, -1427, -674, 1416, 1112, -1300, -1440, 979, 1521, -645, -1542, 476, 1510, -263, -1530, -9, 1456, 375]
7193C75j733N05J941K52j979j092J919J751j513k395J176K639p36k864M35K947
7209A628j90k950k18K936O68k664j349K266J966j697k261Q78K494j09k567n53
7225a722K560J140k530j649K580K144k471k644K136L171j639l469R75L518k45
7240A855l303m63K923J116k501j739K113K306j785k734J168L236n20l696j92L835
7256A619J002l819j721L482K218k983k596K459K871j868l072J228L202m21l342
7271a741l99L318J317l103k094K618K821j961l381J526L518q63l636L33L696J02
7287B071l559p13L394J310k984j900K390K305j694k583Q57K812k72k823l86K801
7303A026Q66k666j461K504J921k225k422J919K639j368k709O30K777j10k511m20
$$ y = [375, -1358, -853, 1088, 1340, -639, -1731, 188, 1939, 426, -1969, -793, 1846, 1110, -1754, -1319, 1628, 1438, -1512, -1730, 1206, 1874, -790, -2139, 127, 2093, 396, -1865, -987, 1507, 1398, -1169, -1722, 838, 1978, -552, -2201, 379, 2523, 52, -2592, -456, 2715, 1076, -2393, -1418, 2100, 1855, -1448, -1911, 1012, 2128, -373, -2112, 1, 2307, 522, -2212, -1044, 2192, 1672, -2024, -2216, 1619, 2621, -1198, -2919, 563, 2781, -202, -2798, -339, 2532, 664, -2408, -1180, 2022, 1601, -1741, -2140, 1178, 2495, -608, -2702, -84, 2737, 776, -2605, -1079, 2439, 1576, -2060, -1727, 1969, 2071, -1488, -2201, 1193, 2503, -481, -2381, 9, 2314, 620, -1963, -1106, 1706, 1434, -1389, -1775, 1026, 1892, -774, -2235, 269, 2190, -35, -2457, -538, 2101, 733, -1976, -1346, 1431, 1321, -1190, -1610]
7319a610K238Q56j869j221J530J615j028k031O37K267j24k299m53K317R02k091
7335c64j232J726J527j409j640J026J655n99j639J18J599L12j495p25J185J131
7351A176q48j514N33J652j16j726k15J613N02j535o75J308Q98j103r94O86J242
7368H84m04j195q0J191N81j041r44Q20J270n47j458L14J540r1j521k88J600M94
7386A125j405q71J246J173r09j468N94J588j23j666l82J644P93j502j206J331
7402c8J574j169j881Q44K140m91k289rK336N02k204r51K046J373j759j814J347
7419d43K148q85k417L97K535J26k609p08K576J231k390j769K139K219j672k544
7435b066J147K786o62k854J19K826N19k749j038K595J488k154k099J805K467j275
$$ y = [-1610, 628, 1484, -385, -1606, -76, 1539, 511, -1520, -883, 1384, 1260, -1039, -1492, 825, 1727, -364, -1596, 130, 1657, 248, -1392, -366, 1289, 690, -949, -831, 768, 1080, -415, -1140, 45, 1176, 328, -1186, -653, 999, 883, -843, -1058, 555, 1057, -478, -1153, 155, 1053, -50, -1044, -358, 884, 480, -715, -795, 396, 977, -64, -1008, -188, 1082, 535, -923, -609, 931, 840, -681, -969, 631, 1125, -280, -1151, 95, 1268, 359, -1109, -515, 1073, 950, -716, -1098, 546, 1339, -163, -1369, -38, 1536, 367, -1514, -670, 1470, 979, -1310, -1319, 1017, 1519, -685, -1636, 410, 1783, 24, -1790, -443, 1705, 820, -1597, -1200, 1335, 1461, -1148, -1856, 720, 1951, -439, -2208, -69, 2150, 478, -2066, -919, 1867, 1205, -1649, -1530, 1296, 1815, -934, -1972, 623, 2111, -43, -2142, -337, 2130, 855]
7451H55k776P58K981k46k961l83K898Q98k738j428K502J827k081k269J619K608
7467B064j087k772L51K901K11k826q37K660J348k392j856K045K232j560k595J078
7483a035K803m89k933PK896N85k761j068K440J616k008k076J612K297j025k481
7499a620M96K596L5k539n79K414J063k196j506J894J830j493k089J024K254o25
7515I59k202l5K258M22k079q72J777J319j576j452J133J743q16j839L60J857K5
7532I82j784m65J730P67j455j023J159J231q08j404N06J491k00j401k21J322N89
7549A016j140r12R03J163o10j362L59J392%j352l90J292O51j135q82P97J141m99
7567D32j222J05J300K69j301o10J202R37j014j246Q11J377l86j622J19J634K65
$$ y = [855, -1921, -1163, 1818, 1572, -1389, -1772, 1126, 2024, -714, -2142, 360, 2187, 106, -2163, -544, 2064, 977, -1795, -1444, 1457, 1668, -1158, -1995, 665, 2013, -379, -2235, -190, 2042, 482, -2113, -1035, 1768, 1279, -1654, -1647, 1249, 1834, -927, -1995, 445, 2061, 53, -2023, -411, 1886, 861, -1620, -1124, 1472, 1507, -1032, -1611, 803, 1866, -330, -1836, 58, 1888, 395, -1694, -670, 1584, 959, -1243, -1278, 980, 1402, -677, -1549, 228, 1547, -29, -1481, -348, 1395, 579, -1260, -900, 957, 982, -802, -1267, 463, 1230, -225, -1248, -89, 1142, 334, -1070, -564, 927, 727, -674, -895, 427, 1016, -124, -1036, -133, 1030, 420, -942, -583, 809, 809, -543, -933, 359, 1010, -125, -1007, -210, 931, 432, -790, -685, 615, 884, -417, -1027, 175, 1112, 98, -1148, -337, 1040, 654, -968, -849, 785, 1050]
7584A050j579o75J493R93j290j257R56J498n25j748K02J753K49j804o49J674J123
7601A464j561j374J231J715r71j908N28K134j77k165k56K084P08j871j134J618
7617F5J600j347j860Q75K171m93k266o4K404N21k389j063K270J631k104j937J654
7634c32K276j226k518O93K676j86k644l91K503R54k342j487K035K011j656k446
7650b080J138K844o50k986Q3L040N03k905j038K687J502k406j846J972K258j493
7666F23k505Q84K681k38k704l74K539J010k352j591K139J956j785k243J237K679
7682A956r58k752M49K791L1k659o15K396J116k098j466J632J836j202k007O33
7698i17K136j12k258l02K278Q32k184j281J967J589j577j915J212K090p23k074
$$ y = [1050, -529, -1204, 289, 1282, -8, -1265, -309, 1189, 664, -1084, -882, 871, 1120, -684, -1333, 341, 1464, -97, -1471, -240, 1475, 504, -1404, -876, 1258, 1081, -1084, -1340, 744, 1452, -419, -1553, 65, 1665, 318, -1542, -667, 1504, 1011, -1255, -1319, 1085, 1606, -783, -1846, 424, 2055, -49, -1986, -332, 1944, 718, -1800, -1107, 1569, 1383, -1261, -1652, 851, 1805, -537, -2024, 11, 2022, 366, -2080, -942, 1902, 1252, -1734, -1651, 1389, 1892, -1013, -2051, 636, 2138, -268, -2114, -142, 2116, 623, -1882, -998, 1683, 1445, -1259, -1633, 906, 1916, -436, -2027, 112, 2068, 283, -1960, -723, 1956, 998, -1754, -1305, 1486, 1517, -1142, -1757, 639, 1755, -343, -1809, -177, 1659, 457, -1550, -917, 1219, 1107, -1151, -1453, 825, 1657, -527, -1808, 159, 1748, 171, -1744, -532, 1558, 835, -1239]
7714a239L05J968J14j811n12J622Q60j311j310J039J610o20j879J51J904L39j870
7731f40o43J696Q67j462j099J202J240r43j314O57J403k79j397j81J219O36r93
7748c1r80O58J319m12j368P0J433J68j423l35J381N14j269p71J079R51o80j075
7766g71K26J154K22j151n57R04R22p40j173N81J345l95j540K18J692L0j794l09
7784a136J617P27j382j091J062J321n67j462J02J530K69j502o98J592J030j552
7800a40j466J470J903j275k157Q26K313l47k369n4K190N40j942r50J684J249j339
7817A36j698J099J924n71k283O7K435N32k463j059K343J525k146j731J764J956
7833A830j456k068R91K306o40k356J32K332N28k203j115J903J652j568k029J052
$$ y = [-1239, -934, 1034, 1148, -663, -1175, 447, 1307, -4, -1314, -275, 1335, 715, -1164, -1013, 891, 1230, -640, -1283, 413, 1280, -182, -1281, -79, 1161, 218, -1096, -439, 964, 685, -712, -893, 326, 962, -31, -1011, -353, 966, 554, -814, -744, 689, 857, -566, -901, 480, 994, -275, -1046, 33, 984, 304, -771, -545, 609, 831, -320, -877, 27, 949, 209, -964, -383, 962, 567, -973, -755, 937, 967, -827, -1136, 481, 1208, -174, -1265, -203, 1118, 551, -911, -809, 721, 990, -512, -1210, 382, 1412, -140, -1606, -136, 1767, 492, -1665, -839, 1474, 1127, -1242, -1296, 894, 1434, -508, -1458, 226, 1475, 136, -1562, -463, 1461, 890, -1393, -1326, 1109, 1641, -822, -1881, 462, 1987, -159, -1890, -126, 1830, 374, -1694, -703, 1603, 963, -1393, -1261, 1071, 1599, -604, -1719, 184, 1836, 268, -1761, -709]
7849g09K404o22k603K33K686J11k729m55K694Q48k484j357K096J816j640k080
7865a791J056K217l74k292k06K221O62k165j062K043J598j922j978J576K404j235
7881G52k585P12K658j64k512k74K185O88j932r60J654J265j284j598R32J874m16
7898I95k184p5K222N62k134j098K008J271j577j468J278J566j101j524P69J593
7914A103l75j686l8J537N19j269r91J024J208n46j496L21J514j4j554j81J553
7931F29M21j537n90J376Q16j116j008P17J178k47j152j58R44M99p50q25P09R48
$$ y = [-709, 1695, 1073, -1530, -1297, 1389, 1500, -1229, -1684, 1010, 1858, -626, -1983, 113, 1929, 289, -1791, -735, 1482, 1108, -1184, -1390, 831, 1493, -672, -1734, 309, 1907, -15, -1993, -417, 1987, 752, -1833, -1121, 1537, 1373, -1139, -1413, 772, 1460, -472, -1432, 222, 1487, 203, -1395, -463, 1411, 995, -1189, -1264, 958, 1520, -614, -1712, 296, 1567, -10, -1478, -200, 1366, 265, -1259, -490, 1103, 728, -958, -996, 541, 1060, -209, -1200, -176, 1032, 486, -1010, -689, 825, 811, -743, -924, 629, 1050, -487, -1077, 299, 1115, -1, -1009, -292, 886, 639, -513, -671, 273, 772, 22, -803, -94, 854]
$$ [...]
##END NTUPLES=NMR FID
##END=
