##TITLE=1H_DPA3005-01
 CDCl3, 8 sc, 
 31.5.2019
##JCAMPDX= 6.0         $$ Bruker NMR JCAMP-DX V2.0
##DATA TYPE= NMR FID
##DATA CLASS= NTUPLES
##ORIGIN= UXNMR, Bruker Analytische Messtechnik GmbH
##OWNER= root
$$ XWIN-NMR		Version 3.5
$$ Fri May 31 15:51:30 2019 Russian Standard Time (UT+4h)  she@DPX200
##.OBSERVE FREQUENCY= 200.13155
##.OBSERVE NUCLEUS= ^1H
##.DELAY= (6, 6)
##.ACQUISITION MODE= SIMULTANEOUS
##.ACQUISITION SCHEME= undefined
##.AVERAGES= 8
##.DIGITISER RES= 18
##SPECTROMETER/DATA SYSTEM= spect
##.PULSE SEQUENCE= zg30
##.SOLVENT NAME= CDCl3
##.SHIFT REFERENCE= (INTERNAL, CDCl3, 0, 15.7039)
##AUDIT TRAIL= $$ (NUMBER, WHEN, WHO, WHERE, WHAT)
$$ ##TITLE= Audit trail, XWIN-NMR		Version 3.5
$$ ##JCAMPDX= 5.01
$$ ##ORIGIN= Bruker BioSpin GmbH
$$ ##OWNER= she
$$ F:/spectra/data/she/nmr/H-F/1/audita.txt
$$ ##AUDIT TRAIL=  $$ (NUMBER, WHEN, WHO, WHERE, WHAT)
(   1,<2019-05-31 15:50:23.75 +0400>,<she>,<DPX200>,
      <created by zg, POWCHK disabled, PULCHK disabled
       configuration hash MD5:
       00 E9 B6 7A A2 85 ED C7 34 08 36 98 17 FE 4E 26
       data hash MD5: 16K
       58 35 6A 27 33 EC 95 3B E2 AC 0F 63 52 E7 C1 85>)
$$ ##END=
$$ 
$$ hash MD5
$$ 57 14 80 3A 3E 91 65 52 FE 6B 79 7D 4C 46 4B 72
##$RELAX= 
##$RELAX= 
##$RELAX= 
##$RELAX= 
##$RELAX= 
##$RELAX= 
$$ Bruker specific parameters
$$ --------------------------
##$DU= <F:/spectra>
##$EXPNO= 1
##$NAME= <H-F>
##$PROCNO= 1
##$TYPE= <nmr>
##$USER= <she>
##$AMP= (0..31)
100 100 100 100 100 100 100 100 100 100 100 100 100 100 100 100 100 100 
100 100 100 100 100 100 100 100 100 100 100 100 100 100 
##$AQSEQ= 0
##$AQ_mod= 1
##$AUNM= <au_zg>
##$AUTOPOS= <>
##$BF1= 200.13
##$BF2= 200.13
##$BF3= 200.13
##$BF4= 200.13
##$BF5= 200.13
##$BF6= 200.13
##$BF7= 200.13
##$BF8= 200.13
##$BYTORDA= 1
##$CFDGTYP= 0
##$CFRGTYP= 5
##$CHEMSTR= <none>
##$CNST= (0..31)
1 1 145 1 1 1 1 1 1 1 1 1 1 1 1 1 1 1 1 1 1 1 1 1 1 1 1 1 1 1 1 1 
##$CPDPRG= <>
##$CPDPRG1= <>
##$CPDPRG2= <>
##$CPDPRG3= <>
##$CPDPRG4= <mlev>
##$CPDPRG5= <mlev>
##$CPDPRG6= <mlev>
##$CPDPRG7= <mlev>
##$CPDPRG8= <mlev>
##$CPDPRGB= <>
##$CPDPRGT= <>
##$D= (0..31)
0 1.2 0 0 0 0 0 0 0 0 0 0.03 0 0 0 0 0 0 0 0 0 0 0 0 0 0 0 0 0 0 0 0 
##$DATE= 1559303423
##$DBL= (0..7)
120 120 120 120 120 120 120 120 
##$DBP= (0..7)
150 150 150 150 150 150 150 150 
##$DBP07= 0
##$DBPNAM0= <>
##$DBPNAM1= <>
##$DBPNAM2= <>
##$DBPNAM3= <>
##$DBPNAM4= <>
##$DBPNAM5= <>
##$DBPNAM6= <>
##$DBPNAM7= <>
##$DBPOAL= (0..7)
0.5 0.5 0.5 0.5 0.5 0.5 0.5 0.5 
##$DBPOFFS= (0..7)
0 0 0 0 0 0 0 0 
##$DE= 6
##$DECBNUC= <off>
##$DECIM= 24
##$DECNUC= <off>
##$DECSTAT= 4
##$DIGMOD= 1
##$DIGTYP= 9
##$DL= (0..7)
0 120 120 120 120 120 120 120 
##$DP= (0..7)
150 150 150 150 150 150 150 150 
##$DP07= 0
##$DPNAME0= <>
##$DPNAME1= <>
##$DPNAME2= <>
##$DPNAME3= <>
##$DPNAME4= <>
##$DPNAME5= <>
##$DPNAME6= <>
##$DPNAME7= <>
##$DPOAL= (0..7)
0.5 0.5 0.5 0.5 0.5 0.5 0.5 0.5 
##$DPOFFS= (0..7)
0 0 0 0 0 0 0 0 
##$DQDMODE= 0
##$DR= 18
##$DS= 0
##$DSLIST= <SSSSSSSSSSSSSSS>
##$DSPFIRM= 0
$$ [...]
##$SUBNAM2= <"">
##$SUBNAM3= <"">
##$SUBNAM4= <"">
##$SUBNAM5= <"">
##$SUBNAM6= <"">
##$SUBNAM7= <"">
##$SUBNAM8= <"">
##$SUBNAM9= <"">
##$SW= 24.9336996594482
##$SWIBOX= (0..15)
0 0 2 0 0 0 0 0 0 0 0 0 0 0 0 0 
##$SW_h= 4990.01996007984
##$TD= 16384
##$TD0= 1
##$TE= 0
##$TE2= 300
##$TE3= 300
##$TEG= 300
##$TL= (0..7)
0 120 120 120 120 120 120 120 
##$TP= (0..7)
150 150 150 150 150 150 150 150 
##$TP07= 0
##$TPNAME0= <>
##$TPNAME1= <>
##$TPNAME2= <>
##$TPNAME3= <>
##$TPNAME4= <>
##$TPNAME5= <>
##$TPNAME6= <>
##$TPNAME7= <>
##$TPOAL= (0..7)
0.5 0.5 0.5 0.5 0.5 0.5 0.5 0.5 
##$TPOFFS= (0..7)
0 0 0 0 0 0 0 0 
##$TUNHIN= 0
##$TUNHOUT= 0
##$TUNXOUT= 0
##$USERA1= <user>
##$USERA2= <user>
##$USERA3= <user>
##$USERA4= <user>
##$USERA5= <user>
##$V9= 5
##$VALIST= <valist>
##$VCLIST= <CCCCCCCCCCCCCCC>
##$VD= 0
##$VDLIST= <DDDDDDDDDDDDDDD>
##$VPLIST= <PPPPPPPPPPPPPPP>
##$VTLIST= <TTTTTTTTTTTTTTT>
##$WBST= 1024
##$WBSW= 4
##$XGAIN= (0..3)
0 0 0 0 
##$XL= 0
##$YL= 0
##$YMAX_a= 88468
##$YMIN_a= -102559
##$ZGOPTNS= <>
##$ZL1= 120
##$ZL2= 120
##$ZL3= 120
##$ZL4= 120
##$ABSF1= 10
##$ABSF2= 0
##$ABSG= 5
##$ABSL= 3
##$ALPHA= 0
##$AQORDER= 0
##$ASSFAC= 0
##$ASSFACI= 0
##$ASSFACX= 0
##$ASSWID= 0
##$AUNMP= <proc_1d>
##$AZFE= 0.1
##$AZFW= 0.1
##$BCFW= 1
##$BC_mod= 2
##$BYTORDP= 1
##$COROFFS= 0
##$CY= 11.3945322036743
##$DATMOD= 1
##$DC= 2
##$DFILT= <>
##$DTYPP= 0
##$F1P= 18.9103706918063
##$F2P= -1.10871071338519
##$FCOR= 0.5
##$FTSIZE= 0
##$FT_mod= 4
##$GAMMA= 1
##$GB= 0.15
##$INTBC= 1
##$INTSCL= 1
##$ISEN= 128
##$LB= 0.24
##$LEV0= 0
##$LPBIN= 0
##$MAXI= 10000
##$MC2= 0
##$MEAN= 0
##$ME_mod= 0
##$MI= 1.114404
##$NCOEF= 0
##$NC_proc= 0
##$NLEV= 6
##$NOISF1= 3.799351
##$NOISF2= 2.8
##$NSP= 1
##$NTH_PI= 0
##$NZP= 0
##$OFFSET= 15.70392
##$PC= 1
##$PHC0= -8577.553
##$PHC1= 12.40023
##$PH_mod= 1
##$PKNL= yes
##$PPARMOD= 0
##$PSCAL= 0
##$PSIGN= 0
##$REVERSE= no
##$SF= 200.130013532006
##$SI= 16384
##$SIGF1= 3
##$SIGF2= 2
##$SINO= 400
##$SIOLD= 16384
##$SREGLST= <1H.CDCl3>
##$SSB= 0
##$STSI= 0
##$STSR= 0
##$SW_p= 3612.71676300578
##$SYMM= 0
##$S_DEV= 0
##$TDeff= 0
##$TDoff= 0
##$TI= <>
##$TILT= no
##$TM1= 0
##$TM2= 0
##$TOPLEV= 0
##$USERP1= <user>
##$USERP2= <user>
##$USERP3= <user>
##$USERP4= <user>
##$USERP5= <user>
##$WDW= 1
##$XDIM= 8192
##$YMAX_p= 0
##$YMIN_p= 0
$$ End of Bruker specific parameters
$$ ---------------------------------
##NTUPLES= NMR FID
##VAR_NAME=  TIME,          FID/REAL,        FID/IMAG
##SYMBOL=    X,             R,               I
##VAR_TYPE=  INDEPENDENT,   DEPENDENT,       DEPENDENT
##VAR_FORM=  AFFN,          ASDF,            ASDF
##VAR_DIM=   8192,          8192,            8192
##UNITS=     SECONDS,       ARBITRARY UNITS, ARBITRARY UNITS
##FACTOR=    0.0002004,     1,               1
##FIRST=     0,             0,               0
##LAST=      1.6414764,     0,               0
##MIN=       0,             -102559,         0
##MAX=       1.6414764,     88468,           0
$$ Real data points
##PAGE= N=1
##DATA TABLE= (X++(R..R)), XYDATA
$$ [...]
2485B4L366k510l912J677M307q37m479n5M544R85m446j939M070K761l498l504
$$ 24 3390 880 -3032 -1355 2952 2115 -2364 -2419 2125 3110 -1336 -3275 795 3556 58 -3446
2501c446K813M013k059m515J144M775j42m845q82M630J789m278k647L780L430
$$ -3446 -633 3380 1321 -3194 -2050 2725 2583 -2262 -3144 1486 3275 -1003 -3650 130 3560
2516C560l099m104K244M558j270m767L35M814O32m688j563M389K494l820l234
$$ 3560 461 -3643 -1399 3159 1889 -2878 -2543 2271 2903 -1785 -3348 1041 3535 -285 -3519
2531c519L107L814k302m229J481M520n34m627m05M452J333m115k121L646K792
$$ -3519 -412 3402 1100 -3129 -1648 2872 2338 -2289 -2694 1758 3091 -1024 -3145 501 3293
2546C293l095l402K397L841j547m121O76M161J37m083r46L868J722l509k435K925
$$ 3293 198 -3204 -807 3034 1487 -2634 -1958 2203 2340 -1743 -2689 1179 2901 -608 -3043 -118
2562a18L003k242l400J543L653p88l813lL773Q04l490j553L091K131k594k625
$$ -118 2885 643 -2757 -1214 2439 1651 -2162 -2165 1608 2412 -1078 -2631 460 2591 -3 -2628
2578b628K032L003j343l257N88L270J57l124q17K884J411k524j957K068K400j446
$$ -2628 -596 2407 1064 -2193 -1605 1665 1822 -1302 -2119 765 2176 -348 -2305 -237 2163 717
2594G17k636Q10K725j78k688m07K589J009k301j525J871J950j366k180Q24K355
$$ 717 -1919 -1109 1616 1438 -1250 -1657 932 1941 -360 -1885 -14 1936 570 -1610 -786 1569
2610A569k75k446l09K341R30k132j448J753J808j343k167Q67K385l37k507l15
$$ 1569 1294 -1152 -1461 880 1810 -322 -1770 -17 1791 448 -1719 -852 1533 1196 -1311 -1626
2626a626K436Q84k243j392J912J847j521k277J025K596m17k701k03K684Q34k559
$$ -1626 810 1694 -549 -1941 -29 1818 297 -1980 -955 1641 1224 -1477 -1680 1004 1838 -721
2642g21j347K355J953j981k429J501K798q51k981K64L083L93l050j068K880J747
$$ -721 -2068 287 2240 259 -2170 -669 2129 1278 -1703 -1439 1644 2037 -1013 -2081 799 2546
2658B546k519k330K002K813j498l171Q47L443j42l612o54L495J378l262k059K852
$$ 2546 27 -2303 -301 2512 1014 -2157 -1310 2133 1991 -1621 -2275 1220 2598 -664 -2723 129
2674A29K643k371l183J724L567r75l787J61L827O35l723j403L492K226l068k915
$$ 129 2772 401 -2782 -1058 2509 1534 -2253 -2092 1735 2370 -1353 -2756 736 2962 -106 -3021
2690c021K489L456j743l817J068M021k74m093n13M022J341l717k069L294K688
$$ -3021 -532 2924 1181 -2636 -1568 2453 2179 -1914 -2427 1595 2936 -781 -2850 444 3132
2705C132k730l226K084L658j295l947M31M007M03l944j151L706J846l412k563
$$ 3132 402 -2824 -740 2918 1623 -2324 -1893 2114 2517 -1427 -2578 1128 2974 -438 -3001
2720c001K942L129k318l568J584L806q60l929L9L913P40l685j518L241K180k725
$$ -3001 -59 3070 752 -2816 -1232 2574 1714 -2215 -2176 1737 2477 -1208 -2726 515 2695 -30
2736c0k697K154L125j522l463Q04L635k7l592p03L368J345l033j895K624K337
$$ -30 -2727 -573 2552 1030 -2433 -1629 2006 1979 -1613 -2316 1052 2397 -636 -2531 93 2430
2752B430k014k682J404K845p59k880J44K856M94k707j113K418J692j982k104J488
$$ 2430 416 -2266 -862 1983 1224 -1656 -1512 1344 1838 -869 -1982 436 2128 146 -1958 -470
2768d70K374r97k527M84K586K1k513n53K292R70k012j345J627J686j235j972O63
$$ -470 1904 907 -1620 -1136 1450 1471 -1042 -1595 697 1667 -345 -1690 -63 1623 388 -1584 -921
2785i21K107j02k054m69J929Q57j737j222J487J565j172j803P89J936l60j955
$$ -921 1186 1084 -970 -1439 490 1347 -390 -1612 -125 1440 268 -1535 -746 1190 830 -1125
2801a125o3J914N25j712r60J414J338r70j552N41J703j19j763k65J820O95j735
$$ -1125 -1188 726 1251 -461 -1421 -7 1331 361 -1191 -650 1053 934 -829 -1094 726 1421 -314
2818c14j113J535J487j234j773Q54J953m00k057j17J974O12j782j080J506J420
$$ -314 -1427 108 1595 361 -1412 -558 1395 995 -1062 -1179 795 1407 -375 -1455 51 1471
2834A471j246j770R07K100m85k359m6K432N79k396j055K242J482j937j888J570
$$ 1471 225 -1545 -638 1462 977 -1382 -1428 1004 1583 -813 -1868 374 1856 -81 -1969 -399
2850c99K189j072k362N90K474j01k522m21K523J055k396j648K081K168j674k532
$$ -399 1790 718 -1644 -1054 1420 1319 -1203 -1624 899 1954 -442 -2090 -9 2159 485 -2047
2866b047J208K782p19k988K19L025L26k983q54K799J373k567j902K188K407j658
$$ -2047 -839 1943 1224 -1764 -1545 1480 1806 -1177 -2031 768 2141 -426 -2328 -140 2267 609
2882F09k793J001L019l41l079k78L081Q92k959j484K758K050k401k481J964K868
$$ 609 -2184 -1183 1836 1495 -1584 -1862 1219 2111 -848 -2332 426 2476 75 -2406 -442 2426
2898B426j432l146Q24L282r4l235o13L001J203k657j741K271K192j869k644J336
$$ 2426 994 -2152 -1328 1954 1860 -1375 -1988 1013 2216 -441 -2182 89 2281 412 -2232 -896
2914h96K960p65l157J00L190M71l111j085K854J626k485k037J997K313j451k513
$$ -896 2064 1299 -1858 -1758 1432 1903 -1208 -2293 561 2187 -298 -2335 -338 1975 524 -1989
2930a989R56K696l91k734k14K707Q87k487j429K207J913j791k254J357K505q36
$$ -1989 -1033 1663 1272 -1462 -1676 1031 1918 -569 -1998 209 2122 331 -1923 -566 1939 1103
2946A103k590L27K590J20k490n68K309J016k053j483J609J807j091k042N42K084
$$ 1103 -1487 -1160 1430 1550 -940 -1508 801 1817 -236 -1719 -110 1697 606 -1436 -894 1190
2962A190q1k080m14J969Q29j790j196J505J460j204j679Q72J814m30j825o9J760
$$ 1190 1109 -971 -1385 584 1413 -377 -1573 -68 1392 188 -1491 -619 1195 765 -1060 -1129 631
2979F31N26j470q69J170J147q12j334M87J497r0j552k79J520O41j405r53J215
$$ 631 1157 -313 -1182 -12 1135 323 -1011 -524 973 883 -669 -948 572 1213 -192 -1145 70
2996G0J226r12j482N25J549j15j511l22J370O47j242r65J035J258p63j539M19
$$ 70 1296 384 -1098 -573 976 861 -650 -972 398 1045 -197 -1162 -127 1131 368 -1171 -752
3013g52J703o2j781l05J783P05j667j069J436J399j114j568P52J726l70j836J0
$$ -752 951 889 -892 -1197 586 1291 -376 -1445 -9 1390 276 -1292 -540 1186 816 -1020 -1010
3030a010J874M74j852r22J666J345j441j691J120J964p57k190K96K260J18k225
$$ -1010 864 1338 -514 -1436 230 1575 134 -1557 -437 1527 770 -1420 -1124 1136 1254 -971
3046i71n65K088R47j940j338J664J718j303k040Q30K256l49k313j31K346O24k227
$$ -971 -1536 552 1499 -441 -1779 -115 1603 300 -1740 -910 1346 997 -1316 -1447 899 1523 -704
3063g04j104K077J536j773j840J459K128j063k329O42K470j22k478l85K316Q62
$$ -704 -1808 269 1805 32 -1808 -349 1779 716 -1613 -971 1499 1377 -1101 -1486 830 1692
3079A692k129j279J865J619j549j979J129K197p06k369K38K386J76k398o10K263
$$ 1692 -437 -1716 149 1768 219 -1760 -631 1566 860 -1509 -1271 1115 1291 -1107 -1717 546
3095E46J057k047j442J734J711j375j912J022K094n75k189J44K217L43k073p45
$$ 546 1603 -444 -1886 -152 1559 184 -1728 -706 1388 813 -1376 -1232 985 1328 -745 -1490
3111a490J954J135j716j437J433J747j065j890O54J987k92j992p9J936M43j820
$$ -1490 464 1599 -117 -1554 -121 1626 561 -1329 -675 1312 1020 -972 -1051 885 1328 -492
3127d92q40J581J121j304j373R65J503o48j635K61J652R0j593m50J451O94j258
$$ -492 -1332 249 1370 66 -1307 -342 1161 513 -1122 -861 791 881 -712 -1162 289 983 -275
3144b75r30J069J122q02j256N06J326j59j270q4J216L42j067n87R75P92o94r30
$$ -275 -1205 -136 986 184 -1072 -566 760 601 -669 -753 463 805 -262 -849 126 918 224 -706
3162g06M68J021k31j037PJ052K24r71m90Q22O74o45p93M11Q68k45r09l3Q96K60
$$ -706 -238 783 552 -485 -478 574 798 -173 -663 159 833 188 -605 -194 674 429 -480 -513 383 643
3182F43q39m85O65O53n19q09L41R14j08r93j22R50L92q35n90P03P78n18r31L19
$$ 643 -196 -681 -16 637 118 -691 -350 564 456 -537 -659 291 683 -152 -742 -39 739 221 -710 -391
3202c91J066n4j079k22J039N01r51p18Q36R34o71j122L93J279j31j327j61J305
$$ -391 675 621 -458 -680 359 860 -91 -809 27 961 290 -832 -439 840 709 -618 -779 526
3220E26M39j274p11J147R91r63j221O98J373m21j485J49J538J93j568n04J478
$$ 526 965 -309 -1020 127 1118 155 -1066 -368 1005 584 -901 -752 786 979 -589 -1093 385
3237C85Q31j293j098J087J325q58j508N88J643k40j708j03J678M27j604p32J467
$$ 385 1216 -77 -1175 -88 1237 379 -1129 -541 1102 862 -846 -949 729 1156 -448 -1180 287
3254B87J025j295j302J009J493p14j639L93J700r0j751k40J694N84j554r06J375
$$ 287 1312 17 -1285 -276 1217 503 -1136 -743 957 867 -884 -1124 570 1154 -400 -1306 69
3271F9J158j143j356Q83J542n75j659K49J692J20j643l97J533P11j383r65J195
$$ 69 1227 84 -1272 -389 1153 578 -1081 -832 860 980 -663 -1060 473 1184 -199 -1164 31
3288C1J217r21j378O15J474l31j513M5J506K37j448n38J303P54j105r63Q97J069
$$ 31 1248 327 -1051 -436 1038 707 -806 -761 745 982 -466 -1004 299 1053 -52 -1015 -118 951
3306I51o85j213M43J260j62j285q8J225K72j112m87J025O70q62q47O87R53m57
$$ 951 266 -947 -504 756 594 -691 -779 446 718 -394 -881 144 814 -48 -895 -208 745 288
3324B88r98L02J024j02j010q7R76L26q83m68P35O10n97o97M57P73k78q06O4P90
$$ 288 -710 -408 616 514 -496 -583 393 719 -164 -632 103 713 116 -581 -124 649 371 -435 -371 419
3344D19P8p33k14O38L30n65m51M36N00k68n46J12N18%m83j27M24K56l58l31K32
$$ 419 497 -236 -450 188 518 -47 -498 -62 438 170 -376 -264 254 254 -229 -356 68 324 -34 -365 -133
3365a33M02j21m04M4L96P5l90j52L39K85k55l29J18L90l0l90p0L89K01l87l18
$$ -133 269 148 -256 -212 184 259 -131 -283 56 341 86 -243 -125 265 235 -155 -225 164 365 -22 -340
3386c40K94M46k32n01J16N60l2o02j10N99K64n62m09M50N21l61n94K44O86j13
$$ -340 -46 400 168 -333 -217 343 311 -291 -401 198 462 -100 -509 -59 462 101 -493 -249 437 324
3406C24p34o0P66K45p46l85P00N51o29o80N22Q16l44r06J60R30Qr35j66R25L72
$$ 324 -410 -470 296 541 -205 -590 110 661 32 -648 -126 690 346 -560 -400 530 538 -397 -563 362 734
3427G34q89o00P88P66o14r32M28J048k55j138K3J162K01j131m38J055O18r49q11
$$ 734 -155 -755 33 799 185 -747 -319 729 474 -664 -641 521 722 -409 -847 208 826 -123 -934
3446i34Q32R63o31j116M00J187r9j209j28J179L69j105o02R97Q21q32r69O60J096
$$ -934 -102 861 230 -886 -486 701 602 -607 -735 444 813 -292 -894 103 924 92 -877 -217 879
3465H79m75j179K78J241l4j251k10J167M32j048o14Q90P45p37r00N48J013l56
$$ 879 404 -775 -497 744 710 -541 -751 416 848 -200 -814 76 821 84 -816 -268 745 389
3483C89j082J18J102J03j124l12J073N27r80p04Q05Q25o15q76M50R25k82r23P4
$$ 389 -693 -575 527 630 -494 -806 267 794 -186 -890 -85 740 125 -751 -301 624 342 -581 -507
3502e07R23J56q58l18P59M83o24o05M77P15k96p45J32P26Lo81j12O59J75n95k96
$$ -507 416 572 -286 -604 155 638 14 -591 -114 601 305 -440 -308 418 421 -260 -372 287 462 -133 -429
3523d29N08L84l93m24K22M31j12m29j7L99J13l37k12K59K61k13k74J74L04j37
$$ -429 79 463 70 -354 -132 299 187 -242 -259 140 253 -84 -296 -37 224 11 -263 -89 215 78
3543G8l42O5L57J7k75r8K02J44j18j39M5J49M7j55j08J36J62j14j88J01K09p4
$$ 78 -264 -199 158 175 -100 -198 4 148 30 -109 -64 85 132 -23 -131 5 167 53 -135 -34 175 101
3565A01k47NK89N8k42j55J59J92q1k10kK32M6k39j39K48J88k35k51K27L20k23
$$ 101 -146 -141 148 206 -36 -191 -32 160 79 -131 -133 99 145 -94 -233 15 203 -32 -283 -56 264 41
3587D1l88J74M65p1m69l5M39J04l69j72L50K49l14l23K21M26j46m87O0N40L7n82
$$ 41 -347 -173 292 221 -248 -283 156 260 -109 -281 69 318 4 -319 -98 328 182 -305 -245 295 332 -250
3609b50j69N89K73n45l56M52M11l95m35L24M91k63n30J26N57nn48r8N06K45m70
$$ -250 -419 170 443 -102 -458 -6 405 10 -425 -101 390 127 -403 -277 280 275 -273 -371 135 380 -90
3630i0l60M26M44l30m94K59N29j97n64J45O36p0o38o1O22J73n66k63N03L35m05
$$ -90 -450 -24 420 90 -404 -145 384 187 -377 -232 404 334 -304 -365 257 430 -136 -399 104 439 34
3651C4m13K99M65j94m94P3N41j5n66j00N73K15n68l17M82M04l92m44L16M48k56
$$ 34 -379 -80 385 191 -303 -230 311 296 -270 -370 203 418 -150 -467 15 419 27 -417 -101 347 91
3672I1m54J60M68q5m24j8M30J04m11j81L66L01k93l63K12L83j27l85J11L99p8
$$ 91 -363 -203 265 180 -244 -262 168 272 -139 -320 46 347 54 -309 -97 286 159 -226 -115 284 206
3693B06m10K0L98N5l82j13L41J47l16j82K39K21j68k45R0K39o7k33L5K42J0k83
$$ 206 -204 -184 214 269 -113 -226 115 262 -54 -236 3 224 56 -189 -99 140 73 -160 -125 117 127 -156
3715a56n2K62J04k33j23K00J30j82j34J71J45j34j18J07J11j05j08J00J34p4j10
$$ -156 -208 54 158 -75 -198 2 132 -50 -184 -13 132 -2 -120 -13 98 -7 -115 -15 119 45 -65
3736f5LJ20Nj00RQ5J0j17l2J31L5j50l9J66L6j79p4J63J05j53j02J40Q7j52j00
$$ -65 -62 58 63 -37 -28 57 67 -50 -82 49 84 -66 -105 61 97 -82 -156 7 112 -41 -143 -3 84 -68 -168
3761a68J61J38j34j75R2K03m1k05J6K03M1k18p6J98J37j67j74J61J81j47k08J18
$$ -168 -7 131 -3 -178 -86 117 76 -129 -113 90 131 -87 -163 35 172 5 -169 -8 173 26 -182 -64
3783f4K56p6k66K2K39K0k34l7K02Q4j96j22J62J50j19j65Q4J78o7k00K7K15K2
$$ -64 192 116 -150 -128 111 131 -103 -140 62 146 -50 -172 -10 140 21 -144 -60 118 51 -149 -122 93 115
3806A15k06p2J95R1j80r1J84J03j56j26J25J31q3j38O1J58m9j42qJ66K9j15o8
$$ 115 -91 -163 32 123 -57 -148 36 139 -17 -143 -18 113 30 -108 -47 111 62 -80 -88 78 107 -8 -76
3829g6R5Q0r6p4Q9R0j02q6Q0P1m2p0M9O0p0p2O6N7n0m0M9N4o4n9N5Q8l4j01J9
$$ -76 19 99 3 -71 18 108 6 -80 0 71 29 -41 8 68 -2 -74 -8 49 -1 -41 8 62 -2 -61 -6 82 48 -53 -34
3858c4J13j5j33J4J49Pj54m9J70N9j60j03J83J08j70j56J37K05r9k19P1K12l9
$$ -34 79 64 -69 -55 94 101 -53 -102 68 127 -33 -136 47 155 -15 -171 -34 171 72 -147 -76 136 97
3881I7k56QK74O0k70j11K40J60k26j89K07K44j78k76J20L20n2l38J3L30L5l37
$$ 97 -159 -151 123 183 -87 -198 42 202 -24 -213 -6 238 60 -216 -96 224 172 -166 -153 177 212 -125
3903a25r9L31J75k87k30K29K67j94l03J50L37r3l81J9L78N7l53j27L26J75l25
$$ -125 -224 107 282 -5 -235 -6 261 67 -236 -86 251 158 -223 -204 174 231 -122 -249 77 252 -73
3924g3k38K82L13k15l41J26L83q6l82K1L95O8l87j52L54K27k94k77K40L16j74
$$ -73 -311 -29 284 69 -272 -146 237 151 -231 -210 185 253 -134 -286 68 295 1 -276 -36 280 106
3945A06l71J26L94m0l86m3L79J03l48j77L38K21k74l04K04L44j43l43O2L52kl68
$$ 106 -265 -139 255 215 -171 -214 165 268 -80 -257 81 302 28 -276 -72 272 129 -214 -152 200 198 -170
3967a70o3L36J49k95k13K55K16j97k67J54L04q2l27J3L12O7k85j18K73J56k40
$$ -170 -233 103 252 -43 -256 -1 215 18 -249 -95 209 127 -200 -187 125 192 -93 -211 62 218 -22
3988b2k17J93K68j10k90N5K67J1k75n9K69J26k39j87J78K33j17k51P1K53Jk68
$$ -22 -239 -46 222 112 -178 -123 144 155 -120 -179 90 216 -23 -210 -32 201 84 -167 -96 157 158 -110
4010a10o9K58J28k09k01J80K06j10k54O4K83j3k69q4K70J46k41j88J88K49j46
$$ -110 -179 79 207 -2 -203 -23 183 73 -181 -117 166 153 -116 -200 70 216 -25 -213 -25 224 78
4031G8k86Q3L20rl30o9L06J47k86k01K42K73k03l19J10L59l8l68l6L79R9l61j98
$$ 78 -208 -125 195 186 -144 -213 93 240 -46 -247 -5 268 65 -254 -144 215 177 -191 -227 152 251 -110 -308
4054c08L38K79k72l47J96L91j15m28N0M48N0m46j67M29K56l58l45L18M04k31m77
$$ -308 30 309 37 -310 -114 277 162 -266 -216 232 282 -164 -331 98 354 -4 -349 -31 373 142 -335
4075c35J52N07l7n24p1M91J98m98k60M10L91l61m74K65N17j61n55L7N89O6n68
$$ -335 -183 324 287 -237 -308 183 381 -117 -377 33 424 63 -411 -146 371 210 -345 -308 281 347 -221
4096b21k03N32L29m70m17L77M86k92n38J86N97n9o12p1N81K10n53l08M91M08l99
$$ -221 -424 108 437 -33 -450 -73 413 121 -417 -231 366 307 -305 -376 205 415 -138 -446 45 453 54
4117E4n13L04N90j92o14O6O03P7o07j85N77L00m94m35M13N09k94n60J82N93p1
$$ 54 -459 -155 435 243 -371 -305 298 375 -232 -417 160 460 -34 -469 -56 453 159 -401 -219 374 303
4138C03o06q2O02K13n44l33M85M16m11m98L14N60j65o07K3O10R1n59k26N16L32
$$ 303 -303 -385 217 430 -114 -447 38 454 43 -455 -141 419 254 -353 -330 280 371 -188 -414 102 434
4159D34m53m44L65N23k35n75J00O13J1o05j33N79K65n24l67M00M86l15n36K04
$$ 434 -19 -463 -98 425 190 -385 -285 328 339 -266 -399 180 445 -79 -446 -46 440 125 -411 -207
4179b07N58o8n90o8O01J99n43l30M71M20l82m94K66N70j23o26jO18J29n79k50
$$ -207 351 283 -307 -375 226 425 -118 -448 23 443 61 -433 -167 403 280 -346 -347 271 400 -179 -429
4200d29N28L60m52m68L49N52k16o14Q7O39L3o23j70N75L20n17m64M37N42l22o13
$$ -429 99 459 7 -461 -112 440 224 -390 -303 336 369 -254 -424 151 471 -46 -510 -73 469 147 -466
4221d66K00O62o9o91p7O65K55o00l94N27M86m35n69L08O58j59p19J2P31J39o91
$$ -466 -266 396 327 -364 -441 224 479 -121 -515 12 498 63 -506 -198 460 301 -418 -406 325 464 -227
4242b27k79O29M25n58n44M37O56k90p11J46P19Pp27j62P02L13o43m64N55N73m21
$$ -227 -506 123 548 -10 -554 -117 539 249 -462 -316 403 410 -317 -479 223 536 -107 -571 -16 557 136
4263A36o66K91P31j41p70l3P65J93p12l36O39M70n51n83M16O81k76p46J09P71
$$ 136 -530 -239 492 351 -419 -452 313 506 -206 -542 97 567 16 -567 -151 530 254 -492 -383 388
4283C88N8p48k17P07L69o43n23N49O21l98o89K51P40r5p77m0P49K28p05l81O22
$$ 388 446 -302 -519 188 557 -86 -609 -60 561 163 -526 -275 465 370 -407 -447 302 530 -175 -556 66
4304F6M96m88o09L45P12k25p41M4P66J17p28k76O56M17n86n42M87O47l48o97J64
$$ 66 562 74 -535 -190 522 297 -444 -400 366 483 -245 -521 135 552 -34 -576 -89 558 210 -487 -323
4325c23P37rp33j50P12K95o32m61N56N71m33o66K87P25j27p67k3P48J96p15l64
$$ -323 414 405 -328 -478 234 529 -103 -564 -8 563 130 -536 -249 476 349 -418 -441 307 503 -212 -576
4346e76O43M85n10n97L82O75k23p48O3P63J33p53k82O87M29o08n46M75O85l38
$$ -576 67 552 42 -555 -173 502 279 -469 -406 357 490 -263 -545 142 571 -37 -583 -108 577 239
4366B39p71J87P91Oq00j54P64L16o96m85N92O20m58p27L04P88j22q44m5Q37K25
$$ 239 -532 -345 446 452 -348 -502 262 578 -118 -603 -11 609 151 -576 -272 516 394 -450 -495 342 567
4387E67p94m09P21N65o06o74M51P89l12q51J31Q82O2q52k73Q19M21p30n85O22
$$ 567 -227 -636 85 650 44 -630 -179 610 298 -553 -422 460 522 -330 -603 216 637 -93 -678 -56
4407e6P25m69q38K90Q97r1r32q3Q98K72q52m44P62O09o16p49M60Q43k89r01J03
$$ -56 669 200 -638 -348 549 458 -474 -557 341 613 -239 -683 79 688 72 -677 -217 626 337 -564 -461
4428d61R32J13r21l12Q57N05p54o53O17P74m65q73K69R36o8r51j11R10L12q59
$$ -461 471 584 -337 -649 208 713 -41 -694 -77 697 232 -641 -372 564 496 -455 -566 344 656 -203
4448b03m70P24O43n77p82M13Q54k26r14M7R07J63q99l54Q37N21p08o67N51P76
$$ -203 -673 51 694 117 -665 -252 602 376 -538 -491 416 579 -320 -674 163 684 -24 -691 -140 636
4468F36l90q57K29Q83j1q89j85Q48L54p62n18O44O77n09p74L37Q60j54q78n1Q68
$$ 636 246 -611 -382 501 490 -399 -584 264 618 -144 -662 -18 659 150 -624 -287 573 419 -459 -510 358
4489C58K45q24l95P16N66o07o85M33P75k45q38P6Q41J13q14l17P52M90o30o38
$$ 358 603 -221 -616 100 666 59 -626 -193 582 337 -501 -425 416 529 -285 -602 150 640 10 -628
4509f28N04P32l58p93J52Q53K6q46k25P89M03o99n48N73O82m27p99K59Q51n2q65
$$ -628 -124 608 250 -543 -391 462 488 -358 -583 206 609 -90 -638 -65 617 190 -609 -350 501 449 -416
4530d16j25Q20L28p70m97O75O42n23p72L61Q52j81q90pQ94J91q47l89P65N74o45
$$ -416 -541 279 607 -163 -660 15 657 134 -638 -277 575 394 -496 -503 391 582 -265 -654 111 685 40
4551D0p09M94Q24l25r11J38R51P1r56k60Q93M51p84o38O64P80n14q80L11R63j08
$$ 40 -669 -175 649 324 -587 -449 502 573 -383 -643 250 701 -83 -721 -57 723 209 -671 -360 603 495
4572D95r89j02R79K94r18m93Q12O91o69q60M95R50k93j026Q3J055J22j016l47
$$ 495 -494 -596 383 677 -241 -734 78 769 100 -760 -265 685 392 -634 -551 504 626 -390 -737
4591g37R61N38q32p16O77Q66n04r79L17J037r5j040j44J029L53r59n48Q54P37
$$ -737 224 762 -70 -786 -109 757 253 -726 -409 628 533 -507 -651 378 731 -228 -776 78 815
4610H15p15q71N17R85l13j058J01J075J11j026l44R82N24q48p19O87Q75n28r53
$$ 815 100 -771 -254 731 418 -640 -539 536 647 -379 -723 259 783 -65 -784 -97 778 250 -703
4629g03L13J029j09j033j31J011L44r40n23Q05O81o56q46N04R25k89r84Q1R85
$$ -703 -390 639 530 -503 -634 377 721 -219 -742 63 744 88 -758 -254 671 382 -602 -521 464
4648D64J39r47l35Q78N04p39o87N95Q08m25q70K11R25j5r39j71R09L60p95n47
$$ 464 603 -344 -679 199 703 -36 -723 -128 680 255 -615 -404 521 506 -433 -604 305 665 -130 -677
4668f77O68O90n17p90L39Q65j43q95o8Q82K52q14m40P25N84n75p31M25Q07k39
$$ -677 -9 681 164 -626 -287 578 435 -460 -528 354 606 -208 -648 77 661 86 -645 -220 587 348
4688C48q50M1Q59J54q21l34P60M91o41o44M96P45l13q21J37Q43M6q53k26Q03M05
$$ 348 -502 -461 398 552 -269 -603 157 648 7 -637 -141 604 291 -530 -393 450 496 -357 -583 220 625
4709F25p02n81N80P12m29q01K40Q64n1q96j41Q72L33p77n26O76O74n36p88L63
$$ 625 -77 -658 -78 634 205 -596 -356 508 457 -439 -580 292 625 -152 -678 -2 672 136 -652 -289
4729b89R05j75r51m0R32K61q95m36Q11O23o82p83N20R02l11r88J07J013J16j014
$$ -289 616 441 -510 -550 382 643 -252 -688 123 746 64 -719 -199 703 392 -596 -489 524 640 -374
4749c74l24R47N25q43p32P01Q83n25r85L14J056j05j094j28J060L67r98n79Q86
$$ -374 -698 249 774 -69 -801 -100 783 258 -727 -413 643 538 -556 -684 376 743 -255 -834 52
4768E2P65p41r11N52J033l36j093R0J133J37j109l66J053N85r38p70P70R45n77
$$ 52 817 76 -835 -283 750 414 -679 -589 544 681 -428 -794 259 844 -94 -864 -94 851 274
4787B74j051L47J150j49j152r8J147L19j033n76R33P60p72r34N81J045l54j140
$$ 274 -777 -430 720 571 -581 -679 468 787 -246 -822 111 871 99 -835 -254 791 437 -703
4805g03J25J159J18j117l66J052N61r33p66P84R13n94j013L56J084j11j116j04
$$ -703 -578 581 699 -418 -784 268 829 -104 -870 -86 827 233 -780 -424 660 549 -567 -671
4823f71J079L38j011n50Q76P35p10q76N43R67l16j049J08J065J28j021l42R40
$$ -671 408 746 -265 -815 61 796 86 -790 -247 720 404 -645 -537 528 656 -365 -707 233
4841B33N19q12o92O60Q20m71r06K69R61o1r51j67R15L58q42n36P18P13n82q06
$$ 233 752 -60 -752 -92 728 257 -649 -380 581 520 -431 -598 317 675 -167 -703 15 728 146 -660
4861f60L93Q60j92q99JQ89K01q38l93P33N47n95o84M48P81k65q55P2Q76J39q43
$$ -660 -267 593 401 -498 -497 392 593 -245 -638 95 642 47 -637 -189 592 327 -528 -456 420 559 -284
4882b84l37P80M87o55o45N26P51l50q39J73Q47M8q50k41P91M46p05o04N49P65
$$ -284 -621 159 646 -9 -654 -128 623 273 -566 -393 454 502 -348 -589 202 648 -57 -661 -112 653
4902F53l85q59J87R19Jr15j86Q83L85q26n56P00P22n34q43L35R33j54r71o9R78
$$ 653 268 -591 -404 515 516 -399 -585 298 683 -143 -699 1 723 189 -654 -319 614 460 -511 -580 398
4923C98K87r03n12Q11O79o76q46N31R48l36j048J25J085J13j075l33J008N51q97
$$ 398 685 -218 -730 81 760 84 -762 -231 717 381 -667 -542 543 656 -419 -752 256 807 -90
4942i0p57P39Q95n07j024L15J067p4j124j47J103M08j052o24R37Q34p68j009N84
$$ -90 -847 -108 787 280 -744 -429 638 564 -560 -707 396 804 -248 -872 65 899 131 -878 -294
4961b94J117l50j183J10J191J44j160l80J066O12r42q27P87R95n60j145L24J222
$$ -294 823 473 -710 -600 591 735 -425 -805 261 873 -69 -896 -109 886 326 -819 -495 727
4979G27o4j254j90J217M23j133o35R91Q27q15r74O12J083l84j149J26J187J29
$$ 727 663 -591 -781 436 859 -274 -909 82 909 94 -880 -268 815 431 -718 -592 595 724
4997G24j154l73J048O23r31q02P51R70n88j058L64J126j25j153j02J122L17j049
$$ 724 -430 -803 245 868 -63 -865 -114 856 268 -790 -426 700 575 -578 -680 442 759 -290
5015b90n25R06P05p39q45N25R60l08j004Q9J013J38r97l41R27N51q27p12O72Q41
$$ -290 -815 91 796 57 -788 -263 697 389 -615 -526 487 625 -372 -713 214 765 -62 -774 -102 739
5035G39m82r38K89R70o5r43j56Q96L34p77n19O55O60m85p93L11Q73j15q96j14
$$ 739 257 -681 -392 578 513 -430 -586 310 644 -133 -652 3 663 178 -615 -304 569 454 -442 -556
5055e56Q87K91q12m61O99N93n47p12L88P71k07q14K4P96J88p76l58O83N37n41
$$ -556 331 622 -190 -651 48 641 94 -618 -230 541 334 -480 -456 340 528 -248 -606 77 614 73
5075G3o84L90P71k26q19N1Q42J12q13k84P57M51o53n91N26P10l52q01J77Q35L4
$$ 73 -611 -221 550 324 -495 -444 398 510 -303 -587 170 621 -32 -623 -97 613 261 -540 -363 472 506
5096E06q31k35P74M39o99n99N94P25m39q49K78R12r2r52r8R23L09q71n19P73O76
$$ 506 -325 -560 214 653 -46 -645 -51 674 235 -614 -336 576 484 -468 -566 357 666 -205 -724 49 725
5117G25o10q19M08R25k18r90J0J016J94r80m30R22O30q12p97O61R28m71j027K60
$$ 725 115 -704 -296 629 411 -579 -569 447 641 -339 -769 153 783 -29 -826 -165 763 292 -735 -475
5137d75J090k3j098j99J050M08r59n99Q36Q01o82r61M92J075k56j149L7J163J86
$$ -475 615 592 -506 -705 345 753 -206 -805 31 832 150 -811 -319 756 500 -649 -612 551 737
5156G37j099m19J030O12r12p89P47R25n65j020L42J088j13j118j36J083L72j001
$$ 737 -362 -781 249 861 -51 -840 -93 832 267 -753 -411 677 564 -554 -690 393 765 -236
5174b36n92Q80P71p43r16N53J018l52j083J35J110O6j068k91R98N14q89o85P48
$$ -236 -828 52 823 80 -836 -283 735 383 -700 -565 545 611 -457 -748 250 764 -125 -810 -62
5193f2Q13n27r39L38R95j15j020q8J002L03r23n02Q39O60o94p93N21Q88l25r48
$$ -62 751 224 -715 -377 618 503 -517 -605 397 700 -223 -725 114 774 80 -713 -192 696 371 -577
5213e77J21R40Q3r10k73Q25M46p21n88N63P19m11q04K50Q37o5q42j24Q07K96p52
$$ -577 -456 484 567 -343 -616 209 655 -66 -654 -91 628 217 -587 -337 500 435 -407 -531 276 572 -180
5234a80m35O33N77m96o59L48P09j76p43MP29J88o99l33O10M56m79n85L66O53j99
$$ -180 -615 18 595 99 -560 -212 497 321 -422 -418 311 499 -200 -533 77 533 54 -531 -165 488 289
5255B89p15N4P21J04o86k60O25M00n24n25L88O39k53o85P9P13Q5o86k50O39L88
$$ 289 -426 -372 349 453 -233 -493 132 532 8 -517 -129 510 257 -428 -349 364 449 -237 -487 152 540
5276E40n43n49M39O63l12p20J37P77Rp63k04P26L75o46n31N48O58m29p44K59Q14
$$ 540 -3 -552 -113 550 238 -482 -345 432 441 -322 -526 200 575 -71 -602 -54 604 175 -569 -310 504
5297E04q0q53j01Q43K80p76m75P06O17n87p51M48Q29k59q93N9R19J31r01l05Q45
$$ 504 424 -429 -530 313 593 -183 -658 48 665 78 -673 -225 604 345 -548 -489 430 561 -340 -645 200
5318B00M92p52o53O10Q07m59q95K63R67o4r86j46R83L41r21n12P92O93o83q13
$$ 200 692 -60 -713 -103 704 245 -650 -387 580 516 -470 -616 367 708 -213 -725 67 760 77 -736
5338g36M82R46l00j018Q6J037J29j007l37R46N28q58p01P10Q49n21r80L45J028
$$ -736 -254 692 392 -626 -540 497 626 -381 -718 228 756 -102 -803 -93 756 235 -745 -400 628
5357F28j13j067r4J033L21r77m95Q55O82p14q19N46R30l53j002J60J018P2j026
$$ 628 515 -552 -646 387 708 -269 -764 91 773 59 -760 -214 716 363 -639 -479 539 611 -415
5376d15k57R44M50q57o09P15P59n61q61L80R24j80r56j0R27J98q77l80P87N38
$$ -415 -672 272 722 -135 -744 -29 730 169 -692 -312 612 432 -524 -534 393 591 -286 -666 121 659
5396F59o70o56N15P64l47q23J64Q69Mq40j89Q04L43p04m85N93N98m51o85K95P17
$$ 659 -11 -667 -152 612 265 -558 -394 475 479 -361 -550 254 597 -107 -592 1 599 148 -537 -242 475
5417D75r7p58m5P27K06o69l50N89M75m63n82L25O46j84o59J3O56J36o31k76N59
$$ 475 378 -380 -425 302 508 -161 -511 78 553 90 -492 -167 479 295 -364 -351 305 441 -190 -466 93
5438I3L99m67n04L28N85j99o17O8O11Q5n75k34N31L61m48m66L29N68k30n97Q6
$$ 93 492 25 -479 -151 434 235 -382 -314 297 382 -193 -427 104 465 17 -449 -120 448 218 -379 -293
5459b93O16O3o03j99N60L20m73m59M01N19k47o14J32O32K6o31j83O25K81n53m13
$$ -293 323 386 -217 -416 144 464 -9 -468 -67 452 205 -409 -277 355 381 -250 -433 192 473 -80 -493
5480d93M64N36l62o05K19O79p5p15o2O81K51o56l94N74N13m63o37L46P18j90p85
$$ -493 -29 507 145 -460 -241 438 363 -352 -414 267 518 -138 -532 42 555 92 -545 -199 519 329 -456
5501d56K2Q14J34p83l06P37M57o61n96N46P11l88q09K18Q58n0q63j37Q52K99p80
$$ -456 -434 380 514 -269 -575 162 619 -42 -638 -92 619 231 -578 -360 498 448 -415 -552 300 599 -181
5522a81m73P01O09n65p43M38Q31k64q97J00R12R1q89k76Q36M39p33o05O37O93
$$ -181 -654 47 656 91 -652 -214 617 353 -544 -444 468 559 -330 -606 230 669 -64 -669 -32 661
5542F61m83p93L12Q68j36r01n6R02K10q41l85P59N39o55o58N20P42l61q19J95
$$ 661 178 -615 -303 565 429 -472 -528 374 584 -257 -642 117 656 1 -657 -137 605 244 -575 -380
5562c80Q55m2q28j61Q01L34p36m73O23O04m89o94L41P66j78q07L4P96J22p59k72
$$ -380 475 433 -395 -556 245 579 -157 -630 -7 597 108 -586 -245 521 343 -464 -430 366 488 -271 -543
5583e43O98M29o18n24M71O26l15o78J79O94m3o70j32O57K57n95l71M99M90l99
$$ -543 155 584 -34 -558 -87 539 224 -454 -275 419 376 -294 -426 231 488 -107 -478 21 511 112
5603A12n69K71O19j44o29RO10J09n49k36M77L16l90m03K96M56j76n04N9M99O7
$$ 112 -457 -186 433 289 -340 -331 279 388 -161 -397 80 396 6 -397 -101 355 179 -325 -266 233 300
5624C00m75j87M45K69l75l46K73M33k12m34J06M29L1m43j08M01K16l35l08K51
$$ 300 -175 -362 83 352 -23 -369 -96 337 125 -309 -203 226 257 -186 -294 107 323 -12 -320 -69
5644f9L91j54m40O3M51N9m52j71M37K55l77l43L11M13k41m47J12M96nm93j40M80
$$ -69 322 168 -272 -209 242 301 -151 -322 115 370 -7 -350 -39 374 133 -314 -202 294 289 -204 -344 136
5666A36K46m28l54L21M65k51n14J40N42k8n80q0N85J86n46l17M99M11l92n15K89
$$ 136 382 -46 -400 -79 386 135 -379 -239 303 275 -305 -385 200 386 -160 -477 22 433 41 -474 -185
5687a85N61j51n84L2O01R9n93k17N56L62n10m59M23N74l37o33K21O85q4p03o0
$$ -185 376 225 -359 -327 274 373 -220 -437 119 481 -29 -488 -65 509 172 -461 -240 445 361 -342 -402
5708d02O77J86o20l04N64M07m89n04L61O05k43o75R7O98N8p22j95O84L38o31m47
$$ -402 275 461 -159 -463 101 508 19 -485 -124 481 238 -437 -340 358 416 -306 -501 183 521 -110 -557
5729e57N50N37m54o19L34O88k08p12O6P18R3p00k40O43L70n37n07M52N91l21o64
$$ -557 -7 530 76 -543 -209 479 271 -441 -375 343 436 -264 -504 139 509 -28 -535 -83 508 187 -477
5750d77K04P05p8p22m7P25J75o81k99O03M11n00m89L88N40k49n86J31N92Pn99
$$ -477 -273 432 354 -368 -415 310 485 -196 -495 108 519 19 -470 -82 458 209 -377 -246 346 353 -246
5771b46j18N80K20n11l68M80M29l83n02K75N35j57n65N8N38M8n17j30M58K30m02
$$ -246 -364 216 436 -75 -443 37 466 83 -419 -144 391 234 -331 -273 265 313 -204 -334 124 354 -48
5792d8l23L36L70k08m58J17M86j2m73j10M50K14m12k60L25L46k77l60J78L94q2
$$ -48 -371 -35 335 127 -331 -214 272 260 -213 -323 127 341 -71 -331 -6 340 63 -297 -119 275 193
5813A93m07qL76J13l37j94K80K75k11l26J20L73m4l66n3L74J11l54j66L02K39
$$ 193 -214 -222 154 267 -70 -264 16 291 80 -246 -126 247 203 -163 -216 158 269 -85 -251 51 290
5834B90k50l01J64L36p7l50k5L40J03l03j99K73K67k27l27J66L49p4l92mM11J01
$$ 290 40 -261 -97 239 162 -188 -213 127 230 -73 -272 1 268 41 -286 -120 229 155 -237 -241 170 271
5856B71m03j81L65K51k92l24K05L94j33m08L4M31P8m37j83M32K57l53l71L04M47
$$ 271 -132 -313 52 303 11 -313 -108 286 153 -255 -221 210 288 -149 -332 100 357 4 -367 -63 384
5877C84k30m89J09N46k0n42r6N16K04m82k99M28L93l45m87K54N37j24o05NO20
$$ 384 154 -335 -226 320 300 -242 -338 178 382 -100 -399 29 422 77 -410 -156 381 257 -348 -343 277
5898B77J00n85k29N52L42n11m26M16N18l24n79K14O20q8o28n4O16J86n85k99N14
$$ 277 377 -208 -437 115 457 -54 -480 -64 454 130 -449 -235 385 297 -331 -385 231 417 -168 -467 47
5919D7M20m41m92L34N67k36n98J15O36Lo45j14N97K52n51l45M79M33l88n03K73
$$ 47 467 26 -466 -132 435 199 -399 -284 352 355 -290 -404 193 445 -106 -451 28 461 73 -430 -157
5940a57N44j53n62K7N83O9n62j91N37K94m80l84L94M61k94n12J94N45r1n50l2
$$ -157 387 234 -328 -301 282 351 -211 -402 135 429 -51 -435 -41 420 126 -386 -192 353 262 -288 -320
5961c20N53J23m98k28M30L18l61l90K70M38j73m83P2M91K9m73r6M09K02l76k77
$$ -320 233 356 -142 -370 60 378 17 -373 -103 335 162 -321 -249 242 271 -202 -298 111 313 -63 -340
5982c40L21L21k36l68J69L88p6l95nL79R3l56j59L06K21k43k58J67L02j10l15
$$ -340 -19 302 66 -302 -133 255 179 -216 -221 158 251 -105 -264 42 263 20 -238 -71 231 121 -194
6003a94M8L13L0l03r5K82J43k39k06J66K48j12k52L3K75K9k69r1K49J37k04j95
$$ -194 -146 167 197 -106 -201 81 224 -15 -221 -55 193 81 -171 -138 137 166 -103 -194 55 192 -12 -207
6025b07J54K36r2k62K9K73K1k56r8K32J77k07k16J40K78j14k78L2K97M6l04j06
$$ -207 -53 183 91 -171 -142 131 152 -104 -202 30 207 0 -216 -76 202 88 -190 -158 139 185 -119 -225
6047b25K71J89k44k43J96K93j41l39P6L64kl53q3L51J78l45k25K69L31k33l64
$$ -225 46 235 -9 -252 -56 237 96 -243 -167 197 195 -158 -241 110 288 -57 -282 -13 318 85 -279
6068b79J51M08p2m33pM18J06m25j77L75K79l34l34K59L89j79m31R5M58qm71q8
$$ -279 -128 280 208 -225 -232 186 292 -133 -310 65 344 10 -324 -65 324 145 -286 -191 267 259 -212 -300
6090c00M46J99m40k59L68L40k96m24K23M74j39m99N6M98O6n09j57M80K59m32l42
$$ -300 146 345 -95 -354 14 354 58 -366 -143 331 192 -307 -251 247 313 -196 -353 127 386 -46 -388
6111c88L58M20k88m56J82M98p1n31j8N19J33n09k22M66L14m01l77L11M42k19m82
$$ -388 -30 390 102 -354 -172 326 255 -276 -294 225 358 -151 -373 93 407 6 -371 -60 382 163 -319
6132c19J21N03j8n16o3M66J79m56k68M08L13l12l81K35M20j57m55P2M60J4m43
$$ -319 -198 305 287 -229 -292 174 353 -103 -371 37 350 38 -343 -108 312 155 -300 -228 232 246 -197
6153a97j08M22J78l71k47L12L11k58l42J73L70q8l80J7L73O4l60j26L23K00k62
$$ -197 -305 117 295 -76 -323 -11 300 42 -300 -127 243 155 -225 -208 165 229 -131 -257 66 266 4
6174Dk66K27K79j44l12Q0L21k1l13l4K89Q9k52j47K04K16j67k42J04K43l8k61
$$ 4 -262 -35 244 100 -212 -132 189 168 -145 -179 110 199 -53 -200 4 220 53 -189 -85 158 120 -141
6196a41j7K38Q0k22j28J85J58j37j93R3K16m7k30QJ96N3j79j01J56J47j36j58
$$ -141 -158 80 160 -62 -190 -5 153 16 -177 -84 132 85 -145 -137 59 112 -67 -168 -12 135 -1 -159
6218a59Q7J82k6k04j5K05O9j98j01J68J56j37j75Q0K05l7k20OK08N0k02j05J73
$$ -159 -72 110 84 -120 -135 70 139 -59 -160 8 164 27 -148 -68 137 100 -120 -114 94 144 -58 -163 10
6241A0J71j59k00J07K34o5k55PK68N8k84j13K70J47k23k09J97K35j33k73O8L20
$$ 10 181 22 -178 -71 163 98 -157 -150 118 176 -108 -221 49 196 -27 -236 -39 196 63 -210 -142 178
6263A78k4l22m1L22J06l14j84K95K52k37l28J98L57j13l77L4M00L8m12j01L93
$$ 178 154 -168 -209 113 219 -95 -279 16 268 31 -297 -99 258 145 -232 -198 202 240 -172 -273 120
6284A20J73l49k54L02L25k39l64J54M12p0m43qM34R1m24j66L96K52l78k94K99
$$ 120 293 -56 -310 -8 317 78 -286 -132 280 210 -233 -241 193 284 -140 -306 90 342 -36 -330 -31
6305c1L75k60l92J58M27p2m42k3M41J16m13j88L60K79l29l39K67L98j95m37J12
$$ -31 344 84 -308 -150 277 205 -237 -260 181 297 -116 -304 56 335 6 -333 -66 332 137 -300 -188
6326a88M66k9m64p3M61J52m23k22L50L07l12l38K17L82j35m16O3M26L1m18j21
$$ -188 278 249 -215 -288 173 325 -98 -320 30 337 25 -313 -96 286 151 -265 -202 224 255 -163 -284
6347b84L90J99l44k77K87L47k34l76J49L93p8l96ML83Q0l59j50L23K11k48k81
$$ -284 106 305 -39 -316 -29 318 84 -292 -143 250 172 -224 -220 163 243 -116 -266 57 268 20 -261
6368b61J97L13j20l47N4L46K5l45p5L11J28k74j81K30K23j65k66J16K64k6k70
$$ -261 -64 249 129 -218 -164 182 207 -138 -213 98 226 -48 -229 1 224 59 -207 -91 173 147 -123
6389a23l2K58O9k12j50J86J76j32k30J06K41m7k32k9K44O6k23j17J91J64j46j85
$$ -123 -155 103 172 -40 -190 -4 172 40 -190 -84 157 110 -122 -151 93 159 -64 -181 10 174 28 -157
6411a57Q3J84j1k11l2K09R2k03j33J63K01j31k29Q0K60k7k65l2K60R2k32j47J99
$$ -157 -74 110 99 -112 -144 65 157 -46 -179 -16 185 54 -175 -95 165 138 -127 -159 101 193 -39 -186 13
6434A3K01j66k26J22K47m5k86j1K81Q1k91j50K59K33k39k76J96L01j23l30N6L33
$$ 13 214 48 -178 -56 191 146 -140 -151 130 211 -80 -230 29 262 23 -253 -57 244 121 -209 -153 180
6456A80Ml42p2L31J43l04k10K64K67k05l17J29L59n3l78j2L88O9l69j47L48K18
$$ 180 184 -158 -230 101 244 -60 -270 -6 261 56 -261 -132 227 174 -204 -216 172 241 -128 -275 73 291
6478B91l19k74K66L41k11l65J28L93l3m09m3L86J44l84k07L37K87l02l39K33M08
$$ 291 -28 -302 -36 305 94 -271 -143 250 217 -192 -235 151 295 -89 -296 41 328 26 -313 -80 328
6499C28j71m44Q3M65Qm80q6M18J76l81k47L28K94k59l57J95M04j04m34J0M43O6
$$ 328 157 -287 -204 261 269 -211 -297 121 297 -84 -331 -3 291 32 -325 -130 274 170 -264 -254 189 255
6521B55m29j43L97K30l64k82L02L49k52l63J69L92q6m06J9L87P6l77j45L33K28
$$ 255 -174 -317 80 310 -54 -336 -34 315 63 -300 -131 261 175 -231 -212 175 251 -126 -271 62 290
6542B90k77k85K13L40j63l51O6L79j2l66n1L56J19l31j93K83K43k36k67J50L16
$$ 290 13 -272 -59 281 118 -233 -167 212 200 -166 -217 139 258 -73 -266 17 260 24 -243 -93 223
6563B23q6l26J5L03O3k85j31K63J97k28k39J85K58j16k82L8K97J2k81o7K35J33
$$ 223 137 -189 -174 129 192 -93 -224 39 236 8 -231 -46 212 96 -186 -148 149 161 -120 -187 48 181
6585A81k08j70J69K00r8k36M9K47Qk52o6K28J40k11j68J48K31j27k43P8K45Pk46
$$ 181 -27 -197 -28 172 74 -162 -113 134 142 -110 -176 52 192 -19 -187 -39 192 65 -178 -100 145 152 -94
6608i4n4K36J02k04j55J63K01j12k45O6K51Kk60o2K47J32k34j87K05K13j60k54
$$ -94 -148 88 190 -14 -169 -6 195 83 -162 -96 155 157 -103 -165 82 214 -20 -207 -2 211 51 -203
6630b03J07K79m0l02k2K89R0k63j93K55K35k07k69J36L15o3l65K6L46P8l79j23
$$ -203 -96 183 143 -159 -181 108 198 -65 -258 -3 232 25 -244 -108 207 144 -221 -195 151 229 -150 -273
6652b73L45J97k96k62K55L23j89l54J02L96k4m07n4L91J51l78k12L21K98k81l58
$$ -273 72 269 -27 -289 -34 289 100 -254 -152 244 220 -187 -241 150 301 -77 -289 32 330 49 -309
6673c09K20M03j53m15N8M28K2m34j16M14J76l54k58L13L16k48l78J77M12j07m21
$$ -309 -89 314 161 -254 -196 232 254 -180 -296 118 294 -60 -318 -5 311 63 -315 -138 274 167 -254
6694b54J5M36O1m28j44M12K15l52k96K99L43k26l84J44M15o1m29k2M10J13l76
$$ -254 -239 197 258 -170 -314 98 313 -39 -335 -36 307 81 -303 -159 256 195 -234 -256 154 267 -109
6715a09k16L81K56l10l04K28L65j61l86P9M01Jm12o9L93J57l54k23L05K79k45
$$ -109 -325 56 312 2 -302 -74 291 130 -256 -177 224 225 -187 -256 137 294 -60 -283 22 301 56
6736E6l25J77L61j17l61K3L67N1l58j22L21J80k85k38K39K80j71l17R8L32m9l28
$$ 56 -269 -92 269 152 -209 -186 181 232 -126 -248 73 253 -32 -270 -31 249 78 -239 -141 191 142 -186
6758a86j8L01J00k66j64K40J96j91k31J44K67r6k67J5K76M3k58j00K32J63k04
$$ -186 -204 97 197 -69 -233 7 203 12 -219 -75 192 96 -171 -156 120 163 -95 -195 37 200 -4
6779dj84J37K34j03k30K9K68K1k41q6K13J39j89j69J43K15j02k54N9K39J7k41
$$ -4 -188 -51 183 80 -150 -121 147 168 -73 -159 54 193 4 -165 -22 193 91 -163 -104 135 152 -89
6801h9q0K21J43j97k01J63K30j03k72M7K80K3k92q7K75J44k37k12K17K43j42l03
$$ -89 -169 52 195 -2 -203 -40 190 87 -185 -138 142 165 -127 -214 61 205 -32 -244 -27 216 74 -229
6823b29Q0L41j8l41n7L25J40l08j97K71K60k09l23J54L56p5l74j2L89R3l80j64
$$ -229 -149 192 174 -167 -224 101 241 -67 -264 7 267 58 -265 -111 245 170 -204 -216 173 266 -114 -278
6845b78L46K38k89l11K30L51j58m05R9M19nm36q4M22J74l81k51L18L40k73l95
$$ -278 68 306 17 -294 -64 287 129 -276 -177 242 237 -199 -283 139 313 -68 -319 -1 339 66 -329
6866c29J98M21r3m74OM73R8m65j85M24K69l72l57L06M13k16m59J34M89l4m90q4
$$ -329 -131 290 197 -277 -271 202 300 -165 -350 74 343 -29 -386 -80 333 117 -342 -208 281 247 -243 -327
6888c27M85J85m46k65L94L39l21l99K30M63j66m64M4M93M4m64j40M29K43m08k98
$$ -327 158 343 -103 -368 26 365 44 -355 -125 338 172 -292 -248 245 289 -175 -315 114 357 -51 -349
6909c49L31L51k46m02J68M26p0m55j4M46J05m27j90L79K64l16l17K39L62j69l97
$$ -349 -18 333 87 -315 -147 279 209 -246 -260 186 291 -136 -326 53 317 1 -316 -77 285 116 -281
6930b81Q9L97Pl93q4L69J54l21k33K72K86j95l29J26L60n8l43k9L41R7l15j66
$$ -281 -192 205 212 -181 -265 104 258 -63 -296 -24 262 67 -262 -136 224 166 -177 -206 135 232 -83 -249
6952b49K76K30k27k66J60K86r0k92RL06M3k81j07K43J86k13k31J51K75j00k95
$$ -249 27 257 30 -236 -76 210 120 -172 -163 143 186 -95 -202 41 227 14 -217 -66 209 109 -186
6973a86L9K92K7k80q4K43J60k18j96J59K35j02k46L8K58L1k58j12K61J64k19k21
$$ -186 -147 145 172 -108 -192 51 211 -7 -203 -44 191 89 -157 -119 139 170 -88 -200 61 225 6 -215
6995b15J81K51j16k91N3L09Lk91p5K65J37k47j96K22K36j63k99J05L18k7l39m1
$$ -215 -34 217 101 -190 -137 172 175 -116 -191 74 211 -36 -232 -10 226 63 -236 -131 187 160 -179 -220
7017b20L44J27l30j91K77K67k47l01J87L60j18l92M3M01N3m04j27L66K34l30l02
$$ -220 124 251 -79 -270 7 274 27 -274 -87 273 155 -237 -194 207 260 -144 -271 95 329 -1 -303
7038c03K56L63j89m13J26M35k6m71m2M47J43m40k43M01L00l28l73K28M44j49m55
$$ -303 -47 316 127 -286 -160 275 249 -222 -264 183 326 -114 -357 44 344 16 -357 -129 315 166 -289
7059b89N7M57M5m50j35M29K13l85l20L54L81k72m46K00M70r4m85jM86Q4m54j73
$$ -289 -232 225 270 -180 -315 114 327 -58 -378 -24 357 85 -361 -161 309 215 -270 -271 215 299 -155 -328
7081c28M22K50l57l30K92L98k11m30J03M69rm85p7M54J83m15k73L65L27k94l94
$$ -328 94 344 -13 -343 -51 347 136 -294 -191 278 269 -216 -293 161 344 -71 -344 21 348 54 -340
7102c40K35M29j51m46M4M50M8m37j36L72K42l40k95K56L65j95l91J07M16j7m34
$$ -340 -105 324 173 -273 -229 221 269 -168 -304 68 310 -30 -325 -69 296 101 -290 -183 233 216 -218
7123b18m1M16J20l77j95L18K61k48l05J67L40q7l57J1L55O0l28j34K92J95k48
$$ -218 -259 157 277 -100 -295 23 284 36 -269 -102 238 151 -206 -195 160 220 -108 -242 50 245 -3
7144ck41J88K91j31l21N2L24K1l12p5K77J31k15j98J74K37j19k45M6K75J0k68
$$ -3 -244 -56 235 104 -217 -165 159 180 -132 -207 70 201 -14 -212 -38 199 80 -165 -119 156 166 -102
7166a02q1K64J39k37k14J92K46j19k77O5K84rk82p0K71J31k41j88J91K56j36l01
$$ -102 -183 81 220 -17 -231 -39 207 88 -189 -124 160 151 -131 -201 70 201 -40 -228 -37 219 83 -218
7188b18O6L21Ql37p4L24J44k92k05K57K63k07l13J45L48p6l65%L71Q6l47j65K97
$$ -218 -152 169 177 -160 -234 90 234 -58 -263 -6 257 50 -263 -118 230 154 -211 -211 160 246 -101 -266 31
7211C1K57k52l01J85L50j21l78M6M02K1m01j00L79J78l54k52L14L13k44l59J42
$$ 31 288 36 -265 -80 270 149 -229 -183 219 240 -161 -261 118 296 -58 -310 4 317 73 -286 -144
7232a44M01p5m07k7M23J00m05j75L71K63l33l46K73M03j92m46J06M70j5m80o8
$$ -144 257 182 -225 -252 171 271 -134 -309 62 325 -8 -354 -81 322 130 -316 -210 260 245 -235 -303
7253c03M68J46m15k38L58L20k90l84K42M11j26m59K9M82O2m76j53M40K34l97l06
$$ -303 165 311 -104 -342 16 336 46 -338 -96 315 189 -270 -241 241 303 -173 -326 114 348 -49 -355
7274c55L31L73k65m25K00M40r6m59nM63R5m35j74L68K72l28l45K54L94j77m21
$$ -355 -24 349 84 -341 -141 299 203 -256 -261 202 297 -138 -312 56 328 0 -345 -91 303 126 -295
7295b95J04M36lm46p0M15J57l78k34L13K90k44l23J55L60q0l77J0L61P4l45j50
$$ -295 -191 245 242 -204 -274 141 298 -80 -314 -1 289 45 -278 -123 237 157 -220 -210 151 225 -120 -270
7317b70L14K20k62k78K19L10j53l37P0L71ml40r1L25J41k60k05K17K47j56k87
$$ -270 44 264 2 -276 -57 253 100 -237 -167 204 200 -140 -231 94 235 -25 -230 -13 234 78 -209
7338b09P7L21j9k96q3L20J15k59j94K19K41j64k80R1L02l1k99m2K90Q7k34j85
$$ -209 -132 189 170 -126 -209 111 226 -33 -227 -8 233 69 -211 -120 182 151 -148 -190 100 187 -47 -232
7360b32K23K27j70k69Q6L03j8l11o3L11J15k76j81K44K29j94k71J38L03n7l08
$$ -232 -9 218 48 -221 -135 168 150 -161 -224 87 202 -74 -255 -11 218 24 -247 -109 194 137 -171
7381a71k0L20J02l04j70K76K36k22l06J76L34r6l69L6L73N1l72j51L67K17l15
$$ -171 -191 129 231 -73 -243 33 269 47 -259 -83 251 155 -214 -178 195 246 -126 -277 90 307 -8
7402hk86K47L44j79l89Q8M19j0m30r2M24J79l87k79L47L41k79m00J98M60j14m86
$$ -8 -294 -47 297 118 -271 -183 236 226 -204 -296 128 307 -80 -359 -12 329 50 -350 -152 308 194 -292
7424b92K7M77Q6m75j65M31K66l68l60L10L99k10m58J27M85k4m86p8M86J63m56
$$ -292 -265 212 298 -177 -342 89 355 -13 -373 -63 336 126 -332 -205 280 256 -230 -308 178 341 -115
7445a15k43L95L30l30l92K57M26j56m71P7M72L9m62j27M26K21l85k94L19L64k53
$$ -115 -358 37 367 37 -355 -98 328 172 -299 -222 250 289 -173 -300 126 347 -38 -332 -13 351 98
7466I8m10J64M42p3m60k7M50J06m15j81L55K75l29l09K32L79j65m06P9M12Pl99
$$ 98 -312 -148 294 221 -239 -266 184 290 -125 -306 49 324 -5 -314 -82 297 132 -274 -195 217 224 -175
7488a75q9L77J64l54k29K90L02k22l37J56L55o7l64j7L82O8l21j58K91K24k62
$$ -175 -264 113 277 -77 -306 -16 286 64 -273 -117 238 171 -193 -210 172 240 -81 -239 52 276 14
7509A4k61J95K92j08l14L1L18L6k92j04K67J58k44j91J80K36j30k59O4K58Rk81
$$ 14 -247 -52 240 132 -182 -151 167 203 -89 -193 74 232 -12 -203 -23 213 83 -176 -112 146 155 -126
7531a26n0K44J11k15j69J77K08j19k35N3K58Rk65o3K45J19k12j68J77K05j10k66
$$ -126 -176 68 179 -36 -205 -28 180 61 -174 -121 137 146 -119 -182 63 182 -30 -198 -21 184 74 -192
7553a92P7K74pk67n9K81J05k38j84K03K37j57k85J08L01k8l20m1L28R5l04j80
$$ -192 -115 159 152 -115 -174 107 212 -26 -210 -7 230 73 -212 -104 197 169 -151 -192 136 231 -73 -253
7575b53K73K35k09k95J42L51r3l75J8L80P3l70j45L36K14k81l00K44L55j82l78
$$ -253 20 255 46 -249 -107 244 151 -224 -206 174 247 -123 -268 68 282 1 -299 -55 300 118 -260
7596b60Q5M02qm09p3M08J47l80k27L22K99k51l59J80M01j05m32J3M43O5m20j63
$$ -260 -175 227 219 -190 -263 145 292 -88 -315 7 306 55 -304 -124 277 172 -260 -247 196 261 -159 -322
7618c22M01K48l71k97K94L69k15m04J34M39m6m42n4M50J36m23k14L69L05l24l67
$$ -322 79 327 -44 -341 -47 322 107 -297 -163 276 230 -212 -266 184 320 -103 -317 52 357 33 -334
7639c34K40M13j57m42P5M45K5m64q6M11J95l82k75L16L43k51l81J58M18p8m38
$$ -334 -94 319 162 -280 -205 240 265 -199 -285 126 321 -61 -336 -20 323 72 -309 -151 267 189 -249
7660b49%M23R3l99j77L58K58l28k90K34L51j55l86J06L61Jl79n1L46J32l11j87
$$ -249 -249 174 267 -132 -309 49 307 -21 -311 -77 274 119 -267 -161 200 201 -178 -229 117 249 -62 -249
7682b49K50K54k02k95J45L06n7l18%K93P8l03j09K61J70k22k10J64K43j07k60
$$ -249 1 255 53 -242 -97 209 152 -166 -166 127 205 -98 -207 54 224 2 -208 -44 199 92 -168
7703a68M8K66J1k45q8K21J30j83j74J34K05q2k32M9K43ok36p0K48J00j92j58J49
$$ -168 -120 146 157 -88 -176 45 175 -8 -182 -48 157 75 -157 -108 135 129 -107 -177 71 171 -21 -179 -30
7726c0J88r6k05L6K21J4k18p5K07J23j84j70J58K09j08k42M9K62nk46m5K30J14
$$ -30 158 62 -143 -107 114 128 -90 -165 42 165 -19 -189 -31 178 70 -172 -123 139 134 -112 -157 73 187
7749A87k22j52J83K00j30k29N5K76j2k83l7K57J23k44j79K17K30j81k60J13L07
$$ 187 -35 -187 -4 196 66 -163 -108 168 156 -127 -164 93 216 -28 -207 10 240 59 -201 -88 219
7770B19q9k95jK99P2l05j33K89J78k34k49J99K79j29l27O6L50Kl64p8L67J29l37
$$ 219 130 -165 -166 133 205 -100 -233 56 234 0 -249 -50 229 100 -227 -161 189 191 -173 -251 116 245 -92
7793i2k04L25K58k59l24K03L60j15l84M4L99K9l69j22L60J91l27k58K66L32k23
$$ -92 -296 29 287 28 -296 -93 267 152 -232 -188 211 240 -129 -251 109 300 -27 -285 -19 313 90
7814I0l79J57M08n6m36j3M05J00l98j56L50K22k89k96K40L23j59l73Q4L90lm12
$$ 90 -289 -132 276 220 -216 -229 176 276 -122 -278 72 294 5 -291 -51 272 113 -260 -176 214 211 -201
7836b01o8L91J49l55k12L10K83k56l26J89L48j33l53N0L52M1l53j02L28J69k83
$$ -201 -269 122 271 -84 -296 14 297 41 -285 -96 252 119 -234 -184 168 209 -144 -246 82 251 -32
7857c2k28K26L05j76l24J03L26j0l62k9L41R5l13j61K76K07k18k59J56K88r0k95
$$ -32 -260 -34 271 95 -229 -126 200 190 -172 -201 140 235 -78 -239 37 244 26 -233 -77 211 121 -174
7879a74J5K85M8k58j07K41J51j93k01J59K19j11k53N7K79ok71m5K47R4k05j46
$$ -174 -159 126 174 -84 -191 50 201 8 -193 -34 185 74 -179 -122 157 151 -120 -165 82 176 -29 -175
7901a75J58J70r5j92L7K05Kk16n0J98J08j64j46J26J84q8k17N7K23qk10m0J83
$$ -175 -17 153 58 -134 -97 108 110 -106 -156 42 150 -14 -160 -34 150 62 -155 -98 125 117 -93 -133 50
7924E0Q5j52j39J38J59p9j95M0K13J9k20p7K11J33j93j67J67K01j21k34O6K62
$$ 50 135 -17 -156 -18 141 62 -133 -93 120 139 -81 -158 53 186 -7 -174 -7 194 73 -161 -95 167
7946A67k8k64k8K47R5k34j60K15K10j74k51J01K91n4k97k0L09Q2l07j39K83J99
$$ 167 139 -125 -153 94 189 -45 -205 10 220 46 -205 -104 187 133 -164 -184 125 207 -100 -239 44 243
7968B43k56k38J84K92j40l23Q2L24%l22p7L21J32k72k00K51K49k08k94J55L36
$$ 243 -13 -251 -67 225 85 -238 -156 168 168 -154 -231 90 222 -50 -250 1 250 42 -252 -97 239
7989B39q1l59J9L59N3l33j36L28J73k81k28K21K92j76l10R2L40m1l63k0L58Q1
$$ 239 158 -201 -182 177 230 -103 -239 89 262 -19 -247 -26 266 90 -220 -128 212 171 -192 -212 146 227
8011B27l25j73L19K14k61k75K02L16j50l35Q6L36ql53n2L42J21l08j72K68K20
$$ 227 -98 -271 48 262 1 -274 -72 244 94 -241 -155 181 173 -180 -232 110 231 -77 -249 19 239
8032B39j93k94J52L08q2l31K8L29L7l27r2L06J49k60j94K21K30j68k60J15K57
$$ 239 46 -248 -96 212 130 -201 -173 156 193 -134 -226 80 229 -31 -225 -4 226 58 -202 -87 170
8053A70l1k77j8K68P5k51j13K17J68j92j76J18K31j05k29L5K44J2k42l9J86R4
$$ 170 139 -138 -156 112 187 -64 -177 40 208 16 -160 -42 189 84 -145 -110 134 146 -96 -135 51 145
8075A45j67j24J32J49r9j59N6J74mj80l4J77O0j53j03J13J36q3j61O3J64l7j49
$$ 145 -22 -146 -14 135 36 -123 -67 107 103 -77 -111 66 126 -27 -130 -17 119 36 -125 -62 102 65 -84
8098h4pJ37O1j29r6J12J17o9j48M9J57lj62m2J59P3j40j09J18J37q5j57N3J64
$$ -84 -91 46 107 -22 -118 -6 111 42 -106 -57 100 97 -65 -107 52 125 -15 -124 -6 131 46 -111 -58 106
8122A06Jj80l2J61R4j55j17J19J32p4j71M3J75J2k06l4J82Q8j83j20J53J43j10
$$ 106 107 -73 -105 56 150 -5 -122 -3 129 55 -116 -73 102 114 -92 -126 56 144 -39 -159 -6 137 27
8145B7j91R1K01k8k20j1K16N5k05j13K14J42j69j98J54K15j07k31N3K59Jk75l8
$$ 27 -164 -73 128 100 -120 -131 85 140 -65 -178 36 178 9 -189 -35 180 73 -158 -105 154 155 -120 -158
8168a58K56R5k40j55K24J95j78k41J39K51p3k85K9K93K7k81r3K76J41k56j83J99
$$ -158 98 193 -47 -202 22 217 39 -202 -63 188 115 -170 -141 152 179 -102 -195 81 222 -34 -217 -18
8190a8K51
$$ -18 233
8191B33
$$ Imaginary data points
##PAGE= N=2
##DATA TABLE= (X++(I..I)), XYDATA
0@%%%%%%%%jNj2J6j6J6k3L1l3M1m9N7o6P5r0J06j22J38j57J80k04K31k62K94l29
$$ 0 0 0 0 0 0 0 0 0 -1 4 -8 8 -8 8 -15 16 -17 24 -25 32 -34 41 -49 57 -65 73 -84 96 -108 123 -139 155 -174
33a74L69m13M60n12N69o32P01p76Q59r51J054j167J294j438J599j783J997k246
$$ -174 195 -218 242 -270 299 -333 368 -408 451 -500 554 -613 681 -757 842 -941 1056 -1190
51a190K542k901L348l924M691n772P432j0327J6787n5326J5045R7909q5056p9943
$$ -1190 1352 -1549 1799 -2125 2566 -3206 4226 -6101 10686 -44640 -29595 68314 -16742 -96685
65i6685N3643J04420m1206r9535J6516J14317J0156r8918l2885R5679N1327p7598
$$ -96685 -43042 61378 20172 -79363 -62847 51470 61626 -37292 -70177 25502 76829 -769
77g69o6312P1326Q4223m9410r8342K7588J01286l236r9135j3928R2227K8375r0659
$$ -769 -67081 4245 88468 39058 -59284 -31696 69590 66354 -32781 -46709 45518 73893 -16766
90a6766m8105P7838O4013o3729p7889M0899Q0213k7015q6159P570Q7463J1029
$$ -16766 -64871 12967 76980 13251 -64638 -23739 56474 29459 -56700 -49130 38333 49362
102D9362q6934l4824P4863M9798o1214n9374M9440O7290l7826p5754K2970Q2937
$$ 49362 -37572 -72396 2467 52265 -8949 -68323 -18883 48407 10581 -65173 -42203 40734
114D0734p83p8327j5478P2032L0739o1198l9824N5106N5371l9398o3954K2878
$$ 40734 39951 -38376 -53854 18178 48917 -12281 -52105 3001 58372 18974 -44980 -22102
126b2102O8920m028o5221p387O3872J9147o2632l3736N6288M7794m4128n7365
$$ -22102 46818 42790 -22431 -29818 34054 53201 -9431 -43167 13121 60915 16787 -40578
138d0578K7757N8116j6862o0264M065O0043Q950n8884k5997M8858L6686l8144
$$ -40578 -12821 45295 28433 -31831 -27766 32277 41227 -17657 -43654 5204 41890 3746
150C746m3760K8361M9345j9741n6795O678O1227J0154n7676k3728N0138L2770
$$ 3746 -40014 -11653 37692 17951 -38844 -32166 29061 39215 -18461 -42189 7949 40719
162D0719m2381l9392L6082M8473k5157n5364J0310N6692M293n3113j4937M9915
$$ 40719 -1662 -41054 -4972 43501 18344 -37020 -26710 29982 34275 -18838 -33775 16140
174A6140K4991m7201l7796M0019N0029k7198n6636J3076N7249k565n7384o950
$$ 16140 41131 -6070 -43866 -3847 46182 18984 -37652 -24576 32673 30108 -27276 -34226
186c4226N8298J9291n6046l3421M7578M3980l6183m9774K6322N4991j6406o0933
$$ -34226 24072 43363 -12683 -46104 1474 45454 9271 -40503 -14181 40810 24404 -36529
198c6529K984O4298J3784o0752k7731N3670L7439m7020m5869M0941N6243l0695
$$ -36529 -33545 30753 44537 -16215 -43946 9724 47163 143 -45726 -4785 51458 20763
210B0763o5214J5588O8021p24o6381j1849O3325K2998o0913l7486N3068N0387
$$ 20763 -44451 -28863 39158 38434 -27947 -39796 23529 46527 -14386 -51872 1196 51583
222E1583m0879n9465K6284O2501j5076o5841L315O8934J1203o8555k7380O1894
$$ 51583 10704 -48761 -22477 40024 24948 -40893 -37578 31356 42559 -25996 -53376 8518
234H518M0507n1425m8247M2777N5965l2666o3067K0258O8919l250o7334j0694
$$ 8518 49025 -2400 -50647 -7870 48095 15429 -47638 -27380 41539 38289 -29045 -39739
246c9739O3317K2423n8469l2833N4134M5697m5187n7064L1387O2746j7700o4517
$$ -39739 23578 46001 -12468 -45301 8833 54530 9343 -47721 -16334 46412 28712 -35805
258c5805N689O4728N068o5944j9763O1729L3404n3386m4498M1729N0211l2441
$$ -35805 -30116 34612 39680 -26264 -46027 15702 49106 -4280 -48778 -7049 43162 10721
270A0721n6503K1735O2188q010o4802p925O1354K1250n4485l0377M8827L9634
$$ 10721 -45782 -24047 38141 30131 -34671 -42596 18758 40008 -14477 -44854 3973 43607
282D3607m1740m8814L1881N6871j7321n8126M979N6913N839n4420j5393N2409
$$ 43607 1867 -46947 -15066 41805 24484 -33642 -28663 28250 34089 -20331 -35724 16685
294A6685K7729m5559l8429L4767M4756k3370m7237J3929M9124m905n1628p542
$$ 16685 44414 -1145 -39574 -4807 39949 16579 -30658 -16729 32395 27490 -24138 -31680
306c1680M9743J9560m3806k9140L4942L4003k8418l9532K0578M4578j0342m7419
$$ -31680 18063 37623 -6183 -35323 -381 33622 5204 -34328 -13750 30828 20486 -26933
318b6933k348M4715J2510l9608j9435L5320K6386l0339l3986K2540M0390j0964
$$ -26933 -29281 15434 27944 -11664 -31099 4221 30607 268 -33718 -11178 29212 18248
330A8248m1131J156L9621O848l7415j3866L5811K3334l0197l1476K1186L5797
$$ 18248 -22883 -21727 17894 24742 -12673 -26539 9272 32606 2409 -29067 -7881 27916
342B7916j1702l6739M227L7437K971l8699j2964L6298K2711l0224l0021K1999
$$ 27916 16214 -20525 -16298 21139 24110 -14589 -27553 8745 31456 1232 -28789 -6790
354f790L3124j5934l6736Q995M0131L7m1511j1188L7926J9889l2203k5619K7198
$$ -6790 26334 10400 -26336 -17341 22790 22827 -18684 -29872 8054 27943 -4260 -29879 -2681
367b681L1202k1741l7325J3592M2170k282m1860p427L9304J5232l6210k2096L3529
$$ -2681 28521 6780 -30545 -16953 25217 22935 -18925 -26352 12952 28184 -8026 -30122 3407
380C407L0933k7208l8451J7702M2232p837m2720j42M2813P766m3169j7843M0114
$$ 3407 34340 7132 -31319 -13617 28615 20778 -21942 -22084 20729 28495 -14674 -32517 7597
393G597K7601l3536l4885K4997L8356j8285m2130J0797M5664j222m7189j0207
$$ 7597 35198 1662 -33223 -8226 30130 11845 -30285 -19488 26176 24954 -22235 -32442
405c2442M4106J9524l8912k6199L4303L2811k9014m0008K1115M5993r967m7318
$$ -32442 11664 31188 -7724 -33923 380 33191 4177 -35831 -14716 31277 21310 -26008
417b6008O7M6472Q456m4973j6440M3636K6546l8536l5615L0259M1498k1055m4306
$$ -26008 -25941 20531 28987 -15986 -32426 11210 37756 -780 -36395 -6136 35362 14307 -29999
430b9999J3199M6852m982m9330n725M8526J6756m3993k5693L7361L1491l1783
$$ -29999 -16800 30052 25070 -24260 -29985 18541 35297 -8696 -34389 2972 34463 2680
442B680l7594K5062M3572j5938m7552M591M7105N128m4597j2869M2163K0670l8971
$$ 2680 -34914 -9852 33720 17782 -29770 -25179 21926 27054 -17543 -30412 11751 32421 -6550
455f550k9419L2789L7013k3492m0615J4696M2056o946m3033p76M3921J0735m1313
$$ -6550 -35969 -3180 33833 10341 -30274 -15578 26478 19532 -23501 -24277 19644 30379 -10934
468a0934k0152L5557K6979k8654l1202K2844L5491j6248l9731P145M1247K765
$$ -10934 -31086 4471 31450 2796 -28406 -5562 29929 13681 -26050 -18905 22342 25107
480B5107l9190j0961L5305J6736l2165k3010K7940K9530k1205l4537J2133L5623
$$ 25107 -14083 -25044 10261 26997 -5168 -28178 -238 29292 8087 -26450 -14317 21306
492B1306m241l4958k291L4281R030l3104j7100K8913K4239k1983k8130J5152L0027
$$ 21306 17065 -17893 -20184 14097 23127 -9977 -27077 1836 26075 4092 -24038 -8886 21141
505B1141r323l1796L171L3496N126l2166j3179K7808J8997k2331k2467J7786K6144
$$ 21141 11818 -19978 -16807 16689 21815 -10351 -23530 4278 23275 944 -21523 -3737 22407
518B2407j2487k9759M942L1106L506k9083j0294K5526J4967k2627j9903J8903
$$ 22407 9920 -19839 -14897 16209 19715 -9368 -19662 5864 20831 -1796 -21699 -2796
530b796K5199j2907k8956M879K9115K039k7504p412K5855J2762k3807j9165J9216
$$ -2796 22403 9496 -19460 -14581 14534 16573 -10931 -18343 7512 20274 -3533 -22698 -3482
543c482K4576j2238k6990N469K7450J11k7865n836K8090J3163k5710k0211K0462
$$ -3482 21094 8856 -18134 -12665 14785 14896 -12969 -18805 9285 22448 -3262 -23473 -3011
556c011K4771j4468k7064R368K9122m004l1286l340L1137J1302k8042j7777K3443
$$ -3011 21760 7292 -19772 -10404 18718 14714 -16572 -19912 11225 22527 -5515 -23292 151
569A51K2115j9383k6661J4598L1328p680l4401r65L4024Q457l1781j4238K9556
$$ 151 22266 2883 -23778 -9180 22148 14468 -19933 -20898 13126 21583 -10198 -24436 5120
582E120J9937k6834k6397K1739L1984j4061l4515O474L5123L38l5121p091L4879
$$ 5120 25057 -1777 -28174 -6435 25549 11488 -23027 -16553 18570 18908 -16213 -23304 11575
595A1575J5503l1774k3279K6213K8888j9608l2022J4059L5123p953l7946Q0L8667
$$ 11575 27078 -4696 -27975 -1762 27126 7518 -24504 -10445 24678 16725 -21221 -21141 17526
608A7526Q589l6172j5899L1944K1142k7927k6437K2880L1552j5997l5305P299
$$ 17526 26115 -10057 -25956 5988 27130 -797 -27234 -4354 27198 11201 -24104 -16805
620a6805L5711K18l4824o627L3757J3020l2349k0542K8333K7165k1882l1028J5244
$$ -16805 18906 19124 -15700 -22327 11430 24450 -7899 -28441 -108 27057 5175 -25853 -10609
633a0609L2894r313l4214L327L5300M373l3874j1723L0227J7587k5450k1603K1494
$$ -10609 22285 12972 -21242 -17915 17385 21758 -12116 -23839 6388 23975 -1475 -23078 -1584
646a584K6128j6501l0440R630L3058j576l2504n116L0532J0186k8739j5267K6271
$$ -1584 24544 8043 -22397 -12767 20291 18715 -13789 -18905 11627 21813 -6926 -22193 4078
659D078K0670k1966k5215J5668K7060r936k7870M518K8261J073k8381q232K5747
$$ 4078 24748 2782 -22433 -6765 20295 10359 -17511 -12993 15268 16341 -12040 -20272 5475
672E475J4410k1289j8563J6465K0857j2700k3429Q568K5907k887k6481l072K4849
$$ 5475 19885 -1404 -19967 -3502 17355 4655 -18774 -10206 15701 12814 -13667 -16739 8110
685H110P901k2027j1245J9710J5078j6188j8637J1151K0879m960k0422K40J9395
$$ 8110 16011 -6016 -17261 2449 17527 1339 -17298 -6147 14732 9772 -10650 -10410 8985
698H985L431j8804p328J8097J2229j5412j6396J0985J8299o764j8945L160J9297
$$ 8985 12416 -6388 -13716 4381 16610 1198 -15198 -4213 14086 7322 -11623 -8463 10834
711A0834N69j9392n505J7385R706j3909j2440J0243J3895p559j6087M119J8287
$$ 10834 11403 -7989 -13494 3891 13597 -312 -12752 -2509 11386 3827 -12260 -8141 10146
724A0146P99j8940o319J7211J0367j4642j3007J2416J5536r700j8141N647J9452
$$ 10146 10945 -7995 -14314 2897 13264 -1378 -14385 -1969 13567 3867 -14274 -8627 10825
737A0825o97j8740l356J7395O672j6309j0528J4704J5234j1003j9003N770K0455
$$ 10825 10128 -8612 -11968 5427 12099 -4210 -14738 -34 15200 4197 -14806 -9036 11419
750A1419q96k0491k873K0498O673k0310j1308J8430J5605j4822j8402J0873K0058
$$ 11419 10523 -9968 -12841 7657 14330 -5980 -17288 1142 16747 1925 -16477 -5604 14454
763A4454p165k1803K730K3277L229k2740r362K0048J3995j6575j7072J3750K0233
$$ 14454 7289 -14514 -11784 11493 14722 -8018 -17380 2668 16663 88 -16984 -3234 16999
776A6999j0587k3516O053K5717m45k5746m586K4585Q925k3190j3430K0891J8307
$$ 16999 6412 -17104 -11051 14666 14221 -11525 -16111 8474 17399 -5791 -19221 1670 19977
789A9977j6644k2102J0995K3733n761k4314J295K4997L478k5579r497K4278J5342
$$ 19977 3333 -18769 -7774 15959 10198 -14116 -12821 12176 15654 -9925 -19422 4856 20198
802B0198k1081j9736J7056K2688j3248k5413Q726K7637k925k8040l133K6462Q195
$$ 20198 -883 -20619 -3563 19125 5877 -19536 -10810 16827 13902 -14138 -17271 9191 17386
815A7386k4108j2149K2043J6728j9076k1428J4400K5224q166k6500K609K6643
$$ 17386 -6722 -18871 3172 19900 824 -20604 -6204 19020 10854 -15646 -13037 13606
827A3606K367k6256p164K5368J2532k2589j6957J8491J9810j4267k1694J0325
$$ 13606 15973 -10283 -17447 7921 20453 -2136 -19093 -602 19208 4941 -16753 -6428
839f428K3567n629k5012m61K4470O345k2065j0905J8962J4133j6350j7451J3117
$$ -6428 17139 11510 -13502 -13963 10507 16852 -5213 -16118 2844 16977 627 -16824 -3707
852c707K0544q796k2383L857K2404L62k1751m001K0961Q106j9212j2478J5750
$$ -3707 16837 8041 -14342 -10485 11919 12281 -9470 -13471 7490 15596 -3616 -16094 -344
865c44J5766j1051j7106O960J7697l421j8324l75J8779N073j7592r305J5052J2272
$$ -344 15422 4371 -12735 -5775 11922 8501 -9823 -10198 8581 13654 -3938 -13243 1809 14081
879A4081j2234j4283R640J6255o387j7810K042J7652K209j6057n360J3962P619
$$ 14081 1847 -12436 -2796 13459 7072 -10738 -8696 8956 11165 -4892 -10252 3710 11329
892A1329j2391j0350J0142J3124o723j4944K536J5059R10j4551l779J3993O793
$$ 11329 -1062 -11412 -1270 11854 5131 -9813 -7277 7782 8692 -5859 -9638 4355 11148
905A1148j2835j0027J0286J2313o905j3081L935J3275j407j3678j631J3718N502
$$ 11148 -1687 -11714 -1428 10885 3980 -9101 -5166 8109 6702 -6976 -8607 5111 10613
918A0613j2246r051R509J1199o684j2529M225J3846j432j4944k241J4610N802
$$ 10613 -1633 -10684 -1175 10024 3340 -9189 -4964 8882 7450 -7494 -9735 4875 10677
931A0677j2995q398J1065J0235r344j2419O955J4603l338j5657q10J5108M260
$$ 10677 -2318 -10716 349 10584 1240 -11179 -4224 10379 7041 -8616 -9426 5682 9942
944I942j3982p009J3004R948j1539j3180Q884J5622n348j6639K058J7030Q79j7341
$$ 9942 -4040 -11049 1955 11903 364 -12816 -3932 11690 6342 -10297 -8239 8791 9670 -7671
958g671m300J7159Q386j5423j2041J2448J4461r308j6123O447J7847l012j9300
$$ -7671 -11971 5188 13574 -1849 -13890 -1442 13019 3711 -12412 -5965 11882 8870 -10430
971a0430j386J9414N891j8082r531J6204J2506j4294j5602J1606J8553p630k0283
$$ -10430 -11816 7598 13489 -4593 -14124 2080 14586 292 -15310 -3704 14849 7219 -13064
984a3064L090K0417R34j9863m464J9243Q352j7946j2522J5203J5979j1429j8028
$$ -13064 -9974 10443 11377 -8486 -12950 6293 14645 -3301 -15823 -620 15359 3930 -14098
997a4098P762J9310m272k0477L29K1020M299k0053q596J7817J1798j5301j4378
$$ -14098 -6336 12974 8702 -11775 -11446 9574 13873 -6180 -14776 3041 14839 -462 -14840
1010a4840J2831J6995r610j9339N264K0343o86j9934l273J8976O727j7904j0430
$$ -14840 -2009 14986 5376 -13963 -8699 11644 10958 -8976 -12249 6727 13454 -4450 -14880
1023a4880J6035J4133j2849j6839Q974J8167n330j8881J961J9417J986j9232o280
$$ -14880 1155 15288 2439 -14400 -5426 12741 7411 -11470 -9509 9908 11894 -7338 -13618
1036a3618J7596J0024j4820j2605J2020J4594r251j6536N860J7975j687j8018
$$ -13618 3978 14002 -818 -13423 -1403 13191 3940 -12596 -6736 11239 9552 -8466
1048h466k374J6843N564j5365q287J3804J1118j1529j3767Q129J5203m422j5447
$$ -8466 -10840 6003 11567 -3798 -12085 1719 12837 1308 -12459 -4330 10873 6451 -8996
1061h996J241J5192J564j4856m775J3787Q080j1511j0563Q555J1882n847j2694
$$ -8996 -7755 7437 9001 -5855 -10630 3157 11237 -274 -10837 -2282 9600 3753 -8941
1074h941L340J3446l00j3601l118J2503O073j0446q025Q430R494o474j0980L978
$$ -8941 -5601 7845 7545 -6056 -9174 3329 9402 -1044 -9069 -639 8855 2381 -8599 -4621
1088d621J2073p42j1989k308J0879M613r580o463Q327Q477o464j0348L716J1206
$$ -4621 7452 6710 -5279 -7587 3292 7905 -1675 -8138 189 8666 2202 -8146 -4430 6776
1102F776p64j0980j641J0452L722r931o078Q833Q533o687j0243M022J0892j621
$$ 6776 6012 -4968 -6609 3843 7565 -2366 -8444 389 8922 2235 -8008 -3986 6906 5285
1116E285j1168n22J1395L091j1135o035R752Q482p568j0030N406J1068l301j2181
$$ 5285 -5883 -6405 4990 8081 -3054 -9089 663 9145 1577 -8453 -3047 8021 4720 -7461
1130g461P33J2840K486j2398n530J0937P803r254r640P591J1562n360j3216K277
$$ -7461 -6728 6112 8598 -3800 -9330 1607 9410 156 -9484 -1893 9669 4309 -8907 -6630
1144f630J3850R92j3406l709J2609O080j1713q611J0239J1196p737j2967M775
$$ -6630 7220 8212 -5194 -8903 3706 9786 -1927 -10538 -299 10897 3160 -9807 -5032
1157e032J3696k028j3947m86J4179L384j3837o593J2427R348j0225j1241P983
$$ -5032 8664 6636 -7311 -7797 6382 9766 -4071 -10664 1763 11111 886 -10355 -2372
1170b372J2681n817j4155L069J5195K87j5222l624J4216O268j3021q647J1637
$$ -2372 10309 4492 -9663 -6594 8601 8888 -6334 -9958 4258 10526 -2495 -11142 495
1183D95J1110r658j3453O717J4803l505j5195N68J5155K145j5014n179J4189Q363
$$ 495 11605 1947 -11506 -4789 10014 6509 -8686 -8118 7037 9182 -5832 -11011 3178 11541
1197A1541j2292j0880R778J2495p308j3681M906J4841j966j5372j368J4900M469
$$ 11541 -751 -11631 -1853 10642 3334 -10347 -5441 9400 7434 -7938 -9306 5594 10063
1210A0063j3523o799J2065Q925j0478j1066Q289J2955n328j3794K247J3802L64
$$ 10063 -3460 -10259 1806 10731 253 -10813 -2524 10431 5103 -8691 -6444 7358 7722
1223G722j3529k822J3095N495j2060q170J0010J0029p652j1148N387J1870l215
$$ 7722 -5807 -8629 4466 9961 -2099 -10269 -259 9770 2118 -9030 -3643 8227 5012
1236E012j2593N04J2613K425j1671m965J0071O703q525q226O919R768m779j0884
$$ 5012 -7581 -7077 5536 7961 -3710 -8675 1396 8099 -426 -8652 -1733 8035 3256 -7628
1250g628K152J1079L41j0543k273R944M110r157o064P815P888n654q799L453R058
$$ -7628 -5476 5603 5944 -4599 -6872 3072 7182 -1975 -8039 -224 7664 2010 -6789 -3336 5722
1265E722j513r091k30R166K420q632m630P322O323n607p318M048Q060k460q792
$$ 5722 4209 -4882 -5112 4054 6474 -2158 -6788 534 6857 1250 -6068 -2020 6040 3580 -5212
1280e212L99Q940J832q224l790O914N021n713o152M374P305k602q171K42Q147
$$ -5212 -4813 4127 5959 -2265 -6055 859 5880 167 -5985 -1611 5694 3092 -5079 -4837 3310
1295C310J935p470l643O675N101n758o630M352P936k340q370L37Q197J312p820
$$ 3310 5245 -2225 -5868 807 5908 150 -6480 -2128 5808 3468 -4902 -4565 3632 4944 -2876
1310b876k823P474M686o527o554M843P848k791q375R81Q699P61q943k769Q771
$$ -2876 -5699 1775 6461 -66 -6620 -1777 6071 3280 -5095 -4114 4585 5346 -3597 -6366 2405
1325B405M939p803o679O378P858n006q852L493R893j481j0561j098J0297L507
$$ 2405 7344 -459 -7138 -760 7098 2092 -6760 -3267 6626 5145 -5416 -6514 3783 7290
1339G290r362n465Q198P135p029q931N360J0497l133j1372P75J1569J396j1486
$$ 7290 -2072 -7537 661 7796 767 -8164 -2804 7693 4560 -6812 -6037 5532 6928 -4558
1353d558l474J1194N858j0129q111Q269R757n981j0598L879J1243j776j1807o79
$$ -4558 -8032 3162 9020 -1109 -9220 -951 8806 2825 -7773 -3894 7349 5573 -6234 -6913
1367f913J1916L376j1210n852R937P765q603r498O991J1109m876j2251K247J2449
$$ -6913 5003 8379 -2831 -8683 1254 9019 416 -9082 -2091 9018 4142 -8109 -5862 6587
1381F587J99j1992k256J1419M219j0720o439R447Q621p383j0141N002J1025k733
$$ 6587 6786 -5206 -7462 3957 8176 -2544 -8983 464 9085 1702 -8439 -3437 7588 4855
1395D855j1545M45J1878K047j1579m503J0526O450r115p833P715R128o175j0385
$$ 4855 -6690 -6245 5633 7680 -3899 -8402 2124 8574 -541 -8374 -659 8469 2294 -8091
1409h091M039J1203j465j1139j006J0448L065r595m970Q562O832p099q409N166
$$ -8091 -4052 7151 5686 -5453 -6459 3989 7054 -2541 -7511 1051 7883 784 -7625 -2459
1423b459R318l328r864J625J0234J80j0412k393R834M489q433n990O723O928n152
$$ -2459 6859 3531 -6333 -4708 5526 5706 -4706 -7099 2735 7224 -1209 -7199 -476 6452 1300
1438A300p630L536Q359j527q589n87Q273K512p510m015O784N488n712o898M161
$$ 1300 -6330 -2794 5565 4038 -4551 -5138 3135 5647 -1863 -5878 906 6394 682 -6216 -2055
1453b055P798k181p871M48P407Q26o892k075O313L436n328m793L832N612k251
$$ -2055 5743 3562 -4309 -3861 3546 4372 -2520 -4595 1718 5154 -174 -4967 -1135 4477 2226
1468B226o051P40O274P74o348k460N824L964m814m894L640N377k709n809J683
$$ 2226 -3825 -3085 3189 3963 -2385 -4845 979 4943 129 -4765 -1125 4252 1543 -4266 -2583
1483b583O277k50o366j463N837K989m901m143L910N238k715o195J198O779N44
$$ -2583 3694 3444 -2922 -4385 1452 4441 -460 -4603 -693 4545 1830 -4365 -3167 3612 4156
1498D156o687j979O311L110n889m242N375N613m282o764K551P271o97p248r71
$$ 4156 -2531 -4510 1801 4911 -978 -5220 155 5768 1486 -5278 -2727 4544 3847 -3401 -4372
1513d372O978K523o595m238N734N796m490o921L076P580j792q205L56Q657J463
$$ -4372 2606 5129 -1466 -5704 30 5826 1336 -5585 -2509 5071 3279 -4926 -4570 4087 5550
1528E550q592l423P776M994o480o108N162P060l749p925K019Q525k7q550j873
$$ 5550 -3042 -6465 1311 6305 -175 -6283 -1121 5939 2190 -5735 -3716 4809 4782 -3768 -5641
1543e641Q301L556p859n274P189P048n864q498M104R227k255r386O20R442J028
$$ -5641 2660 6216 -1643 -6917 272 7320 1456 -7042 -2938 6289 4034 -5352 -4732 4710 5738
1558E738r312k911Q737M814p553o406O110P605m595q701K867R568p89r912j379
$$ 5738 -3574 -6485 2252 7066 -487 -6893 -783 6822 2227 -6474 -3607 5961 5172 -4740 -6119
1573f119R532L191q850m664Q097O033p196p447N724Q602l848r169J876R284l3
$$ -6119 3413 6604 -2246 -6910 1187 7220 24 -7423 -1699 6903 3055 -6114 -4238 5046 5013
1588E013r173j834Q783L814p857n545O526O813n094p657L751Q471k245r051M04
$$ 5013 -4160 -5994 2789 6603 -1254 -6799 -273 6540 1446 -6211 -2460 6011 3766 -5285 -4881
1603d881R147J523q534l145P610M403o564n547N321O572l729p214J954P324l51
$$ -4881 4266 5789 -2745 -5890 1720 6123 -441 -5988 -667 5905 2176 -5038 -3084 4240 3889
1618C889p221j062P018K497o600m069N684N293m376n984L032O290j859o509O31
$$ 3889 -3332 -4394 2624 5121 -1479 -5548 136 5429 1053 -4931 -1899 4391 2532 -3977 -3346
1633c346O537Q05o143k187N381L246m485m036L575M854k472n524J067N791M00
$$ -3346 3191 3996 -2147 -4334 1047 4293 -192 -4228 -653 4201 1729 -3795 -2728 3063 3463
1648C463n506j560N039K479m546l348L904M220k873m811J602M945m08m845o47
$$ 3463 -2043 -3603 1436 3915 -631 -3979 -75 4145 1272 -3539 -1937 3008 2600 -2245 -2892
1663b892M625J758m236k940L402L858k290m349J188M540l12m687o87M676J845
$$ -2892 1733 3491 -745 -3685 -283 3575 1285 -3064 -1876 2664 2352 -2335 -3022 1654 3499
1678C499m283k938L479L651k513m128J630M532o14m785o47M678J948m142k935
$$ 3499 -784 -3722 -243 3408 895 -3233 -1603 2929 2315 -2470 -3117 1561 3509 -633 -3568
1693c568L506L688k846m417K083N105r48n483l50N402J527n070k501M666L449
$$ -3568 -62 3626 780 -3637 -1554 3551 2603 -2880 -3230 2172 3699 -1371 -3872 794 4243
1708D243m048m509L088N296j854n714O22N840M95n939j697N813L071n308m363
$$ 4243 195 -4314 -1226 4070 2216 -3498 -2876 2964 3459 -2480 -4177 1636 4707 -601 -4964
1723d964M402N267l350n903K304O462j116o876l28O910J845o472l122N809M266
$$ -4964 -562 4705 1355 -4548 -2244 4218 3102 -3774 -4102 2808 4653 -1819 -4941 868 5134
1738E134n100n314M157O345k838p044J317P270J41p192j482P036K816o605m247
$$ 5134 34 -5280 -1123 5222 2384 -4660 -3343 3927 4068 -3124 -4606 2430 5246 -1359 -5606
1753e606N752N460m554o292L272O828k011p265N87P480J009p257k578O610L833
$$ -5606 146 5606 1052 -5240 -1968 4860 2849 -4416 -3829 3651 4660 -2597 -5175 1435 5268
1768E268n762m883M898N843l793o708K405P182q79p193n14O996J768o671l052
$$ 5268 -494 -5377 -479 5364 1571 -5137 -2732 4450 3571 -3622 -4136 2860 4628 -2043 -5095
1783e095O121M347n155n377L942O010k705o415J519O721k11o805j260O484K593
$$ -5095 1026 5373 218 -5159 -1217 4793 2088 -4327 -2808 3913 3702 -3103 -4363 2121 4714
1798D714n777l660M976M505m128n344L065N994j757o242L63O136Q06n842j867
$$ 4714 -1063 -4723 253 4758 630 -4714 -1649 4345 2588 -3654 -3291 2845 3651 -2191 -4058
1813d058N448K971m827l989L837M751k695n122J648N296o08n368n15N212J712
$$ -4058 1390 4361 -466 -4455 -618 4133 1438 -3684 -2036 3260 2652 -2716 -3231 1981 3693
1828C693m667k702L886L383l062l894K249M324j258m600J09M481R47m071j784
$$ 3693 -974 -3676 210 3593 531 -3363 -1114 3210 1952 -2648 -2539 1942 2889 -1182 -2966
1843b966L542K469l017l159K262L711j306l945K72L841N75l628j330L353K141
$$ -2966 576 3045 28 -3131 -869 2842 1536 -2409 -2137 1704 2279 -1349 -2679 674 2815
1858B815k897k886K130L412j217l598M09L653M05l669j231L479K191k928k950
$$ 2815 -82 -2968 -838 2574 1357 -2241 -1832 1821 2226 -1443 -2674 805 2996 68 -2882
1873b882K198L438j425l747O76M026K34m133j280L885K236l329l007K707L590
$$ -2882 -684 2754 1329 -2418 -1742 2284 2518 -1615 -2895 990 3226 -103 -3110 -403 3187
1888C187k051m160J134M604m5m734j094M474K051m095k911L613L771k920m562
$$ 3187 1136 -3024 -1890 2714 2669 -2065 -3159 1315 3366 -729 -3640 -27 3744 824 -3738
1903c738J904N050p16n232l26N198J367n004k470M644L601l880m485K929N092
$$ -3738 -1834 3216 2500 -2732 -3058 2140 3507 -1497 -3967 677 4278 398 -4087 -1158 3934
1918C934j871n515Q73N850L00n911j606N653K800n026l813M312M610l487n406
$$ 3934 2063 -3452 -2579 3271 3571 -2340 -3946 1707 4507 -519 -4332 -20 4590 1103 -4303
1933d303K449O011j198o315j51O227J374o016k544N632L707m994m844L985N687
$$ -4303 -1854 4157 2959 -3356 -3507 2720 4094 -1922 -4466 1166 4873 -121 -4965 -980 4707
1948D707k829o201J672O499m84o676q10O569K209o079l431N319M401m388n243
$$ 4707 1878 -4323 -2651 3848 3364 -3312 -4122 2447 4656 -1423 -4854 465 4866 478 -4765
1963d765L423N997k212o484Q35O617N31o390j754O050K839n538l939M761M915
$$ -4765 -1342 4655 2443 -4041 -3206 3411 3942 -2448 -4202 1848 4687 -851 -4790 -29 4886
1978D886l721n596K501N916j332o074J32O049J101n742k361N077L380m248m153
$$ 4886 1165 -4431 -1930 3986 2654 -3420 -3288 2761 3862 -1880 -4241 836 4216 -32 -4185
1993d185L375M781k448n308J331N589p9n511j045N126J996m606k816L975L609
$$ -4185 -810 3971 1523 -3785 -2454 3135 3056 -2455 -3500 1626 3622 -984 -3800 175 3784
2008C784l135m187K096M479j026m531Q0M457Q82m295j892L845K820l138l488K309
$$ 3784 649 -3538 -1442 3037 2011 -2520 -2440 2017 2899 -1396 -3288 557 3377 239 -3249 -940
2024i40L830j509m065P24M165J59m070j082L687J859l122k465K503K986j772l471
$$ -940 2890 1381 -2684 -1960 2205 2364 -1706 -2788 899 2758 -364 -2829 -326 2660 888 -2583
2040b583Q85L719J46l628j043L308J767k933k362K479K945j869l357J027L551
$$ -2583 -1698 2021 2167 -1461 -2504 804 2571 -362 -2724 -245 2700 831 -2526 -1499 2052
2055B052j86l481o16L273J410k928k227K317K935j506l347O29L499J14l550q44
$$ 2052 1866 -1615 -2231 1042 2452 -476 -2703 -386 2549 1043 -2304 -1675 1824 1938 -1612 -2456
2071b456L553J638l347k443K863L096k156l537J441L818n97l965l41L937J339
$$ -2456 1097 2735 -612 -3055 -192 2904 748 -2789 -1348 2470 1873 -2092 -2433 1504 2843
2086B843l580k186L075K913k559l533J979M193j225m694K44M891P40m799j685
$$ 2843 -737 -2923 152 3065 506 -3027 -1048 3145 1920 -2774 -2530 2361 3101 -1698 -3383
2101c383M499K500m056l343L341M034k469m520J469M789n11n006n19N068J718
$$ -3383 1116 3616 -440 -3783 -442 3592 1123 -3397 -1928 2861 2350 -2656 -3175 1893 3611
2116C611m894k895M347L919l585m616K781N181j861n556R01N737K29n582j272
$$ 3611 -1283 -4178 169 4088 503 -4113 -1332 3849 1988 -3568 -2667 3070 3299 -2283 -3555
2131c555N289K261m784l245M173M188l192m989K026N422q38n591k66N570J266
$$ -3555 1734 3995 -789 -4034 139 4327 1135 -3854 -1828 3594 2756 -2835 -3101 2469 3735
2146C735n489k332N107L301m523m164L684M765k800n264J692N530m67n545p66
$$ 3735 -1754 -4086 1021 4322 -201 -4365 -681 4084 1284 -3980 -2288 3242 2775 -2770 -3536
2161c536N156J895m640k775M081L607l387m391K581N043j536n348N11N485N14
$$ -3536 1620 3515 -1125 -3900 181 3788 401 -3990 -1409 3634 2098 -3250 -2739 2746 3260
2176C260n308j486N009K433m338l207L529L722k632m106J797M399q69m651k46
$$ 3260 -2048 -3534 1475 3908 -430 -3637 -108 3614 982 -3124 -1327 3072 2203 -2448 -2694
2191b694M617J346m326k346L759L066l166l691K404M115j599m325P05M249J09
$$ -2694 1923 3269 -1057 -3403 356 3422 256 -3435 -1031 3084 1485 -2840 -2135 2114 2223
2206B223m055q65L760J656l297k451K601L092j664l405P63L518J00l458q31L325
$$ 2223 -1832 -2697 1063 2719 -578 -3029 -428 2664 1000 -2405 -1642 1876 1976 -1482 -2313 1012
2222A012J568k972k133K489K566j896k890J329L087n80l177k81K981J118k547
$$ 1012 2580 -392 -2525 -36 2530 634 -2256 -927 2160 1580 -1597 -1878 1103 2221 -326
2237c26j760J961K225j442k637Q86K944k45l136m64L109J105k918j714K632K290
$$ -326 -2086 -125 2100 658 -1979 -1093 1851 1606 -1530 -1994 1115 2220 -698 -2412 220 2510
2253B510k158k797J454L121n98l157j92L049R12k884j603K646K351k230l021J623
$$ 2510 352 -2445 -991 2130 1532 -1625 -1817 1232 2144 -740 -2343 303 2654 424 -2597 -974
2269i74L514r11l829J62L940O38l893j492L560K243l032k811K355L239j691l645
$$ -974 2540 1629 -2200 -2038 1902 2540 -1353 -2845 715 2958 -74 -2885 -530 2709 1018 -2627
2285b627R36L977j7m120r77L998J922l653k722L228L443k618m030J863M449r77
$$ -2627 -1691 2286 2269 -1851 -2828 1170 3092 -561 -3283 -55 3388 770 -3260 -1397 3052 2075
2301B075m576J21M585P11m470j597M201K544l669l433K893M056k036m509J106
$$ 2075 -2501 -2380 2205 2916 -1554 -3151 1050 3594 -75 -3508 -615 3441 1405 -3104 -1998
2316a998M797j98m964q17M850J772m552k645M087L366l531m068K784M616j811
$$ -1998 2799 2601 -2363 -3180 1670 3442 -1110 -3755 332 3698 167 -3901 -1117 3499 1688
2331A688m979P54N035L15m897j252M649K221m249l081L659L891k878m459K072
$$ 1688 -3291 -2537 2498 2813 -2084 -3336 1313 3534 -715 -3796 -137 3754 876 -3583 -1511
2346a511M881j144n147J72N212Q78m979j845M484K669l889l369L184L967k378
$$ -1511 3370 2226 -2921 -2749 2463 3341 -1638 -3483 1001 3670 -219 -3588 -404 3563 1185
2361A185m467J380M709l46m765o65M562J579m270k469L758L228l056l776K212
$$ 1185 -3282 -1902 2807 2461 -2304 -2969 1593 3172 -1098 -3567 191 3419 363 -3413 -1201
2376a201M088j358m253N58M287L39m155j225L798K064l208k675K557L196j851
$$ -1201 2887 1529 -2724 -2166 2121 2460 -1695 -2920 878 2942 -266 -2941 -384 2812 961
2391I61l576J091L809k16l805n99L598J301l294j934K884K517k338l028J606L287
$$ 961 -2615 -1524 2285 2069 -1736 -2335 1263 2564 -730 -2664 220 2737 399 -2629 -1023 2264
2407B264p78l403PL302P11l106j458K778K122k209k646J572K988q88l150K26L219
$$ 2264 1486 -1917 -1910 1392 2103 -1003 -2461 317 2439 230 -2416 -844 2144 1256 -1894 -1668 1551
2424A551N44l094j282K762J941k201k410J604K749r54k979K14L073N61k938j337
$$ 1551 2095 -999 -2281 481 2422 221 -2189 -585 2164 1210 -1769 -1555 1518 2079 -859 -2196
2440b196K610J929k179k452J626K897j021l219K32L287N50l167j272K882J931
$$ -2196 414 2343 164 -2288 -662 2235 1214 -2005 -1773 1514 2064 -1103 -2375 507 2438
2455B438k522k533J986L109j294l446M93L618L23l576j086L486J882l144k625
$$ 2438 -84 -2617 -631 2478 1184 -2262 -1769 1849 2172 -1404 -2490 996 2878 -266 -2891
2470b891K632L289j920l705J181L990l60m170m66M119J414l882k299L406K998
$$ -2891 -259 3030 1110 -2595 -1414 2576 2216 -1954 -2420 1699 3113 -769 -3068 338 3336
2485C336k837l603K113M097j339m496L74M586N59m511j483M210K311l843l106
$$ 3336 499 -3104 -991 3106 1767 -2729 -2355 2231 2790 -1721 -3204 1006 3317 -526 -3632
2500c632L240L818k464m337J548M635n97m776k94M770J304m545k247M097L126
$$ -3632 -392 3426 962 -3375 -1827 2808 2211 -2565 -2859 1911 3215 -1330 -3577 520 3646
2515C646l397l783K671M300j790m678Q76M865J68m788j161M522K025m065k829
$$ 3646 249 -3534 -863 3437 1647 -3031 -2155 2710 2878 -1910 -3071 1451 3476 -589 -3418
2530c418L505L530k773m117J881M445r65m572M3M503Q23m342j702L958K497l391
$$ -3418 87 3617 844 -3273 -1392 3053 2088 -2484 -2441 2062 2885 -1457 -3159 799 3296 -95
2546i5l160K672L625j949l962J164M175l07m222n71M031J393l665k075L190K698
$$ -95 -3255 -583 3042 1093 -2869 -1705 2470 2163 -2059 -2630 1401 2794 -871 -2946 244 2942
2562B942k640l213J970L588j141l776L37L760M19l602j125L352J812k897k441
$$ 2942 302 -2911 -941 2647 1506 -2270 -1933 1827 2246 -1356 -2481 871 2683 -214 -2655
2577b655K330K853j623l108R55L243k48l251m54L073J156k702j726K262K147j710
$$ -2655 -325 2528 905 -2203 -1248 1995 1747 -1504 -1958 1115 2271 -431 -2157 105 2252 542
2593E42k490J165K696n17k769j62K659P49k395j284K060J694j662k110J145K347
$$ 542 -1948 -783 1913 1396 -1373 -1535 1124 1873 -522 -1806 254 1948 286 -1824 -679 1668
2609A668n63k446q4K364O23k239j146J981J628j616k053J109K315n40k428J2K452
$$ 1668 1105 -1341 -1425 939 1562 -677 -1823 158 1786 170 -1883 -774 1541 1001 -1427 -1415 1037
2626A037N55k360j093K129J687j723k102J264K403o74k601J57K737M86k687j117
$$ 1037 1592 -768 -1861 268 1955 232 -1870 -606 1797 1123 -1478 -1321 1416 1902 -785 -1902
2642a902K484J716k137k179J703K572j219k911O09L068Q8l113q11K922J405k688
$$ -1902 582 2298 161 -2018 -315 2257 1038 -1873 -1264 1804 1892 -1221 -2032 890 2295 -393
2658c93k020K303K553j823l053J156L354m65l519k47L520R77l416j720L129K395
$$ -393 -2413 -110 2443 620 -2433 -1277 2077 1612 -1907 -2154 1366 2343 -1073 -2793 336 2731
2674B731k604k959K024L376j325l645O06L857K18l814j067L638J887l250k555
$$ 2731 127 -2832 -808 2568 1243 -2402 -1796 2061 2279 -1535 -2602 1036 2923 -327 -2882
2689b882K771L150k156l662J465L975o38m106j74M044R09l860j674L532K370l066
$$ -2882 -111 3039 883 -2779 -1314 2661 2023 -2083 -2257 1787 2696 -1164 -2838 694 3064 -2
2705bl029K378L490j654l802Q41L958p6m020p59L879J537l590k245L141K839k633
$$ -2 -3031 -653 2837 1183 -2619 -1778 2180 2104 -1916 -2675 1204 2741 -849 -3094 47 2886 253
2722B53l324J995L730j252l927M27L949L86l764j120L471J813l032k441K500K956
$$ 253 -3071 -1076 2654 1402 -2525 -2098 1851 2237 -1527 -2647 824 2637 -395 -2836 -336 2620
2738B620j808l334J140L530m21l602k82L544J033l270j680K837K159k277k494
$$ 2620 812 -2522 -1382 2148 1727 -1875 -2157 1387 2420 -850 -2530 307 2466 189 -2305
2753b305J721K746j126k899M72K917K15k796q52K535J393k221j872J782K255j269
$$ -2305 -584 2162 1036 -1863 -1391 1526 1741 -1055 -1907 628 2021 -200 -2072 -290 1965 696
2769F96k518O92K561j83k527k80K393P11k201j166J867J575j420j859R19K014
$$ 696 -1822 -1130 1431 1248 -1279 -1559 834 1545 -656 -1822 45 1620 200 -1659 -740 1274
2785A274l77k067j37K042O62j856j079J590J444j299j635R80J868o04j976J63
$$ 1274 897 -1170 -1307 735 1397 -459 -1538 52 1496 197 -1438 -458 1410 806 -1170 -1007
2801a007J990L46j801p88J528J143j177j427P93J642l41j790j11J777N17j737
$$ -1007 983 1329 -472 -1260 268 1411 234 -1193 -400 1242 901 -889 -1000 777 1294 -443
2817d43r09J618J261j437j661J085J902o04k035R2J985L60j871q13J670J252j412
$$ -443 -1352 266 1527 90 -1571 -486 1416 812 -1223 -1131 854 1214 -657 -1470 200 1452 40
2834D0j648J077J957o51k193K32K387K55k448q00K368J343k104j715J730K032
$$ 40 -1608 -531 1426 775 -1418 -1186 1201 1456 -992 -1792 576 1919 -185 -1900 -170 1862
2850A862j320k272Q99K430l74k544k07K558P63k438j342K233J889j944k361J472
$$ 1862 542 -1730 -831 1599 1225 -1319 -1526 1032 1795 -643 -1985 248 2137 193 -2168 -696
2866f96K724r45k916M26K978M5k980n32K918J125k753j661K378K178j877k584
$$ -696 2028 1083 -1833 -1407 1571 1616 -1364 -1896 1022 2147 -606 -2267 111 2289 412 -2172
2882b172J343K890o95l079J6L148O51l036j232K855J722k597k228K251K688j757
$$ -2172 -829 2061 1366 -1713 -1697 1451 2102 -934 -2166 689 2411 -186 -2414 -163 2525 768
2898G68l065J100L235m40l259k64L113Q69k867j501K499K002k072k431J588K780
$$ 768 -2297 -1197 2038 1598 -1661 -1925 1188 2057 -810 -2311 188 2190 118 -2313 -725 2055
2914B055j074l058M78L234J88l199q05K995J386k621j790K246K176j755k430J231
$$ 2055 981 -2077 -1599 1635 1823 -1376 -2181 814 2200 -421 -2211 35 2211 456 -1974 -743
2930g43K647o28k707O0K720N36k623j136K396J697k027k130J506K389j066k550
$$ -743 1904 1276 -1431 -1371 1349 1885 -738 -1874 522 2219 192 -1938 -432 1957 891 -1659
2946a659N96K565j53k574l59K412Q14k172j282J805J627j390j917Q62K109k94
$$ -1659 -1063 1502 1349 -1225 -1584 828 1642 -530 -1812 -7 1620 230 -1687 -825 1284 990
2962I90k132k11K021O43j828r87J663J335j403j583J057J799o16j813J65J786
$$ 990 -1142 -1353 668 1311 -517 -1504 159 1494 91 -1492 -435 1364 748 -1065 -900 886
2978H86K73j624o62J359J032j004j286O06J412k54j505p7J523M15j507q27J336
$$ 886 1159 -465 -1127 232 1264 260 -1026 -420 992 738 -767 -844 679 1094 -413 -1240 96
2995I6J131j066j369O97J464l16j533p3J465M90j347q28J130J135q65j367O05
$$ 96 1227 161 -1208 -511 953 637 -896 -969 496 986 -361 -1189 -59 1076 211 -1156 -551
3012e51J616k76j783j04J835N54j739r08J538J216j263j486R78J666n92j809J49
$$ -551 1065 789 -994 -1098 737 1291 -448 -1356 182 1398 135 -1351 -373 1293 701 -1108 -959
3029i59J863K42j849o72J742J091j589j543J287J890r30k100N07K193r9k224l04
$$ -959 904 1146 -703 -1375 367 1458 -131 -1674 -387 1503 573 -1527 -1020 1173 1074 -1150 -1454
3046a454K189P59k025j178J807J547j440j864J100K134o30k278R7K378M39k283
$$ -1454 735 1494 -531 -1709 98 1645 205 -1659 -559 1575 945 -1333 -1236 1142 1581 -702
3062g02q86K132J287j919j667J637K018j296k270Q26K395l85k457j33K408N81
$$ -702 -1588 544 1831 -88 -1755 -118 1900 604 -1666 -840 1555 1170 -1287 -1420 988 1569
3078A569k278j086K010J486j684j817J302K068r37k283N31K424m9k421m15K341
$$ 1569 -709 -1795 215 1701 17 -1800 -498 1570 633 -1650 -1119 1305 1256 -1165 -1580 761
3094G61Q69k146j199J920J576j584j825J213K057p55k125L47K180P4k154n16K067
$$ 761 1630 -516 -1715 205 1781 197 -1628 -415 1642 887 -1238 -891 1289 1363 -791 -1307 760
3111G60R40j861j333J543J588j212j828Q68J952n40k043Q7J992K82j884o41J674
$$ 760 1700 -161 -1494 49 1637 425 -1403 -535 1417 877 -1166 -1079 913 1195 -689 -1330 344
3128C44R61j475j248J163J480p96j606M14J655o4j602k31J539N70j382q21J187
$$ 344 1305 -170 -1418 -255 1225 429 -1177 -763 892 828 -774 -1005 534 1104 -278 -1099 88
3145H8J060r01j178O62J261l39j312P7J281K38j147n15R89O83q11q44O02R67l99
$$ 88 1148 247 -931 -269 992 653 -659 -582 699 937 -210 -725 264 947 136 -708 -106 861 462
3164D62j074J08J051J35r99l67Q68N33p60p21N59Q44l34r10P1R01J55q46l54P80
$$ 462 -612 -504 547 682 -317 -684 184 717 -43 -764 -205 639 305 -605 -534 367 522 -324 -678 102
3184A02N58o27p48M50Q85j76r24m1R44K62q88m68P98O99o14q99M18R75j53j056
$$ 102 660 33 -715 -265 620 444 -480 -521 423 685 -203 -671 127 826 212 -687 -269 706 553 -503
3204e03q1J069L11j031o16R09Q56p40j048N04J182k83j308K7J346K74j303o00
$$ -503 -584 485 796 -235 -851 58 914 174 -874 -370 812 529 -779 -752 594 868 -435 -1035
3222a035J209Q60j032j082Q32J299n70j476K91J557M2j547l60J503O57j402r55
$$ -1035 174 1034 2 -1080 -248 1051 481 -995 -704 853 895 -652 -1012 491 1148 -254 -1209
3239a209J239J230r93j455O98J583m06j662P8J692K45j691n86J547R18j376j173
$$ -1209 30 1260 267 -1188 -490 1093 687 -975 -897 795 1040 -651 -1237 310 1228 -148 -1321
3256a321J138J383q91j553N92J694k37j742j02J713M42j615p16J482J026j282
$$ -1321 -183 1200 309 -1244 -652 1042 805 -937 -1039 674 1116 -499 -1215 267 1293 11
3272A1j286J029J493p06j602L99J679j00j673k52J629N96j504q76J281J089j044
$$ 11 -1275 -246 1247 541 -1061 -662 1017 917 -756 -1008 621 1217 -287 -1163 118 1207 163
3289A63j308Q09J431n34j523J81J512J29j459l93J339O30j221q58J028J050p81
$$ 163 -1145 -336 1095 561 -962 -781 731 860 -599 -992 347 977 -244 -1102 -74 976 195
3306A95j185N58J221k95j236O3J265J86j195m18J103O20r24p55P80Q79o01r66
$$ 195 -990 -432 789 494 -742 -679 586 772 -423 -841 262 882 -42 -797 -17 862 261 -705
3324g05M04J042j88j040k0R71J98r09l71Q15N35p06o86M98P59l50p89J81P77j9
$$ -705 -301 741 553 -487 -507 464 662 -247 -618 197 732 26 -660 -162 597 247 -542 -361 416 397
3344C97p81j49P05K89n99m03M85M59l42n04K23N46p0n26p9M76K09l63k81L04L41
$$ 397 -384 -533 172 461 -138 -541 -56 403 61 -443 -220 326 256 -270 -349 127 336 -27 -308 -4 337
3365C37k14l91J04M31M3m09j39L41K19k73l14K11L61r9m13n7M03J72l84k83L37
$$ 337 123 -268 -164 267 310 -99 -238 103 322 49 -265 -54 307 208 -205 -262 141 313 -71 -354 -17
3386a7L57k93m60J94N51p3n97p1N89K03n59l06N11M50m26n67L00O65j39p06K0
$$ -17 340 47 -413 -219 332 259 -338 -409 180 383 -176 -482 29 479 53 -514 -214 451 312 -394 -374
3407c74P40J23p50l05P44M90o68o50N60P54m30q44K76R24j16r77q2R46K80q85
$$ -374 366 489 -261 -566 178 668 0 -650 -90 664 234 -610 -334 590 474 -503 -585 361 641 -244
3427b44m87Q10O67p25q44N50J012l38j100R8J139R5j132k91J095N41j032p32Q95
$$ -244 -731 79 746 21 -823 -273 739 401 -699 -601 538 633 -499 -790 305 846 -186 -918 -23
3446b3R09p00j028M96J151k66j217J6J212K75j149n16J037O97q97q95P75J032
$$ -23 886 186 -842 -346 805 539 -678 -662 550 825 -324 -840 197 894 -3 -898 -123 909
3464I09n90j174L77J221j40j247q1J201K86j122n28R95P01q22q37O26R50m45j020
$$ 909 319 -855 -478 743 603 -644 -725 476 762 -360 -888 107 808 -14 -851 -225 725 280 -740
3483g40K37J117rj149k07J098M46r92n96Q64P55p07q71N52R19l43r22J67R00L1
$$ -740 -503 614 605 -544 -751 347 793 -199 -795 69 824 117 -754 -202 717 374 -548 -381 519 550
3503E50q75k11Q12M06p19n74N31O74l54p34J99P36p9p41m8O85J57o20k70N42L30
$$ 550 -325 -536 276 682 -37 -611 -80 594 240 -494 -295 441 362 -379 -427 258 415 -205 -475 67 397
3524C97m63l79L28M52j95m53L4M12J00l56j39K89K16k46k60K13L13j50l26Q0L29
$$ 397 -66 -445 -117 335 140 -313 -279 133 233 -123 -262 27 243 -3 -263 -50 263 113 -213 -133 196
3545A96ql12n0K74J22j72j79O8J74Mj34p6J28J06j38j62J18K05p2k55QK65L1k53
$$ 196 188 -124 -174 100 222 50 -129 -61 113 117 -17 -93 35 141 3 -159 -41 164 92 -163 -155 110 141 -112
3569a12q4J93J70j53k06M8K32L4k01j15K29J34k29k08K73K85k29l66J74M25j04
$$ -112 -196 -3 167 14 -192 -144 88 122 -79 -194 35 169 -60 -268 5 290 61 -305 -131 294 190
3590A90m37L2M47O3m29j49L71K25k95l13K67L56k16m32J18N32j3n81j26N64K44
$$ 190 -247 -215 232 295 -134 -283 88 313 18 -295 -28 328 112 -320 -202 330 317 -264 -390 174 418
3611D18n55l08N13L76m54m30L54M65k63m87J90N44r6n64k8N60J99n10l15M29L95
$$ 418 -137 -445 68 444 -10 -440 -86 379 116 -371 -181 363 267 -297 -325 235 434 -76 -391 38 433
3632D33l60m62L20N14k52n75J85O10j14o21LO34P8o00k21N34L19m31l97L42M23
$$ 433 73 -389 -69 445 193 -382 -197 413 299 -322 -319 315 393 -207 -428 106 425 -6 -403 -61 362
3653C62k65m61J70N16p2n68n2N74J80n59k54N19L51m67m18L74M57k57m66K00M52
$$ 362 97 -364 -194 322 250 -318 -370 204 384 -175 -429 90 441 -26 -444 -70 387 130 -336 -136 316
3674C16j32m55N8M64N7m37j60L80K46k99l36K63L56j99l94J30M17q7l99K8L84
$$ 316 184 -271 -213 251 308 -129 -289 91 337 38 -298 -35 321 122 -272 -142 275 188 -211 -183 201
3695B01ml97m9L67J32l42j81K46K07j77k18J46K13r4k32M0K50Rk41l8K57Q7k65
$$ 201 197 -200 -249 118 250 -92 -273 -27 180 3 -215 -69 144 50 -182 -142 108 117 -124 -162 95 182 -83
3718h3j11K42J58k12j23J39J34j36j08J32J23j29j26R2J25p1j18N0J11k4j31j
$$ -83 -194 48 206 -6 -129 10 144 8 -100 32 155 26 -100 -8 117 46 -72 -22 89 65 -66 -67
3740f7J06J5q8k9R7J4j26l1J63N5j78o3J46Q9j53q2J71Q9j51j20J44J32j22j36
$$ -67 39 54 -34 -63 34 48 -78 -109 54 109 -69 -132 14 103 -50 -132 39 128 -23 -143 1 133 11 -125
3764a25J11J85r9j91J9K30K7j93q7J90J08j85j29J68J76j60k28J35K40r5k36N4
$$ -125 -14 171 72 -119 -100 130 157 -36 -123 67 175 -10 -139 29 205 45 -183 -48 192 97 -139 -85
3786h5K40j2k55l4K39O5j89j06J62J21j36j35J01K02r2j95L9K01Lk08m3K16P1
$$ -85 155 143 -112 -146 93 158 -31 -137 25 146 10 -125 -24 178 86 -109 -70 131 134 -74 -117 99 170
3809A70k00r9J76J14j62j03J28J28j14j41P6J54m0j57QJ40J1j24l3J18O1j21p9
$$ 170 -30 -129 47 161 -1 -104 24 152 38 -103 -27 127 87 -70 -62 78 89 -35 -68 50 111 -10 -89
3832h9J11P6q1p9Q8N6p4p8O8P6l2p7M7N4n2o3P4O0n4p9N8O2n0o4M2J13m1j37N
$$ -89 22 98 17 -62 26 82 8 -70 -2 74 42 -35 12 66 14 -49 25 85 31 -48 10 72 22 -42 0 113 72 -65 -60
3861f0J31K3j38l2J60K4j69q7J83J20j67j48J38J69j28j80J00K16o0k46J3K48
$$ -60 71 94 -44 -76 84 108 -61 -148 35 155 -12 -160 -22 147 19 -161 -61 155 95 -151 -138 110
3883A10M7k48p9K61J12k53j67K17K39j77k47J33K77j03l01L4L35J7l33q5L09J46
$$ 110 157 -91 -170 91 203 -50 -217 0 239 62 -185 -52 225 122 -179 -145 190 207 -126 -211 98 244
3905B44l08j79K63K30k22l06J78L33j06l54N8L51jl46r8L74J52l33k13K92K58
$$ 244 -64 -243 20 250 28 -278 -100 233 127 -227 -169 182 181 -165 -263 111 263 -70 -283 9 267
3926B67k36l07J92L52j17l80L3L97M8l95r9L56J72l31k57L00L03k13l58J45L64
$$ 267 31 -276 -84 268 151 -229 -196 201 249 -146 -245 111 283 -48 -305 -5 298 85 -273 -128 236
3947B36o5l75j6M01O0l68j47L28K08k75k54K24L06j82l45J11L61k6l57m8L57R2
$$ 236 171 -204 -220 181 241 -127 -274 54 262 -13 -267 -43 263 81 -264 -153 208 182 -175 -223 134 226
3969B26l06j66K83K32k56k63J67L07r3l18N2L20Ml25p1L01J47k50j94K03K22j55
$$ 226 -80 -246 37 269 13 -250 -83 224 131 -187 -135 185 189 -136 -207 94 241 -9 -203 0 222 67
3991F7k59R6K84k0l00n6K84J07k54j42J96J94j63k50J14K69j1k87m7K61R1k12
$$ 67 -192 -96 188 168 -132 -188 96 203 -51 -193 3 197 34 -216 -102 167 156 -131 -178 83 174 -38
4013c8j59K00K02j43k62Q3K86j4k81l8K67J07k76j47K08K39j59l00J35K88m5l13
$$ -38 -197 3 205 62 -200 -117 169 155 -126 -164 103 210 -66 -213 -5 234 75 -225 -90 198 153 -160
4035a60k6L15J14l21j85K73K45k09k89J60L29r5l80J4L96Q2l84j62L35K58l01
$$ -160 -186 129 243 -78 -263 10 255 46 -243 -83 246 151 -229 -215 181 263 -121 -283 52 310 9
4056Il05K33L85j79m12O6M42L3m49j03M16K00l83l08L46L88k67m61J74M88r2m99
$$ 9 -296 -63 322 143 -269 -203 239 272 -177 -280 136 336 -47 -355 -9 379 112 -349 -175 313 221 -278
4078b78j6N15J19n02k31M67L23l78m19L11M73k13n50J21N75K3n82j36N47K50m97
$$ -278 -294 221 340 -162 -393 74 397 19 -400 -89 384 171 -379 -258 317 340 -242 -378 169 419 -78
4099g8l60M48M44l38n37K37N68r6n92k4O05J27n68k72N36L72m49m76L47N35k44
$$ -78 -438 10 454 116 -421 -184 384 288 -304 -328 277 404 -164 -436 100 472 23 -453 -106 429 185
4120A85n85J32O13J2o31j40O03K53n36l54M56M51l57n37K45N75r9o20k2N97J50
$$ 185 -400 -268 345 357 -274 -414 189 442 -94 -448 8 459 102 -435 -190 385 286 -334 -356 241 391
4141C91n72k54N21L87m52m66L20N44k07n83R7O06K0o03j45N35L05m80l96L94M80
$$ 391 -181 -435 86 473 21 -445 -125 419 212 -371 -274 332 352 -251 -396 139 444 -36 -432 -38 442
4162D42l03n44J93N76m5o11r1N82K22n39l15M60M02l62n09K80N46j24n92pN97
$$ 442 139 -405 -212 364 319 -292 -383 199 421 -118 -433 27 429 67 -442 -162 384 260 -332 -339 258
4183B58J22n62k50N08L80m22m84L09N49j82n88Q3N97L9o01j81N68L19m94m34M04
$$ 258 380 -182 -432 76 456 34 -450 -141 408 226 -362 -279 318 357 -244 -425 143 462 -32 -466 -62
4204f2N06k70n95J67O17k2o20j48O20K66n51l90M91M82l98n77K70O52j22o75k4
$$ -62 444 174 -421 -254 363 341 -279 -427 193 459 -92 -482 9 491 93 -484 -214 438 316 -359 -383
4225c83O69J61o29l05N75M40m84n37L44O24k12o79Q0P15N2p25k05O78L60n92n04
$$ -383 286 447 -182 -487 88 528 44 -493 -149 475 263 -416 -336 379 431 -294 -499 179 539 -53 -557
4246e57M92O06l73o75K34P27p7p38r9P30K28o61l74N99M96m90o41L70P24k10p52
$$ -557 -65 541 168 -507 -273 454 377 -361 -460 270 498 -163 -537 62 558 68 -573 -203 521 311 -441
4267d41M8P75R8p52k60O95M10o07n30M74O46l41p17K06P50l5p76j42P63L04o88
$$ -441 -393 382 480 -272 -532 163 573 -34 -564 -90 556 215 -502 -296 454 419 -357 -499 264 568 -120
4288a20m43N68N73m74o49L29P40j92p56J1P66J41p19k95O49M27n45n75M27O78
$$ -120 -563 5 578 104 -545 -216 524 332 -424 -413 353 494 -225 -520 129 556 11 -564 -137 541
4308E41k80p46J32P56L5p49j92P17L39o36m86N24N89l99o68K69P21q8p64o7P32
$$ 541 261 -485 -353 403 438 -311 -503 214 553 -83 -569 -45 544 145 -523 -254 467 379 -385 -452 280
4329B80K26o64l95O10M94m79o21L62P04k08p58M3P67J24p42k68O74M05n71n52
$$ 280 506 -158 -553 57 551 72 -549 -187 517 309 -449 -406 361 485 -257 -525 149 554 -17 -569
4349e69M66O50l09p16J42P41K6p47j89P35L53o68n04N49O21m12p11K66P73j08
$$ -569 -103 547 238 -478 -336 405 431 -316 -505 230 583 -85 -589 -40 581 169 -542 -276 497 389
4369C89p99p7P97K37p25m06O28N63n38o66L98P66k29q23L3Q43J49q09l22P63M69
$$ 389 -410 -487 310 547 -178 -584 44 607 69 -597 -199 567 338 -485 -452 391 540 -269 -591 172 641
4390F41o73o13N37P57l95q31K25Q63l6q79j48Q42L57p89n23O75O60n22p94L87
$$ 641 -32 -645 -108 649 254 -577 -352 511 475 -404 -552 290 647 -142 -665 10 670 148 -646 -259
4410b59Q63k13r19J7R35J80q87l75Q15N32p06o75N56Q05l76r00J99R15K9r24k20
$$ -259 604 391 -528 -511 424 604 -283 -658 157 689 -17 -692 -136 669 293 -607 -408 507 536 -388 -608
4431f08Q96M01q20n74P01P15n33q43L63R03j91r28k0R45K26q97m12P82N84o59
$$ -608 288 689 -131 -705 -4 711 178 -665 -302 601 410 -518 -538 407 633 -264 -676 106 690 31
4451C1p14N01Q35l40q99J38R38O5r19k58Q56M35p69o04O59P39m80q35K93Q87j20
$$ 31 -683 -182 653 313 -586 -448 490 555 -364 -622 234 669 -100 -704 -45 694 214 -621 -328 559 439
4472D39q97p9Q79K76q22m58P20O20n85p37M18Q31k43q83O2Q80J36q34l31P69M88
$$ 439 -458 -537 342 618 -204 -662 58 678 93 -644 -226 605 362 -521 -459 421 557 -277 -608 161 649
4493F49o51o19N04P34l48q12J62Q39K7q23k25P82L93o83n73N81O88m12p88K45
$$ 649 -2 -621 -117 617 269 -543 -381 458 485 -338 -563 219 612 -71 -644 -63 625 213 -575 -330
4513c30Q34o1q50j13Q15L13p63m82O49O28m81p62L37Q07j40q61k9Q56K29q01m27
$$ -330 504 443 -407 -520 295 608 -155 -637 12 640 159 -603 -266 541 401 -460 -489 367 596 -205 -632
4534f32P10N82o03o92M48Q09k90q76P4R10J03q61l12Q18M90p25o47N92P74m15
$$ -632 78 660 57 -635 -187 622 332 -544 -470 440 543 -318 -630 188 678 -47 -694 -102 672 257
4554B57q75K18R33j2r57j66R31L69q74n44P40P25n86q58M10R33k07r93J2J001
$$ 257 -618 -400 533 521 -436 -602 329 698 -176 -720 20 745 159 -699 -289 644 437 -556 -544 457
4574D57J94r52m19Q81N92p48p70O08Q94m01j001J89J047K2j027k49J007M43r06
$$ 457 651 -301 -720 161 753 5 -765 -157 737 336 -665 -476 571 593 -434 -683 324 767 -139
4593a39o42P73P91n93r19L90J031k04j056j2J033K58j014m62R19O43p69q09O08
$$ -139 -781 -8 783 190 -729 -339 692 488 -568 -580 453 711 -303 -765 154 797 28 -781 -173
4612a73R27m17j025K05J072Rj053k38J008M37r16o07P68P85o15r18M14J007j95
$$ -173 754 337 -688 -483 589 598 -455 -693 315 752 -164 -771 -3 782 167 -751 -337 670 475
4631D75j046oJ016K31r76m33Q92O13p42p72N80Q77l84r57J82R90K2r81k36R22
$$ 475 -571 -577 439 670 -306 -739 153 766 24 -748 -168 709 325 -632 -450 540 562 -419 -655 267
4651B67M36q06o15O79P48n04q68L24R39j41r39r0R17K74q38m62P41O17n99p52
$$ 267 703 -103 -718 -39 709 205 -663 -339 600 459 -480 -570 347 621 -217 -679 62 679 80 -672
4671f72M26Q52k34q92M5Q84J55q47l45P85N09o57o58M95P65l12q38J65Q44M6q41
$$ -672 -246 606 372 -520 -475 409 564 -283 -628 157 666 9 -649 -154 611 299 -539 -374 470 516 -325
4692c25k55P92M24o89n80N64O88m00p80K26Q39l2q68j42Q12L36p56m92O29O46
$$ -325 -580 212 636 -53 -633 -69 619 219 -561 -335 504 472 -396 -538 274 610 -146 -638 -9 637
$$ [...]
8191C5
##END NTUPLES=NMR FID
##END=
