##TITLE=1H_DPA0406
 CDCl3, 8 sc, 
 5.6.2019
##JCAMPDX= 6.0         $$ Bruker NMR JCAMP-DX V2.0
##DATA TYPE= NMR FID
##DATA CLASS= NTUPLES
##ORIGIN= UXNMR, Bruker Analytische Messtechnik GmbH
##OWNER= root
$$ XWIN-NMR		Version 3.5
$$ Wed Jun  5 13:54:05 2019 Russian Standard Time (UT+4h)  she@DPX200
##.OBSERVE FREQUENCY= 200.13155
##.OBSERVE NUCLEUS= ^1H
##.DELAY= (6, 6)
##.ACQUISITION MODE= SIMULTANEOUS
##.ACQUISITION SCHEME= undefined
##.AVERAGES= 8
##.DIGITISER RES= 18
##SPECTROMETER/DATA SYSTEM= spect
##.PULSE SEQUENCE= zg30
##.SOLVENT NAME= CDCl3
##.SHIFT REFERENCE= (INTERNAL, CDCl3, 0, 15.7039)
##AUDIT TRAIL= $$ (NUMBER, WHEN, WHO, WHERE, WHAT)
$$ ##TITLE= Audit trail, XWIN-NMR		Version 3.5
$$ ##JCAMPDX= 5.01
$$ ##ORIGIN= Bruker BioSpin GmbH
$$ ##OWNER= she
$$ F:/spectra/data/she/nmr/H-F/1/audita.txt
$$ ##AUDIT TRAIL=  $$ (NUMBER, WHEN, WHO, WHERE, WHAT)
(   1,<2019-06-05 13:51:59.14 +0400>,<she>,<DPX200>,
      <created by zg, POWCHK disabled, PULCHK disabled
       configuration hash MD5:
       00 E9 B6 7A A2 85 ED C7 34 08 36 98 17 FE 4E 26
       data hash MD5: 16K
       06 2B C7 2F 1D 9D 2A C8 E7 41 53 22 3F 76 AF A7>)
$$ ##END=
$$ 
$$ hash MD5
$$ E7 6C F1 DF CC BC B3 3D 30 43 03 BB 5D DB C6 C0
##$RELAX= 
##$RELAX= 
##$RELAX= 
##$RELAX= 
##$RELAX= 
##$RELAX= 
$$ Bruker specific parameters
$$ --------------------------
##$DU= <F:/spectra>
##$EXPNO= 1
##$NAME= <H-F>
##$PROCNO= 1
##$TYPE= <nmr>
##$USER= <she>
##$AMP= (0..31)
100 100 100 100 100 100 100 100 100 100 100 100 100 100 100 100 100 100 
100 100 100 100 100 100 100 100 100 100 100 100 100 100 
##$AQSEQ= 0
##$AQ_mod= 1
##$AUNM= <au_zg>
##$AUTOPOS= <>
##$BF1= 200.13
##$BF2= 200.13
##$BF3= 200.13
##$BF4= 200.13
##$BF5= 200.13
##$BF6= 200.13
##$BF7= 200.13
##$BF8= 200.13
##$BYTORDA= 1
##$CFDGTYP= 0
##$CFRGTYP= 5
##$CHEMSTR= <none>
##$CNST= (0..31)
1 1 145 1 1 1 1 1 1 1 1 1 1 1 1 1 1 1 1 1 1 1 1 1 1 1 1 1 1 1 1 1 
##$CPDPRG= <>
##$CPDPRG1= <>
##$CPDPRG2= <>
##$CPDPRG3= <>
##$CPDPRG4= <mlev>
##$CPDPRG5= <mlev>
##$CPDPRG6= <mlev>
##$CPDPRG7= <mlev>
##$CPDPRG8= <mlev>
##$CPDPRGB= <>
##$CPDPRGT= <>
##$D= (0..31)
0 1.2 0 0 0 0 0 0 0 0 0 0.03 0 0 0 0 0 0 0 0 0 0 0 0 0 0 0 0 0 0 0 0 
##$DATE= 1559728318
##$DBL= (0..7)
120 120 120 120 120 120 120 120 
##$DBP= (0..7)
150 150 150 150 150 150 150 150 
##$DBP07= 0
##$DBPNAM0= <>
##$DBPNAM1= <>
##$DBPNAM2= <>
##$DBPNAM3= <>
##$DBPNAM4= <>
##$DBPNAM5= <>
##$DBPNAM6= <>
##$DBPNAM7= <>
##$DBPOAL= (0..7)
0.5 0.5 0.5 0.5 0.5 0.5 0.5 0.5 
##$DBPOFFS= (0..7)
0 0 0 0 0 0 0 0 
##$DE= 6
##$DECBNUC= <off>
##$DECIM= 24
##$DECNUC= <off>
##$DECSTAT= 4
##$DIGMOD= 1
##$DIGTYP= 9
##$DL= (0..7)
0 120 120 120 120 120 120 120 
##$DP= (0..7)
150 150 150 150 150 150 150 150 
##$DP07= 0
##$DPNAME0= <>
##$DPNAME1= <>
##$DPNAME2= <>
##$DPNAME3= <>
##$DPNAME4= <>
##$DPNAME5= <>
##$DPNAME6= <>
##$DPNAME7= <>
##$DPOAL= (0..7)
0.5 0.5 0.5 0.5 0.5 0.5 0.5 0.5 
##$DPOFFS= (0..7)
0 0 0 0 0 0 0 0 
##$DQDMODE= 0
##$DR= 18
##$DS= 0
##$DSLIST= <SSSSSSSSSSSSSSS>
##$DSPFIRM= 0
$$ [...]
##$SUBNAM2= <"">
##$SUBNAM3= <"">
##$SUBNAM4= <"">
##$SUBNAM5= <"">
##$SUBNAM6= <"">
##$SUBNAM7= <"">
##$SUBNAM8= <"">
##$SUBNAM9= <"">
##$SW= 24.9336996594482
##$SWIBOX= (0..15)
0 0 2 0 0 0 0 0 0 0 0 0 0 0 0 0 
##$SW_h= 4990.01996007984
##$TD= 16384
##$TD0= 1
##$TE= 0
##$TE2= 300
##$TE3= 300
##$TEG= 300
##$TL= (0..7)
0 120 120 120 120 120 120 120 
##$TP= (0..7)
150 150 150 150 150 150 150 150 
##$TP07= 0
##$TPNAME0= <>
##$TPNAME1= <>
##$TPNAME2= <>
##$TPNAME3= <>
##$TPNAME4= <>
##$TPNAME5= <>
##$TPNAME6= <>
##$TPNAME7= <>
##$TPOAL= (0..7)
0.5 0.5 0.5 0.5 0.5 0.5 0.5 0.5 
##$TPOFFS= (0..7)
0 0 0 0 0 0 0 0 
##$TUNHIN= 0
##$TUNHOUT= 0
##$TUNXOUT= 0
##$USERA1= <user>
##$USERA2= <user>
##$USERA3= <user>
##$USERA4= <user>
##$USERA5= <user>
##$V9= 5
##$VALIST= <valist>
##$VCLIST= <CCCCCCCCCCCCCCC>
##$VD= 0
##$VDLIST= <DDDDDDDDDDDDDDD>
##$VPLIST= <PPPPPPPPPPPPPPP>
##$VTLIST= <TTTTTTTTTTTTTTT>
##$WBST= 1024
##$WBSW= 4
##$XGAIN= (0..3)
0 0 0 0 
##$XL= 0
##$YL= 0
##$YMAX_a= 192246
##$YMIN_a= -390907
##$ZGOPTNS= <>
##$ZL1= 120
##$ZL2= 120
##$ZL3= 120
##$ZL4= 120
##$ABSF1= 10
##$ABSF2= 0
##$ABSG= 5
##$ABSL= 3
##$ALPHA= 0
##$AQORDER= 0
##$ASSFAC= 0
##$ASSFACI= 0
##$ASSFACX= 0
##$ASSWID= 0
##$AUNMP= <proc_1d>
##$AZFE= 0.1
##$AZFW= 0.1
##$BCFW= 1
##$BC_mod= 2
##$BYTORDP= 1
##$COROFFS= 0
##$CY= 11.3945322036743
##$DATMOD= 1
##$DC= 2
##$DFILT= <>
##$DTYPP= 0
##$F1P= 18.9103706918063
##$F2P= -1.10871071338519
##$FCOR= 0.5
##$FTSIZE= 0
##$FT_mod= 4
##$GAMMA= 1
##$GB= 0.15
##$INTBC= 1
##$INTSCL= 1
##$ISEN= 128
##$LB= 0.24
##$LEV0= 0
##$LPBIN= 0
##$MAXI= 10000
##$MC2= 0
##$MEAN= 0
##$ME_mod= 0
##$MI= 1.114404
##$NCOEF= 0
##$NC_proc= 0
##$NLEV= 6
##$NOISF1= 3.799351
##$NOISF2= 2.8
##$NSP= 1
##$NTH_PI= 0
##$NZP= 0
##$OFFSET= 15.70392
##$PC= 1
##$PHC0= -8656.172
##$PHC1= 14.80018
##$PH_mod= 1
##$PKNL= yes
##$PPARMOD= 0
##$PSCAL= 0
##$PSIGN= 0
##$REVERSE= no
##$SF= 200.130013532006
##$SI= 16384
##$SIGF1= 3
##$SIGF2= 2
##$SINO= 400
##$SIOLD= 16384
##$SREGLST= <1H.CDCl3>
##$SSB= 0
##$STSI= 0
##$STSR= 0
##$SW_p= 3612.71676300578
##$SYMM= 0
##$S_DEV= 0
##$TDeff= 0
##$TDoff= 0
##$TI= <>
##$TILT= no
##$TM1= 0
##$TM2= 0
##$TOPLEV= 0
##$USERP1= <user>
##$USERP2= <user>
##$USERP3= <user>
##$USERP4= <user>
##$USERP5= <user>
##$WDW= 1
##$XDIM= 8192
##$YMAX_p= 0
##$YMIN_p= 0
$$ End of Bruker specific parameters
$$ ---------------------------------
##NTUPLES= NMR FID
##VAR_NAME=  TIME,          FID/REAL,        FID/IMAG
##SYMBOL=    X,             R,               I
##VAR_TYPE=  INDEPENDENT,   DEPENDENT,       DEPENDENT
##VAR_FORM=  AFFN,          ASDF,            ASDF
##VAR_DIM=   8192,          8192,            8192
##UNITS=     SECONDS,       ARBITRARY UNITS, ARBITRARY UNITS
##FACTOR=    0.0002004,     1,               1
##FIRST=     0,             0,               0
##LAST=      1.6414764,     0,               0
##MIN=       0,             -390907,         0
##MAX=       1.6414764,     192246,          0
$$ Real data points
##PAGE= N=1
##DATA TABLE= (X++(R..R)), XYDATA
0@%%%%%%qJ6k3L1l2M0n6O4p2Q8j12J36j60J89k21K57k97L45l95M52n18N90o70
29c56P58q55R62j079J208j349J504j676J864k068K293k541K813l114L448l822
45b010M239m704N233n840O541p363Q344r535J1017j2931J5511j9187K4900l5109
59b0894N9013k16809k12217J58496o2318n5556J987J09241J2408l7169j4118P6755
71b01181M3561m389j8281M0762M7353K6332o221R904K4650L4496J1809J767N837
84A6399K5702J3399n885l809K2714J2314k0941k0945K2363K3776k7269m4779J1529
97B4568L9923j6441o4006j4066M6375J0130o2168m3348L3446L7739l4675n9587
109a02110o97M1557M714m2720k6731J8895K3618j0367k6271m552J8950J2116j0615
$$ y = [0, 0, 0, 0, 0, 0, 0, -8, 8, -15, 16, -16, 24, -32, 32, -40, 48, -64, 72, -88, 101, -120, 137, -160, 185, -210, 242, -276, 314, -356, 402, -453, 509, -570, 638, -711, 793, -883, 981, -1087, 1206, -1335, 1478, -1636, 1812, -2010, 2229, -2475, 2758, -3082, 3459, -3904, 4440, -5095, 5922, -7009, 8502, -10685, 14215, -20894, 38119, -178690, -390907, -232411, -294729, -350285, -348298, -239057, -226649, -263818, -277936, -201181, -157620, -162009, -180290, -139528, -92175, -65843, -72064, -62160, -37510, -3014, 8795, 10562, 16399, 42101, 55500, 49615, 45806, 68520, 80834, 59893, 38948, 61311, 85087, 57818, 13039, 24568, 64491, 48050, -15956, -30022, 16353, 26483, -35685, -79033, -45587, -7848, -42523, -102110, -102807, -61250, -56536, -99256, -125987, -107092, -83474, -93841, -120112, -124664, -105714, -93598, -104213]
122a04213j4998M508J9278Q691r219p387R428J4473L550j777M686O048L03M014
136f2615J3574O957q753k812J8776J6201j0239j4750J3968K6151j444k3357k062
149c0405K6019J4381j6259j6415J0086J8816m27j4573n474P946O983k635p294
162i251m629J075M588J640o379r021j062P727L664q335j0781J743J1915M310j1693
177b4489j2205O704J8533L118j8124j0441J7806K2148o536k2332J672K6741J1619
190A4214j8339j3851J6439K2527l697j8467l35J8415Q676j0194q398O000P822
203B0812k289n013J028J521m314l042L905J611r114q751N660J0068o754j8871
217a3543l062J7738P942j9673j9847J0679K3598l677k8064q348K4621J7405j8453
$$ y = [-104213, -119211, -114703, -95425, -86734, -95953, -103340, -93912, -79439, -75889, -77666, -72980, -66932, -66629, -62615, -49041, -42084, -50837, -53649, -34873, -18672, -28911, -43661, -29693, -3542, -4986, -28343, -30405, -4386, 9995, -6264, -22679, -12593, 6223, 5796, -8777, -14251, -6305, 678, -1957, -9251, -13880, -12805, -8217, -6577, -12956, -21977, -23039, -15312, -11648, -19983, -30764, -29021, -17106, -12796, -24489, -36694, -29990, -11457, -8339, -26463, -36904, -19098, 3050, -3486, -25818, -24146, 2595, 14214, -4125, -17976, -1537, 20990, 17293, -1174, -1509, 16906, 25582, 15388, 6990, 12990, 20812, 18523, 13510, 14538, 16059, 11745, 8703, 12608, 14219, 5105, -3646, 2014, 12082, 5328, -13543, -16605, 1133, 9075, -10598, -30445, -19766, 3832, 155, -27909, -36257, -11636, 5769, -12684]
230a2684k4714Q808K7975K875k4830j1378K0106J9322r558j9553K840J9639N752
243D600j3112p701R427J0004k789o218J713M496k11m44L712J075n465k214Q386
258E259P266o755j1105M391J5893K336j6722r028J5783J7312r703k2145J659K4806
272A9247Q447k2236j6934J6226K2902q276k5202o82K3215P391j9509j3053J2630
285D166J3860p938j4016K153R991j304q179l1M755k720n619K998O140l729r505
300h978Q85J0647L081j0884q552Q010J3363k410j5940m491J6453J2866j2598j9607
314a8155O783K5418K738k6182j1991K3913K0882j7318k5984R297K7988j417k6625
327a0653n015K3216R386j9330j2666J4372J3319j0363j3328O247J1703m548j0837
$$ y = [-12684, -37398, -28590, -615, 2260, -22570, -33948, -13842, 5480, -4078, -23631, -20791, -1152, 4600, -8512, -16213, -6786, 3218, 429, -5789, -4076, 420, 209, -235, 3477, 4552, -913, -3127, 5259, 12525, 5770, -5335, -944, 14949, 17285, 563, -8465, 7318, 24630, 14927, -7218, -5559, 19247, 27694, 5458, -11476, 4750, 27652, 19376, -5826, -6508, 16707, 24098, 4589, -8464, 4166, 18026, 10088, -3928, -1775, 8216, 6912, -1267, -1298, 3457, 737, -4882, -1884, 4256, 527, -8978, -8093, 2554, 5635, -5249, -13801, -5791, 7572, 5162, -10778, -15269, 1184, 14050, 1452, -18155, -11372, 14046, 16784, -9398, -21389, 2524, 23406, 6088, -19896, -10599, 17389, 15972, -10653, -15668, 7548, 16934, -2396, -15062, -690, 12629, 2266, -11062, -4815, 6888, 2340, -8497]
340h497K786J0106j604j0863j505J0687N835q726j0406M347J4251K250j5214r207
354a5760J4258J6730r912k2053M466K6838M060k7619j2603K5810K1580j9141k6466
367a9812J1135K8533k226k5734m444K1187Q700j5581j0458J0255J0651n476r639
380b909J024O963J548m472l179J416K946m11l458m26M237M05p192k873R087O324
396I030j0294j1501Q825J5634o044j8897J592K0216L189k0182q213J8221J3062
409A4638j3696j6146P484J6716q18j3434l806Q277O221k036m920k477K345N555
423C903J435o528m651O277Q241m230j0202J145J0823K346r169m795N929N002k380
438C146l316K03K73k31K186J273m004l120M464M570m286o176L588O983k468p441
$$ y = [-8497, -5711, 4395, 2791, -8072, -9577, 1110, 6945, -1781, -12187, -7840, 6411, 8661, -6553, -15760, -1502, 15228, 5316, -16737, -12271, 14567, 18627, -8992, -21595, 4215, 25795, 6654, -19812, -8677, 19856, 17630, -8104, -12548, 8639, 17339, 1758, -8700, 1555, 12206, 6730, -2909, -1885, 5078, 6626, 2154, -1025, 391, 3337, 2926, -532, -958, 3279, 3684, -3508, -6381, 2706, 9030, -1264, -12765, -3940, 11694, 5650, -13247, -11655, 8561, 11750, -8432, -16645, 1576, 14638, 942, -15204, -7720, 8996, 8178, -5256, -9062, -785, 5436, 3400, -1520, -3997, -1652, 3903, 5338, -1190, -5841, 436, 8677, 4447, -5755, -4610, 6213, 8559, -610, -5405, 524, 5526, 3146, -170, 33, 306, 75, 2261, 3534, -470, -3590, 874, 5444, 1158, -5018, -1430, 5553, 3085, -4356]
454d356R44O871K10n280O7L940j279l249L538N004m419p156M840J0569k213j1851
470c820k62J3217M773j1798p845J0116J1997n539j3480P27J4105N517j1297j0031
484c620O827J3110j125j3543m434J1556Q701q983j2380M565J3449j094j4496l835
498e302J2558O603j1323r967P465J0690n710j2097K338J1916p56j2807k549J2340
512C399N291j1526r020R426J1947o103j4051K146J5461K761j4839p029J3509J1935
526A3307r421j4795N124J7097R84j6092n531J4333J0428j0117j2828O350J4418
539A3257j460j3967k279J2764O265j0298q561P508J0213m483j1025J553J0909
552A0396J092j0625l702R519N673q500q372O019R857l905j1628J81J1263K609
$$ y = [-4356, -3412, 3459, 3669, -1611, -1544, 2396, 1117, -2132, 1406, 6410, 1991, -5165, -325, 10244, 8031, -3820, -4082, 9135, 13908, 2110, -5735, 4381, 16378, 10839, -2641, -1914, 12191, 17708, 6411, -3620, 3207, 16317, 15192, 1649, -2785, 8771, 17472, 8489, -3891, 674, 14123, 13029, -1467, -5302, 7256, 13859, 2536, -7431, 34, 10724, 5014, -7083, -4745, 7171, 6415, -6392, -8941, 3399, 8690, -2836, -11856, -2430, 9517, 3414, -10637, -8491, 6970, 9731, -5108, -12137, 1372, 13307, 3886, -10909, -5785, 11312, 12296, -3796, -9327, 5006, 15434, 5317, -7511, -1161, 13257, 11797, -2170, -4449, 8315, 14580, 4282, -4279, 3229, 13442, 8959, -2066, -513, 10396, 11488, 863, -2839, 6680, 12353, 3853, -4519, 1500, 11357, 7452, -4176, -3995, 7268, 9877]
566I877j0956o444Q526Q406o496j0811K728J1217M22j1028m214R259O811o721
580E76q391L907R221j015q408n87Q277K770o653l562O115M981m167m772L704N584
596G580k422n572J940O309p73o930r47O575K331o407m799M426N318l516p333J84
612d036O346R90p212m397M608N106l739p306O61O883Q79p012l448N908M861m439
628e347n402L538O426j836n730J880P091K76n943k05P020K362n150j920N867L495
644F422m406l487M630M822k795n065J372M949M73l990j976K215K057j299l101
659H21p54K708J978l217m615J696N581o56o931j655O730K861o798m299O319N201
675D970n834o085M900O916m026p226K964P018k063o581J286N677j223n405P36
$$ y = [9877, -1079, -7523, 1003, 9409, 2913, -7898, -5170, 6047, 6469, -4559, -8773, 486, 7297, 576, -7815, -3908, 5313, 4298, -4110, -4697, 3580, 6350, -303, -3865, 2250, 7231, 3064, -1708, 1996, 7580, 5158, -414, 1526, 7835, 7062, 132, -815, 5760, 8091, 1684, -3115, 1311, 6629, 3113, -4220, -4036, 2310, 3300, -3912, -8309, -3701, 1405, -2334, -9640, -8979, -2096, -1217, -8229, -11677, -5769, -908, -5347, -10749, -7211, -785, -2621, -8351, -6471, 620, 896, -5047, -5252, 1768, 4130, -1020, -2940, 2927, 6422, 2016, -1471, 3159, 7981, 5186, 121, 1493, 6442, 6915, 2925, 949, 3164, 5221, 3922, 821, 67, 2775, 4753, 1536, -3079, -1383, 4198, 3542, -3389, -5044, 1686, 4547, -2251, -6550, -231, 4970, -864, -6949, -2049, 4867, 841, -6385, -3421, 3597, 1534, -5047, -3761, 1916, 693, -4712, -3976]
690c976M440j494m657Q19L821j158m069L65K789j105l036R16K384j014k414N41
706f848J494k60J79J076r79j747K289L901j272l846K111N862o70n611J560P840
722E079P21p623j302Q512L826o678l878O313M603n358m521M977M830m309n780
737e88L101N600k462o145N57N383n1n886k131M529K943l869m949J336N700O37
753C705o286l850N277O421l403q473M85R380K794q969n489P852Q090n915r892
768h273L415J1364j34j1256l250R844N820p706p327N098P794l254q274J203Q331
783C395Q48q184l308O957N308n242o696L381P809j170q234o47Q871L894p977o461
799g456O802R613l488j0641P06J1732L383j0537o325R189R498o069j0916K796
$$ y = [-3976, 464, -1030, -5687, -4868, -1047, -2205, -6274, -5909, -3120, -4225, -7261, -6345, -3961, -4975, -7389, -6848, -5354, -5614, -5435, -4359, -5338, -7085, -4796, -895, -2167, -6013, -3902, 1960, 1290, -4321, -2761, 5079, 5800, -1823, -3125, 5387, 9213, 2535, -1343, 4970, 9573, 4215, -306, 4671, 9501, 5192, -588, 2513, 8113, 5651, -494, 63, 5446, 5395, -491, -2622, 1907, 4850, 981, -3968, -2632, 3068, 3705, -2581, -6431, -1154, 5267, 1864, -6609, -6124, 3256, 6050, -2919, -8408, -556, 7534, 1619, -8273, -4858, 6506, 6372, -4884, -8134, 1710, 7530, -176, -7503, -2405, 5389, 2135, -6139, -4936, 3395, 4243, -3941, -7249, -292, 5016, -226, -6922, -3541, 4268, 3098, -5136, -5783, 3088, 6982, -995, -7456, -654, 8959, 5471, -5170, -4464, 7268, 10651, 114, -6211, 2978, 12476, 6407, -4509, -1713]
813a713J1625Q77j0889m043R112O321o883q130L759Q389j305q272j539O820L011
828G140o134m632M409N464l404o827J222P187O47p439k867O689M649n873o507
843f276M448P957k219r153l70R352L493q205n974O068P798l190q228M29P992K306
859F228o624m182M725N555k305n622K76N021J504l773k111K585K564j573k138
874A30J027J879p88j513J101J670j196k311J240K956m82l641o29L597J940l370
890A610l285K225M079r24m765j124M144K612l118l901J096L808K65l316j730K017
906c07J959q93j987k68R89P52K9o47j145l78J778J761j339l154J73L840J767l688
924g58l442K458M906n26n396j661M909L876l440n628J342O231J186n859l546M427
$$ y = [-1713, 9912, 10789, -100, -4143, 4969, 11290, 4407, -3723, 36, 8425, 7120, -1152, -2691, 4129, 7140, 1006, -3626, 783, 6247, 2843, -3984, -2762, 4425, 5072, -2367, -5234, 1455, 6104, 231, -6276, -1828, 6129, 3910, -5243, -5613, 3739, 7232, -973, -6947, -879, 6919, 3729, -4499, -4070, 3922, 6228, -396, -4578, 147, 5702, 3397, -2225, -1949, 3072, 4576, 803, -1308, 1277, 3841, 2268, 130, 1157, 3036, 2248, 735, 1836, 3506, 2310, -1, 1239, 4195, 3713, 72, -557, 3040, 4980, 1610, -1675, 550, 4629, 3705, -1060, -2184, 1960, 4572, 1454, -2447, -1351, 2457, 2722, -594, -2324, -307, 1652, 759, -1228, -1496, -507, 245, 274, -373, -1518, -1896, -118, 1643, 304, -2850, -2677, 1163, 2930, -758, -4200, -1742, 3164, 2638, -2758, -4419, 490, 4366, 926, -4702, -3360, 2871, 4057, -1802, -5348, -921]
940i21N100k623n747O23N315R49m597j800L514K024k638j917K272J719k263j567
956b557K633J828k819k400L042L643k341m651J133N569J020n159l199L944N221
971D907j669o027r83N933L769m803o016K658P765j98q297k773P498N333n941o869
987e713L415P223j544o939l5N918P51n287j175M547J211m206j576L888J754l728
1003a496k253L485L059l037m006J795M895L91n064k633M022M875j860o172o82
1018d681O525L580n789n775M292P615k157q509k64Q656K621p482m511N768N393
1033E282l839n306K460M764j896m038J616L844j602l900J213M163n53m272m44
1048b508M269J511l828l039K868M526j134n522j535N347M476l908o904J284Q194
$$ y = [-921, 4179, 1556, -4191, -3568, 1747, 2696, -1901, -3701, -187, 1837, -801, -2718, -446, 1273, -990, -2557, 76, 1904, -915, -3315, -273, 3370, 1029, -3622, -2489, 3080, 4100, -1059, -4258, -314, 4907, 3238, -2789, -3772, 2161, 5930, 1127, -4889, -2231, 5534, 5336, -2961, -5734, 1764, 7097, 1156, -5713, -2298, 4925, 3381, -3558, -3593, 2325, 3076, -2211, -3386, 1161, 2372, -1834, -3410, 478, 2232, -1496, -3749, -264, 2795, -242, -4248, -2453, 2442, 2833, -2231, -4864, -842, 4033, 2173, -3999, -4681, 1844, 5424, -365, -6140, -1848, 5767, 3610, -4899, -5163, 3493, 6114, -1368, -5879, -111, 5282, 1443, -3863, -1403, 3361, 1465, -2573, -957, 2887, 1285, -2615, -1402, 2761, 2208, -2064, -2508, 1761, 3272, -556, -3595, -727, 3799, 2665, -2857, -4392, 955, 5431, 1523, -5381, -4097, 4097]
1063D097J723q035m718O970O928n065q376K681Q917q7q476k214P249L510n220
1078a16l985L572L631k627k765K252K462k382k593K497L144j995l676J069M119
1093B607K43m101j786L690L435k347m947K72N649K619n206n389L355P346n91q124
1109c275k403P473M959n863o859L596P685j219p544j222O508K826m755l650K695
1124a048L512j174k691N47J489m45r07J085R08j372j415J478K137q05k831p6L357
1141A749J413k944k860K056M241l06m746j644M268L728k786n077P86N286J309
1156D473m468l109L145L807j325m051k99L143J516j953k132N55J718N02r71j008
1172d57k21N93J098K14j392j410R13K263J47k670j541K329K752j217l571j97L662
$$ y = [4097, 5820, -2215, -6933, 37, 6965, 1900, -6476, -3795, 5122, 5035, -3441, -5655, 1594, 5104, -116, -4101, -529, 3102, 475, -2290, -38, 2424, 42, -2551, -54, 3090, 1095, -2581, -1512, 2607, 2850, -1251, -3037, 653, 4088, 1741, -3206, -2934, 2715, 5334, 128, -5261, -1906, 5440, 4849, -3275, -5678, 1795, 6754, 891, -5968, -2372, 5313, 4094, -3450, -4672, 1836, 4662, -93, -3743, -1048, 2464, 1290, -1401, -854, 635, 190, -717, 368, 1276, -96, -1511, -33, 2104, 1299, -1532, -1608, 1749, 3162, 218, -2642, -586, 3655, 3349, -1397, -3041, 1227, 4955, 2169, -2908, -2122, 3164, 4473, 5, -3104, 41, 3848, 2523, -1528, -1827, 1316, 2832, 879, -1253, -698, 1020, 1522, 551, -457, -678, -85, 1013, 1227, -165, -1575, -662, 1601, 1748, -922, -2463, -134, 2618, 1401, -2170, -2367, 1295]
1189A295J791l095k974J846L737k66l683j081K940K131j845k436P91K037K37j435
1205a0l67N71K47j59L42J86r23p83J292J718j061k606J51L256J228l259k802K482
1223d97M156r05m857j065M707K994l487m562J788N172L57n035k300M013L701k466
1239A714m439P00M297P50l670j893K585K303j692k315Q87J943o57j818P19J632
1255A046j096k040R16K640n22l473m14L854J816l851l342K996M679j479n425n47
1271d242N443K710m370m492K510N695j96n631k078M751M027l139n048J243N250
1286B433Q32m819k257L681L158k312l368J085K998m24k373L02J988n36j948P51
1302h09K171o12k759L73L223L54l399j492L213K676k189l665P57L999J099l416
$$ y = [1295, 3086, -9, -2983, -1137, 2600, 2334, -1349, -2430, 510, 2641, 796, -1640, -849, 1188, 1425, -10, -377, 194, 441, 282, 624, 810, -113, -896, 396, 2114, 1053, -1553, -1402, 1854, 3082, -177, -2979, -497, 3659, 2754, -2103, -3168, 1539, 4533, 1046, -3516, -1728, 3444, 3801, -1234, -3534, 479, 4180, 1714, -2725, -2025, 2272, 3022, -648, -2541, 44, 2347, 655, -1660, -773, 1170, 513, -1305, -586, 1046, -50, -2090, -1174, 1466, 944, -2529, -2943, 911, 2727, -1124, -4466, -1470, 3209, 1730, -3695, -4242, 1201, 3911, -459, -4951, -2441, 3254, 3058, -2573, -4651, 100, 4127, 988, -4060, -2817, 2433, 3265, -1554, -3811, -130, 3028, 716, -2652, -1567, 1431, 1007, -1366, -1064, 924, 388, -1560, -809, 1362, 750, -2009, -1636, 1587, 1941, -1458, -2950, 263, 2939, 750, -2915, -2158, 1841, 2940, -476]
1318d76k934K351M046l89m461j619M024L392l020m464J353M996L27m801j731L921
1334E15K640k757l028J539K529o70k031N07J159p37q98J115R65j596j272J474
1350e46J880j362k326O99K496J94k446j175J764K034n17k448r32K148K190r58
1366F95l006l73L023J696k550k563J805L115p50l262j77L074R43k221j406J451
1382e06J243p10m89N51q7q36M06J455k39j856k71K131R46j898j564J462K102p17
1400A123k154l22K072J178j279j905K53K244P86j719j954R53K295K04k294r87
1416a506J684J402j166j455N33J322j35j201K3O38j06k55L77J44j128l68J449
1433B52J149j618j871R12K522o7k573p43K014J626j487k002O11K257L84k020j309
$$ y = [-476, -3410, -1059, 2987, 2598, -1863, -3482, 542, 3934, 914, -3550, -2197, 2799, 3126, -1675, -3406, 515, 3155, 398, -2630, -1091, 1438, 768, -1263, -756, 403, -334, -1232, -117, 848, -748, -2020, -546, 1334, -28, -2354, -1655, 841, 1035, -1411, -2586, -822, 1212, 695, -1753, -2685, -537, 1653, 695, -2311, -2684, 339, 2035, -515, -3078, -1273, 1842, 1092, -2170, -2347, 727, 1670, -551, -1957, -506, 737, 27, -462, 89, 2, -834, -428, 1027, 788, -1068, -1339, 792, 1738, -160, -1724, -262, 1840, 1123, -1031, -1353, 719, 1897, 618, -1287, -1034, 1210, 1996, 277, -1677, -724, 1571, 1775, -519, -1506, 178, 1580, 414, -1041, -508, 814, 679, -522, -499, 139, 33, -222, 155, 299, -829, -1197, 252, 1401, -217, -2088, -1176, 1346, 1279, -1294, -2037, -23, 1603, 116, -1886, -1275, 982, 1366, -654, -1963]
1450a963J364K001k06k149q34J792J524r58j748K84J734J76j334l89R91L79o58
1467Fj59O09j19q26L12J311l62j722J9K107O75k366j421K074K283j365k842J91
1485a595K956R10k463j741J596K267p04k285l81K177J228j554j872Q07K080J31
1501A557j853p48J375R72q04j011M95Q51l82p75M99P68n54j034P32J213p10j651
1519a060M23J991J49k265j016K086J838j643k540P13K802L52k768j389K309K156
1535B138j552k631N66K692L63k256j194J749J644j026j885M66J683J70j445m86
1551a004J247N50q85o01Q72N37p35p32P09R89n48j334M27J649Kj772n34J671J259
1570A767j527j866J056K216j90k330o29K111J237j520j770Q74J930j62j864m65
$$ y = [-1963, -599, 1402, 1196, -953, -1787, 5, 1529, 571, -1177, -893, 841, 1017, -317, -706, 285, 664, 6, -153, 456, 337, -489, -177, 1134, 772, -950, -931, 1176, 1851, -515, -1936, 138, 2421, 1056, -1786, -1595, 1361, 2271, -192, -1933, -337, 1930, 1226, -1059, -1440, 737, 1965, 411, -1461, -654, 1426, 1557, -296, -1044, 331, 1303, 499, -512, -17, 834, 452, -323, 176, 944, 390, -644, 88, 1301, 591, -1060, -637, 1354, 1503, -762, -1778, 308, 2146, 503, -2037, -1324, 1478, 1830, -938, -2327, -18, 2138, 586, -2045, -1479, 1213, 1576, -680, -1874, -125, 1519, 493, -1392, -926, 757, 927, -518, -1004, 243, 793, -92, -693, 179, 716, -19, -751, -42, 947, 399, -935, -508, 1141, 1143, -629, -1163, 508, 1767, 240, -1626, -570, 1646, 1456, -874, -1503, 608, 1845, 325, -1445, -571, 1359, 1197, -667, -1132]
1586a132J474R98j003j303N13J243j38j173o1R21K46q38k86P18L29q01n40R26
1604I3O50q76r44Q51J171o08j577L16J589K45j622o45J303J149r70j345M34J320
1622E34J22j102m74N71Q27k68p82m9O21M95m70n36J74O23mo21P3M88k5l74J08
1643f9M29j57p29K40J018j72j220m9J324M95j409p92J243J069r69j369O85J374
1661I42j92j275k19J058M68p12n04K12N29pk72k72K08K08k9k53n0L06J35l83j25
1682b27L95J24m54j89P30J55q17m58R78Q99j033j233O71J626m14j690J1J673M00
1701A147j612o97J455R87j066j210O68J236k65j005j74P80L49m20l89J74M44q6
1719C16l14j99L91K76j77n93J15P79o1q38k3R18J20j032l76J101O84j223r33J009
$$ y = [-1132, 342, 1340, 337, -966, -453, 790, 652, -521, -582, 339, 585, -253, -539, 179, 508, -293, -833, 93, 743, -133, -1077, -226, 945, 337, -1240, -924, 665, 910, -712, -1357, -54, 1095, 125, -1220, -786, 534, 656, -446, -920, -349, 478, 210, -572, -621, 0, 495, 25, -511, -337, 286, 282, -339, -266, 222, 197, -177, -69, 360, 203, -526, -286, 732, 560, -660, -709, 615, 1110, -299, -1091, 152, 1221, 252, -1117, -432, 942, 750, -525, -744, 314, 782, 70, -434, -222, 307, 300, 28, -244, -36, 172, 143, -110, -160, 146, 281, -102, -227, 168, 292, -162, -351, 379, 534, -283, -741, 237, 1136, 103, -1130, -459, 1167, 753, -937, -926, 747, 1147, -465, -1162, 293, 1280, 214, -996, -328, 908, 643, -362, -536, 244, 593, 173, -216, -42, 402, 316, 2, -197, 194, 470, 293, -300, -185, 594, 533, -305, -328, 590, 710, -322, -698, 403, 1087, -136, -1069, -60]
1739f0J372q27j524L63J628p7j486l13J321O55j264p56R11R57n86r91J75R11J87
1758E96p33k95N00L41k06m49K0N49J72n67l04N16O97n37o90J76Q61p6r08q5R66
1779E44L30j016m64R38P65p84r82N57J047k93r59l8Q23L12q24m67O46N16n04o87
1799e40K34O98l5n84j92N43K78m35l54K40M97k44m67J3N80R6n83k27M70M61m18
1820C1n09L13O09j93o02J40N77R8n63k64N96L94m34m29J40N70l9n40q8N08J92
1841E07m18l57L30M58k53m96J31M59km77j48M27J42k99l11L17L08k50m89J95M89
1862B63o5n53l5O00R3m72k88L82M14l55m41K12N19Qn51j19N19K83n01l34L68M80
1884D27k53m82Q4M99J20n24k84N13L56l96l62K52M09p5m97k9N31J44n10k31L47
$$ y = [-60, 1312, 485, -1039, -676, 952, 875, -611, -924, 397, 1052, -212, -968, -57, 900, 314, -677, -502, 409, 596, -137, -432, 68, 409, 203, -246, -226, 323, 495, -72, -376, 140, 837, 300, -390, -214, 647, 571, -337, -422, 544, 874, -142, -606, 332, 1097, 313, -669, -112, 935, 642, -317, -355, 468, 780, -44, -511, 135, 651, 147, -540, -306, 392, 357, -227, -419, 124, 402, -33, -387, -147, 350, 106, -361, -348, 232, 328, -255, -482, -12, 449, 31, -478, -165, 444, 251, -351, -211, 366, 464, -99, -363, 233, 627, 193, -236, -96, 474, 435, -105, -193, 315, 507, 89, -268, 62, 520, 267, -229, -98, 361, 359, -118, -266, 161, 303, 4, -307, 10, 318, 68, -421, -226, 263, 198, -355, -390, 210, 303, -169, -457, -75, 339, -16, -457, -245, 274, 282, -269, -388, 131, 414, -87, -421, -53, 427, 174, -308, -224, 275, 395, -129, -413, 100, 456, 60, -302, -50, 359, 284, -213, -242, 289, 433, -77, -308, 39]
1905C9N02l77n15J59N52M0o53j38N68K70m78l93M11M37l02n42P8P00k6o41j18
1926d27N92K24m99l76L66N93l63n33J34M63J32n00j80M19L92l30m07L7M95Q4m59
1947a43k34M89M02l70n44K07O52m6o98r8N90K96o25l94N94M46m31n51K60O34j54
1968B82n75N4M84R4n68j5L35K73m10k67L30J96j26j95q3K85J88j40l41O5L69P4
1990C09m16j01M15L33l88n74M54N49j60o69N7O23J09o43j61N77K57n53k76M04
2010A46L90m09l64K03L49j75k05P1J66j54j94J16J16j17q1kN4jM3j4q1r7J63J35
2034E8k28j70K75J47l04j90L24L43k74m22J45M90n3m33J00L17l2k79R6J83L8l04
2056a73L2K88Rk72J02K88j30l05Q8L56j2l68p8K94K23k97q6Q0N4J4j43N2LN2K3
$$ y = [39, 541, 164, -351, -192, 360, 400, -253, -391, 177, 447, -31, -424, -13, 424, 122, -420, -342, 358, 332, -309, -427, 165, 389, -110, -486, -120, 473, 110, -423, -289, 174, 306, -194, -374, 45, 437, 107, -300, -263, 232, 316, -143, -377, 112, 514, 144, -400, -193, 459, 413, -285, -383, 207, 503, -122, -516, 78, 524, 93, -458, -198, 436, 282, -293, -239, 245, 339, -229, -244, 91, 364, -46, -313, 17, 213, 87, -108, -191, 94, 282, 142, -199, -134, 235, 309, -107, -208, 207, 540, 152, -422, 32, 581, 421, -248, -191, 432, 541, -102, -263, 314, 571, 18, -258, 146, 536, 127, -237, -34, 315, 140, -65, 6, 172, 18, -176, -60, 56, -61, -142, -144, -90, -91, -48, -62, -143, -240, -77, 58, -170, -340, -65, 82, -222, -412, -88, 255, -19, -441, -296, 194, 141, -292, -192, 125, 93, -186, -90, 93, 131, -173, -141, 147, 156, -116, -14, 274, 144, -161, -73, 283, 271, -97, -175, 119, 342, 45, -41, 39, 93, 107, -36, 16, 19, 71, 94]
2081I4j55p4J79J22m2k75j6K31L4k15K1Q5L2j58k5L24n7l74l9M70Q3m01k99M77
2105B2K85k90n17K68N46j64m56k25N10L40l16m97J37N46Pn05k21L59L19j95l86
2126d33K6M52J05m32k51L23K42j29l31P2K53j6j50K5J39n6k31M1M24j2l76q3L98
2149@K03m12k89L79N15j68n76o7O41M21n09n52L00P39j8o61k48N30M72k96n88
2170a84R0O15J70n31l42L13N13j71m75r4L73J02j53j89M8J47q3j07N9r9j27J19
2192fJ51p8l48O3K29J83l31l73K00L80k5m45k06L61L84j48m71p9M30K64l62l90
2214f17P7N68J55m37k85K50M67o3m03j40K70K79n0k73j12K61K07l0k51j80K86
2235b1K54n2m05j14M58J68j97l33O3L61J40k48k99J50L50Q2l00k02J20K49N8j37
$$ y = [94, -61, -135, 44, 166, 124, -151, -167, 64, 98, -117, -96, -11, 21, -137, -162, 162, 105, -269, -308, 162, 245, -156, -455, 22, 307, 17, -500, -232, 314, 150, -306, -531, -21, 319, 3, -494, -357, 189, 196, -309, -530, -171, 148, -47, -433, -407, 45, 150, -282, -533, -210, 32, -97, -428, -356, -103, -119, -269, -244, -105, -161, -392, -351, 73, 61, -315, -398, 0, 203, -209, -498, -119, 396, 228, -348, -415, 226, 647, 138, -414, -114, 625, 607, -54, -302, 228, 700, 404, -184, -94, 521, 691, 160, -182, 131, 644, 473, -2, -96, 277, 379, 226, 37, 85, 232, 149, 42, 101, 2, -125, -6, 145, 67, -281, -218, 11, 194, -137, -510, -310, 70, 45, -400, -606, -245, 139, -9, -480, -559, -129, 135, -227, -617, -540, 28, 183, -254, -539, -289, 178, 115, -288, -428, -158, 121, 71, -202, -314, -53, 154, 124, -127, -307, -21, 233, 181, -224, -338, 120, 288, 91, -242, -179, 182, 322, 74, -225, -75, 275, 357, 57, -145, -25, 224, 282, 145]
2257A45k44J37J76R0j68j68K7K02J29j27l17pM61J46l51m41K07M81J19n42l28
2278c73M45N84k48o55p4O76K27n23m69K08N91r2m78j37L03L15j58l11j17J83J48
2299D5nj70j33k9K21J16j43l57N6L81J24l46l74J59N50R9n61m55M89O55j00p23
2321e01l59Q50N99n50q26K11R47J87q23l92N75O15j99o90m0O45K46l89k52M4K06
2342A04J65k4k36j62J86L62J7l74l30K59M43Pm85l63M05N16j04o95k80O84O24
2363G19m63r27O1J204K70j121o95P55J034l31j100r3R71N36p38o86L48O87K4m83
2383b8l93L45M07r7k21k26J06L17R4j96k22j03J61L29L6n08k79M09M93j57q40
2404e73o5P45O37p48q87L42J159l8j215m80J024Q81o71j060J1J090L99q66o70
$$ y = [145, -99, 38, 214, 304, 136, -32, -5, 197, 326, 199, -118, -125, 336, 482, 131, -310, -103, 378, 497, -45, -373, 72, 656, 408, -247, -321, 355, 582, 59, -410, -202, 389, 297, -181, -318, -15, 300, 142, -169, -286, -103, 45, 40, -130, -263, -292, -71, 45, -98, -455, -399, -18, 106, -240, -614, -455, 95, 194, -367, -822, -333, 322, 222, -501, -860, -10, 589, 39, -787, -576, 371, 558, -265, -657, -82, 533, 334, -356, -396, 249, 495, 106, -146, -102, 104, 269, 245, 9, -153, 33, 395, 412, 38, -292, -33, 410, 417, -68, -431, -26, 490, 386, -309, -589, 95, 719, 256, -671, -610, 594, 864, -257, -952, -197, 837, 506, -594, -687, 284, 820, 82, -604, -256, 431, 455, -28, -421, -76, 331, 234, 13, -213, -107, 210, 304, 108, -114, -217, -56, 273, 309, -199, -478, -69, 424, 267, -573, -638, 107, 744, -4, -891, -549, 610, 572, -643, -1123, -99, 782, 111, -949, -938, 152, 551, -315, -985]
2423i85M38P12L3o22l47M70M44j27m59q4L74L34q6k49j04J21K80O2k01j36P7L33
2445B78K12k64m19Q3O12K32n55n02L69P07Qq43l26P16O60m67p25o2Q00L35n51
2466B98o04J59O18K33n76m90J63O33J89n50m31K03O00N7o39n13M50P19j13p54
2486c48l29N99O33k71q21r3O44N27m69o20N3O71K56n50m00K34M13J56l74l86K08
2507b67L95J61k78l53l2N16L18k68n37n6O30L74m03q50J94Q81L85r37p76N34J186
2528H17p1j356m42J059J070o93j494K26J342N63j264r47O80J306k16j226k50R32
2546C6P20o14p21J27O78K55n38k41J86K89Nk0q3j20m4L18L29k94n63P5P83L01
2568H64p64p46N23J080j36j236n24J134J032p60j486K17J532L57j387r89R40J261
$$ y = [-985, -547, 165, 198, -424, -771, -301, 143, 16, -443, -527, -153, 181, 95, -154, -258, -137, 143, 205, 4, -132, -55, 278, 490, 226, -193, -110, 502, 734, 179, -323, 46, 753, 761, -82, -408, 308, 968, 501, -224, -286, 514, 849, 298, -306, -147, 471, 704, 128, -362, -199, 434, 623, 73, -358, -155, 445, 502, -137, -650, -200, 519, 406, -348, -677, -78, 555, 284, -537, -630, 14, 541, 72, -548, -495, 176, 432, -118, -518, -284, 129, 285, -89, -475, -267, 128, 289, 11, -342, -374, 142, 460, 192, -345, -401, 229, 603, 200, -650, -456, 425, 810, -127, -903, -369, 817, 746, -610, -1052, 7, 1077, 384, -1110, -884, 458, 1021, -243, -1190, -510, 796, 580, -646, -896, 36, 756, 142, -579, -452, 226, 481, -57, -298, -112, 177, 182, 162, 79, -41, -85, 233, 562, 268, -295, -220, 563, 864, 100, -646, -123, 957, 821, -415, -939, 195, 1227, 467, -1019, -802, 730, 1087, -300, -1289, -349, 912]
2586I12l65j467l12J263O71q72j067M36R15J39q81l46M22M56q9l81j66J66J52
2605d14J40j26k08k16K36M99p7n63k32N67N86l75q75O9R61M91q49q29M93J089
2625C67M9j082n18Q57Q49l71r35k2R12M04o79n18L16N45Q4m35k55K20L03R0k09
2646b8l51n8L60M27k56n95j63O18O25n44p59M5P89M04p80p72M10J084j26j081
2666g51m24Q12Q83n95j009LJ026M14p96o24L51P30l9n48k47L96K10m5j21o2j20
2687e56J59L07J3m66k38M17P05l09q43j12R34N82p30r17K51J208K57j106p92P40
2707d96J166l15j286k58J279O98q67j104L37J301O1r61o26O76P20r2p79p2M32
2726a86L56j07l68p9K51K63J0k98k09J46M76J62m30n62K60P46K27p17n77N49Q96
$$ y = [912, 547, -920, -1232, 31, 702, -170, -1237, -801, 114, 253, -628, -974, -552, -96, -185, -566, -732, -566, -414, -274, -400, -608, -824, -588, -89, -166, -729, -961, -394, 192, -183, -1058, -989, -28, 463, -386, -1215, -722, 367, 416, -666, -1184, -327, 522, 151, -784, -806, 106, 510, -169, -687, -371, 174, 258, -177, -432, -212, 91, 181, -28, -379, -437, -77, 350, 94, -501, -664, -46, 579, 35, -724, -679, 110, 514, -266, -1038, -628, 456, 330, -751, -1175, -363, 520, -75, -1084, -1081, -55, 359, -437, -1061, -710, 20, -19, -567, -814, -418, -208, -253, -374, -436, -556, -397, -90, -77, -543, -781, -364, 341, 32, -811, -923, 11, 593, -137, -1054, -803, 405, 662, -444, -1236, -496, 670, 355, -931, -1189, 90, 788, -79, -1183, -846, 455, 516, -445, -1071, -395, 325, 233, -546, -618, -186, 170, 63, -305, -384, -133, 130, 140, -158, -367, -221, 255, 417, -13, -575, -315, 431, 658, -59, -636, -87, 809]
2747H09j66j069k21R01P54p18r55K50J042K08q57o91N70Q99j78p25l47M83N53
2766E42r3o07k77M25N27j08n15l74L98N48n3o19l96N21O63k20r11j54P32O39n09
2787A59j069L6J079L57q97p46O26Q32j90q96k59P92N72n83o21J96P07L1n50j13
2807e37L49K04j51n9J78l2k02O7M49L4n70j56P83M51n85r94M88J207m7j257l87
2828g67J210Q52q92j349M94J416J49j363o92J007J167o27j313P9J172M50j001
2845ho62O82Q77l67r02O8Q60J83p29k46O34K12n20k55N51L48n70n74N02Q17m28
2866D73r28m1J178K33j153p59R96J101o33j466J03J501K81j273q64Q62J212m63
2884C60j329p7J235O12j076q74O09Q41n4q45k02O41L53l54m37J40M16L0k58l8
$$ y = [809, 643, -426, -647, 254, 1008, 290, -665, -415, 627, 835, -22, -713, -143, 756, 578, -147, -494, -11, 542, 449, -158, -435, -10, 517, 409, -106, -480, -82, 466, 413, -206, -602, -81, 582, 362, -549, -703, 29, 668, 159, -910, -874, 205, 562, -335, -1081, -455, 377, 187, -709, -968, -176, 396, -187, -808, -612, 95, 126, -424, -537, -188, 16, -135, -194, -16, -48, -250, -183, 266, 300, -270, -426, 357, 808, 223, -771, -283, 924, 877, -380, -767, 443, 1295, 403, -946, -452, 964, 1113, -250, -942, 65, 1232, 605, -708, -629, 543, 993, -8, -670, 12, 889, 522, -380, -312, 548, 731, 2, -244, 390, 602, 82, -173, 378, 726, 156, -418, 84, 901, 473, -455, -496, 682, 915, -238, -997, -1, 1100, 467, -999, -896, 605, 886, -387, -1251, -389, 823, 360, -969, -1046, 189, 801, -275, -1149, -540, 301, 247, -598, -800, -159, 194, -160, -597, -457, -41, -11, -269, -307]
2904c07J16M0j48J91J13j60k61R8N45lo03k08O65N23n36p14L85Q93N9r82k51Q53
2926C08N41l81p60J21P38K05m86l45K84M84n0k89k18J84K55P5k13j89j2K57J62
2947F71k30l58l6N09J34m25n10L25O22j09p12l63O59O52m56p91J32P43K37q27
2967a33m06N86N39l75n80N1O13J84n03l82M53L46k70m27K52L70j99n10K33L94
2987B36n5n11j7N87K36o81m31P23N58n13p83L30R79l7r63k62Q21O48n95p85L31
3008a84R35O3r50k85P32P04n38q06K24R61m2q49k75Q01M36n35o07M32O55m21n74
3029a23L02N89l3o47n0N78K33n16l35L75O09l46n40J02O72J10o48k64N24M70l70
3050F92n46R9O04O8m72k76L77L44l71l78K17L65j49m17O6K46Ml93o3L26Ol09q0
$$ y = [-307, -191, -151, -299, -108, 5, -155, -416, -318, 227, 224, -379, -587, 78, 601, 65, -649, -264, 629, 688, -294, -545, 308, 849, 468, -292, -171, 567, 772, 286, -59, 225, 709, 659, 370, 152, 336, 591, 666, 453, 264, 252, 509, 671, 441, 83, 47, 556, 690, 265, -245, 80, 702, 593, -119, -482, 177, 829, 373, -418, -286, 457, 694, -133, -539, 47, 586, 211, -369, -318, 295, 479, -24, -406, 47, 393, 123, -304, -52, 318, 119, -391, -158, 236, 181, -330, -347, 240, 476, -205, -636, 87, 645, 132, -651, -321, 658, 621, -342, -604, 217, 865, 270, -515, -184, 751, 814, -136, -421, 311, 1015, 477, -329, -105, 856, 814, -35, -310, 491, 927, 392, -215, 217, 872, 451, -123, 179, 768, 735, 88, 38, 616, 849, 333, -2, 373, 982, 636, 96, 198, 870, 980, 332, 68, 592, 1062, 692, 146, 245, 849, 917, 445, 169, 546, 890, 519, 141, 358, 723, 574, 157, 223, 469, 473, 80, 17, 343, 349, 40, -40]
3073d0L50J26m89j61L11M13k59n36K13N13q0m95j22O26L16m67m93L84O35k42n08
3094eL8O24J32n60j79M28M20m45m03K99N99k37o55K42N78J39p30k14O68M34n41
3115F32o03M00P66j97q46p4R09L25q13n36N28R20l62j020K17R62J50j039m19Q47
3135G47P81p09r98L75J070m1j151l61J048N36r32q05N96R62m16j222j4J199L90
3154A055j202o75Q18Q52n41j009J85J016J07r31m86R03N82n86p86L29R17n8r00
3173d10p0O46M22o30n37N99N33l61o57J90P72O5p51k75P65M31o22o03N21P36k75
3194D89q85lJ046K99r34n34P41P22m07q29M7Q49J88o63m88M74O41k71n97K2M67
3215C74K30l40l31J03K95M8j40k15J02O8Q0k6j75o8J24K43j01j87j91K97K90j97
$$ y = [-40, 310, 436, -53, -214, 97, 510, 251, -285, -72, 441, 361, -134, -256, 370, 686, 219, -274, 110, 745, 503, -5, 33, 657, 789, 229, 50, 478, 898, 453, 50, 349, 948, 711, 56, 298, 876, 1015, 285, 71, 739, 1173, 632, 29, 429, 1195, 998, 152, 78, 987, 1312, 499, -37, 491, 1411, 1049, 29, 246, 1208, 1358, 319, -100, 747, 1528, 819, -179, 196, 1266, 1225, 74, -287, 761, 1297, 365, -440, 156, 1118, 702, -520, -534, 665, 1055, -147, -822, -4, 848, 307, -702, -517, 499, 606, -325, -811, 92, 674, 88, -698, -369, 548, 490, -410, -480, 166, 588, -42, -579, 20, 553, 192, -465, -275, 497, 562, -189, -464, 301, 732, 110, -493, 28, 764, 489, -396, -399, 647, 946, 12, -522, 219, 941, 534, -295, -248, 601, 789, 126, -362, 112, 753, 482, -115, -93, 374, 604, 264, -67, 36, 331, 379, 239, 24, 126, 194, 274, 248, 73, 5, 129, 372, 271, 84, -107, 190, 480, 283]
3237B83n28J84M72O8m28l23K64M27j16n04j1L78J16k83j90J47J55m2k48R9J06
3258B6j22r2J01J03k55k06K85L68l45n65P8O49K81p25n43N62Q79l26j076JJ049
3279A27N62j016q42P66J019k05j144j74J127N08q26p85N43R85j74q88j46Q69L50
3298F56o44l96N11M87l32n04K09N70j20o28J14O94J5o55l10P46N03o46p42L75
3318i7J142k58j071l08J040P06q87j024M65J285r4j326k92R78P55p45j094N26
3336b99Q86J0q37k98O43M03m13m54J56M30o4l16P3J74q3j51J29K94j70l81J56
3357a12M61J31o71k66O25N98m23q17J22J059J86r11n72O91R10l79r12p5J070K34
3377I49p20m69L67N22j0m52k23K74J90j5j48j88o7K74J84j01m48j76M38M67l68
$$ y = [283, -245, -61, 411, 479, 51, -272, -8, 419, 303, -201, -212, 166, 282, -1, -191, -44, 111, 69, -179, -80, 26, -96, -188, -87, 16, -239, -445, -160, 208, -137, -702, -624, 25, 306, -419, -962, -400, 479, 153, -923, -922, 127, 689, -327, -1169, -403, 616, 411, -733, -907, 220, 728, -98, -883, -340, 645, 471, -417, -563, 306, 656, 12, -384, 127, 614, 282, -222, -13, 557, 437, -191, -77, 617, 632, -23, -333, 413, 916, 270, -472, -97, 1045, 787, -284, -592, 448, 1154, 267, -757, -292, 993, 899, -427, -719, 259, 1014, 269, -825, -299, 587, 597, -240, -538, 105, 508, 95, -359, -203, 227, 163, -153, -80, 94, 11, -140, -11, 283, 113, -268, -112, 349, 480, -191, -457, 168, 766, 343, -474, -352, 707, 893, -18, -590, 101, 1011, 632, -280, -355, 715, 949, 229, -240, 127, 649, 639, 187, -36, 238, 428, 413, 265, 77, 10, 284, 468, 367, -81, -257, 181, 648, 280]
3398B80o73k7P91M55p60q57M05J091j3j214m72R56R59o18j309K37J270K58j074
3417c15p50Q01R73m12r17o9Q89K13n46l79K62M94j62k74J11J23j56qK69Q5l43
3438a11k74L81O21k65q94O5R69L91r08q49P23J141j44j390l47J363Q61r86j271
3457i24M60J422K15j426o81J059J103n45j341m0J305L48r15o87N46O55j85o45
3475b76j14M90J39k29k00J44j07j49K25J75k25m67J50N38J92p42m39N97P00k80
3495A22q72j28R65M59o89q72M75R81L3q97n22O80P60j47r18o1O62M94m24o28o
3516e33O21K60l15n45L9M69L55k96n88M4N42M01m25o32N2P23L75n78p29L67Q77
3537D84O6q14m61O20O71j81q32p2P51L95n23m50J89M18Lj90k14k7R6K13J44k56
$$ y = [280, -393, -420, 371, 826, 66, -791, -386, 705, 692, -522, -994, -38, 921, 303, -1006, -769, 501, 759, -315, -1065, -264, 709, 297, -620, -689, 200, 413, -133, -512, -250, 244, 82, -192, -81, 42, -114, -122, 147, 232, -111, -385, -4, 617, 352, -542, -477, 492, 883, -25, -874, -151, 990, 846, -544, -891, 472, 1333, 347, -924, -464, 958, 1173, -253, -934, 125, 1228, 683, -658, -698, 607, 955, 40, -647, -101, 554, 369, -276, -390, 100, 239, 10, -190, -46, -153, -302, -77, 98, -127, -594, -444, 94, 286, -456, -895, -298, 402, 122, -750, -878, 87, 546, -143, -1015, -540, 441, 474, -423, -945, -265, 495, 348, -570, -631, 31, 525, 101, -527, -533, 88, 348, 33, -512, -473, -4, 351, 55, -533, -489, 53, 454, 29, -603, -551, 172, 547, -31, -760, -393, 484, 550, -264, -725, -105, 566, 385, -447, -519, 232, 627, 104, -346, -157, 261, 264, 74, -140, -167, -71, 142, 286, 30]
3559C0m25j0P07J03o11o13M97Q96j94j115l44J040R01p95j231J51J452M53j351
3578d59r87Q98J433m13j557j77J353Q68r97j210N45J332Jj135l86P56P53m64o64
3597e10J23O46j0l17o3J72m2j60J60L22k01n84K23R37k3j075l98J092Q13p80j243
3618i18L04J456L48j512q71J126J403o31j586k87J609Q22j191j217M72J570m4
3635H53j419n58J064R60o37j070J69Q07J97n40l17K89K67j23l4J2q1j83K62M09
3655C27k45n79Q1P14K99o83o53N28Q59o8r76l73Q65R00n38j193J21J169M39r86
3675Hq68O63J028j59r90l47Q38N75l75o95R4M38K07j59l80q9J85L52Q3m22m46
3696d59L57O04k6p13k99N17O85k58q54j45Q86N40o75q65J68J073K76r59o56O26
$$ y = [30, -395, -405, 302, 405, -206, -819, -322, 574, 380, -735, -1079, -39, 862, 67, -1164, -1013, 439, 892, -459, -1446, -548, 885, 472, -1085, -1262, 91, 959, -38, -1248, -703, 629, 630, -505, -891, -135, 618, 154, -510, -387, 259, 249, -68, -131, 41, -1, -161, -1, 321, 120, -464, -241, 696, 673, -402, -800, 292, 1105, 325, -918, -614, 842, 1190, -322, -1193, -67, 1336, 705, -881, -1168, 441, 1263, 72, -1145, -673, 897, 853, -566, -1124, -60, 900, 263, -807, -638, 169, 366, -174, -491, -202, 65, -58, -92, -80, -161, -344, -82, 327, 82, -497, -416, 298, 597, -86, -739, -211, 648, 580, -396, -769, 96, 996, 458, -735, -614, 555, 994, 8, -860, -197, 831, 672, -318, -665, 173, 748, 373, -322, -228, 210, 417, 258, -122, -211, -26, 326, 409, -13, -459, -102, 502, 476, -237, -536, -19, 666, 408, -446, -591, 295, 835, 160, -705, -537, 536, 812, -147, -803, -177]
3716a77Q71j64q49l19Q16M27m06o05J68M55R0k59j08rP7J67J32k14l64J04N38
3737C71J99n11o81L98Q86k1r47m50P91R03n10j148JJ131N50j008r99N98J294n0
3757G97j311n01J082Q18n48j075O5R61L72p51n25L54M74L9m48j80J89K79K3r5
3777A9k42j46K44L69j9n36l03N94N62k53q31j79Q70N78o79r13K99J126R2r97o02
3798i47P34R27k69j052k63R13O92p30p88K00Q09K35o65l61K41N06K4l70l48J65
3818c47K69L62l03n18QO47L80n15p60J86Q57K64r20n15N68Q37r4j050l20R63O36
3839F35n89r54K39R51J74p66n07M97O29k30n67o0L93K04j76k42Q7NP3J52K6k29
3861b55k33J97N35j9p65k00P20N99n12j005K77J203J53j116p38R59J091n01j247
$$ y = [-177, 694, 530, -319, -638, 178, 605, 199, -406, -238, 217, 307, 48, -60, -69, 8, 175, 307, 93, -271, -167, 371, 570, 59, -622, -224, 662, 641, -306, -756, 35, 938, 428, -720, -719, 412, 962, -46, -1045, -447, 847, 797, -514, -1015, 67, 885, 337, -738, -673, 288, 660, -91, -616, -262, 212, 251, -197, -377, -188, 91, 114, 19, -223, -369, -125, 244, 225, -311, -614, -20, 542, 289, -542, -721, 149, 727, 48, -865, -566, 560, 652, -345, -947, -213, 714, 445, -607, -870, 43, 735, 5, -783, -583, 226, 461, -204, -565, -324, 182, 206, -164, -512, -347, -78, 284, -19, -537, -529, 118, 498, -17, -777, -591, 266, 530, -390, -905, -337, 500, 406, -644, -964, -1, 635, 46, -908, -669, 282, 456, -310, -817, -320, 309, 79, -488, -548, -155, 49, -127, -369, -282, -277, -204, -52, -26, -255, -488, -291, 244, 225, -540, -740, -20, 579, 67, -938, -661, 542, 695, -421, -1159, -200, 891, 390, -857]
3880h57p4J296N77j079r51O95J185k27j189k64J061N64p04p65L78P37j35o33p
3899c92M62J16m16p4L71N0l87r3N12J94o01l56N30O95m24r27L2J129M26j151o85
3920i89O86J230m47j358q7J306P48j041j152O86J269j70j275l39J076O94o96q32
3938f91K66Q28Qo49k14M80L63l71k93K65R7j69O8J64K2l08j27M57K14l53m75K62
3960a56P19j4p61k99O84N87l24r11P5R35L12p18p42N02Q61j32q31k82O88N62m39
3981C16n70j3O15K13m20l50J27L42J23l50j78m6L52J97j81m74k9N16K96l77n56
4002d47Q9O48J48n69m26M25N60j39n68k23O11L54l58m83Q0M76J69m05l13K83K73
4023A85N5k70r1P4J13K8Oj47p1L8L27nl74j95L41M58j52p30p3P44M19o55o70L74
$$ y = [-857, -931, 365, 942, -137, -1088, -393, 792, 565, -624, -888, 173, 737, 33, -732, -354, 383, 248, -385, -392, 70, 186, -230, -304, 67, 117, -270, -363, 149, 343, -258, -614, -84, 611, 187, -740, -708, 421, 847, -304, -989, -303, 927, 480, -878, -965, 341, 1089, 48, -1104, -418, 851, 681, -594, -933, 143, 837, 141, -691, -425, 403, 411, -238, -452, 28, 391, 20, -273, -8, 89, -80, -12, 152, 174, -134, -261, 196, 410, 57, -418, -156, 563, 549, -212, -511, 173, 760, 436, -475, -400, 535, 847, 129, -613, -111, 750, 618, -213, -495, 193, 755, 316, -254, -267, 348, 561, 141, -209, -82, 260, 383, 33, -145, -191, 161, 358, 177, -297, -326, 190, 486, 109, -447, -358, 290, 438, -131, -557, -132, 428, 289, -279, -502, 109, 463, 105, -378, -298, 178, 347, -58, -371, -88, 185, 240, -30, -121, -47, 66, 94, 100, -47, -118, -80, 247, 242, -132, -327, 14, 472, 320, -410, -483, 261, 680, 25, -645, -271]
4047b71Q77o3q86l13P90N29m71p62J57Q33J87p17m23N15N46k93o92J01N44J10
4067B98l24l13L37J74k53q6J79J41k62j94L10K25j99m50K09N79j57o13j07O70
4087A64L83o12p03M16Q11qr18k85P71N12n20o90L43O98k9o84k30N47L98l59m42
4108d37J61L68lk50o7K15Mj63L1J54M8l35J01K35J32l31k73L56M00k39n54P9O80
4131C12O2o91k62N40N95l76p52J30P35J60n67m62N02M34k26n37J03M86O9m43j71
4152c59L15K10j97k66K12J62j69j60K81J55k96k82K69M15j52m94o6N88K72o06
4172a68m60M64O96k58q05j3P39M18p12o00M87P44j56p97j14P70L37o12m52L02
4192a90O36j91n92N7M21K07m24k58L09L43k48l61J80L89k21m17J76M25rn71p7
$$ y = [-271, 606, 543, -343, -656, 134, 663, 192, -570, -413, 420, 607, -110, -533, -18, 528, 235, -457, -356, 188, 298, -26, -339, -2, 172, -81, -167, 12, 153, -109, -303, 7, 232, 33, -417, -208, 371, 214, -399, -506, 164, 547, -65, -768, -352, 459, 451, -467, -752, 19, 531, 11, -679, -336, 362, 333, -351, -581, -34, 364, 5, -437, -276, 92, 89, -161, -228, -13, -9, -172, -141, 13, 61, -274, -173, 62, 194, -137, -410, -54, 346, 107, -447, -368, 312, 374, -317, -579, -39, 556, 180, -572, -442, 293, 453, -114, -576, -74, 360, 134, -403, -300, 186, 255, -188, -359, -44, 166, -31, -297, -85, 77, -92, -252, 29, 184, -112, -394, -125, 290, 138, -356, -422, 166, 438, -168, -628, -164, 532, 274, -531, -544, 195, 613, -99, -699, -212, 532, 376, -421, -535, 235, 572, -40, -492, -190, 446, 255, -337, -280, 141, 348, -76, -334, -25, 318, 70, -291, -111, 278, 57, -360, -184, 241, 232, -339, -416]
4213d16N50K53m67m15L60N30j77o22pP08J94n85m91N48M88j70p12O2N93J56m62
4234h2l90M74M30k68m95J25L54J64l44k33L13K12j25k75L9K85o8k87Q9K43J9k39
4256e9j24K45R3j60j96J74K70j73k95J7L61j4k50j46K57R1j7k26J5J62K1j98M2
4279a10N4L4k2%K8mk1oJ3k9L2NN9O0j37j24J95J07p4j87J5J35J11j96p1K14J13
4306A94j25k08O8L04j10l25P4L16K7l19n6J95K18k03k56J69K13Pl18m0L38J91
4328C54l36l40K71L61j86l92O5M03J79n73k42L95M66l72n19K05N74l0o55j54N53
4349B7L24m76m16L73M77k38n07P7N26P9n18j93L80M16l83m60K56M84l1o06j25
4370e34N69M00n08n28M17N45j37n72j3N81K07n18m30N53M35k41n48J27N90Rn46
$$ y = [-416, 134, 387, -80, -495, -135, 395, 218, -404, -411, 297, 491, -94, -585, -37, 451, 281, -431, -369, 224, 380, -82, -472, 2, 432, 164, -331, -206, 148, 312, -32, -265, 48, 260, 135, -140, -101, 184, 116, -171, -82, 161, 180, -59, -183, 62, 155, -5, -201, -27, 243, 70, -225, -208, 153, 139, -111, -257, 0, 91, 74, -152, -137, 25, 46, -152, -110, -56, -22, -44, -44, -16, -20, -41, -47, -34, -63, -31, -26, 33, 93, -44, -168, 27, 134, 60, -127, -112, 23, 134, -62, -133, 81, 194, 69, -139, -71, 233, 123, -202, -128, 188, 215, -104, -160, 35, 253, 50, -206, -37, 176, 183, -135, -175, 163, 354, 18, -322, -51, 310, 124, -268, -203, 200, 379, -194, -436, -41, 425, 53, -466, -261, 313, 283, -372, -526, 27, 351, -125, -541, -168, 309, 71, -436, -359, 167, 246, -272, -465, -85, 331, -52, -512, -256, 228, 197, -409, -534, 35, 435, -73, -601, -184, 361, 224, -348, -361, 220, 427, -91, -521, 32, 467, 226, -322, -195, 395, 404, -142]
4391a42k07N09K75l51m49L32M08j41n45M5M93Q3m23k50M37L22l48n72K87M96m1
4412B18n43k04N37L13m01m94K72N53j33m92j37N26K29l86l63L29L73j21m67L9
4432c52L27J33k55j90L15J92k88j54J55K09j59k68J51K96m4l85R9L21M8k78k08
4453c35L28K28k01l47N8L83R2m00k39M25K79k49l02J7M16R8m40j55L27K52k06
4474B9k68N1J97O6j61p3J81k4j99J49J18p6j60K1J99O3k70j63K57K36k22l19J80
4497a88L90Lm56k19L96L49k16m90J28L92J32m58j69L12K45j23k86l4L39J14k75
4518a14j40J85J36q4m5J9M3k3q8L9J46j19j26J53J79j14k52N7L03N6k64k67K72
4541d8L79q7n29K8M55J75l59k17J17M40j65l12kK83J12j92j63K9K53l4j46kO8
$$ y = [-142, -349, 160, 435, 84, -365, -33, 375, 234, -311, -266, 227, 310, -113, -363, 74, 396, 48, -524, -237, 259, 218, -325, -529, 8, 321, -80, -574, -302, 251, 118, -374, -511, 15, 244, -142, -505, -176, 197, 76, -391, -352, -25, 108, -147, -337, -22, 170, -118, -272, -117, 92, -67, -335, -184, 112, 68, -317, -218, 103, 151, -127, -335, -7, 221, 20, -327, -269, 114, 206, -194, -433, -8, 271, 22, -280, -263, 153, 251, -189, -344, -17, 235, 29, -239, -188, 9, 75, -86, -159, 22, -2, -201, -52, 66, -10, -170, -149, 50, 113, -157, -320, -63, 173, -49, -368, -188, 202, 205, -251, -470, -74, 275, 59, -431, -303, 89, 221, -237, -406, -94, 151, 28, -258, -292, 47, 161, -114, -254, -69, 67, -17, -62, -43, 0, -23, -111, -72, 74, -45, -171, -18, 161, 47, -205, -148, 155, 211, -53, -320, -48, 331, 244, -285, -257, 198, 373, 14, -203, -86, 354, 189, -123, -125, 158, 270, 78, -85, -56, 197, 163, 17, 15, 83]
4564H3l8jL3M8q1j73J80J68j58k80L7L79Ll08k24L33L06k70l63N6L82K16l89l67
4588d28K94L76p4m28o4K75K21j72k61P9K18P6k35l5J51Jj05J36M7n4j74R9K77
4611B20p9l49l5N08O6l57m36L86N77j74o28j05P35L13n98m75K87P08j87o69j26
4632d18N72L82m53n09K03N08P3n63j41L64K86k56l22J81K09p9k43J11K47j64j98
4653b10N5L92j69l41K0M16J94n62l91M74N89k79o70K4O63K99o36n63M70P01j37
4674C39q40n8P58L99o96n10K90Q03j24n79k36M93L52l95l27J38L90r6k37m8J99
4695A5P0j31j00K29Jk60J2K65J38l81k50M06L55k63n67J58N74L8m95l38M37N27
4717D40k15o54L0O14K80m70n38K99N42m0m89j83M00L33k39l68L8L52Q7k50j35
$$ y = [83, 45, 44, 77, 125, 44, -129, 51, 219, 61, -219, -182, 197, 200, -108, -332, 1, 307, 37, -326, -270, 112, 328, -61, -428, -134, 242, 168, -260, -324, -49, 172, 0, -261, -182, 36, 112, -123, -158, -7, -6, -111, 25, 72, 18, -156, -57, 220, 141, -208, -243, 265, 331, -26, -462, -76, 501, 327, -301, -406, 329, 642, 44, -431, -144, 564, 377, -292, -418, 154, 536, 83, -426, -223, 285, 358, -205, -346, 18, 304, 48, -274, -93, 116, 37, -206, -95, 152, -12, -210, -155, 237, 68, -273, -253, 163, 357, -205, -596, -122, 467, 188, -482, -458, 205, 504, -132, -695, -225, 476, 339, -501, -559, 199, 598, -98, -608, -318, 485, 361, -218, -454, 39, 391, -4, -331, -193, 197, 101, -136, -184, 15, 85, -46, -146, 83, 84, -176, -164, 101, 239, -142, -392, 14, 369, 106, -461, -303, 271, 309, -186, -524, -87, 440, 225, -429, -399, 215, 495, 25, -513, -214, 328, 288, -201, -384, 16, 349, 110, -258, -220, 132, 219, -31, -166]
4738a66J21J54Jr1p2k2L7R5N5r9k13M2L10M1k92j64J97L31j31m25l0L99J70k59
4762a1l62J92L59O2l80j88K15K95p2k24o8J57J73J7k28j47Q9K91L1j81j81J18
4784d3L21l6l01k18K80L75j39m22p9L73L08k60m79J35N59j0m17k85K81L81n0n65
4806b91J5L44J96j75k48R3J73L7j77n9PM0J40k3r4r7LK01J73k81k73J88M09J1
4830C12m88j93M59M63l50n26J3O23J96n06m53L69N56q5n63j85M56M08l31m79J41
4851a63M99P0m00k36K09L16r6k40J5J78k2l3r0L6k0k1J26N3k13k15K25L54j18
4874B14l82j56M69L56m03m99J42O15N3o53k92N38N12l23o49J05N89J53m81l48
4894d40L53M09n6m24j31L57K39k42k59J27J35J00j82j1L1m8N1Q6M2j20k22K88
$$ y = [-166, -45, 109, 110, 19, -53, -75, -38, 57, 112, 13, -200, -158, 152, 193, -99, -263, -66, 265, 134, -291, -321, 78, 248, -11, -373, -181, 178, 240, -140, -328, -113, 182, 110, -114, -182, -25, 148, 165, -63, -210, -121, 170, 201, 20, -161, -43, 278, 242, -59, -277, 3, 378, 239, -183, -262, 111, 419, 159, -320, -185, 374, 364, -53, -338, -57, 324, 274, -291, -276, 68, 264, 89, -159, -66, 107, 144, -33, -92, -85, -45, 95, 72, -22, -119, -116, 85, 258, -23, -296, -108, 301, 312, -176, -369, 90, 553, 203, -323, -310, 313, 509, 3, -450, -81, 475, 390, -173, -358, 98, 506, 175, -304, -163, 336, 406, 6, -230, -21, 295, 199, -41, -26, 152, 130, 97, 7, 43, 23, 2, 128, 181, -32, -247, -22, 332, 214, -168, -324, 145, 501, 98, -401, -259, 356, 409, -244, -536, 2, 514, 191, -458, -353, 236, 389, -92, -440, -87, 322, 266, -158, -289, 68, 307, 65, -194, -67, 68, 168, -14, -25, 6, -42, 9, 95, 137, 17, -205, 83]
4916H3K03j46l47K9L82K11m25m19L92N85j22o88o1N44L14m30n55L73M91l5m68
4937h9k50M57L59k89l15l9L53Q8k74q8R8J45j17J6K5j1j34R1J57jk71j01K26L00
4961C36k21m26J38M47Q2m92k08L61L81j77n59L4N83J89m58m25K98N18j00n03j28
4982c30L85L73k90m98J24L50J56l36j16J46K17q5j12m8N1K4M7k7j6j44jK76J5
5005A61k34k11K02L13o5l33j65M55K54l05l97P8N18R0m74k38L17M28j25m14j63
5026c08M17K07j83l62O4L47Q3j03l35M2K94J11j78k38P4K07Q0j95j43O9J91J06
5048B47j79k40R0K55J06l58j71K47L10j32l67p5L16K47j94l07L9K32N2j45k01
5069b28J46J26R3j87q8m3J55J08n5j46j03K09K00j69k87MK85K55k72l97J48L39
$$ y = [83, 286, 140, -207, -178, 204, 415, -10, -429, -37, 548, 426, -262, -323, 221, 535, 105, -450, -77, 414, 379, -89, -339, 118, 477, 188, -127, -166, 187, 275, 1, -87, 11, 156, 39, 55, 80, 69, -65, 26, 183, 182, -89, -190, 36, 336, 115, -311, -173, 274, 356, -136, -344, 17, 398, 221, -338, -304, 279, 468, 10, -415, -117, 401, 301, -202, -330, 55, 428, 138, -360, -236, 114, 270, -66, -182, -36, 181, 96, -16, -64, -13, 11, 58, 31, 15, -129, -130, 146, 161, -73, -284, -82, 231, 166, -167, -332, 123, 377, 72, -325, -247, 271, 361, -113, -351, -34, 394, 269, -145, -308, 109, 316, 133, -229, -165, 182, 265, 162, -173, -131, 163, 274, 96, -142, -68, 139, 219, 24, -119, -50, 141, 247, 68, -172, -82, 173, 279, -79, -250, -3, 307, 175, -192, -267, 49, 296, 102, -205, -166, 66, 118, -27, -228, -82, 44, 137, -50, -138, -181, -26, 82, 27, -119, -222, -13, 187, 18, -269, -265, 20, 275, 3, -394, -246, 93]
5091I3J67m64k25K97M31j16n14r5M68K65l26l94K66L61%l82j20K56K53k01k36
5112b16M6K25J2j44n0Q1L0o1J2J56j5k26jK47N3l13j15L00K63j65m35P4M47J72
5136C77n15l18L76N32k74n82l2O59J48l64m84K48N65r1n01j14M37K66l02l92J67
5157a94L86j23k65J7J64P3j67k4J20K0j54J3K36K4k69j11K57K82l02l41R8M77
5179B17J6m36k09L72M45l47n15J63M82K19n35k83L01M07m6n27j24N26J52k67k68
5200b57P4L01L3l06n7J76J12p3j13J25r0M9J1J10m2k09K3K11J05k80j41K20K88
5223B70j09l66n0M19J89l35l82K72L93n6l77j28L00L58k88l55J17L26Kk30j62
5244a92J64J97r4j68m3J29J57j58m5p0J06K2K8j7r2m1J09J31j57j33K8R9K43k69
$$ y = [93, 260, -204, -429, -132, 299, 183, -331, -426, 42, 307, -19, -413, -147, 214, 214, -168, -288, -32, 221, 20, -216, -170, 55, 67, -77, -127, -46, -16, -77, -65, 91, 76, -150, -151, 96, 149, -164, -279, 21, 284, 119, -316, -242, 205, 377, -138, -456, -80, 452, 178, -404, -436, 223, 371, 7, -477, -229, 336, 245, -256, -370, 67, 333, 31, -361, -194, 192, 69, -196, -179, -15, 58, -109, -133, -13, 7, -147, -134, 102, 126, -143, -254, 3, 285, -17, -358, -260, 217, 233, -203, -412, -40, 405, 58, -457, -294, 188, 407, -128, -411, -110, 297, 251, -276, -400, 126, 278, 11, -257, -183, 118, 151, -155, -212, -36, 76, 3, -110, 15, -75, -26, -15, 95, 53, -156, -133, 78, 183, -97, -238, -18, 270, 161, -205, -255, 164, 353, 18, -364, -92, 301, 245, -132, -260, 40, 398, 110, -245, -128, 198, 200, -30, -192, -28, 169, 75, -93, -136, -7, 150, -8, -53, -123, -17, 5, 33, 16, -76, -117, -8, 123, -34, -167, -139, -40, 203, -66]
5268f6j91J17K37J5k69j86L02K39j40k90J6L58Lj88j17J13J27M1j91r5J56P3%
5291F4q0L1J6N4J8j22o8J37L9M5j13j37N8J99pj18j37J23J52j5k38k5K49P9j83
5316B1j77Q4K14m1j66n1Q2J39n5j13L1N6P4q3p0Ol7M8P9L4j51m0O8J48p4j49N4
5343f9O9J52j79j79J34K21m6k54m2J89J75j50k72J07K78j3j98r8K02J92j79k19
5365a79R5J84k6j37jP4P1k05KK20Nj72j6O5J72j45j49N8K14J1l00n7L26K12l23
5390ak43J55M21j16m59J9M12Q6k49k73J97L58p6l50r7L35K19k86k19J96J78n6
5412A51l07L0K62Nk35J8J64Q9k07q0J24J82j92j41N9J95L1l27m3K99J37l05k14
5435c05K11L57k14l37K4L27J01l10k54L18L38j21m45M8L76K4k67j43K08K39j25
$$ y = [-66, -257, -140, 97, 112, -157, -343, -41, 198, 58, -232, -216, 142, 145, -43, -160, -47, 80, 121, -70, -165, -9, 64, 64, -16, 15, 31, 85, 103, -19, -87, 50, 89, 134, 21, -116, -58, 141, 134, 16, -121, 2, 154, 139, -99, -124, 125, 204, 21, -156, -72, 142, 101, -65, -116, -34, 105, 50, -63, -32, 24, 98, 15, -55, -49, -86, -38, 41, 75, -76, -116, -48, 100, 26, -123, -69, 0, 152, -27, -206, -72, 149, 103, -151, -193, -4, 171, 21, -251, -144, 134, 121, -77, -175, 27, 219, 40, -179, -84, 100, 74, -63, -64, 10, 81, -124, -122, 98, 103, -69, -85, -20, 152, 7, -142, -84, 130, 141, -159, -216, 110, 322, -1, -244, -89, 332, 216, -243, -224, 188, 274, 25, -248, -51, 307, 231, -119, -216, 119, 338, 52, -167, 29, 207, 151, -156, -126, 136, 141, -94, -76, 88, 177, -30, -110, 14, 196, 4, -137, -78, 117, 148, -179, -222, 77, 214, -91, -305, -94, 263, 49, -288, -264, 63, 164, -146, -400, -82, 256, 135, -310, -262, 114, 138, -129, -272, -64, 175, 50]
5456E0l01J24L03j00j95m7J54J99j87j57J07J88l9j91l3K00P4r5j07Q8J57j47
5478D5j65J61J32j29j40K9J61J24l25m7J68J96j08j94P4K09K7k30p4J75R2j03
5500G8j74oK34mk52O3J93pj89LQ7R5j58m2OJ30M9j83K3P8k8M5o7K9L2J3j62Q7
5528b7N3J1j31K1J13n4N0q4J39j35K7p7R9J3k9j35N5J22n4l5l2N4Q2j58M4L4N0
5555A6m4n5Q0R8o0p1k4P4J45j16o5J21l0K2m0o0J60n0p7j2J63j00m1q8J57L4j54
5582a7J5L2J82j32j36J6J96M3j42j84J97L9q8j14J08J25r1j41m0J14J05p5j13
5605a01Q4K04j24j48O3J37l2j58j7J71Q6j92j05O9K35j14j58L3K68m8k40m5J43
5628A1J85j77j25K3K68k9l18k4K90P6j72k29J77L36k03k45K1K75l7j78o0J29J38
$$ y = [50, -251, -127, 176, 76, -119, -166, -12, 187, 0, -157, -50, 138, 99, -92, -125, 75, 149, 54, -53, 35, 192, 45, -120, 41, 173, 44, -96, -67, 94, 218, -107, -154, 14, 210, 102, -92, -18, 191, 218, -12, -86, 89, 181, 78, -96, -102, 132, 128, -124, -61, 132, 125, -64, -61, 26, 121, -37, -79, -73, 57, 106, -77, -54, 24, -4, 41, -26, 3, 35, 48, -114, -27, 26, 37, -94, -73, 40, -14, 36, -48, 91, -44, -17, -94, 5, 18, -11, -146, -91, 31, -23, -58, -90, -36, 46, -112, -68, -34, 16, -28, -83, -3, 95, 35, -36, -60, 14, 159, 43, -22, 99, 69, 91, 51, -9, 151, 101, 24, 12, 175, 75, 34, -54, 103, 137, -17, -2, 30, 212, 80, -56, -40, 156, 199, 57, -127, 70, 109, 21, -93, 15, 140, 49, -92, -132, -18, 87, 12, -101, -17, 187, 63, -85, -22, 115, 83, -75, -92, 79, 165, -27, -132, -63, 172, 58, -100, -67, 201, 153, -87, -132, 11, 196, 19, -106, -83, 185, 156, -162, -186, 104, 180, 8, -221, -44, 292, 89, -156, -135, 140, 103, -75, -135, -6, 132]
5651A32j33j60J20J39n3j70P0J51L8j33j35J60J42q7l24J38K79l3k56q3K95K24
5673C21l11k62J35L58m8l77m0L47J81k55k76J77L41l3l87m2L58Rj61j33P0K33
5695B05j25j58O0J43n0j42J4J27k7n6j01J63N8j72q5O4K01l4l24J09K24Q7k82
5718a01k21K57K51n1l73l5L16J53l50r5J09L03o8k91k8K08J52k06j80J65J08L3
5740E6k11J2J01J06j03j4N1k3m5J9N9J1j28O1L8O8m6j44Q9J44j7j80n4K33J16
5765A99j27k23M5J98N3k37p9J48Q3J8j60n3Q5J22q7j31PN5J01k4j48N4R8O0k3
5790C4r9o4J24K6%p9n2O8K12j53j55R5J27k7q9n9L5K18r6j58L6M2J18p4q9M1O4
5817D6R0k02L3jMl9O6k5o5P8L1L6p4j50Q4J96k9j93j07K15J65j19j89k4K27O6
$$ y = [132, -1, -161, -41, 98, 45, -125, -55, 96, 134, 1, -134, 26, 168, 81, -243, -105, 174, 141, -115, -198, 97, 321, 10, -252, -117, 241, 193, -184, -224, 123, 304, 49, -227, -50, 291, 258, -129, -171, 187, 196, 35, -98, -28, 205, 80, -78, -18, 125, 75, -67, -53, 74, 47, -9, -110, 53, 111, -61, -146, -82, 119, 85, -239, -130, 94, 181, -101, -322, -65, 186, 135, -238, -273, 43, 196, -154, -249, -140, 163, 95, -196, -224, -16, 136, -70, -250, -85, 23, 56, -155, -143, -42, 64, -39, -53, -2, -25, -70, -51, 8, 19, -109, -48, -10, 58, 12, -132, -43, 101, 84, -96, -150, 83, 199, 72, -151, -106, 92, 145, -92, -171, -23, 60, 78, -82, -135, -50, 72, -15, -146, -139, -84, 17, -7, -155, -101, -3, 57, 34, -65, -129, -5, 21, 21, -58, -110, -42, 170, 17, -138, -43, 84, 57, -32, -91, -56, 162, 66, -92, -56, -14, 104, 30, -59, -18, 46, 136, -66, -33, -34, -30, -69, -3, -28, -93, -15, 16, 52, -22, -172, -88, 108, 79, -114, -221, -6, 159, 40, -149, -173, 54, 120]
5843A20j04k80K37J99k8k83p1K46J13j50j91Q3J81L1j95OO2P1Rn5m1L6N7K9j10
5868b8N8q0l3J69jj35q4J01J79p8j92j06L07J99k88k33R0K92Q0l85j21K49K91
5891B51j15m21PL71Q9k58j41J42K81m7l18N6J49M8j20l0N5J2k9O0nl5pp9J54O
5917G6j46q5J76K13j23k53K4L61n7k27k19J63M13j28l93k9L53J72k46l67J11M62
5939B51jl29j99K30L05j72k92N7K60K3j60p7O2J08p6o4kN1kkM5Qp4n6P4J32n4
5966D6k09N2K82P8l29j44J52L42j15l28m2L46J03j93k89J42L16L2l72j32L09K63
5988C10j86k80J8K67N8j75k00J25K27o7j84m7Q3J01rq7j5k7O2R4J9j27j08R6K17
6013A65q9j69p2J16K83j43k41K7K67R8k31j94J82J67l1k10q6K13J98o1l39J8J48
$$ y = [120, 16, -264, -27, 172, 144, -139, -210, 36, 149, -1, -192, -109, 72, 103, -92, -86, -24, 47, 56, 1, -40, -4, 53, 82, -28, 30, -50, -83, 86, 85, -50, -134, -33, 146, 68, -124, -230, 77, 276, -12, -245, -155, 137, 217, -168, -289, -40, 251, 136, -285, -278, 93, 182, -76, -217, -75, 206, 159, -159, -103, 46, 94, -26, -56, -1, 11, -18, 42, 37, 2, -5, -84, 70, 76, -70, -155, 21, 234, 111, -142, -118, 243, 186, -41, -260, -97, 316, 188, -205, -234, 119, 291, 45, -322, -211, 251, 250, -79, -278, -48, 257, 85, -207, -150, 110, 133, -27, -104, -42, 66, -10, -74, -76, -25, -27, -29, 16, 24, -50, -106, -32, 100, 46, -163, -111, 171, 249, -80, -224, -72, 270, 155, -173, -215, 131, 234, 41, -248, -106, 210, 242, -130, -262, 47, 310, 124, -156, -138, 129, 187, 12, -188, -63, 164, 97, -87, -134, -51, 50, 41, -46, -61, -88, -26, 68, 87, -40, -148, -52, 165, 76, -93, -165, -49, 234, 91, -150, -123, 144, 242, 11, -183, -1, 166, 135, -75, -161, 52, 250, 189, -150, -132, 16]
6036A6K10q9j92l6J43J9j1k40J28J60N0k6k10rK20M8j89k20J64K13j6j56j73J72
6060b4J91l3k09j66K46J69j55j29r7K77M3n6j83K2Q2J31k1j51m4J19J76q8k32
6083a32j3J82J12q2k26j3K30K09k14l00K5M64L8l49k39K33L45q4l45q7L20K11
6105B85k55l34J13L69jk51j24R1L05j96j15rJ53N8q1q1L1N6L1J8j4j3q9M3J85
6130A75l9k88j4K51J62k03k42R3L87L1m01j54K30M13j96l15l5K71K28l31l46K34
6152h9L49j4l12j88L03J93j49k40jK16Q5j57j32N8O9J4m8Q4q3K1KO2m8j08j5K58
6178A30J02l07j57J55K71l2k50q0K74J51j61l01N3L41J46l24k28J74L42p1k60
6199c2j61K96J83j74k45J39J70po9j13K4M8O6q0J8o3l6J25j0lk11J36J62Jk43
$$ y = [16, 226, 137, -55, -91, 52, 71, 60, -180, -52, 108, 158, 132, -78, -87, 133, 181, -8, -228, -64, 149, 133, -23, -196, -24, 167, 134, -75, -241, 5, 174, 19, -110, -207, 70, 113, 57, -126, -104, -22, 109, 88, -63, -107, 12, 188, 100, -132, -145, 37, 149, 67, -159, -172, 58, 267, 53, -247, -222, 242, 280, -69, -308, -75, 270, 186, -159, -246, 74, 285, 30, -304, -191, 178, 177, -74, -198, -107, 198, 2, -113, -122, 31, 89, 8, -73, -42, 14, 45, 63, 49, 36, -53, -10, 175, 136, -152, -166, 85, 247, 44, -198, -105, 282, 313, -88, -242, -12, 401, 205, -110, -145, 126, 354, 23, -323, -89, 260, 246, -66, -254, 49, 242, 93, -147, -148, 68, 153, -4, -136, -78, -9, 5, -43, 41, -42, -21, -19, 43, -5, -113, -128, 130, 232, -75, -232, -77, 194, 162, -88, -168, 106, 257, 96, -205, -152, 189, 335, 11, -217, -43, 299, 228, -32, -193, 103, 286, 112, -133, 6, 176, 169, 100, -13, 11, 59, 125, 45, 63, 0, -36, 89, 79, 76, -135, 1, 163, 164, -79]
6224g9q0K13J75j16l27M9L14J57l77p8O0L11L2l74k01L02K99j40k65kK59J23k17
6247C8j61N3J45N9j48p6M1J22Q4j02q7j4O9J16%j55n6Q2J07o4j38j8J80J26j73
6272C0k13J48K67L6l19k78K98K70o0l03r4K78K09j84l24P6K64J11j82k46J70K33
6294A87l4j82j1NK08n4j87K5Q2P8O7k28r0J08J76l3j42j28J21J21l2k23O4J26
6318B4J39j10j72n0J95J14j33j15k0J62R2j06j86R1J17O1j46j30J14J54K5p6j74
6341a30K3J63J52k00j58P6K57M6k91j38K69J59j14k38k9K52R7j62k03J05K31j1
6363A56j40j73J89J38m8k55J14J39Lj08k0M6Oj0q7J8k4l5P1P4Nj97k3J24K06k10
6389d1k85J28K78M1k72k09L17K74k21l75Q2L33J98l38l31K85K68k5k55q6J88K30
$$ y = [-79, -159, 54, 229, 113, -214, -165, 149, 306, -71, -149, -89, 222, 254, -120, -321, -19, 280, 140, -125, -127, 132, 255, 38, -123, -70, 75, 134, -14, -90, -49, 73, 157, 55, -32, -46, 23, 139, 139, -16, -72, 10, 117, 53, -85, -103, 77, 203, 30, -183, -35, 232, 268, -51, -329, -31, 239, 179, -124, -218, 60, 269, 85, -239, -163, 101, 212, 30, -216, -46, 187, 153, -29, -40, -35, 173, 119, -68, -43, 39, 117, 184, -44, -134, -26, 150, 117, -25, -153, -32, 89, 57, -166, -102, 24, 163, 53, -119, -169, 26, 140, 7, -108, -128, 34, 126, 20, -166, -75, 42, 103, -43, -173, -59, 95, 120, 44, -130, -107, 56, 208, 8, -150, -74, 183, 229, -62, -200, 69, 228, 114, -124, -153, 99, 196, 34, -169, -64, 167, 156, 16, -157, 32, 170, 122, -133, -19, 120, 123, 15, -5, 41, 47, 37, -50, -32, -56, -91, -20, 54, 59, -138, -161, -37, 169, -41, -326, -198, 80, 121, -151, -360, -43, 231, 10, -365, -283, 50, 248, -90, -421, -136, 132, 107, -148, -234, -46, 184]
6411A84k22k40R0K74L8j96n7J27J03r0m6R7k7l4n4R8N1j19o6R1J54j2l17O5K11
6436A03J28k85j69K28J92kl42o9K99J98k83k22J82L25r9l24p4L20J67j81k94Q2
6458a20K79J1k18p2J50J73r1j21qP8j0p6M4J5n5jJ05M3j13q6Q6K0N0j56n8J63
6484C2J08k00j26J4K91L1k70j2R4J96p0k38J6J03J47j42j87J41J64L5k24l6J09
6507b4J32k6j59m2L7J07l7mm4J3R2M4j15k5l6K14nr3j04O1J56p0j27j3J28R2j11
6534D1j59P2J43K0q6j78J22J83l4q1q8O2N2n3l8k8K8oQ6m2k2l8N0O9kj24l0J33
6562E2kk8j40P7J39J8k36k4J59J02j33n5m1J66Nn8k17J95P3n9p1q3J50jN5j07
6588f4j3R1k5J8m5k9P4l4K0Nj7J1L8m6L5j43L9O6Q3p1j29J05J76j99l8L1P1R4
$$ y = [184, -38, -278, -188, 86, 124, -72, -129, -2, 101, 11, -35, 62, 35, 1, -53, 45, 96, -23, -89, 2, 156, 144, -173, -108, 103, 231, -54, -223, 5, 197, 195, -147, -216, 83, 281, -2, -224, -42, 283, 184, -140, -214, 106, 273, 92, -202, -120, 159, 170, -48, -120, 30, 203, 112, -9, -17, 61, 51, -25, 19, 34, -21, -22, 83, 126, 13, -73, 13, 33, 83, -73, -131, 32, 140, -60, -186, -172, 119, 150, -120, -132, -38, 158, 88, -150, -134, -31, 116, -26, -213, -72, 92, 127, -97, -133, -24, 108, 82, -77, -119, -82, 25, -12, -16, -60, -47, 45, 89, -26, -51, -87, 127, 122, 29, -75, -14, 142, 72, -55, -68, 60, 152, 41, -118, -46, 97, 117, 31, -147, -25, 158, 124, 43, -45, 17, 69, 16, -22, -50, -22, -28, 58, 16, -6, -44, 6, 75, 73, -51, -81, 52, 50, 22, -118, -41, 98, 116, -120, -144, 15, 117, -16, -71, -112, 54, 59, 1, -216, -21, 52, -7, -78, -161, -11, -12, 43, -64, -77, 14, -11, 7, -38, -67, 7, -27, -7, -2, -19, -8, 30, -16, 19, -124, -85, -19, 64, -7, -136, -31, 145, -54, -92, -61, 10, 104]
6616A04j22j40J62J25o2j50n7J15J7qj6LP8m0Om1M7m6n0J23l5M2j21N1Q0o4q3
6643h2M1P9J25k32q2J21R1m0k39J14O9J11j12j84J80J18J1k11O3J43jo2j63J67
6667B5J05q8j64M5J74pj75j1Q7N9qj58R7Q9q6o0L3J44m6j03n9J74J51j66k62J99
6693a1K39k03j16RJ75J06j40k13Q3K57q8k61m2L12J11k46j01J38J90j62j96M9
6715a10K56j0j97r4K22J04j73j43J09J06jj69j1J62Nj11q5J63J28r6j65R2J58
6738A40m4k00L4P2J56j09j76Q8J72N9k38MJ22P6j01r7N1J27r9o7R3M5L9o6j77
6763i6J26O4p6o9J9J28M4j31r1J79L1j06q9M3J18k2q5q5J08R9j00p5R9Q3q4q7
6789e5j9J44nl7p4N1N2Pl6k7o6J41L1q1qnM1N4j28J23n9rJ2Ol2lM8Po6Q9Rm8j8
$$ y = [104, -18, -158, 4, 129, 67, -83, -140, -25, -8, -16, -32, -29, 49, 9, 15, -26, 21, -25, -75, 48, 13, 55, -66, -15, 65, 1, -82, -41, 38, 163, -69, -151, -30, 61, 21, -218, -104, -35, 76, -36, -220, -40, 78, 89, -122, -59, 84, 83, 21, -142, 25, 130, 42, -122, -77, 97, 90, -85, -96, -9, 50, 42, -116, -19, 70, -16, -76, -43, 101, 55, -48, -107, 67, 218, 52, -210, -11, 228, 25, -91, -82, 93, 199, 59, -154, -71, 186, 98, -163, -205, 107, 218, -28, -129, 9, 199, 37, -159, -110, 146, 136, -61, -155, 67, 171, -2, -145, -36, 70, 69, -100, -111, 51, 56, -55, -140, 23, 151, 55, -110, -18, 140, 96, -104, -70, 2, 158, 49, -127, -39, 133, 192, -46, -42, 80, 156, 55, -42, 9, 136, 37, -30, 63, 108, 147, 81, -96, 30, 94, 18, -51, -32, 96, 140, 9, -82, 97, 128, 22, -67, -24, 94, 72, -13, -98, 10, 109, 9, -66, 33, 116, 32, -55, -74, 70, 65, 28, -46, 5, 57, 64, 28, 1, -65, 76, 107, 26, 18, 13, 54, 108, -20, 103, 44, 35, 47, 53, 21, 18, 66, 73, 7, 96, 105, 57, 39]
6822C9o0J03n6K3k2jR5j14%N0oM6j66O6M1P7j37o1Q6J49j91j8M7J2J29j57o1P6
6850a1J67j27j54K6J89j5o2o2N3P2K6k04R7J32j00p7k4J03P4l5r4O6O7p0j27J00
6876A0J02Qj52l3J18R7r9j97K01P5o5j52j1K42k0j32n1N4J69q1k23L1K06P3j94
6901b4l2L6J39l8j97Q8R4l3p9l7Q6N0pj3k8M1j07j9J05Q3q6p5l4J12L6j29k7J37
6929D2O2r4p5l5K61m6j29j27J28K22j90j25oK18nj07j83Q0J96p8j47J5J88k3o2
6954b0j07N1O0k7m1N2K8p1oR4j2n0j25J70J16j15j58O1K67j25j50j01K21J05p2
6979D5j82J2K42Jj41q6O0J78q9j40K9J45P5j75j07P9J62l1n6r8P9k2n2L0L4M8
7005D0j42K9K2O0j15K0O8N3j10r9Q1J12M7k41j6J89J14j63j56Q5J91R4k66j18
$$ y = [39, -21, 82, 26, 49, 27, 26, 121, 7, 7, 57, 51, 97, -69, -3, 38, 115, -22, -83, 3, 152, -39, -57, -10, 2, 131, -26, -87, -11, 156, 29, -125, -99, 90, 75, 13, -49, 4, 76, 102, -102, -5, 127, 27, -50, -74, 29, 103, 68, -26, 40, 107, 37, -90, 10, 112, 120, -32, -65, 53, 150, 51, -146, 55, 130, 65, -87, -98, 144, 124, -8, -59, -5, 164, 83, -140, -109, 97, 170, -24, -56, -20, 119, 81, -116, -28, 66, 33, -46, -83, 3, 53, 46, 33, 5, 46, -61, -80, 25, 108, 22, -53, -87, 25, 61, -68, -95, 42, 104, 10, -65, -100, 161, 115, -14, -141, -13, 209, 19, -106, -112, 106, 101, -6, -189, -109, 87, 9, -138, -123, 65, 42, -20, -127, -76, -16, -43, -84, -32, -4, -75, -81, 13, 1, -49, -174, -4, 112, -3, -161, -100, 167, 42, -108, -209, 12, 117, 45, -137, -125, 117, 118, -23, -109, -49, 129, 40, -100, -71, 74, 149, -26, -133, -54, 108, 77, 21, -77, 2, -20, -72, -42, -8, 40, -102, -73, -51, 9, -106, -86, -18, 35, -75, -174, -93, 19, 66, -175, -191, -2, 112, -51, -207, -122, 69, 163, -103, -221]
7029b21K24Q0k2k33oK05J9p9n0J0J06lk3j25J13M3k1p6M6k8K9j4Q0j01JN5KK0
7057C1p6m3J56n9J0j50L3J23L0j38J4k7J46J17k17o4O8J02op9j41J46J70j22j06
7082h2q5K28O0j12j75J14J58m4n0j73J19P3R8r0j30N8J90q8r7j34J74J24j32j24
7106a20qJ34N8p8n6m1J80M2j45k7P6l8O4j1o9M5j6K7J5m6q4O2J26J5k01l7J83
7133E0J03r4j91J6K19J97k62k79J08L73p8k61j15K44K18j11l26O8K54M4k09j54
7155a86R6K60p0k24jK32M2j64n4M6J66r5r8M2jL4j09J3J64p6p7KJ27n6j53JK20
7182H1Q7j85k46J90K53Jl02j24K43K63k11l17O7K99J63l16j31J12L56j16k86n2
7204a71K24J25j54k31J09J96l5j46m1J18N4n6k2K2NJ1k6J17j44m5nJ06P6j03q8
$$ y = [-221, 3, 83, 61, -172, -178, 27, 46, -33, -83, -73, 33, 30, 7, -118, -5, 38, 17, -59, -13, -41, -12, -26, 54, -47, -46, 9, 11, 31, -45, -88, 68, 9, 19, -131, -98, 25, 55, -83, -69, -96, 50, 167, -50, -114, -46, 56, 50, -29, -170, -24, 146, 24, -82, -167, 61, 121, 9, -166, -52, 106, 62, 12, -161, -42, 31, 129, 39, -91, -33, 157, 69, -28, -162, 12, 136, 4, -120, -128, 6, 64, -14, -70, -111, 69, 111, -34, -61, 15, -23, 41, 30, -39, 6, -10, 17, 32, -14, -98, -36, 90, 105, -96, -133, 50, 153, 59, -132, -116, 103, 300, 38, -241, -133, 240, 162, -99, -214, 30, 248, 137, -189, -121, 133, 177, -32, -186, -90, 170, 100, -124, -125, 107, 149, -15, -69, -23, 143, 48, -50, -8, -9, 25, -84, -71, 93, 17, -60, -58, 69, 13, -140, -139, 81, 168, -17, -263, -73, 180, 181, -121, -245, -2, 261, 50, -267, -200, 99, 262, -54, -185, -73, 283, 167, -119, -171, 53, 178, 24, -207, -98, 98, 63, -83, -124, -6, 48, -8, -30, -8, -3, 8, -18, 99, -45, -90, -95, 11, 87, -16, -104]
7229a04J12K00m0l04M2J40J27j67j85Q4K68Rk49j23J83J67n9k03qJ49J00j20j54
7252a35L1J88l7k4n7o1J83n7p2K9k9oQ4L3j98m4J89J07p3j66R7N7M7r4r7oJ92
7279H1Oj27p2O9J44p6j19j6J62P9j47j05J7R2Q3o8j23R6M0J62j24j15l9J01J05
7304A06j41Lm5J21J29q3k39Q3K29p7r8j43J42K04j2k51o9K44J11j08j60m3J95
7327I8R9j50j73J18Q4O5j00j44Q7J24J3j77j40J40J31J9j00p5M3J47K1o1j16L9
7351hJ59n4j29n2mK61j10k07RJ71J00q5j11o5K04N1j11j21J6J98qq3j11K1J97
7376A28j6j15r0P7J31rj28m0O1R9M9j37j54J24J62p7r5j38J60J79j11j76o6K20
7400C8J49j56j91M2K24L2j48j48J23K18m4k56LJ59P1p5j35J3J09P9r0Mm5MQ8M
$$ y = [-104, 8, 208, 168, -136, -94, 46, 173, 6, -179, -95, 173, 182, -67, -190, -7, 160, 101, -102, -110, 39, 139, 19, -135, -104, 84, 47, 23, -34, -95, 88, 31, -41, -12, -41, -47, 37, 70, -128, -172, 17, 124, 51, -115, -18, 39, 86, -8, -105, -111, 81, 87, -40, -112, -43, 101, 25, -94, -110, 52, 131, -16, -121, -104, -12, 71, 3, -120, -24, 16, 178, 54, -61, -100, 1, 106, -35, -32, -77, 44, 173, 90, -149, -66, 163, 86, -12, -155, -13, 191, 179, -72, -141, 103, 214, 106, -54, -97, 98, 197, 47, -126, -8, 76, 141, 41, -103, -16, 108, 121, -56, -196, -56, 75, 94, -6, -81, -38, 109, 130, 69, -47, -8, 151, 97, -32, -84, -88, 173, 63, -144, -135, 36, 136, 51, -60, -125, 79, 130, 19, -102, -86, 112, 104, 21, -90, -69, 128, 112, -3, -93, -16, 115, 106, -22, -62, -1, 98, 147, 10, -144, -20, 142, 65, -30, -168, -8, 171, 60, -116, -182, 38, 187, 31, -160, -118, 106, 138, -10, -158, -35, 183, 139, -117, -114, 45, 116, 41, -94, -81, 28, 107, 17, 21, -24, -20, 68, 72]
7426G2j5j01jP9M4o6j07MK55K3k17j22J68J99j18k35n7K79J43k33k16J85K02J7
7450A82k24j72K05K71j86k53o1L61J5j66j12N1J61L5j40k4N6N4m9l2N8n1L7l5
7474a9R2%j46m1J29J02o6k21J55J77p8j77k6J75K19k31k29J19K91M2k72k25K30
7497@K81j88k62o8L65J74k66k28J07K09J7j92j34J91J08n9j25l2J81k8nj15O5
7520dj2M9K7k0o0j06J43R0m8j44L1J54N2j65j15J12J59k4j67k0R7J34l1k03j4
7545h5K01N8p5k37N3K17M1j78j30J50P6L3j88n1J27Q7l1j25j8O0J82p1k14k6J78
7570C4J19j27j05k1J55l9q6q5O2J73l8j04k8M3Q7o1J0n6R3M1k5k0m5J7J2L8o6
7597b2p5O4P7O9k6k24O7J00O4j19r9R6J24M6k74O9J75O7j54k39J20K08L0j66j30
$$ y = [72, 57, -44, -45, 34, 78, 12, -95, -91, 164, 187, -30, -152, 16, 215, 97, -138, -195, 84, 227, -6, -222, -37, 165, 182, -42, -214, -9, 262, 76, -177, -238, 123, 138, -28, -140, -89, 72, 107, -33, -57, -1, 53, 4, -28, 30, -21, 16, -19, 73, 73, -73, -114, 15, 117, 51, -170, -15, 162, 84, -93, -119, 56, 275, 44, -185, -66, 225, 267, -5, -230, 0, 281, 93, -169, -237, 128, 302, 36, -192, -85, 124, 141, -51, -185, 6, 114, 55, -70, -102, 79, 51, 46, -69, -4, -16, 33, 60, 40, -20, -126, 17, 107, 59, -85, -54, 100, 152, -13, -128, -16, 143, 119, -48, -68, 29, 163, 132, -71, -85, 116, 174, 99, -138, -85, 132, 173, -5, -135, 15, 91, 124, -64, -115, 12, 99, 68, -57, -75, -15, 167, 96, -118, -144, 34, 153, 26, -79, -100, 55, 16, -70, -155, -93, 80, 42, -62, -90, -47, 40, -21, -11, -67, 26, 67, 42, 22, -23, -6, 6, 44, -22, -97, -33, 44, 113, 87, -137, -70, 30, 94, -25, -124, -28, 96, 142, -132, -63, 112, 179, 25, -214, -94, 114, 144, -22, -152]
7622a52M1K61l6k00n3J00J43j49j25O3J48mo0n8R9L9m7m6k1j1N2oJ8l6q3P0J37
7649H4M9j25j16Q5K07q2k16J5J59J30j32k19J04J91j4j60q1J19J90n1j82n4J35
7672C6R1j47rJ2J9Q1j8j02L3P9p8q5P6k1L8L0J8p5o6K6J34Pj97M8O8Q4o6j39P
7701a16K42N0k62q1J48Q0q5po2J35R5j04j40NK07k8p3q7RJ02o7k6K1K8N9l5j3
7728eJ2q2M6M0M3q7n5J19J12j23j28K4J67J3j96q0P6K08l9j60p4J94R4n6k36P5
7754i8K51L1j76j36J43J38j50p9jJ31Mj20m2R4R2p6NpOJ5l9M1J4m2K8q7R9n0j6
7783b7n9J41M0j39j11J61M1mq3j29J62J33j26j60j7K27O6j82p6N3J90j12j30J5
7807a26K2K65j19k17P1J14O4j70K8P4k4ol5O7n0J0N8n6k4O0j2JOql9M2M2o5m3
$$ y = [-152, -111, 150, 114, -86, -139, -39, 104, -45, -170, -107, 41, 37, -23, -81, 18, 57, 10, -36, -57, -68, -16, -22, -4, -40, -123, -53, 84, 133, 8, -108, -23, 184, 102, -114, -99, 60, 190, 58, -161, -57, 134, 120, -40, -121, -2, 188, 137, -45, -99, 36, 127, -20, -29, -17, 2, 83, 65, -37, -4, 75, -3, -88, -12, -33, 5, 35, 53, -22, -88, -62, 72, 79, -118, -70, -2, 82, 16, -123, -116, 126, 176, -86, -167, -19, 61, -24, -31, -93, 42, 137, 33, -107, -102, 105, 77, 4, -83, -74, 28, -39, -65, -44, -16, 43, 8, -5, 7, -75, -29, 11, 54, -33, -88, 31, 143, 20, -108, -84, 83, 96, -100, -180, -104, 104, 65, -95, -169, 25, 119, 63, -173, -98, 153, 184, 8, -128, 15, 153, 3, -76, -77, 54, 58, -62, -104, -10, 82, 6, 11, 4, 10, 25, -14, 27, 41, -1, 27, -60, 39, -11, -27, -86, 55, 95, -44, -155, 6, 47, 43, -40, -169, -7, 126, 0, -160, -177, 50, 116, -66, -142, -89, 101, -11, -141, -126, -104, 161, 42, -175, -104, 10, 74, -96, -68, 6, -18, -24, -59, 8, -42, -32, 26, -30, -54, 6, -6, -5, 1, -7, -46, -4, 38, -27, -70]
7836g0k1N4O5K2q5RN6p1O1n1j3J14m6j02j9QQ2J07j36p7P5L8k7j8q5J35O3q0p9
7865i1M4J16l8q3r2J29L1N0j71L2J66L6j21j16O8J09l5r8L0J20n9q1jQ0J1o4Q
7892b0QN8M1j84R6R6q0k7m8Q4O1m7j36P1J38n2j10r4J49J70j63j81P5K19M2j80
7918a4j13J03J44r5j44M1K04r3j08MP3J74j87j09P4J22Lj83l0J92n3l4j28J44
7942a3P0j02q4K2J05N0j32N5M4L2p8j28J17J05m2j16j9J71l9l7j12J44J01m4k04
7967a34J41R5j1j14j7J10k6k5r9N6J27o9p4k9P3J04o2j49Q2O6N1j53Q3L5J5q4
7993hn7M5L9p1M9j0N0k3o2k5N9O1p6K2n8Q3o6l2qJ51k5p7m0J28n1j14K6R7k9J6
8023fk7QN0k8q5K6L0K1j9q4R2J12o6m4K1L2l3L5k3J4J9k2p3K8J05m5p5K8L7Kj18
$$ y = [-70, -91, -37, 28, 50, -35, -26, 30, -41, 20, -31, -44, 70, 24, -78, -97, -89, -7, 100, -36, -113, -38, 0, -27, -45, -130, 5, 68, -12, -91, -47, 69, 31, -52, -144, -15, 16, 66, -105, -73, 93, 129, 8, -108, -40, 69, 34, -64, -34, 86, 27, -54, -55, 25, 36, -28, -20, -12, 46, 87, -97, -1, 95, 15, -12, -60, 24, 85, 38, -98, -27, 111, 59, -51, -145, 4, 174, 11, -170, -95, 124, 166, -14, -127, -24, 120, 25, -119, -78, 126, 33, -75, -71, 2, 176, -11, -120, -46, 76, 79, -104, -134, 58, 5, -29, -157, -13, 57, -45, -129, -107, -2, 48, -84, -29, 15, 47, -31, -159, -42, 63, 21, -95, -114, 57, 18, -19, -131, 13, 114, 70, -134, 7, 102, 91, -23, -40, 70, 44, 19, -80, -24, 103, 34, -40, -69, 4, 108, 46, -103, -21, 45, 96, -57, 26, 61, 76, -8, -65, -20, 19, -52, -3, -13, 37, 14, -48, -73, -14, 47, -29, -7, -65, 18, -48, -80, -88, 63, 38, -39, -79, 49, -2, -116, -90, 7, -22, -6, -33, -25, 25, -3, -88, -62, -32, -11, -30, -114, -22, 90, 24, -20, 1, 33, 0, 35, 12, 26, 45, 23, -50, -22, 83, 38, -37, -9, 28, 30, -88]
8054h8J34j5Pk1m1J5kp9J28j2P2j04p6rM9L5p2K7K5J12j74M3r4J19N5j05L5O1
8082B5K7m3k8K4nK4j5j01O2J4m0J25np5lm6J18q2J01r2K5M0q0k8L9M5K9j4j28
8111h7M4J00m4kk2J0R8o1j13M3P5m5J1j8j8N1k3k5j1l5PM2m9L4rj6R5q1m7PN9
8142c0K9j3n5L8JO9j14n7P5J47j20Lo2J72Nj32j05J45j7L4n6J6O3m4j9K9l8KQ3
8171D9j11R7J6j05QJ38k8q6q1J49L4m3p8n2J89Q1j77r0M8J59
$$ y = [-88, 46, 31, 38, 17, -24, -9, -11, -90, 38, 26, 98, -6, -82, -91, -42, -7, -79, -52, -27, 85, -89, -46, -140, -21, 34, -71, -36, 25, 52, 9, -19, 5, 0, 24, 9, -92, -30, -16, -56, 69, 64, -11, -14, -60, 58, -24, 77, -15, 10, 50, -30, -58, -19, 26, 55, 41, -87, -43, 57, 13, 11, -11, -1, 97, 36, -77, -34, 41, -4, 7, -11, -29, 22, -1, -26, -37, -72, -65, -23, -72, -38, -47, -63, 32, -49, -96, -89, -30, -1, -14, -69, -31, -30, 39, -75, -132, -57, 90, -30, -27, -89, 83, 88, -44, -149, -4, -21, 13, -43, -27, 36, -8, -27, 2, -36, -34, 49, -62, 35, 51, -54, -46, 92, 64, -22, -103, 46, 80, 37, -41, -93, 96, 177, 0, -90, -42, 117]
8191A17
$$ Imaginary data points
##PAGE= N=2
##DATA TABLE= (X++(I..I)), XYDATA
0@%%%%%%%%%%%%%%MpJ1j6J6j6J6j8K2k8L3l6L9m6N4n9O7p4Q3r3J03j17J29j41
38g4J56j74J93k14K38k64K93l25L60m03M53n09N75o57P59q87J059j302J666k268
58a325L441o555K9338R1831l9650o6802M2859R9815O465o5202o744O9640L5135
71A92246l6637l2810K3323L2443p463l2057j4754P275N523j4818k5796j4591N31
84H2415q361k7363k1070J959m925l4022k8210J0970J1419l5100m3735J1386L4705
97d9932k1469n8647l436N1699Q804n7408k8357M7875M1087l4257m8515J8606N4014
110g9936N847m0036j3363L4420K9679j0716k1860O143K6656J2207j1578j0699
122g3236J0721K0577N129j2172o439J1583J3549p94o759J273M892o53N23P718
$$ y = [0, 0, 0, 0, 0, 0, 0, 0, 0, 0, 0, 0, 0, 0, 0, 4, -3, 8, -8, 8, -8, 8, -10, 12, -16, 17, -19, 20, -26, 28, -31, 36, -38, 45, -48, 55, -62, 67, -74, 82, -92, 101, -113, 125, -139, 154, -171, 189, -214, 239, -270, 305, -352, 407, -480, 579, -723, 943, -1325, 2116, -4439, 24899, 116730, 77080, 10278, 53137, 152952, 159417, 94215, 87471, 157111, 192246, 155609, 122799, 146122, 178565, 171102, 139045, 124291, 131566, 137089, 122271, 96475, 81884, 82415, 74054, 46691, 25621, 27580, 22655, -11367, -39577, -28607, -17188, -52288, -96023, -84637, -49932, -71401, -130048, -133484, -81785, -72981, -130389, -158746, -110871, -69784, -104041, -152556, -133950, -79936, -74089, -114125, -127488, -93068, -63389, -74105, -95965, -89822, -63166, -50959, -62537, -73236, -62515, -41938, -36809, -48981, -55420, -43837, -30288, -31082, -37841, -36568, -31676, -32329, -31806, -24088]
136b4088J968j0663m008J4658J0081j4349j5063J2876K0983p699k4999J46K5711
149a4446Q758k1432j5687J3774J8435m776j6970k659J1893P128m792p180o78N037
163b3595N638R10n150m857L924R698L346p329o426O514J2650K123j1475p397J0536
178a0890J6399j388j8248o518J8880J6733j2658k3018L663K4338M216k3953j4207
191b6651J6441J7161j1686k2809k93J7024K994j6358j0800O105O783n365p930
204c5384P0J944l370k889L498J773o749m771Q130R976n785j3491L503K0211O902
219a6432j7487j2245J7678K4246n406k4257j77K8909J5109k0109j9881J5625K8470
232A4043j543k5704o243K3742J6642j4231j9565O387K0184J836j6695p345J0996
$$ y = [-24088, -22120, -32783, -36791, -22133, -12052, -26401, -41464, -28588, -7605, -15304, -40303, -40157, -14446, -5688, -27120, -42807, -29033, -10598, -15374, -32344, -35003, -23110, -15982, -20774, -27954, -28632, -23595, -17957, -17047, -22197, -27054, -23130, -13432, -10086, -17415, -23841, -17327, -4677, -2554, -14029, -21426, -10890, 5509, 4121, -14127, -20645, -1765, 14968, 2310, -20708, -17045, 7293, 11509, -12444, -26651, -10210, 6951, -4735, -27544, -27837, -10813, -7819, -24177, -34977, -28872, -22089, -27454, -35384, -35314, -33370, -36740, -39629, -36131, -34358, -41107, -45878, -37748, -27772, -33557, -47048, -43545, -23334, -16432, -33919, -46164, -28486, -4240, -9646, -33903, -34080, -5171, 9938, -10171, -30052, -14427, 14043, 12500, -13204, -19447, 4295, 20937, 6706, -12859, -6472, 13712, 15548, -1147, -8492, 2504]
245B504Q812o164q714J377M878j051k827J385m4m996j720O847M269q177r538N853
261g306J3539j508j6844n620J6772J3245j3176k0156O033K3962L414k4032j3070
274b4747J9622K0346j2437k4571L602K4631M237k1765j0646J6292J3755j0165
286a846j4251M878J2312j321r011O65O370j045m672L178N998l341p480K811J0679
301C924J167j0711n517J0114J1443n307j4711p11J6714Q859j4895j6400J0269
314e762K2806k415k6235p533K5377J6632k1064k4009J3213K7375n439k7757k188
327a6999K4980P375k1403j1272J6894J3202j2217j3467Q355J2768n163j0992L807
340d132J0593k088j0187N39J1230L873r787p862P031J2764r61j4823n471J5236
$$ y = [2504, 11316, 5152, -3562, -2185, 2693, 1642, -1185, 200, 156, -4840, -6560, 287, 4556, -3621, -13159, -7306, 6233, 4725, -12119, -17739, -967, 12278, -898, -21054, -15021, 8941, 12355, -11677, -24747, -5125, 15221, 2784, -21787, -18185, 6446, 10683, -11082, -21728, -5436, 8319, -1846, -16097, -11219, 1093, -228, -9239, -8574, -2204, -3249, -7921, -4743, 1255, -2086, -9566, -6755, 3924, 5091, -5620, -11137, -1023, 10420, 5113, -9598, -10309, 6405, 15264, 369, -16031, -5762, 17044, 14629, -11606, -19139, 6238, 22870, 1806, -22203, -8990, 18385, 12946, -14811, -16999, 7981, 15356, -6047, -17319, -425, 12777, 560, -12907, -4552, 8216, 3053, -7939, -4132, 6461, 4373, -5814, -5275, 5955, 9828, 41, -7821, -790, 11974, 11013, -3810, -9281, 5955]
354E955J3262j2256j9517P428K4807l71k7708q420K7125J7264k2940k4623J5039
367d955K7846o893k7786j596K3429O609j8605j0053J2552J0501q109j0535K919
380d676Q234J82n880k631K710L104r44l171j84L639L53n603j346Q215M540r908
396c366q854J0045J3779p577j7298M019J9953Q43k0199n539J9626J0822j6074
409A80j4783J0828J6998m073j5333j704J1061N436n032n894m81L803M256n07o296
424a541l144O427O479n503r495K675J0666N56j0338l847P528N202m197m531J099
439a964J725j18J084O60l234k159M366L902m367n228M077O727k986p093J903P447
455D742Q1n874RM714l05l201K709M274m006n795N185R210l690j1086J115J2955
$$ y = [5955, 19217, 6961, -12556, -5128, 19679, 19308, -8400, -16820, 10305, 27569, 4629, -19994, -4955, 22891, 15998, -11788, -13384, 10045, 16654, -1951, -12004, 548, 11049, 2940, -7595, -4676, 3558, 3740, -2140, -4771, -2061, 1043, 99, -3072, -3256, 383, 736, -4867, -6213, 2002, 6542, -3366, -12220, -2175, 11604, 4027, -13271, -9252, 10701, 11544, -8655, -14194, 5432, 16254, 180, -14603, -3775, 13223, 9150, -6183, -7887, 3174, 8610, 3578, -2316, -2797, 1006, 5262, 4755, -1541, -4685, 1742, 8221, 2718, -6777, -4102, 6564, 7120, -3218, -7065, 463, 5665, 1468, -3063, -1964, -239, -357, 727, 1387, -1847, -4006, 360, 4262, -105, -5333, -1256, 5471, 2485, -4608, -2705, 4742, 4823, -1051, -1042, 3672, 3367, 166, 2875, 7149, 3143, -2652, 2533, 11743, 8053, -3033, -1918, 11037]
471A1037K532j2800o244J1143R977q099j3084K975J3890K157j3255q201Q877J1463
485A2368m415j3890k167J2340O331j0773j1013O386J2752l111j4385j744J3544
498B223N056j2121q521R358J0467o514j1353M151J2273j392j2072o29J3034M171
512H131j1756o792J1035J1064p508j2728M668J5307O64j4910m518J4725R995j1442
526E935j3271P623J6488j883j6660l195J5537Q325j2372j1761Q278J3817l947
539A2914j4409n86J3395M212j1873p683Q696R240o358j0913K702J0659m94j1144
553a642k726R754M402r423p432O985Q919n365j1025J871J1315J007j1305m704
567i369R760P521p584r652M807J1343r74j1116k161J0512N952p691p437N568R252
$$ y = [11037, 13569, 769, -5475, 5668, 15645, 7546, -5538, -2563, 11327, 13484, 229, -7972, 905, 12368, 7953, -5937, -8104, 4236, 10567, -206, -11219, -4833, 7919, 4808, -9577, -11321, 2223, 7279, -4842, -13363, -4005, 6462, -52, -11405, -7254, 5019, 3627, -8445, -9074, 3960, 8131, -3625, -10417, 618, 11682, 4174, -8554, -3886, 11421, 12085, -2825, -7343, 7382, 17377, 5935, -7336, 287, 16775, 14892, -1768, -4963, 10574, 18899, 6527, -5234, 3044, 16861, 12914, -1495, -2081, 11314, 15526, 3653, -4030, 4666, 13906, 7548, -3365, -663, 9996, 9502, -1642, -4368, 5386, 9788, 365, -7067, -82, 8837, 3472, -7553, -5682, 5633, 6640, -4665, -9369, 391, 7912, 328, -9324, -4517, 6826, 5852, -5264, -7425, 3087, 9039, 1348, -6089, -521, 8731]
582H731k108q537L60Q644K012p302l050O537M404n104m968L857N200l319n724
597c67J963N638j660p026l10O490J287o935l956N177M878m291o661J723O761K66
613B977o895k689O075M996m114n956K483P484N90o782j665P019M630m730m796
628a373M396O465k317n722K102O773o63o441j16O469J363o136k338N236K429n488
644D639l714M147L651m187n413J737M646q63m964j698K636J799k041l006N3K782
660B04J146l263l336K450M982j227o359n53O950K270o652l610O571M677o148n687
676g585N374O526m675p176L391P017k596o983J444O063j417n690Q58M775j223
691a897m539J154M327j000l791Q33L589m43k620J418L000o28k121J292K530J87
$$ y = [8731, 6623, -1914, -1554, 7090, 9102, 1800, -1250, 5287, 9691, 4587, -381, 3476, 8676, 5357, -367, 1596, 7234, 5574, -1452, -1762, 4728, 6015, -920, -4876, 301, 5179, 888, -5773, -4050, 2711, 2977, -3918, -6607, -532, 4464, 350, -5606, -3123, 4361, 4951, -1831, -3496, 3523, 8153, 3423, -1373, 3023, 9488, 7171, 1449, 3551, 10324, 9661, 3220, 3104, 9573, 10936, 4800, 2462, 7698, 10127, 4639, 925, 5072, 8723, 4536, -877, 860, 5506, 4643, -321, -2019, 617, 2416, 375, -2631, -2578, 204, 1350, -1913, -5249, -2799, 2183, 956, -5403, -5956, 994, 3264, -3388, -6998, -427, 4250, -1898, -7585, -2211, 4315, -360, -7536, -4145, 2872, 276, -6707, -5263, 800, -617, -6307, -5449, -674, -1897, -6436, -5282, -955, -1955, -5746, -4913, -1324, -1767, -4387, -2969, 31, -597, -2718, -1426, 1104, 1291]
707A291k31R11k07j030K258L149j484l751J895N072j345n673J176O631n95q106
723c9j186P907K359q096m373O003L786o200m997M661M288n071n650L438N256l119
739a033o105J358N618m49n709r22N198K636m085l938K956N665k77n914j902O155
755g48N439m263p428K199R392J153r253m077Q609O885o916r161M875J0590j852
770E444j1483j704J0575M519q882o898O291P680m232q175K215Q325j61q320k025
785f831P704M533o080n913M529P382k152p901N57Q759K485q466n002P575Q344
800I523n110j0234K261J1461J363j1359m858R969P934p844j0304M296J1367j064
814G401j1521k591R975N130q177p419N210Q213k596q477l19P576K190o445l885
$$ y = [1291, 1060, 1971, 1764, 734, 2992, 6141, 4657, 906, 2801, 7873, 6528, 855, 2031, 8662, 8067, -39, -1225, 6682, 9041, 945, -3428, 2575, 6361, 161, -4836, -175, 4113, -958, -6608, -3170, 2086, -1033, -7138, -5780, -162, -611, -6320, -7242, -2044, 592, -3493, -7431, -4475, 1190, 913, -5001, -6903, -748, 4691, 428, -7000, -4801, 4591, 5744, -3509, -7586, 1023, 7908, 992, -8169, -3294, 7296, 5444, -6039, -7743, 2832, 7351, -1531, -8429, -2138, 5542, 1310, -6865, -4650, 3675, 3514, -4806, -6831, 873, 5406, -674, -6587, -2058, 5324, 3172, -4729, -4172, 4587, 7072, -1394, -6396, 1179, 9523, 4413, -5821, -3560, 7901, 9264, -2095, -6953, 3016, 10950, 3106, -7198, -2902, 8465, 7401, -4120, -6711, 3264, 8394, 217, -7202, -1992, 6221, 3625, -4852, -5171, 2405, 4595, -1850, -5735]
829e735N098N086l923o172K338P119l29p386j623P134L771o303n580N222P368
844F085l363q586R93R393K052q839m775P341P051m499q069J851Q453R71p257l419
860d617N995N181l369n588J305N591Q08m315j656L211K539j883k289J288K049
875D250q08j532R64J559j199j984J311K442q93l412j19L593J142l672k743K680
891A579L530j750m616k75M466J736l862l523J963L886m82l671j232K657J835j462
907G79k124J29J550N55m74o98p05J77J632J145j695k537R44L681P95l843k599
924c288L269M335j551n177o77N537K766m207m811K543O071k9o140k429N392M371
940E975l523n531J615N741K39m984j391M050K008l023k046K432J878k243j707
$$ y = [-5735, -637, 4449, 526, -5646, -3308, 3811, 3482, -3904, -5527, 1607, 5378, -925, -6505, -1283, 6085, 2722, -5864, -4871, 4522, 6574, -2265, -7040, 301, 7352, 2853, -5216, -3365, 5088, 6059, -1198, -4617, 1378, 6559, 3190, -2398, -1093, 4498, 5306, 991, -665, 2546, 5085, 3202, 913, 2201, 4250, 3442, 1910, 2874, 4433, 3234, 1250, 2561, 5003, 4110, 698, 579, 4172, 5314, 1642, -1101, 1579, 5109, 3359, -1257, -1532, 2934, 4670, 808, -2715, -752, 3134, 2652, -1019, -2251, 406, 2241, 779, -1345, -1216, 334, 889, 415, -283, -988, -811, 821, 1966, 271, -2266, -1322, 2359, 3154, -689, -3288, -19, 4316, 2765, -2412, -3089, 2448, 5214, 1007, -3804, -1261, 4810, 4781, -1359, -3788, 1604, 5975, 2452, -3079, -1464, 4277, 4516, -468, -1859, 2191, 4199, 1176, -870, 1562, 3440, 1197, -510]
955e10K457J686k797k137K958K830k804m169J704N042j26n485k300M638M132l005
971B114n807K23O120K269n590n086L814O891j515q292j322P989M173o818o230
986g067M619P251k464p144P02O583L84n462r21M837J302m200j369M081J685l716
1002h99j857L666K651l161l516K500M590p85n001j549M786L840l111n664N84O618
1018C692K033o309m691N039O805l281q245R38Q707J438q231l813O707N156m878
1033A067n513L084N058k122m316J675L908j732l901J543L969r76m226J83M277
1048A978Q71m081k336L540L872k197n016k70N613L125m829n902K719P738K14q289
1064c250l228P668N845n965p935M006Q738j407q782j092Q000K954o296l934M416
$$ y = [-510, 1947, 3633, 836, -1301, 1657, 4487, 1683, -2486, -782, 4260, 4134, -1351, -3651, 987, 5119, 2114, -3693, -3470, 2650, 4919, -671, -5757, -1943, 4948, 3433, -4859, -6181, 1808, 5981, -837, -7067, -2448, 4803, 2339, -4805, -4103, 2480, 2864, -2598, -3519, 1318, 2620, -1580, -2949, 1132, 2817, -899, -2756, 910, 3561, 400, -3116, -616, 3974, 3189, -1812, -3361, 1425, 5265, 2154, -3510, -2926, 3692, 5725, -584, -5275, -236, 6569, 3288, -4957, -4019, 4688, 6126, -2105, -5918, 789, 5945, 1067, -4446, -1362, 3696, 1574, -2742, -1067, 2841, 1109, -2792, -1249, 2720, 1744, -2482, -2299, 1978, 2849, -1232, -3568, -28, 3844, 1647, -3369, -3639, 1974, 5099, 270, -5632, -2913, 4825, 5039, -3250, -6478, 1190, 7035, 1070, -6865, -2859, 5879, 4472, -4310, -5402, 2598, 5552, -744, -4678, -262]
1079b62L900k996l211K352K549k347k415K517K905k314l417J621L913m61m240
1094a906r09L935K621l073m293J350N422J122n620m056M482O531k153p887r79
1109e413Q034L695o788n993M736P395k429p659k8P060K098n566l446L693L723
1124C112j823l149P59K098m29j111Q63Q75j348j106J632J777j266k579N33L191
1140B029P06l222k253K611L602j234m606p55M624K742l633m505J790N277J48n000
1156a679k319L931L512k227m086M32L658J018k602j888J177K045J4j401o88K67
1172h36R27P66j69j375p98J264J909l66k586p56K623K145j833l176N87L773J018
1189C117l486k448K652L468j191l717m67L472J671k398k346J208K328k30j742
$$ y = [-262, 3638, 642, -2569, -217, 2332, -15, -2430, 87, 2992, 678, -2739, -1118, 2795, 2334, -1906, -2815, 1120, 3741, 668, -3625, -2275, 3147, 4269, -1351, -5407, -925, 5606, 3453, -4434, -5413, 2621, 6316, -472, -6465, -1729, 5666, 3237, -4422, -4450, 2610, 4708, -858, -4304, -611, 3112, 1289, -1860, -1101, 997, 568, -543, 320, 1195, -153, -1259, 373, 2150, 884, -1695, -1162, 2029, 2735, -487, -2740, -129, 3473, 2239, -2367, -3122, 1502, 4244, 611, -3894, -2104, 3173, 3321, -1679, -3998, -67, 3445, 1218, -2868, -2436, 1222, 2240, -362, -2250, -1073, 972, 986, -415, -1103, -836, 91, 857, 688, -687, -1485, -221, 1688, 1322, -1264, -2020, 603, 2748, 915, -2261, -1674, 2099, 3117, -369, -2817, -165, 3303, 2112, -1605, -2072, 1400, 3071, 673, -1673, -465, 1863, 1633, -109]
1204a09l97J049L89l58K2J02o30m88J235J177j226k229O79L073M42l341k041K939
1222B88L579j785m618l7M887J955m183l887K779M925p82n346j340M618L035l302
1238G86m221J553M438K0m028j510L103K222k126k358J200K106o90j803O76J568
1254I36q06j769R12K473q05l036R8L791J115l996k457L569M031k254n144M97N598
1271B753J638m989l720L609N208j410n753j011N284L114m025m566K125N246r5
1286C408n213j605M154K852k912l430J607L248o70k710L04K075l39j803N70K022
1302A558p29k363M95K971L1l286r41L301K160k804l266J553L981J68l948j990
1318c109K937L491j366m322n89M292K384l481m111K161M837n58n046j113M340
$$ y = [-109, -506, 543, 932, 574, 596, 698, 68, -420, 815, 1992, 766, -1463, -784, 2289, 2731, -610, -2651, 288, 3867, 2082, -2536, -2573, 2314, 4269, 86, -3801, -1022, 3903, 3121, -2225, -3565, 1053, 4088, 786, -3435, -1882, 2556, 2576, -1452, -2962, 141, 2363, 237, -2121, -921, 1185, 495, -1308, -632, 936, 130, -1639, -727, 1746, 941, -2095, -1997, 1794, 2909, -1087, -3544, 25, 4056, 1802, -3342, -2845, 2753, 4391, -598, -4318, -709, 4499, 3089, -2664, -3675, 1609, 4723, 698, -3868, -1743, 3503, 3408, -1805, -3410, 744, 3596, 684, -2746, -1139, 2109, 1439, -1271, -967, 1108, 769, -1034, -464, 1558, 829, -1534, -1039, 1932, 1963, -1323, -2264, 1037, 3197, 393, -2873, -1320, 2661, 2829, -1119, -3109, -172, 3319, 1953, -2369, -2958, 1334, 3718, 237, -3874, -1713, 3124, 2566, -2480, -3593, 747]
1333G47K299l390k971K146K832j076k333M20J602n48j062R27Q71j437j125J739
1349c59J603j525k088J148K419l51k370o43K124J653j149k375k0K397J665j594
1365E35k695K36L179J179k833k193K192L044j372l195K83L222P18k735j301J875
1381A39J384j008r52N10K43o58L41J075m39j632K7J976N07j973j307J638J810
1398A681j116k180J92K073P16j701j658Q59K095K79k171j378J368K127m42k329
1414a585o20J996J218j459j513Q81J433m06j286R9J023j32m35K58J28o86j00J326
1432A40O55j522j473J306K296m51k610l29K381J271j828j708J048K187j10k157
1448i04q20J672J741p74k096k96J934J213j393j720O36J770mj453m21J086N48
$$ y = [747, 3046, -344, -3315, -1169, 1663, 587, -1746, -1326, 276, -272, -1334, -407, 464, -973, -2098, -359, 1244, -281, -2369, -1221, 1198, 847, -1523, -2166, -42, 1611, 462, -1913, -1933, 464, 2129, 535, -2160, -1924, 1255, 2434, -399, -2592, -400, 2644, 1272, -1923, -1640, 1582, 2300, -435, -1736, 139, 1523, 515, -437, 73, 316, -342, -1, 1074, 635, -997, -970, 1006, 1513, -460, -1767, -129, 1681, 565, -1615, -1423, 650, 1366, -335, -1993, -1134, 961, 1240, -931, -2309, -941, 1186, 744, -1585, -2205, -209, 1009, -450, -1963, -1082, 351, -55, -1341, -1242, -219, -351, -786, -528, -400, -1086, -1186, 140, 795, -727, -2200, -894, 1402, 951, -1659, -1988, 393, 1664, -164, -1872, -824, 1363, 1253, -904, -1724, -52, 1689, 915, -1181, -1477, 457, 1670, 277, -1443, -807, 963, 959, -494, -915, 171, 719]
1465G19r31k65O59Kp30J85J065l74j518K62J948K62k301j010K224J885j703k663
1483b284P88L038L28k754j258J988K002j051k389J74K255Q71j856j675J235K021
1499A433k67k032n23J623R14j122r56O03Q80m03q09M96O50n53q33O80R56p90j282
1518a335N79J783j90k157m65K151J496j971k127J206K692j71k897p87K568J822
1534B197j939k393J040K728K0k518q84K124J473j378j761O88J863j01j544l59
1550g44J320N12r25o11P20O38p25p12Q45Q39p47j126N15J431k22j713l04J848
1568H39Q73j698j563J332K051o37k361j27K181R15j803j550J183J827m79j936
1584i53j92J721P55j172j283P40J263l47j184j8J059K20r08l42Q26L62p97m42
$$ y = [719, -212, -477, 182, 184, -546, -361, 704, 330, -1188, -926, 1022, 1284, -1017, -2027, 197, 2082, 379, -2284, -1496, 1542, 1870, -884, -2142, -154, 1848, 797, -1592, -1418, 837, 1708, -148, -1823, -588, 1433, 1166, -866, -1389, 234, 1148, 26, -930, -327, 553, 150, -659, -163, 487, -66, -899, -219, 737, -53, -1335, -756, 1027, 837, -1320, -1785, 366, 1862, -109, -2236, -1030, 1662, 1491, -1406, -2193, 375, 2197, 258, -2135, -1095, 1633, 1653, -865, -1749, 375, 1848, 470, -1291, -603, 1260, 1159, -385, -744, 576, 1088, 163, -448, 272, 910, 185, -527, 318, 1157, 410, -716, -201, 1230, 1008, -705, -1009, 839, 1712, 14, -1549, -217, 1834, 1197, -1164, -1291, 890, 1805, 2, -1548, -365, 1462, 983, -953, -1145, 576, 1331, 159, -1124, -384, 879, 532, -652, -670, 389, 609, -299, -641, 185, 547, -250, -692]
1602f92Q67N15q61p96Q42J127p63j370N08J666j08j689m32J564Q99j215j181P59
1620c60J321j89j175l38Q86P65n30p12K8P31L08n64n67L52O64j98o41j0N95K4
1640C90m99O9M96k46n94K66R13k80j191O2J364J89j365o35J316R00j163j260R05
1659c63J337l75j454N2J158L75q24o35M94N32o2l67j66K08K28j47k25j5L47M5
1679A43k85k19M10J58l80j79N70K01p34l55R50O59j001j019Q92J429o55j614J27
1698i02J823J91j640o22J596Q65j276j083Q09J262m18j169NR55K72n68l92K49
1716d3L78j23l55n2L18L16l68m90K32O90j96p32k8P95J60r22l16J073N62j207
1736c08q69J139J255r98j429N64J557r9j585k21J535M67j325o59J148Q61p15j007
$$ y = [-692, 175, 690, -171, -967, -125, 1002, 239, -1131, -623, 1043, 935, -754, -1186, 378, 1277, 62, -1119, -360, 961, 772, -403, -741, 145, 910, 380, -332, -304, 427, 735, 171, -396, -44, 620, 422, -219, -229, 366, 390, -109, -40, 456, 210, -384, -118, 795, 515, -676, -614, 750, 939, -426, -1061, 255, 1155, -8, -1268, -363, 974, 599, -855, -803, 355, 730, -94, -729, -235, 297, 235, -132, -298, -90, 138, -9, -234, -249, 98, 143, -142, -361, 49, 207, -173, -352, 218, 419, -315, -670, 280, 939, -62, -1081, -189, 1240, 585, -1029, -902, 921, 1112, -528, -1150, 446, 1311, 35, -1048, -239, 1023, 605, -564, -559, 396, 668, 100, -292, -43, 335, 212, -143, -195, 123, 439, 71, -419, -187, 503, 307, -425, -453, 342, 502, -420, -736, 337, 899, -308, -1177, -38, 1217, 219, -1210, -646, 911, 812, -773, -994, 541, 1008, -317, -976, 172, 1033, 318, -689]
1754f89L19J011j8p26l18N41M08l03m32J80N14M0o18j48N73M58n25o86L67P73
1774G21j35r26n1R56J52r31l88R35O01q77q97O62R70l76j031O1R41J20q53l03
1794f49P15N33n74o72L74O30m5o61o8M64L41l97l69L16M07j31m96J62M64O5n71
1815a62r7N18L92n47l91L90M85k49n54J36N92Oo02j88O48L21n48m27K29N74r1
1836D35n59l2M77J03m31k62L61L42l28m43J96N15j26n07n6M57J44m49j89L53L36
1857C37k77m03K46M31j48m92NN36O7m06k41M19M29m16m58K93N09j56m77n9N42
1878B81J83m37m34M66M05k38o15K18N51k6n15j01N12K34m66l82L67N10k72m71
1898b30L4M83J67n34l21N01L48l19n59K82M60m7n73r8O22K43n75l37M73M22l51
$$ y = [-689, -370, 641, 623, -103, -421, 120, 528, 225, -207, -27, 487, 527, -91, -239, 334, 792, 267, -419, -52, 721, 586, -340, -391, 565, 717, -214, -602, 333, 934, 57, -840, -178, 792, 416, -615, -554, 387, 507, -346, -649, 66, 599, 25, -647, -273, 357, 312, -349, -417, 47, 388, -9, -378, -62, 345, 214, -282, -120, 344, 409, -162, -259, 259, 651, 104, -287, 103, 588, 339, -215, -79, 513, 519, -83, -271, 377, 698, 150, -277, -48, 526, 435, -124, -156, 321, 424, -7, -269, 92, 434, 106, -337, -141, 374, 248, -259, -315, 142, 286, -163, -352, 1, 337, 60, -343, -97, 334, 186, -306, -301, 235, 302, -104, -345, 74, 503, 87, -371, -78, 431, 275, -202, -261, 281, 464, 27, -407, 59, 464, 226, -389, -171, 380, 354, -161, -262, 250, 484, 18, -364, 3, 513, 241, -230, -196, 287, 454, -80, -401, 100, 448, 129, -430, -148, 312, 265, -308, -406, 216, 459, -116, -453, 20, 442, 91]
1919I1n75K55N00Oo07k2M90J63m40l90M58M82l44n45J98N36n8m43j95M70L51l82
1941am44J76N05om92k03N37L78n19l84J81O73j29p00J2O74J81o38l38N99M68m95
1963C5n92M20O16k75o66K06N86l6m79m0M24J01l37k05K83K50j94k77Q6K55R4k15
1985D0k57J75L05k1l35j05L91K12m72l42L00N86k91o38R4O50J28q12m8N51K47
2006C58n43l58M22L97l41m77L47K77j11l19J28J51q1r3P8K02j09j85O6J04K5%
2028f2M6o7l9J58Q7j57p8J87J62k02j68K42K93k90l64K52M28q6m40N2L44J5l29
2051a6J7L49j18l12R6K39M2k94M8K11j48k82J24L26r5m08N2L03J17k86j80J62
2073e3J14n1j02RK8P5Rk72J21R3J39j33j72J5K38k1k07kJ46Kk17J04K31o9l32
$$ y = [91, -484, -229, 271, 277, -330, -352, 138, 301, -139, -529, -71, 411, 67, -478, -280, 256, 198, -245, -440, 30, 381, -1, -445, -269, 236, 230, -262, -465, 72, 450, -69, -453, -272, 401, 272, -428, -416, 258, 439, -199, -537, 62, 530, 35, -557, -137, 479, 204, -462, -256, 330, 294, -185, -225, 199, 300, -37, -242, 41, 291, 97, -180, -94, 161, 255, 40, -217, -42, 263, 242, -93, -198, 193, 405, -67, -409, -109, 477, 186, -452, -358, 292, 420, -392, -440, 111, 358, -185, -543, -121, 276, -65, -542, -195, 82, -29, -348, -220, -69, -150, -243, -165, 37, -72, -257, -191, -87, -62, -62, -16, -83, -122, 36, 123, -34, -112, 75, 237, 35, -133, 109, 402, 112, -252, 0, 428, 342, -98, -46, 298, 313, -16, 1, 350, 232, -80, 16, 255, 297, 3, 51, 262, 114, -168, -44, 282, 187, -221, -169, 134, 251, -35, -215, -53, 61, 10, -92, -83, -55, 20, 29, -243, -122, -29, 110, -23, -195, -180, 58, 37, -170, -172, -26, -24, -241, -137, 94, 25, -307]
2098c07N1L44O2m08j75L91L12m30k64K67M70k09n58oN22K12m38l32K38M27j3n68
2120d12m2M11K43l11l23J99L72J5m67j13M48K61k19l95J61L76m0k87J00K28j61
2141D4j48J02K92q9k72j2M34J00m11k60L68N05k81n45K7O60J69o23m75M39O24
2162F48j92p47q6O45L48n05n44J44O24qn35k93L72M01k79m63L5L19K34l82j79
2183d43J39R9m9k9m5l0n0O7J87o7k82M3L98K8l17k23J86M92r2m84j4L69L66k39
2207A0m37P4M67J83l77l25K09N34K7n02j27K99L52j39l95l8L70K62k07l39q3L14
2229A32J58l5k41j16K23K96k11l58J7L84J62l64k23P5L41O1k77k30J58L39j2l35
2251e6j47K34J60Jk06j37J56J46J8k32q8M1K66Q9l31j54R9L60R5m31l51L11N54
$$ y = [-307, -256, 88, 150, -258, -433, -42, 270, -160, -424, -157, 313, 104, -454, -460, 62, 274, -164, -496, -258, 169, 156, -412, -454, -43, 200, -111, -434, -235, 137, 152, -315, -428, 20, 281, 62, -333, -172, 204, 164, -123, -23, 205, 44, -104, -2, 290, 201, -71, -83, 351, 451, 40, -220, 148, 653, 372, -173, -146, 514, 683, 60, -415, 24, 648, 456, -291, -377, 268, 616, 111, -433, -289, 335, 327, -208, -501, -129, 272, -7, -470, -435, -116, 118, -264, -443, -304, -205, -254, -283, -328, -358, -408, -341, -154, -221, -503, -460, -62, -34, -351, -574, -388, 104, 12, -472, -486, -117, 249, 10, -427, -353, 114, 297, -80, -405, -196, 338, 365, -137, -264, 35, 387, 248, -147, -185, 185, 447, 240, -99, -182, 132, 290, 255, 14, -102, 121, 417, 206, -152, -135, 249, 411, 47, -176, -101, 240, 301, 24, -206, -48, 291, 279, -56, -203, 31, 191, 192, -14, -151, 5, 151, 169, -63, -151, -110, 156, 245, -86, -240, -141, 219, 314, -117, -468, -157, 397]
2274C97k06m90k08N30M67l77o44J33O54J20o40m11M32N12j90n15j69N36J98k31
2294a02l08L6K36J05o5j59j10J05K55j6k41j50J37M33L0l58k65L14M56L4n58k34
2316d25M45N63k03p16r2P97M33n78p98L71R80k8r45k86O78O23n21n81N4P00J15
2337E86m50k89J74L01lj39k69K6J57K53n0m23k07L37L72j28m83j76M45M84k74
2358B44o98j14P67M72o43q17L57R72K11j171n18Q84R28n71j110P8J108L35q19
2377a05n90M48O89j29n82j73L31L52j04l40j44K17K23P7k42k98J12K21K29j46
2397D6l97j36M30L51j96q07R3P70L63p82o50M86J156k19j289k29J135P23p28j048
2417i28K83J165J63q99m92O11P15j79p24p8N59M85l61m30J4M46J84j46m02k5L38
$$ y = [397, 191, -299, -507, 23, 490, 113, -531, -398, 256, 376, -264, -675, -243, 269, 79, -436, -605, -69, 129, -102, -410, -374, -138, -33, -98, -257, -367, -262, -7, -23, -264, -414, -277, 156, 186, -172, -437, -123, 333, 367, -191, -425, 20, 583, 380, -336, -428, 369, 802, 224, -574, -203, 777, 749, -196, -482, 196, 819, 298, -283, -229, 471, 586, 136, -153, 21, 322, 319, 180, -89, -63, 94, 347, 297, -126, -333, 4, 376, 248, -235, -411, 34, 518, 244, -454, -568, 199, 671, 28, -789, -432, 540, 751, -420, -938, -54, 874, 303, -807, -729, 379, 714, -105, -695, -247, 442, 313, -269, -442, -111, 241, 137, -203, -347, -130, 93, 170, -72, -370, -258, -37, 192, 46, -351, -487, -57, 294, 98, -709, -616, 154, 517, -265, -915, -429, 727, 508, -781, -1010, 125, 848, 120, -928, -645, 520, 683, -216, -708, -97, 618, 439, -285, -363, 196, 681, 320, -110, -96, 350, 534, 388, -14, -39, 299]
2438B99K09j24k88j78J90L16R2l32m34K07N29J38o93l83M31O80l26p48j47Q21
2458B59M69p25o50J46Q32J75p02n21L81O90n7n99l70L78O01ro32l21L76N89p4
2479B36o25k84N30O27k47p30k16P38N27m62o52P2P25L08n21n94K52P21R7o06l37
2500d41L57N52j8n29k24L53L95r4l20j92J36M39J46l10m93J22N56K56n88n92L21
2521a68Q98R2q96o32P59J080l67j316k59J259P99r03j255M35J513J86j376p97
2539i48J049J224n26j284l3J171O20r11p94M57Q27K1p02j55L17K05l1q7j26o4
2559B30J3K34J30l07m19J00P24M6p73n46O76Q23l38j211j87J278P23j123j198
2578a125N87J408J51j511q02J257J109n91j426N6J388M33j030r26O76J024o9j015
$$ y = [299, 508, 384, 96, -82, 108, 424, 516, 184, -250, -43, 486, 624, -69, -452, -21, 659, 333, -415, -562, 259, 728, 3, -647, -501, 331, 506, -196, -717, -336, 354, 297, -302, -672, -294, 307, 298, -334, -655, -279, 310, 236, -389, -673, -143, 484, 237, -493, -709, 29, 556, 94, -558, -486, 239, 547, 26, -568, -316, 405, 502, -104, -441, -84, 468, 450, -79, -303, 50, 445, 351, 31, -161, -25, 414, 560, 250, -243, -121, 435, 691, 103, -489, -168, 730, 822, -74, -706, 53, 1133, 766, -550, -809, 450, 1249, 346, -909, -474, 1039, 1225, -151, -948, 101, 1325, 799, -485, -518, 653, 1273, 362, -432, 25, 852, 873, 171, 16, 333, 538, 507, 420, 294, 230, 243, 477, 607, 300, -119, -19, 705, 751, -22, -568, 108, 931, 593, -618, -805, 473, 1196, 73, -1125, -538, 870, 1021, -490, -1292, -35, 1074, 483, -943, -887, 501, 934, -96, -1022, -346, 678, 609, -406]
2596d06k27P05N13k94m00r1L91J76q3o2j62n8K54L61k34m31j24O36M45n19p01
2617c11J53R83K28q89o71O38J061k99j103k38R52O95o33r06J78R49K03q09n07
2636c26M52O01j42n31j96L26K96l4l46k87K7M25K00l73m73k5O00L52n84p16L09
2657d45Q15J26r03n54O85P84k73r94k25R23P30o83r93K63J064J65r04m77O13O45
2677C62j99o42k3M60K35k12k67J01L4J57J44p7l82m0L44N21l84p45P6Q44L96q58
2699a55p26M52J129k3j178n30R16J072o28j262J17J282M74j103r15O19J243j15
2717F69j175l92R26O05l55p39M9O09K51l37m06N6L14J94j35k20k33K56L57N7m70
2738a19l85L45N94m6p83m10P20P48l57j096K0J027N39q49r21N07J047l6j025m26
$$ y = [-406, -633, 72, 585, 291, -109, -200, 191, 367, 284, 222, 60, 2, 256, 617, 383, -48, -172, 464, 909, 390, -311, -158, 825, 1053, 164, -507, 131, 1192, 893, -210, -448, 504, 1199, 566, -340, -162, 787, 990, 181, -326, 126, 727, 585, 54, -142, 184, 480, 446, 100, -187, -160, 265, 465, 92, -381, -406, 194, 546, -38, -754, -445, 370, 496, -407, -961, -276, 508, 235, -759, -984, -61, 669, -14, -1007, -744, 320, 485, -419, -896, -283, 362, 163, -479, -502, -42, 193, -19, -286, -185, -151, 6, 150, 73, -309, -349, -5, 516, 132, -613, -537, 307, 703, -155, -881, -429, 700, 677, -501, -1031, -115, 957, 329, -933, -816, 466, 940, -163, -1078, -459, 784, 669, -506, -898, 28, 633, 278, -461, -412, 197, 448, 111, -295, -239, 75, 269, 134, -86, -319, -63, 294, 351, -119, -504, -159, 435, 389, -394, -804, -84, 664, 307, -789, -769, 258, 797, -52, -973, -466, 581, 545, -480, -906]
2758i06P51P76l85q50j8O33M29k84o34q0M88M28k23o01j10M55M30j80o26k00N69
2779a38M63l27q25K0Q60M93p30q99L14J115J72r74o14P12R77l54r30n2J014L95
2799F92o90o02M42P31j20n65o1M77J36k00q7J18J02j61K1L55m6n41p4O85L17p06
2821B23p31N68J036l17j224j80J222O66j097j122O46J347j40j385n14J228J000
2838A226q77j156K63J284J99j139o12R29Q02o16r16J70Q48J24q19j95N97K22n27
2857a93k75N01L69o44m70N16O81m84q92K05J095k6j122m31J106R04r28j261M32
2876i17J491J18j377o66J157J099p27j286J89J363K88j211n97P94R35l39q22k3
2894e31P37L39n31m76L99L36n0k06n7J76K1o6J31nr3j94J94M60j32n12q6P42J94
$$ y = [-906, -155, 621, 236, -614, -632, 1, 430, 146, -488, -568, -80, 348, 125, -476, -586, -131, 299, 119, -507, -707, -138, 325, -2, -827, -807, 53, 546, -184, -1083, -769, 346, 518, -456, -1070, -358, 619, 265, -665, -717, 297, 692, 2, -600, -158, 573, 453, -112, -173, 304, 440, 240, 153, 271, 373, 212, 233, 588, 542, 1, -73, 612, 929, 223, -508, 60, 1096, 779, -445, -625, 597, 1263, 166, -956, -310, 1037, 897, -488, -1002, 226, 1226, 349, -807, -544, 740, 939, -200, -812, 117, 919, 303, -613, -443, 405, 529, -290, -485, 112, 334, -193, -468, 33, 402, -242, -712, -196, 485, 1, -891, -686, 409, 383, -739, -1170, -64, 840, -88, -1349, -917, 574, 692, -685, -1351, -194, 905, 178, -1108, -919, 444, 732, -479, -1076, -282, 653, 314, -508, -531, 206, 545, 14, -462, -63, 273, 223, 17, -40, 136, 157, 91, 222, 217, 124, -70, 124, 584, 452, -60, -146, 596, 790]
2917G90n70n91M41Q43j50r25j05P65M75o31o71L26O80ko33k74M28L35j68m31j56
2938b24L28J92j50k47j85J47K15Ll43k48J56L76J33n60l72M80N50j47q49j18P43
$$ y = [790, 220, -371, 70, 913, 763, -162, -267, 498, 973, 342, -329, -3, 677, 675, 42, -232, 196, 531, 363, -68, -224, 104, 296, 146, -101, -286, -139, 76, 79, -264, -512, -356, 20, 153, -407, -779, -299, 251, 104, -745, -863, -120]
$$ [...]
8191C1
##END NTUPLES=NMR FID
##END=
