##TITLE=1H_DP132303K-2
 CDCl3, 8 sc, 
 24.3.2020
##JCAMPDX= 6.0         $$ Bruker NMR JCAMP-DX V2.0
##DATA TYPE= NMR FID
##DATA CLASS= NTUPLES
##ORIGIN= UXNMR, Bruker Analytische Messtechnik GmbH
##OWNER= root
$$ XWIN-NMR		Version 3.5
$$ Tue Mar 24 13:50:08 2020 Russian Standard Time (UT+4h)  she@DPX200
##.OBSERVE FREQUENCY= 200.1315
##.OBSERVE NUCLEUS= ^1H
##.DELAY= (6, 6)
##.ACQUISITION MODE= SIMULTANEOUS
##.ACQUISITION SCHEME= undefined
##.AVERAGES= 8
##.DIGITISER RES= 18
##SPECTROMETER/DATA SYSTEM= spect
##.PULSE SEQUENCE= zg30
##.SOLVENT NAME= CDCl3
##.SHIFT REFERENCE= (INTERNAL, CDCl3, 0, 15.7039)
##AUDIT TRAIL= $$ (NUMBER, WHEN, WHO, WHERE, WHAT)
$$ ##TITLE= Audit trail, XWIN-NMR		Version 3.5
$$ ##JCAMPDX= 5.01
$$ ##ORIGIN= Bruker BioSpin GmbH
$$ ##OWNER= she
$$ F:/spectra/data/she/nmr/H-F/1/audita.txt
$$ ##AUDIT TRAIL=  $$ (NUMBER, WHEN, WHO, WHERE, WHAT)
(   1,<2020-03-24 13:48:38.50 +0400>,<she>,<DPX200>,
      <created by zg, POWCHK disabled, PULCHK disabled
       configuration hash MD5:
       00 E9 B6 7A A2 85 ED C7 34 08 36 98 17 FE 4E 26
       data hash MD5: 16K
       1C 2C 42 40 C7 0B 11 B6 73 42 4E EA 39 08 28 00>)
$$ ##END=
$$ 
$$ hash MD5
$$ 9F 38 5A E3 85 36 6C 57 B4 E1 9B 9D 01 59 D6 37
##$RELAX= 
##$RELAX= 
##$RELAX= 
##$RELAX= 
##$RELAX= 
##$RELAX= 
$$ Bruker specific parameters
$$ --------------------------
##$DU= <F:/spectra>
##$EXPNO= 1
##$NAME= <H-F>
##$PROCNO= 1
##$TYPE= <nmr>
##$USER= <she>
##$AMP= (0..31)
100 100 100 100 100 100 100 100 100 100 100 100 100 100 100 100 100 100 
100 100 100 100 100 100 100 100 100 100 100 100 100 100 
##$AQSEQ= 0
##$AQ_mod= 1
##$AUNM= <au_zg>
##$AUTOPOS= <>
##$BF1= 200.13
##$BF2= 200.13
##$BF3= 200.13
##$BF4= 200.13
##$BF5= 200.13
##$BF6= 200.13
##$BF7= 200.13
##$BF8= 200.13
##$BYTORDA= 1
##$CFDGTYP= 0
##$CFRGTYP= 5
##$CHEMSTR= <none>
##$CNST= (0..31)
1 1 145 1 1 1 1 1 1 1 1 1 1 1 1 1 1 1 1 1 1 1 1 1 1 1 1 1 1 1 1 1 
##$CPDPRG= <>
##$CPDPRG1= <>
##$CPDPRG2= <>
##$CPDPRG3= <>
##$CPDPRG4= <mlev>
##$CPDPRG5= <mlev>
##$CPDPRG6= <mlev>
##$CPDPRG7= <mlev>
##$CPDPRG8= <mlev>
##$CPDPRGB= <>
##$CPDPRGT= <>
##$D= (0..31)
0 1.2 0 0 0 0 0 0 0 0.06 0 0.03 0 0 0 0 0.0002 0 0 0 0 0 0 0 0 0 0 0 0 
0 0 0 
##$DATE= 1585043317
##$DBL= (0..7)
120 120 120 120 120 120 120 120 
##$DBP= (0..7)
150 150 150 150 150 150 150 150 
##$DBP07= 0
##$DBPNAM0= <>
##$DBPNAM1= <>
##$DBPNAM2= <>
##$DBPNAM3= <>
##$DBPNAM4= <>
##$DBPNAM5= <>
##$DBPNAM6= <>
##$DBPNAM7= <>
##$DBPOAL= (0..7)
0.5 0.5 0.5 0.5 0.5 0.5 0.5 0.5 
##$DBPOFFS= (0..7)
0 0 0 0 0 0 0 0 
##$DE= 6
##$DECBNUC= <off>
##$DECIM= 24
##$DECNUC= <off>
##$DECSTAT= 4
##$DIGMOD= 1
##$DIGTYP= 9
##$DL= (0..7)
0 120 120 120 120 120 120 120 
##$DP= (0..7)
150 150 150 150 150 150 150 150 
##$DP07= 0
##$DPNAME0= <>
##$DPNAME1= <>
##$DPNAME2= <>
##$DPNAME3= <>
##$DPNAME4= <>
##$DPNAME5= <>
##$DPNAME6= <>
##$DPNAME7= <>
##$DPOAL= (0..7)
0.5 0.5 0.5 0.5 0.5 0.5 0.5 0.5 
##$DPOFFS= (0..7)
0 0 0 0 0 0 0 0 
##$DQDMODE= 0
##$DR= 18
##$DS= 0
##$DSLIST= <SSSSSSSSSSSSSSS>
$$ [...]
##$SUBNAM2= <"">
##$SUBNAM3= <"">
##$SUBNAM4= <"">
##$SUBNAM5= <"">
##$SUBNAM6= <"">
##$SUBNAM7= <"">
##$SUBNAM8= <"">
##$SUBNAM9= <"">
##$SW= 24.9337058887773
##$SWIBOX= (0..15)
0 0 2 0 0 0 0 0 0 0 0 0 0 0 0 0 
##$SW_h= 4990.01996007984
##$TD= 16384
##$TD0= 1
##$TE= 0
##$TE2= 300
##$TE3= 300
##$TEG= 300
##$TL= (0..7)
0 120 120 120 120 120 120 120 
##$TP= (0..7)
150 150 150 150 150 150 150 150 
##$TP07= 0
##$TPNAME0= <>
##$TPNAME1= <>
##$TPNAME2= <>
##$TPNAME3= <>
##$TPNAME4= <>
##$TPNAME5= <>
##$TPNAME6= <>
##$TPNAME7= <>
##$TPOAL= (0..7)
0.5 0.5 0.5 0.5 0.5 0.5 0.5 0.5 
##$TPOFFS= (0..7)
0 0 0 0 0 0 0 0 
##$TUNHIN= 0
##$TUNHOUT= 0
##$TUNXOUT= 0
##$USERA1= <user>
##$USERA2= <user>
##$USERA3= <user>
##$USERA4= <user>
##$USERA5= <user>
##$V9= 5
##$VALIST= <valist>
##$VCLIST= <CCCCCCCCCCCCCCC>
##$VD= 0
##$VDLIST= <DDDDDDDDDDDDDDD>
##$VPLIST= <PPPPPPPPPPPPPPP>
##$VTLIST= <TTTTTTTTTTTTTTT>
##$WBST= 1024
##$WBSW= 4
##$XGAIN= (0..3)
0 0 0 0 
##$XL= 0
##$YL= 0
##$YMAX_a= 72932
##$YMIN_a= -29412
##$ZGOPTNS= <>
##$ZL1= 120
##$ZL2= 120
##$ZL3= 120
##$ZL4= 120
##$ABSF1= 10
##$ABSF2= 0
##$ABSG= 5
##$ABSL= 3
##$ALPHA= 0
##$AQORDER= 0
##$ASSFAC= 0
##$ASSFACI= 0
##$ASSFACX= 0
##$ASSWID= 0
##$AUNMP= <proc_1d>
##$AZFE= 0.1
##$AZFW= 0.1
##$BCFW= 1
##$BC_mod= 2
##$BYTORDP= 1
##$COROFFS= 0
##$CY= 11.3945322036743
##$DATMOD= 1
##$DC= 2
##$DFILT= <>
##$DTYPP= 0
##$F1P= 16.9975609425685
##$F2P= -3.02152046262296
##$FCOR= 0.5
##$FTSIZE= 0
##$FT_mod= 4
##$GAMMA= 1
##$GB= 0.15
##$INTBC= 1
##$INTSCL= 1
##$ISEN= 128
##$LB= 0.24
##$LEV0= 0
##$LPBIN= 0
##$MAXI= 10000
##$MC2= 0
##$MEAN= 0
##$ME_mod= 0
##$MI= 1.114404
##$NCOEF= 0
##$NC_proc= 0
##$NLEV= 6
##$NOISF1= 3.799351
##$NOISF2= 2.8
##$NSP= 1
##$NTH_PI= 0
##$NZP= 0
##$OFFSET= 15.70392
##$PC= 1
##$PHC0= -9862.145
##$PHC1= 9.800819
##$PH_mod= 1
##$PKNL= yes
##$PPARMOD= 0
##$PSCAL= 0
##$PSIGN= 0
##$REVERSE= no
##$SF= 200.130013532006
##$SI= 16384
##$SIGF1= 3
##$SIGF2= 2
##$SINO= 400
##$SIOLD= 16384
##$SREGLST= <1H.CDCl3>
##$SSB= 0
##$STSI= 0
##$STSR= 0
##$SW_p= 3612.71676300578
##$SYMM= 0
##$S_DEV= 0
##$TDeff= 0
##$TDoff= 0
##$TI= <>
##$TILT= no
##$TM1= 0
##$TM2= 0
##$TOPLEV= 0
##$USERP1= <user>
##$USERP2= <user>
##$USERP3= <user>
##$USERP4= <user>
##$USERP5= <user>
##$WDW= 1
##$XDIM= 8192
##$YMAX_p= 0
##$YMIN_p= 0
$$ End of Bruker specific parameters
$$ ---------------------------------
##NTUPLES= NMR FID
##VAR_NAME=  TIME,          FID/REAL,        FID/IMAG
##SYMBOL=    X,             R,               I
##VAR_TYPE=  INDEPENDENT,   DEPENDENT,       DEPENDENT
##VAR_FORM=  AFFN,          ASDF,            ASDF
##VAR_DIM=   8192,          8192,            8192
##UNITS=     SECONDS,       ARBITRARY UNITS, ARBITRARY UNITS
##FACTOR=    0.0002004,     1,               1
##FIRST=     0,             0,               0
##LAST=      1.6414764,     0,               0
##MIN=       0,             -29412,          0
##MAX=       1.6414764,     72932,           0
$$ Real data points
##PAGE= N=1
##DATA TABLE= (X++(R..R)), XYDATA
0@%%%%%%%%%%%%Qj6J6j6J6j6K4l2L2l5M3m8N6o4P2q8R9j07J20j36J52j73J97k17
36a13K41k69K98l30L65m05M49m97N52o13O79p54Q42r44J064j207J381j602J888
55A025k275K833l712N314r158L4593M4312o0316l1806K3395L8492o866j8346l255
69A4230L871q010M657J8105K864k5689j3702J8487K2822o316j9325o000Q350N840
83B0184J747K80k188o061l078K524N998M635j441j0323q449P553J6690P24j8379
98A0416j0899J1350J4108k013r405l200n81j153O006R794l977j6320l571J5367
112A5922R144j0386r870N285N604m916j805Q172J437j2153n842J1555R967o885
126A5229j0066J359M344j375J228O594k348j3769m027J5326J2324j0046j7369
$$ y = [0, 0, 0, 0, 0, 0, 0, 0, 0, 0, 0, 0, 0, 8, -8, 8, -8, 8, -8, 16, -16, 16, -19, 24, -24, 32, -32, 40, -48, 51, -56, 64, -72, 80, -93, 104, -113, 128, -141, 157, -173, 192, -213, 236, -261, 291, -322, 357, -397, 445, -499, 565, -642, 739, -863, 1025, -1250, 1583, -2129, 3185, -5973, 28620, 72932, 12616, -19190, 4205, 42697, 35831, 17485, 14230, 18101, 10091, 14748, 32853, 35717, 10028, -3674, 14813, 37635, 31319, 11994, 5994, 14344, 20184, 21931, 22211, 20023, 13962, 10884, 13408, 19406, 24041, 22600, 12277, 3828, 11381, 28071, 28795, 10416, -483, 10867, 24975, 22962, 13557, 10357, 9776, 8623, 14629, 24423, 20446, 4126, 555, 15922, 25066, 14680, 4810, 10095, 15699, 10783, 8978, 17150, 18587, 6434, 592, 12147, 22114, 15229, 5163, 6522, 10866, 9491, 10719, 17313, 14965, 1196, -2831, 12495, 24819, 14773, -2596]
139b596m51J3800Q044n021r017m374K475P337N264l816r290l412N915P096O36
154A2590n195o119j900N277P481m72r029n013N631O170k408m348J434J495m143
169A451j847O810M762p397r058L732J0312R25p889l933K698K058K24K013N87n324
185A24m757M286P749o87p935l413M458M381p32k736j679o74O38K346J440j813
201I96k805m53J321J157Q69K76j943k894K21L785K254k325l625q05J981K724J399
218B133j923m445j665M465N301j492o372k484L948M200j91k717k198q17J379L447
234E69J464l635m179J296M824J223l297k172J078J108j63O55J108j277k649J96
250c851L090J605j853k270j77J148J211R03l96k137j490J546K944M83k609k199
$$ y = [-2596, -3047, 10753, 18797, 13776, 4759, 385, 2860, 10197, 15461, 11645, 2355, -1057, 4858, 11954, 12590, 7395, 1276, -624, 4653, 12134, 11662, 2633, -2380, 3251, 9421, 7013, 2665, 4099, 5594, 1451, -396, 6414, 11176, 3779, -5279, -1547, 8765, 9690, 1801, -2132, 566, 2624, 2848, 4861, 5448, 124, -4633, -347, 7402, 6715, -1220, -4633, -175, 4206, 3474, 738, -941, -1615, -977, 1369, 2809, 996, -1809, -2262, -941, 216, 1085, 1361, -582, -3476, -3255, 530, 2784, 459, -3166, -3971, -1990, 734, 2133, 210, -4235, -5900, -1435, 3866, 2374, -3998, -6482, -2534, 1666, 1475, -1242, -3440, -4257, -2878, 569, 2033, -1602, -5781, -4485, 339, 1562, -1735, -3907, -2829, -1721, -1884, -1229, -121, -1398, -4047, -3851, -761, 844, -1009, -3279, -3456, -2308, -1097, -194, -590, -2727, -4217, -2671, 273, 756, -1853, -4052]
266d052O13K362J621p00k337j462J266K644O36k027j728N96J496N02k89l88o25
283a872m40P88J344j7j396o34P72O84j4J56K09q33j038P48J951K65j860j236R56
302a467J503J98p30p12l88L36J257P68j071j688J60J836R18j012j135m0P84M44
320c9J40j48n96l62M38R45J4p49m71K83M80J88Q4j94m76j96N37N79k6n26k78J45
342b28L07K67K9l97m62J74P09K77n00n41O9L86K46J44m7m58m18L46P85J07p45
363E0m71L65N51K6k64j88j39j7L49M12k24o68j60N89M09k42m07JJ72J7J9Q9n2
386B17k24n1K03J21j28j00L6j4r9P9K20L6l07k23J64L45J09k47l14k4K79K67r9
409B46l44j70J85K71%k13j39J8R6J07J7j33j09N0J20k6j14M0J24j05k04K9K96
$$ y = [-4052, -3439, -1077, 544, -156, -2493, -3955, -2689, -45, 591, -1436, -3164, -2568, -1072, -570, -859, -1247, -1872, -2312, -1524, -180, -197, -1593, -2227, -1455, -771, -785, -629, -420, -1253, -2291, -1543, 408, 673, -1187, -2423, -1467, 36, 234, -496, -1208, -1596, -1260, -3, 765, -306, -1994, -1834, 2, 920, -92, -1227, -1267, -483, -39, 101, -47, -643, -1005, -567, 378, 392, -357, -828, -545, -65, 123, 207, 13, -463, -659, -122, 457, 431, -95, -373, -228, 79, 346, 375, -22, -484, -310, 399, 676, 176, -365, -296, 90, 336, 480, 433, -25, -443, -97, 688, 795, 50, -421, -56, 495, 521, 257, 69, -70, -87, 262, 674, 450, -218, -378, 211, 620, 378, -29, -28, 144, 161, 180, 269, 217, -7, -58, 145, 266, 138, 38, 74, 60, -39, 40, 260, 296, -11, -234, -70, 275, 384, 137, -177, -201, 78, 345, 246, -98, -268, -83, 188, 188, -25, -164, -146, -50, 57, 74, -59, -168, -118, 2, -24, -138, -98, 26, -79, -283, -254, 42]
432D2R8k96k44J53K89L1j72j93oJ30J98N4k40k92J09M01J37l29l31J24L17P0k10
455a60j71R7J36L0r9j06L3J06O5p6r3K1J22K9j47j18J14K32J2k59k23J38L54R1
479A28l69l34J87M64J06m20l51J11M06K12j95l57j50K66L70L1m14k87L03M55n6
500A06m99j99L59L71j28l27o4K22J38j03j39JJ38J36o7k30j22K13K97o5l55j53
522d70K91L31p2m35k21L22M72K0m75l47K36N12N7m32k90K38L47jk77j72M4J96
544a26J70l9k18j57J73K34j01k47R7L44J3m25k07L69L85j79m36r6L36L05n7l53
566b15k83J53N07K63l75n84mO32L74l46n59l3M84L32j93m61j67L09M01o1l81j67
588c74K51K19j45k32Q3K48M9k00j82K2J64J90m4l27j88L36M38j94o34j61O13M66
$$ y = [42, 140, -156, -400, -247, 42, 73, -99, -292, -298, -168, 30, 84, -156, -448, -339, 62, 199, -130, -461, -337, -20, 50, -160, -331, -234, -98, -68, -167, -273, -240, -134, -69, -145, -238, -217, -95, -66, -213, -331, -217, 15, 27, -232, -455, -317, 37, 128, -241, -575, -388, 76, 182, -238, -589, -478, -72, 140, -55, -412, -562, -296, 74, 105, -309, -596, -293, 162, 106, -393, -592, -233, 138, 10, -317, -381, -159, -21, -124, -263, -262, -124, 12, -55, -285, -407, -194, 103, 38, -317, -470, -179, 152, 80, -355, -576, -254, 218, 238, -237, -584, -348, 164, 221, -211, -501, -263, 84, 83, -194, -366, -322, -126, 44, 5, -213, -370, -197, 37, -64, -311, -214, 130, 143, -282, -489, -120, 265, 86, -350, -446, -110, 195, 138, -215, -498, -345, 162, 425, 50, -534, -538, 94, 468, 122, -437, -470, 14, 346, 153, -308, -475, -166, 235, 174, -207, -374, -123, 96, -49, -281, -198, 50, 99, -101, -283, -261, -97, 93, 49, -278, -466, -130, 308, 114, -520, -681, -68, 398]
610C98k92n56p2L73K15r4j64j10K7J87J48j79l32L1L97J49k94k81J93K26r9k22
632c51K0K25J10j42k21n8K28K67n1l86j87L86M26j77n78j28M67M15j61m55k20
653e71K28M03J34l29m75O0O04L18m26o05O6O01K88k64m02q4K34K55Rk38j82J44
675b32K95k5l18q1L26J91k20k50J66K79m0k71j05J71K41Q1j76l29q4L66M04j59
697B30n26j38M73L77k06m13r1K79K68L5k33k65K8L23K13k43l27J28L68pl56p9
719a62L04J69j88j91N4K04O8j03j68p5J68L02Om12k74L04N13kn01l18K78M63J24
742E63l21m60qM92M48k31o16j74N33M24j96m51r8K79K23qj71j81l1K38K14j28
764C40l09kK88Q7k43q9K06J40k21j93J51K43Kj90j52OJ67K23m6l73k10K93M41
$$ y = [398, 106, -450, -522, -149, 66, -28, -192, -302, -275, -88, 60, -119, -451, -420, -23, 126, -168, -449, -256, -30, -129, -351, -331, -106, 4, -138, -359, -417, -189, 78, 27, -359, -546, -160, 266, 89, -489, -617, -150, 265, 104, -351, -571, -343, 60, 194, -135, -610, -550, 54, 372, -54, -659, -593, 8, 296, 32, -370, -454, -220, 35, 44, -194, -376, -232, 63, 38, -280, -361, -35, 156, -64, -314, -148, 131, 91, -180, -285, -114, 127, 208, 32, -297, -381, -15, 389, 230, -296, -434, 39, 416, 210, -203, -294, -15, 253, 288, 55, -210, -182, 141, 354, 111, -216, -88, 280, 273, -83, -162, 142, 311, 123, -68, -14, 190, 258, 155, -13, -88, 80, 382, 388, -24, -298, 6, 519, 517, 16, -302, -24, 439, 563, 242, -218, -226, 266, 714, 483, -133, -307, 226, 650, 454, 3, -95, 184, 407, 399, 228, 47, 16, 254, 468, 340, 31, 29, 317, 404, 161, 72, 278, 418, 197, 4, 155, 398, 400, 210, 58, 64, 231, 454, 408, 35, -175, 118, 559]
787E59o4m90k17L23L54j9k80j94J8K35K03p2l39j34K84K81j39l04MK05N4j38o
810A24R8Lj24k7O0O4N4Pj37j85J10L28M3m18k49L01L92k9l84k07J36K74J85j02
834C17l48k17K44M35Qm53k66K42L29qk32j25K6P0R6M8q4j53PJ27Ko6L2P7j09k07
860b08J19K78L1k86j94J18K35R1j09k19j39J10L45J14l58l42J30M17J31l25k59
881c20L1K08J49lj81j77J7K30J09j39k00M3J38J2q3J6N3o2j01N1J25J1r6p8l0
906b77M8J49N6j43k20J5L10J46k18k87J8K54J63m8k17j60P4K58J58j77k83l4L10
929a05J52j06k71pJ08M8Q5k3q9j43J43J48L3j05j56J15O3j17J24L6k1k03k8K11
953a08J64j03j96p3J02J76R5j31j99o7K23K46l4k98j61J50K66O6j65k12k6J64
$$ y = [559, 495, 5, -212, 111, 465, 446, 166, -28, -10, 225, 428, 356, 17, -117, 167, 448, 309, 5, 9, 214, 268, 130, 124, 222, 225, 101, 74, 134, 198, 252, 259, 122, -63, 47, 375, 418, 0, -249, 52, 444, 415, 31, -176, -40, 234, 419, 317, -31, -248, -4, 431, 439, -14, -280, -38, 291, 283, 51, -74, -48, 22, 118, 166, 82, -71, -64, 63, 65, -1, 31, 108, -1, -208, -89, 189, 220, -66, -260, -142, 93, 184, 75, -144, -283, -173, 172, 286, -72, -414, -284, 133, 264, -61, -320, -289, -81, 68, 65, -116, -293, -276, -46, 63, -76, -276, -233, -95, -83, -166, -150, -97, -159, -260, -209, -84, -73, -169, -247, -277, -229, -80, -24, -167, -387, -372, -62, 84, -134, -421, -403, -149, 14, -34, -251, -411, -337, -79, 79, -98, -381, -415, -105, 47, -59, -330, -337, -229, -181, -96, -119, -208, -351, -208, -60, -27, -132, -288, -173, -110, -227, -103, -67, -88, -291, -319, -108, 56, -47, -243, -316, -214, -38, 57, -74, -273, -340, -117, 129, 95, -203, -364, -214, 52, 118, -47, -259, -285, -121]
975a21J89Pk03j34Q6J88N2j10r4J6K0O2P3kp7o9J7R8N8l4m5p1l3J06J50k3k01
1002i5j24J18K35L4j71j78K0J65J49l7j56j68Q6K26P5j84j74L4J75J06m6j38p9
1025a27N4Q8J02n5j04l7O0P1L7n4l6m3J6M6P2rj18m9M1J06N6l2j19n7P2J45K9
1052A55j06j45K9J48R3o3j32n8P4J25O4p6j50m7J32J35kj36p7M1R9L5k4q0m2K7
1078A9Q8K4l7q4j6N7L5L0k5n3o0L6Q3M9l3q1k7N6Q9jo6q2JJ02P5k2j18q7P0J28
1108A50K7p0j03j5Q4P1kr3o2M2O1L0l6n1l3K9M7L8j2o7n7L0O6L8k9n6l4K4M9N6
1138A22n0q7m4P8J01Kj04j06K8J19O6n8j06m5N9P4L9o2q3qQ8N9l0p7m1L6M9L6
1166E5k3n1j4J2J5K0m%l8k3L0N1Kl6m9JM9N9j6p0o2L6Q8L5n5r2j4Q4O6k8p1m2
$$ y = [-121, 68, 75, -128, -262, -176, 12, 64, -46, -140, -124, -104, -42, 31, 29, -48, -117, -100, -2, 56, 22, -23, -94, -127, -21, 129, 106, -95, -219, -101, 134, 168, -3, -181, -161, 4, 153, 116, -40, -208, -122, 104, 179, -5, -179, -145, 30, 136, 90, -48, -127, -73, 15, 117, 62, -42, -79, -19, 52, 89, 35, -1, -44, -28, 18, 90, 81, -37, -86, -45, 61, 117, 85, -34, -91, -19, 126, 155, 49, -96, -67, 81, 174, 111, -21, -79, -5, 120, 184, 108, -42, -89, 43, 178, 176, 40, -37, 4, 103, 138, 114, 34, -8, 19, 107, 131, 94, 10, -6, 51, 86, 116, 91, 38, -22, 14, 97, 146, 113, 32, 5, 61, 150, 149, 83, 1, 2, 104, 179, 157, 39, -48, 22, 150, 177, 107, 4, -11, 73, 144, 142, 49, -13, 29, 90, 120, 84, 33, 0, 29, 76, 114, 102, 35, -22, 8, 74, 112, 83, 27, -7, 17, 66, 122, 72, -15, -59, 19, 120, 122, 18, -88, -60, 59, 125, 67, -39, -84, -25, 49, 88, 26, -57, -65, 23, 82, 52, -25, -66, -30, 19, 55, 32, -19, -33, -21, -6, 14, 10, 10, -28, -51, -21, 30, 32, -4, -53, -52, -3, 56, 40, -30, -92, -56, 32, 67, 12, -80, -94, -10, 56, 28, -43, -85]
1198h5M4O6J8m4n0j4N5O0j4p5k5K7N3jl6k1J6K8r%LJj9jJ3J4Pj3k4j5N5K9j4l6
1232gm6K7K9M7l7p5J0O0N6m6p1k1N2P7j0o8m3K0L9L2k2k9k0J3L3Ml5k2L6jOj4
1264b6%J8oj9JK1K6j2m4k9L5M6jl2m4NM8M1l6n4j8N3N2qo2l5L2O9kl8l0J6M5q
1298Dk8j0ROQl0JJ7K6kl7nK3M3j8m4k1N1K9j8m1k0L2L6J1l4l3J8L1L9l5m7KO5
1332B8K9k8n0mN2K4j5l9JK5L7k7j8p%L5K2l2l0K2K6J2l8k9L3M5om9j1K3L0j6j9
1365B6J6MnLOrl7J5M0ol8j0M1J6k5l3K4M4k0m7oM0L3l9k4J1OJ9nok0j3L0L0j1
1400E0m3k1M6M1k3n5oL9L7jn9k1N5J9k2l2QK7mpNQk1%J6ol2nN0J5n6l9M8L3po1
1436b4RO1qk3l4K9J9%lj3j7KK6M1k2p8J8N9K7l7m2ML0J8j5k2RJ6Kj7PLPnqmK7
$$ y = [-85, -41, 25, 43, -1, -51, -65, -10, 50, 36, -39, -64, -37, 16, 15, -21, -42, -26, 2, -7, -7, -4, -3, -22, -23, -10, 4, 11, -2, -26, -41, 14, 43, 29, -7, -53, -26, 3, 50, 13, -62, -52, 8, 64, 18, -53, -74, -22, 55, 45, -23, -66, -46, -7, 25, 3, -26, -46, -33, 0, 4, -31, -53, -17, -18, -12, -26, -26, -8, -14, -33, -32, -11, 15, 3, -41, -70, -35, 11, 10, -22, -66, -61, -13, 28, -8, -62, -80, -27, 25, 17, -45, -80, -48, 21, 19, -19, -49, -33, 12, 4, -24, -34, -25, -19, -11, -41, -40, -23, 3, 1, -36, -41, -18, 25, 7, -37, -58, -7, 22, 4, -37, -57, -25, 11, 22, -12, -45, -27, 4, 43, 8, -39, -37, 28, 57, 29, -21, -25, 27, 51, 36, -3, -2, 23, 60, 33, 15, 8, 8, 43, 65, 33, 3, 25, 51, 63, 25, -4, 29, 74, 68, 19, 8, 31, 61, 45, 26, 42, 46, 41, 44, 50, 41, 4, 19, 59, 53, 15, 5, 46, 62, 37, 4, 28, 72, 52, 5, -1, 39, 72, 33, 9, 20, 26, 45, 40, 34, 14, 1, 31, 61, 50, 7, -14, 32, 73, 50, -5, -11, 28, 65, 64, 5, -16, 39, 58, 36, 4, 12, 39, 35, 28, 33, 41, 20, 20, 36, 30, -2, -7, 43, 58, 2, -37, 11, 44, 37, -24, -15, 46, 38, 15, -19, 10, 29, 29, 26, 13, -4, -2, 24, 65, 43, -35, -17, 42, 69, 32, -10, -6, 24, 42, 27, 5, 14, 30, 32, 15, 22, 25, 32, 27, 19, 15, 42]
1473D2Nk2j8nJ6J7J2qn5k0O4N6l7q7KP6N6o1m9jL1J3nJ3k5m2J8O0J1m7m2K4M0
1506C2j8l0J6J2j2j6K5J6rk8rJ8K0%j8j8oM1Qj6l0j4L6J8J2k0l8k8L6O7j1n2m0
1539e6M2L4j5l0OJ6rnK1Jm0k5M5M5m1k9pL6plK2pl3k2N0N1j8o3j4K8M0Mj4j9k7
1574d3J8M5K1l9l2oN3K2k2k4j1jL0L6k7l9%K4L4kj3j5l4OM8K8k4m5l1L6N6rl3
1607Gl0j9K3Q7lo6n9K7P8L8n5n3j0L4N8pl8m0j9O7M8j9o7k8M7L0K0l1j7l1RK6
1639GM2j6l6k9K7L2J2j3m3k1L5O2Qn6m8QM4M2mo6k3NN9M1m8o0j4N2L0jm5k3nJ4
1673c1L9J5k4n0nL9L4lk5l6qL0M4J3m5n9LQ7N4m3p9k0N0M5J7m8n8pN2O3k0o8k3
1706f7L5O6Ll9l7j7L3K8K9l9k6j2K8K2Nk0j7k8K6M5K4l9l5j1L5L1kl5l5jN5L9
$$ y = [42, 47, 25, 7, 2, 18, 35, 47, 39, -16, -36, 28, 84, 47, -40, -38, 38, 94, 33, -16, -17, 14, 27, 22, 35, 10, -32, -14, 46, 57, 10, -32, -8, 32, 14, -16, 0, 12, 0, -16, 9, 25, 16, -12, -21, -3, 17, 17, -1, -19, -25, 16, 24, 8, -22, -36, 0, 18, 30, 10, -28, -56, -20, 47, 36, -16, -56, -14, 20, 5, -25, -19, -3, -12, -17, 4, 5, -35, -60, -15, 30, -11, -40, -47, -11, -18, -21, 1, -6, -39, -61, -11, 40, 22, -41, -55, -27, 13, 17, 3, -16, -43, -25, 20, 41, 2, -30, -36, 17, 39, 17, -7, -18, -19, 11, 47, 20, -19, -19, 5, 39, 37, 24, 9, -25, -19, 29, 57, 33, -12, -43, -7, 49, 40, 7, -23, -42, -19, 68, 65, -1, -60, -33, 45, 83, 28, -25, -35, -1, 57, 50, 12, -28, -47, 20, 68, 49, -18, -46, 1, 31, 51, 20, 3, -28, -19, 7, 49, 33, -3, -32, -5, 27, 39, 26, -17, -38, -3, 59, 67, 11, -37, -29, 15, 57, 53, -13, -36, -31, 28, 69, 21, -39, -53, -1, 29, 28, -17, -40, -45, -31, 8, 23, -1, -51, -56, -17, 17, 14, -11, -47, -55, -25, 19, 32, -13, -72, -69, 18, 72, 29, -50, -70, -20, 25, 42, -6, -64, -71, -19, 44, 24, -44, -67, -32, 34, 37, -2, -39, -56, -23, 5, 34, -5, -31, -43, -15, 7, 12, -8, -25, -53, -27, 18, 42, 3, -32, -43, -8, 23, 21, -14, -49, -50, 5, 44]
1738D4l7m6k1K8N8lm3l1NM6K1Lm5l6J0N1K1k1l2lJ2K6Nrj5k8J6L4J7l2k6rK7L7
1772B4jl3l4k6M3N8qm9l6PM6L4l2m3j7L2M3Pl1m1j6M5L3jk8k7J3K3O%j6j2j3L3
1806a7RMj8j9%J6L6km8qK3K7K4l0l1mK1K9J6l1k3j2N3J1nk6k3K5K1mj0rj7K2N
1841EJ1j6j6mK9JLnj1kLKLKj7mJ2K5Kj1j7pL5Lok2NK1nljj1J1pKJ4k8NLK5nj5
1883IqJ7Mj9POqPMqNnoJ8j4mkJ5qorPJ5oj0Lj3lJ2Jqj2J0JM%k1RJ9jmk2QJ7lk6
1929b8PJ7J1rk0j1L5NPk1k3J0J4Pj0k2lK1L6qm6j5L7L4j4l0k1K4J3lqKqnJ1PO
1966amoJ2j2mJ4Qk1k2%L2K5k0l9NL0K2k0l4j7M2L5Kk4l1qN2J9l1k4pK1L5k2k4
2001a7QK3Rj5okK5nl1QK5J5k3j9j3K3K6Ml9m1J2N0M3o3n7K0O4M0m9o8j3O7N0j4
$$ y = [44, 7, -39, -60, -32, 26, 23, -20, -51, -46, 0, 21, 24, -21, -57, -47, 4, 25, 4, -28, -31, -19, 7, 12, 3, -12, -40, -24, 10, 27, -5, -31, -40, -13, 24, 23, -10, -44, -70, -27, 31, 23, -26, -62, -55, -9, 25, -7, -50, -67, -35, 8, 15, -16, -57, -73, -28, 5, 4, -24, -51, -38, -15, -9, -9, -25, -37, -50, -17, -8, -4, -22, -41, -41, -25, 11, 9, -39, -47, -24, 3, 27, -3, -34, -38, -17, 12, 28, -3, -26, -38, 15, 26, 21, -5, -28, -3, 18, 14, 4, -5, -22, 0, 5, 16, 0, -16, -20, 9, 10, 13, 8, -3, -5, -2, 0, 3, 5, -12, -16, -4, 21, 23, 12, -5, -12, 23, 26, 20, -2, 3, 24, 19, 16, 15, 4, 15, 8, 10, 24, -4, 1, 4, 29, 24, 9, 1, 18, 22, 3, 10, 16, 8, 15, 19, 11, 16, 11, 5, 23, 9, 5, 3, 18, 10, 4, -5, 2, 17, 11, 1, 4, -9, -12, 0, 1, -7, -19, -9, -8, -4, -4, -25, -16, 3, 2, -2, -24, -16, 1, -2, -28, -21, -4, 7, -2, -22, -33, 2, 7, 14, -7, -30, -20, -6, 1, -9, -31, -34, -13, 23, 15, -31, -46, -9, 25, 11, -19, -40, -16, -3, -6, -14, -12, -20, -25, -14, -7, -1, -5, -11, 1, -11, -15, -1, 7, -14, -36, -36, -4, 21, 1, -38, -33, -3, 19, -1, -35, -52, -10, 25, 27, 3, -28, -36, 16, 35, 4, -20, -27, -6, 29, 7, -17, -9, 14, 23, 8, 2, 0, 25, 20, -11, -3, 22, 37, 14, -5, -18, 5, 31, 35, -4, -45, -33, 17, 60, -3, -60, -40, 24, 64, 15, -53, -66, 1, 51, 37]
2035C7n1m3J7N6K0m2l8OL4K8k1k5J2J8j1j2J0J6jk3k0J5L1K5k7m7j0O0M5j9p0
2066c0l5O1P2j4p1m1K0O2K8l0o5jM3N5l4n2JK1L3j7j6mNJ6pj5J5J8Mj6m9L6N7
2099E0Qp5l1M3O1J1o0n1K0O0L8l8n3l9P0O5j1q6k5M2O4%o1k2K2L3J0j9k3LL2N
2131D3l1rJ7M1k5m7QN6Rm5m5OM7K5k0o2j1L5N8jo5m7L9Q1Ko7m9K2N7K8l8m3j2
2164d3M3L1pm4j0M0L0l3qk8N3lk8J4k4M2K5kj47J28%K7n2k0l5J09J2n6n4pO8K8
2196D9k5n4k2N0K6Km7k3K1M9lm1k5K0L6nk2k2J6K0j3j0nPL6Nn1j2K9N1k2n1oM9
2230GL5k7k9j9L2L5Jl1k8J1L6J4l1l9J6L4J2k0m3L0J5Rmk4lQPJ5l1kK4J2k4k3
2264b5K1K3jk3k4OM1j9j2lqK7J7j5l7oL9J7j0l9QK2K3j0l2jJ7K5Pl8j6J7L3rk5
$$ y = [37, -14, -57, -40, 16, 36, -6, -44, -38, -4, 24, 3, -22, -10, 8, -3, -15, -5, 11, 10, -13, -33, -18, 13, 38, 11, -36, -46, 14, 59, 40, -30, -65, -4, 68, 54, -17, -58, -38, 24, 52, 22, -43, -44, -1, 54, 20, -32, -31, -10, 23, 6, -10, -14, -9, 7, 0, -15, 0, 18, 22, 6, -43, -7, 50, 58, -17, -48, -5, 56, 67, 7, -44, -24, 36, 74, 36, -17, -56, 14, 79, 68, -18, -43, -1, 63, 63, 2, -20, 2, 35, 45, 26, 3, 6, 38, 43, 12, 3, 20, 61, 36, -11, -3, 53, 62, 17, -28, -22, 25, 50, 30, -32, -43, -8, 50, 49, -16, -63, -24, 57, 59, -8, -57, -35, 22, 50, 12, -31, -43, 0, 31, 24, -20, -30, 10, 40, 7, -1, -29, 24, 21, -7, 7, -17, 25, 50, 48, -99, 29, 29, 56, 4, -16, -51, 58, 70, 14, -40, -47, 21, 49, 24, -30, -52, -2, 24, 26, -21, -44, -23, 26, 23, -18, -43, -23, 13, 8, -14, -36, -20, 0, -13, -23, -28, -21, 15, 20, -31, -43, -14, 37, 15, -36, -42, 7, 42, 15, -14, -33, -1, 34, 35, 4, -24, -13, 23, 37, 6, -33, -17, 17, 29, 9, -34, -4, 11, 20, 16, -8, -11, -3, 4, 19, -12, -14, 10, 22, -2, -25, -4, 19, 18, -5, -29, -23, 18, -1, -13, -16, -24, 3, 20, 5, -32, -38, 1, 18, 8, -31, -23, -1, 22, 12, -20, -21, -4, 21, 28, -10, -26, -9, 24, 15, -10]
2299a0oJ1K2j8rjK0pJj7MQMLkk2J0J1rk2J0J5kj0prM0j5LnrNKOj7lmK2mroJ4j0
2342b2J1kpKNjkOmJ7pnrJ4LLj3jJ6lpLPNmnmj3MK0Nj4j4J3J0mj5qjJ5llQj6K0
2387@j0J0j1OOj3jLJ6j1jKO%j1j3LJ4lRLj6j1J8J0j3j6J0jJ7rj1QJ0rJLp%J9q
2428aoKpPj0qJ8nkj4pJ8K0nj2k8RRJ7j7k4ML1J4j7m0NL3Rjk2pK3J2Nlj2j0RPl
2469ipRJ0j3%LJ0morJ1OK5j0k5j2K3K5ql7oL1J8j6j6qJ6J4Qk3k1mL7J9k4k8oL2
2507EJ4rk1PJ0nrPQO%j2kNlRoj5OK5Qk6qJ5J3Pj5k3JK6K6k1k3nK1K3k0k3j4K3
2547EL7j7j6j4K1KQj4k3KL0kk8qL3j1j0qJ3J0J4j9k0QK3Mkl9k2L1K4Kk7k5K0M1
2583B3nk8k0J1L9Mk4qJ0qJ8qLj7J8J7j2kmJQlrKKJ1j7j1nK7lj8j2K0J5k3roJ8
$$ y = [-10, -16, -5, 17, -1, -10, -11, 9, 2, 3, -14, -10, -2, 2, 5, 3, -19, -9, 2, -7, -29, -19, -4, -6, -16, -23, -32, 8, -7, -4, -9, -18, -13, -11, -5, -22, -25, -29, -7, -11, -20, -26, -12, -22, -11, -13, -20, -18, -13, -14, -16, -10, -14, 3, -4, -9, -18, -4, -1, 2, -11, -12, 4, 1, -6, -3, 4, 9, 5, 0, -4, -17, -13, 7, 12, -2, -16, -3, 7, 3, -12, -20, -21, -6, -9, -12, -4, -20, 0, -10, 0, -11, -5, 1, -12, -13, -10, 6, -5, -6, -4, 2, 2, -9, -22, -19, -5, -8, 1, 4, -12, -23, -5, 5, -8, -24, -14, -15, 2, -7, -18, -10, 0, -9, -8, -5, -12, -12, 7, -1, -7, -5, -12, -5, -15, -23, -5, -10, -12, -26, -33, -15, 5, 0, -12, -40, -31, -22, -5, -22, -46, -42, -11, 3, -14, -54, -49, -16, -7, -8, -30, -37, -14, -2, 3, 0, -12, -22, -13, -6, -9, -16, -7, 3, -10, -10, -7, 3, -1, -7, -16, -5, 1, 26, 16, -9, -21, 2, 27, 19, -18, -24, 7, 25, 9, -7, -15, 1, 15, 23, 0, -21, -25, 12, 31, 7, -21, -27, 5, 19, 10, -11, -4, 6, 1, -8, -1, 7, 13, 13, 1, -1, 4, 1, 10, 4, -11, -5, 20, 28, 2, -6, 9, 22, 29, 14, -9, -8, 18, 44, 23, 0, -5, 16, 39, 19, -4, -18, 5, 42, 25, 9, -5, 16, 18, 26, 12, -11, -9, 21, 19, -9, -17, 16, 5, -5, -13, 0, 10, 24, 5, -15, -7, 16, 20, 18, -21, -43, -12, 12, 14, -13, -38, -18, 23, 18, -10, -30, -19, 20, 24, 0, -8, 2, -6, 12, 4, 7, -10, 8, 25, 13, 11, 7, 8, 16, 13, 4, 6, 8, 19, 2, -9, -14, 13, 10, -8, -20, 0, 15, -8, -17, -23, -5]
2622eOQj0qj2K3J6j4k4rK4K5j0k6JJ5J2j6rLJ2NqMJlmN%qRNj9rLK4Qj1k5NM0O
2664C0j7l4J3J7RJl4j4K2J5jk4j0OJ4Klk6MJ8Mj5KRkJj0oJ8J3j2k2QK4Pj8j5j
2702b7K9Rok2rMK6Lk7j1%L8Pk6j1j6L8Qj2j5POOJ2k8J4j3J8roOLjMlLJ0k3RnM
2743fK6k0j5j5K0J5J0j9k1LL0K4k7k0nJ9J5J9l2j6NJ7K8rj1j6J3QLj4jNonJ3j
2779A4Jj0oJ6J4pj2Kk3M5k0nj5RJ6L8Po5J5o6L7P5m9k4j5j1P9kn6JPPj5J0rJ6
2815aj3O1j8qk8j0j2K3L7l6J5m0L1j3oL3o9l3J1J09l4n1J00j07j0R7j4k1l6L2
2845a1J5O9o0l5NJ0K5j2qk2J1J4J2k3KoNJ2nJ6l1NpJ6K1j7j8kJJ1J6qj3j7J2L0
2881A3Mk1j9LL0Qj7qj7J0L1J3k7j3nK8MlKk7JK4JPk0rJK2qk1K2k3nKJ8kj3k3K0
$$ y = [-5, 1, 9, -1, -9, -21, 2, 18, 4, -20, -29, -5, 20, 10, -16, -15, 0, 12, -4, -13, -10, 2, 7, -1, 3, 4, 1, -3, 2, 2, -6, 3, 8, -11, -20, -17, 7, 15, 4, -21, -16, 24, 30, 13, -21, -8, 9, 18, 19, -15, -29, -7, 8, 7, -17, -27, -21, -7, -5, -8, -34, -30, -12, -8, -23, -21, -12, -14, -13, -23, -29, -11, 2, -10, -32, -24, 0, 7, -11, -26, -27, 2, 11, 5, -17, -26, -22, 4, 7, -20, -31, -31, 7, 14, -12, -23, -39, -1, 7, -5, -20, -13, -7, -1, 11, -17, -3, -16, 2, -7, -13, -7, -4, -5, -1, -4, -1, 9, -14, -5, -10, -6, 20, 0, -15, -30, -10, 5, 15, -4, -25, -22, 8, 32, 5, -15, -20, -1, 14, 33, 1, -15, -10, 7, 35, 26, 15, -1, 12, 20, 23, 9, 8, 13, 7, 2, 15, 14, 15, 5, -1, 15, 29, 22, 10, 12, -11, 34, 14, 9, -6, 3, 19, 57, 64, -1, 14, -52, -15, 60, 11, -13, -28, -39, 40, 38, -18, -17, -10, -3, -18, -8, -17, -1, -14, 47, 29, 21, -7, -17, -29, -6, 31, -5, 10, -30, 1, -12, -18, 15, -54, -87, -76, 33, -1, -52, 48, -59, -69, 28, 14, -7, -43, -11, 4, 73, 13, -22, -17, -7, 18, 6, -2, -24, -13, 1, 13, -10, -8, -14, -9, 3, -2, 14, -17, -12, -19, -3, 18, 1, -17, -19, -18, -7, 9, 1, -12, -29, -17, 13, 17, -4, -23, -20, 10, 18, 1, -7, -24, -14, 17, 30, 3, -10, -15, 13, 17, 14, 16, -11, -10, 14, 15, 22, 2, -7, -6, 16, 8, -13, 9, -14, -19, -17, 1, -1, -14, -37, -17]
2920a7J9J0j8k0OJ6J1Kj5l7K0K5J9k1l5RK1J6j1oj4rK4%mj5J3pK1j6KpRj2J3P
2956aJ5k7j6K1J8pjj0k3J0K3J4j5m1LL2J7k1j1j7JK1K2ml6jJ9L3k0k1rJ6K0lp
2991fj4PlJ4J2j9qmJ2J2jLJj5lRJ1lj6mK6%mPk2nJ1K3Lk4j2QK3Nj5j9LK6pJ4l2
3032frJ2L0oj8j6J0J3KLlj2j3RLLLqJ6Lk2J7J0l3oJ6J7jj9j0J7PJ8j4k0PoK3M
3071B1k8j9PL3J6j6k3lJ6J2okk1OK3o%k1OJRJ0j5M%j8J4PK%mj9J2J2J0k5k8J7
3109a6L3J0k1l7OK7J2%j1j3LNK1Kl3kK7J3j1mj8QK6kojrj2J9Olkpp%NJ7nj9j8
3149a7K5RJ3k3k4PJ8J6qk5j6L8K1ql9mK2K4qoj3J0kJ8qpk3K6J6k1j6mJ8J6rk1
3185eJ7ORj8kJ3kRlk2oK2K2j2k2pJ3L4j0l6qJ5J6Ll3j3OK5J6j9l7J9K1%j4j4K0
$$ y = [-17, 2, 12, -6, -26, -20, -4, 7, 9, -6, -43, -23, 2, 21, 0, -35, -26, -5, 11, 0, -6, -20, -29, -5, -5, -9, -24, -11, -18, 3, -13, -11, -18, -9, -21, -8, -1, 14, -13, -29, -8, 10, 3, 2, -8, -31, -21, 2, 16, 1, -40, -37, -5, 12, -9, -20, -37, -36, -15, 7, 3, -33, -34, -15, 18, -2, -23, -32, -16, 4, 1, -6, -20, -13, -16, -2, 10, -9, -17, -21, -9, 3, 2, 5, 6, -9, -12, -3, 8, 5, -11, -15, 11, 11, 7, 14, -8, -13, -2, 21, 24, 0, -12, -4, 19, 24, 9, -10, -7, 19, 12, 26, -6, -15, -3, 27, 21, 3, -13, -3, 10, 12, 15, 12, 0, -13, -4, -1, 2, 5, -3, 13, 16, -6, 11, 21, -12, -18, -2, 15, 14, -5, -15, 2, 9, 27, 13, -7, 0, -6, 17, 21, -7, -26, -19, 14, 30, 14, -9, -12, 4, 16, 10, 8, -13, -7, 16, 10, 10, -11, -5, -4, 5, 15, 0, 4, 4, -14, 0, 7, 9, 9, 5, -14, -2, 10, 20, -5, -33, -16, 17, 27, 6, -31, -25, 2, 14, 14, 3, -10, -7, -2, 19, 21, -12, -14, 13, 26, 15, 11, -7, 1, 27, 25, 19, 18, 9, -3, 16, 22, 19, 17, 10, 3, 3, 8, 25, 20, 1, -17, 8, 17, 30, 7, -17, -10, 8, 24, 16, -9, -25, 13, 34, 26, -13, -17, 5, 29, 21, 15, 2, 12, 10, 28, 20, 13, -10, 16, 32, 11, -5, -9, 9, 25, 16, -5, 12, 18, 27, 9, 7, 20, 18, 27, 24, 2, -4, 18, 40, 28, 6, -1, 12, 46, 36, 0, -8, 7, 23, 26, -7, -20, -14, 11, 27, 8, -29, -10, 11, 11, -3, -17, 3]
3222ClJ9j9nnK2J0j0rkK3Ok0pRK1j7rj4OL1rk2j6PL7J8l5k2KL1K7k8k6JL7J0j8
3260B4k1j0J9J8qk3oJ4K3pk1j3J2K1j1j0j4J1K3j4j1l1K7L3j0k8j6K6K3%l4JJ7
3293DK3Mk3k2J7J6J0k6k6QN0kj9l8J5K8J0l1Ok0K9lQl3lK3J1kl6J7J5Rpk9j5M5
3329A3kj7j6OK2Nqm0J4J6J5%m2j4L9K6lm9MOK7J4l6l0L0L6Ll6k0NJ9L2r8L3KQ2
3365C8k3K2q1K3O5kr6L6K0k4L3mj58J31K2j0k8p5Q1O5j8l1j3jM1J2k8k5j4M2K0
3396B0j0l2oL0J8k0k4QQK4j5j6j5J6K8j7j6kJ5K7%k3k0K7J1Jl2jK4K6ok9qJ2M1
3431D4j1m0k0J3M5nk6k0QK5Pnn0J6K7J8j6l0jK8KOm0NK8J2j8j1qK2J2j2j8N%K2
3467A4j8j2lL1Qqk4jL8J6j4m2KK0K0j0j9nK2J9rk6mJ9J4j4j9NjL0mk9j3J3K1Q
$$ y = [3, 0, 19, 0, -5, -10, 12, 22, 12, 3, 1, 24, 30, 10, 3, 12, 33, 16, 7, -7, -1, 30, 21, -1, -17, -10, 27, 45, 10, -12, -10, 21, 48, 20, -6, -5, 32, 42, 24, 3, -7, 12, 30, 22, -1, -7, 7, 30, 23, 2, -11, 1, 22, 11, 1, -13, -2, 21, 7, -4, -35, -8, 25, 15, -13, -29, -3, 20, 20, -14, -13, 4, 27, 31, 8, -14, 3, 19, 29, 3, -23, -15, 35, 33, 14, -24, -9, 19, 29, -2, 4, -16, 13, 10, 18, -15, -18, 5, 16, 14, -22, -5, 10, 19, 12, -17, -32, 13, 11, -6, -22, -16, 6, 11, 3, -37, -23, -7, 8, 8, -34, -48, -9, 17, 14, -35, -31, -25, 2, 16, -20, -50, -20, 16, 19, -17, -37, -32, -13, 19, -79, -46, -44, 38, 15, 37, -44, -21, 44, 42, -54, -18, 2, -22, 11, 7, -151, -20, 2, -8, -36, -111, -30, 35, 17, -14, -27, -28, 13, 25, -3, -28, -42, 0, 20, 10, -22, -28, 2, 20, 0, -24, -16, -8, 16, 1, -15, -30, -14, 14, -3, -19, -21, -6, 21, 21, -2, -22, 5, 16, 17, -15, -16, 8, 34, 28, -1, -9, 3, 44, 33, -7, -27, -14, 31, 26, 0, -20, -12, 13, 20, 15, -35, -19, 8, 26, 10, -20, -21, 7, 9, 15, -25, -20, 8, 20, 2, -9, -17, 5, 17, 5, -13, -8, -8, 14, -4, -16, -19, 12, 20, 12, -12, -13, 25, 41, 27, -15, -13, 7, 27, 17, -2, -7, 15, 34, 25, -1, -5, 14, 28, 14, -5, 0, -1, 29, 25, -4, -17, -4, 17, 25]
3503B5j6k2J3OJ5k3j3JK5jj7j6LJ9J2j4pLJ6Ok0j0MK7Mk3j1J2J4K1j9k3JJ8NJ
3539A6k4j8L9ONk1k2J7Ojq%J3J0pj0mNRlj0JJ1%Kk1oK7j0%j5MOK2j1k6nLK7%j0
3580ck3KJ9K3j9k0OJ2K4k6j2RJJ7j1Mj0jJ5KpkQj6rjK2mjk1NnK0J0j3j8LK6nl
3620bk8NJ9J7rj9k1J9%K6k1j4jJ4J1Pk0rQJ7okjj5MjROoqJOMPKk0qL1POj8rkQ
3664fJ3J0m2K0jK0kk1j1jJ7J7j1j8kKK2orkoRQJj2rJ0MoK0Kj7j6KK3jRl4KJ4K0
3705A2nok7J4J1J3kl0LJ1K4kj7j9NK3Qml2J8LJ9k2Rj6NJ2j0J4j5lQpoNJkj3RJ6
3745ELOl1l2N0lJ3l1pMK6Qj2k5LK1K8mk5pJ3J7nj5k3K0J2Qj3rnJ6J1nJoPj9J6
3784A1NKJmj5OJ3Knk6%PM2j6k0j1PL2rj7j7J1J2njj0j0K2J4Kk8j1J3J1Qj2j1Q
$$ y = [25, 9, -13, 0, 6, 21, -2, -15, -14, 11, 10, -7, -23, -20, -1, 11, -3, -10, -7, 9, 15, -5, -15, -11, 16, 20, -3, -14, -2, 12, 33, 14, -9, -8, 10, 15, 16, -8, -26, 13, 19, 24, 3, -19, -2, 4, 3, -5, -5, 8, 18, 11, 1, -3, 2, 11, 8, -2, -1, 10, 10, 12, -9, -15, 12, 2, 2, -13, -9, -3, 19, 8, -18, -23, -20, 7, 7, -3, -26, -24, -5, 18, -1, -21, -15, -3, 21, -5, -17, -8, -7, 10, -1, 3, -7, -8, 7, 9, 2, 0, 8, -8, -17, -18, 4, 0, -1, -22, -17, -22, -2, 8, -5, -23, -20, 6, 1, -2, -30, -25, -6, 11, 2, -17, -38, -19, -19, 7, -14, -28, -29, -15, -4, 3, -17, -26, -18, -1, -7, -9, -10, -25, -21, -22, -13, -7, -13, -21, -20, -14, -10, -3, -1, -21, -29, 2, 9, 15, -3, -12, -14, -6, 7, 17, -25, -5, -6, 14, 12, -9, -20, -21, -4, 13, 2, -16, -18, -16, 6, 0, -9, -11, -17, -8, 0, 1, -11, -20, -10, -6, -12, 8, 10, -7, -23, -21, 2, 1, 10, -24, -22, -8, 12, 7, 1, -26, -12, -1, 12, 10, -20, -17, -6, 18, 16, -1, -20, -15, 8, 16, 12, -20, -2, 1, 20, -2, 7, -9, -4, 8, -2, 12, -3, -6, 2, -5, -11, -6, -5, -7, -20, -11, 5, 8, 14, -17, -49, 1, -2, 11, -20, -27, -23, 3, 11, -1, -26, -23, -2, 26, 22, -3, -10, 3, 20, 15, 0, -23, -3, 9, 17, 4, -5, -10, 6, 17, 12, 13, 7, 14, -5, 11, 16, 18, 19, 15, 0, 6, 19, 21, 16, -10, -10, -3, 39, 23, 3, -8, -1, 31, 22, 5, -12, -1, 11, 6, 5, -5, -15, 7, 21, 23, -5, -16, -3, 8, 16, 4, -7, 1]
3822AQNojOLj6nJ5Rjj4j6OK5lj9j1J0K1K5l1k0kJ6K4Jm3j2K6J6Lk5nJ5NJ2j2j4
3861dkQJ7j2j6NJ1Kj1k0K0Nnj4rK2J0kk3lRK6Mj0l2LK9K0k6j5MK0J4kl7j0K4J8
3899A8kj1j0JL4j5k4LJ4Nj6J6j5MK%j0LJ0Kj5k3J9K7oj4j4mL0J8k5k2qJ4K6nj4
3936gj4lL4J5k3k1JK1Rj6rkK8krpoJ3MLoj7K0Nlj5J2J8j2j9pJ0K5Kk7ojK6J4k3
3976Ek8%K4J5kl3j7K1J5%j1j4J0L0jk4mLPJ1k0oK2npOoQJ3j5j4LK3pjj2oJ1K2
4015A6Lk4k2K4K4nll1MK7QPl8j4K7K0mk2k0K0K2j1pk0J5PQk0L%J1pj1RNQk8J0
4053iLJ3mlj6JL2%jj4k1J3K9j0qj1MK2rqj2RMJ5rnnJ0kJ3j2pPJ0mj3MlPk5J8n
4095bJ8j6mj5J1LJ8j8j5OL4rj4rj4K2J2Pk8oJK2J1j5j7J5oK5nj8kJ0Rj3rJ1jP
$$ y = [1, 9, 14, 8, 7, 13, 16, 0, -5, 10, 19, 18, 4, -12, -6, 19, 16, -3, -14, -4, 17, 42, 11, -9, -11, 5, 29, 30, -13, -25, 1, 17, 20, -5, -10, 5, 10, 22, 10, -4, -6, 2, 19, 7, -9, -4, 7, 9, -2, -22, -2, 3, -2, -16, -25, -3, 7, 5, -18, -21, -12, 14, 18, 8, -24, -21, 8, 28, 2, -13, -9, 11, 25, 23, -14, -24, 0, 18, 16, 5, -5, -4, 30, 15, -9, -6, 8, 13, -3, 13, -2, 2, 4, 4, -6, -3, 7, 9, -6, -29, -10, 17, 11, -3, -17, -21, 9, 27, 2, -20, -28, -14, 12, 7, -7, -21, -24, 10, 25, 2, -19, -18, 3, 12, -4, -13, -15, 13, 11, 2, -5, -11, 2, 6, 9, 3, -14, 6, 11, 8, -7, 5, 23, 11, -8, -15, -5, 20, 22, -5, -11, -12, 14, 28, 5, -23, -23, 1, 16, 14, -19, -36, -15, 0, 0, -11, -25, -15, 15, 14, -10, -14, -11, -4, 7, -13, -19, 3, -2, -9, -3, -9, -1, 12, -3, -17, -14, 9, 2, 1, -11, -17, -6, 16, 19, -5, -27, -3, 21, 16, 13, -18, -14, 13, 21, 28, -10, -24, 3, 23, 19, -3, -23, -3, 19, 8, 1, -19, -4, 3, 11, -9, -6, -6, 5, -2, -13, -4, 1, 9, -19, -9, -6, 7, 3, 0, -16, -15, 17, 17, 16, 2, -19, -6, 23, 13, 5, -6, -2, 20, 11, 3, -9, 0, 4, 19, 10, 5, 0, 10, 8, 21, 9, 2, 9, 19, 15, 2, 6, 3, 10, -15, 3, -2, 16, 0, -4, -19, -8, -5, 13, -5, -20, -14, 20, 11, -3, -12, -26, -4, 8, 15, -13, -19, -18, 4, 15, 0, -17, -2, -8, 17, 12, -6, -8, 2, 11, -2, -11, 0, -1, 6]
4133FMj2KLJj0KJ7kLk3J4qJ6omk1J5J2j1J7k8j0K4J3Mn0J2J5J8Kk1j0RJ9j8Mj4
4171a6J3Jmkm%oJ2Mj5QLJ4%k3K8jjj1k3J2K6nkj3KK2Nk0omK4%j2j6MJ5Rj0j0O
4212DlJ6j6pj2J4J1kkj3mK5Jnj6NJ0kj1nPJ1nnqJ2J2jj4k2K2J3Lj8k3J7K2qpj6
4252b0J2K0Rj6lj7K5J4k0jj6K1PqpnNJ2j1j1j0J0J4pk1KJ1NrPj0RJ8k4RqMJ7j4
4291gj4MOJ4%j7rJ0K9j7oqQJ6j2J0j9j0J3K7k0qnJ1K2j9nPkJ5Mj5JkJ8k4KoJ3
4330EOj8oJ0MJjj6lK0MpNj9OK3k4oJJ6%jj6QKNKqqNK7lj1qRKlKlPjolNoJ8j8m
4378fJLJ1Lj1j1J0J4kj0k1J3J1Pj6oOKPmnj4J2J5p%j7KK1j5nMKjMJ3j8kKJ1j0
4419gJ2KrkjNJ0pJ0o%Nmj%LmJ4kpqKMRj9pkK2Mnoj3NJ3j0JmjMmKNMj6K3oJ1j6
$$ y = [6, 10, -2, 0, 3, 4, -6, -4, 13, 11, 14, -9, 5, -3, 13, 7, 3, -18, -3, 9, -2, 15, -13, -23, 1, 14, 18, -32, -20, -5, 13, 15, -6, -16, -7, 12, -6, -2, -16, -3, -2, -6, -8, -12, -12, -18, -6, -2, -17, -9, -6, 8, 8, -15, 13, 12, 11, 0, -23, -11, 15, 10, 8, -5, -3, 19, 24, 4, -2, -6, 18, 18, 6, -10, -6, 9, 18, 8, -2, 4, 1, 17, 1, -6, -18, -4, 7, 5, 3, -10, -14, 11, 12, 7, -9, -4, 6, 4, -7, -12, -5, 6, 1, -4, -12, 0, 12, 11, -3, -25, -3, 10, 13, -5, -28, -11, 11, 3, -4, -20, -8, 12, 21, 5, 2, -15, 10, 24, 4, 3, -13, 8, 15, 7, 0, -5, 0, 12, 1, -10, -20, -10, 4, -3, -24, -22, -11, -6, -15, -8, -18, -9, 9, -15, -6, -14, -10, 7, -7, -21, -17, -11, 3, 3, -14, -23, -13, 16, -1, -7, -15, -7, 9, -3, 7, -12, -22, -9, 18, -2, -10, -15, -4, 18, -1, -6, 1, -1, 14, 18, 3, 4, 2, 20, -4, -2, -8, 5, 11, -7, -13, -3, 1, 2, 1, -15, -18, 2, 6, -1, 4, -15, -9, 14, -10, -16, -15, 1, 1, 0, -16, -8, -6, -1, 1, -7, -15, -10, 17, 14, 3, -5, 4, 6, 3, 5, 2, 9, 8, 2, -1, 4, -2, 16, -2, -6, -5, -2, 9, 12, 1, -10, 0, 14, 12, 2, -19, -6, 5, 12, -4, -10, -4, -2, 5, 1, -4, -18, -6, 9, 2, 2, -15, -13, 8, -7, -12, -8, -6, -7, -3, 10, -8, -10, -8, 3, -7, 5, 7, -2, -4, -5, 0, 10, 3, 13, 7, 7, 12, 8, 7, 7, 10, 6, 20, 18, 11, 3, 5, 9, 18, -1, -8, -10, 12, 16, 11, 5, -8, -3, 10, 0, 1, -3, -4, 0, -4, -2, 3, 7, -9, 14, 8, 19, 3]
4467CNj2J9rNj4J1nOpJ8pk2J7oJ7j2roJ2MNlj4LJ9j4OPj2J0J4j3j0%KLlOoj1J
4509bKJ4Jj6J1j6lJ6j0pK1q%MjJ1l1nJ5J6j6OQj7OQLj7JJ3jLrOPKjnjjNnjOrQ
4555A1jj3J5rMnPJ0j1jjnmJ7j7Pj6J1%lPkj4PPpnnNJ6mknoJ3QopKMlJ1pJk2K2
4601DNj0Pk1K4rPj5OOj4nJ7kjmoMJ3Ok8J5j1lJ3kMj0nJ5Mj4j4QqK1lpkmJ3pqJ1
4645a0j3MJ6mj1jJ2Lj1J5j6QLKQklpkJ3LLj4rNJ1Oj8qJ3KJ6kk7lJ2jNroNMPJM
4690Dnnjq%LOjJj7K2mLj2J0Rl%j4rK5nLJrmK4nj1nMJ9%pj1jQmJ2j8PqRMprRK%
4739B%n%Ok%j7J8j1jqJ7OoJk2J6J2Lkk2kJ3nNomPJ9j4j0nMNJ8jrNj2K%RmNoJL
4786CnN%rJ0NOqnJ%PJ4k3j7J2RJ2j0j5jJ0NqlpJ2rk%jLNOrJRrQmQrQj0ORj4KN
$$ y = [3, 8, -4, 15, 6, 11, -3, 8, 3, 9, 2, 20, 13, -9, 8, 2, 19, 7, -2, -8, 4, 8, 13, 10, -4, -1, 18, 4, 10, 17, 5, 15, 29, 16, 6, 6, 8, 11, 8, 14, 8, -3, -2, 0, 14, 15, -1, 10, -6, -9, 7, -3, -10, 11, 3, 3, 7, 6, 17, -14, -19, -4, 12, -4, 2, 10, -7, -1, 7, 10, -7, -6, 7, 6, 9, 0, 6, 13, 15, 14, 9, 8, 7, 12, 7, 6, 12, 3, 11, 10, -3, 12, 3, 7, 2, 9, 19, 8, 7, 6, 1, -3, 14, -3, 4, -12, -1, -1, -4, 3, 1, -13, -6, 1, -6, -11, -16, -11, 5, 1, -1, -6, -12, 1, 9, 3, -4, -2, 2, -1, 10, 3, 4, -18, 4, 9, -1, 6, -15, 9, 0, 7, -8, -2, 4, -10, -15, 2, 0, -1, -5, -11, -7, 6, 12, -16, -1, -12, -15, -2, -4, 0, -10, -15, 0, 4, -10, -24, -16, -24, -3, -6, -13, -15, -19, -6, -13, -21, -10, -23, -19, -3, -7, -18, -19, -7, -4, -15, 0, -16, -8, -5, -3, 5, 3, 0, -7, -9, 4, 7, 10, -4, -13, -8, 3, 9, -9, -17, -4, -2, 14, 12, -15, -18, -6, -7, -2, -11, -17, -12, -8, -1, 0, 4, -1, -6, -7, -15, -15, -12, -6, -7, -6, -23, -1, -5, -2, -14, -4, 5, 2, 2, -12, -21, 4, -1, 2, 3, -6, -10, 14, 9, -2, -7, -3, 16, 16, 9, -2, -3, 5, 1, 13, -5, 2, -6, 3, 7, 0, -9, 0, 2, 2, 2, -3, -3, 3, 1, 1, -16, 2, -9, -10, -18, -1, 5, -1, 0, -22, -6, 6, 9, 7, -15, -17, -4, -9, -4, -10, -14, -7, 12, -2, -12, -17, -13, -8, 10, 9, 0, 5, -7, -5, -5, 4, 0, 5, -1, 0, 3, -2, 3, 3, -6, 4, 9, 15, 7, 2, 3, 3, 10, 24, 1, -16, -4, 5, 17, 7, -8, -9, 1, 6, -2, -5, -12, 0, -9, -11, -11, -12, -9, -4, 2, -7, -6, 3, -6, 2, -2, 6, -3, 5, -5, 1, 10, -4, -2, 3]
4835CjNlJrpj0J8K7j6ppJ7mlrJ1mRNk1PklRLj2OOJ3Qm1J9nkj1J0qJ0Pj5j0OjQ
4880cmjkJ2mj8J1lLJ5Mrj2J3qOjnkK4qrOj0J1j2J5kq%J5okj0KMjJP%Kj5pJ%on
4927b1KJ3J7j4j6lJ7LJ%j9J8j0Rj1kOPJj0MjROjmjo%J0oKJ4j6J2pMkNmopJ2Kj2
4972eQrPLJjmOj1J6k2J1j0PJ5j5kLJ4Kjoj6RkKJ0j7LnkkJ0j0RJpPKjMoNlJ1Rk5
5019gPOQmKklK2k0%Qj4J3j3Qk2MK1nKj6LNJllkKkJ0oj4J1Nj0%J%LJ6j7OJ9oj3
5064Aj5J0j2K8j7ljJ5Llj9J6OnJ2j4J1mPJrlmL6k9MJ3j6kMkj1J4rPlj5RkJ2pj3
5106iJ1JJj9PKJ3nNj6rJ7j0J1pKQqKpmK1rKLj4J1pJLOlJ2j4rJlJ6qLoOJjnJ3O
5153A2oJrrROJ5j7qQnJ5j5j1OKNj6jNK0k1PkjKKllNMJ6k2KRLmkoJ1kNNnqJ1kJ
$$ y = [3, 2, 7, 4, 5, -4, -11, -21, -3, 24, 8, 1, -6, 11, 7, 4, -5, 6, 2, 11, 16, -5, 2, 0, -3, 6, 9, -3, 3, 9, 22, 30, -11, 8, 3, 1, -10, 0, -8, 2, 9, -6, -16, -10, -11, -3, -7, -8, -10, 2, -2, -20, -9, -12, -9, 6, 10, 1, -11, 2, -6, 0, -1, -6, -8, 16, 8, -1, 5, -5, 6, -6, 9, 7, -1, -1, 14, 8, 6, -4, -2, 2, 1, 2, 9, 9, 11, -4, -11, -10, -10, -16, -21, -19, -6, 11, -3, -19, -22, -5, -2, -1, -1, -20, -2, -12, -3, -14, -16, -10, -3, -2, -12, -8, -9, 0, 6, 5, 1, 0, -6, -6, 4, -2, 0, 14, -2, 10, 3, 7, 5, 10, 6, 0, -7, 5, 7, -5, 3, -6, 1, 4, 5, 4, 0, 6, -5, 11, -11, 0, -10, -3, 12, -3, -5, -2, 12, 14, 13, 7, -9, 0, -2, 0, 10, -7, -4, -9, -11, -13, -3, -13, -4, -3, -10, -3, -1, -2, 2, -4, 1, -2, 9, 18, -7, 0, 6, 14, 10, 12, 10, 7, 29, 9, 9, 17, 3, 16, 3, 11, -11, -7, 14, 9, 11, -5, -2, 3, 4, 1, -2, -4, -2, -4, 6, 0, -14, -3, 2, -8, -8, -7, -7, -4, 12, -5, 1, 20, 14, 1, -14, -4, -16, 12, -5, -8, -9, 6, 9, 6, -13, 3, 9, 4, 16, 2, 13, 9, 16, 17, 8, 5, 1, 37, 8, 12, 25, 9, 7, 11, 9, -2, 12, 3, 10, 7, -8, 1, -1, 11, 4, -9, 2, 3, 4, -15, -8, -6, 7, 2, 7, -9, -18, -1, -11, 0, -7, -5, 3, -5, -3, -10, -14, 7, -2, 0, 3, -11, 0, -7, -6, -3, 3, 0, 12, -2, -11, -10, -13, 3, -5, -2, -8, -2, -1, -2, -7, 6, 12, 6, 7, -2, -11, -2, 4, 19, 2, -6, 2, -3, 12, -3, -14, -8, -6, -1, -17, -18, -13, 7, -14, -7, -9, -10, -8, -6, -9, -12, -7, -3, 13, -9, -7, 2, 5, 1, -1, -7, 4, 2, 7, 12, 7, -1, 10, 8, 9]
5201Ij1%%QRk1LJNkNj6J5Mlo%%QOpj1%Nnj0J4%kMj6RMlKNj9LJ6jmj3NJ5oj7J4
5248dKoPnM%MRRj8J2oQj4KJlRrKrlJ4jj2J1j1JQpLj0J1j0oJ2Nj1J7j0mJ0MJro
5294hLNrPkpLNqJRmOj2OlRMLj3MmJ3Kj5KJJ6m%j6J2J3r%klNr%%J5Kj9KQ%j6LQ
5344Dj7OLlJ4k4MKJ1Oj9PJ1j%j6RQoLoM%J2qloJ1KnmLMNjj3jNrRKqJLQj4LQJ2
5393A6j2npJ4lpkjJ0l%jj6K7j2qN%nQpKpJKMK%%j1J7%qjlMJKKQmknMNmPj5nL0
5443A7qj3LnjlJ9okjoK4j4oPMjmnmJ0LpqjPklj1J4MrJ1Kj5Q%jMoJ2lqnK0OlJj3
5492BPN%pjlJ0J6j9jkoOJ0k0NRj3J7k1NJ0j0RnlKqPKjpJ3Jlj3RlNj4PJJ1nj3%
5538iJjJ9j1LrMJ5j2llJ4nlRqNMmjjQOoJqlPjlnJ3nPj5%j0K4rj2NkOjrJ4mJ2n
$$ y = [9, -2, -2, -2, 6, 15, -6, -3, -2, 3, 1, 6, -10, 5, 9, 6, 0, 0, 0, 8, 14, 7, -4, -4, 1, -4, -14, 0, 0, -2, 2, -14, -5, -1, -4, -2, 3, -16, -13, 3, 2, -2, -15, -10, 5, -1, -18, -4, -2, -8, -1, -6, -2, -2, 2, 11, 20, 2, 14, 8, 16, 2, 4, 5, 2, 11, 2, 4, -5, -8, 6, 5, -7, 4, -7, -6, 2, -5, -2, -12, -1, -11, -17, -5, 0, -11, 6, -4, -8, 2, 6, 7, -2, -8, -5, 0, -9, -2, -4, -11, -8, -3, -11, -10, -1, -5, 1, -11, -5, -8, 1, 5, 8, -5, -1, -5, 8, 10, -5, -3, -2, 14, 10, 10, -6, 6, 19, 10, 10, 8, 5, 10, 1, 1, 1, 16, 18, -1, 1, 9, 9, -7, -4, 4, -13, -7, -4, -7, 7, -17, -13, -11, 0, 6, -13, -6, 5, 4, 4, -12, -3, 5, -1, 2, -4, 0, 0, 12, 4, 1, -5, 6, 8, 3, -1, 2, 6, 11, 10, -3, -4, 1, -8, 1, 3, -5, -4, -1, 7, -7, -4, 4, 16, 4, -1, -8, 6, 3, -4, -6, -7, 3, 0, 0, -1, -17, 10, -2, -10, -5, -5, -10, -2, -9, -7, -14, -13, -11, -7, -5, -5, -5, -16, 1, 1, -7, -8, -11, -7, -6, -4, -2, 6, 2, 0, -5, -1, 4, 0, 7, -8, -13, 17, 9, -4, -1, -6, -7, -10, 9, 3, 1, 0, -6, 18, 4, -2, 5, 9, 8, 4, -1, -5, 5, 8, 1, -7, -8, -1, -3, -6, -17, -3, 1, -8, 3, 5, -10, -2, -2, -3, 1, -5, 7, 4, -4, -9, 11, 17, 14, 15, 2, 9, 14, 14, 7, 6, 3, 13, 29, 10, 9, 7, 1, 7, 17, -3, 2, 11, -2, 15, -6, -1, 9, -1, 8, 3, 0, 2, -6, 1, 3, 2, -5, 8, 9, 6, -7, 2, -1, 4, -10, -3, -2, 9, 4, -9, -9, -8, -9, 10, -1, 2, -7, -3, 12, 0, -3, -6, 8, 3, 0, 9, 1, 6, 10, 6, 5, 4, 12, 18, 12, 13, 5, 2, 9, 8, 5, 0, 13, 8, 15, 0, 0, -10, 14, 5, -7, -2, -4, 2, 1, -8, 6, 2, 14, 9]
5587Inj0JMQnj1OKJ1j5J2lj6JJ6mpQj4K1k4J3%QjPj1%K0j8J4j0PpLljMOj2mJ1
5630A1qJ0rjoJ0knpJ3ll%nljPj1lJ1LqQRoJ4j0JjLrMnlqJ9kJj1%J1QqqLrK2ln
5679EJ1j4kJ9k2jKNRrmjLj8MJ3lOlQj4JKOj1nJ0jk2K7j1rJ1PonKmjJ1j2K0pjj
5724ePj0KOj0J3Rj5J4rRj5J1lmJ0qjMJkNLqj0NPnMkPj2lJ1mlPj0kLqJJ1oKNnm
5772g%QoPl1K0jNNlMq%OLLjqNNJjPKk4K3pNj1LKrj0NJ2JrpjLMOrKjJoOPqJ3j3
5824g%mJNjj4RJ4Qj6JJ0j1KLnkOJmj0K6k0J0MkJ0j2pPPLj0%NJlRj2LKjnMMjnn
5872bPopNj7J1LO%JMj8J2j0J1qRNlj5%OmOqQKOLlnMmpR%J0pj4J1%JLPnJJkKKp
5923Dj1J8kk4J5k%JmRonJPj9OJ2jLolMKJOj5M%nJJ2kpJOj4K4Lj2JNrQjmLqRlP
$$ y = [9, 4, -6, -5, -1, 7, 2, -9, -3, -1, 10, -5, 7, 4, -12, -11, 5, 1, -6, 2, -12, 9, -15, -2, -2, 6, 5, 12, 1, 1, 21, 3, 17, 7, 14, 7, 10, 7, 6, 10, 16, 4, 0, 11, 3, 13, 4, 3, -3, 7, 5, 0, -7, 6, 3, 0, 0, -5, -8, -9, -2, -13, -16, -5, -2, -10, -2, 7, 1, 15, 5, 6, 5, 8, -1, 3, -2, -5, -13, 6, 4, 5, -6, -6, 5, 13, 5, -3, 0, -9, 13, 10, 5, 16, 2, 0, 19, -3, -4, -2, 3, 12, 3, -1, -2, 1, -17, -13, 0, -3, 3, 0, 8, -6, -5, -3, 3, -8, -13, -3, -4, -26, 1, -10, -19, -8, -1, -7, -12, -10, -14, -15, -4, -16, 4, -3, -4, -5, 2, -8, -6, 0, -10, 3, 12, -3, 11, 2, 11, -4, 7, 4, 0, 10, 2, 1, 5, 6, 4, 9, 12, 4, -6, -1, 6, 1, 5, 3, 10, -2, -5, 6, 2, -1, 6, -4, -6, -3, -11, -10, 1, -5, -3, 2, -3, -7, -7, 1, -5, 2, -29, -9, -10, -5, 0, -3, 1, -7, -7, -1, 2, 5, 4, -4, 1, 6, 7, 6, 13, 15, -9, 14, 7, 12, 1, 4, 6, -3, -13, -8, 4, 5, -4, -11, -12, -9, -5, 1, -8, -6, -7, -6, -12, -6, 1, -7, 6, -7, -7, -11, -10, -5, -6, -20, -11, 3, 11, -5, -4, 6, -5, -3, 0, -5, -7, -1, 0, -4, -14, 12, -8, 2, 6, 4, 14, 2, -5, 2, 9, 12, 2, 2, 7, 8, 5, 14, 2, 5, 7, 6, 1, 5, 9, 8, 3, -2, 5, -1, -8, -3, -20, -9, -6, 0, 0, 1, 5, -13, -1, -11, 0, -8, 1, 6, 3, -12, -12, -6, -10, -4, -12, -4, -2, 4, 7, 4, -1, 3, -1, -8, 1, 1, 11, 4, -10, 1, 1, 2, 5, 12, 7, 8, 9, 7, 9, 11, 4, -7, 11, 9, -15, 0, -2, -2, -1, -5, 4, -2, -7, -6, 1, -18, -12, 0, -1, 2, -4, -7, -3, -1, 0, 6, -9, -5, -5, -10, -9, 3, 1, -6, -5, 1, -13, 11, 14, 2, 3, 8, -1, 7, 6, 2, 5, -3, 6, 3, 10]
5973A0%jnJjNmJkKj2J0pMMLnRMpj9J0mJ2j6J3j5PKj2J4nJ1k3J1JJ0j2Nj0KJ4p
6016bN%jnOmOJOkOj7J6nqJlRKj2j%LnKjPjK%qJ0oLlPj3Rj3RJmPj5OKnqJ0J1j2
6067gj0nJ1pJ4JOrllJ3pJ2r%J3mKqOLMJj0jO%JOkj1LjrJ4j0LnLOr%qKJ1j0Oj3
6115a4MJ5qJ3pnj0J5pklJ7j6JJ0Jj0jMKJj3J3LKk1K3onJ0LqJ2j0J0qN%Oj0LJ%
6158A0Lj5MMKmOj1jNnoLlqkM%oJ3Jj2QoKOJ2k2OJJ5j7QJ0nqJ6j1Pnj0J0%QMkj0
6205aPk2K6LqnOjJj%pKLkK2k7J0mj8J6J6j7%lMjJKqQopLoJ3j0NrJ8j4KjjJ4j8
6251a5J0JJ0j1J2j1J6kj3J2j0Oj0J9j6pK0qKqM%jJmmPJ4pJrkKKqM%%PqMKj4NL
6296djOj1mJ2Nj9QJ2j1%Qmk1J7lJ0j4J4j3J1KNj1PLlRljklJllMkMmj2J3jlLJ1
$$ y = [10, 10, 9, 4, 5, 4, 9, 5, 6, 4, 6, -6, 4, -3, 1, 5, 8, 3, 12, 16, 9, -10, 0, -4, 8, -8, 5, -10, -3, -1, -13, 1, -4, 7, -16, -5, -4, 6, -6, -1, -11, -9, 5, -2, 3, 3, 2, -3, 3, -1, 5, 6, 12, 10, 16, -1, 15, 10, 2, 3, 0, 9, 11, -1, -2, -2, 1, -4, -2, -3, 4, 3, 5, 5, -3, 7, 1, 4, 1, 8, -5, 4, -9, 0, 1, -3, 4, -11, -5, -3, -8, -16, -6, 5, -7, -17, -22, -11, -18, -4, -3, 3, -6, -9, -12, 1, -6, 6, -3, -3, 10, 6, 8, 0, 6, 9, 13, 14, 4, 3, 9, 9, 10, 16, 14, 3, 6, 5, -4, 10, 0, 3, -2, 1, 7, -2, -2, -10, -8, 3, -7, -1, -14, -10, 5, -3, 10, 3, -2, -12, 3, -4, -6, -9, 8, -8, -7, 3, 4, -6, -7, -3, -1, 0, -13, 0, 3, 5, -16, 7, 1, -4, 6, 9, 1, 13, 3, 13, 5, 10, 10, 16, 6, 9, 10, 10, 13, -2, 2, 6, 8, 4, 10, -1, -2, 3, -2, -8, -5, -8, -16, -18, -14, -14, -20, -7, -6, -18, -10, -16, -14, -8, 4, -18, -12, -11, 4, -13, -5, 5, 0, -8, 8, -3, 4, -1, -11, -1, -1, 7, 11, 9, -1, 6, -16, 10, 13, 5, 0, 6, 5, 6, 5, 5, -2, 0, 3, 1, 23, -4, 6, 2, -16, 0, 16, -1, -1, -4, 0, -1, 0, 2, -6, 2, -4, -11, -8, -14, -1, -11, -6, -15, 3, -11, -9, -10, -11, 3, -15, -5, -4, 6, -5, 7, -4, 12, 10, -3, 9, -1, 5, -5, 14, -2, -9, 11, 3, 5, -3, 1, 1, 0, 1, -3, -7, 0, 14, 7, 8, -1, -3, -1, 1, -7, -3, -3, -3, 4, -4, 0, 2, -12, -7, -4, -5, 1, -10, -14, -2, 3, -16, -8, 4, -7, -7, 1, -3, -24, -7, -10, 0, -14, 0, -13, -2, 0, 5, -6, 1, 4, 1, 10, 7, 6, 4, 1, 2, -1, -4, 0, -2, 2, -2, -14, -1, -2, -5, -2, 9]
6341Ij0KlJ4j4K%J2j8kKnRpkl%J7j1j%LnJ1j8J2Oj6J2lqPJ0jkOk6J8mJ0lMj1j
6385hQKJJj6J2kJJpJ7oj6J6oJ2j7KM%mlmnJ6j2mJ8qJ8j9LJ3rj5J3qNJ5olpQrJ
6430goRj2K6j2%JlJ0pJJNloNMqKPp%jRmMj5jJ3j2J1lKj1R%Lj3J1mjrJ6pj2J5K
6477BOj7OLrNOjlMKk3K0pPj1J8pj0J3j1J3oj0K7k4%J1kNj8J8rlMKlMRkj0JLj2
6521iK3k0J1Pj6Rl%qNpjPj1PkPpNmMj0LOkPlmjRmkjpRNj7J4J0mOj3LRkj6J5kL
6570Hj2LRj3J1kqKKrJ4jmPopJ%NJj5J6pJKLoMj1J0oJ2qmKLkoJ5%j4jlOJJ1njm
6619fN%J6rkJPj2J0kmlkJ0q%j0J2rkNqRLKJ1k0l%nJ5o%%kknJ0%Oj3J0j9K6j3O
6665aoLj2J5j2J4jj0M%J1j0MRqPpOoPKRj4lMoMrJ6k0J1JkPj5nJ2j1J6omjrMRn
$$ y = [9, -1, 1, -2, 12, -2, 0, 0, 12, -6, -8, -6, -11, -2, -9, -11, -14, -14, 3, -8, -9, -9, -6, -11, 0, -18, -6, 0, -16, -4, -7, -15, -8, 2, 1, -1, 5, -21, -3, -7, 3, 0, 4, -7, -8, 0, 2, 3, 4, -12, 0, -2, -1, 0, -7, 10, 4, -12, 4, -2, 10, -7, -5, -1, -1, -5, -8, -12, -17, -1, -13, -17, 1, -7, 11, -8, -5, 8, -1, -16, -3, -11, -6, 9, 3, 0, -7, 1, -8, -7, -13, -4, -16, 10, -2, -2, -1, -4, 6, -1, 0, 1, 6, 3, -3, 2, 6, -2, 0, 7, 0, 0, -1, 8, 4, 8, -7, -8, 5, -7, 4, 1, 3, -8, 1, 1, 4, -9, 2, -2, -3, -12, 4, -3, -15, 0, 2, 8, -9, -3, 0, -9, -4, 2, 1, -2, 2, 4, -19, 1, -6, 1, -10, 8, 1, -9, 4, -7, 6, 0, -10, 17, -7, -7, 4, 2, 7, -11, 7, -2, -5, -1, 1, -2, 2, 11, 9, -1, 0, 3, -9, 14, -6, 5, 12, -4, 5, 2, 2, -6, -1, -8, -9, -2, -13, -6, -8, -1, -8, -3, -7, -3, -13, -10, -4, -6, 1, -2, -6, -7, 2, -2, -4, -5, -12, -3, 2, -15, -1, 9, 5, 11, -2, 1, 10, 8, -8, 7, 5, 8, -4, -1, 8, -5, 6, 4, -4, -2, 0, -9, 5, 4, 0, 7, 1, -6, -5, -5, 0, 1, -14, 2, -5, -4, -2, 1, -5, -1, -12, -2, -8, 4, -4, -8, -6, -3, -5, -11, 4, 4, -10, -11, -14, -8, -7, 4, -1, -2, -6, -1, -1, 15, 6, 4, 5, 12, 0, 10, 8, 4, 1, -1, 9, 1, 1, -9, 3, -6, -8, -3, -11, -2, 1, 3, 14, -6, -9, -9, -14, 1, -5, -5, -5, -7, -9, -14, -4, -4, 2, -11, -1, -20, 6, -7, -1, -7, -4, -16, -1, -13, 1, 0, -10, -6, -6, 5, -5, -1, 8, 0, 7, 0, 6, 0, 7, 9, 18, 4, 1, 5, -1, 3, -6, 10, -10, 1, 2, 0, 7, -8, -13, -1, -12, 4, -2, -6, -7, -16, -12, -3, -8]
6711hjMj3Rj0J5kK%pOLJ%jljj0K0Jj0j0J5Mj4NLrMJ0rQNlkOj2KJ6rJ2j5j%kJ2
6757A1j4KLlRpj0J1r%%jLnPMj4%J2k3J3mOjJ0j5K0j3%K0j8KQlOoJj1OqPPKqoL
6803fLOj4J0mJ0j3ORmmJ3j9J2Jj0MJ0j5J2k0J0KJj2Kj1J9lkNlnRj5%LJ1lrJ2q
6845a0Pj6QMJ0mRpO%mJ0qjlOj0%MJ3rolJOMj2ORrrKNrPQnpPrLJ5oo%Kj0O%PoJ
6897cMj0J1rk%JKrPJ7j2KoNOj4RkQKj3PKn%J2J3k5LoRrLK%Ooj7J0kJ1mKjjl%j0
6946a5J8pPj3oJ0pMkJ0j3LKmPLNj5%J7j5MOkoojRPlLoLOkkRj1J1j6K5k1KLoQr
6993fkJ2nQmrjkkjmJ3KqPn%PMj4PKqMJ1j1kQlNJJnj1J2jjknJ2rLpJ3LnKL%%pJ2
7045A2j5ONj5MjJ3j2NlK3j3lj0Qj0J4j3J0qQnkNlrKONj3%nJ8Lj4RkoJ7r%OqJ0
$$ y = [-8, -9, -5, -18, -9, -19, -4, -6, -4, -4, -11, -5, -2, -1, -1, -2, -5, -6, -16, 4, 5, -5, -15, 0, 4, -10, -5, -2, -11, -7, 3, -6, 2, 7, 4, 2, 8, -4, -2, 14, 5, 17, 2, 1, 1, -1, 11, -3, -1, 2, -1, 8, 1, -9, 2, -7, -7, -7, -8, -5, -10, -3, 1, -13, -13, -1, -24, -11, -15, -9, -10, 0, -15, 5, -8, -8, 12, -6, -4, 4, 1, 7, 1, 2, -9, -3, -11, -4, 3, 5, -3, -9, -6, -3, 3, -11, -1, -5, 5, -8, -2, 7, 3, -1, 12, -7, 5, 6, -4, 0, 10, -5, 7, -13, -3, -1, 0, -12, -10, -21, -2, -5, -7, -2, -5, -10, -1, -16, -16, -13, -2, -5, -14, -2, -10, -3, -19, -11, -7, 3, -1, 8, 1, 7, 7, 3, 13, 5, 4, 1, 7, -3, -3, 1, 14, 5, -1, -4, -3, 3, 7, -5, 1, 10, 1, -8, -6, -1, -10, -3, 5, 0, -7, 0, -9, -6, 9, 3, -3, -3, -1, -11, -5, -5, 2, -4, -3, 1, -9, 2, -7, -9, -9, -8, -6, -15, -8, 9, -3, -1, -7, -2, 4, -10, -1, -3, 5, 7, -6, 1, 3, -2, -2, 10, 23, -2, 1, -5, 4, -5, -2, 0, 0, 6, 0, -17, -7, -9, 2, -2, 0, -1, -2, -5, -5, -15, 3, -4, 3, -10, -16, -6, -13, -9, -11, -1, -14, -11, -9, -13, -6, -3, 2, -13, -13, 4, -11, -7, -1, -3, -9, -15, -16, -7, 0, -3, 0, -6, -3, 3, 1, -1, 8, -3, 8, -8, 17, -4, -2, 1, -5, 3, -6, -8, 4, -1, 7, 3, -6, -7, -9, -11, -12, -16, -3, -1, -9, -2, -7, -7, 0, 4, -10, -3, -1, -9, -5, 6, -5, -7, 1, -2, 3, 4, 5, 0, -11, 1, 0, -1, -3, -8, 4, -5, -2, -9, 4, 7, 2, 4, 7, 7, 7, 0, 12, -3, 3, 8, -7, -3, -4, 9, -3, 2, -1, 22, 9, 6, -4, 4, -6, 8, -5, 5, -3, 5, 0, -2, 3, 0, -9, -7, -1, 4, -9, -9, -14, 4, 7, -7, 2, 0, -6, 11, 2, 2, 8, 0, 10]
7089A0j0kKkRnnPrJ6rpJ1kj0J7rlPn%nN%rJ2Mj4J3Nj9J0%j0J4rj1PRj5J6j7J1
7132bMnnKj1J8j3RKlojRrJ2KRj0ORkmlL5rM1o9J5L8q2K8mJ0rkNLqPJ3mj5PrkJ1
7178HmLjjmlJ5mk1J1nmP%lONj1lJ8j1j0J0lJjJ2lJoJ3lj3J1Nj5qK0rjR%rK3j2
7223A0Mj4OJnO%%%mj0mKPkJ3ojj3J9j0Jj6J7Jj4Rj1LK0j0LmKNkLkoRj1Qj1KK1
7268A6j7OkqLJ0qJ0JQj5PrJLQnmmKj4J8Jk0LJ8j4K0j8OKj4JLMj0kRlNNNKl4K6
7313BqPJpOj1QKQKj1J1rKJKo%MmPnrK3k7K7molOj5JJnJ4mM%Nj5K3j7Qk1J0mJ4
7360HrokJ0pKp%Jk%j0J0ROrlJ3j1J2%j2QRmjMpjLL%JjOOj8j0J0JnQqqJ0%rJ3l
7409@LnJQp%OMoj2J0mLnnLJnmJ5pnRkqJ7j2Mn%lmQnPMMkRrj%PokO%%ppJ4oQj7
$$ y = [10, 0, -2, 0, -2, 7, 2, -3, 4, -5, 11, 2, -5, 6, 4, -6, 11, 2, -1, 6, 1, 1, -4, 1, 1, -8, 4, 8, -6, 7, 12, -7, 3, 3, -7, 7, -2, -13, -6, 3, -12, 4, -13, -2, 2, -3, -8, -6, -17, 1, -12, -3, -1, -4, -10, -11, -2, -11, 1, 3, 12, 2, 8, 17, 15, 11, 8, 43, 34, 75, 6, 21, 59, -23, 5, 1, 11, 2, 0, 5, 8, 0, 7, 20, 16, 1, 8, -1, -3, 8, 4, 7, 6, 5, 1, -2, 13, 9, -12, -1, -6, -10, -3, -3, -6, 0, 5, -6, -9, 9, -2, -12, -2, -5, -4, -5, 7, 4, 5, -1, 12, 9, -4, 7, 12, -3, -11, 9, 0, -1, 8, 8, -1, 22, 10, 14, 0, 6, 7, 2, 8, 8, 8, 8, 4, -6, -10, -8, -1, -3, 10, 4, 3, -10, 9, -1, 0, -16, 1, 2, -12, -3, -14, -11, 9, -1, 2, -2, 0, 5, 3, 6, 4, -2, 7, -4, 4, -7, -5, 16, -1, 5, 3, -5, -2, 8, 0, 10, 11, 19, 4, 11, 2, 3, 6, 14, 9, 5, 1, 3, -11, 7, 8, -12, -9, 9, -5, 15, -3, 3, 5, -9, -8, -5, -1, -11, -13, -4, -7, -2, 3, 8, 10, -24, 2, -6, 1, 2, -5, 1, -10, -2, 0, 8, 10, -1, 10, 1, 3, 4, 6, 0, 0, 4, 0, 7, 2, -7, 16, -11, 16, 12, 6, 3, 9, -6, -5, -4, -9, 5, 1, 5, 5, 10, -5, 18, 1, 9, -12, -2, -6, 8, -1, -7, -9, 1, -6, -4, -11, -11, -10, -12, -12, -22, -12, -3, 3, -6, -9, 4, -7, 5, 5, -7, 1, 10, 6, 5, 9, 2, 1, 4, 7, 7, 8, 7, 13, 19, 1, -9, 1, 2, -3, 5, -3, -11, -1, -1, -10, 3, 0, 3, -2, -1, 7, 0, 0, 6, 10, 4, -8, 2, -2, 1, -4, -9, -6, -5, -10, -14, 1, -6, -11, -2, -4, -12, 5, -7, -3, -8, -8, -11, -15, -7, -12, -5, -1, 3, 1, 10, 1, 0, 0, 7, 1, -1, 5, 5, 5, -2, -9, 5, -1, 7, -10]
7463a0J7qkJ0lnj7QQpLQrK0qjkqORj3kOqRpJ2nrjjRpOPlj2LLmM%LNLnnkjPnNK
7516CqPKMlj1J4k%oOrLNNj1mPmJJ0Jqj3PLlqQj0J8j0RlkJj2QJ3qj4J4jmoJ9lr
7564dkMlJ6kj5J4nLMjMJ0j8PmpJ%PoJ0mMrrlKPJ5j7mRKj0j0J7j5NJ7k4QLKqOJ
7611bmOnQjNnrJ1kJOklklRkNj2Kj1M%ljJMKOLkj2J5jNj7K1j1qMjj4J3k%nKj2J0
7661i%Mk1K1pQPj0J4j7qJ2mkJ7oJNJj1J3%OoO%j6pJ5mrK1krJ%J1j5KqOJ0nomo
7707a1J2kOj0lPJPj2%Nj6J2nOqlmJ9jqpOJ6oprKKLnRjKMK%nLJjRmjJ0nomJ3kj8
7758gJ2OoNj3LLpkjQLk1Rj4J7QqOnKLj1J2Kj7J6qpjJ4q%N%KlNNj5Lj0J2%nRjj
7806ajJ7j5ONopJ1lllRj%j1nJ3JlPkpLpJ3j4Qkj5J0J%lLLLj1MnlRlMMrNJJrOO
$$ y = [-10, 7, -1, -3, 7, 4, -1, -18, -10, -2, -9, -6, 2, -7, 13, 5, 4, 2, -6, 0, 9, -4, -6, 0, -8, 1, -6, 6, 1, -8, -9, -10, -1, -8, -2, 5, 2, -10, -7, -4, -8, -4, -4, -1, 4, 7, 2, -3, -5, -6, 1, -4, 1, 3, -5, 2, 4, 8, 5, -6, 8, 6, 6, 0, 6, -3, 0, 5, 10, -1, -5, 2, -2, -1, 9, 10, 2, -11, -4, -1, -4, -12, -4, -14, 4, -6, 3, 0, -2, -1, -13, -5, 8, 0, -14, 0, -1, -5, -11, 8, 5, -4, -6, -2, -5, 11, 9, -6, 8, 3, 6, 10, 9, 13, 23, 5, 12, 8, 1, 2, 2, 9, 3, 13, 9, 13, 4, -5, -8, -6, 1, 16, -1, -5, 4, 6, -4, -14, 3, -12, -7, 10, -14, -6, -3, -1, -9, -3, -2, -6, 0, -5, 3, 2, 7, 2, -7, 4, 2, 3, 9, 7, 4, 2, -1, 8, 6, 11, -1, 1, -10, -6, -6, -9, -10, -9, -5, -3, 3, 6, 4, -8, 7, 6, 11, -6, 15, 4, -4, 0, -1, -15, -2, -4, -4, -9, -7, -19, -9, -9, -5, -26, -5, -12, -4, 3, -7, 7, -10, -18, -6, -10, -12, 5, -1, 0, 5, 6, -5, 8, 8, 14, 8, 14, 14, -2, -9, 6, 2, -7, 14, 12, 3, 4, 4, 15, 0, 2, -6, 0, 10, 5, -1, -5, -11, 1, -1, 5, -5, -8, -1, 0, 7, -5, -5, 0, -16, -4, -9, -3, -11, -14, -18, 1, 0, -8, -15, -9, 7, 1, -6, -15, -13, -11, -8, -13, -4, -5, -3, 1, 3, 3, -2, 1, 2, 1, 10, 6, 5, 15, 10, 4, 0, 13, 11, -7, 5, 11, 5, 10, -3, 0, 3, -4, -6, -7, 1, 4, -17, -8, -22, -5, 3, -5, 1, -4, -2, 1, -10, 2, 4, -13, 3, -5, -12, -13, 1, -7, -7, -2, -2, 0, -3, 2, 7, -8, -5, -15, -3, -3, -8, 1, 0, -1, -2, 15, 0, 6, 11, 5, -2, 9, 6, 3, 0, 9, 8, 8, -3, -8, 5, 6, 3, 10, 8, 1, 4, -3, 10, -4, 4, 2, -13, -3, -2, -2, -5, -2, 1, 4, -7, -3, -8, -11, -2, -5, -1, 3, -6, -1, 0, 1, -8, -2, 4]
7857DljkLJ%qrQJ8mJnjlQonJ4%Mj5%LJ2j3RnL%ppJ7k1J8j1lNjrJ5j3%n%RJ4j7
7905hKJ2k1J0J4j2OlPoj1J8n%Ojj0PjN%lpJ0lljO%llJKLmkPj1M%jrJ0pJ1JkMj1
7954bnK4j5KoMJnj1PLjOqKKOpKkRoJ1knjKMjKokKMQj0Jklk%NjNj3%J3j2NpLj0
8006a2J6J5l1L%qNJ4n%JLnOj2PmlJ8j4MlMkNLj4J1j0R%qj1RRRj9J4kNrMNNqq%
8053dJ3lKOj3lRlj1J5nLmqKjMjk1K6%j9O%J2JrnRLlkNLkm%lJ5j3Qj4OjmkNJ1p
8102apJKK0j0j4J1Qj0J3rQjqJpKOnmJ4j6LJ0j0Pj0KNKk0J4j1J0oJM%J0j4pP%l
8146a2J4J%%qKmLmJ2qJ0j6KRNkjqJ3qJKkkjOQj8J5oRqpJ5rKo%Mj5J9kr%
$$ y = [4, 1, 0, -2, 1, 2, 2, -6, -15, -7, 11, 7, 8, 3, 2, -1, 7, 1, -4, 10, 10, 14, -1, -1, 2, 14, 1, 10, 5, 8, 8, 1, -6, 11, -10, 8, -3, -6, -1, -2, -11, 4, -9, -9, -14, -14, -5, 9, -8, -6, 6, -15, -5, 9, -3, 3, 0, 7, 1, -10, 8, 3, 3, 9, 8, -2, 5, 4, 9, 9, 6, -1, 9, 6, 3, 2, 8, 8, 5, 2, 3, 5, 8, 4, 2, 9, -2, 2, 2, 1, -8, 2, -5, 6, 7, 5, 9, -2, -7, 17, 2, 4, -2, 2, 3, -2, -13, -6, -3, -4, 2, -6, -4, -2, 4, -3, -1, -3, 6, 0, 11, 9, 4, 3, 5, 9, 8, 10, 4, 2, 4, 8, 16, 6, 7, 5, 2, 0, 0, 5, 4, 9, -4, -4, 9, -3, 2, -5, -2, -12, 4, 19, -12, -9, -9, -17, -12, 2, -3, -3, -2, 1, -4, 2, -10, -3, -7, -10, 8, -6, -2, -5, -1, -3, 2, 5, -9, 2, -8, 1, 1, -7, -18, -9, 0, 9, -10, 4, 2, 7, -2, 2, 7, 12, 4, -4, -4, 9, 6, 8, 14, 1, -2, 7, 4, -7, 8, 3, 6, 2, -6, -4, -5, -1, -2, -23, 3, 3, -16, -10, -10, 2, 3, -6, -11, -2, 1, -2, -4, 1, 4, 2, -2, -2, -5, 10, -3, 5, -9, -3, -4, -8, -10, -5, 6, -1, -8, -7, -5, 15, 5, -9, 2, 10, 0, 13, 4, 12, 11, 3, 4, -3, -1, 5, 0, -4, 10, -6, -3, 7, -3, 4, -6, -4, 1, 3, -17, -3, -14, -4, -10, -9, -5, -5, 5, -9, -16, -9, -9, -12, 2, 3, 3, 3, -5, -3, -7, -4, -8, 4, -4, 6, -10, -8, 1, 6, 4, 3, -5, 8, 0, 1, 3, 1, -1, -2, 4, 12, -6, 9, 3, 12, 4, -3, 12, 3, 5, -1, -1, 3, -12, 7, 5, -4, -4]
8191d
$$ Imaginary data points
##PAGE= N=2
##DATA TABLE= (X++(I..I)), XYDATA
0@%%%%%%%%%%%%Qj6J6j6J6j6K4l2L2m0M8n1N9p2Q0q8J04j20J36j52J68j84K06
35A10k30K56k87L19l52L88m30M77n27N83o47P19p99Q89r96J120j267J445j667
54h96J950k324K852l654N038q086K6269j3662l6899M6156L4271j1688l2351O32
68G608Q014n45J16J3547l955k3086r559K3472J8175j2920k3619r79J3240P069
82A6578l313l387l902m142q57M990M707N95n222q439l644R735J2773m142j8898
97f568o417J5279J3317o932j2882j882M150J688L864M902o192j4012K04J6444
111D963O678j3397j0450P233P849m532l624N961J004j0630l453J2489Q014r699
125a594j0828L728P546o38j301L334k758j0513k29J5375Q155j3610j5804M832
$$ y = [0, 0, 0, 0, 0, 0, 0, 0, 0, 0, 0, 0, 0, 8, -8, 8, -8, 8, -8, 16, -16, 16, -24, 24, -27, 32, -40, 40, -48, 56, -64, 72, -80, 88, -96, 110, -120, 136, -151, 168, -184, 204, -226, 251, -276, 307, -340, 379, -420, 469, -527, 593, -674, 771, -896, 1054, -1270, 1582, -2072, 2966, -5120, 21149, 7487, -29412, 16744, 51015, 39327, 6976, 7608, 15622, 15077, 15193, 28740, 24785, 1699, -7860, 15612, 33787, 20867, -2752, -3731, 9509, 16578, 13265, 9878, 5976, 1834, 977, 5967, 10674, 11269, 6047, -2392, -6036, 3699, 16472, 12330, -6568, -12985, 2294, 15611, 8679, -4203, -6085, -1935, -247, 3617, 8519, 2327, -11685, -11481, 4963, 11641, -1756, -12206, -4973, 2876, -1656, -5280, 681, 1685, -8945, -12398, 91, 8105, -1594, -12422, -8694, -1148, -1786, -3087, 247, -2511, -13024, -13253, 2122, 10277, -3333, -19137, -14305]
139a4305J6500M763r896r658k27O320O727J513o353q116J52Q374N913k827o937
154h057m005J872O436N069l234q980k603P637O103l784n578J433K792k581j236
169h716N656K979p529p036N992J0222j362r603k936N361L544p55l9l02m055k515
185a1094N391O625k640q257j507O567M353k419l838q08J108J520J852L90k282
200e039k333P12K387J090j54o14j614j562J412L680J071l277l173Q42L209K094
216a269l54k659l090L54M945L720l201o216m95N603L837k016l761j254J064K222
232b570K494l5l810k924K670M892J01m192j885K195J880l23j49N40j128j805R94
249c055L185Q64k634k094Q87J968R66m2r69j640m65K114K493o07l009j425J800
$$ y = [-14305, 2195, 6958, -2938, -12596, -12823, -6503, 224, 1737, -4616, -12732, -12580, -4206, 1707, -1120, -8057, -12062, -10190, -3754, 1315, -1919, -10899, -13502, -5865, 238, -3546, -9124, -7691, -4899, -7480, -8716, -3060, -81, -7610, -14646, -8654, 1568, 206, -9397, -12333, -6972, -3428, -4183, -4222, -4524, -8579, -11094, -5703, 922, -1718, -9975, -11482, -4915, -562, -2981, -6819, -7627, -6519, -4999, -3147, -2757, -5039, -7372, -6660, -4273, -3183, -3337, -3951, -5565, -7127, -5715, -2035, -964, -4241, -7414, -6572, -3363, -1269, -1623, -4282, -7372, -7018, -2073, 1647, -1554, -7770, -8265, -2662, 1175, -841, -4602, -5856, -4792, -2570, -76, -111, -3921, -6845, -4175, 717, 818, -3374, -5259, -3064, -1184, -1507, -1656, -1116, -2244, -4049, -3055, 130, 994, -1640, -3734, -2847, -879, 87, 45, -924, -2564, -3029, -915, 1578, 971, -2038, -3463, -1663]
266a663K633O32j688k182m08K010K303k63k478j310J360J790Q5r03n72k43Q4Q85
284G2R71m48j478l52J186Q13l08l07K8n48n45R57J580k74j983p92J510J494l37
303A239j194n65J68O54R11J68j292j325O89J887M19j501j140M84J049K57k18l72
321C18m56j68O42P41k57q89l39N32N06N9k51k79k61k9N36M87l27o38j39L47L22
342D57P2j71l79k81L11O22L2p05m63K82M99J31j37k50l41j90M52O42j39q15l34
363g05N79N46j54m61j46M1J29K80K01l63n78L3O53L06m51m44R3L22L7p7L1p8j76
386c82J2K25J10j77j36N3L2n9O1J61n2k98j39K42L14l3l27k22J20L41J57k11l30
409e38n5K99K11n6k57j03J05J32O7n5j38o4R5J20k9j05K8J17o1j72R6K64Kl10
$$ y = [-1663, 970, 1602, -86, -2268, -2676, -666, 1637, 1374, -1104, -2414, -1054, 736, 821, -82, -654, -897, -813, 72, 1043, 595, -883, -1235, -49, 764, 456, 149, 177, -371, -916, 41, 1621, 1347, -636, -1428, 82, 1576, 1239, 45, -520, -352, 302, 1213, 1381, 89, -1236, -547, 1340, 1759, 258, -882, -398, 651, 908, 690, 318, -138, -306, 336, 1077, 820, -69, -408, 124, 630, 689, 438, 159, -102, -131, 405, 892, 565, -73, -212, 135, 457, 529, 358, -21, -302, 9, 631, 663, -42, -505, -223, 276, 407, 270, 20, -321, -511, -59, 583, 444, -371, -705, -126, 420, 266, -195, -341, -300, -171, 109, 310, -53, -631, -598, 55, 361, -90, -534, -441, -119, -82, -159, -128, -206, -382, -370, -145, -35, -212, -348, -295, -263, -322, -261, -100, -152, -450, -589, -347, -33, -66, -393, -615, -495, -154, 3, -208, -538, -593, -294, -83, -139, -396, -499, -394, -262, -195, -250, -388, -452, -357, -237, -266, -371, -343, -226, -287, -459, -363, -99, -97, -407]
433d07j71K32K92n1k47j40J09J55J41n0k69j50K23L60J5l98k44K36L50qk76j05
455d03J34J71j8j28o2O2J20L7q9q6M2J11Qj29n0J44J67m8k59j28K13L26k7l81
479b73k16L10M04m1m67k56K91M16P3l28l21OL45K77j10m11j49L84L68j84m95o5
501d42M66L19k47l80L3K66J18j56j47R0J59P1j22k02j4K52K36j55l31l5L30K41
523C50k27l93n6M08L58j52n06k16L85M55p6m74j78L50L27j20l45j20J89K29N5
544B43j24k42o9J91K00j40k15J06K87l9m02r6M09L08k96m25M4M15J98k26l87j25
566c85K99M17N2m95m55K10O40J97m99m87J66N64K08l65m43JM13L14j92m04r0L25
588iK00k08k40R1K76j7k30j38J34J93Q6j35k64m9L49L17k79n68K5O33L33m50n43
$$ y = [-407, -578, -346, -54, -105, -352, -492, -383, -228, -87, -137, -406, -556, -333, 27, 42, -356, -600, -364, -14, -22, -298, -403, -269, -98, -116, -244, -306, -244, -124, -87, -176, -262, -220, -109, -101, -230, -280, -136, 31, -17, -276, -404, -191, 135, 108, -273, -489, -179, 225, 184, -283, -539, -248, 168, 241, -87, -408, -402, -57, 220, 110, -301, -450, -66, 302, 118, -377, -442, 24, 343, 96, -284, -251, 15, 133, -23, -170, -80, 79, 150, 28, -174, -188, 64, 300, 145, -186, -221, 109, 350, 123, -270, -326, 82, 440, 288, -218, -434, -49, 406, 330, -144, -322, 28, 355, 235, -110, -230, -41, 188, 243, 119, -123, -192, -1, 199, 59, -156, -50, 237, 198, -204, -300, 109, 417, 121, -304, -260, 155, 353, 127, -260, -385, -86, 331, 383, -112, -567, -357, 283, 480, -19, -506, -340, 224, 432, 67, -376, -375, 38, 352, 160, -244, -334, -9, 191, -17, -257, -166, 110, 93, -137, -275, -141, 52, 138, 3, -261, -310, 39, 356, 77, -491, -466, 167, 500, 50, -493]
611d93J10M87J86k44k11k8J29J69O5j89k46J07L92O4l62k18K60K39j13k39N5K44
633A64K3k05j68O4K41J59j36l54n4M10L08k69n04K8N68K95l21m77k4L89L37j9
655D55m22l29K24N71J31n46m85K54O57J53m53l99R1L51J94r9k59j25K00K46q1
676C29l17l6L40J51k74k17J98K74r3l01jK55J77n1k18k06N5L66K53k88m91QN42
699D55K70l46m43M8L90K05j20k85j46J19L36R4l01k89J72L56o3l65m3L11J40k51
721B44j87J21K20nj54j26QJ84J83j13l81j36L71M23j80n44j85M02M20n9m46k96
743b36J61N07K11l85n59L6N88L42l82m87M8L55J81j50k06r8Q4K01J37k06k85M3
765a00L05O7k62j06K09J01k24j74K12K31p2k30j05J07J86J12j27l18p8L60L37
$$ y = [-493, -383, 104, 290, 46, -165, -193, -64, 105, 170, -19, -265, -158, 234, 298, -64, -282, -22, 217, 104, -135, -80, 164, 187, -18, -186, -122, 119, 278, 142, -212, -266, 144, 452, 183, -321, -293, 275, 570, 249, -228, -252, 137, 474, 455, 33, -296, -72, 499, 630, 84, -401, -147, 510, 663, 210, -189, -98, 253, 447, 348, 89, -36, 164, 410, 329, 12, -24, 316, 467, 193, -24, 174, 448, 355, 54, 53, 308, 485, 434, 216, 10, 65, 431, 684, 396, -95, -87, 455, 725, 379, -64, -16, 374, 579, 459, 174, 28, 147, 483, 577, 276, -13, 159, 515, 452, 87, 44, 355, 495, 244, 57, 178, 398, 393, 239, 113, 121, 305, 488, 375, -6, -142, 229, 652, 472, -72, -257, 145, 565, 506, 60, -236, -75, 432, 643, 258, -301, -265, 323, 665, 283, -204, -156, 199, 380, 230, 24, -74, 10, 211, 348, 142, -143, -100, 205, 272, 10, -96, 113, 214, -10, -184, 28, 259, 187, -43, -148, -41, 145, 257, 130, -188, -266, 94, 431]
786D31k25n06o7M20K94j89l31r4J63K16J08j89k89m0L41K14k19l24P2K39K2j59
808a12j1R7j6j19rQ5M1K0n6j02r4J55K59p5m05j30L61L31j67m20j17K67K83K9
832I5k15l04m6L23L47j25m80j54L73L21j22l03q9J24J16M8jj13j29N7J60Jr5J0
856b01O3r9j04J23K41l6l16j20K33K23j9j93j57j3J85K62k4l56k52K71M07J8l85
879b49k20J55K79Q2j27j83r1J14K35N2k07j71R8J83Kj15J3O0m7p1O7J13j3j12
903a53m2L5J04P7Qj58j51J01K88P0k56k48J09L12R0j81j97m9J65K31M3k22k46
926b70R6L23J08k15k11N3J66P3p4K0j13j8J19N8N6k50j3Q1J29n0kM1n4j37P5J79
952A70Q7j40j86OJ87J29j7j75j65M3K47J79j53k94o2K41K28j6k36j44L5K22J21
$$ y = [431, 206, -300, -367, 53, 347, 158, -173, -267, -104, 112, 220, 31, -258, -298, 43, 257, 38, -286, -214, 25, 47, -112, -123, -26, -42, -161, -170, -85, -44, -24, -80, -182, -276, -121, 138, 63, -342, -472, -111, 220, 53, -367, -484, -217, 66, 95, -120, -424, -470, -147, 200, 75, -405, -559, -186, 135, 13, -290, -379, -255, -139, -91, -92, -205, -334, -277, -117, -116, -211, -201, -138, -237, -341, -218, 23, -13, -329, -449, -216, 7, -12, -205, -362, -375, -190, 72, 48, -308, -560, -289, 118, 136, -249, -469, -314, -35, 47, -80, -263, -354, -240, -5, 47, -160, -331, -233, -50, -48, -163, -150, -90, -137, -208, -141, -28, -41, -153, -195, -160, -56, 21, 29, -129, -280, -179, 109, 179, -77, -325, -216, 96, 186, 5, -192, -241, -76, 155, 198, -24, -270, -174, 149, 257, 42, -169, -116, 50, 123, 49, 69, -44, -62, 57, 115, 171, -79, -92, -11, 118, 68, 66, 107, 53, -84, -9, 170, 257, 117, -69, -63, 124, 253, 236, 61, -104, -61, 186, 365, 212, -82, -144, 97, 325, 309, 73, -71, -36, 186, 307]
975C07r4k16q1J77J77k3j58p9L7Q1M0K5l7q1m2N9J03Oo3o7l8M4J24O1q1j99n8
1002g6J96J97o1k04j38J06J83Q0j13j71o2J64J78ok19j58J29J91M6j19j64kJ08
1025H5J00K3p1j29lR7Q1j7o2m5KK5N3N2o3r1k6P4R8Nq8r2k5J17J16j2j52j05Q6
1054C3J44M9j20j38J0J19R6pj21j36M6J35R6o9j35m5P9J02J2q0o3j7O9N8J4p4
1080E7p3K5N9L9k7m8l1j5L5P1Np0p2MR6N6l1r4n6N2J07L1p6j17k4J18J05k4j20
1109a8p2K1J07N3o5p9l8O9Q1rp0n3mN2M0J0l6n2l4N3O0Mm6o5rO3N1jn0p0qJ14
1141aO5m8j20l7P7J04J9q1q7qR2P2Kj11n3L5R3N3p6p2NN0N8On3l9mL3L8kj0l0
1173c0j3PJ8N0j7n6k0K2N6K4l0o8j2O0O8K0q9p0K2Q8M2m7o1j9N0O0rn7m6J4Q5
$$ y = [307, 213, -3, -84, 93, 270, 247, 89, 10, 47, 128, 168, 193, 156, 75, 33, 92, 195, 201, 138, 71, 33, 77, 201, 262, 181, -18, -76, 120, 317, 256, 52, -86, 20, 203, 283, 170, -1, -63, 101, 279, 273, 54, -104, 25, 216, 262, 143, -21, -23, 85, 185, 208, 137, 8, 5, 102, 183, 166, 104, 59, 61, 86, 139, 191, 128, 37, 11, 85, 183, 188, 100, 8, -17, 100, 216, 204, 52, -53, 33, 177, 226, 106, -32, -22, 97, 193, 186, 65, -71, -25, 110, 206, 137, 2, -43, 36, 138, 150, 70, 7, -10, 59, 117, 131, 57, -16, 9, 68, 107, 80, 32, 1, -14, 21, 92, 97, 27, -45, -41, 55, 111, 80, -14, -70, -18, 89, 120, 44, -73, -97, 21, 126, 102, -18, -90, -69, 38, 91, 26, -53, -91, -22, 59, 50, -20, -73, -77, -25, 15, 25, -11, -63, -97, -44, 16, 20, -26, -91, -100, -37, 14, 13, -37, -107, -115, -1, 64, 16, -104, -141, -64, 40, 59, -22, -109, -117, -25, 47, 49, -62, -115, -80, 13, 66, -10, -82, -77, -27, 31, 37, -16, -55, -59, -26, 12, 10, 0, -30, -43, -36, -18, 32, 15, -41, -61, -39, 17, 41, 11, -57, -69, -9, 59, 79, -10, -80, -58, 30, 72, 25, -36, -55, -5, 55, 46, -11, -57, -43, 42]
1204D2L5o2o5mN2M8j9m0oJ4J8jk1K3%j9LJ4Krl0nL1K0K9k4n3j7L5N2Pn4m4RO4
1239B5K7n1o0KQ4L7m0p5pM0M3J8l7l5j7L9K9mm7NL1J8j9j3KJ4j6m%K7J1j7l7m
1273c1N1L0Kl6m7K3O0J2m4m9J2N7L3m2o2j5O1N3j4l8k3K2K6Lk1j9L1J0Ll5j1K6
1305B8K9qm0j1M3J8k5k9mN9J7k5n1J1K9J8Ql5m6M2M2Mm8m4K2O2Rm1m6L1L3Lk3
1338C2l0K6K3mmm7PL5K1j9k5j0K3K7km2j0K9L5po0mL1J3j0k0oK0nLoj7rKL6%l9
1375a3rL0K8m1l1L2L4k0m3PM1J9m0j7J3J6LrLk8K0J8J5k4m7jM8K5k1n6LM4L3m4
1409a2m8NN3J5m2k7K2J8Mk8J8LrJ1KJ2l3J0M0ml4k9L7N0l8o1J8N5Nm8k4L5L4k5
1443a5j0MlnL1K2l4n7K0O6J0n1l5K6M3Kk6j1jK3J3k1j%J8pk6OL0qj8j4J2JJ1J5
$$ y = [42, 77, 15, -50, -54, -2, 46, 27, -13, -19, -5, 13, 12, -9, 14, 14, -5, -2, 12, 14, 5, -25, -30, 1, 21, 50, 26, -27, -44, -9, 43, 50, -4, -48, -39, 25, 52, 1, -59, -57, 27, 64, 24, -51, -58, -18, 25, 43, 6, -29, -46, -7, 22, 18, -29, -24, 7, 25, 6, -7, -5, 9, -7, -11, -11, 16, 27, 10, -27, -31, 20, 50, 52, 16, -31, -8, 52, 64, 20, -29, -17, 40, 73, 31, -31, -46, 15, 68, 54, 16, -7, 15, 41, 44, 23, 4, 35, 45, 48, 13, 2, 28, 57, 49, 9, -2, 41, 59, 34, 5, 1, 60, 77, 52, 1, 12, 41, 59, 67, 32, -14, 28, 70, 74, 26, -18, 4, 66, 75, 34, -12, 19, 52, 55, 32, 2, 28, 51, 47, 43, -4, 3, 38, 59, 40, 15, 5, 28, 55, 53, 11, 1, 30, 65, 58, -2, -6, 25, 38, 28, 8, 2, 22, 17, 20, 14, -3, -12, -10, 26, 26, -13, -22, 8, 36, -5, -36, -4, 30, 10, -33, -26, 15, 34, -6, -23, -10, 6, 9, 0, 3, -25, -5, 13, 28, 4, -43, -44, 4, 29, 8, -48, -45, -1, 32, -12, -60, -55, -2, 13, -29, -56, -34, -16, -12, -40, -22, -19, -28, -17, -15, -3, -36, -26, 14, 10, -24, -53, -16, 34, -4, -65, -47, 8, 13, -35, -59, -24, 10, -15, -25, -21, -24, -29, 2, 24, -10, -67, -47, 19, 29, -22, -57, -31, 12, 14, -12, -23, -24, -1, 12, -9, -10, -10, 8, 1, -25, -19, 11, 3, -15, -29, -17, -16, -5, 10]
1479A0k6k8nN2L5m8p5K3R7J3o6n5K9M8Lomj1k9J8M5mn6k4N0L4l6l4L0J4k2pK4
1512a1L0m1k5J7J7J6jl3k0J7L4K2l8l8RK8K8j2j4l3qN1M3j8q5j0O1K6j3l9kK5
1544a7QkRql8J4M0K9l1m3J1M7j5MRMl8k6N9M6k4p1kN2K9nm3k0LK6N2j0n6k5J9
1579a3N8Ol2l1pK6L6K3n8k0kM0K3k2j6pj9LM3K8m9n1QM8M3l5m9j3nM0N2j4p8m9
1613i3O2Q3Np7m4K6N3K7j9m2l3QP5K9m5o7lN4L0j1k9k4j1L1L4kl4l7kM3K8j2k9
1646b6l5lN1M1j0o4l9K8O8J0l1m8j3L4M7J7n0m9J3N8L1k2n3j5K4K1K5pl4l1ON2
1678dK2j9l6j4ML8M1j5n1l1K1Q4J2n7m7j6P1N5k7n1n4K8P0L8l6p3k2O4N2j8n8
1709b9k3J5L8L1mn0k8K8J7J7Jj9k9jK1K4J3l5k8J8L9K1k3m0j3K8M6K1n4o0%O8
$$ y = [10, -16, -44, -49, 3, 38, -10, -85, -62, 35, 48, -18, -73, -44, 4, 7, 1, -3, -14, -43, -25, 20, 16, -40, -64, -14, 20, -16, -50, -20, -6, -28, -35, -11, 19, -22, -47, -30, -13, 3, 2, -31, -51, -34, 0, 22, -16, -54, -45, -17, 11, -1, -15, -48, -56, -5, 38, 20, -65, -75, -14, 12, -1, -40, -42, -17, -9, -11, -2, -10, -48, -34, 6, 35, 4, -39, -28, 19, 4, 8, 17, 21, -17, -43, 16, 62, 38, -33, -35, 17, 46, 41, -2, -22, -19, 7, 59, 49, -7, -32, -13, 45, 51, 19, -12, -19, 7, 43, 66, 8, -12, -14, 26, 49, 27, 11, 4, -15, -12, 31, 59, 10, -41, -33, 15, 58, 23, -26, -39, -44, -4, 48, 34, -44, -93, -31, 52, 57, -20, -64, -38, 15, 42, 23, -19, -52, -44, 31, 60, 15, -52, -55, -1, 29, 18, -11, -35, -46, -15, 19, 17, -17, -54, -56, -13, 15, 3, -26, -61, -64, -13, 28, 18, -46, -85, -57, 11, 21, -10, -58, -71, -37, 10, 27, -23, -72, -59, -1, 30, 8, -45, -60, -36, -15, 10, 3, -31, -62, -56, -4, 18, -1, -37, -51, -47, -9, 32, 17, -34, -65, -44, 40, 52, -5, -52, -68, 3, 58, 31, -20, -74, -46, 24, 62, 26, -47, -69, -5, 47, 29, -29, -52, -37, 1, 32, 28, -22, -50, -22, -5, 12, 13, -6, -35, -36, -15, 9, 22, -13, -41, -23, 16, 37, 14, -26, -39, -11, 35, 56, 2, -58, -58, 10]
1741A0M6k6o3nK5L0L0k9m8nK7M7Jm0l2J0L1J3Jk6oj8K8L0ll4k6mM6L0j4l6k8P
1775c1M9K3j3o2l1M8N6kn3l5PN2K3ol4l4K4M7J1k0k8oLL8kj3j7j4J6K5J0j4j6
1808Aj0LK5J7j7k2j3K1L7Rm8k5J2K7K9j6j9k3QM6J4l6k7jL1K0j6k0j8NJ5K0kj2
1842A5j8MJ6J1Lj2j7JJ0KQKk0K1Pjpj3j9J1K8Qk6k8K1J1Pj1j3knJ1K4k8j7J5N
1879DJ7j6nj7J1K6l3J2jrjOnMk0J4Rj9NMOOrpJ4nJ5k9j2QK0j2LoNNpQkj1ORJ6
1922Gj5pOQJ0k2nJ3Koj8J3K1Qnl1NJ5J5qj1j7kK9K5j7m4LL9K3l6k9J8K8Klj1o
1960cjKJ5jj0KqJ5k7K1NK4l1l0J4M3J6m0l1J6L7J3k6k6j4L4L7mm2l2L7L4Jk3l4
1995a7J1K6K2l1l2J6J7J1k3mlK6j1j4OJ3Ok0k5J2J6L6k3m5k1M8N4pn5n4K7R3R
$$ y = [10, 56, 30, -33, -38, -13, 17, 47, 18, -30, -35, -8, 39, 40, 0, -32, -22, 9, 22, 23, -3, -9, -27, 1, 31, 28, -6, -32, -36, 10, 40, 26, -10, -38, -31, 18, 41, 28, -34, -65, -17, 39, 37, -16, -51, -44, 8, 31, 25, -9, -43, -19, 28, 39, 19, -9, -15, -12, 26, 24, 11, -6, -20, -4, 21, 31, 17, 1, -9, -6, 19, 36, 19, -3, -16, 5, 42, 51, 3, -22, -10, 17, 46, 30, 11, -12, -4, 42, 56, 20, -7, -8, 23, 43, 27, 7, -11, -6, 9, 29, 27, 15, -3, 1, 17, 28, 31, 19, 2, 3, 13, 15, 23, 25, 5, 26, 33, 32, 25, 12, -7, 4, 32, 40, 14, -14, 7, 18, 25, 14, 1, -1, -6, 5, 29, 1, -16, -1, 4, 21, 5, 0, -17, -6, 20, -13, -1, -2, -11, -12, -6, -11, -7, -27, -13, -4, -23, -18, -14, -8, -2, -11, -18, -4, -9, 6, -23, -35, -27, -7, -19, -16, -22, -17, -12, -19, -11, -13, -24, -18, -9, 7, -8, -15, -9, -1, 9, -13, -18, -5, -3, -9, -27, -14, 7, 15, 10, -21, -16, -1, 14, 6, -5, -22, -24, 5, 30, 13, -31, -28, 11, 34, -2, -31, -13, 15, 17, 14, 3, -3, -4, -2, 13, 12, 2, 4, -4, 11, -16, 5, 10, 34, 3, -27, -13, 30, 46, 6, -25, -9, 28, 41, 15, -11, -25, 9, 46, 42, 0, -32, 5, 39, 40, 17, -17, -6, 20, 42, 11, -21, -5, 12, 23, 0, -4, -7, 19, 8, -6, 0, 13, 19, -1, -26, -14, 2, 38, 15, -30, -51, -3, 51, 44, -11, -65, -38, 55, 64]
2028F4p5n6L1O3L5m0o6lM4N9j2m0m3K2M5J1k6k7K6Nj0kKJ1jk9j6K7M7j0k8m2J2
2061b2N9L4n0o4ON9O7l9q2j8M8N6Rn6m4PO2M7m4n5mN4Pj7l2LL7j5lj2J0K0Jk9
2095@rL6K7k3n6j8N6N3%p6l5M3O1Qn5o0J4P1N6n6p2j8P1M7m2n6j0L4M3j2k5k1
2127b4OJ8K3l8j2J5K3j8l7J3M0K1m6l8J8O8pk4o3J0N4M4m0p2j2M9O9lp6m8M8P4
2159C5Mn5m5K0L8K5k6l8JN2lj9m2M9rK5o1O0j34J77n8m6L9J4j9K6k8o0P3MM6o5
2191b0l9J8O3J2m0m5J7M0L4l6m0pL1O3l0o2oL5L2ml8JRL0j6j7OJ4K3k7l5RK8K6
2225B9k1m7JO3J2l7m2ON3J2nm6kPM0J2l6l6K2M2On4j3J9L1Rk4j8J1OKKk6PNJ0
2261@j4j9J8L8j2l8rL3J4j4mk8J9J6K4j2n0K1K5J7l6j4QL3Kk3k0j1K7J5j3Lk1
$$ y = [64, -11, -67, -36, 27, 62, 22, -44, -47, -3, 56, 44, 4, -39, -17, 28, 39, 13, -14, 12, 17, 7, 5, 7, 18, 17, -12, -28, -1, 46, 36, 8, -34, -22, 37, 71, 21, -43, -37, 22, 89, 50, -32, -50, -2, 54, 63, 7, -37, -30, 32, 79, 35, -20, -24, 30, 37, 20, -12, -9, 28, 13, 10, -2, 8, 28, 29, 0, -9, 27, 54, 31, -25, -43, 13, 66, 66, -10, -45, -2, 59, 67, 12, -48, -34, 37, 93, 37, -35, -53, 18, 65, 23, -33, -43, -9, 34, 22, -3, -24, -18, 0, 23, -15, -27, -12, 11, -7, -44, -31, 9, 30, -16, -54, -36, 32, 25, 1, -62, -52, 2, 46, 6, -66, -78, -29, 40, 37, -39, -87, -39, 35, 39, -16, -61, -41, -3, 22, -4, -42, -41, 11, 8, -11, -53, -4, -13, 12, -49, 11, -123, 54, -4, -50, -11, 3, -16, 10, -18, -78, -5, -1, 45, -20, -59, -41, 22, 34, -6, -51, -34, 6, 40, 4, -36, -43, -12, 51, 21, -41, -47, -12, 20, 16, -22, -21, -12, 18, 2, -15, -9, 5, 28, 1, -34, -25, 3, 29, 8, -39, -38, 25, 37, 0, -42, -36, 17, 29, 24, -22, -24, -17, 23, 35, -1, -37, -15, 27, 33, -21, -34, -15, 16, 25, 1, -17, -6, 0, 2, 4, -22, -15, -10, 0, -14, -33, -15, 23, 11, -27, -36, -3, 11, -3, -7, -35, -16, 0, 24, 12, -38, -17, 8, 25, -11, -25, -17, 16, 18, -5, -25, -36, -9, 6, -7, -4, -25]
2294b5QK7ll6oK9P%k1J0jJ6j8Oj0OL%lj1jJ6Ok7JJ5J1j8j1J4QRp%j4J3J8j3j3
2333a5j0J3RLj6%J4PplokJ4mKkLLrrJ3MJpj5J5J1j1OJjLmLoj2J4LNk4kK1Kkk2
2378a9QJ1Pqj1KNNLj2MkLMjmQkj3J0oL3l0pmRK7j8mrj3L6Oj8j9oL4Klk9J5ROo
2422Cj5J0LRj4Oj1J0Jj1mMOJ3l0OPK2k0mk3L1J4Pj8j3%K7J3l2jj2L1J4j4k2LK0
2460A6Qj2j0KPK0nk2OJ0Jrj1J2PPk3OJJ2Knj8J7J0J5k0m1J4K7K2k0l5QL3jpj7
2498Gj8K2OJ1k5j2J1K3Qj6k5JK9j4krNORj6j1J9jppoJ8P%j4k2L6K1j2j9k7J7K8
2536B1Lk9j8PK6Lrl2kK3K6k0k3KKK3J1k2j5RK5j2rkJ2Oj4j6J5K1Nk6k2J4K5Nr
2573Dj8pK6J2j3k4nK8K0ll8pK4J6mk5j2K4K0qj7nJ1J3Oj0j6kJ8ljk1J1J3%k1k
$$ y = [-25, -17, 10, 7, -29, -35, -6, 1, 1, -20, -10, -11, 5, -13, -7, -17, -11, -8, -8, -11, -22, -23, -7, -1, -28, -27, -12, -1, -19, -30, -16, -8, 1, -6, -6, -20, -7, 11, -2, -15, -25, -12, -3, 0, -16, -16, -2, 5, -2, -5, -11, -13, 1, -3, -1, -3, 0, 3, -6, -15, -2, 2, 3, -4, -19, -4, 7, -4, 2, 3, 2, 5, 1, 4, -2, -14, 0, 3, 8, -16, -18, 3, 5, 3, -19, -11, 0, 7, -1, -12, -10, -5, 0, 3, -9, -5, -7, -4, 0, -1, -5, 3, 1, -12, -2, -8, 25, -5, -12, -16, -7, 20, 2, -2, -11, -24, 12, 18, 0, -19, -25, 9, 11, 8, -21, -6, 3, 9, 3, -12, -2, 1, 10, -4, 2, -9, 1, 2, -9, -13, -9, -3, 10, -20, -14, -7, 15, -5, -9, -32, -1, 13, 20, 2, -11, -11, 16, 29, -3, -4, -16, 15, 29, 15, -7, -4, 16, 24, 12, 2, 4, 11, 31, 26, 4, 10, 20, 21, 12, 1, 13, 20, 27, 4, 10, 11, 23, 25, 20, 2, 19, 29, 44, 24, -17, -3, 24, 46, 26, -9, -1, 32, 31, 24, 7, -11, 11, 17, 28, 3, -9, 2, 25, 33, 17, -8, -7, 22, 8, 6, -3, 2, 8, 17, 1, -10, 9, 8, 1, -6, -12, 6, 13, 13, -1, -23, 13, 34, 22, 3, -24, -7, 21, 24, -5, -23, -16, 10, 13, 4, -28, -30, -7, 19, -1, -24, -22, -20, 3, 14, -8, -23, -14, 11, -1, -10, -12, 0, 6, -8, -24, -9, 12, 17, -9, -31, -17, 8, 13, 4, -14, -21, 5, 17, 4, -20, -25, 3, 23, 20, -18, -25, -1, 15, 11, -14, -26, -2, 18, 10, -7, -12, -1, 12, 18, 8, -8, -10, 8, 5, 4, -17, -6, 7, 7, -14, -16]
2610a6K2J1pk1PJ7mpk5QJ6KJ0j5j3JK7Lj0k5kL3Nk4j8mM3qlj2NPKj3LJ1mjNj4
2650hjNOnkKJ7Mk0j4QL5Kl4k5K3L1jj3l4jJ9J8j1qnoL1Kk4qJK6Oj4klPj4J1Ro
2692DJ4rj0J1J6nj7nLRPKk6mK9J5k2k3MJ5K0Nk8k0J2K3K1l1k8J7K6lj3j2J3k%
2729HLOj8J5%j0kJ3jnnQMJ4pj9j5K2K5%l0j8J7K9J2l2qOJ2J6Kk7l4K9J8Lqj9l
2768AJ9Nj4pJ0Lk1J1QnnlJJ5rNj9KmJ6J1j4nKNK2j6Ok9nM6J8j5j02K4K7Kpj4K6
2808iK3k0K9k0K2m1j3O5m6pK0l5O1l7RL2r6Q3n6L0L1r4J11o7L2K1l7K2m2L0m6
2839d5j1P6m9mRO9m5k8J6nK0jQj2j6J4PRk6LO%mJ7jj0k9K6RJ3rk2NJJ9Rnl2%J9
2879AK6%l4j0J3K0Qk5k0JL3J5j3k0k1K8Qj0Oj0l%J7Krj7JOJ4onnNj9K4O%k1jK5
$$ y = [-16, 6, 17, 10, -11, -4, 13, 9, 2, -23, -15, 1, 3, 13, -2, -15, -14, 13, 16, 6, -19, -21, 12, 17, -7, -25, -29, 14, 6, 3, -9, -4, 3, 5, -8, -5, 6, 2, 1, 6, -8, -9, -4, 2, -3, -5, -3, 14, 18, -2, -16, -8, 27, 29, -5, -30, -7, 24, 23, 10, -24, -25, -6, 12, 1, -7, -12, -18, 13, 15, -9, -17, -16, 10, 16, 2, 0, -3, 4, -10, 1, 10, 4, 18, 9, -1, 10, 26, 21, 4, -1, 2, 11, 18, 20, -6, -10, 19, 34, 12, -11, -7, 8, 28, 33, 5, -15, -3, 20, 41, 10, -18, -1, 25, 22, 9, -3, 10, 8, 8, 11, 17, -1, 14, 14, 4, 2, 15, 14, 9, 4, 12, 16, 30, 23, 4, -11, 11, 36, 36, 6, -12, 5, 34, 46, 14, 6, 12, 24, 40, 42, 15, -19, 10, 28, 31, 23, 4, 1, 20, 25, 11, 4, 14, 17, -4, 7, 15, 10, 5, 2, 3, 18, 9, 14, -5, -3, -7, 9, 20, 6, 1, 3, 8, 30, 14, 20, -9, -14, 32, 50, 35, -67, -43, -16, -14, -21, -35, -9, 14, -6, 23, 3, 25, -16, -29, 36, -10, -17, 3, -32, 29, -8, 1, 33, -63, 20, -36, -6, 25, -69, 42, -25, 7, 28, -9, 13, -29, 1, -45, -56, 20, -29, -33, -24, 45, 0, -28, -12, -17, 3, 2, 10, -2, -18, -4, 3, 12, -14, -11, -5, -5, -9, 8, 7, -3, -32, -6, 3, 16, 7, -15, -10, -9, 10, 19, 14, -18, -18, 1, 27, 27, -7, -17, -4, 16, 24, -1, -21, -20, 13, 28, 15, -5, -26, 2, 10, 0, 6, -4, -7, -7, 10, 12, 3, -14, -13, -7, 7, 1, -4, -9, -4, -23, 1, 7, 7, -14, -15, 10]
2919A0J6j1l5OJ0J8Kpk5mJ2K7%k4k5J4K9%j1j0jmK0J2k8%JJ7Nj2JpJ0LjK2j8j9
2957g%J0J9Oj5k2LkL2J5l5k1J0L1Pql5JJ4RRj4k0NK6J7j2m1PK3J6j6nJ1nJ2mJ3
2995C4l6QJ7kLj0l%RnPJ0jk3%K3qrqLmPJ4pl0RK6Qqk3j1OK7Rj3k8mJ4K5pk7mO
3038fK1j6kJ9j7j0J4J3Qk1%Oj2MJ5j0j8J1J1J2Ol4pK2J8Lk6rJ1OJ9Lj9l6J6K2
3074A7K9l8k1J0J8Pj8%j4RJ4lrMLJ7j7k1K6jqrRJ6j0j2M%RJOj1k0QK2J4j0l6J5
3113@K9j1omj3NK2J3j2l6%L5J4k1poJ0J9j1prKpjJ6j6QJ2j0mJ2Nj0j1kJ0Pkk0
3152grJ4K2Oj6l5PL4J3j2l7lL0J3mj5k0J5J9Mj9qj6K9J9j4k4J1K8j6lj0jRJ2j0
3188F%kJ3j0pj2J3J7pk9j2J8K9Kk1k1oM3krk0pJ4K4j0k9rK4K1Ml2pJ1K5Jj9Pp
$$ y = [10, 26, 15, -20, -14, -4, 14, 16, 9, -16, -20, -8, 19, 19, -5, -30, -16, 13, 13, 2, -8, -9, -13, 7, 19, -9, -9, -8, 9, 14, 2, 3, -4, 6, 9, 8, 30, 12, -7, -7, 3, 22, 28, 13, -9, -6, -8, 24, 39, 4, -17, -7, 24, 31, 23, -12, -11, 3, 12, 21, 7, -13, -8, 18, 35, 23, -18, -11, 12, 28, 12, 7, 18, 13, 25, 21, 34, -2, 6, 23, 21, 24, 14, 11, 11, 20, 15, 22, 32, 31, 8, 8, 31, 23, 14, 6, 9, 5, 12, 26, 19, -11, -2, 24, 32, 24, 1, -10, -4, 23, 32, 19, -9, -13, 1, 26, 19, -8, -12, -6, 15, -1, -3, 16, -1, -11, 3, 16, 24, 3, 3, 9, -3, 1, 16, 6, -12, -1, 10, 22, 28, -6, -13, 9, 27, 30, 4, -5, 6, 12, 31, 34, 15, -21, -5, 17, 46, 8, -13, -3, 15, 22, 4, 4, -10, -1, 13, 10, 1, 5, 8, 25, 8, -13, 13, 12, 4, -5, 4, 20, 10, -2, 2, 2, 11, 12, 18, 7, -13, -5, 17, 31, 21, -15, 0, 29, 18, 12, 8, -5, 0, 22, 35, 23, -13, -13, 22, 36, 15, 8, 2, 12, 31, 20, 13, 4, 6, -1, -2, 14, -2, 6, 18, 8, 4, 16, 21, 11, 0, -2, 8, 15, 13, -7, -16, -2, 20, 26, 10, -25, -18, 16, 29, 17, -20, -23, 7, 20, 16, 1, -19, -4, 15, 19, 0, -8, -24, 5, 24, 10, -14, -3, 25, 9, 6, -4, -5, 4, 16, 6, 6, 4, 17, 7, 0, -12, 1, 18, 11, -18, -30, -12, 17, 19, -2, -23, -29, 14, 12, 3, -17, -24, -10, 14, 4, -25, -34, -10, 11, 15, -17, -24, -13, 12, 13, -6, 1, -6]
3226fKOkj4J8Mj0j5j2L5K5j8l0ORK3rk7j0J8J4Nj4l2K9L3lm0j9J0L3K1l0k8qM2
3262FRnl6NJ2K9j6k9MK0J4k4qj3K7J0%k9PQK8ml4KK0J8nl3j3K5J9ll1j1K3K5k0
3299cj5j0J5L0Kl1j6PK0Rl0k2K0K6J0l2j2NJ6K3k6j6LJ7J8l0noK6Oj7j5%K8Lj0
3335a2k7J2K6J6j3l7KL9K9j9l4qL6J7j0m0j4K6L5j7k4j0K8M2j3L2j51R7M9k6j7
3366A4m5M6RM1m9p0O6o7Q4q7O7K3J0L0r6j5n2J42p6K0J7m3N7jk7k2J7K1kql8K4
3398a0RK3lm0j2M5K5k6k0qK8Oqk1OK1J6j9j5j3K7K4j9k8%J7K0j5k1j4L0K7j3m7
3432b8lL4K0j2k5k0J6K7j1kk3J2L3Ok3k6OL2J4j8l0NL9jk0j8KJ8K7k5k8K5QJ1
3466B2j4k3QK3J2k3j3J3J6Lk8k0kM2Pj9j5jK2J5j6k0JQJ7pk5j1K9K1j7k4nPL6
$$ y = [-6, -4, 2, 0, -14, 4, 8, -2, -17, -29, 6, 31, 13, -17, -11, -2, 21, 12, -15, -25, -7, 7, 12, -2, -34, -5, 28, 25, -15, -34, -24, 9, 30, 0, -28, -36, 6, 15, 10, -26, -21, -9, 20, 4, -25, -21, -1, 13, -11, -19, -32, -5, 5, 5, -24, -17, -9, 19, 15, -19, -17, 3, 21, 16, -17, -30, -5, 14, 11, -20, -31, -8, 17, -3, -18, -28, -13, 17, 19, -12, -28, -21, -1, 8, -22, -44, -24, 2, 12, -20, -32, -27, -11, 12, -14, -30, -27, -10, 8, -22, -27, -33, -7, -1, -18, -33, -33, -5, -2, -12, -39, -27, -1, 15, 2, -35, -33, 6, 35, 16, -18, -26, 10, 27, 17, -23, -37, -11, 24, 7, -17, -27, 1, 43, 30, 62, -89, 8, 57, 31, 14, -31, 15, 24, 65, 16, -54, 12, -55, 29, -58, 9, 32, 42, 72, -24, -39, -91, 51, -25, -5, 12, -31, 26, 25, -2, -24, -7, 14, 12, 4, -34, -10, -1, 22, 19, -21, -33, 12, 37, 11, -9, -17, 11, 17, 9, -12, -6, 15, 31, 12, -3, -16, 11, 35, 16, -12, -12, 5, 25, 10, -11, -25, 5, 32, 19, -28, -31, 3, 23, 11, -14, -34, -18, 9, -2, -4, -27, -15, 18, 24, 1, -25, -19, 13, 27, 9, -21, -16, 23, 22, 2, -16, -14, 4, 31, 6, -22, 3, 11, 22, 8, -15, -7, 16, 28, 5, -8, 5, 21, 24, -4, -24, -26, 16, 23, 4, -11, -12, 10, 25, 9, -11, -10, -2, 15, 8, -17, -28, 1, 22, 5, -19, -24, -17, 19]
3501A9j4j8jLJ6Kj2k3J6K5j1j3j4J3J8%qj6RK4Ql6pK0J5nj5k1J5J9Jj7j4mK9Q
3537A1k0j6J3J5J1j2k4LJ2J9plj7OQj0j4QNJ0qnNJ5knj6JRJ3j0k9%K5NPk5%J8
3576dK0j9k5rQL6Nk6qNK6pjk2oK0Qj1pnJ3Lk%oJ0rM%Qj2jkMqK7nrj6MJ1J4j5k0
3620b9J6J6Pnk4OJ2KJmj9JRKJ6k7J2JJ9%j4JmJKRJ5j3j4JPPJ1ok3OJ8J4nl1pK4
3662A1QMpk8KJ8J9j8j8nQK7Lj6k6J9J3nQj8kPPjj1J7j0oJ9mqJ3j1rJ1JJ1j8kj
3702BJ0J6qj8lJJ9Oj0k7J8QJ3mj7j3QMK2rk5jJ8K4k2mrJ0J4j5JkkJRLj2Qk1j0
3742a7RJ5J5j7j6MK9J0j5j4j2K5J6Lk8k6jN1Qj2l4PJ7Nnnoj3L0Nj3j7J1J6kk6
3778cNK7j9Oj8J3KMj2jqK0mkj0nJ0J7ml0oK6J9j7k0j2J8K3Qk8j3MQK9j1l6%J9
$$ y = [19, 5, -13, -14, -11, 5, 7, -5, -28, -12, 13, 2, -11, -25, -12, 6, 6, -2, -18, -9, 15, 23, -13, -20, 0, 15, 10, -5, -26, -11, 8, 9, -8, -22, -26, 3, 11, -9, -25, -12, 3, 14, 2, -22, -19, -7, 12, 5, 2, -15, -9, -1, -11, -25, -17, -12, -2, -10, -15, -10, 5, 3, -2, -18, -17, -8, 5, -5, -34, -34, -9, -4, 3, -22, -22, -4, 16, -3, -28, -37, -29, 7, 12, -14, -22, -17, 9, 2, 1, -21, -27, -7, 1, -10, -17, -22, -9, -6, -8, -8, -14, -4, -13, -9, -9, -1, -13, -14, -16, -12, -20, 7, 2, -7, -23, -19, -8, 6, -9, -29, -13, 3, 10, 5, -19, -13, -1, 1, 2, -2, -21, -20, -11, -9, 7, -20, -8, -7, 12, 12, -2, -1, -5, -4, -2, 7, 22, 9, -5, -4, 3, 10, 21, 15, -8, -2, 16, 30, 25, -6, -13, 11, 19, 23, 16, -12, -10, 8, 27, 9, -9, -14, -6, 21, 24, 8, -18, 1, 14, 9, 17, -1, -3, 4, 11, 10, -1, 16, 6, 0, 19, 15, 7, 20, 9, 0, 11, 12, 23, 5, 3, 2, 12, 28, 20, 2, -1, 0, 19, 25, 15, -12, 6, 14, 27, 23, 6, -7, 1, 5, 27, 18, -7, -8, 10, 34, 12, 8, -1, 9, 23, 8, 9, 7, 5, 6, 15, 18, 6, 14, -7, -17, -8, 7, 22, 5, -11, -7, 22, 32, 17, 3, -9, 16, 32, 35, 7, -19, -20, 31, 39, 27, -7, 0, 17, 22, 17, 12, 6, -7, 23, 28, 15, -2, 9, 25, 23, -3, 2, 29, 10, 16, -2, 11, 13, 17, 5, 4, -4, 16, 12, 10, 0, -5, 5, 22, 18, -12, -18, 8, 27, 10, -10, -22, -4, 19, 27, -1, -14, -10, -2, 27, 16, -20, -20, -1]
3816aK3k5oLRPj1NOMqmlPjpj1kJ4J9%l1j1LL5jj7j9QK0J6k4k2qL0L2k3k7Kj2L7
3857FllrJJ6qKj3J3mJ0lj7K3Lj3lj1K8Lj5j6mK7J2nk1j8K5K2J1l8k0J6L5Nl2k3
3895b1J2K8R%l1MqK7oj6kJJ6kj6LOKrnPJ0pjj5PJ7Nj9j2MK7J2j8l7J7K0J0j6j8
3935a5j3K7K8jk9k0J7L5qj8j0%K9mj2nRnJ2mj9K4%oj8pQK0jk3j5K7J3kk4j2J9
3972cL4j0l5j3lM7J0j7l4OK9J3rk8kJ6J7Lj2k8J3K0Jqj0J0MrL%J0Oj6qJ1K3j2
4009A9rj7KJ8J4ol2mL6Q%l8lK2PLj7j9J2J6K3l3j0jJ8Ooj2pJ3%Kj1PPnrJ0J0j2
4049BJ8k2NnK4poojJ6Joj9jJ3K1qj7qRK2lk5oJ3J6rkmlJ2Rj3j5kK3pqqJ5MMj6
4092@lOmPk0PPJJ0j6nRJ6Lj6rkL1jll0J6KK0j7%j9J8R%mj2JRjLj5K3j2Joj4K1
$$ y = [-1, 22, -3, -9, -6, 3, 10, -1, 4, 10, 14, 6, 2, -1, 6, 5, -2, -13, -15, -1, 18, 18, -13, -24, -21, 14, 13, -4, -23, -15, 5, 21, -3, -25, -33, -3, 29, 6, -21, -19, -31, 6, 3, 0, -9, -8, 8, 0, 2, -11, 2, -2, 8, 5, -12, 11, 14, 1, -2, -13, 15, 18, 3, -13, -17, 10, 22, 17, -4, -22, 3, 25, 36, -2, -22, -6, 29, 34, 2, -21, -9, 19, 28, 28, -3, 1, -7, 20, 14, -2, -4, -3, 13, 11, -5, -2, 4, 6, -3, -8, -1, 9, 2, 1, -14, -7, 10, 15, -4, -16, -12, 15, 27, 9, -28, -11, 9, 19, 3, -15, -28, -1, 27, 26, -3, -23, -6, 29, 21, 3, -7, -7, 22, 18, 6, 1, 10, 5, 17, 13, -6, 18, 18, 12, -6, -13, -5, 15, 14, -9, -24, 3, 16, 14, -10, -22, -3, 31, 21, -14, -27, -30, 17, 27, 10, -24, -18, 11, 24, 15, -13, -15, 1, 18, 21, 9, -19, -6, 14, 15, 7, -3, 7, 11, 2, 5, 5, 15, 21, 5, -3, 8, 31, 19, 10, -7, -5, 13, 27, 21, -11, -15, 21, 29, 29, -9, -12, 10, 17, 20, 3, -16, -4, 12, 35, 2, -8, -9, 9, 15, 9, -3, -10, 3, 3, 5, -6, 1, 8, 3, -6, 4, 14, 2, 20, -2, 3, -2, 22, 15, 9, 3, 2, 18, 19, 13, -6, -7, 6, 27, 19, 2, -6, 3, 25, 22, -3, -9, 4, 20, 11, 9, 5, 2, 14, 23, 10, -5, -7, 16, 9, 1, -7, 8, 12, 16, 0, -3, 3, -1, 6, -14, -7, 0, 1, 11, -5, -10, -1, 15, 18, 2, -7, -9, 22, 21, 18, -12, 4, 6, 26, 9, 9, -10, 8, 17, 17, 13, 1, 2, 11, 10, 13, -2, 21, 9, 10, 4, -10, 11]
4135A1oMoj2J4J1%l3K1pJ1Qj5nPLPrj4KK5J6j2l8J1J5K4j9j3jJ1J9k0oj6RJ5N
4173A7j3rJ2%J0j4JJ0LoJpmJ7Mj4j1J7mMk0LPNopMj3J9Qj2j5nJ7K0rl1J4RRj0
4214Aj6MJ1Qnj2j0J0J4k%j5RJ0j9PlMJ7j0j4MJ2JPl2J5kJ9Oj8j4J9MKj1kj5K8
4253A2J0j7k1NJ9Qj2j7nK8Nj4j1J0jJ7mk0J3MJ0j3j0nJ4RKj0%K%mk0K0QJ2j2j5
4291cJ5NNj0noNJ4mj6j0JL0j4Pj5JK0loj1J4LQk8jJ0J4Mk1nMJ9kk1J1j5J3J0j2
4331Ej3mK0jk0kJ6kJ4j0j4QK6rj2nRJ7joj0rJ3J0nnj1J8J3Pl0rJ1K3j5jj5%J0
4370A1jLjQoMj7J0POj5%j0J1J7j3j0kLNJ3j2pnJ6kkk8K1PLj0OqRPrmoJ8pJ7j0
4413A7%rOpjQpMJj0MMK0k7k%PJ1%j9LRRkj8kJ0Mj1%j1RNkLj0%jK1j2j9J2J0nn
$$ y = [11, 5, 9, 3, -9, 5, 16, 16, -17, 4, -3, 8, 16, 1, -4, 3, 6, 13, 4, -10, -8, 17, 33, 21, -17, -6, 9, 33, 14, 1, 0, 11, 30, 10, 4, -12, -3, 12, 17, 4, -5, 7, 7, 17, 3, 4, 14, 17, 11, 12, 5, 1, 18, 22, 8, -3, 14, 10, 14, -6, -3, 4, 9, 3, -4, 0, -13, 6, 14, 2, -13, -18, -1, 19, 10, -21, -7, 2, 11, 1, -15, -11, 0, 8, 3, -9, -19, -9, 5, 3, 3, -12, -3, 7, -12, -5, -8, -4, 13, 3, -11, -7, 5, 6, 13, -19, -4, -6, 13, 19, 1, -13, 6, 10, 12, 1, -1, -16, 12, 22, 5, -16, -11, 8, 16, 4, -13, -18, 10, 15, 1, -10, 0, -1, 16, 12, -8, 5, 9, 19, 6, -4, -9, 5, 14, 16, 6, 6, 8, 8, 4, -16, 4, 12, 24, 12, -3, 12, 17, 22, 12, 7, 1, 6, 20, 16, 0, -10, -9, 21, 7, 14, -1, 0, 20, 17, 11, 0, 14, 17, 25, -3, -4, 6, 20, 24, 3, -2, 2, 21, 19, -2, 9, -6, 7, 17, 5, -8, -12, 8, 7, -13, -15, 1, -1, 13, 3, -11, -3, 23, 14, 2, -3, 6, 23, 22, 16, 6, -3, 10, 20, 15, 10, -1, 17, 30, 37, 7, -2, 9, 32, 17, 16, 1, 1, 11, 10, 13, 12, 20, 14, 18, 1, 11, 18, 24, 9, 9, -1, 10, 27, 14, 4, 2, 5, 10, 23, 11, 4, -1, 15, 13, 11, -17, 4, 11, 14, 4, 10, 2, 11, 18, 9, 5, -1, 17, 10, 27, 17, 17, 8, 14, 7, 6, 14, 7, 11, 12, 2, 6, 10, 30, 3, 1, 1, 8, 19, 19, 0, 3, 12, 21, 19, 1, -1, 9, 13, 2, 2, -9, 0, 5, 3, 6, -4, -4, -5, 16, 4, -15, -3, 7, 2, -3]
4458cPMlMkPj6J%pJ3NqknPj1J8mmLlOJJ0rqnJ8kqj0OJ0krj0nJ2Pp%j%MMrlkK%
4509ikPp%OPk0J9nmOoRonLJ2kqJqKJ0LmJj2J6lqlNlK0ooj0%pK2j2jOlPKknlnQ
4560cjJ3j4LoLj3K3j1KpQNj2Qj5pPJ2Qj7KoJ3mj0Oj2K2NroJ0PQj4j0mJ%J6j2k
4603a3J4pPkj4QlrPkPKj1QnMJ0%j7kPK0k0J1j6QJ5qpj3NJ5Nqj2JJ2JJ0j7JKLq
4647a1KRnQJJ0j2%J1j5OMOJk5J1J5n%j0nJ2M%jk3MK6j4KmoJ6pOj2j2J1LpJ6k1
4689a1QJ5rKNRj0NrO%j2Rj3Qj1J3J0j1QKMkmj6J7%OqkKRlj1j2J0PkkNj6RqJ0P
4734A4k5J1JPkMomjNmJ2kj0klK2kj3j3J1J3prqQK9j3qj9RjK1LorLPkLj7jJ4kJ0
4779A8pKlLJlPj0lJ0lJ3rqk4J1QJ5rk2JKL3j9rpJ1J9nrrjJ2plMMnJ2%pQj7P%J0
$$ y = [-3, 4, 8, 5, 9, 7, 14, -2, -1, -1, -8, 5, 10, 2, 0, -5, 2, -9, 9, 5, 1, 4, 1, 7, 8, 18, 9, 1, -4, 14, 12, 4, -6, 0, 10, 8, -1, -11, -16, -4, 3, -4, -4, -5, -5, -1, 3, -6, -9, -11, -9, -9, -11, -4, -11, -11, -5, 2, -18, 1, -4, -8, -2, -8, 1, -5, -10, -7, 5, 3, -5, -4, -12, -10, 0, 3, -1, 0, -12, 4, 1, -7, -10, -5, -8, 12, 6, 0, -10, -10, -17, 5, -7, -8, -2, -5, 2, 4, 2, -3, -6, -11, -3, -4, 9, -5, -2, -8, -5, -18, 5, -6, -4, -11, -3, 2, -10, -2, -17, -24, -17, -5, 3, -14, -12, -18, -5, -9, -19, -13, -25, -3, 2, -7, -13, -3, 4, 12, -2, -12, -16, -15, -15, 1, -11, -13, 1, -6, 1, -1, -15, -7, -10, -19, -12, -14, -7, -5, -16, -8, -13, -9, 1, 1, -16, -18, -11, 9, -11, 0, -16, -8, 7, -1, -8, -21, -16, -1, 4, -4, -16, -15, -3, -2, 8, -9, -8, -6, -3, -11, -9, 0, -5, 3, 4, 14, 2, 2, 13, -2, 4, 8, 14, 15, -10, 1, 16, 11, 11, 1, -4, 8, 12, 12, 11, -12, -8, 18, 4, 6, 2, -4, 12, 5, 11, -1, -13, -2, 1, -6, 10, -11, -3, 12, 3, 5, 10, 19, 9, 14, 5, 11, 11, -1, 8, -5, 3, -8, 5, 15, 4, 12, 14, 18, 16, 12, -4, 13, 13, 19, 11, 9, 11, 20, 17, 6, -6, 4, 11, 9, 7, 12, -4, 5, -3, 7, 14, -11, 0, 1, 8, 6, 10, 4, 0, -1, 4, 0, 12, 10, 0, -2, -5, 17, 15, 2, -11, 0, 13, 6, -3, -11, -3, 26, 13, 5, -14, -5, -6, 15, 18, 12, 3, 6, 13, 11, 14, -3, -4, 10, 8, 18, 11, 13, 10, 13, 14, 11, 18, 8, 5, 15, 12, 25, 16, 8, -16, -5, 3, 18, 9, -13, -12, -10, 23, 4, -5, -12, -1, 18, 13, 4, -5, -6, 6, -1, -4, 0, 4, -1, 11, 11, 4, 12, -5, 2, 2, 12]
4825A2j4PqqPPoRj4K0rMNj0nPJ4j4Pj7lJ9Nj2LlJjJJo%JK6l3J7j5NrJ7mm5M8m
4869C%rJ0Jpn%QMJkjLM%mmoJ9Kj1MoJQnj4QoJ9rqPpJ1oMjNrLLnMRk1MJ0mQk1K2
4921A4pJnp%k1L1Nmj5j1K4OJk7J2Rj3J0LnJ0jpNMmOKnQj0QJ4j5jNmj3MLPKj1k
4966FqPJ6%j7rNJ4qqKnJ0LKk3RMPKj8NPJ3mj5%%J1jNqj6J8j4J7oqJ1jj5J5Nom
5011@JPjNqjlOJ1onj5J2LMj0nkK0mqnMj5K2Jnj1OK0j1moqMLRj4LPJJlkQoJPj6
5060hRRqNjj%%jjPllokRK2k7oOMJ1oj9KPJ3j4jJ1rkJ7j9nlJ0pJ3krJLmLLnkj3
5109b2nK4Omj1j5J5J7nj1RpLJ3jj0JOMOk2J0rJ8qj5J0j0QOrlnJ4kj1J7NnJ2j2
5150BqJ0o%j3J5PollMkOkj0lPJmMkPJ%MplNl%jNRjjlpNJ4qj2oJ7r%jJ9j3J2j9
$$ y = [12, -2, 5, -3, -11, -4, 3, -3, 6, -8, 12, 3, 7, 12, 2, -3, 4, 18, 4, 11, -6, -9, 10, 15, 3, 6, 3, 4, 3, 4, 5, -1, -1, 0, 26, -7, 10, -5, 0, -9, 8, 4, -41, 7, 3, 3, -6, 4, 5, -2, -7, -7, 1, 5, 6, 4, 3, 6, 10, 10, 6, 2, -4, 15, 17, 6, 10, 4, 5, 13, 8, -6, 2, -4, 15, 6, -2, 5, -2, 9, 3, 7, 6, 11, 2, 5, 8, 3, 7, 16, -5, -1, 9, 5, 13, -8, 14, 7, 8, 3, -4, -4, -25, 6, 11, 7, -8, -19, 5, 11, 12, -15, -3, 6, -7, 3, 6, 1, 11, 10, 3, 8, 12, 8, 14, 16, 11, 19, 9, 17, 31, 16, 15, 20, 16, 3, 7, 10, 17, 19, 8, 6, -2, 5, 21, 21, 4, -5, 0, 14, 6, -2, 0, -5, 5, 8, 10, -13, -4, 0, 7, 9, -9, -4, 3, 16, 12, -3, -3, -3, 8, 7, 12, 4, -12, 6, -8, 9, 3, -5, 6, 5, -10, 5, 10, 4, 0, 1, 8, 7, 12, 4, 3, 0, 6, 17, 11, 6, -9, 3, 6, 10, 0, -5, -7, 13, 9, 1, -4, 0, -15, 7, 8, 3, -8, -2, 18, 7, 3, -3, -11, -7, -4, 5, -9, -6, 1, 2, 3, 0, -2, 6, 0, 1, 8, -8, 1, 10, 2, 7, 6, 5, 5, 5, 4, 3, 10, 7, 4, -2, -4, 5, 27, 0, -6, 0, 4, 15, 9, -10, -8, -1, 12, -2, -3, 8, -1, -3, 14, -5, -10, -13, -3, -10, 3, 1, -8, -7, -4, -8, -5, -2, -7, -9, -22, -27, -3, 3, -1, -12, -27, -12, 5, 0, -11, -2, -9, -6, 7, 6, -4, -3, 3, 7, 13, -9, 1, -8, 10, 2, -13, -3, -13, -5, 1, -8, -11, -16, -2, -4, -15, 2, 7, 2, 14, 2, -6, 4, -2, -2, -15, 0, 7, 1, -2, -5, -1, -3, 3, 1, -9, -12, -5, -4, -8, -4, -6, 1, 2, 2, 6, -1, -4, 1, -2, -2, -3, 2, 11, 10, 9, 6, -1, 4, 18, 10, -2, -8, 9, 0, 0, -1, 18, 5, 17, -2]
5200bmPRnjk1J4%Nnj1NJ2Lj2j0nRJ2JmkkJ1j7J8pkLPj1%mJ0j3JJ3RmqMkkKJ1j4
5246bMJ4j8PmKk%J6j4J2k2NJR%n%lMqjPJ5kj6KJjrMJ1oj4PQpJMPkoj%J1j5kNJ5
5295A2rMpKLjJ%QKmojnPkOj1LJQj0mK2k7J9j3Qj4J3j2JJ7j2kLKj5K1lqPj9K0q
5340cQj1J0jPrKlqJ4oJ0orlK0rkj0OQOoK%qJj1MnK1rNMj0J5j3Qj7J6NJj7PnJ1
5386A0Jq%j3J1rnQj2K8j3LrLmJ1pm%MKJ1ppKMOkj0K0j6OjlKPJ2j3mMkMlnLJ0p
5433Hj9J4qJ1kKkKJ2j2omMLpJ6j0MqLMj4jJ6Qk1jJ2j4J1Lnj2J4%mJQjlNrJ0j4
5477fJ9j2Lk0K3j0J1j4KQKLj2kJ8pLj7oK4m%%jj3J3kllOjRj3J1oj2J4j3J2oj3
5518a5J7j5NKQlmpKRloLqQOjj6Q%J4LpqRJ4j1nKjoJ4Lj2rJ8LJj8J3rQjoJpNrJ1
$$ y = [-2, -6, 1, 10, 5, 4, -17, -3, -3, 2, -3, -14, -9, 3, 6, -6, -16, -21, -12, 0, 1, -3, -5, -7, 4, -13, 5, -2, -4, -1, 6, -5, -5, -9, 1, -12, -11, 2, 11, 7, -1, 3, 1, -1, 1, 12, -2, 2, 16, -2, 5, 1, 3, 1, 1, 17, 3, 15, -7, -2, -1, 8, 8, 3, 3, 0, 4, -4, -5, 2, 17, 15, -1, 1, 2, 1, -8, -4, 7, 1, -13, -6, 2, -5, -4, 0, 7, 5, -1, -2, -2, 9, -6, -8, -3, 12, 3, 7, 0, 2, 5, 4, 5, 5, 13, 15, 11, 5, 4, -1, 6, 4, 10, -1, 2, 3, 11, 1, -3, 19, -8, 11, -2, 6, -8, 5, -7, -6, 11, -1, -3, 0, 2, -13, 8, 5, -3, 4, -15, 5, -3, 5, -6, 4, 3, 10, 1, 3, 0, -8, 6, 0, 10, 4, -5, -8, 12, 3, 1, -9, -3, 5, 11, 5, 7, 7, -1, 0, -11, -7, -12, 9, 0, 5, 9, -1, 14, 1, 9, -8, 8, 13, 14, -3, 4, -1, 10, 11, 3, 3, -10, 1, -8, -13, -5, -17, 11, -2, 1, -8, -5, -9, 2, -5, -9, -9, -5, -3, 8, 1, -6, -4, 0, 6, 4, -6, 14, -2, 4, 3, 0, 2, 9, 21, 8, 4, 8, 6, 10, 7, 2, 5, 15, 8, -11, 3, -5, 6, 4, 6, 4, 6, 18, 6, 0, -4, 0, 3, -4, 12, 2, 6, -2, 1, 5, -9, -10, 6, 14, -7, -8, 4, -10, 1, 4, -1, -13, 1, 1, -3, -2, 6, 5, 2, 7, -2, 8, -6, 13, 1, 4, -16, 7, -3, 8, -6, -4, 4, 6, 9, -3, -5, 13, 6, 9, -8, -14, 10, 6, 6, 6, 5, -8, 5, 3, 0, -3, 3, 2, 11, -2, 9, 3, -9, 5, -8, 4, -2, -15, 2, -13, -8, -6, 2, -1, -5, -12, -10, -1, -4, -10, -7, -15, -7, -1, -2, -18, -10, -10, 4, 7, 0, -8, 1, 15, 4, -1, 1, 0, -6, 8, 11, -1, -10, 8, 11, 12, -6, 7, -2, 6, 5, -1, 0, -7, -2, -11, 0]
5567@J2rOqk2J0KP%kJ%J3klr%RJ2j0k2RKlRqOMmmkLPLmoJ6oqKj5K3j3RpLJ4j8
5615cJ1j6J2pj1J7rlRMnLj5LJ9j9LljMJ2j9OLjLNk1ROQj0qQJ0j4kRkJJ0ln%J0
5660HppL%J0qMLMqPj4PJpOoJ1nmjN%mKMNKk6J1NrJJ5qNj7LMKj%J2qj1J3Loj0j
5710a2J1qJ4kKKnnQj3J2%kLlKJjnlOmlmK2j5pNoMMJnJLRj4pJJJ4j3J0%rRmj5J1
5759ioJ3j5J4mj0JJ4nlkLJ4j0qJ7kmJ5j6OPLrLj5QmRojLlmPoKRj6LP%koPjj1J2
5807aj4jNJ5kj5K2rrmJ3MllLQj4JOj1PJJ3j9JQkmNlJ9j4KoJ6j1Qj3oJ0PLk4J9
5851HlQj3NRkl0J7mPnjqKJ1MqlmQrKJ2oQoKjjjJkpRQj1lQJj0LJNNk0J9pOrKOp
5903dJ4j2NJnQj3J8oLojnj2J3oJ1m%O%prJ3k5J9nPPj4lPKMkpRlrJ6j1jQmRJj7
$$ y = [0, 12, 3, 9, 1, -21, -11, -9, -2, -2, -4, -3, -3, 10, 8, 5, -4, -4, 5, 17, 7, -15, -6, -4, -7, 2, -6, 0, 4, 0, -4, -6, -3, 4, 7, 3, -3, 13, 7, -1, 1, -14, 9, -4, 5, -2, 1, 15, -3, 8, -8, 4, -3, -14, 3, -6, -9, 0, 4, -1, 2, -13, -10, 9, -10, -7, -10, -11, -7, 5, -14, -8, -5, -6, -3, 2, -19, -10, -4, 4, -6, -14, -6, 4, -10, -12, -3, -5, -4, 6, 3, -2, -2, 8, 1, -6, -3, -3, 7, -1, 3, 6, 10, 2, 9, -5, 2, 3, -4, 2, -4, 7, 2, -2, -3, 2, 2, -2, 0, 4, 9, 11, -15, -4, 1, -8, -7, 8, 0, 5, -12, -9, -5, -3, -4, -4, 8, 0, -11, 2, 5, -1, -11, -12, -1, -9, 5, 3, 5, 7, 2, -3, 5, -8, 4, 4, 2, 5, 2, 4, 5, 4, -1, -4, 2, -2, -5, -9, 13, -2, -9, -4, -10, -6, -2, -1, -6, -5, -2, 7, -7, -14, -13, -12, 2, -11, -1, -1, -10, -1, -5, -20, -9, -15, -2, -17, -3, -7, -17, -16, -2, -7, -10, -12, -9, 5, -5, -13, 4, 2, -2, 13, -3, 3, 10, 13, 4, 7, -8, 0, -4, 5, -1, -2, 1, -2, -6, 1, -5, -3, 6, -10, -7, 0, 0, -2, -8, -1, -2, -13, -1, -15, -16, -11, 4, 2, -13, 9, 0, -9, -13, 0, 4, 1, -2, 1, 9, -5, -4, 2, -9, -2, -1, 12, -7, -6, 2, 0, -4, 1, -2, 17, 3, 5, -1, 15, 4, 12, -1, -7, 3, 10, 13, -11, 8, 5, 13, 0, 5, 14, 12, -18, -1, -5, 2, -3, -4, -12, -10, 1, 5, -3, -6, -10, -2, -11, -9, 3, -3, 5, -1, 1, 0, -1, -2, -1, -3, -10, -1, 7, -4, -7, 1, 2, -8, -5, -4, 1, 6, -14, 5, -2, 4, -5, -3, 3, -4, 10, -2, 3, 4, -1, 7, -6, 12, 6, 9, 3, 2, -3, -15, -2, -8, 3, -1, -1, 5, 5, -2, -11, 2, -23, -4, -9, -2, 5, -9, -12, -5, -3, 1, -1, -8, 1, -2, -11, 5, -6, -7, 1, -3, 6, 7, -10]
5950a0J8rjJ3j4L%OkkjLJ0j6J7q%Qj4OLj6J2Jj9J2nKJ2jlj6nJ4QKnMj1KOj6J5
5993CJlj9J6LLMnr%LjJ7oj2LMLPmnnLLJqRj0K0mj9PjJ5qLrmJ6pj1QRj2J8j2jN
6041InpJrNJ4j0j0J0M%mLqKJ2j2nJ3jj9K6o%PkLlRpoLkOLMkj7oJ2Rnj1RLpkLJ
6090ENqQKj1J1j7QKrkJ1j1J0%mlkOLj0J2j5RM%J2kj9kKLjOj0J1oPkj3J1j1Rnm
6135a0OOlJ2mKojk%ML%%OmpPj2J4qJoJ3j0JL%l%nJ5j2NlJ%pMoK0pJj4Qj5K7j8
6183dJ0okOqMjpPL%lnQKJ1kj5LPj3J0MPk1J1Rj4j%nJ4j3LN%loJ1loLLKlMoRpL
6233EKoK%KKnj%j1J1Rj9lJ4qQkJ1qLkRj4kQJ4j0mlJ%kLJRj5jKQj3J9Kk9J4Moj0
6281a1kJ5jjmlKJJ0j0J4k1J4Lj5NLmJ%%NNq%J0j6J6j0MMlKLj2QkJ2j5J7j0J0k5
$$ y = [-10, 8, -1, -2, 11, -3, 0, 0, 6, 4, 2, 1, 4, 14, -2, 15, 7, 7, 15, 1, 7, 10, -6, 6, 7, -12, 0, -5, -3, 9, 8, 5, -11, -16, -2, 6, 8, 3, 7, -4, -2, 4, -12, 3, 4, 1, -18, -2, 1, 4, 8, 3, -6, -6, -3, -4, 13, 7, -5, -2, 2, 5, 12, 8, 3, -2, 1, 4, 5, -3, 6, -4, 16, 12, -7, 0, -1, 14, 6, 9, 0, -4, 12, 5, -6, 2, 11, -1, 17, 5, 4, 9, 4, -3, -2, -11, -6, 8, -2, -12, -2, 2, 2, -2, 1, -7, -5, 7, -5, -10, 3, 2, -17, 9, 3, 3, 10, 8, 11, 8, 17, 10, 4, 7, 5, 11, 14, 18, 16, -1, -7, 5, 14, 9, -2, 7, 10, 3, 1, 4, 5, 10, 2, 10, 12, 1, 12, -5, 3, 5, -4, -6, 5, -6, 4, 4, 0, -3, -5, 1, 4, -6, 6, -9, 0, 4, 4, 16, 14, -5, -7, -5, -2, -3, 3, -7, 4, -2, 5, 3, -10, 1, -10, -1, -6, -10, -4, 2, -1, 11, 7, 9, 3, 2, 0, 0, 4, 7, 7, 7, 13, 9, 2, 9, -3, 11, 3, 4, -2, 11, 1, 2, 5, 5, 2, 2, -3, 12, 0, 5, 2, 3, 3, -4, 0, -6, 14, 7, 8, -6, 2, -13, 14, -4, 6, 0, -2, 4, -4, 0, -1, -8, -1, 2, 2, -1, -6, 2, 4, 15, 13, -2, 1, 8, -5, 5, 9, 16, -5, 6, 15, 1, 0, 0, -5, 9, -4, -1, 4, 4, 1, -5, 6, 3, -3, 0, 3, 5, 2, 6, 0, 9, 2, 5, 7, 1, 3, 3, 5, 7, 2, 1, 1, -10, 1, 10, -9, -12, 2, -6, 2, 0, 11, 3, 6, 4, 13, -1, -3, 5, 19, 9, 5, 2, 3, 3, 1, 4, 5, 14, -1, -2, 0, 8, -5, 14, 16, -13, 1, 5, -1, -11, -13, 2, 1, 0, -4, -7, -5, -4, 6, -4, 10, -11, 3, 6, -9, -4, -1, -5, -4, -4, -4, 1, 6, -2, -2, 8, -8, 8, -2, 2, 6, 3, 5, 8, -4, 4, 2, 14, -1, 16, 6, 16, -9]
6324iOKLMkk4K3lnKj2J0JNMkqnKRKMNj5lNJMj1KmKJ3Oj6QloONjMrkQ%nk%LJ0n
6376GJ1j0mOj9J1J2k1J2LorJ0j1%J3pkkkMKj4J6olOo%Qj0NlJ2rNj0MJ0kj0J1p
6419eQmMnj0J1kKlJmJ2oJMoNoLJ0j9PLP%j6OKNNj2MoMjmKQj0MJ0JrMoJ2j3jmP
6469@lmMJ1j4QnJ3lkj8K3j2J2lJrJ3mlmNJK%mOj8J3NlqMlNLjqJ1j0nnJ1%%Lnl
6517c%Mq%KJRMj2JJlJ0j7OjRmNlrNOOoKqJ5Oj3J5jj8LMj3K1j8J2j0Mj2NPJmjQ
6565Hj8J0%NmpJ1qJ3nmNj4J3q%K%jPpPpMmmNjQj7QpJ0JlLJ%rOlKPkONj3oQkNn
6617AkOqMqMMRk4J4JnmmLmLrQPLNmj1kJ4rR%oMrPjoJ2j2J4kJNqj3K1j3PLMj3J2
6667Hj0J1j2LRJ2j4lOkqPj3J5nNjk1K4ropK4k1NnNOj4mK1opJ5j4%Lj0J6rmOKm
$$ y = [-9, -3, -1, 2, 6, 4, -20, 3, 0, -5, -3, -15, -5, -4, 1, 5, 3, -5, -10, -8, 1, 3, 7, 12, -3, -6, -1, 0, 4, -7, -5, -9, -7, 6, 12, -4, 4, 1, -5, 1, 6, 5, 9, 0, -2, 6, 6, 1, -1, -1, 2, 12, 7, 18, 8, 4, 10, -9, 2, 14, -7, 5, 8, 2, -7, 3, -8, -8, 5, -2, -4, -6, -8, -4, -2, -16, 0, -6, -9, -3, -9, -9, -1, -11, -6, -9, 3, -6, -1, -11, -7, 3, 1, -9, 2, -5, 3, -1, 3, -2, -12, -1, -3, -1, -4, -3, -7, 5, -1, 0, 4, -2, 3, -3, 0, 10, -9, -2, 1, 8, 8, -8, -2, 0, 5, 10, -2, 2, -4, 0, -1, -5, -3, 5, -5, -1, 9, 10, 1, 5, -1, 11, -2, -3, -7, 0, -3, -7, -3, 8, -6, 2, -3, 10, 7, 5, -13, 10, -2, 10, 7, 8, -1, 12, 8, 5, 1, 6, 7, 9, 9, 5, 11, -7, 6, 11, 8, 0, 4, 1, 6, 9, 8, 0, 11, 1, -4, -9, 2, 2, 2, 5, 0, -3, -3, 1, -7, -7, -5, -4, 5, 9, -3, -2, -1, -4, 6, -11, -5, -6, 3, -1, 4, 1, -8, -3, 3, 9, 3, 5, -3, 12, 18, 5, 20, 19, 1, 4, 8, -5, 16, -2, 10, 0, 4, -8, -3, 4, 5, 1, 0, 8, -10, 0, 0, 5, 1, -6, 5, -3, 10, 5, 1, 6, -8, 5, -3, -3, -1, -1, -2, 5, -2, 5, -2, 2, -2, -6, -1, -2, 6, -11, -3, -10, 0, 1, -2, 1, 2, 2, -7, -1, -4, -2, 5, 3, 9, 14, 1, -5, 3, 1, 6, 1, -1, 5, -3, 1, -7, -3, 1, 10, -14, 0, 1, -4, -8, -12, -9, -13, -10, -19, -11, -4, -1, 4, 0, -11, -13, 1, -8, 1, 1, -5, -1, -10, -3, -4, -10, 2, -10, 4, 2, 3, 8, 0, -13, 8, -5, 2, 5, 9, -4, 8, -2, 9, -3, 0, 9, 21, 7, 4, 10, 8, 0, 7, -6, 9, 4, 9, 8, -13, 11, 2, -4, -11, 13, -8, -3, -8, -3, 3, -11, -15, 6, 0, -7, 8, -6, -6, -3, -13, 3, -6, -10, -4, -2, -6]
6711fOPjj3PJ0pOj7J5lKj0kJ1Lj0OKnNj0J4k0KJ2JPj2Qljk%%p%LJ1ommJ3mKrk
6758eMrJ6%jj0%Rj1NLJ1k7J8Nlj3J4Pj7J9%j3nJ3rJ1j1nPmJ7j1nNlLJ2j0j0LP
6800GnlNNKKj0%%PNj5KjQLj4KOJ1j0mo%NpMOj1P%%lMj0J5kJnkRoOpLJ2j5J5j9
6849cPMMj8jQNJOj3%Rq%mNMjmMrrJ4Ml%j2J1olJ7Kj5%LQljJjrJ1qjJLj5J4Lj0
6899hJJ0kLMLpLj1J6nqJ0oLoONj4J8rJnoJ6j3KjKOj7jKNOkKoLoJkRLj4J6p%nK
6949cMnJ3j4PKOnlMrpJ3lOkpj5K1J2k0JQJmjlPJ1j2oMRnNj0LkpJRJ%JolOlMNm
7000Ej4PpJ0joKmPlJ2lpJJrLRj2K3qMkkrmNLKkjJJJ1j2QMj0OpRoPk1K1rn%jrL
7051iJ0j6LPMkMj%jRj5RJpKmNjNnJJjJ3j1Rj3LKJ0j3qK1j5MJ4k0Rn%koRLklJ5
$$ y = [-6, 0, 7, 6, -7, 0, 10, 3, 9, -8, 7, 4, 6, -4, -6, 5, 8, -2, 4, 6, 1, 6, -4, 10, -10, -8, 4, 5, 12, 0, 8, 5, 4, 2, 2, 2, -5, -5, -2, 9, 3, -1, -5, 8, 4, 6, -3, -5, -1, -10, 6, 6, 5, -5, -5, 4, -7, -2, 1, 12, -15, 3, 8, 5, -8, 6, 13, -4, 15, 15, 2, -3, 10, 1, 12, 1, -4, 3, -1, 16, 5, 0, 5, 2, 5, 17, 7, -3, 0, 7, 2, -1, 4, 9, 11, 13, 3, 3, 3, 10, 15, 0, 2, 1, 9, 12, -2, 0, 6, 17, 7, 3, -3, -3, 2, -5, -1, 5, -6, 1, 1, 1, -2, 2, -8, 7, 5, 6, 1, -1, 8, 2, 8, 1, 4, 16, 1, 16, -3, 4, 8, 12, -6, -7, 1, 6, 7, 13, 0, 0, 9, 1, 1, -3, 2, 6, 5, 1, 5, -4, -13, 1, 5, 2, 2, -10, 1, -5, -8, 9, 11, -4, -4, -1, 7, 4, 3, 4, 3, -6, 5, -3, -4, -3, 0, -15, -1, 2, -8, -7, 3, 1, 4, 8, 11, 4, 7, -4, 12, 7, -1, 9, 3, 6, 0, 6, 11, -3, 15, 6, 7, 2, -4, 12, -1, 1, 0, 2, 8, -9, -10, -8, -3, 3, 1, 3, -3, 0, -6, -5, -7, 2, 5, -9, 7, 0, 0, -5, -3, 1, -4, 9, -5, 2, 4, 10, 5, 2, 6, -3, -10, 3, 0, 6, 4, -3, -18, 3, 15, -5, -4, 4, 5, 1, 0, -3, 4, 15, 3, -3, 1, 10, 5, 10, 0, 3, 1, -6, -5, 4, 5, 5, 6, 0, -3, 3, 0, 4, 9, 5, -9, -2, -9, 1, 0, -6, -4, -8, -1, -4, 8, 5, -2, -1, 0, -9, -6, 3, -9, 14, 6, 10, 8, 6, -3, -7, -2, 1, 3, 1, 0, 1, 2, 13, 1, 9, 13, 3, 9, 2, 11, 5, 12, -9, 12, 3, -2, -2, -3, -12, -9, 1, -15, -12, -5, -1, -3, 1, 0, 0, -1, 8, -7, 2, 3, -4, -2, -6, -1, -2, 3, -2, -1, 0, -1, 12, 1, 10, -3, 0, 2, 12, -1, -9, 12, -3, 1, 15, -5, 4, -1, -1, -3, -9, 0, 3, 1, -2, 13]
7099A3pKnJk%PJrQj0pK6mJj7JL%mJ0j0J%qNjOj8J5mnJ8k0J7JrJ2k%nJ1k5J4%j5
7145a4l8M3J6nJjlpj0J4K6j2k2MJ1j2NQPkrnJ1rJ0j1Nj0nRJJ0oJMlkkkpK1l0J9
7188ankPoK5j8%KNj1J3j9J3jOm%MnjOnj0J3qJ2jLj2nJ0%LpMnKmJRk6J5lJ1Onk
7235Dj4MJ1j2NlKKKj0Po%JJL%J1jKqNJ3j9j4J9oOjnJ1kpKL%KkqJ1lJLmjj%olM
7285aLKMk2NJPqJ4j6J0kmRj2J0Lj2LnJ2jjqJ1OlRqNpLLoNJj3mQRKokJ7k7LNMP
7334A3j5lPJ0j6RpkJpK0k1J6mknJJ4j6OLJoJ0NnkJoQMk0J3lJ5j7loK7j5Kj3J2
7377DJ6k4K0j2Kj3J1KoLJ0rpRJrNj1J0lOJj3K%nRLo%nKJ4j2J4nMj2j2J0MpMnk
7422a2%J5knknJ7Kpj4J0lLNlJ3kj0Oj1MmMrLJ5j3J0J2k7NRoOpQ%KkqJ0j3J1po
$$ y = [13, 6, 8, 3, 4, 2, 2, 9, 10, 1, 9, -1, -8, 18, 14, 15, -2, -1, 2, 2, -2, 8, -2, -1, -1, -9, -4, -5, 1, -17, -2, -6, -11, 7, -13, 4, 5, -4, 8, 6, 6, 1, 12, -13, 1, 1, -14, -52, -9, 7, 2, 3, 2, -1, -8, -18, -4, 22, 10, -12, -8, 3, -9, -4, 4, 11, 9, 0, -5, 6, -3, 7, -4, 1, -9, -14, -5, -4, 6, 0, 1, 5, 2, 0, -2, -4, -11, 10, -20, -1, -6, -8, -1, -7, 18, 0, 0, 2, 7, -4, 9, -10, 3, 2, 8, 4, 4, 8, 3, 2, 8, 3, -7, 6, -2, 10, 9, 12, 0, -5, 5, 5, 8, 1, 5, 0, 2, -2, -1, 8, -18, -3, -6, 5, 11, 6, 4, -10, -6, 5, -7, -2, -5, -3, -1, 1, -9, -2, -8, -8, -7, -6, -3, -3, 8, 7, 9, 1, 6, 19, 0, -14, 5, -1, 5, 4, -1, 10, 8, 1, 3, 6, 6, 8, 6, -2, 9, 6, 7, 10, 6, 5, 4, 4, -2, -5, -1, 2, 4, 8, -14, -9, -8, -1, -9, 5, -11, -1, -3, -7, 2, -10, 0, 3, -9, -6, -11, 1, 0, -1, -9, 2, 8, 5, 14, 6, 11, 4, 7, 10, 4, 9, 10, -3, -7, 1, 10, 12, 6, 4, 21, -6, -3, 2, 6, 13, -2, -5, 2, 12, -4, 5, -2, -4, -3, -10, 10, -11, 5, 1, -1, -6, -5, 9, -7, -1, 2, 3, -3, 7, 12, 7, 5, 6, 0, 8, 12, -8, 5, 2, 17, 0, -3, -9, 18, 3, 5, -8, 4, 20, -4, 16, 4, 6, -7, 4, 6, 0, 3, 13, 4, -3, 6, 7, -2, 3, -8, 2, -1, 5, 6, -7, -5, -5, -10, -1, 2, -4, -4, -9, -7, 7, -5, 9, 4, 8, -4, -16, -6, -2, -9, -5, -10, -12, -12, 3, 1, -4, -6, -11, 6, 8, 1, -13, -3, -6, -3, 2, -1, 12, 10, 0, 6, -5, -1, -5, -1, -10, -7, 8, -5, 5, 17, -10, -5, 4, -2, 4, -3, 5, 5, 7, 5, -3, 7, -6, 5, -2, -8]
7467hLJ%%%%Oj1QJojnK8poJMmj2J3l%Oj0klJ4kkkjpKlLJ4on%lOrMnJ0jJ1%pjj6
7519a3OMMqnJ1j6J7pOj1OOojJ1okM%mjJJ0pMnJMkj4J5jKoNPoMj2LJORj4LJj0m
7568a0OJ3lJNoMjj2kJ3mOj0Lklj0PJ3nj2QPjlpOpMQqLP%j1QjmknJ0K%lKNKj2P
7618Fj8J6%nJ1j5J1kjn%jKQojJj4RPJoJnkPOqnJ1j3kjJ1MRj5QprJ1JpMoMkJ4p
7667@pPlj2J9jKpJ3j4J2MoJ0j3lJ8j3qJ0JlolPj2kK4qj3LRqjpJ3OnJj8J9j8J4
7710AonjRJ0m%%Kkpj0MJ2pQj2PKqoJ9loJ5j2J2mrQj3J5j2J9j7KPlJOorNJ3j2j
7756BJkknrJ0%MnK%KLj1RLRknKrJ8j0r%J1LrjnjK3j3kJmlOQl0K1MpJ2j2pJ1Nn
7805BNmkPrnJ5kkLj2oMJ5j4MPpRoL%mKrJ0nlNNk1K1Njnj2J1oj0J2j0Qj2J9pNm
$$ y = [-8, -5, -4, -4, -4, -4, -4, 2, -9, -1, 0, -6, -7, -12, 16, 9, 3, 4, 8, 4, -8, 5, 2, 2, 8, -2, -4, -7, 7, 5, 3, 1, 0, -7, -5, -8, -5, 9, 3, -2, -2, -5, 1, -8, -4, -9, 1, 0, 11, 11, 4, 3, -13, -7, -3, 1, -7, -12, -1, -17, 0, -7, -1, -12, -6, 0, -6, -7, 4, -2, -4, 0, 0, -4, -5, -4, 6, -1, 3, -2, -1, 3, 1, -13, 2, 1, 3, -3, 2, 9, 3, 7, -5, -2, -1, 5, 14, 0, 3, 4, -6, -10, -4, 9, 6, 7, 12, 6, 10, 9, -3, -5, 8, 4, 10, 0, 3, 1, -2, -12, -5, 8, 3, -9, -1, 6, 5, 2, -5, 1, -6, -2, 6, -2, 1, 8, 8, -3, 5, 4, 0, -2, -7, 3, 5, 5, 2, 4, 9, 11, -1, 6, -12, 4, 4, -1, 10, -5, 6, 4, 3, -2, -2, -3, -1, 7, 1, 0, 1, -13, -4, 3, 4, -2, -1, -6, -8, -1, 5, -3, -8, 3, -10, -12, -13, -2, 2, 11, -4, 4, -3, -12, -1, 0, -7, -3, -9, -5, -7, 7, 0, -7, 0, -3, -15, 4, 3, 5, -2, 11, -3, 9, 13, 7, 17, 4, 1, 19, 6, -2, 8, 9, 6, 0, -3, 4, -8, -10, 14, 6, -7, -4, 5, -3, -4, -11, 2, 8, 3, 4, -14, 5, -13, 1, -5, -10, -11, -2, 8, 4, 4, 4, 6, 4, -3, -13, -9, 3, -4, 4, -8, -1, 1, -7, -13, 6, 3, -3, 12, 0, 12, 8, -1, 7, -6, 9, -3, 16, -1, 1, 8, 5, 6, 12, 6, -3, 2, 15, 3, 2, 3, 1, -1, -6, -15, -5, -5, -1, -6, -4, -4, -2, 1, -10, -1, 2, 11, 9, 4, 6, -3, 15, 5, -4, -4, 7, 10, 1, 0, -5, -6, 17, 4, 2, 3, -1, -4, 2, 10, -20, 1, 5, -2, 10, -2, -9, 2, 7, 2, 7, 3, 1, 8, -1, -6, 9, 7, 5, 8, -4, -10, -6, 9, -5, -1, 6, -1, 8, 2, 5, 5, 1, 3, -6, 4, -1, -4, 1, 6, -15, 6, 11, 10, 5, -7, 4, -2, -12, 0, -10, -2, -14, 5, -2, 3, -1]
7852aRLoLKjpOpLlJ2j4MmkMLjo%MKj1JNkMkR%JoJ4j5j%MLmj2j0QOkJ4Qj4NpqJ1
7904BLKlOnKJ2j5J7j7lJ1mlJ3k6J7qmjPmJnJ1LkKj6R%Kj2K0nJ2j6Po%nj2J4J0
7948A1j7jJJ2j3NJ4j3NJ0j2qJ%MMrOLmMNkJ0rJ0j3j3J2NnOj6J8jrLKj0%J0knR
7992Hj8KkQPk%qNOnlJ0j6KJ1OnkLj2J1jQopQkj4KmJ5qJ1j4MRJkrLJ5j1qJ0KLn
8040FmRlJ0nj0lJnRklkOjM%j0PpnNlKLmLPpKkLrJ3lJ2k0J0Pkk2J9Nj2J3JrmlM
8090ALoRKNj3KK%kjJ1k4J8j2K%Lj8J1J5moQqjjOjmmMKNoMKljNnJ2j2lJ5j0mnP
8139@nRnNPoLj0LjMLmRj6J3j5PKoJ2j4J8rm%J9j8MmqJ1mJoRmKpRK%Oj3LrPOjp
$$ y = [-1, 8, 11, 5, 8, 10, 9, 2, 8, 1, 4, 1, 13, -1, 3, -1, -3, 1, 4, 3, -3, -3, 1, 3, -8, -7, -2, -4, 0, -2, 7, 7, 8, 2, 16, 1, 0, 0, 4, 7, 3, -9, -19, -11, -5, -7, 7, 15, 1, 6, -1, -9, 2, 5, 7, 4, 10, 5, 7, 19, 4, 21, 4, 1, 12, 8, 5, 18, -8, 9, 1, -3, -4, 3, -1, 0, -5, 6, 9, 7, 9, -7, 2, 2, 4, -8, 12, 7, 19, 3, 10, 4, 4, -1, -13, 1, 11, -6, -7, -6, 6, -7, -2, 12, -1, 4, 14, 2, -6, -5, -5, -1, 3, -6, 0, 3, -1, 3, 8, 6, 16, 7, 17, 4, -9, 3, 8, 3, 9, -7, 11, 10, 1, 4, 6, -4, -4, 6, 4, -1, 8, -10, -8, -10, -2, 5, 3, 3, -5, 0, 6, 1, -2, 8, -8, -6, 5, 11, 6, 4, 7, -5, 6, 5, 13, 7, 0, 8, 6, -8, -6, -10, 5, -3, 8, -6, -2, 7, 8, 6, -3, 0, 15, 4, -4, 6, 8, 11, 6, 2, 11, 8, 18, 13, 3, 0, 1, -4, 5, 3, 0, -2, 4, 3, 7, 7, -3, 4, -3, -8, -3, -6, -4, -1, -5, -2, 5, -2, 0, -2, 1, -8, 5, 2, 14, -6, 4, 11, 9, -13, 6, 11, -1, 12, 13, 4, 0, -3, 1, 4, -2, 7, 9, 14, 1, 3, 5, 5, 3, 2, 13, -11, 7, -5, -3, -3, 0, -18, -7, 8, 4, -2, 6, -2, -3, -4, 2, 1, -3, -7, -3, -1, 4, -2, 2, 4, 1, 0, 5, 0, 12, 0, -3, 12, 2, -2, -7, 0, -5, 4, -1, 4, 11, 5, 8, -2, 1, 0, 4, 7, 3, 12, -4, 9, -6, 1, 3, -3, 9, -5, 13, 4, 0, 0, 19, 1, 5, 1, -7, 4, 0, 1, -5, 4, 0, 2, -5, 4, 6, 6, 12, -1, 2, -7, 0, 6, 5, -2]
8189bn%
8191g
##END NTUPLES=NMR FID
##END=
