##TITLE=1H_DMP2312
 aceton-d6
 8 sc, 
 23.12.2024
##JCAMPDX= 6.0         $$ Bruker NMR JCAMP-DX V2.0
##DATA TYPE= NMR FID
##DATA CLASS= NTUPLES
##ORIGIN= UXNMR, Bruker Analytische Messtechnik GmbH
##OWNER= root
$$ XWIN-NMR		Version 3.5
$$ Mon Dec 23 14:33:32 2024 Russian Standard Time (UT+4h)  she@DPX200
##.OBSERVE FREQUENCY= 200.1315
##.OBSERVE NUCLEUS= ^1H
##.DELAY= (6, 6)
##.ACQUISITION MODE= SIMULTANEOUS
##.ACQUISITION SCHEME= undefined
##.AVERAGES= 8
##.DIGITISER RES= 18
##SPECTROMETER/DATA SYSTEM= spect
##.PULSE SEQUENCE= zg30
##.SOLVENT NAME= Acetone
##.SHIFT REFERENCE= (INTERNAL, Acetone, 0, 15.7039)
##AUDIT TRAIL= $$ (NUMBER, WHEN, WHO, WHERE, WHAT)
$$ ##TITLE= Audit trail, XWIN-NMR		Version 3.5
$$ ##JCAMPDX= 5.01
$$ ##ORIGIN= Bruker BioSpin GmbH
$$ ##OWNER= she
$$ F:/spectra/data/she/nmr/H-F/1/audita.txt
$$ ##AUDIT TRAIL=  $$ (NUMBER, WHEN, WHO, WHERE, WHAT)
(   1,<2024-12-23 14:32:18.40 +0400>,<she>,<DPX200>,
      <created by zg, POWCHK disabled, PULCHK disabled
       configuration hash MD5:
       00 E9 B6 7A A2 85 ED C7 34 08 36 98 17 FE 4E 26
       data hash MD5: 16K
       30 FE 0F F9 D9 AA 83 C2 3F B6 79 65 7B 63 C1 AB>)
$$ ##END=
$$ 
$$ hash MD5
$$ BD 49 C5 3C BF B6 A5 EB 52 21 D1 17 4A CC EE 7B
##$RELAX= 
##$RELAX= 
##$RELAX= 
##$RELAX= 
##$RELAX= 
##$RELAX= 
$$ Bruker specific parameters
$$ --------------------------
##$DU= <F:/spectra>
##$EXPNO= 1
##$NAME= <H-F>
##$PROCNO= 1
##$TYPE= <nmr>
##$USER= <she>
##$AMP= (0..31)
100 100 100 100 100 100 100 100 100 100 100 100 100 100 100 100 100 100 
100 100 100 100 100 100 100 100 100 100 100 100 100 100 
##$AQSEQ= 0
##$AQ_mod= 1
##$AUNM= <au_zg>
##$AUTOPOS= <>
##$BF1= 200.13
##$BF2= 200.13
##$BF3= 200.13
##$BF4= 200.13
##$BF5= 200.13
##$BF6= 200.13
##$BF7= 200.13
##$BF8= 200.13
##$BYTORDA= 1
##$CFDGTYP= 0
##$CFRGTYP= 5
##$CHEMSTR= <none>
##$CNST= (0..31)
1 1 145 1 1 1 1 1 1 1 1 1 1 1 1 1 1 1 1 1 1 1 1 1 1 1 1 1 1 1 1 1 
##$CPDPRG= <>
##$CPDPRG1= <>
##$CPDPRG2= <>
##$CPDPRG3= <>
##$CPDPRG4= <mlev>
##$CPDPRG5= <mlev>
##$CPDPRG6= <mlev>
##$CPDPRG7= <mlev>
##$CPDPRG8= <mlev>
##$CPDPRGB= <>
##$CPDPRGT= <>
##$D= (0..31)
0 1.2 0 0 0 0 0 0 0 0.06 0 0.03 0 0 0 0 0.0002 0 0 0 0 0 0 0 0 0 0 0 0 
0 0 0 
##$DATE= 1734949937
##$DBL= (0..7)
120 120 120 120 120 120 120 120 
##$DBP= (0..7)
150 150 150 150 150 150 150 150 
##$DBP07= 0
##$DBPNAM0= <>
##$DBPNAM1= <>
##$DBPNAM2= <>
##$DBPNAM3= <>
##$DBPNAM4= <>
##$DBPNAM5= <>
##$DBPNAM6= <>
##$DBPNAM7= <>
##$DBPOAL= (0..7)
0.5 0.5 0.5 0.5 0.5 0.5 0.5 0.5 
##$DBPOFFS= (0..7)
0 0 0 0 0 0 0 0 
##$DE= 6
##$DECBNUC= <off>
##$DECIM= 24
##$DECNUC= <off>
##$DECSTAT= 4
##$DIGMOD= 1
##$DIGTYP= 9
##$DL= (0..7)
0 120 120 120 120 120 120 120 
##$DP= (0..7)
150 150 150 150 150 150 150 150 
##$DP07= 0
##$DPNAME0= <>
##$DPNAME1= <>
##$DPNAME2= <>
##$DPNAME3= <>
##$DPNAME4= <>
##$DPNAME5= <>
##$DPNAME6= <>
##$DPNAME7= <>
##$DPOAL= (0..7)
0.5 0.5 0.5 0.5 0.5 0.5 0.5 0.5 
##$DPOFFS= (0..7)
0 0 0 0 0 0 0 0 
##$DQDMODE= 0
##$DR= 18
##$DS= 0
##$DSLIST= <SSSSSSSSSSSSSSS>
$$ [...]
##$SUBNAM2= <"">
##$SUBNAM3= <"">
##$SUBNAM4= <"">
##$SUBNAM5= <"">
##$SUBNAM6= <"">
##$SUBNAM7= <"">
##$SUBNAM8= <"">
##$SUBNAM9= <"">
##$SW= 24.0689530833862
##$SWIBOX= (0..15)
0 0 2 0 0 0 0 0 0 0 0 0 0 0 0 0 
##$SW_h= 4816.95568400771
##$TD= 16384
##$TD0= 1
##$TE= 0
##$TE2= 300
##$TE3= 300
##$TEG= 300
##$TL= (0..7)
0 120 120 120 120 120 120 120 
##$TP= (0..7)
150 150 150 150 150 150 150 150 
##$TP07= 0
##$TPNAME0= <>
##$TPNAME1= <>
##$TPNAME2= <>
##$TPNAME3= <>
##$TPNAME4= <>
##$TPNAME5= <>
##$TPNAME6= <>
##$TPNAME7= <>
##$TPOAL= (0..7)
0.5 0.5 0.5 0.5 0.5 0.5 0.5 0.5 
##$TPOFFS= (0..7)
0 0 0 0 0 0 0 0 
##$TUNHIN= 0
##$TUNHOUT= 0
##$TUNXOUT= 0
##$USERA1= <user>
##$USERA2= <user>
##$USERA3= <user>
##$USERA4= <user>
##$USERA5= <user>
##$V9= 5
##$VALIST= <valist>
##$VCLIST= <CCCCCCCCCCCCCCC>
##$VD= 0
##$VDLIST= <DDDDDDDDDDDDDDD>
##$VPLIST= <PPPPPPPPPPPPPPP>
##$VTLIST= <TTTTTTTTTTTTTTT>
##$WBST= 1024
##$WBSW= 4
##$XGAIN= (0..3)
0 0 0 0 
##$XL= 0
##$YL= 0
##$YMAX_a= 927370
##$YMIN_a= -990304
##$ZGOPTNS= <>
##$ZL1= 120
##$ZL2= 120
##$ZL3= 120
##$ZL4= 120
##$ABSF1= 10
##$ABSF2= 0
##$ABSG= 5
##$ABSL= 3
##$ALPHA= 0
##$AQORDER= 0
##$ASSFAC= 0
##$ASSFACI= 0
##$ASSFACX= 0
##$ASSWID= 0
##$AUNMP= <proc_1d>
##$AZFE= 0.1
##$AZFW= 0.1
##$BCFW= 1
##$BC_mod= 2
##$BYTORDP= 1
##$COROFFS= 0
##$CY= 11.3945322036743
##$DATMOD= 1
##$DC= 2
##$DFILT= <>
##$DTYPP= 0
##$F1P= 15.6554695791079
##$F2P= 12.8336369535428
##$FCOR= 0.5
##$FTSIZE= 0
##$FT_mod= 4
##$GAMMA= 1
##$GB= 0.15
##$INTBC= 1
##$INTSCL= 1
##$ISEN= 128
##$LB= 0.24
##$LEV0= 0
##$LPBIN= 0
##$MAXI= 10000
##$MC2= 0
##$MEAN= 0
##$ME_mod= 0
##$MI= 1.114404
##$NCOEF= 0
##$NC_proc= 0
##$NLEV= 6
##$NOISF1= 3.799351
##$NOISF2= 2.8
##$NSP= 1
##$NTH_PI= 0
##$NZP= 0
##$OFFSET= 15.70392
##$PC= 1
##$PHC0= -26733.69
##$PHC1= 16.18744
##$PH_mod= 1
##$PKNL= yes
##$PPARMOD= 0
##$PSCAL= 0
##$PSIGN= 0
##$REVERSE= no
##$SF= 200.130013532006
##$SI= 16384
##$SIGF1= 3
##$SIGF2= 2
##$SINO= 400
##$SIOLD= 16384
##$SREGLST= <1H.CDCl3>
##$SSB= 0
##$STSI= 0
##$STSR= 0
##$SW_p= 3612.71676300578
##$SYMM= 0
##$S_DEV= 0
##$TDeff= 0
##$TDoff= 0
##$TI= <>
##$TILT= no
##$TM1= 0
##$TM2= 0
##$TOPLEV= 0
##$USERP1= <user>
##$USERP2= <user>
##$USERP3= <user>
##$USERP4= <user>
##$USERP5= <user>
##$WDW= 1
##$XDIM= 8192
##$YMAX_p= 0
##$YMIN_p= 0
$$ End of Bruker specific parameters
$$ ---------------------------------
##NTUPLES= NMR FID
##VAR_NAME=  TIME,          FID/REAL,        FID/IMAG
##SYMBOL=    X,             R,               I
##VAR_TYPE=  INDEPENDENT,   DEPENDENT,       DEPENDENT
##VAR_FORM=  AFFN,          ASDF,            ASDF
##VAR_DIM=   8192,          8192,            8192
##UNITS=     SECONDS,       ARBITRARY UNITS, ARBITRARY UNITS
##FACTOR=    0.0002076,     1,               1
##FIRST=     0,             0,               0
##LAST=      1.7004516,     0,               0
##MIN=       0,             -990304,         0
##MAX=       1.7004516,     927370,          0
$$ Real data points
##PAGE= N=1
##DATA TABLE= (X++(R..R)), XYDATA
0@%%%%%QqQj6QqK2k2K2l6L8m0O0p1P3r3J13j24J51j76J95k30K67k98L42l89M32
$$ 0 0 0 0 0 0 8 0 8 -8 0 -8 14 -8 14 -22 16 -24 36 -35 38 -55 58 -66 85 -91 104 -126 141 -157 185 -204 228
32B28m91N56o15O91p78Q57r51J065j177J301j449J600j766J961k168K399k672
$$ 228 -263 293 -322 369 -409 448 -503 562 -615 686 -763 837 -929 1032 -1136 1263 -1409
49a409K973l314L721m193M747n431O271p306Q598j0013R869K1727P23663J70353
$$ -1409 1564 -1750 1971 -2222 2525 -2906 3365 -3941 4657 -5356 4513 26240 749903 920256
63I20256r06577q82232L0722R04449P05902k65509r27170m94955M76361R08019
$$ 920256 13679 -868553 -837831 66618 772520 507011 -420159 -915114 -438753 469266
73D69266K95758o59867q95958j04606Q16263Q52445l5114q60928p45635J83898
$$ 469266 765024 105157 -790801 -895407 -79144 773301 738187 -122741 -868376 -684478
83f84478Q87537O01662l17392q17704l82284M74801P85652J99086o18248p19039
$$ -684478 203059 804721 487329 -330375 -712659 -237858 547794 746880 128632 -590407
93e90407O205P40180O68162j42281q17756o02682K68106Q24695M70608l72330
$$ -590407 -584202 155978 824140 681859 -135897 -738579 -470473 354222 824830 452500
103D52500p81857l26633M66695O91875J07909n88616o07041N8815O60469N14451
$$ 452500 -329357 -655990 -189295 502580 610489 21873 -585168 -526353 134116 648567
113F48567k35828p45501m36273L41307P37692L39050m17842p06882k17283M79603
$$ 648567 412739 -332762 -769035 -427728 309964 649014 231172 -475710 -692993 -213390
123b13390O04389O1792n12893m85710J03522N77823L85263k46228n91376k73918
$$ -213390 390999 452791 -60102 -545812 -442290 135533 520796 274568 -316808 -590726
133e90726L55885O18603K19363m10524n76066j17430M41423N09341L9074m44978
$$ -590726 -234841 383762 603125 192601 -383465 -500895 -59472 449869 488943 43965
143D3965m04634R6061M61626K82281k15594m69760j93153L15920M76885R7376
$$ 43965 -360669 -264608 197018 479299 263705 -206055 -399208 -83288 393597 490973
153D90973l93219m60730n0495L97003M07605k4688m11127l28997R2448L69068
$$ 490973 97754 -362976 -413471 -16468 391137 366449 -44678 -373675 -281227 87841
163H7841K13226j86619l70165j16047K76165L44837K0169l31707l30266L0913
$$ 87841 301067 114448 -255717 -371764 -95599 249238 269407 -62300 -392566 -361653
173c61653L64770L03154p1739l38858k34122J03529L12562J74269j42612k63830
$$ -361653 3117 306271 234532 -104326 -338448 -234919 77643 251912 109300 -154530
183a54530o4050K05114K40063M035k46342k19570O8764K89325J99844q9042k75965
$$ -154530 -218580 -13466 226597 230632 -15710 -235280 -166516 122809 322653 233611 -42354
194d2354j76859J00924K54102J23756j18338k03152o6656J26905J60380j0075
$$ -42354 -219213 -118289 135813 259569 141231 -61921 -128577 -1672 158708 148633
204A48633j78998j36065O3760J89892J08232j00984k17364j05869J07398J84876
$$ 148633 -30365 -166430 -102670 87222 195454 94470 -122894 -228763 -121365 63511
214F3511O8913r5806j47452m6572Q7632R7990r276q5815m8986M9043J02345M1906
$$ 63511 132424 36618 -110834 -157406 -69774 28216 18940 -66875 -115861 -66818 35527 77433
226G7433p7334j12409k0630Q9773J12861L9606o0583q8929k2706M7972N2796J8179
$$ 77433 99 -112310 -132940 -43167 69694 109300 48717 -40212 -62918 -14946 37850 56029
238E6029j1382j5332Q385K1363o188l4533k3985Q296L7243M2022M523m2434m7117
$$ 56029 44647 29315 37700 59063 52875 18342 -5643 2653 39896 81918 86441 44007 -3110
251c110k0635L586K2602K8851J2587q524k6746m4291l2714J2788M0888K6038n680
$$ -3110 -23745 -20159 2443 31294 43881 35357 8611 -35680 -68394 -55606 -14718 11320 5640
264E640k9884k7237L804J8461o940k6036m288L5000N4153K1941n2637q6837k3547
$$ 5640 -24244 -51481 -47677 -29216 -36156 -62192 -66480 -31480 22673 44614 -8023 -94860 -118407
277a18407P3235J03095M0165n9498r5486k0531P5345P5437o761o6993m0459M7908
$$ -118407 -45172 57923 98088 38590 -56896 -77427 -2082 73355 66594 -399 -40858 7050
289G050R5354K5157r1220j11804r261J10938J28340J1148j29429j34892K1J19373
$$ 7050 102404 127561 36341 -75463 -84724 26214 154554 165702 36273 -98619 -98598 20775
301B0775J02291k3156j22410q0498N8121J19305K5627j08636j30950q816J39986
$$ 20775 123066 99910 -22500 -102998 -44877 74428 100055 -8581 -139531 -148347 -8361
312h361J44921j9471j73658j46620K8997J73383J38010m6131j74639r7782Q6402
$$ -8361 136560 117089 -56569 -203189 -174192 -809 137201 91070 -83569 -181351 -94949
323i4949J62882N2901j19152j55214L714J79205J56617m4215k00550j43824P4933
$$ -94949 67933 120834 1682 -153532 -149818 29387 186004 141789 -58761 -202585 -127652
334a27652K27409J38276r7484k14536r4581J18990J95855N2089j51628j73173
$$ -127652 99757 238033 140549 -73987 -168568 -49578 146277 198366 46738 -126435
344a26435J4540J85392J41505o9709k19988j33130J10383K36965J01431j43314
$$ -126435 -111895 73497 215002 145293 -74695 -207825 -97442 139523 240954 97640
354I7640k36667q5767J50756K15507L5115j78729j82957J5275J90622J46975p7022
$$ 97640 -139027 -224794 -74038 141469 176584 -2145 -185102 -169827 20795 167770 90748
365I0748k26638j14857J37047K43004Q5659j70100k50187n6311K03803K38808
$$ 90748 -135890 -250747 -113700 129304 214963 44863 -205324 -261635 -57832 180976
375A80976J8133k06502j95733L2676K25740J58844r2611k31022r6944J55471K44838
$$ 180976 199109 -7393 -203126 -170450 55290 214134 121523 -109499 -206443 -50972 193866
386A93866O1986k02851k47681j3658K35364K27882j9706k41581j99218N9894K39712
$$ 193866 255852 53001 -194680 -208338 27026 254908 235202 -6379 -205597 -145703 94009
397I4009J39778j12330k30334q9291J54329K23585K7948k11829k19051J3601K32922
$$ 94009 233787 121457 -108877 -198168 -43839 179746 207694 -4135 -223186 -209585 23337
408B3337K02748n1454k55708j80365Q5395K43607J32420j16362k30267q1267J61510
$$ 23337 226085 174631 -81077 -261442 -176047 67560 199980 83618 -146649 -227916 -66406
419f6406K14410J8533j98014j92264L4801K39154J85016p8600k55620j50362J16737
$$ -66406 148004 166537 -31477 -223741 -188940 50214 235230 156630 -98990 -249352 -132615
430a32615K57843J22903j41470k38705o2074J76618K07517N876k00545j78236
$$ -132615 125228 248131 106661 -132044 -194118 -17500 190017 195893 -4652 -182888
440a82888N5624K33594J45226j09662k47699j20117J39316K49452Q3937j71599
$$ -182888 -127264 106330 251556 141894 -105805 -225922 -86606 162846 246783 75184
450G5184k32413m4031J77372J93996q032j99932j59867O2590K07260J14140j11115
$$ 75184 -157229 -201260 -23888 170108 162076 -37856 -197723 -135133 72127 186267 75152
461G5152k22259q8701J49970K25584N4188j71185k09785k5942J83423J88770j2942
$$ 75152 -147107 -235808 -85838 139746 193934 22749 -187036 -212978 -29555 159215 146273
472A46273j87234j40605O1870J91697J05509j03367j95621n8477J51156J96764
$$ 146273 -40961 -181566 -119696 72001 177510 74143 -121478 -179955 -28799 167965
482A67965L0130j70198j88480N69J88868J66552l2222j83328j29929O2506J79053
$$ 167965 198095 27897 -160583 -160014 28854 195406 163184 -20144 -150073 -87567 91486
493I1486Q5606j07127j72884m0556J36196J62006L056j69961j59660K5206J77267
$$ 91486 177092 69965 -102919 -143475 -7279 154727 157783 -12178 -171838 -146632 30635
504C0635J35313m8589j78562j15766O9408J66615P1540r6845j49374l3197J22611
$$ 30635 165948 117359 -61203 -176969 -107561 59054 130594 33749 -115625 -148822 -26211
515b6211J39767p273j49131j22584M0449J63316J14989n6702j65456r0214P9394
$$ -26211 113556 106283 -42848 -165432 -124983 38333 153322 96620 -68836 -159050 -79656
526g9656J55087O4712q6328j34125k6371J11013J15945j2610j23500r4410M3562
$$ -79656 75431 140143 53815 -80310 -106681 4332 120277 107667 -15833 -110243 -66681
537f6681J40159Q2276o9792j44551o4073P8078J32748M5455q8204j19517j9054
$$ -66681 73478 155754 85962 -58589 -122662 -44584 88164 133619 45415 -74102 -93156
548i3156R0376Q8587j3313j00357p3785M0206J08834N0126o6963j13822m2124
$$ -93156 -2780 85807 72494 -27863 -101648 -61442 47392 97518 30555 -83267 -125391
559a25391P5312J13486K8691q2977r8841j1681P9687Q1304n675q1270n6164L6405
$$ -125391 -50079 63407 92098 9121 -89720 -101401 -21714 59590 53915 -27355 -83519 -47114
571d7114Q5551L7840n3003q7720k1939P5422R2683J1690p5961q0903k539P6362
$$ -47114 38437 76277 23274 -64446 -86385 -10963 81720 93410 17449 -63454 -65993 10369
583A0369O9901j1191o9308m3583K6481O1685K3761m5421o3423n755N8688N7190
$$ 10369 80270 69079 -229 -43812 -17331 44354 68115 22694 -40729 -46484 12204 69394
595F9394o035o5377n9990O995O1794M5819j4446n2185l5251J4205M1553J5575
$$ 69394 63359 -2018 -62008 -55013 6781 52600 38154 -14031 -49282 -35077 6476 22051
607B2051k8157l4309L39L4562L2298p549m4496l3496J4701M5927L2630q323l8156
$$ 22051 -6106 -40415 -40076 -5514 26784 19235 -25261 -58757 -44056 1871 34501 26178 -11978
620a1978k7026J2038L2386J5905j0141j7503j926J9153J7551q903k5629j1703
$$ -11978 -39004 -26966 5420 21325 11184 -6319 -8245 10908 28459 19556 -6073 -17776
632a7776J5315K9187J6822j3214k9768j5223R330J7815J0185l372j0703m940K200
$$ -17776 -2461 26726 43548 30334 566 -14657 -5327 12488 22673 19301 8598 3658 5858
645E858k461q429m448L352Q221O984k952j2488r883k461J118M789P814N432K12
$$ 5858 3397 -5032 -9480 -6128 2093 9077 6125 -6363 -16246 -18707 -17589 -12800 -4986 446 658
660F58o266j3387r879O203J7247J2980L95j1173j1848J238J1300N818l451l303
$$ 658 -5608 -18995 -28874 -22671 -5424 7556 7951 -3222 -15070 -13832 -2532 3286 -165 -3468
674c468M542J2465R289q851k1662j0243J4113K6808J6966j0363k9772j8078J1305
$$ -3468 1074 13539 22828 13977 -7685 -17928 -3815 22993 39959 29596 -176 -18254 -6949
687f949K4462J1155j1947k1357n069J8531J6519j1080k9599j7061J5890L6752
$$ -6949 17513 28668 16721 -4636 -9705 8826 25345 14265 -15334 -32395 -16505 20247
699B0247J8246k5592m4986j8011K4979M0568J4172k7443l7201k968L1723K6186
$$ 20247 38493 12901 -32085 -50096 -25117 15451 29623 2180 -35021 -37989 -6266 19920
711A9920r928l5517j9683K4862M6647J5328l4595m7644j0622L9997N1870R564
$$ 19920 9992 -25525 -45208 -20346 26301 41629 7034 -40610 -51232 -11235 40635 50199
723E0199m0742m2792J368M0528L4367r494m2022k2669K6458M5734J2267l7616
$$ 50199 9457 -33335 -31967 8561 42928 33434 -8588 -31257 -4799 40935 53202 15586
735A5586n0607q604M7241N2992N02n2073n0316J810N0052M1547j4793n2544k8931
$$ 15586 -35021 -43625 3616 56608 57110 5037 -45279 -43469 6583 48130 33337 -19207 -48138
748d8138K5985M9351J4630m2237n4794l072N5445N3477p040o1931n2539J4275
$$ -48138 -22153 27198 41828 -409 -55203 -58275 -2830 50647 43607 -18324 -70863 -56588
760e6588O5956M4417k3315o0328k9146L3964N8591J4905m6647n2214N077N9414
$$ -56588 9368 53785 30470 -29858 -59004 -25040 33551 48456 1809 -50405 -45328 14086
772A4086N0866j4484o7366m6608K6977P1333L9518l1517o6870k9655L9314O1142
$$ 14086 64952 50468 -16898 -63506 -36529 34804 74322 42805 -24065 -53720 -14406 46736
784D6736J2318m8399n2610K674N6338M6482k0361o8345m1436L0727P0002L4497
$$ 46736 59054 10655 -41955 -39281 17057 63539 43178 -25167 -66603 -35876 34126 68623
796F8623l9761p2844k6801M5519O3556J1684n0807n5525L531N8796M4349k2760
$$ 68623 28862 -43982 -70783 -25264 38292 49976 -831 -56356 -52825 5971 50320 27560
808B7560o4607l3705L7154P1046K7366m8104p0162j5382N4765O5542P277n6531
$$ 27560 -37047 -70752 -33598 37448 64814 16710 -53452 -68834 -14069 51473 58750 2219
820B219n4228J0267O0663M0850k4131o1479k7862M0962O6111J6117n2933o5038
$$ 2219 -52009 -41742 18921 59771 35640 -25839 -53701 -12739 53372 69489 16556 -48482
832d8482p517N8538O2119k402o3110n3060J2632N9928L8961k6309o1998k5732
$$ -48482 -55999 2539 64658 62256 -854 -53914 -41282 18646 57607 31298 -30700 -56432
844e6432M0237N9010R505n3092n9892l37O1570N5902j1154o4631m8171J8393O3277
$$ -56432 -16195 42815 52320 -772 -60664 -61001 569 56471 45317 -19314 -67485 -49092 14185
857A4185L7505k8883n8833k0178M0135N4277O970m9748m9885R105O0041M5825
$$ 14185 51690 22807 -36026 -56204 -16069 38208 45178 -4570 -54455 -45350 14691 60516
869F0516j7291o1382l9370K5836O2470L0440l1669n4921j7349L7851M9199L076
$$ 60516 43225 -18157 -57527 -31691 30779 61219 29550 -25371 -42720 -4869 44330 47406
881D7406m6825m1951J1364N2342L5562k2640n9174l1603L0605N7769K2199l6019
$$ 47406 581 -41370 -30006 22336 57898 35258 -23916 -55519 -24914 32855 55054 19035
893A9035n4940j4824L9566M6304m42m4722l7302J2496M8806K9064k6358n3438
$$ 19035 -35905 -50729 -11163 35141 34699 -10023 -47325 -34829 13977 43041 16683 -36755
905c6755k0518L5524N3766J4844l9814n0473n522M3402M2647k928m1477l1446
$$ -36755 -57273 -21749 32017 46861 7047 -43426 -48948 -5546 37101 34173 -7304 -38750
917c8750J5106M4206K1551k5594m2758j1245L4542M4396N589l9898m1293J041
$$ -38750 -23644 20562 42113 16519 -26239 -37484 -2942 41454 47043 7145 -34148 -33107
929c3107M0100L5666o033l9406k7939J3420L6140J6042k2065l5409q536K9492
$$ -33107 6993 42659 36626 -2780 -30719 -17299 18841 34883 12818 -22591 -31127 -1635
941a635L4048j335l6806l3350M951L7801L0021j0463l8242k3492J4548L3519J4658
$$ -1635 32413 31078 -5728 -39078 -34127 3674 33695 23232 -15010 -38502 -23954 9565 24223
954B4223j9918l0355m000K7500K6776m694l1367k3824J1569L6359K2024j4901
$$ 24223 4305 -26050 -30050 -2550 24226 19532 -11835 -35659 -24090 12269 34293 19392
966A9392l3633j6124J7233L1020J1064j8791k4136j170K1529J8852n790k4630
$$ 19392 -14241 -30365 -13132 17888 28952 10161 -13975 -15145 6384 25236 19446 -5184
978e184j5257J2797K7083J1771j6038k7485j1322J6076K4887O489j6722k0276
$$ -5184 -20441 -7644 19439 31210 15172 -12313 -23635 -7559 17328 23817 7095 -13181
990a3181l243J5073J4255m382j7833r873R780J8307O191j4260k0915n032J6319
$$ -13181 -16424 -1351 12904 8522 -9311 -19184 -9404 8903 15094 834 -20081 -25113 -8794
1003h794J9753L371j4635j6495j075J3978J1894k740j1266m759P900J2040J998
$$ -8794 10959 14330 -305 -16800 -17875 -3897 7997 5257 -6009 -10768 -2868 9172 11170
1016A1170j1507j1628K025J4130J2354q70j2588j0881J591J0289P283j381o251
$$ 11170 -337 -11965 -9940 4190 16544 15674 3086 -7795 -6204 4085 11368 9987 3736
1029C736l599K784M272j400o127l742K689O728M304l512q726n904J036N486M865
$$ 3736 137 2921 7193 5793 -334 -4076 -1387 5341 9645 6133 -2593 -8497 -7461 -1975 2890
1044B890L52l842l789j375o4oO63J415J799J615p87l173k431K48K034K783K600
$$ 2890 3242 -600 -4389 -5764 -5828 -5834 -5171 -3756 -1957 -342 -1129 -4302 -6733 -6485 -4451 -1668 932
1061I32J226j80j547l156k376J983N893N434P65m858o083r75M918M823J52l284
$$ 932 2158 1978 431 -2725 -5101 -3118 2775 8209 8974 4116 -1967 -2942 1976 6799 6951 3667
1077C667k089K377L886j293p218n348L010R472O655m339j2390q331L878J0676
$$ 3667 1578 3955 7841 6548 -670 -6018 -3008 6464 13119 8780 -3610 -11941 -8063 2613
1091B613N892m588r745l950N875P224j477r039o241M712J2282O743p665j4759
$$ 2613 8505 3917 -5828 -9778 -3903 3321 1844 -7195 -13436 -8724 3558 10301 2636 -12123
1105a2123o392Q865J5557O954q438j3797l606R971J1596N43j0456q399N178J4458
$$ -12123 -18515 -9650 5907 12861 4423 -9374 -12980 -3009 8587 9130 -1326 -9725 -4547 9911
1119I911P110r353j6380n672J2585J8775M944j4386j8008k720J4300J4946j112
$$ 9911 17021 7668 -8712 -14384 -1799 16976 21920 7534 -10474 -13194 1106 16052 14940
1132A4940j5501j1509O034J5893O172j2218j8099l923J6095J8851J41j9334j8808
$$ 14940 -561 -12070 -6036 9857 16029 3811 -14288 -18211 -2116 16735 16876 -2458 -21266
1145b1266J124J9269J6178m575j9066j1469Q460J7868O366j2944j7604q01J8456
$$ -21266 -20142 -873 15305 10730 -8336 -19805 -11345 6523 12889 -55 -17659 -18460 -4
1158dJ7955k484k0943j7171N915K3393J6085p816k1765j1501J0929K0764O894
$$ -4 17951 15467 -5476 -22647 -16732 6661 22746 14930 -6835 -18336 -7407 13357 20251
1171B0251j4686j8248q4J8900J6745n109k2895j5667R405K4651J3087j2594k4758
$$ 20251 5565 -12683 -12767 6133 22878 17769 -5126 -20793 -11388 13263 26350 13756 -11002
1184a1002j0744J4287K2045M719j7233j8926O31J9064J4910p663k2529j2066J2484
$$ -11002 -21746 -7459 14586 19305 2072 -16854 -16223 2841 17751 10088 -12441 -24507 -12023
1197a2023K3830R215j6010k4348o323J8204K2206K581j8600j8248K820K0344J4089
$$ -12023 11807 21022 5012 -19336 -25659 -7455 14751 17332 -1268 -19516 -16696 3648 17737
1210A7737q371k0807q814J4400K2845N814j8426k2616j726K1308K1594j036k1808
$$ 17737 9366 -11441 -20255 -5855 16990 22804 4378 -18238 -19964 1344 22938 21902 94
1223I4j8141N587K1779J2730j0446k1294p466J5590K0732J357k0566k0305K313
$$ 94 -18047 -12460 9319 22049 11603 -9691 -17157 -1567 19165 20522 -44 -20349 -18036
1236a8036K2681J8342o363k4173j5679Q988K2145J0421j2427k0533m985J5887
$$ -18036 4645 22987 16624 -7549 -23228 -14240 7905 18326 5899 -14634 -19619 -3732
1248c732J7853j173j9246j5857N879K2094J4235r291k2586j1331J1830K2090Q526
$$ -3732 14121 12948 -6298 -22155 -16276 5818 20053 10762 -11824 -23155 -11325 10765 19291
1261A9291j3384j9066l012J5872J6363j768j7734j2995P630K0479J0515j1657
$$ 19291 5907 -13159 -16171 -299 16064 14296 -3438 -16433 -8803 11676 22191 10534
1273A0534k1482p819J4452K1323M641j6399j8918q82J6820J4923m346j8299j0782
$$ 10534 -10948 -18767 -4315 17008 21649 5250 -13668 -14550 2270 17193 12847 -5452 -16234
1286a6234R059J8418O109j3985j9362l238J6691J8249j90j8175j6392K724J7779
$$ -16234 -7175 11243 17352 3367 -15995 -19233 -2542 15707 15517 -2658 -19050 -16326 1453
1299A453J2669o153j6813p903R722J6007L712j3111j5099O69J6266J4608k792
$$ 1453 14122 7969 -8844 -16747 -7025 8982 12694 -417 -15516 -14847 1419 16027 13235
1312A3235j7103j2964N458J7574J0615o855j5633o633R372J4258K463j2029j2279
$$ 13235 -3868 -16832 -11374 6200 16815 9960 -5673 -12306 -2934 11324 13787 1758 -10521
1325a0521J895J4490J0983n395j6473r813P576J6326P376r286j5464m907J0056
$$ -10521 -8626 5864 16847 11452 -5021 -14834 -7258 9068 16444 7158 -8306 -13213 -3157
1338c157J2570M11j1704j0095L198J2721P322p249j4158n447R408J4267L769j0548
$$ -3157 9413 9824 -1880 -11975 -8777 3944 11266 4017 -10141 -15588 -6180 8087 11856 1308
1352A308j3207j716J0851J0980m16j0228p776L714J0805N178o460j0548k372R195
$$ 1308 -11899 -13615 -2764 8216 7800 -2428 -10204 -6490 4315 9493 3033 -7515 -9887 -692
1366f92J1374J259j0255j0575K94J0488R417j352r791o855L285Q831L707n745
$$ -692 10682 11941 1686 -8889 -8595 1893 11310 9958 167 -6688 -3403 5428 9135 3390
1380C390q399j165P728P862j387r607p815K020R495O650l149r105n208L389P147
$$ 3390 -5009 -6174 1554 9416 8029 -1578 -9393 -7373 2122 8772 5623 -3482 -8690 -5301 1846
1395A846K475m571n864N7N872M500k197o850m097L545P777L998l717o852l043
$$ 1846 4321 -250 -6114 -6057 -185 4315 2118 -4732 -8829 -5284 2493 6491 2774 -4078 -7121
1410g121L546O083K255l056l915Q2L634K718j478m121j692L262N173J500l555
$$ -7121 -3575 2508 4763 1707 -2208 -2126 1508 4226 2748 -1373 -3065 197 5370 6870 3315
1425C315n273j725L307M534J321k740l256q28J732J419r66k102l04J999J737n55
$$ 3315 -1958 -3683 -376 4158 5479 2739 -517 -1345 387 1806 840 -1262 -1566 433 2170 1615
1441A615l001k665J08K432K338K22j504j834q57K58N90O34R82Q39j63r92j035
$$ 1615 -1386 -4051 -3943 -1511 827 1049 -455 -2289 -3146 -2888 -2298 -1664 -682 157 -6 -998 -2033
1458b033k33Q38J298O62J82L93K52l94j198j016M73K546K490K00k529k999o04
$$ -2033 -2266 -1428 -130 532 714 1107 1359 965 -233 -1249 -776 1770 4260 4460 1931 -1068 -1672
1475a672K222K868N14j857k035O7J526O58j720k593j51L118L036n63m474m535
$$ -1672 550 3418 3932 2075 40 107 1633 2291 571 -2022 -2173 945 3981 3418 -1056 -5591
1491e591P0M743M472n50m751l926P69M370K550k419m274n71M357M732o98o087
$$ -5591 -5521 -778 3694 3144 -1607 -5533 -4764 -394 2156 -263 -4537 -5108 -751 3981 3283 -2804
1507b804n048K156P659N351k246p425m649L318P352L260m009n857q25N643N568
$$ -2804 -7852 -5696 1963 7314 5068 -2357 -7006 -3688 3664 6924 2915 -2942 -3767 1876 7444
1522G444j547p341m883L472Q714M708m813r686m375N468Q863K870o230q153j202
$$ 7444 5897 -1444 -6327 -2855 5859 10567 5754 -3932 -8307 -2839 6024 8894 2664 -5489 -6691
1537f691O927O380k098q495n409M294R802M261o944j1052l362Q103J1045K189
$$ -6691 236 6616 4518 -3977 -9386 -5092 4710 8971 2027 -9025 -12387 -4284 6761 8950
1551H950q786j0145P7R635P996k360r994n557N925J1287L608q492j1436j477J0760
$$ 8950 164 -9981 -9904 -269 7727 5367 -4627 -10184 -4259 7028 10636 2144 -9292 -10769 -9
1566iJ1960K69j1614j0581J746J1772Q664l724j1597n864O628J1229K724r499
$$ -9 11951 12220 606 -9975 -8229 3543 12207 8483 -3114 -8978 -2350 8879 11603 2104
1580B104j1548m52J1707J1185k054j3410j0666L101J3421Q864n513j3333o273
$$ 2104 -9444 -9896 1811 12996 10942 -2468 -13134 -10033 3388 12252 6739 -6594 -12867
1593a2867P452J2181K732j0239j1723O50J2983J0858l603j4661r973O176J5927
$$ -12867 -5415 6766 9498 -741 -12464 -11814 1169 12027 8424 -6237 -16210 -10034 5893
1606E893Q337p939j4816n396R892J3947K167j1724j1543K308J3856R973n503j5415
$$ 5893 14230 6291 -8525 -13921 -4029 9918 12085 361 -11182 -8874 4982 14955 9452 -5963
1620e963q128Q689J6317O204j0376j5762m290J1624J4018Q80j2836j1635K244
$$ -5963 -14091 -5402 10915 17119 6743 -9019 -13309 -1685 12333 13213 377 -11258 -9014
1633i014J3501R050o513j5102o870R256J5451M719j1866j5926k820J3116J4276
$$ -9014 4487 13537 7024 -8078 -14948 -5692 9759 14478 2612 -13314 -16134 -3018 11258
1646A1258J98j3590j2273K883J4444R122o621j4527n765J0249J5473L286j3106
$$ 11258 11456 -2134 -14407 -11524 2920 12042 5421 -9106 -14871 -4622 10851 14137 1031
1659A031j4901k57J4949J4268j628j5305j1683M794J5330Q380p507j4518m706
$$ 1031 -13870 -14127 822 15090 13462 -1843 -13526 -8732 6598 14978 7471 -7047 -11753
1672a1753J0866J4140R07j3728j3309J598J5284J2427m409j6350j0547N992J5191
$$ -11753 -887 13253 14160 432 -12877 -11279 4005 16432 12023 -4327 -14874 -8882 6309
1685F309P557q361j4637m204J0574J2770O6j2949j2006K877J5117J0695n708j5967
$$ 6309 13866 5505 -9132 -13336 -2762 10008 10074 -2875 -14881 -12004 3113 13808 8100 -7867
1699g867r035P417J5987P033r040j4327l346J0750J2613J88j2326j0369M179J4370
$$ -7867 -16902 -9485 6502 13535 4495 -9832 -13178 -2428 10185 10373 -1953 -12322 -8143 6227
1713F227Q663o765j5000o817R093J5326M869j0289j3585k467J0890J1575q97j2032
$$ 6227 14890 8125 -6875 -13692 -4599 10727 15596 5307 -8278 -10745 145 11720 10823 -1209
1727a209q869M221J2312O361p534j3736m688R769J3251K465j0969j2935j162J1423
$$ -1209 -10078 -5857 6455 12816 5282 -8454 -13142 -3373 9878 12343 1374 -11561 -12723 -1300
1741a300J0629j688j1348p994M082J1419N408p395j1588k423R903J1651J053j1127
$$ -1300 9329 7641 -3707 -11701 -7619 3800 9208 1813 -9775 -12198 -2295 9356 10409 -718
1755g18j1201J207J1917R695k274j0828p132M523J0595M202o562r264j223Q719
$$ -718 -11919 -10712 1205 10900 8626 -2202 -9334 -4811 5784 9986 3424 -5840 -7063 1656
1769A656R163r20j0484q459K506J0466P537l344j0395o039M151Q515L185n300
$$ 1656 10819 9899 -585 -9044 -6538 3928 11465 8121 -2274 -8313 -4162 4353 7538 2238
1783B238p559j236O605O383j820q219n985K811Q936N589m018r049m493M152P831
$$ 2238 -5321 -6557 48 6431 4611 -3608 -9593 -6782 2154 7743 3725 -5324 -9817 -5665 2166
1798B166L279m405o402o24N599M732j386n921l503L495P496L175m418p004k362
$$ 2166 5445 1040 -5362 -5986 -387 4345 2959 -2962 -6465 -2970 4526 7701 3283 -3721 -6083
1813f083M495O893J919m235m894k99L712K916j089l768j740K906L876K91l714
$$ -6083 -1588 5305 7224 2989 -1905 -2204 1508 4424 3335 -433 -2173 733 4609 4900 1186
1828A186m459r04L576M198L67l122l483r89J635K032qj405m90P77Q06l82j668
$$ 1186 -3273 -4177 -601 3597 3964 842 -2641 -3630 -1995 37 29 -1376 -1866 -1089 -283 -665 -2333
1845b333j620P00K396J880Q7j551j883p29J206J480J129P98lq22r31o36J98J504
$$ -2333 -3953 -3253 -857 1023 1110 -441 -2324 -3053 -1847 -367 762 1560 1557 735 -196 -832 -634 870
1863H70J786K27r40p08r9J89p3q77k89J791K250j16k876l536j057K891M138O57
$$ 870 2656 2883 1943 1235 1136 1325 1252 375 86 1877 4127 4011 1135 -2401 -3458 -567 3571 4228
1881D228l325l758p30K540K536j028l502j199K946L596N3m575m948L62O078N384
$$ 4228 903 -2855 -3585 -1045 1491 463 -3039 -4238 -1292 2304 2357 -2218 -7166 -6804 -726 4658
1897D658n76n711n078P84N966M393j705n112j979L528N410R15n525n690J310P684
$$ 4658 4082 -1629 -6707 -5923 43 4436 2731 -2381 -4360 -832 4578 5493 -32 -5722 -4412 3272
1913C272O252j633q509o665K626Q944N562l468q279m114M776P838Q75p504p374
$$ 3272 9524 7891 -618 -7283 -4657 4287 9849 6381 -1898 -6012 -1236 6602 7477 -27 -7401
1928g401J466R162O992m007j1946o795N623J1796N419o706j1692l846Q038R879
$$ -7401 -5935 3227 10219 6212 -5734 -12529 -6906 4890 10309 3603 -8089 -11935 -3897 5982
1942E982M96r177q165K625J1298P142n918j2718n364Q321J3857M969r376j3440
$$ 5982 6478 -2699 -10864 -8239 3059 10201 4283 -8435 -13799 -5478 8379 13348 3972 -9468
1956i468k480J0592J1944O54j0877r736L116J2529P386o543j3507n572R525J5211
$$ -9468 -11948 -1356 10588 11242 365 -9371 -6255 6274 13660 7117 -6390 -11962 -2437 12774
1970A2774L642j2440j5261j994J3127J3970o24j4593j1758M000J4103P902p855
$$ 12774 16416 3976 -11285 -13279 -152 13818 13194 -1399 -13157 -9157 4946 12848 4993
1983D993j5373n144J1793J5583J463j4876j5659O27J6718J4747l509j7202j1564
$$ 4993 -10380 -15524 -3731 11852 13315 -1561 -17220 -16593 125 14872 11363 -5839 -17403
1996a7403O360J6732Q352r531j5992l280J3561J5312l0j5945j4708L656J8966
$$ -17403 -11043 5689 14041 4510 -11482 -14762 -1201 14111 14081 -1864 -16572 -12916 6050
2009F050J3686o019j8930j1509Q390J8974Q285j1509j7235l486J3864J5628j045
$$ 6050 19736 13717 -5213 -16722 -8332 10642 18927 7418 -9817 -13303 561 16189 15144
2022A5144j7625j4374N338J9368J2307q636k1151j1112J1074K0504P136j3558
$$ 15144 -2481 -16855 -11517 7851 20158 11522 -9629 -20741 -9667 10837 17973 4415
2034D415j8835l433J5426J6245k024j8251j3169P039J9846J0904j0843k1246p956
$$ 4415 -14420 -17853 -2427 13818 11794 -6457 -19626 -12587 7259 18163 7320 -13926 -21882
2047b1882J4230K0886N514j5284j9023j444J7403J6146k947j7751j2058P915J9750
$$ -21882 -7652 13234 18748 3464 -15559 -17003 400 16546 13599 -4152 -16210 -8295 11455
2060A1455Q915j2650k0145n190J5735K0140K791j8085j8990O32J8564J5559m377
$$ 11455 20370 7720 -12425 -17615 -1880 18260 21051 2966 -16024 -15392 3172 18731 14354
2073A4354j9170j2253Q773J9081O919j3727j9306l436J7015J8830o90j9945j7374
$$ 14354 -4816 -17069 -8296 10785 17704 3977 -15329 -18765 -1750 17080 16390 -3555 -20929
2086b0929L429J9910J4819o272j9894j0652R918J8452O058j2906j7328j253J7242
$$ -20929 -17500 2410 17229 10957 -8937 -19589 -9671 8781 14839 1933 -15395 -16648 594
2099E94J6479k815j8823j4482N812K0412J3019q147j9304q925J0315J7653N494
$$ 594 17073 14258 -4565 -19047 -13235 7177 20196 12049 -7255 -16180 -5865 11788 17282
2112A7282j2800j5882j34J5523J3630m075j8088j2379P620J9450R694j0587j9249
$$ 17282 4482 -11400 -11534 3989 17619 13544 -4544 -16923 -9303 10147 19841 9254 -9995
2125i995p473J1641J7344L141j3885j4451Q59J4538J1364n514j6786q810R551
$$ -9995 -17468 -5827 11517 14658 773 -13678 -12819 1719 13083 7569 -9217 -18027 -8476
2138h476J7377O242j1763j7419m105J3603J5941J181j3169j2503J980J3809R617
$$ -8476 8901 15143 3380 -14039 -18144 -4541 11400 12581 -588 -13091 -11111 2698 12315
2151A2315n405j3526n632Q999J4139L958j1236j4372j361J2944J3359M3j2738
$$ 12315 6910 -6616 -12248 -3249 10890 14848 3612 -10760 -12121 823 14182 14225 1487
2164A487j1682K103J2492Q050m941j1681m992P262J1314J558j0676j1281L74J1540
$$ 1487 -10195 -8092 4400 12450 7509 -4172 -9164 -1902 9412 10970 294 -10987 -10613 927
2178I27J0628k144j2856r614L473J1513O540m913j0228l621O999Q613m3q603p142
$$ 927 11555 9411 -3445 -13059 -9586 1927 8467 3554 -6674 -10295 -3296 5317 5274 -3329 -10471
2193a0471K553J0239P013l974j0372n514M774R734M988m441p996k120N382N955
$$ -10471 -7918 2321 9334 5360 -5012 -10526 -5752 3982 8970 4529 -3467 -5587 -205 5750
2207E750Rn537m374K583O990L385m127p276l293M083P431K948m363o519k282L092
$$ 5750 5759 222 -4152 -1569 5421 8806 4679 -2597 -5890 -1807 5624 8572 4209 -2310 -4592 -1500
2223a500M549O54l877l191J327L666J114l180m613j214L969M820O62l683m196
$$ -1500 3049 3703 -174 -3365 -2038 1628 2742 -438 -5051 -6265 -2296 2524 3186 -497 -4693
2238d693j182K538L319P70j468r35L94P63Pj116p06J435K615J066q45j474j255
$$ -4693 -5875 -3337 -18 752 -716 -1651 -1257 -494 -487 -1603 -2309 -874 1741 2807 1962 488 -767
2255g67J04J143J177J099R86k62j867j979m99J336K456J306j269k218j259L88
$$ -767 -663 480 1657 2756 3742 3480 1613 -366 -865 471 2927 4233 2964 746 -513 -125
2271a25Q92J37j256q20J350J994k60l141l608o70L645M583N99m025m479r54L283
$$ -125 767 904 -352 -1172 178 2172 1912 -1229 -4837 -5507 -1862 2721 3320 -705 -5184 -6138 -2855
2288b855M053L27l498k412J751L965J676l385n229l34O182O572J19o631o764N86
$$ -2855 1198 1525 -1973 -4385 -2634 1331 3007 -378 -5607 -5941 241 6813 6932 301 -6463 -5877
2304e877P556O446j472o739m178K897O631K310n414o825K44P579O816j934r649
$$ -5877 1679 8125 6653 -86 -4264 -1367 5264 7574 2160 -4665 -4421 3158 9974 8040 -1609
2319a609p629K952J0159O231m119r995n218M811Q739K042o867p784L59Q458P260
$$ -1609 -9238 -6286 3873 10104 5985 -4010 -9228 -4417 4322 6364 -503 -8287 -7928 530 7790
2334G790k952j1029o920N035J2093O641n920j2405n274P699J1636K978q255r621
$$ 7790 4838 -6191 -13111 -8076 4017 10658 4738 -7667 -12941 -5242 6394 9372 1117 -8504
2348h504L06J0658Q589l763j2065o589O812J3979O065r014j4491m183J0549J3479
$$ -8504 -8198 2460 11049 7286 -4779 -11368 -4556 9423 15488 6474 -8017 -12200 -1651 11828
2362A1828K096j1440j1856J165J2328Q484n180j3330o421Q361J4162L612j1739
$$ 11828 13924 2484 -9372 -8207 4121 12605 7425 -5905 -12326 -3965 10197 13809 2070
2375B070j4827j977J2684J4017j81j4122j2226K845J3801R018n877j4141n692
$$ 2070 -12757 -14734 -2050 11967 11786 -2336 -14562 -11717 2084 11102 5225 -8916 -14608
2388a4608R908J4326K355j2703j4025L56J5386J4134k613j6006j1834N054J6342
$$ -14608 -4700 9626 11981 -722 -14747 -14391 995 15129 12516 -3490 -15324 -10270 6072
2401F072R640p604j5505n135J1069J4588J420j3963j3909K502J6661J2529n432
$$ 6072 15712 8108 -7397 -12532 -1463 13125 14545 582 -13327 -10825 5836 18365 12933
2414A2933j7872j1179P353J7668Q277j0014j6545m945J1551J4500M01j4631j2940
$$ 12933 -4939 -16118 -8765 8903 17180 7166 -9379 -14324 -2773 11727 12128 -2503 -15443
2427a5443L760J6237J0739p205j8025r343R857J8142O717j1338j6817l792J3097
$$ -15443 -11683 4554 15293 8088 -9937 -19280 -9423 8719 15436 4098 -12719 -16511 -3414
2440c414J5016j04j4563j1714M624J6448R756q572j7585o542J2218J7957M530
$$ -3414 11602 11498 -3065 -14779 -10155 6293 16049 7477 -10108 -16650 -4432 13525 18055
2453A8055j3772j6834j378J5318J4333k125j5482j1096N972J6048P371j0386j6420
$$ 18055 4283 -12551 -13929 1389 15722 13597 -1885 -12981 -7009 9039 16410 6024 -10396
2466a0396m044J3063J6106J016j5739j5420J384J5886J2729m026j6007j0069O802
$$ -10396 -14440 -1377 14729 15745 6 -15414 -14030 1856 14585 10559 -5448 -15517 -8715
2479h715J5104N845r949j4538k560J2966J4269q54j5153j3107L342J6416J1954
$$ -8715 6389 12234 2285 -12253 -14813 -1847 12422 11568 -3585 -16692 -13350 3066 15020
2492A5020n314j6124q719P880J5108N631r781j3543j341J2966J2325k376j4580
$$ 15020 9706 -6418 -15137 -7257 7851 13482 3701 -9842 -11183 1783 14108 11732 -2848
2505b848j0854N382J6314R283p957j5998o713R211J4448L575j0984j2491J50J1903
$$ -2848 -13702 -8320 7994 17277 9320 -6678 -13391 -4180 10268 13843 2859 -9632 -9482 2421
2519B421R508l958j3536p971O907J4097N547r078j4317m242J0080J3110J705j0694
$$ 2421 11929 7971 -5565 -13536 -6629 7468 13015 3937 -10380 -14622 -4542 8568 10273 -421
2533d21j0806Q48J0860Q423l753j1404n633O938J2018M019q722j2104k100J0521
$$ -421 -11227 -10379 481 8904 5151 -6253 -11886 -4948 7070 11089 2367 -9737 -11837 -1316
2547a316J1811P30j0391r870J258J0735P692l756j0053m615O230R996K181q701
$$ -1316 10495 11225 834 -9036 -7778 2957 10649 6893 -3160 -7775 -1545 8451 10632 1931
2561A931r958o2R905R075j450j0364q342K429R667N590m005q705l559N379P461
$$ 1931 -8027 -8089 1816 10891 9441 -923 -9265 -6836 2831 8421 4416 -4289 -7848 -2469 4992
2576D992N08p278o796J358Q130O286k622q834n540L391Q285M547l437p180k608
$$ 4992 5500 -1778 -8574 -7216 914 7200 4578 -4256 -9796 -6405 1880 6427 2990 -4190 -6798
2591f798M573N991O08n015m597J570O598M262k965o914l452L724P098L224l789
$$ -6798 -2225 3766 4374 -641 -5238 -3668 2930 7192 4227 -2687 -6139 -2415 4683 7907 4118
2606D118o249j915L719M608N37l911l469J209M328J776k989m744j642L359M856
$$ 4118 -2131 -4046 -327 4281 4818 907 -2562 -1353 2975 4751 1762 -2982 -4624 -1265 3591
2621C591J016l770m445j132K665L236M36k299j973M47J754O73j382j959m1K476
$$ 3591 4607 837 -3608 -4740 -2075 1161 1597 -702 -2675 -2228 -474 199 -1183 -3142 -3183 -707
2637g07K468rk239k407k06K071K432O74q92j135m48M02N82m8L4O91Q69J28o69
$$ -707 1761 1752 -487 -2894 -3100 -1029 1403 2077 1185 50 -398 4 586 538 572 1263 2132 2260 1591
2656A591j136p40M52J044O42J93k36p14j096r95j50Q83J723N86j372k036j107
$$ 1591 455 -285 167 1211 1853 2046 1810 1096 0 -995 -1145 -262 1461 2047 675 -1361 -2468
2673b468O79J483O80j027j139M50J206L28j573k102j73K925L135L8l171l218n1
$$ -2468 -1789 -306 374 -653 -1792 -1342 -136 192 -1381 -3483 -3656 -731 2404 2442 -729 -3947 -3998
2690c998L360L303p9k850j974J251K787J136k121k996L03L752L366p11m541l881
$$ -3998 -638 2665 2586 -264 -2238 -987 1800 2936 815 -2181 -1878 1874 5240 4529 -12 -3893
2706c893J045N124L656j426m803l212J669M421J664l154m238k52M185L921j249
$$ -3893 -2848 2276 5932 4506 -297 -3509 -1840 2581 4245 1091 -3147 -3399 786 4707 3458
2721C458o012m372K270O587L929k898p003l559L557O569J930m364n475j24N642
$$ 3458 -2554 -6926 -4656 1931 5860 2962 -4041 -7600 -4043 2526 4456 92 -5383 -5507 135
2736A35M920j917o743l864L867P793L687m620q114k661N699P685J782n715o647
$$ 135 5055 3138 -3605 -7469 -3602 4191 7878 3258 -4856 -7517 -1818 5867 7649 1934 -4713
2751d713J55O596N245k288p193l929M176Q139K870o095q789k036O819Q377R76
$$ -4713 -4558 2038 7283 4995 -2198 -6127 -1951 6188 9058 2963 -5826 -7862 -1043 7334 8310
2766H310p779p751N60P648N799k712q312m212M968Q610K084p195q877o87Q636
$$ 8310 531 -7220 -6660 988 6787 4075 -4237 -8449 -3481 5129 7213 18 -8859 -9546 -910
2781i10Q861o67r461p668K253R476O236l734r136l597O008Q938J536p809q377
$$ -910 7951 7284 -2177 -9845 -7592 1884 8120 4386 -4750 -8347 -2339 6599 8135 326 -8051
2796h051P61R682Q165k219j0239p244L481J0416N937m930r818l748O144Q959J352
$$ -8051 -7290 2392 10557 8338 -1901 -9145 -5664 4752 10689 5759 -4059 -7807 -1663 7296 8648
2811H648q189q490J083R560P464l224j0998o991M676J1200N377o156j0840l749
$$ 8648 459 -8031 -6948 2612 10076 6852 -4146 -11137 -6461 4739 10116 3960 -6880 -10629
2825a0629P225R792R66q722q165J739R964O953m191j1069n399O619J1400M139
$$ -10629 -3404 6388 7354 -1368 -9533 -7794 2170 9123 4932 -6137 -11536 -4917 6483 10622
2839A0622p543j0824k157Q762R602R8r009p582K609R844N797n104j0310l734P101
$$ 10622 3079 -7745 -9902 -1140 8462 8560 -449 -8031 -5422 4422 10219 5115 -5195 -8929 -1828
2854a828J0503K439q646j0482q10R171Q984p70r560p706K707R605N219n206r839
$$ -1828 8675 11114 2468 -8014 -8824 347 9331 8561 -999 -8705 -5998 3607 8826 3620 -6219
2869f219l496P125R943J401r099r808J74R848Q972j658j0229p279L477R976N156
$$ -6219 -9715 -2590 7353 8754 -345 -10153 -9979 -131 8841 7183 -3046 -10325 -6848 3128 8284
2884H284n164r453k604P561R181K52q849q316J676J0209P798l191j0205o046M439
$$ 8284 3120 -6333 -8937 -1376 7805 8057 -792 -9108 -7432 2777 10575 7384 -2821 -8867 -4428
2899d428R718M262n639q874j667P004P528n38q356o966K526R280N763m231r713
$$ -4428 5290 9552 3913 -4961 -6628 376 7904 7366 -990 -7956 -5430 3850 9613 5382 -4331
2914d331m962M980R226L248o121q291j430O609O921q64p792n705L106Q451M525
$$ -4331 -9293 -4313 4913 8161 2040 -6251 -7681 -1072 5849 4985 -2807 -8512 -5406 3045 7570
2929G570m573r027l465N996Q847K363o327p750p12O937O546j100o949m516L062
$$ 7570 2997 -6030 -9495 -3499 5348 7711 1384 -6366 -7078 -141 6405 5305 -1644 -6160 -3098
2944c098P443L355m722p611j894N997P370J100o344o955l2O400N392j272o193
$$ -3098 4345 7700 2978 -4633 -6527 -530 6840 7940 1596 -5359 -5391 1009 6401 5129 -1064
2959a064m050K468O058K226m378o070j019N137N924J2o217n662P28N999M689j465
$$ -1064 -5114 -2646 3412 5638 1260 -4810 -5829 -692 5232 5244 -973 -6635 -5907 92 4781 3316
2975C316n696l465K611N176J709l608m507j92M840M522r23n363l849J681N568
$$ 3316 -2380 -5845 -3234 1942 3651 43 -4464 -4656 184 4706 3783 -1580 -5429 -3748 1820
2990A820L673j949n029k402K529M175J300k799l412K11L557K690j276m017k523
$$ 1820 5493 3544 -1485 -3887 -1358 2817 4117 1318 -2094 -1883 1674 4364 3088 -929 -3452
3005c452J720M288K136k094m149j946J870L209J120k111k661j55K071J653q68
$$ -3452 -1732 2556 4692 2598 -1551 -3497 -1627 1582 2702 591 -2070 -2225 -154 1499 631
3020F31k641j441J660K975J058j935k948j124J880K846Q23j615j683j46J380J109
$$ 631 -2010 -3451 -1791 1184 2242 307 -2641 -3765 -1885 961 1784 169 -1514 -1660 -280 829
3036H29m58j222r6J455J369n1j358j520Q4J542J416J06q39q87l05K11J84OK76
$$ 829 371 -851 -947 508 1877 1826 468 -1052 -968 574 1990 2096 1257 370 65 276 460 466 742
3055G42M03n3m26p53n03R7M83K21m2j2q0l99o39o51o6R75J246K18j065j468n88
$$ 742 1145 1092 666 -87 -590 -493 -10 211 169 157 77 -322 -961 -1612 -1678 -703 543 761 -304 -1772 -2360
3076b360Q17J534O50o60r35j19Q15Q35m47j241k85J481J956M89j730k471n35K294
$$ -2360 -1543 -9 641 -19 -954 -1073 -258 577 130 -1111 -1396 85 2041 2530 800 -1671 -2206 88
3094H8K789L87k104k349j14K266J733q98k488r55J843K680L22l090l354R0L504
$$ 88 2877 3264 1160 -1189 -1303 963 2696 1798 -690 -1645 198 2878 3200 110 -3244 -3154 350
3111C50L243n71l769l234P19L681K254j635l450j291K454L438J17l607l369P83
$$ 350 3593 3022 -747 -3981 -3262 419 2673 1038 -2412 -3703 -1249 2189 2306 -1301 -4670 -3887
3127c887M406L610j073m900l371J854M948K958k103m532j826L249M322M77l945
$$ -3887 519 4129 3056 -1844 -5215 -3361 1587 4545 2442 -2090 -3916 -667 3655 4132 187
3142A87l988Q51N292L940k142n935l497K730O140K990l465o134j873M136N128
$$ 187 -3801 -2950 2342 6282 4140 -1795 -5292 -2562 3578 6568 3103 -3031 -4904 -768 4360
3157D360K18n039m622J331N892L568l136o643k992M070O865K110m925o660j024
$$ 4360 4578 -461 -5083 -3752 2140 5708 2572 -4071 -7063 -2993 3872 5982 1057 -5603 -6627
3172f627N192N808j08n775m567K026O295L408l463o647k356N162P144J544n823
$$ -6627 -1435 4373 4265 -1510 -6077 -4051 2244 5652 2189 -4458 -6814 -1652 5492 7036 1213
3187A213o903m76O474O480o44o670n083K182O906L715l931p269k161N636P318
$$ 1213 -5690 -6166 308 6788 6144 -526 -5609 -3427 3479 7194 3263 -4006 -6167 -531 6787
3202F787O75o970p415L81P689O501j800p998n411K941P720L566m875p461j587
$$ 6787 7462 492 -6923 -6542 1147 7648 5848 -2150 -7561 -4620 3100 6666 1791 -5670 -7257
3217g257O168P062k28p600o664J815Q349N935k799q472m705M082Q173L166m991
$$ -7257 -1089 5973 5745 -1855 -8519 -6704 1645 7580 4781 -3691 -8396 -4314 3859 7025 2034
3232B034p310j163O468O764p28p514n818K651Q408N257l732q955m173M992Q506
$$ 2034 -5276 -6439 29 6793 6065 -1449 -7267 -4616 3792 9049 5317 -3638 -7811 -2819 5687
3247E687K712n789p824r56O703O497j218p764n566L090Q482M338m996q957l365
$$ 5687 8399 2610 -5214 -6170 533 7030 5812 -1952 -7518 -4428 4054 8392 3396 -5561 -8926
3262h926N894Q669J926o872p900k75P281O388j549p686m933L620Q149L537n292
$$ -8926 -3032 5637 7563 691 -7209 -7484 -203 6185 4636 -3050 -7983 -4363 3786 7323 2031
3277B031q246j998O570Q277J043p199p307L74P603O173j786p504m442L777P491
$$ 2031 -6215 -8213 -1643 6634 7677 478 -6829 -6455 1148 7321 5535 -1969 -6411 -2634 4857
3292D857K796n331p548j278O787P341k25p541o873J231P747N618k703p648m085
$$ 4857 7653 2322 -5226 -6504 283 7624 7399 -142 -7015 -5784 1963 7581 4878 -2770 -6855
3307f855L756P117K148n447o915l68O600O243j097p588n706K258P781M765l175
$$ -6855 -3099 4018 6166 719 -6196 -6564 36 6279 5182 -2406 -8112 -5854 1927 6692 3517
3322C517p340l415M075O894J818n003n908J48O061N386j443o829m551K841P320
$$ 3517 -3823 -7238 -3163 3731 5549 546 -5362 -5214 847 6233 4790 -2039 -6590 -3749 3571
3337C571L982l522p109k909M343O416J480m848n508J09N499M423j842o258l620
$$ 3571 7553 4031 -3078 -5987 -1644 4772 6252 1404 -4104 -3995 1504 5927 4085 -2173 -5793
3352e793L161O467K630m218o636j944M624N764P31m877m878N26M961L447k048
$$ -5793 -2632 3835 6465 2247 -4389 -6333 -1709 4055 4786 -91 -4969 -4443 518 3965 1917
3367A917n111k275L280N316J362m105n165n60M572M853J10m332l922Q30M300K842
$$ 1917 -3194 -5469 -2189 3127 4489 384 -4781 -5341 -769 4084 4194 -138 -4060 -3230 1070 3912
3383C912j541m029j591K777M065P38l543l981m1M118L821m17m191l413P87L793
$$ 3912 2371 -1658 -3249 -472 3593 4331 788 -3193 -3234 884 4705 4288 97 -3316 -2529 1264
3399A264K441j416l503j533K033K946K80k963k923M58L394K585j093l600k331
$$ 1264 3705 2289 -1214 -2747 -714 2232 2512 -451 -3374 -2916 478 3063 1970 -1630 -3961
3414c961J137L239J745j342k487q84J460J914N4j744j253Q30K173J243j051k249
$$ -3961 -2824 415 2160 818 -1669 -2553 -1093 821 875 -869 -2122 -1292 881 2124 1073 -1176
3430a176j008J243K255J021q42j608p02Q09R73K42o07m25K77P76J94q32j047l25
$$ -1176 -2184 -941 1314 2335 1493 -115 -817 -8 965 1207 600 175 452 1228 1422 590 -457 -782
3448g82Q43J057L19o63j109n12J09L97K77J06M6j13m08n57k87K45O19L96j50m43
$$ -782 61 1118 1437 774 -335 -847 -738 -341 -64 42 88 -25 -433 -990 -1277 -1032 -413 -17 -167 -610
3468f10r1J67j7l47k79N40J158Q05o83j541r20Q50J933J102p43j605o33J007J369
$$ -610 -701 -534 -551 -898 -1177 -637 521 1326 643 -898 -1818 -968 965 2067 1324 -281 -914 93 1462
3487A462K4j302r54P95J876Q06j479k551p99J808K723O38k083k706n71J963K138
$$ 1462 1486 184 -770 25 1901 2707 1228 -1323 -2122 -314 2409 3047 964 -1742 -2313 -350 1788
3504A788k19k196j719Q93K473J010j951l061p16K647L423M94l183l506o2L398
$$ 1788 1569 -627 -2346 -1453 1020 2030 79 -2982 -3698 -1051 2372 2866 -317 -3823 -3885 -487
3520d87L231l65l468k411J482L612J711k471l704n79L745M092j39m405l966R10
$$ -487 2744 2379 -1089 -3500 -2018 1594 3305 834 -2870 -3449 296 4388 4249 -156 -4122 -3212
3536c212M805L692j475m822k832K376M512J434l249m343k54M257L960j027n299
$$ -3212 1593 5285 3810 -1012 -3844 -1468 3044 4478 1229 -3114 -3368 889 4849 3822 -1477
3551a477l837J768N605L371k634n777k699L103N295J501m001m715j85M831M163
$$ -1477 -5314 -3546 2059 5430 2796 -2981 -5680 -2577 2718 4219 218 -4497 -4682 149 4312
3566D312j334n689l579K675O419L171l575o586k248M488O380J263m964n491M07
$$ 4312 2978 -2711 -6290 -3615 2804 5975 2400 -4186 -6434 -1946 4434 5697 733 -4758 -4351
3581d351N797M482j928o254l409L639O919K443m935p109j426N700O675L50o270
$$ -4351 1446 5928 4000 -2254 -5663 -2024 4895 7338 2403 -4706 -6132 -432 6243 6593 323
3596C23n925R23O424M465k662o704l208M094O771J673n606o918o73O474O589n08
$$ 323 -5602 -4679 1745 6210 3548 -3156 -6364 -2270 4501 6174 568 -6350 -7023 -549 6040 5532
3612E532p071n828J778P180M501l099p015k718M620O872J186n958o466M74P202
$$ 5532 -1539 -7367 -5589 1591 6092 2993 -4022 -6740 -2120 4752 5938 -20 -6486 -6012 1190
3627A190O231j642p758n251K970P826M215m058p354k389N224O777M80o424o079
$$ 1190 7421 5779 -1979 -7230 -4260 3566 7781 3723 -3631 -6020 -796 5981 6461 37 -6042
3642f042J225P488N252k926q065m535L872Q031L251m882p655k010N627O583J28
$$ -6042 -4817 2671 7923 4997 -3068 -7603 -3731 4300 7551 2669 -4986 -6996 -1369 5214 5342
3657E342o575n690J651P278M629l453p788l664M738Q105K515n573p526j184O286
$$ 5342 -1233 -6923 -5272 2006 6635 3182 -4606 -8270 -3532 4573 7088 1515 -6011 -7195 -909
3672i09O753k85o678n232K174P262L928l781p403k548N533P404J373o363p005
$$ -909 5844 5559 -1119 -6351 -4177 3085 7013 3232 -4171 -6719 -1186 6218 7591 1228 -5777
3687e777p2O813O003j300o785m713K670O681K882m206o632j467N333O294O9o465
$$ -5777 -5849 964 6967 5667 -1118 -5831 -3161 3520 6402 2196 -4436 -5903 -570 5724 5793 -672
3703f72o011R87O681N099j980o744m113K995O386K582m099n941r95N286N597m92
$$ -672 -6683 -5696 985 6084 4104 -2640 -6753 -3758 2628 5210 1111 -4830 -5825 -539 5058 4566
3719D566o077n027J755O828M452k553o754l374L609O329K085m165n532m70N186
$$ 4566 -1511 -6538 -4783 2045 6497 3944 -2810 -6184 -2575 3754 5839 1674 -3858 -4328 858
3734H58M698j133n750l862K461O147L130l433o274k241L883N535J193m336m811
$$ 858 5556 4423 -1327 -5189 -2728 3419 6549 3116 -3158 -5399 -1516 4019 5212 876 -3935
3749c935O7M446L507j471m779k712K473N015J826l471n089j205L865M740N40m038
$$ -3935 -3868 578 4085 2614 -2165 -4877 -2404 2611 4437 966 -4123 -5328 -1463 3277 3817 -221
3765b21l979L59M007L144j187m038j981K506M200J085l217m084l28M027L978k77
$$ -221 -4200 -3841 166 3310 2123 -1915 -3896 -1390 2810 3895 678 -3406 -3734 293 4271 3994
3781C994l961l383P73L932K594j515l535j419K138L114M44k992k920L85L327K606
$$ 3994 33 -3350 -2577 1355 3949 2434 -1101 -2520 -382 2732 3176 184 -2736 -2351 976 3582
3797C582j004l540k440J127L262J703j516k719j027J574K101J23k026j688N99
$$ 3582 2578 -962 -3402 -2275 987 2690 1174 -1545 -2572 -998 1103 1226 -800 -2488 -1889
3812a889K347J496j070k539j281J306K512J175j191k048o78J260J624K11j168
$$ -1889 458 1954 884 -1655 -2936 -1630 882 2057 866 -1182 -1860 -600 1024 1235 67
3827F7r49N17J547O21r80j603m16J352J531M60j236j454k77Q94Q37R5o16m17J68
$$ 67 -882 -365 1182 1803 823 -780 -1196 156 1687 2147 911 -543 -820 74 911 1006 390 -27 141
3846A41L15k28n56m00K07O58M16k29p19m75k9J75K45L99J11j7m13n32k66M20O67
$$ 141 456 228 -328 -728 -521 137 553 324 -395 -870 -899 -724 -479 -80 31 14 -399 -931 -1197 -777 -110
3867a10M70j65m73k91J92M04j8k39K6M79O93J28p26j107j22J026J339L46r53j419
$$ -110 360 195 -278 -569 -377 27 9 -230 -204 275 968 1096 370 -737 -859 167 1506 1852 899 -520
3887e20k94R86J070l9j037q07N14J285K75j303j651j38J706J836j68k154j978
$$ -520 -814 172 1242 1203 166 -641 -127 1158 1433 130 -1521 -1659 47 1883 1715 -439 -2417
3904b417K43K115J711o34k119j189J147K072L81j807j975K55K544K054p64k862
$$ -2417 -2174 -59 1652 1018 -1101 -2290 -1143 929 1310 -497 -2472 -2217 327 2381 1617 -1245
3920a245j891J147L094J802j295k875j111J793K616M74k186k305N34K862K024
$$ -1245 -3136 -1989 1105 2907 1612 -1263 -2374 -581 2035 2509 323 -1982 -1448 1414 3438
3935C438j257l329j854J774L633J470k163l634j122K493L152K79k932k774O52
$$ 3438 2181 -1148 -3002 -1228 2405 3875 1712 -1922 -3044 -551 2601 2880 -52 -2826 -2174
3950b174L227K022j672l824j583K507M011R82l153l980m76L440L673l06l691k778
$$ -2174 1053 3075 1403 -2421 -4004 -1497 2514 3496 343 -3637 -4113 -673 3000 2694 -997 -3775
3966c775J245L786K099k208l918j049L268M062L66l800l950M26M300L564r44m217
$$ -3775 -2530 1256 3355 1147 -2771 -3820 -552 3510 3876 76 -3874 -3448 852 4416 3472 -745
3982g45k937J715M277J938k582m107q82L471L931j25m379l833J020M760L264j715
$$ -745 -3682 -1967 2310 4248 1666 -2441 -3323 148 4079 3954 -425 -4258 -3238 1522 4786 3071
3998C071n076k714K424M749J540l220m287m96L886L720p59m669l117J840N018
$$ 3071 -2005 -4719 -2295 2454 3994 774 -3513 -4009 -123 3597 2838 -1831 -4948 -3108 1910
4013A910K651k662n142j874L361M825J067l658m165J00M227L480j222m557k566
$$ 1910 4561 1899 -3243 -5117 -1756 3069 4136 478 -3687 -3587 640 4120 2898 -1659 -4225
4028d225K379M943J932l252m991j150L883M748M88m274m243M74M526L244j566
$$ -4225 -1846 3097 5029 1777 -3214 -4364 -481 4267 4755 481 -3762 -3288 1238 4482 2916
4043B916m740k433K690M815J355l910m779n98M474M619m59m957l958J172M886
$$ 2916 -1824 -4257 -1567 3248 4603 693 -4086 -4684 -210 4409 3950 -1007 -4965 -3793 1093
4058A093L115k204m857j767L083M541Q05m053m262M32M808L859j373m914l117
$$ 1093 4208 2004 -2853 -4620 -1537 3004 3809 -244 -4506 -4074 734 4593 3220 -1694 -4811
4073d811K049M968K386k599m499j305L352M099J65l950l504J058M467K907j820
$$ -4811 -2762 2206 4592 1993 -2506 -3811 -459 3640 3805 -145 -3649 -2591 1876 4783 2963
4088B963m785k529K547M822J692l092m526r62L460L943k79m060l144J299M261
$$ 2963 -1822 -4351 -1804 3018 4710 1618 -2908 -3870 -410 3533 3254 -806 -3950 -2651 1610
4103A610K402k359m659j738L108M636R90l664m268k34L956L606p45l928k714J793
$$ 1610 4012 1653 -3006 -4744 -1636 3000 3990 326 -3942 -4176 -220 3386 2641 -1287 -4001 -2208
4119b208M075J808k671l998p17L398L931J81l801l570O01L923L012j099l726k236
$$ -2208 1867 3675 1004 -2994 -3711 -313 3618 3799 -2 -3572 -2971 952 3964 2865 -861 -3097
4135c097J788L624J203k489l404l39L107L099m45l706k861R71L754K421j616l706
$$ -3097 -1309 2315 3518 1029 -2375 -2714 393 3492 3047 -659 -3520 -2549 1205 3626 2010 -1696
4151a696j757J962L233P92k426k929J06K947K360r00l321k030J605L596J590k027
$$ -1696 -3453 -1491 1742 2534 108 -2821 -2715 232 2592 1692 -1629 -3659 -2054 1542 3132 1105
4167A105l320j046K320K893M90k285k420N04K617J678j011k706j278J796K880
$$ 1105 -2215 -3261 -941 1952 2442 157 -2263 -1759 858 2536 1525 -1181 -2459 -663 2217
4182B217Q35k033k719n20K129K481R1k213j982M17K025J354r80k191q88J596K167
$$ 2217 3052 1019 -1700 -2220 -91 2390 2481 268 -1714 -1297 728 2082 1102 -1089 -1977 -381 1786
4199A786J92j988k155j31K175J940l55k001j567N04J817R34q42j605k28J265J288
$$ 1786 1978 -10 -2165 -2296 -121 1819 1464 -537 -2104 -1600 217 1151 309 -1296 -1524 -259 1029
4216A029o6j543j233M61J814J089m86j489r38N87J394N98n27r12j24N88P51k13
$$ 1029 963 -580 -1813 -1352 462 1551 1065 -424 -1362 -775 619 1217 690 -222 -346 242 993 780
4234G80r07m01M67R51M73n46j073n12L78Q64L74k66o32l72K01J84n4k24p4K37
$$ 780 -127 -528 -61 890 1363 817 -256 -768 -390 474 848 582 -50 -422 -221 -37 -91 -315 -389 -152
4254a52L28o4m83l87J4K60L24K09j00j81j38j68j37J94M64N26j02m50n43Q6O23
$$ -152 176 112 -371 -758 -744 -484 -160 49 -51 -232 -370 -538 -675 -481 -17 509 407 -43 -586 -500 123
4275A23L86j13l99L6M52M06l15p82m28O17J063N31o85j358n93Q02J199L04q13
$$ 123 509 396 -3 33 485 891 576 -206 -634 -17 1046 1577 892 -466 -1059 -257 942 1246 433
4294D33r94j51Q79P49n12j277m69Q26J502L87j308j775l72J452J692L19j492j645
$$ 433 -561 -712 167 916 404 -873 -1342 -516 986 1373 65 -1710 -2082 -630 1062 1381 -111 -1756
4312a756J3J673J267n60j643q08J158K079M15j737k097o5K174K332o0k476k012
$$ -1756 -1743 -70 1197 637 -1006 -1814 -656 1423 1838 101 -1996 -2061 113 2445 2385 -91 -2103
4329b103N69K412J661r90k378r88J694K272K28k319k291K92K870K174r10l128
$$ -2103 -1534 878 2539 1549 -829 -1817 -123 2149 2377 58 -2233 -1941 929 3103 2193 -935
4345i35k024J213K964J537j667k939q74K055K513J39k606k436N94L188K164j318
$$ -935 -2959 -1746 1218 2755 1088 -1851 -2725 -670 1843 1982 -624 -3060 -2466 722 2886 1568
4361A568l481j971J900L740J511k241l414q34K587L223J31l123k663R97L636K233
$$ 1568 -1913 -3884 -1984 1756 3267 1026 -2388 -3222 -635 2588 2719 -404 -3067 -2070 1566 3799
4377C799j799l904j819K735M148J083l077l920m87L427L481m50l792k656J312
$$ 3799 2000 -1904 -3723 -988 3160 4243 1166 -2754 -3241 186 3667 3217 -575 -3231 -1919
4392a919L887J863k386m214j168L183M036M77l752l936Q5L993L407r36m014k721
$$ -1919 1968 3831 1445 -2769 -3937 -754 3282 3759 7 -3929 -3844 149 3556 2620 -1394 -4115
4408d115J646M109J769k605l978q15L435M012J13m061l843P47M521L477j299m608
$$ -4115 -2469 1640 3409 804 -3174 -3989 -554 3458 3571 -490 -4333 -3586 935 4412 3113 -1495
4424a495k783K277M588J735k954m219o75L884M048n21m570l618J450M917L096
$$ -1495 -4278 -2001 2587 4322 1368 -2851 -3526 358 4406 3885 -685 -4303 -2853 2064 5160
4439E160k241n095k449K810M779J350l414m396k64M048L647j013m612l060J791
$$ 5160 2919 -2176 -4625 -1815 2964 4314 900 -3496 -3760 288 3935 2922 -1690 -4750 -2959
4454b959M973K513k808m998j858L288M836J129l813m208K7M148L531j011m545
$$ -2959 2014 4527 1719 -3279 -5137 -1849 2987 4116 303 -3905 -3878 270 3801 2790 -1755
4469a755k737K347M875J986l066m833j289L772M791N42m213m104L99M357L441
$$ -1755 -4492 -2145 2730 4716 1650 -3183 -4472 -700 4091 4633 420 -3684 -3285 1072 4513
4484D513j495m624k364K536M580J430l538m691n79M210M304k97m543l941R86M602
$$ 4513 3018 -1606 -3970 -1434 3146 4576 1038 -3653 -4232 -22 4282 3985 -558 -4499 -3513 1089
4500A089L069j933m584k006K620M394R64l589m130N5M223L804p09m571l392J512
$$ 1089 4158 2225 -2359 -4365 -1745 2649 3613 24 -4106 -4051 172 3976 3267 -1304 -4696 -3184
4516c184M733K723k157m282j822K770M229P14l410l589L47M073L308j327m467
$$ -3184 1549 4272 2115 -2167 -3989 -1219 3010 3724 314 -3275 -2928 1145 4453 3126 -1341
4531a341k718J984M556K060k481m267j389K965L715K40l354l095O35L586K546
$$ -1341 -4059 -2075 2481 4541 2060 -2207 -3596 -631 3084 3324 -30 -3125 -2490 1096 3642
4546C642j686m055j932K192L991J464k784l841q28K949L318Q1l015k762P99L309
$$ 3642 1956 -2099 -4031 -1839 2152 3616 832 -3009 -3837 -888 2430 2511 -504 -3266 -2467 842
4562H42J979j487l412j415K355L596Q89k753l339l50L036L067r2l013k398R13
$$ 842 2821 1334 -2078 -3493 -1138 2458 3347 594 -2745 -3095 -59 3008 2916 -97 -2495 -1582
4578a582K928J556j389k986q51K210K785J92k631k655Q7K797K407o83k769j825
$$ -1582 1346 2902 1513 -1473 -2324 -114 2671 2863 232 -2423 -2336 461 2868 2185 -584 -2409
4594b409Q63K329J196j407k177m33J685J828j33k077j739M93K269J574p35k045
$$ -2409 -1546 783 1979 572 -1605 -2038 -353 1475 1342 -735 -2474 -1981 288 1862 1127 -918
4610i18j391Q44J997R48r92j477l46J152J362j27j368j066O45J650J019p05j711
$$ -918 -2309 -1465 532 1480 488 -989 -1335 -183 1179 1052 -316 -1382 -737 913 1932 1227 -484
4627d84r14Q63J596O61q00j241l28P45Q55k20q96l96M38R34K27q42j005k19O80
$$ -484 -1398 -535 1061 1722 922 -319 -647 98 953 733 -163 -559 -121 813 1040 198 -807 -1026 -346
4646c46P10K41m30o66l04K26K43rN2R0K7J8k09k39jL20J77J21Q2J2n2j92k79m2
$$ -346 364 605 175 -491 -795 -569 -326 -335 -283 -193 -166 -148 -357 -596 -597 -277 -100 21 103 115 63 -129 -408 -450
4670d50O27N46J52l20p19l86M20P59K79k78n23k56M49M76k03q26l77N46J017L75
$$ -450 177 723 875 555 -164 -550 -130 629 908 630 107 -149 300 776 573 -253 -630 -84 933 1308
4690A308q65j502l68R38J420L49j087j489k06J209J140l61j369p75P86J784N01
$$ 1308 443 -1059 -1427 -489 931 1280 193 -1296 -1502 -293 847 486 -883 -1658 -872 912 1413
4707A413j458j931j94J804K032J48j979j890L22K114J472n75j944j094J295K170
$$ 1413 -45 -1976 -2170 -366 1666 1814 -165 -2055 -1733 381 1853 1278 -666 -1760 -465 1705
4723A705M50j757k152oK356K253l85k685k187P34K650J830j041k754j297J543
$$ 1705 2155 398 -1754 -1760 596 2849 2464 -221 -2408 -1674 976 2806 1765 -989 -2286 -743
4739g43K459N80k218k572P2K811K425q13l299k347J232L572K011j822l557j339
$$ -743 1716 2296 78 -2494 -2422 389 2814 2001 -1298 -3645 -2413 1159 3170 1348 -2209 -3548
4755c548K275L319N68k854k936N10L474K518j231l836k260K137M300J652k543
$$ -3548 -1273 2046 2614 -240 -3176 -2666 808 3326 2095 -1741 -4001 -1864 2436 4088 1545
4770A545l989j086L002L775K97l453l052P47L670K560j690m107k037K642M232
$$ 1545 -2444 -3530 -528 3247 3544 91 -2961 -2214 1456 4016 2326 -1781 -3818 -1176 3056
4785C056J283l172m324q50L582M023j51l908l402Q80M094K640k121m312j731K976
$$ 3056 4339 1167 -3157 -4007 -425 3598 3447 -461 -3863 -2983 1111 3751 1630 -2682 -4413 -1437
4801a437M471R37l816m484r2M387M036n85m555l436J554M800K459k550m482j349
$$ -1437 3034 3971 155 -4329 -4421 -34 4002 3417 -1138 -4574 -3020 1780 4239 1689 -2793 -4142
4817d142L521M604L07m378m183P38M843L917j431n151l255K263N068K135k890
$$ -4142 -621 3983 4290 -88 -4271 -3533 1310 5227 3796 -1355 -4610 -2347 2721 4856 1966
4832A966m842j212L824M429j59m592m050J086N116L574k168n582k821K810N287
$$ 1966 -2876 -4088 -264 4165 4006 -586 -4636 -3550 1566 5140 2972 -2610 -5431 -2621 2666
4847B666K026l514n075q26M151M349l56m748l712J719N297K892k697n352k227
$$ 2666 4692 1178 -3897 -4723 -572 3777 3421 -1327 -5039 -3320 1977 4869 2172 -3180 -5407
4862e407L597N461J304m076m746l52M508M256q50m815l226K154N037K342l162
$$ -5407 -1810 3651 4955 879 -3867 -4219 289 4545 3695 -1120 -4346 -2192 2845 5187 2025
4877B025n164j612M090N117N46m521m705J57M742M006j314m968l012K266M883
$$ 2025 -3139 -4751 -661 4456 5002 481 -4224 -4067 675 4681 3367 -1601 -4613 -2347 2536
4892B536K017l453n060r26M276M743qm881m385Q51N176L672j845m940k624K641
$$ 2536 4553 1100 -3960 -4886 -610 4133 4125 -756 -5141 -4290 886 4558 2713 -2227 -4851 -2210
4908b210M887J484l594m389j75M310M164p46m801l622J717N052K884k180m818
$$ -2210 2677 4161 567 -3822 -3997 313 4477 3731 -1070 -4692 -2975 2077 4961 2781 -2037
4923b037k030K868M465Q59l386l860J35L936L328j225m441k834J948M604K149
$$ -2037 -4067 -1199 3266 4125 739 -3121 -2986 950 4278 3053 -1388 -4222 -2274 2330 4479
4938D479k577m561j592L002L996O53l339l635K39L923K794j501l989k203K272
$$ 4479 1902 -2659 -4251 -1249 2747 3400 61 -3574 -3335 588 3382 1881 -2108 -4311 -2039
4953b039M339J525k958m146p85L334L753J77l440l066Q00L584K254j575l465j370
$$ -2039 2300 3825 867 -3279 -4064 -730 3023 3200 -240 -3306 -2506 1078 3332 1757 -1708 -3078
4969c078K376L568O16k872l239j59L132L105m62l236k367R36K838J659j369k889
$$ -3078 -702 2866 3482 610 -2629 -2788 344 3449 2987 -249 -2616 -1680 1158 2817 1448 -1441
4985a441r40K052K457J72k466k514K55K708K269p14k786j904Q63K584J361j262
$$ -1441 -2381 -329 2128 2300 -166 -2680 -2425 283 2552 1838 -948 -2852 -1989 595 1956 694
5001F94k258o74J643J992M3k001j755O59K393J423q96k275j253J259K206Q36j211
$$ 694 -1564 -2238 -595 1397 1440 -561 -2316 -1657 736 2159 1263 -1012 -2265 -1006 1200 2036 825
5018H25j645l54J274J324j45j442q34P26J366O25r07j541n39R47J425L41p91j302
$$ 825 -820 -1174 100 1424 1279 -163 -997 -271 1095 1720 813 -728 -1267 -320 1105 1446 655 -647
5036f47l13O64P65j4n67m87J90N86J89n48p90n6O26P29J21n02p12j16L43M18K24
$$ -647 -960 -296 469 455 -112 -599 -409 177 366 -182 -972 -1028 -402 327 448 -54 -766 -882 -539 -121 103
5057A03p4j15K0J0k04LJ68K88K50p1k22n1O5O5j85r9L21N29J91m96q92l35O14
$$ 103 29 -86 -66 -56 -260 -257 -89 199 449 378 156 105 170 235 50 -49 272 801 992 496 -396 -731 -117
5080a17J009K26p00r18j65P22O83l83q40m18N73J111J67j222j332mJ341J389K5
$$ -117 892 1118 418 -500 -665 57 740 357 -483 -901 -328 783 950 -272 -1604 -1608 -267 1122 1147
5099A147j457j401J27J548J151n75j342o96R28J615K62j430j562J06J879J792
$$ 1147 -310 -1711 -1584 -36 1115 540 -802 -1498 -570 1045 1307 -123 -1685 -1579 300 2092
5115B092k11k181j736P50K216J483q89k283r59J403K122L17j899k071K89K467
$$ 2092 1881 -300 -2036 -1286 930 2413 1524 -759 -1718 -315 1807 2124 225 -1846 -1557 910
5131I10J933r69k974j757J286L045J404j779l017q08K081K551J04k508k341O13
$$ 910 2843 1874 -1100 -2857 -1571 1474 2878 1099 -1918 -2726 -645 1906 2010 -498 -2839 -2226
5147b226L040J904j537l250j526K034L591J208k561l415n57K849L169j42l025
$$ -2226 814 2718 1181 -2069 -3595 -1561 2030 3238 677 -2738 -3295 -446 2723 2581 -444
5162d44k496J017L377K038j864l645j366K663L901Q03l213l799k21L687L380o21
$$ -444 -2940 -1923 1454 3492 1628 -2017 -3383 -720 3181 3984 771 -3028 -3249 438 3818 3197
5178C197l850k724J480L804J905k379m133r48L273L760J70l940l739N63M290L211
$$ 3197 -653 -3377 -1897 1907 3812 1433 -2700 -3648 -375 3385 3555 -385 -4124 -3561 729 3940
5194C940j373m349k587K042M278J610k876l999m86L558L858m43m266l441J359
$$ 3940 2567 -1782 -4369 -2327 1951 3561 685 -3314 -3800 -242 3616 3173 -1093 -4534 -3175
5209c175M794L035k057m858k356K915M769J298l313m299k75M169L817r55m717
$$ -3175 1619 4654 2597 -2261 -4617 -1702 3067 4365 1052 -3247 -3522 647 4464 3509 -1208
5224a208l148J967N064K601k958n274j846L662M878P67m018m490K00M496L547
$$ -1208 -4356 -2389 2675 5276 2318 -2956 -4802 -1140 3738 4505 487 -4003 -3803 693 4240
5239D240j491m860k725K503N048J889l551n082j041M170M758J92m506m144Q02
$$ 4240 2749 -2111 -4836 -2333 2715 4604 1053 -4029 -5070 -900 3858 4050 -456 -4600 -3798
5254c798M756L277j744m785k296K884M922J324l757m660l92M551M458m73m942
$$ -3798 958 4235 2491 -2294 -4590 -1706 3216 4540 783 -3877 -4269 282 4740 4267 -675
5269f75l844J411N030L068k259m973k002L277M744P35m195m482K96M889L978j477
$$ -675 -4519 -3108 1922 4990 2731 -2242 -4244 -967 3777 4512 317 -4165 -3869 1020 4998 3521
5285C521n257l351K130N268K443l034m966j319L539M372K04m267l808J006M714
$$ 3521 -1736 -5087 -2957 2311 4754 1720 -3246 -4565 -1026 3346 3550 -717 -4525 -3519 1195
5300A195L169j966m924k559K772N046J757l261m534q43L598M164o4m124l203J225
$$ 1195 4364 2398 -2526 -5085 -2313 2733 4490 1229 -3305 -4148 -550 3614 3550 -574 -3777 -2552
5316b552M392K594k155m605j854L115M572J062l482m395l46L950L687o77m058
$$ -2552 1840 4434 2279 -2326 -4180 -1065 3507 4569 1087 -3308 -3654 296 3983 3306 -752
5331g52k891J456M121K002k600m193j084L227M009K81l860l727M33L914L086j060
$$ -752 -3643 -2187 1934 3936 1336 -2857 -3941 -714 3295 3576 -284 -4011 -3578 336 3422 2362
5347B362l922k352J845L797J347k495l444m78L138L325k91l520k823R07L672K486
$$ 2362 -1560 -3912 -2067 1730 3077 582 -2862 -3340 -202 3123 2832 -688 -3511 -2604 1068 3554
5363C554j223l639j801J886L235J118k186k976k42K734K584o32l062k175J126
$$ 3554 2331 -1308 -3109 -1223 2012 3130 944 -2032 -2274 460 3044 2412 -650 -2825 -1699
5378a699L322J721j691l229j250J885K817O00k202k335j9K389J721q43k446j384
$$ -1699 1623 3344 1653 -1576 -2826 -941 1876 2476 274 -2061 -2080 309 2030 1187 -1259 -2643
5394b643J299K623R77j831k482n94J841K298K86j940j711K77J791J332o46j790
$$ -2643 -1344 1279 2256 425 -2057 -2651 -810 1488 1774 -166 -1877 -1600 191 1523 877 -913
5410i13p13J200J801M25j389j779j61J717J630j1j553j340J13J512R34n72j276
$$ -913 -1626 -426 1375 1800 411 -1368 -1529 188 1818 1807 254 -1086 -973 539 1473 901 -375
5427c75m35Q07J035J16j197j077K06J262Q42l40j168r07L74Q90M59l43o09j99
$$ -375 -810 -3 1032 1148 -49 -1126 -920 342 1184 844 -324 -1231 -857 33 492 149 -460 -659
5445f59L88L79j26n44j69L27N41K05k78n03k31K63L31K60J59q5k31o5j59L8L37
$$ -659 -271 108 -18 -562 -731 -404 137 342 64 -439 -670 -407 -76 184 343 258 27 -38 -197 -159 178
5466A78L19J6j99k77M5J13J97j83j83J09L34K20l04o08m67K95Q53N27m16r07o51
$$ 178 497 513 314 37 82 195 392 209 26 135 469 689 385 -223 -690 -395 458 985 569 -338 -989
5487i89L45R02L74n33q61j21P15P80k01j195p38N74J436Q19q49j576p74J077J747
$$ -989 -644 258 632 99 -762 -883 -168 612 411 -784 -1522 -948 488 1307 458 -1118 -1892 -815 932
5506I32M72j117j505r0J494J279m82j658q04R52J980P81j515k083m63J733K122
$$ 932 1404 287 -1218 -1308 186 1465 983 -675 -1479 -527 1453 2234 719 -1364 -1827 -94 2028
5523B028J34j880j863J39K036J451p51k104j131J315K262N86k020k436j24K274
$$ 2028 2162 282 -1581 -1442 594 2045 1294 -810 -1941 -626 1636 2222 202 -2234 -2358 -84
5539h4K349r3k768k246O53K758J784j156k778j243J836K813M90k516k592J86L057
$$ -84 2265 2172 -596 -2842 -2189 569 2353 1197 -1581 -2824 -988 1825 2315 -201 -2793 -2607 450
5556D50K615q00l434k100J294L456J875j788l393j003K438L014K07k816k733N77
$$ 450 3065 2265 -1169 -3269 -1975 1481 3356 1568 -1825 -2828 -390 2624 2831 15 -2718 -2141
5572b141L431K385j400l721j932J819L809J521k513l675p77K769L263o8l294k841
$$ -2141 1290 3675 2275 -1446 -3378 -1559 2250 3771 1258 -2417 -3194 -425 2838 2770 -524 -3365
5588c365Q99L643K240j835l968j808K576M189J099l124l975m73L628L625n42l813
$$ -3365 -2466 1177 3417 1582 -2386 -4194 -1618 2571 3670 546 -3429 -3902 -274 3351 2809 -1004
5604a004k847J441M196K089k334m280j234L316M258M48l825l973L38M307L407
$$ -1004 -3851 -2410 1786 3875 1541 -2739 -3973 -657 3601 4049 224 -3749 -3411 896 4303
5619D303j150m296k676J921M395J711k862m222p67L597L925j73m237l686R21M541
$$ 4303 3153 -1143 -3819 -1898 2497 4208 1346 -2876 -3643 -46 3879 3706 -531 -4217 -3296 1245
5635A245L058j692m567k439K348M458J428l167m134m74L849L766o03m483l272
$$ 1245 4303 2611 -1956 -4395 -2047 2411 3839 672 -3462 -3936 -87 3679 3076 -1407 -4679
5650d679J610M757K792k339m891j888L087M665J036l624m120J17M235L520j270
$$ -4679 -3069 1688 4480 2141 -2750 -4638 -1551 3114 4150 526 -3594 -3477 758 4278 3008
5665C008m515k832K355M825K038l042m851j237L665M454L66m020l978O34M242
$$ 3008 -1507 -4339 -1984 2841 4879 1837 -3014 -4251 -586 3868 4234 214 -3764 -3130 1112
5680A112L073j659m506k312K576M558J364l339m560o67L883M183j43m286l584
$$ 1112 4185 2526 -1980 -4292 -1716 2842 4206 867 -3693 -4360 -477 3706 3563 -723 -4307
5695d307J003M238K834j671m486j848K770M305R56l500m040j6M115L770q39m220
$$ -4307 -3304 934 3768 2097 -2389 -4237 -1467 2838 3794 294 -3746 -3762 353 4123 3284 -936
5711i36l195J558M382K407k223m092j497K971L844M73l593l513N24M074K965j319
$$ -936 -4131 -2573 1809 4216 1993 -2099 -3596 -625 3219 3692 99 -3414 -2890 1184 4149 2830
5727B830m258k537J933M192J796k536l930j040K854L544J0l436k963R06L634K469
$$ 2830 -1428 -3965 -2032 2160 3956 1420 -2510 -3550 -696 2848 2858 -578 -3541 -2635 999 3468
5743C468j614m069j832K266L952J298k673l708n72L068L132k06l126k509J086
$$ 3468 1854 -2215 -4047 -1781 2171 3469 796 -2912 -3484 -416 2716 2510 -616 -3125 -2039
5758b039L407J944j823l440j234K413L460O67k690l116j31K915K607n16k847j984
$$ -2039 1368 3312 1489 -1951 -3185 -772 2688 3355 665 -2451 -2582 333 2940 2424 -423 -2407
5774b407J041K830J275j684k777p49K097K711K25k564k571J39K591K184n51k637
$$ -2407 -1366 1464 2739 1055 -1722 -2471 -374 2337 2562 -2 -2573 -2434 157 2341 1790 -847
5790h47j716J034K416J002j501k190m19J937K112j32k251j876N57K351J682p43
$$ -847 -2563 -1529 887 1889 388 -1802 -2221 -284 1828 1696 -555 -2431 -1874 477 2159 1416
5806A416k261j243J088K026Q13j298j712l2J576J306l55j656j223Q21J776R06
$$ 1416 -845 -2088 -1000 1026 1839 541 -1171 -1203 373 1679 1324 -332 -1555 -734 1042 1948
5822A948r47j605p48R03J386L68q32j108j34Q41P15l01r13n73M41J008M31p29
$$ 1948 1001 -604 -1352 -449 937 1305 473 -635 -769 72 787 486 -427 -1000 -559 449 880 151
5840A51r87m04O09Q60L54m65p08k24M63M60l6l70j64L75M37l9l50l64RM44L21
$$ 151 -836 -1240 -631 229 583 118 -590 -814 -351 109 73 -297 -461 -86 351 312 -38 -402 -393 51 372
5861C72R8j04j78j85q9Q9O9L98K58k16m32l25J09M76K59l63l73k0M26K56l72p33
$$ 372 470 366 188 3 -86 3 72 470 728 512 80 -245 -136 340 599 236 -137 -157 269 525 153 -580
5883e80k86O46Q57K54q24j131k59R16J047J01j004q46K21R53P20o07j145l24R53
$$ -580 -866 -220 637 891 67 -1064 -1323 -407 640 741 -263 -1109 -888 65 785 178 -967 -1291 -338
5902c38J356K40j217j493o2J550J511n5j516j425M19J672J137p93j756o48J326
$$ -338 1018 1258 41 -1452 -1514 36 1547 1492 -24 -1449 -1030 642 1779 986 -770 -1418 -92
5919i2J804K81j858j948K01K211J860n58k503j755R03K557J245j493k443p25J905
$$ -92 1712 1993 135 -1813 -1612 599 2459 1901 -602 -2357 -1454 1103 2348 855 -1588 -2313 -408
5936d08K314l9k437k169O08K836J946j157l136j638J623L181J212k058k868n87
$$ -408 1906 1867 -570 -2739 -2131 705 2651 1494 -1642 -3280 -1657 1524 2736 678 -2190 -2777
5952b777K511K595j01k780k348J053L209K015j622l447j543K189L579J076k569
$$ -2777 -266 2329 2228 -552 -2900 -1847 1362 3377 1755 -1692 -3235 -1046 2533 3609 1040
5967A040l441m57K968L005l52l316k533J246L640J897k220l898j359K863L965
$$ 1040 -2401 -2858 110 3115 2763 -553 -3086 -1840 1800 3697 1477 -2421 -3780 -917 3048
5982C048O57l546l732O8L738L178r04l942k545J838M075J634k739m010p98L465
$$ 3048 3705 159 -3573 -3505 233 3411 2507 -1435 -3980 -2142 1933 3567 828 -3182 -3980 -515
5998e15M000jm035l565P10M362L185j438m387k321K230M355J511l007m159n37
$$ -515 3485 3484 -551 -4116 -3406 956 4141 2703 -1684 -4005 -1775 2580 4091 1084 -3075 -3612
6014c612L843L941l82m390l623J243M739L035j999m815k349K708M598J296l480
$$ -3612 231 4172 3790 -600 -4223 -2980 1759 4794 2795 -2020 -4369 -1661 2937 4233 753
6029G53m304k43M160L751r00m753l333J854N094K568k719n038j879L394M747Q91
$$ 753 -3551 -3794 366 4117 3217 -1536 -4869 -3015 2079 4647 1928 -3110 -4989 -1595 3152 4043
6045D043l916m197K64M457L521j342m771k720K402N091K003l219m951j200L800
$$ 4043 127 -4070 -3806 651 4172 2830 -1941 -4661 -2259 2832 4835 1616 -3335 -4535 -735
6060g35M797L63m317m070O72M600L323j674m895k521K865M869J570l706m903p11
$$ -735 4062 4425 108 -3962 -3290 1310 4633 2959 -1936 -4457 -1592 3277 4847 1141 -3762 -4473
6076d473M273M583k56m730l929J117M797L000k175m792k085L112M651R72l908
$$ -4473 -200 4383 4127 -603 -4532 -3415 1382 4382 2207 -2585 -4670 -1558 3093 4065 157
6091A57m412j6M471M058q47m728l417J684M753K633k358m539j589L101M348O24
$$ 157 -4255 -4271 200 4258 3411 -1317 -4734 -3050 1703 4336 1978 -2561 -4150 -1049 3299 3923
6107C923l795l869M12M387L495j312m593k891J969M726K183k696m431j332L243
$$ 3923 128 -3741 -3329 1058 4553 3241 -1352 -4243 -2274 2452 4635 1939 -2492 -3824 -581
6122e81L998K39l887l499P77M247K898j705m652k297K479M455J578l031m286p18
$$ -581 3417 3656 -231 -3730 -2953 1294 4192 2487 -2165 -4462 -1983 2472 4050 1019 -3267 -3985
6138c985L410L604j34l731k958J146L897K257j913l967j566K665L983R90l050
$$ -3985 -575 3029 2895 -836 -3794 -2648 1249 3506 1593 -2374 -3940 -1275 2708 3698 648
6153F48l604l04L253L165k84l247k533J092L334J849j780l361j153K380L317N32
$$ 648 -2956 -3260 -7 3158 2874 -373 -2906 -1814 1520 3369 1589 -1772 -2925 -545 2772 3304
6169C304k856l148j9L106K748o55l147k214J181L003J329j787k900o43K347K639
$$ 3304 448 -2700 -2719 387 3135 2480 -667 -2881 -1700 1303 2632 845 -2055 -2698 -351 2288
6185B288j44k652k461N73K915K013r76k812j481J360K464R75j628k123k88J958
$$ 2288 2144 -508 -2969 -2396 519 2532 1556 -1256 -2737 -1377 1087 2062 434 -1689 -1977 -19
6201a9J879k86k123j534P89K346J304r77k146j069J118J975O51j151j626l41J437
$$ -19 1860 1574 -549 -2083 -1294 1052 2356 1379 -767 -1836 -718 1257 1908 757 -869 -1210 227
6218B27J273k25j569j071O40J603Q30r27j729o64R51J545L93j034j207j91R63
$$ 227 1500 1275 -294 -1365 -725 878 1708 781 -948 -1612 -661 884 1277 243 -964 -1155 -192
6235a92P73k30r33m43N06R08K93q00q40j12P74Q51O4n82n59nM19L81nj50k0L2
$$ -192 581 351 -582 -1025 -519 389 682 -118 -958 -1070 -296 555 619 37 -522 -527 -108 273 268 118 98 130
6257A30J41p1j52j4P2K48P3oj14p9k00j49M3L41L09Om43n43j69L85N07J81m80
$$ 130 271 200 48 34 106 354 427 421 307 228 28 -121 -78 263 572 578 135 -408 -577 -192 315 496 16
6280A6m81o0M19L68k11o40l21N05Q74K24p53j047k41J016J217J45j072j091Q7
$$ 16 -465 -525 -106 262 51 -589 -910 -405 469 693 -60 -1107 -1348 -332 885 1030 -42 -1133 -1046
6299a046J233R27m14j276n52R09J447K86j297j612Q7J677J616k52j923j457N89
$$ -1046 187 1114 700 -576 -1128 -219 1228 1514 217 -1395 -1308 369 1985 1733 -190 -1647 -1058
6316a058J872J110q83j915o81J312J811J27j852j775L30K086J705o94k470j627
$$ -1058 814 1924 1041 -874 -1555 -243 1568 1695 -157 -1932 -1602 484 2189 1495 -975 -2602
6332b602R97K544J240j359k483p83J765K232K77k205k080L95K712J966j038k938
$$ -2602 -1605 939 2179 820 -1663 -2446 -681 1551 1828 -377 -2457 -2062 650 2616 1578 -1360
6348a360j671J597L160J344j998l033p53K478K758N0k782k315P81L111J872j551
$$ -1360 -3031 -1434 1726 3070 1072 -1961 -2714 -236 2522 2572 -210 -2525 -1744 1367 3239 1688
6364A688l399j378K141L478Q81k660l396l71L069K890l71l300k433J158L384J771
$$ 1688 -1711 -3089 -948 2530 3411 751 -2645 -3016 53 2943 2572 -728 -3161 -2003 1381 3152
6380C152j966l577j198K706L556M71l122l524J59L504L101p74l699k485J587L807
$$ 3152 1186 -2391 -3589 -883 2673 3144 22 -3502 -3343 161 3262 2488 -1211 -3696 -2109 1698
6396A698J780k285l784q67L113L692J03l662l473O91M121L001j323m190k325K023
$$ 1698 3478 1193 -2591 -3458 -345 3347 3450 -212 -3685 -2994 1127 4128 2805 -1385 -3710 -1687
6412a687M110J528k729l938o09L414L488l48l938l185J132M288K645j879m423
$$ -1687 2423 3951 1222 -2716 -3325 89 3577 3229 -709 -3894 -2762 1526 4171 2292 -2131
6427b131k095K494M144J295l062l820l86L509L419o32l997k963J637M363K319
$$ -2131 -4226 -1732 2412 3707 645 -3175 -3561 -52 3367 2735 -1262 -4225 -2588 1775 4094
6442D094k320m446j657K969M421Q74l439l925O0L887L333j027m105k592J976M475
$$ 4094 1774 -2672 -4329 -1360 3061 3935 496 -3429 -3369 518 3851 2824 -1281 -3873 -1897 2578
6458B578J730k735m439j031L413M151L01l905l657M80M049K944j371m158k211
$$ 2578 4308 1573 -2866 -3897 -484 3667 3968 63 -3594 -3114 935 3879 2508 -1650 -3861
6473c861K201M077J336k950m020n78L443L752m7l928l400Q40L948K714j425m033
$$ -3861 -1660 2417 3753 803 -3217 -3795 -352 3400 3353 -575 -3975 -3135 813 3527 2102 -1931
6489a931j948K292L902J139k963l706j63L583L401m91l994k915J296M088K388
$$ -1931 -3879 -1587 2315 3454 491 -3215 -3378 205 3606 3115 -879 -3794 -2498 1590 3978
6504C978j940l891j600K607L646N92l101l237K98L545K815j178l811k307J773
$$ 3978 2038 -1853 -3453 -846 2800 3392 291 -2946 -2648 897 3712 2534 -1277 -3584 -1811
6519a811L811J643k273l701r96K584L248K28k974k762N48L203K254j367l348j752
$$ -1811 2000 3643 1370 -2331 -3327 -743 2505 2733 -241 -3003 -2455 748 3002 1635 -1713 -3465
6535c465J875L405J247k268l251p33K609L002P2k762k416O07K966J883j228k978
$$ -3465 -1590 1815 3062 794 -2457 -3190 -581 2421 2493 -269 -2685 -2078 888 2771 1543 -1435
6551a435j354J953K996Q87k363k866l06K552K637k71k693k021P43K659J440j361
$$ -1435 -2789 -836 2160 3047 684 -2182 -2488 64 2701 2430 -263 -2284 -1541 1118 2558 1197
6567A197k580q28J774K442K45k191k279J33K324J910n65k291j598Q52K183J062
$$ 1197 -1383 -2211 -437 2005 2250 59 -2220 -2087 237 2147 1582 -709 -2307 -1455 728 1790
6583A790j178k057m77J475J837J09j816j603K90J991J520n71j987j223Q84J981
$$ 1790 612 -1445 -1922 -447 1390 1499 -317 -1920 -1630 361 1881 1310 -677 -1900 -1016 965
6599I65Q67j133j691m26J337J483m8j522j127N43J536Q99o95j671p05Q96J406
$$ 965 1832 699 -992 -1418 -81 1402 1354 -168 -1295 -752 784 1683 988 -683 -1388 -492 914
6616I14M85r32j245k25R49R41j87r39p17L50R81M96n34j107l14O12R69K13o11
$$ 914 1399 467 -778 -1003 -54 887 700 -239 -956 -606 375 871 337 -770 -1084 -472 497 710 99
6635I9q12j36N80N38R4n27l75J87N96J71k74n33o6M77N19P7m03m63m0L12L77M0
$$ 99 -713 -849 -269 269 363 -164 -539 -352 244 415 141 -392 -458 19 538 615 212 -251 -291 21 398 438
6657D38j72j58K5nl1n8j4J24P8m3j29r0KPj14j5J09K59L1l18m21j42M05N03J45
$$ 438 266 108 133 128 97 39 25 149 227 184 55 -35 -33 -26 -140 -155 -46 213 244 -74 -495 -637 -232 271 416
6682D16m69m86%M23M41k27m28k45L44O84P6n76o99P5P52P29l4p70p41J57Q67O25
$$ 416 -53 -539 -539 -116 325 98 -330 -575 -231 453 529 -47 -746 -671 81 810 776 6 -735 -578 289 914
6704I14k95q84m10O00Q37J83q12r66O0R94R91k01j297q61L28J242P99o04j365
$$ 914 619 -265 -675 -75 762 945 133 -833 -773 221 1212 1011 -286 -1147 -819 423 1222 618 -747
6723g47m98Q39J202K21j169j174K08J365J017m14j633r16P85J640P76j013j597
$$ -747 -1245 -406 796 1017 -152 -1326 -1118 247 1264 850 -783 -1699 -914 726 1502 489 -1108
6740a108m04J167J530Q2j386j233L16J610J069o73j779q13J083J765O29j285j804
$$ -1108 -1512 -345 1185 1267 -119 -1352 -1036 574 1643 970 -809 -1622 -539 1226 1855 570 -1234
6757a234l41J500J670p0j633j366L78J850J004r12j917p46J300J881M71j587k014
$$ -1234 -1575 -75 1595 1525 -108 -1474 -1096 754 1758 846 -1071 -1817 -517 1364 1835 248 -1766
6774a766l6J840J664k96k007j375P27K016J030j200k005n26J524K029J41j957
$$ -1766 -1802 38 1702 1406 -601 -1976 -1249 767 1797 597 -1408 -1934 -410 1619 1760 -197
6790a97j759K70K084J710o66k146j260Q85K196R42j380k008m37J688J941q1j938
$$ -197 -1956 -1686 398 2108 1442 -704 -1964 -1079 1117 2059 679 -1329 -1766 -78 1863 1782 -156
6807a56j784N24K199J419q03k278j284J264K259P42j596k068k50J787J851k44
$$ -156 -1940 -1416 783 2202 1399 -879 -2163 -899 1360 2102 506 -1562 -1812 -25 1826 1582
6823A582k124j646P16K350J328j224k386r99J571K324M96j813k063L9K074J643
$$ 1582 -542 -2188 -1472 878 2206 982 -1404 -2403 -832 1492 1988 175 -1888 -1849 225 1868
6839A868m86k168j291R68K323R91j501k175n67J697K194J65j975j845K29K076
$$ 1868 1382 -786 -2077 -1109 1214 2205 704 -1471 -2038 -341 1853 2018 43 -1802 -1573 503
6855E03J590o97k200j079J076K119P30j549k083k85J758J980m2k085j743M21K032
$$ 503 2093 1396 -804 -1883 -807 1312 2042 493 -1590 -1875 -117 1863 1821 -264 -2007 -1586 446
6872D46J512q05k173j065J219K130N65j637j957q9J899J820l37k100j468O74K162
$$ 446 1958 1153 -1020 -2085 -866 1264 1829 192 -1765 -1854 45 1865 1528 -572 -2040 -1366 796
6889G96J175j080k025p39J344J970K51j592j720K57J792J463n66j960j208R38
$$ 796 1971 891 -1134 -1873 -529 1441 1692 100 -1620 -1363 429 1892 1326 -634 -1842 -904
6905i04K000Q56j202j922n32J488J649R5j595j444L40J683J191p61j818r67J148
$$ -904 1096 1952 750 -1172 -1704 -216 1433 1528 -67 -1511 -1171 512 1703 942 -876 -1843 -695
6922f95J814N29j310j761k45J475J544j53j518j274M78J647R51q42j658n46J158
$$ -695 1119 1648 338 -1423 -1668 -193 1351 1198 -320 -1594 -1116 531 1482 640 -1018 -1564 -406
6939d06J584K79j336j414n2J503J245l30j441r58N66J460O58q23j376l45J086
$$ -406 1178 1457 121 -1293 -1345 158 1403 1073 -368 -1326 -760 700 1358 535 -841 -1186 -100
6956a00J281K0j198j153J37J343R92m16j357p35N90J233M36p47j145k29R52J034
$$ -100 1181 1201 3 -1150 -1013 330 1322 906 -451 -1186 -596 637 1073 326 -819 -1048 -96 938
6974I38o1j195q89L41J222P40n51j187n18O55J135L04p47r61m9Q17P95j65r32
$$ 938 877 -318 -1207 -866 356 1096 545 -642 -1160 -505 630 934 187 -774 -823 -6 789 624 -308
6993c08n78L95R60M64n16r20l03O10Q75J82o83p04LO32N85j79o81m29L31O50L16
$$ -308 -886 -491 469 933 417 -503 -806 -196 679 861 178 -526 -523 109 694 515 -166 -595 -264 386 702
7014G02m34p18j97N76N87Rn33n71J02N97L35j72m94k65K63M50R4l52m50mM29L84
$$ 702 268 -450 -647 -71 516 525 -8 -579 -477 120 455 283 -211 -476 -213 237 331 -21 -471 -475 -46 338
7036C38Jm45k84J02L43J90n0l07r9K05J61N5j67j04L0J37J51l0j96j09M7Q2J51
$$ 338 339 -106 -390 -288 55 245 195 -112 -211 -6 155 210 43 -61 -31 106 257 227 31 -78 -31 51 202
7059B02m2o7q4m0k6L2LO1kl7k1j0M4n3l1m1P3OR4m8j51j27N1K03K08o7k54j85
$$ 202 160 93 9 -31 -57 -25 -22 39 37 0 -21 -31 13 -40 -71 -112 -39 -33 61 13 -138 -265 -214 -11 197 130 -124 -309
7087c09J41K52J26j18k90o1K75K86Om09k00M6N12K90k45m88k90L18N39J92m03
$$ -309 -168 84 210 92 -198 -259 16 302 308 -101 -301 -255 257 547 302 -186 -476 -158 381 573 170
7108A70n38n3M61M67o9n61m39K23O55L32m29o82k32M66P43J55o40o33k2O13O17
$$ 170 -368 -421 40 507 438 -123 -562 -339 316 648 219 -463 -695 -229 514 669 29 -604 -626 -13 604
7129F04j43p46m78L65P30M10n12q11k63O92Q76J45q37q34M2Q82P59k33r75n44
$$ 604 461 -285 -763 -398 332 742 230 -581 -844 -152 724 869 32 -802 -760 122 881 648 -327 -871
7149h71N03R65L75o71r74k33Q58J123j44j010r08J71J192O99m10j163n99O08J175
$$ -871 -368 597 972 301 -673 -906 -48 1075 931 -79 -987 -816 376 1075 665 -498 -1097 -489 686
7168F86L29q78j058l8R57J060k19j175r22M35J245P72n89j326n98Q87J253L18
$$ 686 1015 137 -921 -959 -2 1058 839 -336 -1258 -823 422 1194 605 -721 -1319 -432 821 1139
7186A139j041j134J0J146J065k48j319r26N57J453O90p60j524l62R90J376K02
$$ 1139 98 -1036 -1026 120 1185 937 -382 -1308 -751 702 1392 632 -892 -1254 -264 1112 1314
7203A314j177j298J47J341J112n07j539p71P35J541O04j073j537k84J222J441
$$ 1314 137 -1161 -1014 327 1439 932 -607 -1378 -643 898 1502 429 -1108 -1392 -170 1271
7219A271n3j429j229L93J469J001o73j570p23R84J591M05j217j558j51J472J432
$$ 1271 1218 -211 -1440 -1047 422 1423 750 -820 -1543 -559 1032 1437 220 -1338 -1489 -17 1415
7236A415k05j507j218M59J656R51p99j617o40J149J606K87j432j464O0J545J403
$$ 1415 1210 -297 -1515 -1056 600 1551 752 -865 -1505 -356 1250 1537 105 -1359 -1299 246 1649
7253A649l98j656j223P16J747Q64r98j694n55J266J584J03j527j439K45J775J162
$$ 1649 1251 -405 -1628 -912 835 1699 701 -993 -1548 -282 1302 1405 -122 -1561 -1316 459 1621
7270A621n82j798j031R51J800O68j158j677l76J342J647p2j582j336L92J723J099
$$ 1621 1039 -759 -1790 -839 961 1629 471 -1206 -1582 -240 1407 1335 -247 -1583 -1191 532 1631
7287A631o97j846q16J106J811M77j251j691k06J504J570j96j704j224N72J799
$$ 1631 934 -912 -1728 -622 1189 1666 415 -1276 -1482 22 1592 1396 -308 -1532 -960 839
7303H39Q71r10j812o35J245J769K50j436j637L1J653J319l94j668j117O97J688
$$ 839 1710 800 -1012 -1647 -402 1367 1617 181 -1456 -1425 228 1547 1153 -515 -1632 -935 753
7320G53P81j073j684l90J316J657J4j543j364K28J562J251m94j632j001Q44J665
$$ 753 1534 461 -1223 -1613 -297 1360 1374 -169 -1533 -1305 257 1508 1014 -618 -1619 -775 890
7337H90O38j122j509k64J416J338q5j457j288L96J601J081p37j589p23R02J526
$$ 890 1528 406 -1103 -1367 49 1387 1302 -155 -1443 -1047 554 1635 898 -691 -1414 -512 1014
7354A014L85j102j356q1J301J146k12j497r97N49J533P11q18j468n04J026J297
$$ 1014 1399 297 -1059 -1140 161 1307 1095 -402 -1399 -850 683 1394 576 -892 -1396 -370 927
7371I27K31j150j128L1J264R49m26j203p69O65J239N00p70j284k89R59J115J79
$$ 927 1158 8 -1120 -1089 175 1124 698 -505 -1274 -609 630 1130 360 -924 -1213 -254 861 1040
7389A040j031r69Q0J074Q88m24j075n57O70J022L51p97r70j50Q89R46o4r96p44
$$ 1040 9 -960 -880 194 1082 658 -417 -974 -304 718 1069 272 -698 -848 41 987 923 -73 -817
7408h17K02R31N27l63q94l63N62P79P9o03p18p2Q24N68j46p54m93K62O44L21k64
$$ -817 -615 316 843 480 -414 -777 -215 564 643 40 -678 -750 74 642 496 -258 -751 -489 155 476 212
7429B12o07j60L54M78N7l58m44R8M77L77j42m77k70J73M44K48j77l44j80J95L10
$$ 212 -395 -555 -201 277 334 -24 -468 -370 107 484 342 -135 -405 -232 212 460 283 -61 -241 -46 264
7450B64n7j21k06L2K15J27q5k28j15J61J23J05j40q5r3l1RN2Q1Q9l0j75j10L2
$$ 264 207 86 -120 -88 127 254 169 -59 -174 -13 110 215 75 -10 -103 -134 -125 -73 8 97 67 -108 -218 -186
7474a86J76Q3n0j94l4J56K37r2l09j41J29M78J69k55m49j93L84M81Q3l52m77N
$$ -186 -10 73 23 -171 -205 -49 188 96 -213 -354 -225 253 422 167 -282 -475 -91 390 473 121 -356 -351
7496c51N41L24l6o21l29K71O86K42m83o76k67N54Q13O5o51p46J5P47O44j83q97
$$ -351 190 514 478 -143 -472 -201 485 727 244 -432 -699 -145 668 733 82 -664 -649 98 742 559 -338
7517c38n09L49J026L12o89j022k30R12J075Qj042r66J26J144R73m86j187o59P17
$$ -338 -847 -498 528 840 151 -871 -1101 -189 886 894 -148 -1114 -988 156 1129 643 -544 -1203 -486
7536d86J265L79r46j303M1J129J282k60j362j111N10J493R54p88j456n98Q91J448
$$ -486 779 1158 212 -1091 -1050 79 1361 1101 -261 -1372 -862 631 1585 797 -659 -1257 -366 1082
7554A082K89j204j420Q4J447J255l25j745j104O61J750R48j001j781o50J240J692
$$ 1082 1371 167 -1253 -1169 278 1533 1208 -537 -1641 -980 770 1718 717 -1064 -1714 -474 1218
7571A218K43j510j543J10J777J403o19j895j249J122K090Q37j395k031m72J638
$$ 1218 1461 -49 -1592 -1482 295 1698 1079 -816 -2065 -943 1147 1984 589 -1442 -1914 -276
7587b76J939R1j884j726M87K006J387q68k114r72J272K185O18j655k139k48J954
$$ -276 1663 1754 -130 -1856 -1369 637 2024 1156 -958 -1930 -658 1527 2145 490 -1649 -1897 57
7604E7J948j99k078j733N94K258J253j051k302r47J525K308M30j935k240L4K250
$$ 57 2005 1806 -272 -2005 -1411 847 2100 1049 -1253 -2200 -675 1633 2063 128 -2112 -2078 172
7621A72J948m39k384j693R07K475J235j311k489p05J838K325J75k160k121L28
$$ 172 2120 1681 -703 -2396 -1489 986 2221 910 -1579 -2284 -446 1879 2054 -106 -2227 -1899
7637a899K510J903q70k608j504J274K630J082j680k503n08J957K320Pk413j950
$$ -1899 611 2514 1644 -964 -2468 -1194 1436 2518 838 -1665 -2173 -216 2104 2111 -302 -2252
7653b252N75K456J792j079k670j329J458K691Q21j850k546l84K204K221k33k480
$$ -2252 -1677 779 2571 1492 -1178 -2507 -1049 1642 2463 613 -1933 -2317 -113 2108 1875 -605
7669f05j858Q20K627J469j371k730r82J843K609N69k164k435rK391K180n93k560
$$ -605 -2463 -1643 984 2453 1082 -1648 -2630 -787 1822 2391 227 -2208 -2217 174 2354 1761 -799
7686g99j602J138K588J180j656k530o45K026K499J22k235k257L05K450J843p79
$$ -799 -2401 -1263 1325 2505 849 -1681 -2326 -300 2199 2321 86 -2171 -1866 584 2427 1648
7702A648k466j434J258K412Q83j618k465l83K005K265q4k392j978N38K482J638
$$ 1648 -818 -2252 -994 1418 2301 683 -1782 -2165 -160 2105 2021 -371 -2349 -1811 671 2309
7718B309r39k561j243J416K427O76j786k176k24K150J989l48k326j683Q18K463
$$ 2309 1370 -1191 -2434 -1018 1409 2085 299 -1877 -2101 49 2038 1690 -636 -2319 -1501 962
7734I62J324j204k356r43J636K185L56j780j874J01K018J620o15k108j267R67
$$ 962 2286 1082 -1274 -2217 -581 1604 1960 180 -1694 -1593 425 2045 1430 -678 -1945 -978
7750i78K184R67j384k111n61J510J896K55j732j657J95J726J378o18j932j014
$$ -978 1206 2173 789 -1322 -1883 -373 1523 1778 46 -1611 -1416 310 1688 1070 -862 -1876
7766a876J032J867P46j370j836l81J463J779Rj628j481L22J722J224p72j669o99
$$ -1876 -844 1023 1769 399 -1437 -1818 -355 1424 1433 -195 -1676 -1354 368 1592 820 -849 -1548
7783a548R82J699L60j276j458j06J485J384k40j508j075M39J430Q30o79j325m93
$$ -1548 -566 1133 1493 217 -1241 -1347 138 1522 1282 -226 -1301 -862 568 1398 719 -606 -1099
7800a099R04J166J90j076j113O1J185R02k64j186q32M62J080N67n60r34m69P35
$$ -1099 -195 971 1161 85 -1028 -967 218 1120 856 -330 -1162 -700 380 947 387 -547 -1016 -281
7818b81Q71R0q07p63J63R03O66l39r73n01M33R41L76m82p59j78N38N56L9m87m52
$$ -281 590 680 -127 -890 -727 176 842 503 -470 -971 -538 403 779 297 -462 -640 -102 454 493 6 -446
7839d46J76N83K31k31n33j90L43M86J49l71l42j19J90K68L7j33j68O2N0K8k8p4
$$ -446 -270 313 544 313 -220 -410 -67 419 568 197 -145 -264 -74 194 231 98 -70 -8 42 70 42 -32
7861c2q9O8O0N8l1o8k28J9P6J31J74j4k41k36K9K59J47J03j98k14RK29K03o7k92
$$ -32 -121 -53 7 65 34 -34 -262 -243 -167 -36 138 124 -117 -353 -324 -65 82 185 -13 -227 -218 11 214 147 -145
7886a45j29K41M39J62m10n24j33N04O32L0n18o66J4O86N19k16o99l65L40Q30J77
$$ -145 -274 -33 406 568 158 -366 -499 5 637 667 149 -517 -503 183 702 486 -213 -578 -238 592 769
7907G69o50q13r5P75Q85j19r68q32K51J006P07m56j058m45O28J023K57q94r98
$$ 769 119 -694 -789 -14 871 752 -216 -1048 -797 209 916 460 -598 -1043 -415 608 865 -29 -1027
7926a027k7J127J038k99j161r13L44J442P65n81j320n56Q76J305K27j077j269
$$ -1027 -1054 73 1111 812 -349 -1262 -918 524 1289 708 -612 -1168 -292 1013 1240 163 -1106
7943a106O2J386J228m50j611r89P16J745P56j034j746n14J323J587R5j518j377
$$ -1106 -1044 342 1570 1120 -491 -1480 -764 981 1737 703 -1043 -1557 -234 1353 1448 -70 -1447
7960a447K55J666J185q01j801q96J061J893O19j380j845l46J593J745p8j738j442
$$ -1447 -1192 474 1659 858 -943 -1839 -778 1115 1734 354 -1491 -1837 -244 1501 1423 -315 -1757
7977a757M67J867J166q11j988q78J321K021N37j552k080j08J876J824k24k040
$$ -1757 -1290 577 1743 932 -1056 -1934 -613 1408 1945 393 -1687 -1795 81 1905 1681 -359
7993c59j545O56K167J223j129k201q06J596K166K28j961j951J43K152J808o86
$$ -359 -1904 -1248 919 2142 1013 -1188 -1994 -398 1768 1996 35 -1916 -1773 379 2187 1501
8009A501k303j436R72K351R95j447k200m78J776K022j9k121j791M38K300J692
$$ 1501 -802 -2238 -1266 1085 2080 633 -1567 -2045 -269 1753 1734 -387 -2178 -1740 560 2252
8025B252r16k445j228J248K407Q96j619k267l68J968K047r8k284j810P31K483
$$ 2252 1336 -1109 -2337 -1089 1318 2214 595 -1672 -2040 -72 1975 1877 -407 -2217 -1486 997
8041I97J489j195k511j100J546K496O87j922k365j71K212K008l85k365j708R59
$$ 997 2486 1291 -1220 -2320 -774 1722 2409 487 -1878 -2049 163 2171 1786 -579 -2287 -1328
8057a328K506J230j471k586p14J793K442K78k203k057J50K269J772o88k352j290
$$ -1328 1178 2408 937 -1649 -2363 -570 1872 2150 -53 -2110 -1960 309 2081 1393 -959 -2249
8073b249J120K377R41j624k254m79J970K163kk164j879L76K336J625q03k346j190
$$ -2249 -1129 1248 2189 565 -1689 -2168 -198 1965 1963 -201 -2080 -1704 632 2257 1454 -892 -2082
8090b082J203K312P64j668k239j71K002K011k59k299j780P54K357J351j083k396
$$ -2082 -879 1433 2197 529 -1710 -1881 121 2132 1873 -426 -2206 -1452 905 2256 1173 -1223
8106a223r40J435K284L88j824j967R4K015J674n51k194j416J007K181J094j282
$$ -1223 -2163 -728 1556 1944 120 -1847 -1753 262 1936 1385 -809 -2225 -1218 963 2057 775
8122G75k212o21J534J957K34j688j689K69J880J408p21j904j044J009J962Q42
$$ 775 -1437 -2058 -524 1433 1667 -21 -1710 -1441 439 1847 1126 -778 -1822 -813 1149 1991
8138A991j370j888l80J500J715P9j637j549L64J749J152q19j732p92J133J730
$$ 1991 621 -1267 -1647 -147 1568 1647 10 -1539 -1175 574 1726 907 -825 -1617 -484 1246
8154A246L96j414j688r2J557J512k50j689j160N05J599Q11p40j560n39J138J422
$$ 1246 1642 228 -1460 -1552 5 1517 1267 -422 -1582 -1077 522 1333 593 -967 -1506 -368 1054
8171A054J93j334j236M5J436J206m00j396j016O62J409O52p77j261l10R04J210
$$ 1054 1247 -87 -1323 -1278 158 1364 964 -432 -1448 -786 623 1275 498 -763 -1073 -169 1041
8188A041L9j123j020
$$ 1041 1080 -43 -1063
8191a063
$$ -1063
$$ Imaginary data points
##PAGE= N=2
##DATA TABLE= (X++(I..I)), XYDATA
0@%%%qK4k4K4m0M8n7Q9j12J28j68K08k41K97l60M16m96N85o73P86r15J045j202
$$ 0 0 0 0 -8 16 -8 16 -24 24 -33 56 -56 72 -96 112 -129 168 -192 224 -272 313 -360 426 -489 556 -646
26f46J380j562J773k012K261k544K863l199L572l990M438m927N476o070O717p446
$$ -646 734 -828 945 -1067 1194 -1350 1513 -1686 1886 -2104 2334 -2593 2883 -3187 3530 -3916
42c916Q243r120J0110j1210J2441j3850J5459j7310J9496k2102K5259k9215L4322
$$ -3916 4327 -4793 5317 -5893 6548 -7302 8157 -9153 10343 -11759 13500 -15715 18607
55A8607m1184N0996o6273R3532j57006N59744L62753j206852m99322M34020J042126
$$ 18607 -22577 28419 -37854 55678 -101328 458416 821169 -385683 -885005 -450985 591141
66E91141L36229o10706r41799j16841P36555P79668j32852q64403o79949L21256
$$ 591141 927370 316664 -625135 -741976 -5421 774247 641395 -223008 -902957 -581701
76e81701R38808N34600m98436r64618m18957N83161R10930K52132o65333p86803
$$ -581701 357107 891707 393271 -571347 -990304 -407143 503787 755919 90586 -696217
86f96217m9990P14462O47030j41083p67998m92290L58728Q22588L70291m90124
$$ -696217 -746207 -31745 615285 474202 -293796 -786086 -427358 395230 765521 275397
96B75397q26035k45985O20964Q17232J31129o56832o99667J8779O91323N73161
$$ 275397 -550638 -796623 -175659 641573 772702 115870 -583797 -565018 126305 699466
106F99466j86284o99203l92160L57841O96741K43358n07964p06690j12563O07529
$$ 699466 513182 -186021 -578181 -220340 476401 719759 211795 -494895 -607458 71
116G1O54911o528o58360o03505R1980O50175M57627k27801o22622l14961L27043
$$ 71 654982 648454 -9906 -613411 -521431 128744 586371 358570 -264052 -579013 -251970
127b51970N76632J47241m61766n43116j2405N32201M99834p8512n80569m50259
$$ -251970 324662 471903 10137 -532979 -545384 -13183 486651 408139 -172430 -622689
137f22689J63155N77779L67058k07932n23631k47736K97555M83457J13237l61886
$$ -622689 -459534 118245 485303 277371 -246260 -493996 -196441 287016 400253 38367
147C8367m03392K4639M45060L76434j21215m85520l10124J97050M89247K66697
$$ 38367 -365025 -340386 104674 481108 359893 -125627 -435751 -238701 250546 517243
157E17243k30000m61131j81603K68854L84541P0341l04132l23780L3052L47918
$$ 517243 287243 -173888 -355491 -86637 297904 368245 64113 -259667 -226615 121303
167A21303K43503j53818l85631k00880K00084L87261J49709k51265l72191j05885
$$ 121303 364806 210988 -174643 -375523 -175439 211822 361531 110266 -261925 -367810
177c67810K38218L05963M6414k47664k44272L7541K53943J65539j10513k64825
$$ -367810 -129592 176371 222785 -24879 -269151 -231610 22333 187872 77359 -187466
187a87466j15469J84938K91440P7991k10127k66766m7515K18605K54999K8545
$$ -187466 -302935 -117997 173443 251434 41307 -225459 -272974 -54369 200630 229175
197B29175j97485j80570K5476J81891J29401o8255j79094o2645J38041J80280
$$ 229175 31690 -148880 -123404 58487 187888 119633 -59461 -122106 15935 196215
207A96215K0400j67995j86625n130J82333J66038j9886j62546j33818J2772J21444
$$ 196215 216615 48620 -138005 -143135 39198 205236 185350 22804 -111014 -98242 23202
218B3202P8275n1983j02044k6744O6416P3888j3536j06766q9115L1895J15614
$$ 23202 101477 49494 -52550 -79294 -12878 61010 47474 -59292 -148407 -116512 -898
229h98P7439k8369j02120p9203J6853P9399N1972n372k9169j7481R706K0032m980
$$ -898 76541 48172 -53948 -133151 -116298 -36899 15073 9701 -19468 -36949 -27243 -7211 -12191
242a2191k4002l89L4299M3169K4267j6870m8057k9257J5172L6233L4389K1293
$$ -12191 -36193 -36582 -2283 40886 65153 48283 226 -29031 -13859 22374 56763 78056
254G8056n143k6307k9291k3925k368L5115M3312O677l0359l8818k0945J0258J9213
$$ 78056 72913 46606 17315 -6610 -8978 26137 69449 76126 45767 6949 -13996 -3738 15475
267A5475q309k4017J620K9966K3289j9365o8905o3521J8641R2550P1352k1300
$$ 15475 7166 -16851 -15231 14735 38024 18659 -50246 -113767 -95126 -2576 68776 47476
279D7476r5736q0119J9098R5478N7395l8606p2026j4129O4811P3550j3609j00050
$$ 47476 -48260 -128379 -109281 -13803 43592 4986 -67040 -81169 -16358 57192 43583 -56467
291e6467o7322N6912J33632Q1242n5549j44642q0257P6103J48176O4113p3615
$$ -56467 -123789 -66877 66755 147997 92448 -52194 -132451 -56348 91828 155941 82326
302H2326j22271l2693R6534J06482k0306j25522q3470N8689J49585P8622r8561
$$ 82326 -39945 -72638 23896 130378 110072 -15450 -98920 -40231 109354 187976 89415
313H9415j85726p5202J12370J78839N9189j26798j80771l6703J37528J39689k0497
$$ 89415 -96311 -171513 -59143 119696 178885 52087 -128684 -165387 -27859 111830 91333
324I1333j55522j13259O8444J82104P8675j29500j99867n1704J59982K12537L8096
$$ 91333 -64189 -177448 -109004 73100 151775 22275 -177592 -229296 -69314 143223 181319
335A81319j80806j97587J372J88410J67470k9172j85019j19213R4923J99224P0134
$$ 181319 513 -197074 -195702 -7292 160178 131006 -54013 -173226 -78303 120921 191055
346A91055j40219j95907k7588J90996K09736n399k15184j91786L0996K17639J70852
$$ 191055 50836 -145071 -172659 18337 228073 222674 7490 -184296 -153300 64339 235191
357B35191o2112k19826j25223J01834K01081O7687j51647k07545k0138K00533
$$ 235191 173079 -46747 -171970 -70136 130945 198632 46985 -160560 -180698 19835
367A9835J93674l7022k38190j92130O2183K53733J65385j04184k51315j23962
$$ 19835 213509 176487 -61703 -253833 -191650 62083 227468 123284 -128031 -251993
377b51993J28698K32317P0957j73216k11882J376K16011J88724n3673k48369j67900
$$ -251993 -123295 109022 179979 6763 -205119 -203743 12268 200992 147319 -101050 -268950
388b68950J12273K76242J40411j39230k61427j00489J69124K48585N1154j89467
$$ -268950 -156677 119565 259976 120746 -140681 -241170 -72046 176539 227693 38226
398C8226k01966J3696K12691J71742p1824k41659j34794J28565K53021J03521
$$ 38226 -163740 -150044 62647 234389 162565 -79094 -213888 -85323 167698 271219
408B71219j63541k61619p6687J87655K36446K6963k01696k06147J3190K11285
$$ 271219 107678 -153941 -230628 -42973 193473 220436 18740 -187407 -174217 37068
418C7068J59213q2278k29729j16439J29826K38032P9128j81902k48488m0124K10035
$$ 37068 196281 114003 -115726 -232165 -102339 135693 214821 32919 -215569 -255693 -45658
429d5658K31391O609k21302k02342M2385K30884J52955q9554k20852r7254J45557
$$ -45658 185733 192342 -28960 -231302 -188917 41967 194922 105368 -115484 -212738 -67181
440f7181K29926M9807j90267k16176j047K21534K10741k8358k35086j78768O9077
$$ -67181 162745 212552 22285 -193891 -194938 26596 237337 208979 -26107 -204875 -135798
451a35798K28785J35548r9676k17750q5823J42342J99953K4887j79737j88252
$$ -135798 92987 228535 128859 -88891 -174714 -32372 167581 192468 12731 -175521
461a75521J2725K07072J73096n7878k27250j53046P7449K18614J20692j08749
$$ -175521 -162796 44276 217372 159494 -67756 -220802 -143353 75261 195953 87204
471H7204k10980p5220J33928J81836K3628j62790j64893K7621J94330J41948o8576
$$ 87204 -123776 -198996 -65068 116768 140396 -22394 -187287 -159666 34664 176612 108036
482A08036k05299j20868R8618K15545R7899j19336j93875n5146J36774J74116
$$ 108036 -97263 -218131 -119513 96032 193931 74595 -119280 -174426 -37652 136464
492A36464J7269j53892j39484L9190J72265J11955p5354j85117q9347J11045J90173
$$ 136464 153733 -159 -139643 -100453 71812 183767 108413 -76704 -166051 -55006 135167
503A35167O2405j27776j79127m2056J35316J56747K255j46219j25085L1439J46575
$$ 135167 197572 69796 -109331 -151387 -16071 140676 142931 -3288 -128373 -96934 49641
514D9641R1569p5454j62314o4575J05756J58903L9507j26117j60164k1277J36529
$$ 49641 141210 65756 -96558 -161133 -55377 103526 143033 16916 -143248 -164525 -27996
525b7996J39358m816j32718j11337L1579J35208Q0079o5757j29210m1513R6128
$$ -27996 111362 106546 -26172 -137509 -105930 29278 109357 43600 -85610 -127123 -30995
536c0995J32469K2335j16719j25646N172J27998J14716j4350j21907r3265L6514
$$ -30995 101474 123809 7090 -118556 -113384 14614 129330 114980 -6927 -100192 -63678
547f3678J16301O1668n4950j02935l3270P6910R9113K552j00493r3048J3449J05843
$$ -63678 52623 114291 59341 -43594 -76864 46 99159 101711 1218 -91830 -78381 27462
559B7462Q6654k7911j13520p6133L5562R7676N2197m6737r0868l0417O2302P5696
$$ 27462 114116 86205 -27315 -103448 -67886 29790 81987 35250 -55618 -86035 -23733 51963
$$ [...]
8191d79
##END NTUPLES=NMR FID
##END=
