##TITLE=1H_DMP-04
 
 8 sc, 
 9.4.2024
##JCAMPDX= 6.0         $$ Bruker NMR JCAMP-DX V2.0
##DATA TYPE= NMR FID
##DATA CLASS= NTUPLES
##ORIGIN= UXNMR, Bruker Analytische Messtechnik GmbH
##OWNER= root
$$ XWIN-NMR		Version 3.5
$$ Tue Apr  9 13:44:01 2024 Russian Standard Time (UT+4h)  she@DPX200
##.OBSERVE FREQUENCY= 200.1309
##.OBSERVE NUCLEUS= ^1H
##.DELAY= (6, 6)
##.ACQUISITION MODE= SIMULTANEOUS
##.ACQUISITION SCHEME= undefined
##.AVERAGES= 8
##.DIGITISER RES= 18
##SPECTROMETER/DATA SYSTEM= spect
##.PULSE SEQUENCE= zg30
##.SOLVENT NAME= CDCl3
##.SHIFT REFERENCE= (INTERNAL, CDCl3, 0, 15.7039)
##AUDIT TRAIL= $$ (NUMBER, WHEN, WHO, WHERE, WHAT)
$$ ##TITLE= Audit trail, XWIN-NMR		Version 3.5
$$ ##JCAMPDX= 5.01
$$ ##ORIGIN= Bruker BioSpin GmbH
$$ ##OWNER= she
$$ F:/spectra/data/she/nmr/H-F/1/audita.txt
$$ ##AUDIT TRAIL=  $$ (NUMBER, WHEN, WHO, WHERE, WHAT)
(   1,<2024-04-09 13:42:52.00 +0400>,<she>,<DPX200>,
      <created by zg, POWCHK disabled, PULCHK disabled
       configuration hash MD5:
       00 E9 B6 7A A2 85 ED C7 34 08 36 98 17 FE 4E 26
       data hash MD5: 16K
       FB 68 B4 0D 5A 85 85 50 65 10 31 7F B0 17 36 08>)
$$ ##END=
$$ 
$$ hash MD5
$$ B1 1C 1A F2 E5 FD 53 0B E4 0E 4E FB 63 B1 19 F1
##$RELAX= 
##$RELAX= 
##$RELAX= 
##$RELAX= 
##$RELAX= 
##$RELAX= 
$$ Bruker specific parameters
$$ --------------------------
##$DU= <F:/spectra>
##$EXPNO= 1
##$NAME= <H-F>
##$PROCNO= 1
##$TYPE= <nmr>
##$USER= <she>
##$AMP= (0..31)
100 100 100 100 100 100 100 100 100 100 100 100 100 100 100 100 100 100 
100 100 100 100 100 100 100 100 100 100 100 100 100 100 
##$AQSEQ= 0
##$AQ_mod= 1
##$AUNM= <au_zg>
##$AUTOPOS= <>
##$BF1= 200.13
##$BF2= 200.13
##$BF3= 200.13
##$BF4= 200.13
##$BF5= 200.13
##$BF6= 200.13
##$BF7= 200.13
##$BF8= 200.13
##$BYTORDA= 1
##$CFDGTYP= 0
##$CFRGTYP= 5
##$CHEMSTR= <none>
##$CNST= (0..31)
1 1 145 1 1 1 1 1 1 1 1 1 1 1 1 1 1 1 1 1 1 1 1 1 1 1 1 1 1 1 1 1 
##$CPDPRG= <>
##$CPDPRG1= <>
##$CPDPRG2= <>
##$CPDPRG3= <>
##$CPDPRG4= <mlev>
##$CPDPRG5= <mlev>
##$CPDPRG6= <mlev>
##$CPDPRG7= <mlev>
##$CPDPRG8= <mlev>
##$CPDPRGB= <>
##$CPDPRGT= <>
##$D= (0..31)
0 1.2 0 0 0 0 0 0 0 0.06 0 0.03 0 0 0 0 0.0002 0 0 0 0 0 0 0 0 0 0 0 0 
0 0 0 
##$DATE= 1712655771
##$DBL= (0..7)
120 120 120 120 120 120 120 120 
##$DBP= (0..7)
150 150 150 150 150 150 150 150 
##$DBP07= 0
##$DBPNAM0= <>
##$DBPNAM1= <>
##$DBPNAM2= <>
##$DBPNAM3= <>
##$DBPNAM4= <>
##$DBPNAM5= <>
##$DBPNAM6= <>
##$DBPNAM7= <>
##$DBPOAL= (0..7)
0.5 0.5 0.5 0.5 0.5 0.5 0.5 0.5 
##$DBPOFFS= (0..7)
0 0 0 0 0 0 0 0 
##$DE= 6
##$DECBNUC= <off>
##$DECIM= 32
##$DECNUC= <off>
##$DECSTAT= 4
##$DIGMOD= 1
##$DIGTYP= 9
##$DL= (0..7)
0 120 120 120 120 120 120 120 
##$DP= (0..7)
150 150 150 150 150 150 150 150 
##$DP07= 0
##$DPNAME0= <>
##$DPNAME1= <>
##$DPNAME2= <>
##$DPNAME3= <>
##$DPNAME4= <>
##$DPNAME5= <>
##$DPNAME6= <>
##$DPNAME7= <>
##$DPOAL= (0..7)
0.5 0.5 0.5 0.5 0.5 0.5 0.5 0.5 
##$DPOFFS= (0..7)
0 0 0 0 0 0 0 0 
##$DQDMODE= 0
##$DR= 18
##$DS= 0
##$DSLIST= <SSSSSSSSSSSSSSS>
##$DSPFIRM= 0
$$ [...]
##$SUBNAM2= <"">
##$SUBNAM3= <"">
##$SUBNAM4= <"">
##$SUBNAM5= <"">
##$SUBNAM6= <"">
##$SUBNAM7= <"">
##$SUBNAM8= <"">
##$SUBNAM9= <"">
##$SW= 18.0517689322627
##$SWIBOX= (0..15)
0 0 2 0 0 0 0 0 0 0 0 0 0 0 0 0 
##$SW_h= 3612.71676300578
##$TD= 16384
##$TD0= 1
##$TE= 0
##$TE2= 300
##$TE3= 300
##$TEG= 300
##$TL= (0..7)
0 120 120 120 120 120 120 120 
##$TP= (0..7)
150 150 150 150 150 150 150 150 
##$TP07= 0
##$TPNAME0= <>
##$TPNAME1= <>
##$TPNAME2= <>
##$TPNAME3= <>
##$TPNAME4= <>
##$TPNAME5= <>
##$TPNAME6= <>
##$TPNAME7= <>
##$TPOAL= (0..7)
0.5 0.5 0.5 0.5 0.5 0.5 0.5 0.5 
##$TPOFFS= (0..7)
0 0 0 0 0 0 0 0 
##$TUNHIN= 0
##$TUNHOUT= 0
##$TUNXOUT= 0
##$USERA1= <user>
##$USERA2= <user>
##$USERA3= <user>
##$USERA4= <user>
##$USERA5= <user>
##$V9= 5
##$VALIST= <valist>
##$VCLIST= <CCCCCCCCCCCCCCC>
##$VD= 0
##$VDLIST= <DDDDDDDDDDDDDDD>
##$VPLIST= <PPPPPPPPPPPPPPP>
##$VTLIST= <TTTTTTTTTTTTTTT>
##$WBST= 1024
##$WBSW= 4
##$XGAIN= (0..3)
0 0 0 0 
##$XL= 0
##$YL= 0
##$YMAX_a= 232924
##$YMIN_a= -231783
##$ZGOPTNS= <>
##$ZL1= 120
##$ZL2= 120
##$ZL3= 120
##$ZL4= 120
##$ABSF1= 10
##$ABSF2= 0
##$ABSG= 5
##$ABSL= 3
##$ALPHA= 0
##$AQORDER= 0
##$ASSFAC= 0
##$ASSFACI= 0
##$ASSFACX= 0
##$ASSWID= 0
##$AUNMP= <proc_1d>
##$AZFE= 0.1
##$AZFW= 0.1
##$BCFW= 1
##$BC_mod= 2
##$BYTORDP= 1
##$COROFFS= 0
##$CY= 11.3945322036743
##$DATMOD= 1
##$DC= 2
##$DFILT= <>
##$DTYPP= 0
##$F1P= 15.7292609196834
##$F2P= 12.9074282941183
##$FCOR= 0.5
##$FTSIZE= 0
##$FT_mod= 4
##$GAMMA= 1
##$GB= 0.15
##$INTBC= 1
##$INTSCL= 1
##$ISEN= 128
##$LB= 0.24
##$LEV0= 0
##$LPBIN= 0
##$MAXI= 10000
##$MC2= 0
##$MEAN= 0
##$ME_mod= 0
##$MI= 1.114404
##$NCOEF= 0
##$NC_proc= 0
##$NLEV= 6
##$NOISF1= 3.799351
##$NOISF2= 2.8
##$NSP= 1
##$NTH_PI= 0
##$NZP= 0
##$OFFSET= 15.70392
##$PC= 1
##$PHC0= -25379.38
##$PHC1= 7.387311
##$PH_mod= 1
##$PKNL= yes
##$PPARMOD= 0
##$PSCAL= 0
##$PSIGN= 0
##$REVERSE= no
##$SF= 200.130013532006
##$SI= 16384
##$SIGF1= 3
##$SIGF2= 2
##$SINO= 400
##$SIOLD= 16384
##$SREGLST= <1H.CDCl3>
##$SSB= 0
##$STSI= 0
##$STSR= 0
##$SW_p= 3612.71676300578
##$SYMM= 0
##$S_DEV= 0
##$TDeff= 0
##$TDoff= 0
##$TI= <>
##$TILT= no
##$TM1= 0
##$TM2= 0
##$TOPLEV= 0
##$USERP1= <user>
##$USERP2= <user>
##$USERP3= <user>
##$USERP4= <user>
##$USERP5= <user>
##$WDW= 1
##$XDIM= 8192
##$YMAX_p= 0
##$YMIN_p= 0
$$ End of Bruker specific parameters
$$ ---------------------------------
##NTUPLES= NMR FID
##VAR_NAME=  TIME,          FID/REAL,        FID/IMAG
##SYMBOL=    X,             R,               I
##VAR_TYPE=  INDEPENDENT,   DEPENDENT,       DEPENDENT
##VAR_FORM=  AFFN,          ASDF,            ASDF
##VAR_DIM=   8192,          8192,            8192
##UNITS=     SECONDS,       ARBITRARY UNITS, ARBITRARY UNITS
##FACTOR=    0.0002768,     1,               1
##FIRST=     0,             0,               0
##LAST=      2.2672688,     0,               0
##MIN=       0,             -231783,         0
##MAX=       2.2672688,     232924,          0
$$ Real data points
##PAGE= N=1
##DATA TABLE= (X++(R..R)), XYDATA
$$ plain form
0 0 0 0 0 0 0 0 0 0 0 0 0 0 8 -8 8 -8 8 -16 16 -24 24 -32 32 -40 48 -56 64 -73 88 -98 113 -129 146 -168
34 -168 189 -213 241 -266 298 -334 371 -413 459 -507 560 -619 680 -753 831 -913 1009 -1107
52 -1107 1223 -1351 1492 -1651 1834 -2043 2288 -2577 2924 -3351 3891 -4598 5574 -7005 9322
67 9322 -13719 25085 -120660 -231783 -5321 155461 232924 133712 -20809 -155609 -151906
78 -151906 -46123 95663 152444 109934 -7998 -110540 -149420 -94631 6830 100707 127682
89 127682 86646 -3852 -91508 -133831 -96405 431 105410 151418 111050 1133 -109215
100 -109215 -147627 -82382 37867 124747 111384 7063 -115355 -163648 -94622 52222 174444
111 174444 186438 82147 -63349 -155538 -142628 -45544 61999 105740 65202 -16947 -75579
$$ packed form
0@%%%%%%%%%%%%Qj6J6j6J6k4L2m0M8n6O4p2Q8j04J20j37J61j86K11k42K75l14
34a68L57m02M54n07N64o32P05p84Q72r66J067j179J299j433J584j744J922k116
52a107K330k574K843l143L485l877M331m865N501o275P242q489J0172j2579J6327
67I322k3041L8804j45745j11123K26462J60782P7463r9212j54521j34800L703
78a51906J05783J41786N6781m2510j17932j02542l8880N4789J01461R3877K6975
89A27682m1036r0498q7656m2323L7426R6836J04979M6008m0368j09917j10348
100a09215l8412O5245J20249Q6880j3363j04321j22418m8293O9026J46844J22222
111A74444J1994j04291j45496r2189J2910R7084J07543M3741m0538q2149n8632
$$ plain form
122 -75579 -74085 -21620 43138 80281 70475 23882 -30544 -65597 -67762 -37077 14266 61736 76913
135 76913 45874 -17695 -77304 -93819 -51552 25648 86049 86740 28374 -44091 -75874 -43051
147 -43051 29020 83557 74307 3178 -79442 -113770 -76404 4731 74630 91404 53245 -4370
159 -4370 -38979 -33360 -3958 18964 17764 -2183 -22291 -28111 -18992 -4535 6942 14662 21196
172 21196 24883 18785 -943 -26404 -39707 -26549 8625 42274 48516 20513 -22345 -48719 -39585
185 -39585 -4105 27549 29374 1835 -28803 -33541 -5170 35748 57472 42147 652 -36833
197 -36833 -45955 -27184 -1945 8420 341 -11943 -10651 8495 31476 38015 20807 -7285 -25398
210 -25398 -22863 -6909 5628 3905 -8023 -15460 -7612 10853 23723 18544 -1045 -18916 -20608
$$ packed form
122g5579J494N2465O4758L7143r806m6593n4426l5053k165L0685N1343M7470J5177
135G6913l1039o3569n9609j6515M2267P7200O0401O91n8366p2465l1783L2823
147d3051P2071N4537r250p1129q2620l4328L7366Q1135O9899J6774l8159n7615
159d370l4609N619K9402K2922j200j9947k0108n820R119J4457J1477P720O534
172B1196L687o098j9728k5461j3303J3158L5174L3649O242k8003m2858k6374R134
185c9585L5480L1654J825k7539l0638m738K8371M0918K1724j5325m1495l7485
197c6833r122J8771K5239J0365q079j2284J292J9146K2981O539j7208k8092j8113
210b5398K535J5954J2537j723j1928p437P848J8465J2870n179j9589j7871j692
$$ plain form
223 -20608 -5801 11731 16791 6769 -5770 -6348 6371 18639 14507 -8307 -34520 -42271 -21747
236 -21747 14170 39073 34973 8204 -16567 -18187 3422 27627 30103 3428 -35109 -56173 -42231
249 -42231 -2520 35178 47005 29896 829 -18570 -17929 -3672 8755 9149 -80 -8711 -10103
262 -10103 -6136 -2494 -717 2405 9196 15995 14241 -1146 -23821 -36617 -24223 10970 46515
275 46515 55088 26673 -21287 -55383 -50783 -11484 31693 45096 19065 -24341 -49350 -34089
287 -34089 12290 56331 65258 32001 -20123 -56794 -57682 -27671 10741 34299 32825 13324 -7769
300 -7769 -18050 -15212 -3457 11440 22600 22047 6193 -18786 -38372 -37491 -10929 29373 57254
313 57254 48998 4493 -48366 -72253 -47979 10002 62383 71952 31528 -28710 -63929 -48985
$$ packed form
223b0608J4807J7532N060j0022j2539n78J2719J2268m132k2814k6213p751K0524
236b1747L5917K4903m100k6769k4771j620K1609K4205K476k6675l8537k1064J3942
249d2231L9711L7698J1827j7109k9067j9399O41J4257J2427L94r229q631j392
262a0103L967L642J777L122O791O799j754j5387k2675j2796J2394L5193L5545
275D6515Q573k8415m7960l4096M600L9299M3177J3403k6031m3406k5009J5261
287c4089M6379M4041Q927l3257n2124l6671q88L0011L8412K3558j474j9501k1093
300g769j0281K838J1755J4897J1160n53j5854k4979j9586Q81K6562M0302K7881
313E7254q256m4505n2859k3887K4274N7981N2381R569m0424o0238l5219J4944
$$ plain form
325 -48985 2787 51193 59428 20736 -36711 -71089 -57919 -7463 45927 69621 52926 10176
337 10176 -31159 -48541 -36998 -8921 17561 29557 22492 616 -23831 -34806 -22275 9322
349 9322 41961 53328 30770 -16885 -60326 -67632 -29297 31405 73406 66518 13842 -48827 -77383
362 -77383 -51419 9496 60470 65184 22255 -34855 -63753 -43877 9057 56223 64605 29876
374 29876 -23082 -60030 -60269 -27869 14591 42997 45411 25464 -3100 -24958 -29746 -16001 8003
387 8003 27810 29321 7907 -25616 -48850 -42048 -4476 42086 66197 48416 -2664 -53613 -68620
400 -68620 -36506 19711 60159 56946 13840 -37013 -58628 -36307 11122 47227 46456 11918 -30011
413 -30011 -50165 -35766 1730 36293 46955 31260 2551 -22824 -34521 -29772 -13058 6453
$$ packed form
325d8985N1772M8406Q235l8692n7447l4378J3170N0456N3390K3694j6695m2750
337A0176m1335j7382J1543K8077K6482J1996p065k1876k4447j0975J2531L1597
349I322L2639J1367k2558m7655m3441p306L8335O0702M2001o888n2676o2669k8556
362g7383K5964O0915N0974M714m2929n7110k8898J9876N2934M7166Q382l4729
374B9876n2958l6948k39L2400M2460K8406K414j9947k8564k1858m788J3745K4004
387H003J9807J511k1414l3523k3234O802L7572M6562K4111j7781n1080n0949j5007
400f8620L2114N6217M0448l213m3106n0853k1615K2321M7429L6105p71l4538m1929
413c0011k0154J4399L7496L4563J0662j5695k8709k5375j1697M749J6714J9511
$$ plain form
425 6453 19948 22142 12093 -5622 -19873 -18099 1734 26223 35818 19965 -14244 -45537 -50588
438 -50588 -21973 22472 51511 45076 9643 -28556 -43438 -26046 9120 34570 31246 4327
450 4327 -23091 -30935 -16032 8863 25982 23926 5822 -13784 -22182 -18034 -7929 2734 11839
463 11839 17690 18238 12555 1033 -13166 -22133 -17723 -1815 12798 13840 948 -14782 -19592 -6481
477 -6481 17941 35462 29935 3285 -25383 -36384 -24337 197 19712 21395 6517 -9987 -13592
490 -13592 -3462 8858 12550 5922 -4608 -10503 -7205 1558 6897 4454 -1005 -2058 2143 5586
504 5586 2656 -6893 -16855 -17874 -5309 14010 25785 21027 4430 -10978 -14927 -6730 4803 8054
518 8054 -1253 -14999 -19733 -9828 7416 19794 19869 9495 -2385 -7018 -3374 1133 -992 -8504
$$ packed form
425F453J3495K194j0049j7715j4251J774J9833K4489R595j5853l4209l1293n051
438e0588K8615M4445K9039o435l5433l8199j4882J7392L5166K5450l324k6919
450D327k7418p844J4903K4895J7119k056j8104j9606q398M148J0105J0663R105
463A1839N851N48n683j1522j4199q967M410J5908J4613J042j2892j5730m810J3111
477f481K4422J7521n527k6650k8668j1001J2047K4534J9515J683j4878j6504l605
490a3592J0130J2320L692o628j0530n895L298Q763N339k443n459j053M201L443
504E586k930r549r962j019J2565J9319J1775m758j6597j5408l949Q197J1533L251
518H054r307j3746m734R905J7244J2378P5j0374j1880m633L644M507k125p512
$$ plain form
532 -8504 -12953 -8002 4027 14295 14275 3014 -10778 -15273 -6159 8493 15803 9590 -4529 -14496
546 -14496 -11425 2780 16547 17829 4645 -13157 -22744 -18315 -4581 8363 13174 10117 5324
559 5324 4007 5361 4552 -957 -8100 -11153 -7491 -584 2831 -1022 -8183 -9658 28 16175 26264
574 26264 20069 -650 -22438 -29582 -16384 7524 24324 21621 2299 -17992 -23784 -11445 8518
587 8518 20728 16713 895 -14042 -17315 -7601 7045 16753 16588 8390 -2564 -11988 -17568 -17768
601 -17768 -11450 556 13851 21162 16839 2470 -12354 -16105 -4760 13309 22788 13235 -11250
614 -11250 -33752 -36364 -14372 18706 40384 35508 8060 -22009 -33831 -20552 6288 26396
626 26396 25848 6658 -15961 -26123 -18274 155 16079 19995 11103 -3686 -15550 -18586 -11739
$$ packed form
532h504m449M951J2029J0268k0j1261j3792m495R114J4652P310o213j4119r967
546a4496L071J4205J3767J282j3184j7802r587M429J3734J2944M811l057m793
559E324j317J354q09n509p143l053L662O907L415l853p161j475R686J6147J0089
574B6264o195k0719k1788p144J3198K3908J6800k703j9322k0291n792J2339J9963
587H518J2210m015j5818j4937l273R714J4646R708j65q198j0954r424n580k00
601a7768O318J2006J3295P311m323j4369j4824l751J1345J8069R479r553k4485
614a1250k2502k612K1992L3078K1678m876k7448l0069j1822J3279K6840K0108
626B6396n48j9190k2619j0162P849J8429J5924L916q892j4789j1864l036O847
$$ plain form
639 -11739 1930 16836 25774 22493 6385 -15224 -30037 -28050 -9239 14633 26930 18001 -5816
652 -5816 -25987 -25431 -2337 27676 42407 29047 -5139 -37368 -45543 -24825 9174 32942 31842
665 31842 9372 -16652 -27705 -17379 4638 21878 23535 10660 -6961 -18582 -18329 -7770 5982
678 5982 15513 16511 8374 -5987 -20041 -24919 -15340 5061 24769 31377 19453 -4353 -24228 -25649
692 -25649 -7502 15695 25299 12905 -12993 -33410 -31859 -7261 24047 40294 30888 4030 -21186
705 -21186 -29073 -16983 3939 17722 15466 1475 -12094 -16076 -9613 1644 10715 13000 8515
718 8515 1042 -5615 -9582 -9490 -3786 6312 15148 15742 5849 -9820 -21945 -21787 -7913 10834 20923
733 20923 15077 -940 -13730 -12963 1011 17332 22327 10262 -10983 -26162 -24841 -9335 8721
$$ packed form
639a1739J3669J4906Q938l281j6108k1609j4813J987J8811K3872J2297q929k3817
652e816k0171N56K3094L0013J4731j3360l4186l2229q175K0718L3999K3768j100
665C1842k2470k6024j1053J0326K2017J7240J657j2875j7621j1621K53J0559J3752
678E982R531R98q137j4361j4054m878R579K0401J9708O608j1924k3806j9875j421
692b5649J8147K3197R604j2394k5898k0417J551K4598L1308J6247r406k6858k5216
705b1186p887J2090K0922J3783k256j3991j3569l982O463J1257R071K285m485
718H515p473o657l967R2N704J0098Q836N94r893j5669j2125J58J3874J8747J0089
733B0923n846j6017j2790P67J3974J6321M995j2065k1245j5179J321J5506J8056
$$ plain form
746 8721 17791 13913 2788 -5525 -5232 1024 5965 5198 194 -4539 -5655 -3396 -736 -317 -1516 -1076
762 -1076 2382 5836 5035 -844 -7721 -9671 -3740 6982 14779 13051 2460 -9102 -13249 -7990 981
777 981 5649 2332 -5371 -9627 -5236 5385 14255 14581 6490 -3468 -8268 -6153 -1557 -199 -3607
792 -3607 -7722 -7095 -183 8609 12419 7877 -1305 -7548 -6157 819 6615 5860 -990 -8011 -8792 -2238
808 -2238 6068 9007 4189 -4220 -9510 -7754 -681 6013 7600 4471 1018 744 2654 2971 -650 -6623
824 -6623 -10563 -8586 -1346 5592 6610 1805 -3086 -2332 4349 11472 12156 3542 -9725 -18109 -14821
839 -14821 -2491 9396 12707 6446 -3429 -8936 -5779 2870 9192 7842 805 -5643 -7055 -3485
853 -3485 1694 4547 3457 488 -1224 -1177 -1921 -4548 -6677 -4875 1556 9564 13846 10113 -443 -10506
$$ packed form
746H721R070l878j1125q313K93O256M941p67n004m733j116K259K660M19j199M40
762a076L458L454q01n879o877j950N931J0722P797j728j0591j1562m147N259Q971
777I81M668l317p703m256M391J0621Q870L26q091r958m800K115M596J358l408
792c607m115O27O912Q792L810m542r182o243J391O976N796p55o850p021p81O554
808b238Q306K939m818q409n290J756P073O694J587l129l453k74J910L17l621n973
824f623l940J977P240O938J018m805m891P54O681P123O84q614j3267q384L288
839a4821J2330J1887L311o261r875n507L157Q649O322j350p037o448j412L570
853c485N179K853j090k969j712M7p44k627k129J802O431Q008M282l733j0556j0063
$$ plain form
869 -10506 -12151 -4447 5468 9073 3114 -8093 -15544 -11758 2286 16794 20925 11980 -3040 -14149
883 -14149 -15029 -6565 4138 9086 5746 -1373 -5989 -5667 -2103 2074 4769 5138 3589 1037 -2315
898 -2315 -5948 -7510 -3841 4570 12272 12714 3953 -9488 -19019 -17006 -3363 12889 19923 12676 -2689
913 -2689 -14414 -13763 -1249 13492 18555 8992 -8528 -21407 -20771 -7641 9020 18911 16798 5696
927 5696 -5994 -11194 -8560 -1701 4742 7549 5613 -3 -6343 -9975 -8449 -1440 8279 14838 12433
942 12433 744 -13327 -19850 -13032 3824 19889 23558 11100 -9348 -23377 -21038 -4481 13837
955 13837 20742 11547 -6338 -19250 -17269 -1889 15647 23138 15827 -774 -15897 -20759 -13825
968 -13825 -892 9867 13247 9025 887 -6407 -9052 -5739 1768 9300 11940 6787 -4291 -14906
$$ packed form
869a0506j645P704R915L605n959j1207p451L786J4044J4508M131q945j5020j1109
883a4149q80Q464J0703M948l340p119m616L22L564M177K695L69j549k552l352
898b315l633j562L669Q411P702M42q761j3441r531K013J3643J6252P034p247j5365
913b689j1725O51J2514J4741N063r563j7520j2879O36J3130J6661R891k113j1102
927E696j1690n200K634O859O443K807j936n616o340l632J526P009R719O559k405
942A2433j1689j4071o523O818J6856J6065L669j2458k0448j4029K339J6557J8318
955A3837O905r195j7885j2912J981J5380J7536P491p311j6601j5123m862O934
968a3825J2933J0759L380m222q138p294k645L313P507P532K640n153j1078j0615
$$ plain form
982 -14906 -17262 -8092 7725 19901 19300 5143 -13462 -23530 -17355 1058 18682 23041 11353
995 11353 -7399 -19533 -16618 -1654 13628 17892 8341 -7462 -18175 -16686 -4766 9266 16934
1008 16934 14768 5625 -4337 -10180 -10189 -5669 504 5328 6521 3354 -2663 -7799 -7881 -1477 8102 14230
1024 14230 11460 253 -12589 -18030 -11407 3243 15759 17085 6293 -8533 -16705 -12532 294
1037 294 11886 13737 5183 -6384 -11969 -7836 2154 10324 10976 4238 -4516 -9578 -8832 -4430 283
1052 283 3503 4888 5089 4223 2098 -1213 -3976 -3947 -764 2920 3332 -498 -5793 -8052 -4424 3753
1068 3753 10922 11215 3796 -5877 -10764 -7773 161 6918 7538 1932 -4818 -6751 -2579 3454 5911
1083 5911 3138 -2321 -5913 -4736 257 4808 5198 2007 -1144 -1459 366 1620 211 -3462 -6432
$$ packed form
982a4906k356R170J5817J2176o01j4157j8605j0068O175J8413J7624M359j1688
995A1353j8752j2134K915J4964J5282M264r551j5803j0713J489J1920J4032P668
1008A6934k166r143r962n843rM520O173M824J193l167o017n136q2O404R579O128
1024A4230k770j1207j2842n441O623J4650J2516J326j0792j4826q172M173J2826
1037B94J1592J851q554j1567n585M133R990Q170O52o738q754n062P46M402M713
1052B83L220J385K01q66k125l311k763K9L183L684M12l830n295k259L628Q177
1068C753P169K93p419r673m887K991P934O757O20n606o750j933M172O033K457
1083E911k773n459l592J177M993M551L90l191l151l15J825J254j409l673k970
$$ plain form
1098 -6432 -5515 -450 5105 6890 4281 145 -2073 -1084 1548 2613 73 -4419 -6717 -4431 689
1113 689 4553 4695 1817 -1312 -1781 850 3547 2727 -1648 -5649 -5426 -797 4866 7136 3895 -2838
1129 -2838 -7651 -6462 -393 5224 5957 1878 -3303 -5101 -1768 4228 7673 5387 -839 -6274 -7589
1144 -7589 -4970 -940 1894 2413 1808 2066 3291 3519 1401 -1840 -3514 -2327 491 2231 683 -3498
1160 -3498 -6514 -4622 2012 8620 9873 4244 -4508 -10218 -8451 -334 7944 10056 4646 -3711 -8758
1175 -8758 -7174 -779 5258 6346 2163 -3553 -6152 -4134 649 4910 6481 5168 2243 -1042 -4002
1190 -4002 -6230 -6730 -4308 694 5677 7141 3764 -2270 -6161 -4292 2500 9006 9392 2095 -8303
1205 -8303 -14266 -10867 -45 10651 13719 7246 -3713 -11240 -10219 -1936 7143 10589 6587 -1157
$$ packed form
1098f432R17N065N555J785k609m136k218R89K632J065k540m492k298K286N120
1113F89L864J42k878l129m69K631K697q20m375m001K23M629N663K270l241o733
1129b838m813J189O069N617P33m079n181j798L333N996L445k286o226n435j315
1144g589K619M030K834N19o05K58J225K28k118l241j674J187K818J740j548m181
1160c498l016J892O634O608J253n629q752n710J767Q117Q278K112n410q357n047
1175h758J584O395O037J088m183n716k599K018M783M261J571j313k925l285k960
1190d002k228n00K422N002M983J464l377o034l891J869O792O506L86p297j0398
1205h303n963L399J0822J0696L068o473j0959p527J021Q283R079L446m002p744
$$ plain form
1219 -1157 -7001 -7456 -3050 2641 5792 4833 858 -3655 -6529 -6594 -3330 2379 8109 10626 7797 406
1235 406 -7728 -11510 -7877 951 8548 8967 1634 -8021 -12476 -7371 4554 14979 15907 6137 -7497
1250 -7497 -15689 -13261 -2531 8740 12835 7434 -2718 -9995 -9798 -3292 4517 8788 7381 1832
1264 1832 -4001 -6614 -5102 -724 4284 7437 6620 1351 -5977 -11154 -10573 -3700 6006 12681 11491
1279 11491 2891 -7017 -10989 -6079 3926 11461 10198 182 -11665 -16434 -10211 2703 13487
1292 13487 15232 7382 -4102 -11215 -9566 -1451 6471 8859 5025 -1662 -6746 -7368 -3790 1306 4843
1307 4843 5403 3266 -611 -4502 -6194 -4028 1527 7435 9881 6516 -1463 -9441 -11896 -6791 2321
1322 2321 8896 8261 1196 -6708 -9073 -3466 6168 12515 10462 1298 -8613 -12790 -8916 -341 6737
$$ packed form
1219a157n844m55M406N691L151r59l975m513k874o5L264N709N730K517k829p391
1235D06q134l782L633Q828P597M19p333r655m455N105J1925J0425R28r770j3634
1250g497q192K428J0730J1271M095n401j0152p277J97O506P809M271j407n549
1264A832n833k613J512M378N008L153q17n269p328n177N81O873R706O675j190
1279A1491q600r908l972M910J0005P535j263j0016j1847m769O223J2914J0784
1292A3487J745p850j1484p113J649Q115P922K388l834o687n084o22L578N096L537
1307D843N60k137l877l891j692K166N555N908K446l365p979p978k455N105R112
1322B321O575o35p065p904k365N607R634O347k053r164r911m177L874Q575P078
$$ plain form
1337 6737 7864 3423 -2288 -4898 -3324 453 3523 4061 2406 -42 -1794 -2529 -2565 -1808 61 2521
1353 2521 3790 2343 -1599 -5558 -6518 -2932 3490 8464 8187 2724 -3919 -6950 -4528 961 4811
1368 4811 3708 -1593 -6704 -7229 -2497 4117 8064 7003 2338 -2326 -3964 -2464 -170 599 -483
1383 -483 -1727 -1622 -141 1302 1346 61 -1026 -435 1519 2865 1923 -949 -3366 -3087 71 3697 4582
1400 4582 1641 -3217 -6210 -5100 -798 3444 4614 2524 -508 -1582 119 2643 3271 1064 -2484
1415 -2484 -4600 -3952 -1398 827 1115 71 -349 1033 3342 4332 2558 -1267 -4384 -4357 -1301 2266
1431 2266 3323 1151 -2290 -3931 -2269 1476 4055 3342 41 -2976 -3210 -642 2581 3876 2368
1446 2368 -557 -2457 -2160 -835 -342 -1241 -2267 -1791 592 3515 4695 2983 -434 -2657 -1911 684
$$ packed form
1337F737J127m441n711k610J574L777L070N38j655k448j752p35l6P57J869K460
1353B521J269j447l942l959r60L586O422M974k77n463o643l031K422N489L850
1368D811j103n301n111n25M732O614L947j061m665m664j638J500K294P69j082
1383d83j244J05J481J443M4j285j087N91J954J346r42k872k417K79L158L626Q85
1400D582k941m858k993J110M302M242J170k090l032j074J701K524O28k207l548
1415b484k116O48K554K225K88j044m20J382K309R90j774l825l117K7L056L567
1431B266J057k172l441j641J662L745K579p13l301l017k34K568L223J295j508
1446B368k925j900K97J325M93q99j026M76K383K923J180j712l417k223P46K595
$$ plain form
1462 684 2323 1098 -2428 -5485 -5271 -1182 4097 6597 4761 328 -3327 -3811 -1316 1884 3008 1276
1478 1276 -1470 -2707 -1757 42 1100 873 -67 -643 -185 709 642 -657 -1553 -432 2341 4415 3788
1495 3788 112 -4726 -7266 -5208 315 5093 5585 1923 -2682 -4424 -1886 3163 6556 5197 -175
1510 -175 -5601 -7378 -4846 -59 3891 4731 2656 -279 -1864 -1716 -821 190 1169 1845 1720 566 -1313
1527 -1313 -3096 -3423 -1197 2673 5110 3723 -1054 -5906 -7141 -3295 3685 9080 8637 2329 -5253
1542 -5253 -8758 -6076 352 5718 6072 1277 -4802 -7190 -4124 2012 6913 7634 4063 -1367 -5308
1557 -5308 -5817 -3468 -156 2443 3508 2731 416 -2287 -3688 -2741 388 4014 5608 3438 -1756 -6386
1573 -6386 -6760 -2128 4533 8477 6520 -443 -7742 -9983 -5354 2747 8620 8400 2685 -4088 -7031
$$ packed form
1462F84J639j225l526l057K14M089N279K500j836m433l655m84K495L200J124j732
1478A276k746j237R50J799J058k27r40n76M58Q94o7j299q96J121K773K074o27
1495C788l676m838k540K058N523M778M92l662m605j742K538N049L393j359n372
1510a75n426j777K532M787L950Q40k075k935j585J48Q95J011R79O76j25j154j879
1527a313j783l27K226L870K437j387m777m852j235L846O980N395m43o308p582
1542e253l505K682O428N366L54m795o079k388L066O136M901P21l571n430l941
1557e308n09K349L312K599J065p77k315k703j401R47L129L626J594k170n194m630
1573f386l74M632O661L944j957o963p299k241M629Q101N873k20n715o773k943
$$ plain form
1588 -7031 -4315 1581 5913 5511 950 -4390 -6912 -5327 -961 3431 5526 4817 2315 -675 -2953
1603 -2953 -3715 -2615 -79 2562 3527 1865 -1713 -4673 -4556 -855 4182 6777 4686 -1050 -6327 -7215
1619 -7215 -2797 3818 7835 6325 457 -5467 -7249 -4040 1401 4868 4191 461 -3148 -3776 -1259
1634 -1259 2321 4201 3407 899 -1639 -2952 -2993 -2259 -1199 172 1739 2938 2798 980 -1474 -2694
1650 -2694 -1627 962 2962 2485 -485 -3755 -4505 -1862 2423 5001 3963 122 -3691 -4582 -2108 1735
1666 1735 3859 2902 119 -1987 -1900 -205 1297 1166 -488 -2084 -2065 -466 1235 1600 726 -158 46
1683 46 1263 2192 1453 -1050 -3600 -4068 -1944 1359 3350 2787 395 -1732 -1792 150 2221 2405 449
1700 449 -2005 -2961 -1851 321 1828 1642 271 -793 -579 364 689 -180 -1359 -1497 -71 2070 3124
$$ packed form
1588g031K716N896M332m02m561n340k522J585M366M392K095p09k502k990k278
1603b953p62J100K536K641R65j662l578k960J17L701N037K595k091n736n277q88
1619g215M418O615M017j510n868n924j782L209N441L467o77l730l609o28K517
1634a259L580J880p94k508k538j313m1P34J060J371J567J199j40j818k454j220
1650b694J067K589K000m77k970l270p50K643M285K578j038l841l813q91K474L843
1666A735K124r57k783k106Q7J695J502j31j654j596J9J599J701L65q74q84K04
1683D6J217R29p39k503k550m68K124L303J991n63k392k127o0J942K071J84j956
1700D49k454r56J110K172J507j86j371j064K14R43L25q69j179j38J426K141J054
$$ plain form
1717 3124 1915 -994 -3282 -3047 -547 2026 2487 485 -2312 -3390 -1478 2249 4849 4252 928 -2739
1733 -2739 -4231 -3000 -358 1630 1582 98 -1071 -790 494 1482 1408 543 -292 -437 -53 -13 -789 -1736
1751 -1736 -1534 205 2286 2954 1355 -1631 -3823 -3293 -121 3390 4384 2238 -1337 -3502 -2699 274
1767 274 2925 2952 200 -3125 -4271 -2542 712 3223 3602 2109 138 -922 -864 -548 -730 -1159 -1070 -225
1785 -225 767 966 98 -1101 -1256 233 2428 3352 1784 -1506 -4096 -3905 -868 2999 4635 2822 -1194
1802 -1194 -4283 -4190 -1217 2398 3901 2460 -544 -2552 -2133 110 2214 2629 1252 -796 -2224 -2469
1818 -2469 -1885 -1037 -25 1267 2534 3019 2011 -292 -2516 -2957 -1122 1679 3081 1665 -1761 -4484
1834 -4484 -4173 -588 3942 6001 3997 -746 -4768 -5208 -1995 2497 4913 3716 3 -3377 -4066 -2125
$$ packed form
1717C124j209k909k288K35K500K573M61k002k797j078J912L727K600n97l324l667
1733b739j492J231K642J988m8j484j169K81J284R88p4q65q35j45L84M0p76r47
1751a736K02J739K081O68j599k986k192N30L172L511R94k146l575k165Q03K973
1767B74K651K7k752l325j146J729L254K511L79j493j971j060N8L16j82m29Q9Q45
1785b25R92J99q68j199j55J489K195R24j568l290k590J91L037L867J636j813m016
1802a194l089R3K973L615J503j441l004k008M19K243K104M15j377k048j428k45
1818b469N84Q48J012J292J267M85j008k303k224m41J835K801J402j416l426k723
1834d484L11L585M530K059k004m743m022m40L213M492K416j197l713l380o89J941
$$ plain form
1850 -2125 769 2538 2267 541 -1224 -1852 -1221 52 1372 2395 2632 1626 -587 -3116 -4447 -3564
1866 -3564 -493 3140 4691 2996 -820 -3747 -3467 -67 3973 5404 2741 -2456 -6325 -5978 -1717
1881 -1717 3375 5873 4296 -62 -3939 -4539 -1889 1793 3801 3216 851 -1623 -2678 -1960 -333 1009
1897 1009 1456 1157 192 -1245 -2438 -2412 -745 1896 4120 4390 2090 -1870 -4700 -4341 -1149 2485 3793
1914 3793 1849 -1918 -4473 -3513 585 4732 5760 3067 -1424 -4606 -4519 -1551 1985 3371 2003 -562
1930 -562 -2231 -2155 -777 809 1543 1207 458 14 -108 -347 -614 -384 457 1287 1333 166 -1813 -3331 -2960
1949 -2960 -443 2627 3991 2812 81 -2118 -2237 -295 1944 2338 327 -2497 -3783 -2555 255
1964 255 2647 3058 1500 -557 -1369 -572 672 1008 180 -936 -1279 -508 672 1094 259 -1073 -1544 -666
$$ packed form
1850b125K894J769k71j726j765o28O31J273J320J023K37j006k213k529j331Q83
1866c564L071L633J551j695l816k927K80L400M040J431k663n197l869L47M261
1881a717N092K498j577m358l877o00K650L682K008n85k365k474j055P18J627J342
1897A009M47k99r65j437j193K6J667K641K224K70k300l960k830L59L192L634J308
1914C793j944l767k555R60M098M147J028k693m491l182Q7K968L536J386j368k565
1930e62j669P6J378J586P34l36p49m44j22k39k67K30Q41Q30M6j167j979j518L71
1949b960K517L070J364j179k731k199j19J942K239L94k011k824j286J228K810
1964B55K392M11j558k057q12P97J244L36q28j116l43P71J180M22q35j332m71Q78
$$ plain form
1982 -666 814 1626 1113 -257 -1236 -811 773 2075 1830 64 -1933 -2697 -1881 -231 974 996 257 -163
2000 -163 407 1445 1780 888 -671 -1691 -1464 -315 636 363 -910 -1820 -1165 880 2746 2862 961
2017 961 -1629 -2907 -1880 655 2601 2448 326 -1994 -2774 -1552 588 1851 1432 -136 -1375 -1281
2033 -1281 -74 1239 1728 1291 478 -138 -498 -929 -1562 -1957 -1464 37 1740 2409 1486 -389 -1645 -1154
2051 -1154 791 2516 2353 43 -2878 -4116 -2636 626 3328 3543 1298 -1636 -3030 -1989 506
2066 506 2454 2485 892 -941 -1723 -1223 -159 544 528 84 -250 -349 -505 -809 -828 -34 1479 2793 2746 938
2086 938 -1806 -3653 -3184 -649 2052 2838 1193 -1552 -3072 -2047 1009 3752 4044 1644 -1798 -3822
2102 -3822 -3253 -785 1767 2652 1552 -413 -1693 -1640 -711 361 1029 1218 1032 559 -159 -983 -1432 -883
$$ packed form
1982f66J480Q12n13j370r79M25J584J302k45j766j997p64Q16J650J205K2p39m20
2000a63N70J038L35q92j559j020K27J149R51k73j273r10O55K045J866J16j901
2017I61k590j278J027K535J946j53k122k320p80J222K140J263m19j568j239R4
2033a281J207J313M89m37q13o16l60m31o33l95M93J501J703O69r23j875j256M91
2051a154J945J725j63k310k921j238J480L262K702K15k245k934j394J041K495
2066E06J948L1j593j833p82N00J064P03j6m44l34r9j56l04j9P94J513J314m7j808
2086I38k744j847M69K535K701P86j645k745j520J025L056K743K92k400l442k024
2102c822N69K468K552Q85j100j965j280N3R29J072O68J89j86m73p18q24m49N49
$$ plain form
2120 -883 649 2056 2017 136 -2490 -3944 -2914 372 3828 4894 2789 -1024 -3724 -3496 -735 2414
2136 2414 3452 1552 -1860 -4045 -3403 -524 2612 3976 2962 428 -1888 -2594 -1678 -127 1111 1598
2152 1598 1272 260 -1023 -1876 -1825 -727 1075 2525 2436 483 -2083 -3279 -2012 1100 3883 4204 1502
2169 1502 -2677 -5231 -4335 -653 3191 4519 2690 -866 -3379 -2965 -81 2893 3712 1962 -1074 -3392
2185 -3392 -3605 -1819 667 2314 2461 1484 54 -1177 -1707 -1258 -4 1384 2067 1499 -271 -2229 -2925
2202 -2925 -1569 1100 3141 2972 497 -2637 -4061 -2552 1031 4111 4408 1822 -1885 -4015 -3238 -345
2218 -345 2345 2818 943 -1632 -2853 -1912 412 2446 2901 1728 -122 -1482 -1841 -1434 -657 136 786
2235 786 1089 840 -7 -975 -1314 -580 879 1993 1779 139 -1842 -2598 -1409 979 2730 2443 271
$$ packed form
2120h83J532J407l9j881k626j454J030L286L456J066k105l813k700K28K761L149
2136B414J038j900l412k185O42K879L136J364j014k534k316p06R16J551J238M87
2152A598l26j012j283q53N1J098J802J450q9j953k566j196J267L112K783L21k702
2169A502m179k554Q96L682L844J328j829l556k513M14K884K974Q19j750l036k318
2185c392k13J786K486J647J47r77j430j231n30M49J254J388O83n68j770j958o96
2202b925J356K669K041j69k475l134j424J509L583L080K97k586l707k130P77K893
2218c45K690M73j875k575j221R41K324K034M55j173j850j360l59M07P77P93O50
2235G86L03k49q47r68l39P34J459J114k14j640j981p56J189K388J751k87k172
$$ plain form
2252 271 -2243 -3221 -1925 684 2603 2495 670 -1231 -1731 -650 990 1757 957 -715 -1903 -1763 -611
2269 -611 555 1004 747 329 268 550 663 128 -761 -1206 -790 125 761 606 -201 -919 -747 308 1322
2288 1322 1309 214 -1060 -1455 -702 665 1547 1157 -175 -1259 -1157 -137 760 735 -161 -1110 -1169 -30
2306 -30 1461 2001 1082 -506 -1480 -1222 -113 845 746 -376 -1481 -1408 -68 1469 2023 1315 -94 -1176
2324 -1176 -1225 -403 434 472 -108 -568 -406 121 543 446 -30 -445 -251 408 792 354 -588 -1103 -631 577
2344 577 1558 1438 -5 -1780 -2421 -1329 713 2133 1963 469 -1172 -1614 -526 1136 1873 1024 -731
2361 -731 -2025 -2030 -828 680 1502 1252 465 -91 -128 -29 -124 -377 -453 -146 352 595 153 -731 -1232 -686 675
2382 675 1759 1582 133 -1589 -2226 -1128 987 2539 2260 342 -1772 -2564 -1586 307 1670 1533 204
$$ packed form
2252B71k514r78J296K609J919j08j825j901n00J081J640P67q00j672j188J40J152
2269f11J166M49k57m18o1K82J13n35q89m45M16R15O36j55q07p18J72J055J014
2288A322j3j095j274l95P53J367Q82l90j332j084J02J020Q97k5q96r49n9J139
2306c0J491N40r19j588r74K58J109R58r9j122j105P3J340J537N54p08j409j082
2324a176m9Q22Q37L8n80m60J62N27M22r7m76m15J94O59L84m38r42n15M72J208
2344E77R81j20j443j775o41J092K042J420j70j494j641m42J088J662P37q49j755
2361g31j294nJ202J508Q22k50p87n56l7R9r5k53p6L07M98K43m42q84n01N46J361
2382F75J084j77j449j722o37J098K115J552k79j918k114p92R78J893J363j37j329
$$ plain form
2399 204 -1109 -1313 -379 890 1556 1263 315 -602 -1024 -1047 -896 -674 -175 655 1365 1381 518 -773 -1534 -1072
2419 -1072 437 1831 1849 252 -1831 -2746 -1696 664 2649 2721 795 -1717 -2904 -1993 309 2287
2435 2287 2593 1229 -710 -1846 -1577 -404 711 1009 543 -235 -778 -909 -612 -7 795 1543 1771 1067
2453 1067 -459 -2033 -2578 -1548 540 2277 2353 621 -1667 -2688 -1570 991 3064 3045 794 -2099
2469 -2099 -3518 -2497 196 2570 3000 1338 -1145 -2621 -2241 -514 1284 2024 1542 339 -745 -1169
2485 -1169 -856 -156 579 1038 932 105 -1174 -2067 -1841 -353 1695 3001 2563 447 -1957 -2913 -1750
2502 -1750 658 2431 2257 178 -2265 -3148 -1703 1059 3078 2997 992 -1460 -2680 -1961 22 1703
2518 1703 1972 934 -490 -1388 -1396 -709 160 701 806 630 240 -330 -804 -691 140 1180 1649 1065 -495
$$ packed form
2399B04j313k04R34J269O66k93r48r17m22k3J51K22M99Q30P10J6q63j291p61M62
2419a072J509J394J8j597k083r15J050K360J985P2j926k512j187R11K302J978
2435B287L06j364j939j136K69J173J115K98m66p78n43j31K97O05Q02P48K28p04
2453A067j526j574n45J030K088J737P6j732k288j021J118K561K073j9k251k893
2469b099j419J021K693K374M30j662k483j476L80J727J798P40m82j203j084m24
2485a169L13P00P35M59j06q27j279q93K26J488K048J306m38k116k404r56J163
2502a750K408J773j74k079k443q83J445K762K019q1k005k452j220P19J983J681
2518A703K69j038j424q98qO87Q69N41J05j76l90n70m74J13Q31J040M69n84j560
$$ plain form
2537 -495 -2145 -2638 -1418 745 2302 2179 627 -1149 -1815 -831 999 2133 1544 -287 -1930 -2269 -1172
2554 -1172 530 1617 1434 305 -708 -843 -287 306 502 298 22 -57 113 221 -96 -616 -764 -290 398
2573 398 680 301 -462 -945 -600 562 1626 1646 537 -894 -1628 -1278 -243 643 659 -84 -766 -612 285
2592 285 1101 1187 534 -367 -793 -485 157 362 -117 -754 -852 -211 725 1147 690 -388 -1185 -959 159 1224
2612 1224 1382 531 -660 -1262 -848 157 851 641 -266 -1026 -1007 -253 659 1102 873 344 -1 -13 4 -261
2632 -261 -729 -971 -657 129 794 757 59 -663 -669 198 1247 1529 635 -875 -1882 -1583 -159 1310 1684
2651 1684 746 -776 -1652 -1256 52 1212 1406 651 -363 -834 -509 202 650 475 -67 -487 -563 -469 -406
2670 -406 -357 -159 352 1030 1391 985 -118 -1168 -1350 -529 610 1116 524 -779 -1682 -1330 174 1711
$$ packed form
2537d95j650m93J220K163J557j23j552j776o66R84J830J134n89j831j643l39J097
2554a172J702J087j83j129j013j35N56N93J96k04k76p9J70J08l17n20j48M74O88
2573C98K82l79p63m83L45J162J064K0j109j431p34L50J035Q86J6p43o82J54Q97
2592B85Q16Q6o53r01m26L08O42K05m79o37r8O41R36M22m57j078p97K26J118J065
2612A224J58q51j191o02M14J005O94k10r07p60J9P54R12M43k29n29l45j2J7k65
2632b61m68k42L14P86O65l7o98p22oQ67J049K82q94j510j007K99J424J469L74
2651A684r38j522q76L96J308J160J94p55j014m71L25P11M48j75n42m20p6R4O3
2670d06M9J98N11O78L61m06j103j050j82Q21J139N06n92j303r03L52J504J537
$$ plain form
2688 1711 2097 1090 -558 -1645 -1446 -210 1021 1328 585 -482 -1049 -862 -215 343 451 214 10 56
2706 56 182 112 -127 -183 121 625 838 338 -736 -1717 -1757 -579 1087 2005 1558 127 -1209 -1426 -364
2725 -364 1115 1723 876 -749 -1931 -1831 -571 917 1638 1201 87 -763 -848 -349 221 507 481 300 117
2744 117 -75 -357 -683 -708 -188 603 1019 622 -424 -1297 -1232 -56 1529 2305 1512 -424 -2116 -2395 -1106
2763 -1106 775 1881 1445 -121 -1489 -1556 -320 1252 1970 1397 -21 -1282 -1617 -1018 -16 660 780
2780 780 520 131 -235 -508 -582 -324 270 896 1097 579 -499 -1351 -1252 -143 1188 1702 869 -845 -2143
2799 -2143 -1988 -346 1625 2505 1722 -111 -1636 -1805 -636 873 1475 778 -579 -1523 -1407 -386 806
2816 806 1406 1151 437 -224 -556 -591 -486 -243 103 433 568 270 -362 -907 -838 -34 950 1346 749 -463
$$ packed form
2688A711L86j007j648j087J99J236J231L07p43j067n67J87O47N58J08k37k04M6
2706E6J26p0k39n6L04N04K13n00j074r81m0J178J666R18m47j431j336k17J062
2725c64J479O08q47j625j182J00J260J488P21m37j114q50q5M99N70K86k6j81j83
2744A17j92k82l26k5N20P91M16l97j046q73O5J176J585P76p93j936j692k79J289
2763a106J881J106m36j566j368o7J236J572P18n73j418j261l35N99J002O76J20
2780G80k60l89l66k73p4K58N94O26K01n18j078q52R9J109J331N14q33j714j298
2799b143J55J642J971Q80p83j833j525j69J169J509O02o97j357r44J16J021J192
2816H06O00k55p14o61l32l5J05K43L46L30J35k98o32n45O9Q04R84L96n97j212
$$ plain form
2836 -463 -1366 -1212 -34 1312 1731 822 -755 -1808 -1612 -374 947 1375 743 -321 -859 -484 392 987
2854 987 800 25 -711 -911 -543 -78 124 25 -52 134 514 685 393 -239 -705 -595 22 585 617 42 -640
2875 -640 -841 -337 465 867 510 -280 -815 -639 101 770 843 286 -384 -556 -150 295 304 -200 -787 -863 -214
2896 -214 739 1198 764 -175 -793 -612 144 824 750 -121 -1108 -1371 -629 557 1297 1117 260 -593 -877 -432
2916 -432 276 605 371 -74 -307 -269 -104 15 -18 -64 38 298 396 41 -525 -770 -333 556 1294 1233 208
2937 208 -1167 -1820 -1182 261 1394 1407 354 -951 -1451 -691 787 1738 1431 132 -1178 -1685 -1154 -1
2955 -1 942 1073 515 -126 -447 -404 -201 58 305 441 419 187 -249 -778 -880 -300 667 1249 959 -115 -1298
2976 -1298 -1693 -844 784 1949 1775 395 -1177 -1824 -1149 302 1423 1291 87 -1190 -1528 -773 473
$$ packed form
2836d63r03J54J178J346M19r09j577j053J96J238J321M28o32j064n38L75Q76N95
2854I87j87p75p36k00L68M65K02r9p7J86L80J71k92o32m66J10O17N63L2n75o82
2875f40k01N04Q02M02l57p90n35J76P40O69P3n57o70j72M06M45Rn04n87p6O49
2896b14R53M59m34r39o18J81P56O80p4q71r87k63P42J186P40j80q57q53k84M45
2916d32P08L29k34m45k33L8J65J19l3m6J02K60R8l55n66k45M37Q89P38o1j025
2937B08j375o53O38J443J133J3j053j305n00P60J478R51l07j299j310n07N31J153
2955aR43J31n58o41l21M3K03K59K47J36k2k32m36n29j02N80R67N82k90j074j183
2976a298l95Q49J628J165j74j380j572o47O75J451J121j32j204j277l38P55J246
$$ plain form
2993 473 1389 1431 660 -310 -858 -835 -528 -171 167 453 536 337 -123 -597 -754 -309 592 1276 1080 21 -1198
3014 -1198 -1637 -917 547 1712 1655 338 -1303 -1984 -1299 255 1527 1692 699 -643 -1288 -870 146
3031 146 928 933 293 -530 -975 -868 -385 127 544 818 877 576 -75 -808 -1122 -701 261 1113 1141 224 -1054
3052 -1054 -1633 -997 512 1791 1843 566 -1126 -2001 -1425 186 1607 1834 782 -739 -1626 -1355 -285
3069 -285 777 1124 677 -97 -612 -597 -213 265 598 674 468 17 -600 -1115 -1135 -488 589 1439 1403 425 -850
3090 -850 -1472 -946 399 1545 1525 254 -1362 -2047 -1313 372 1757 1875 693 -894 -1694 -1232 61
3107 61 1172 1377 692 -320 -936 -858 -300 241 461 356 100 -160 -405 -476 -278 201 777 1111 821 -78
3127 -78 -1094 -1470 -912 260 1169 1172 230 -908 -1285 -560 778 1634 1332 58 -1232 -1622 -883 386 1197
$$ packed form
2993D73R16M2p71r70n48K3L07L57L38K86Q3j99m60m74j57M45R01O84j96j059j219
3014a198m39P20J464J165n7j317j641o81O85J554J272J65r93j342o45M18J016
3031A46P82No40q23m45J07M83N12M17K74N9l01o51p33l14M21R62Q52K8r17j278
3052a054n79O36J509J279N2j277j692q75N76J611J421K27j052j521q87K71J070
3069b85J062L47m47p74n15J5L84M78L33P6k06m51o17n15k0O47J077Q50l6r78j275
3090h50o22N26J345J146k0j271j616o85P34J685J385J18j182j587q00M62J293
3107F1J111K05o85j012o16P8N58N41K20j05k56k60k45p1J98M79N76L34k90q99
3127g8j016l76N58J172R09Lr42j138l77P25J338Q56l02j274j290l90P39J269Q11
$$ plain form
3146 1197 1023 94 -779 -937 -402 319 674 513 50 -249 -203 23 130 60 -54 -49 42 39 -149 -463 -585 -260
3168 -260 410 953 904 284 -457 -770 -423 245 631 321 -461 -991 -801 61 909 1114 548 -338 -822 -540
3188 -540 221 740 522 -188 -750 -725 -117 581 743 248 -457 -765 -407 273 704 606 128 -301 -343 -37 248
3209 248 197 -150 -449 -442 -153 130 224 115 31 189 495 611 251 -426 -914 -789 -125 605 783 258 -594 -957
3231 -957 -462 546 1259 1080 93 -981 -1330 -674 472 1193 969 4 -924 -1162 -591 291 821 702 169
3250 169 -298 -377 -116 184 318 282 136 2 -215 -505 -734 -654 -83 703 1171 940 90 -810 -1071 -452 580
3271 580 1167 794 -348 -1377 -1494 -518 848 1618 1240 34 -1075 -1311 -573 537 1169 951 131 -644
3289 -644 -891 -589 -50 312 392 248 48 -103 -261 -341 -168 301 825 974 518 -430 -1301 -1443 -630 627
$$ packed form
3146A197j74r29q73j58N35P21L55j61m63k99M6K26J07p0j14NR1lj88l14j22L25
3168b60O70N43m9o20p41l13L47O68L86l10p82n30J90Q62Q48K05n66q86m84K82
3188e40P61N19k18p10n62K5O08O98J62m95p05l08L58O80M31r8m78m29m2L06K85
3209B48n1l47k99PK89K83R4j09q4J58L06J16l60o77m88J25O64P30J78n25q52l63
3231i57M95J008P13j79r87j074l49O56J146P21k24r65r28k38N71Q82N30j19n33
3250A69m67p9K61L00J34l6j46j34k17k90k29Q0N71P86M68k31q50r00k61O19J032
3271E80N87l73j142j029j17R76J366P70l78j206j109k36P38J110O32k18q20p75
3289f44k47L02N39L62Q0j44k00j51j58q0J73M69N24J49m56r48q71j42Q13J257
$$ plain form
3309 627 1399 1112 10 -1030 -1245 -392 893 1597 1134 -158 -1316 -1564 -809 383 1170 1057 246 -595
3327 -595 -862 -565 6 468 646 506 195 -120 -367 -552 -469 -42 523 782 410 -424 -1127 -1140 -289 1017
3347 1017 1801 1423 76 -1280 -1703 -945 409 1375 1198 12 -1209 -1479 -656 595 1427 1359 472 -613
3365 -613 -1121 -861 -195 380 636 522 176 -262 -585 -630 -386 107 708 982 631 -252 -1000 -1037 -276 836
3385 836 1449 1038 -290 -1583 -1834 -827 747 1773 1593 388 -976 -1475 -763 499 1284 1057 70
3402 70 -970 -1369 -906 48 818 974 636 119 -321 -555 -504 -200 225 562 636 305 -356 -939 -921 -233 700
3423 700 1174 820 -189 -1119 -1244 -356 916 1598 1171 -87 -1253 -1535 -793 408 1129 899 19 -762
3441 -762 -836 -223 574 939 686 39 -493 -642 -459 -197 -14 118 240 329 272 16 -308 -449 -176 320 694
$$ packed form
3309F27P72k87j102j040k15Q53J285P04m63j292j158k48P55J192P87j13q11q41
3327e95k67K97N71M62J78j40l11l15k47j85Q3M27N65K59l72q34p03j3Q51J306
3347A017P84l78j347j356m23P58J354R66j77j186j221k70Q23J251Q32o8q87j085
3365f13n08K60O66N75K56j14l46m38l23m5K44M93O01K74l51q83p48l7P61J112
3385H36O13m11j328j293k51J007J574J026j80j205j364m99P12J262P85k27r87
3402G0j040l99M63R54P70J56l38n17m40k34N1L04M25L37P4l31o61n83J8O88R33
3423G00M74l54j009r30j25Q88J272O82m27j258j166k82P42J201P21k30q80p81
3441g62p4O13P97L65k53o47n32j49J83K62J83J32J22Q9n7k56l24j41K73M96L74
$$ plain form
3462 694 542 -76 -683 -799 -295 470 863 556 -250 -903 -865 -162 656 965 595 -114 -576 -472 37 428
3482 428 342 -163 -598 -598 -142 367 555 304 -85 -223 -18 324 374 45 -428 -644 -392 110 496 419 12 -338
3504 -338 -348 -10 321 368 67 -226 -284 -26 283 314 29 -315 -392 -111 243 341 40 -385 -519 -116 551 922
3526 922 636 -133 -835 -919 -351 417 757 416 -324 -810 -615 125 823 944 429 -319 -768 -652 -146 297
3546 297 384 185 -61 -151 -101 -57 -54 -70 30 249 391 247 -172 -546 -507 2 598 795 341 -496 -1114 -948 -64
3569 -64 913 1248 707 -259 -941 -849 -93 698 868 313 -523 -963 -745 -76 576 803 531 66 -257 -322 -247
3590 -247 -154 -44 109 260 291 95 -258 -561 -499 25 636 855 413 -387 -936 -811 -9 901 1194 588 -476
3611 -476 -1181 -1066 -247 634 983 590 -191 -696 -554 9 530 635 331 -149 -474 -521 -343 -142 19 248
$$ packed form
3462F94j52o18o07j16N04P65L93l07q06o53L8P03Q18L09l70p09m62J04N09L91
3482D28q6n05m35%M56N09J88k51l89j38K05L42N0l29m73k16K52N02L86p7m07l50
3504c38j0L38L31M7l01k93n8K58L09L1k85l44p7K81L54R8l01m25j34M03O67L71
3526I22k86p69p02q4N68P68L40l41p40m86J95P40O98J21n15p48m49J16N06M43
3546B97Q7j99k46r0N0M4Lj6J00K19J42j44m19l74L9N09N96J97m54q37o18J66Q84
3569f4R77L35n41r66o82R2P56P91J70n55q36m40K18O69O52K27k72m65l23o5P5
3590b47R3J10J53J51L1j96l53l03O2N24O11K19m42q00n49J25Q02R10K93o06j064
3611d76p05J15Q19Q81L49l93p81n05J42N63N21J05l04m80l25m7J78K01J61K29
$$ plain form
3631 248 451 488 234 -215 -592 -567 -84 560 857 470 -347 -996 -930 -159 789 1176 694 -332 -1110 -1064 -232
3652 -232 751 1178 795 -78 -774 -861 -375 230 506 354 -7 -269 -315 -164 23 191 329 420 341 23 -457
3673 -457 -801 -697 -119 626 971 625 -223 -908 -904 -142 803 1195 712 -348 -1167 -1144 -299 732 1192 786
3693 786 -181 -936 -988 -378 399 827 667 163 -289 -425 -266 -35 112 161 159 91 -103 -360 -485 -289 200 745
3715 745 919 500 -324 -976 -928 -223 609 961 551 -337 -1008 -869 -34 858 1120 610 -289 -944 -863 -173 573
3736 573 787 411 -184 -545 -512 -180 153 259 139 41 32 56 17 -89 -109 7 194 289 124 -295 -677 -620 -85
3759 -85 551 809 520 -74 -557 -546 -35 511 596 116 -492 -725 -444 147 605 559 98 -366 -435 -77 295 356
3781 356 123 -203 -332 -127 206 340 103 -288 -462 -286 83 368 335 58 -243 -229 68 365 336 26 -316
$$ packed form
3631B48K03L7k54m49l77K5M83O44K97l87q17o49O6P71R48L87m82j026p78M6Q32
3652b32R83M27l83q73o96q7M86O05K76j52l61k62m6J51J87J68J38R1p9l18m80
3673d57l44J04N78P45L45l46q48o85MP62R45L92m83j060q19K3Q45J031M60m06
3693G86r67p55n2O10P77M28j60n04m52j36J59K31J47M9ko8j94k57j25J96M89N45
3715G45J74m19q24o52M8P05Q32L52m10q88o71J39Q35Q92K62n10q99o55Q1O90P46
3736E73K14l76n95l61L3L32L33J06j20r8rK4l9j06k0J16J87R5j65m19l82N7N35
3759h5O36K58k89n94m83J1N11N46Q5m80o08k33K81N91M58m6m61m64o9L58L72O1
3781C56k33l26j29K05L33J34k37l91j74J76L69K85l3k77l01J4K97K97k9l10l42
$$ plain form
3802 -316 -454 -298 4 193 126 -52 -75 130 349 339 51 -306 -445 -215 230 474 248 -292 -639 -473 96
3823 96 669 763 277 -470 -837 -544 209 794 788 216 -482 -812 -573 24 485 494 124 -237 -361 -194 94 324
3845 324 362 239 79 -68 -271 -464 -483 -228 233 615 617 176 -414 -704 -384 338 872 780 59 -800 -1114 -658
3867 -658 288 1013 981 228 -670 -1021 -625 196 840 881 348 -318 -648 -490 -90 250 346 211 -42 -247 -337
3888 -337 -301 -120 185 554 702 472 -98 -674 -855 -487 245 801 728 70 -691 -942 -442 460 1089 972 167
3909 167 -720 -1075 -651 190 803 794 222 -451 -731 -520 -35 370 470 309 79 -108 -177 -191 -123 45 266 388
3931 388 223 -214 -665 -770 -354 377 956 918 271 -535 -908 -598 182 792 791 124 -681 -993 -607 186 788
3952 788 843 341 -288 -611 -462 -37 311 382 246 33 -137 -250 -278 -245 -95 169 411 406 59 -376 -553 -282
$$ packed form
3802c16j38J56L02J89o7j78k3K05K19j0k88l57j39K30M45K44k26n40l47J66N69
3823I6N73R4m86p47l67K93P53N85on72o98l30K39N97M61Rl70l61j24J67K88K30
3845C24L8j23j60j47k03j93j9K55M61L82Km41n90k90L20P22N34r2p21q59l14M56
3867f58R46P25l2p53q98l51L96Q21O44M1n33o66l30J58M00L40R6j35k53k05r0
3888c37L6J81L05L69J48k30n70n76j81L68P32N56p3o58p61k51N00R02O29j17q05
3909A67q87l55M24Q41O13rn72o73k80K11M85M05J00j61k30j87o9j4O8J68K21J22
3931C88j65m37m51j05M16P31N79l8o47q06l73L10P80O10jo67q05l12L86P93O02
3952G88N5n02o29l23J49M25L48P1j36k13j70j13k8L3J50K64K42nl47m35j77K71
$$ plain form
3974 -282 324 817 780 131 -704 -1098 -764 85 815 940 397 -395 -811 -523 199 762 752 236 -405 -746 -595
3995 -595 -114 318 437 284 42 -117 -198 -193 -115 26 208 362 337 52 -371 -587 -374 129 563 582 93 -520
4017 -520 -823 -454 331 943 923 285 -509 -897 -629 51 608 582 78 -470 -617 -302 232 585 533 182 -190
4038 -190 -320 -214 -79 -2 26 47 87 100 29 -126 -263 -187 93 374 408 109 -273 -477 -268 187 532 450 -48
4061 -48 -561 -678 -311 278 626 504 21 -382 -371 3 391 436 100 -343 -558 -352 48 344 311 27 -183
4082 -183 -163 46 251 232 -2 -231 -262 -88 106 167 29 -120 -165 -31 124 136 -18 -155 -140 64 295 327 86
4105 86 -246 -377 -192 164 354 199 -210 -529 -411 80 614 738 334 -288 -658 -504 2 463 500 71 -418
4126 -418 -600 -297 176 530 496 145 -238 -394 -244 -1 153 167 120 58 -13 -119 -204 -240 -106 150 412 390 44
$$ packed form
3974b82O06M93l7o49q35l94L34Q49P30J25n43p92m16K88P22N63j0n16o41l41J51
3995e95M81M32J19j53k42j59q1NP8J41J82J54k5k85m23k16K13N03M34J9m89o13
4017e20l03L69P85O12k0o38p94l88K68O80N57k6n04n48j47L15N34L53n2l51l72
4038a90j30J06J35P7K8K1M0J3p1j55j37P6K80K81L4k99l82k04K09M55L45q2m98
4061d8n13j17L67N89L48j22m83m03J1L74L88M5l36m43k15K06M00K96l3k84k10
4082a83K0K09K05j9k34k29l1J74J94O1j38j49m5J34J55J2j54j37J5K04K31L2k41
4105H6l32j31J85L56J90j55m09l19J18M91N34J24m04o22l70J54N06M61L7m29m89
4126d18j82L03M73L54l4l51l83j56J50K43J54J4m7o2p1j06q5l6J34K56K62k2l46
$$ plain form
4149 44 -352 -501 -220 300 692 586 -19 -716 -940 -494 288 848 800 191 -505 -764 -399 279 704 584 40
4170 40 -508 -725 -452 57 442 486 248 -21 -218 -285 -235 -62 134 307 353 194 -165 -501 -548 -151 380 671
4192 671 493 -94 -674 -784 -277 519 977 766 28 -724 -941 -531 224 725 641 77 -483 -645 -321 213
4212 213 576 557 201 -213 -433 -412 -242 -16 197 339 329 130 -191 -443 -458 -111 407 703 497 -102 -656
4233 -656 -774 -321 412 873 676 -42 -759 -934 -445 336 861 805 217 -425 -687 -432 67 415 410 130 -205
4254 -205 -400 -342 -117 120 297 386 334 99 -232 -517 -490 -150 351 653 500 -78 -646 -779 -334 410 879
4275 879 713 34 -686 -909 -447 351 866 758 130 -566 -839 -540 68 515 576 274 -103 -327 -299 -100 121
4296 121 243 232 130 -67 -305 -467 -380 -14 434 671 485 -50 -589 -715 -309 346 781 605 -44 -701 -848
$$ packed form
4149D4l96j49K81N20L92j06o05o97k24M46P82N60m8o09o96k59L65O78M25j20n44
4170D0n48k17K73N09L85M4k38k69j97o7N0J73J96J73M6j59l59l36m7L97N31K91
4192F71j78n87n80j10N07P96M58k11p38p52k17M10P55N01q4n64n60j62L24N34
4212B13L63j9l56m14k20K1J70K26K13J42j0j99l21k52j5L47N18K96k06n99n54
4233f56j18M53P33M61j97p18p17j75M89P81N25n6n88o42k62K55M99L48nk80l35
4254b05j95N8K25K37J77Q9n2k35l31k85K7L40N01L02j53n78n68j33M45P44M69
4275H79j66o79p20k23M62P98N15j08o28o96k73K99O08M47O1l02l77k24K8J99K21
4296A21J22j1j02j97k38j62Q7L66M48K37j86n35n39j26M06O55M35j76o49o57j47
$$ plain form
4317 -848 -378 388 852 684 41 -589 -765 -373 264 668 578 124 -313 -482 -334 -43 166 213 128 22 -64
4338 -64 -102 -125 -70 91 275 344 191 -180 -506 -546 -211 299 607 464 -12 -469 -554 -169 384 644 401 -157
4360 -157 -585 -582 -158 366 568 324 -157 -455 -364 -36 269 327 141 -93 -173 -68 90 125 0 -129 -148 -58 42
4383 42 36 -54 -126 -51 150 304 249 -8 -261 -302 -128 121 242 91 -200 -324 -161 183 414 328 1 -332 -392
4406 -392 -98 288 432 183 -209 -440 -317 58 380 389 44 -337 -420 -161 205 440 340 43 -245 -306 -152
4427 -152 61 120 36 -63 -91 -30 27 50 24 18 104 217 185 -52 -344 -437 -228 175 484 438 32 -426 -552 -206 336
4452 336 653 496 -38 -559 -647 -253 318 632 453 -58 -515 -597 -268 199 479 407 112 -152 -245 -173 -28 60
4474 60 106 92 42 -54 -201 -315 -231 63 418 578 364 -124 -563 -610 -205 350 657 436 -146 -653 -671 -175 451
$$ packed form
4317h48M70P66M64j68o43o30j76L92O37M04r0m54m37j69J48K91K09M7q5j06q6
4338f4l8k3N5J61J84O9j53l71l26m0L35N10L08j43m76m57q5L85N53K60k43n58
4360a57m28LM24N24K02k44m81k98R1L28L05N8j86k34q0J05J58L5j25j29j9R0J00
4383D2or0p2P5K01J54n5k57k53m1J74K49J21j51k91j24J63L44K31q6l27l33o0
4406c92K94L86J44k49l92k31J23L75L22Rl45l81q3K59L66K35j00k97k88o1J54
4427a52K13N9q4r9k8O1N7K3k6oQ6J13l2k37k92r3K09M03L09m6m06m58j26L46N42
4452C36L17j57n34n21q8L94N71L14j79n11m57q2L29M67K80p2k95k64r3P2J45Q8
4474F0M6j4n0r6j47j14Q4K94L55J60k14m88m39m7M05N55L07k21n82n07j8M96O26
$$ plain form
4497 451 758 523 -67 -559 -621 -215 307 561 419 14 -340 -445 -281 -31 164 226 172 96 -14 -128 -198 -130
4519 -130 67 309 389 170 -250 -604 -584 -144 432 733 532 -45 -558 -631 -206 390 684 450 -106 -575 -636
4540 -636 -257 257 538 408 37 -290 -363 -208 30 216 261 191 88 -45 -195 -285 -260 -54 229 369 226 -110
4562 -110 -432 -446 -69 456 728 486 -119 -655 -763 -348 297 674 538 -4 -499 -580 -228 284 575 461 53
4583 53 -319 -429 -255 -7 179 222 160 40 -103 -207 -254 -172 23 310 443 284 -99 -443 -487 -157 305 567
4605 567 372 -162 -641 -665 -185 443 785 595 27 -520 -642 -276 248 521 353 -50 -400 -437 -192 156 345
4626 345 291 126 -50 -134 -160 -138 -71 56 181 241 126 -135 -384 -392 -102 286 484 343 -71 -429 -467 -81 395
4649 395 592 322 -194 -582 -575 -164 331 541 330 -70 -325 -256 18 282 308 120 -152 -270 -165 -11 81 51
$$ packed form
4497D51L07k35n90m92o2M06N22K54j42m05l54j05J64K50J95O2n4p6j10j14p0O8
4519a30J97K42Q0k19m20l54K0M40N76L01k01n77n13p3M25N96K94k34n56m69o1
4540f36L79N14K81j30l71l27p3J55K38J86M5p0j03j33j50r0K5K06K83J40j43l36
4562a10l22j4L77N25K72k42o05n36j08M15O45L77j36n42m95q1L52N12K91j14m08
4583E3l72j10J74K48J86M3o2j20j43j04m7Q2J95K87J33j59l83l44m4L30M62K62
4605E67j95n34m79k4M80O28L42j90n68n47j22L66N24K73j68m03l50l7K45L48J89
4626C45n4j65j76q4k6K2O7J27J25O0j15k61k49qK90L88J98j41m14l58l8L86M76
4649C95J97k70n16l88PM11M95K10k11m00k55O9K74K64K6j88k72j18J05J54R2l0
$$ plain form
4671 51 2 9 44 105 56 -75 -156 -102 89 237 198 -11 -242 -306 -117 150 291 143 -153 -319 -212 95 353 371
4695 371 104 -212 -320 -153 115 226 94 -180 -328 -206 99 348 336 78 -207 -284 -100 144 264 123 -132
4716 -132 -296 -227 14 210 229 65 -111 -170 -63 55 112 50 -5 -9 46 74 -13 -152 -228 -142 86 268 230 -30 -273
4741 -273 -290 -29 348 501 263 -206 -561 -521 -101 350 530 302 -142 -467 -382 -8 369 477 230 -144 -399
4762 -399 -360 -103 161 248 167 29 -80 -143 -149 -106 -12 117 250 262 85 -190 -387 -304 29 359 434 164 -303 -605
4786 -605 -443 70 590 700 318 -238 -618 -532 -63 408 524 222 -218 -481 -378 -49 295 414 256 -5
4806 -5 -213 -246 -189 -73 68 169 199 141 -26 -244 -370 -236 93 404 467 165 -247 -516 -404 44 506 591 211
4829 211 -329 -653 -533 -39 458 602 324 -129 -415 -357 -44 246 332 164 -81 -256 -256 -142 -10 92 165 199
$$ packed form
4671E1m9PL5O1m9j31q1N4J91J48l9k09k31o4J89K67J41j48k96j66J07L07K58J8
4695C71k67l16j08J67K68J11j32k74j48J22L05K49j2k58k85p7J84K44J20j41k55
4716a32j64O9K41J96J9j64j76n9J07J18N7o2n5mN5K8q7j39p6Q6K28J82l8k60k43
4741b73j7K61L77J53k38m69l55M0M20M51J80k28m44l25Q5L74L77J08k47l74k55
4762c99L9K57K64Q7q1j38j09o3oM3R4J29J33J2j77k75j97Q3L33L30P5k70m67l02
4786f05J62N13N20J10l82n56l80Q6M69M71J16l02m40k63J03L29L44J19j58k61
4806ek08l3N7J16J41J01L0n8j67k18j26J34L29L11O3l02m12k69J12M48M62Q5l80
4829B11n40l24J20M94M97J44k78m53k86N8L13K90Q6j68k45j75%J14J32J02P3L4
$$ plain form
4851 199 141 -8 -209 -308 -214 56 349 426 164 -251 -533 -432 -26 418 564 272 -236 -562 -451 -3 451
4872 451 568 309 -145 -476 -455 -136 188 305 209 1 -142 -151 -70 37 100 108 125 101 -27 -202 -314 -235 32 319
4896 319 418 193 -190 -470 -398 -27 412 543 263 -215 -539 -450 -32 391 512 233 -190 -461 -374 -29 287
4917 287 399 240 -18 -194 -197 -92 13 54 38 42 34 2 -70 -134 -105 54 249 296 141 -167 -405 -352 -41 311 427
4942 427 193 -190 -433 -333 30 357 422 147 -216 -391 -249 79 329 298 52 -200 -282 -138 59 167 122
4963 122 -1 -66 -16 84 94 16 -85 -119 -33 60 72 -35 -147 -157 -24 172 250 131 -87 -229 -184 19 200 180
4987 180 -8 -224 -235 -63 170 267 131 -134 -284 -179 90 295 255 19 -225 -263 -74 176 280 127 -140
5008 -140 -293 -214 12 238 288 135 -75 -182 -109 17 63 41 -47 -69 -56 -2 12 -26 -48 14 145 210 93 -88 -277
$$ packed form
4851A99n8j49k01r9R4K70K93P7k62m15k82J01M06M44J46k92n08l26J11M48M54
4872D51J17k59m54l31K1L19L24J17r6k08j43rQ1J07O3QJ7k4j28j75j12P9K67K87
4896C19R9k25l83k80P2L71M39J31k80m78l24Q9M18M23J21k79m23k71Q7L45L16
4917B87J12j59k58j76lJ05J05M1j6Mql2p2o4K9J59J95M7j55l08k38N3L11L52J16
4942D27k34l83k43J00L63L27O5k75l63j75J42L28K50l1k46k52q2J44J97J08m5
4963A22j23o5N0J00J0p8j01l4Q6R3J2j07j12j0J33J96P8j19k18j42M5K03J81k0
4987A80j88k16j1J72K33R7j36k65j50J05K69K05m0k36k44l8J89K50J04j53k67
5008a40j53P9K26K26N0j53k10j07P3J26M6k2q8k2J3N4J4l8k2O2J31O5j17j81j89
$$ plain form
5033 -277 -267 -43 254 370 188 -178 -431 -349 8 377 466 199 -210 -460 -332 50 389 423 159 -217 -428
5054 -428 -338 -51 220 284 180 -5 -128 -135 -69 8 75 99 97 51 -86 -245 -280 -122 146 379 374 97 -265 -473 -311
5079 -311 121 467 492 136 -322 -564 -380 86 480 516 159 -270 -489 -332 48 383 429 198 -113 -304 -279
5100 -279 -129 50 143 146 88 -6 -100 -171 -151 -7 199 318 260 -28 -349 -473 -287 128 462 469 125 -309 -515 -327
5124 -327 122 490 508 163 -275 -494 -342 48 361 387 146 -170 -332 -271 -63 134 228 190 85 -13 -109 -157 -161
5147 -161 -63 98 214 184 -10 -262 -368 -197 163 467 464 128 -302 -520 -367 44 408 462 154 -251 -473 -323
5169 -323 39 335 398 182 -122 -283 -243 -45 134 207 153 33 -71 -148 -170 -148 -46 107 253 246 46 -186 -310
5192 -310 -206 89 350 360 54 -335 -522 -327 91 437 501 193 -220 -455 -307 47 340 361 126 -175 -341
$$ packed form
5033b77J0K24K97J16j82l66k53Q2L57L69Q9k67m09k50J28L82L39L4k64l76k11
5054d28R0K87K71O4j04j85j23pO6P7O7K4km6j37j59l5J58K68K33nk77l62k08J62
5079c11M32L46K5l56m58k42J84M66L94L6l57m29k19J57L80L35M6k31l11j91K5
5100b79J50J79R3Ln8r4r4p1K0J44K06J19n8k88l21j24J86M15L34Pl44m34k06J88
5124c27M49L68J8l45m38k19J52L90L13K6k41l16j62O1K08J97R4l8j05r8r6m8m
5147a61R8J61J16l0j94k52j06J71L60L04ll36m30k18J53M11L64N4l08m05k22J50
5169c23L62K96O3k16l04j61M0J98J79P3n4j20j04p7k2K2J02J53J46pk00k32j24
5192c10J04K95K61J0l06l89j87J95M18L46O4l08m13k35J48L54K93K1k35l01j66
$$ plain form
5213 -341 -255 -12 175 211 133 6 -92 -120 -98 -48 28 117 181 153 -8 -222 -311 -195 66 281 309 73 -224 -380
5237 -380 -215 141 420 385 73 -299 -477 -293 77 342 328 58 -220 -288 -138 107 269 212 22 -139 -153 -78
5259 -78 12 54 42 20 10 29 8 -61 -129 -89 53 178 191 59 -139 -243 -155 64 227 177 -45 -264 -272 -78 188
5284 188 339 226 -47 -242 -225 -11 191 212 50 -172 -264 -137 99 241 182 -1 -145 -145 -22 117 150 39
5306 39 -78 -128 -67 36 73 22 -56 -61 -23 47 49 -8 -62 -35 70 169 122 -28 -204 -243 -93 134 262 153 -89 -266
5332 -266 -219 35 313 374 157 -180 -375 -297 6 285 331 129 -152 -300 -202 39 233 262 102 -75 -165 -143 -35
5355 -35 60 75 80 52 7 -72 -153 -174 -62 132 277 264 51 -210 -334 -196 102 355 335 38 -320 -457 -264 150
5379 150 456 458 145 -245 -427 -265 69 328 333 99 -177 -313 -216 -1 176 218 144 21 -93 -143 -127 -69 52
$$ packed form
5213c41Q6K43J87L6p8j27r8k8K2N0P6Q9O4k8j61k14q9J16K61K15K8k36k97j56
5237c80J65L56K79l5l12l72j78J84L70K65j4k70k78o8J50K45J62n7j90j61j4P5
5259g8R0M2j2k2j0J9k1o9o8M0J42J25J3j32j98j04Q8K19J63n0k22k19qJ94K66
5284A88J51j13k73j95J7K14K02K1j62k22r2J27K36J42n9j83j44%J23J39L3j11
5306C9j17n0O1J03L7n1p8nL8P0Kn7n4K7J05R9m7j50j76l9J50K27J28j09k42j77
5332b66M7K54K78O1k17l37j95P8L03K79M6k02k81j48R8K41J94K9j60j77r0K2J08
5355c5R5J5Nk8m5p9q1k1J12J94J45j3k13k61j24J38K98K53k0k97l58j37J93M14
5379A50L06Kl13l90j82J62L34K59Nk34k76j36R7K15J77M2p4j23j14n0J6N8J21
$$ plain form
5402 52 168 229 140 -72 -277 -335 -149 163 378 334 31 -300 -428 -183 199 464 403 40 -329 -464 -279 97
5424 97 376 361 121 -187 -313 -203 36 211 227 111 -44 -139 -152 -96 -23 66 138 158 76 -58 -217 -244 -90 159
5448 159 358 300 16 -293 -394 -222 115 385 359 44 -307 -413 -215 128 390 382 130 -180 -321 -220 8
5469 8 177 196 96 -26 -112 -101 -52 0 67 119 137 74 -50 -188 -219 -96 117 283 250 26 -263 -361 -199 126 373
5494 373 368 98 -242 -380 -215 104 337 318 76 -217 -332 -203 49 232 250 126 -22 -107 -106 -49 8 47 76 88
5518 88 40 -50 -139 -171 -59 116 254 221 20 -231 -314 -171 118 335 301 43 -251 -360 -182 113 322 286 39
5541 39 -212 -272 -117 126 257 210 26 -135 -177 -98 16 68 73 32 28 37 14 -24 -66 -34 48 118 127 -10 -147 -202 -98
5568 -98 102 229 201 0 -204 -252 -95 134 262 170 -39 -211 -211 -39 158 211 74 -95 -196 -114 48 162 158
$$ packed form
5402E2J16O1q9k12k05n8J86L12K15m4l03l31j28K45L82K65o1l63l69j35J85L76
5424I7K79j5k40l08j26J10K39J75J6j16j55r5j3N6P3Q9P2K0q2j34j59k7J54K49
5448A59J99n8k84l09j01J72L37K70k6l15l51j06J98L43K62qk52l10j41J01K28
5469HJ69J9j00j22q6J1M9N2O7N2J8o3j24j38l1J23K13J66l3k24k89r8J62L25K47
5494C73nk70l40j38J65L19K33j9k42k93j15J29K52J83J8j24j48q5JN7N7L9K9J2
5518H8m8r0q9l2J12J75J38l3k01k51q3J43K89K17l4k58k94j09J78K95K09l6k47
5541C9k51o0J55K43J31m7j84j61m2P9J14N2Nm1mRk3l8m2L2Q2P0Rj37j37n5J04
5568i8K00J27k8k01k04m8J57K29J28r2k09j72%J72J97N3j37j69j01Q2J62J14m
$$ plain form
5591 158 35 -80 -89 -4 72 76 1 -82 -94 -34 65 96 26 -35 -56 28 76 75 0 -89 -117 -36 76 118 38 -88 -140 -55 84
5620 84 176 116 -32 -177 -171 -10 178 222 88 -118 -230 -154 39 210 203 46 -132 -199 -74 117 210 168 10 -140
5644 -140 -178 -77 29 85 57 19 -9 -14 -9 -23 -23 -18 40 98 92 -23 -135 -193 -99 90 231 209 0 -226 -284 -113 155
5671 155 315 249 3 -243 -300 -127 144 294 212 -16 -216 -258 -93 105 223 177 48 -77 -121 -86 -32 15 49
5694 49 58 55 11 -52 -134 -120 -6 162 230 146 -63 -265 -288 -86 187 333 221 -42 -278 -317 -107 181 338 243 -12
5719 -12 -230 -248 -73 129 238 167 -13 -151 -173 -95 6 71 93 77 51 11 -50 -102 -93 -9 98 166 99 -82 -229 -230
5745 -230 -63 182 313 218 -23 -258 -295 -102 159 318 225 -14 -240 -262 -104 102 227 176 20 -114 -139 -64
5767 -64 35 101 95 56 26 -22 -72 -120 -117 -21 99 174 134 -28 -164 -195 -75 142 266 181 -47 -276 -300 -126 133 298
$$ packed form
5591A58j23j15rQ5P6Mp5q3j2O0R9L1p0o1k1Q4M8jp5q9k8Q1J12M2q0j26n2Q5J39
5620H4R2o0j48j45OJ61J88M4j34k06j12P6J93J71pj57j78o7J25J91R3m2j58j50
5644a40l8J01J06N6k8l8k8nNj4%NN8N8oj15j12n8R4J89J41k2k09k26n8J71K68
5671A55J60o6k46k46n7J73K71J50q2k28k00m2J65J98J18m6j29j25m4L5N4M7L4
5694D9Rlm4o3q2J4J14J68O8q4k09k02k3K02K73J46j12k63k36l9K10K88J57r5k55
5719a2k18j8J75K02J09p1j80j38k2P8J01O5K2j6k6m0o1n2RQ4J07O8o7j81j47j
5745b30J67K45J31r5k41k35l7J93K61J59r3k39k26k2J58K06J25n1j56j34k5P5
5767f4R9O6ol9l0m8n0m8LR6J20P5m0j62j36l1J20K17J24q5k28k29k4J74K59J65
$$ plain form
5793 298 230 8 -197 -250 -94 104 223 189 34 -128 -175 -81 28 80 85 42 8 -26 -55 -76 -62 11 100 175 109 -34
5819 -34 -179 -221 -91 102 215 163 -32 -230 -244 -72 157 280 197 -21 -215 -252 -97 112 216 141 -9 -128
5841 -128 -144 -45 81 130 83 16 -30 -32 -8 -11 -4 9 35 69 59 -22 -114 -140 -54 97 177 139 -3 -156 -174 -44 111 183
5869 183 91 -92 -199 -186 -34 147 189 84 -69 -152 -90 34 126 103 -11 -101 -106 -19 62 84 33 -37 -64 -12 49 77
5895 77 24 -37 -63 -6 66 72 12 -65 -99 -50 29 81 31 -56 -79 -36 66 109 95 -29 -134 -137 -29 100 119 31 -93 -162
5923 -162 -85 71 190 156 8 -140 -168 -61 95 167 117 -30 -133 -141 -36 77 105 73 -22 -61 -49 -6 23 29 10 18
5949 18 29 17 -38 -95 -110 -32 70 158 113 -31 -152 -178 -42 130 214 117 -83 -240 -229 -43 166 264 164 -46 -194
5974 -194 -195 -30 137 196 121 -33 -137 -131 -49 37 91 72 26 -19 -49 -71 -59 -22 48 119 134 44 -89 -188 -165 -12 135
$$ packed form
5793B98o8k22k05n3J56J98J19l4j55j62m7R4J09N2Nm3l4l4k9k1J4P3Q9P5o6j43
5819c4j45m2J30J93J13n2j95j98j4J72K29J23q3k18j94l7J55K09J04p5j50j19
5841a28j6R9J26M9m7o7m6kK4lPJ3K6L4j0q1r2k6Q6J51Q0l8j42j53j8J30J55P2
5869A83r2j83j07J3J52J81M2j05j53q3O2J24R2k3j14r0nQ7Q1K2n1p0k7N2O1K8
5895G7n3o1k6N7P2Oo0p7l4M9P9N2n0q7k3M3J02M3j4j24j05lJ08J29J9q8j24o9
5923a62P7J56J19l4j48j48k8J07J56P2n0j47j03qJ05J13K8l2r5l9J2M3K9Oj9Q
5949A8J1j2n5n7j5P8J02Q8m5j44j21k6J36J72Q4r7k00j57J1J86K09R8j00k10j48
5974a94jJ65J67N9p5j54j04OQ2Q6N4j9m6m5l0k2J2L7P0P1J5r0j33r9K3J53J47
$$ plain form
6001 135 207 98 -105 -232 -194 14 207 274 128 -93 -243 -210 -26 166 218 111 -48 -154 -138 -14 105 140
6023 140 88 6 -37 -54 -48 -28 -1 42 74 71 12 -84 -148 -113 9 161 209 100 -72 -205 -180 -23 162 222 100 -97
6049 -97 -223 -198 -19 164 227 126 -40 -145 -126 -19 89 110 60 -15 -69 -47 -11 9 9 28 59 74 35 -38 -100 -106 -8
6076 -8 115 168 78 -70 -190 -186 -42 134 213 135 -42 -195 -164 -20 132 183 95 -43 -158 -140 -36 80 126 84 22
6101 22 -32 -41 -14 -8 5 21 36 54 32 -29 -85 -89 -21 94 149 103 -39 -169 -172 -31 119 205 124 -55 -190 -182 -35 105
6129 105 172 81 -53 -139 -124 -8 101 127 67 -12 -68 -62 -15 12 14 23 16 44 33 -9 -50 -69 -8 63 108 58 -40 -128 -118 -31
6159 -31 100 147 78 -57 -157 -143 -15 126 152 64 -69 -139 -92 38 111 100 5 -88 -108 -41 42 78 55 4 -22 -3 31
6186 31 40 5 -29 -40 -5 40 47 19 -43 -56 -13 55 84 41 -39 -93 -73 15 93 75 -1 -87 -105 -21 61 97 53 -55 -105 -77 31
$$ packed form
6001A35P2j09k03j27L8K08J93O7j46k21j50L3J84J92N2j07j59j06J6J24J19L5
6023A40n2q2m3j7OK0K7M3L2ln9r6o4L5J22J52M8j09j72j33K5J57J85O0j22j97
6049i7j26K5J79J83O3j01j66j05J9J07J08K1n0p5n4K2L6K0%J9L1J5l9p3o2oR8
6076hJ23N3r0j48j20MJ44J76P9p8j77j53L1J44J52N1q8j38j15J8J04J16M6m2o2
6101B2n4rK7OJ3J6J5J8k2o1n6mO8J15N5m6j42j30lJ41J50Q6q1j79j35QJ47J40
6129A05O7r1j34q6J5J16J09K6o0p9n6OM7K7KRpK8j1m2m1j9O1P1M5n0r8q8J0Q7
6159c1J31M7o9j35j00J4J28J41K6q8j33p0M7J30P3j1r5r3k0O7Q3L6k3n1k6J9L4
6186C1Rl5l4j1L5M5Pk8o2j3M3O8K9m3q0n4K0Q8P8j8p6q6j8Q4Q2L6m4j08n0K8J08
$$ plain form
6217 31 124 121 21 -97 -115 -59 66 119 69 -25 -97 -63 -6 89 107 50 -21 -58 -31 10 32 18 5 -1 10 24 15 -19 -48 -17
6247 -17 41 79 48 -33 -114 -117 -37 94 147 86 -57 -168 -145 -26 127 193 107 -46 -168 -138 7 114 148 66 -49 -136
6273 -136 -109 -8 94 102 78 17 -34 -46 -38 -17 -2 28 57 58 20 -72 -111 -79 14 116 138 45 -97 -190 -137 13 159 193
6301 193 77 -103 -206 -165 -3 157 181 76 -66 -136 -111 2 118 136 74 -32 -83 -73 -33 3 31 57 52 30 -7
6326 -7 -50 -77 -51 29 108 108 19 -105 -164 -126 19 146 167 65 -116 -199 -144 19 153 168 72 -75 -153 -112 4 97 126
6353 126 51 -36 -80 -55 0 48 62 45 41 30 -8 -45 -71 -47 3 74 101 45 -64 -121 -109 0 128 161 64 -81 -174 -136
6381 -136 -7 123 153 61 -69 -140 -122 -8 91 115 59 -24 -58 -56 2 30 37 26 18 9 5 -15 -46 -36 20 89 101 64 -20 -108
6411 -108 -105 -6 90 128 56 -58 -150 -123 -17 117 152 73 -68 -138 -106 -4 98 113 55 -37 -89 -60 -15 52 55 36 13 -1
$$ packed form
6217C1R3lj00j18j8N6J25N3n0r4p2L4N7R5J8n7p1l7K7M1K2j4j3oJ1J4rl4k9L1
6247a7N8L8l1q1q1lQ0J31N3o1j43j11K3J19J53O6q6j53j22L0J45J07L4q2j15q7
6273a36K7J01J02Qk4o1n1j2QK1J5L0K9Jl8r2l9L2R3J02K2r3j42r3N3J50J46L4
6301A93j16j80j03M1J62J60K4j05j42p0K5J13J16J8o2j06n1J0M0L6K8K6nk2l7
6326gm3k7K6Q0P9%q9j24n9L8J45J27K1j02j81q3N5J63J34J5r6j47p8M1J16R3K9
6353A26p5q7m4K5N5M8J4j7mj1l8l7k6K4N0P1K7n6j09n7J2J09J28L3r7j45r3L8
6381a36J29J30L0r2j30p1J8J14R9K4n6q3l4KN8K8Pj1qrmk0l1J0N6O9J2l7q4q8
6411a08LR9R6L8p2j14r2K7J06J34L5p9j41p0L2J02J02J5n8r2n2K9M5O7Lj9k3j4
$$ plain form
6439 -1 8 5 -13 -20 8 43 57 34 -39 -93 -85 3 80 109 65 -38 -113 -96 12 82 107 38 -76 -129 -84 17 90 91 21 -58 -82
6470 -82 -43 28 80 48 4 -44 -32 15 28 24 -8 -20 -9 18 35 21 -19 -22 -9 46 63 41 -17 -63 -56 -6 60 53 4 -60 -83 -25
6502 -25 54 87 51 -38 -88 -70 -10 63 73 6 -63 -98 -47 48 86 54 -12 -66 -73 -5 56 75 34 -32 -57 -35 9 36 25 0 -17
6533 -17 -7 22 11 2 -17 -12 19 35 29 -20 -75 -91 -42 44 104 65 -22 -95 -98 -18 74 114 54 -53 -119 -92 -8 87 115 53 -40 -89
6565 -89 -77 5 71 86 41 -8 -36 -29 -5 21 17 17 19 23 2 -35 -47 -45 17 81 85 41 -60 -120 -98 3 91 107 40 -69 -136 -95
6597 -95 10 113 123 50 -60 -127 -84 18 95 92 47 -29 -65 -52 -6 38 41 32 13 9 -7 -24 -29 -14 14 52 60 18 -52 -110 -78
6628 -78 10 99 103 46 -70 -132 -93 5 113 107 34 -72 -123 -92 11 90 94 38 -18 -61 -47 9 44 47 24 11 10 1 -7 -24 -21 5
6660 5 54 62 35 -16 -74 -57 9 82 105 41 -47 -116 -108 -22 88 110 57 -47 -104 -71 1 79 98 44 -34 -67 -48 -9 30 48 20
$$ packed form
6439aRlj8pK8L5J4k3p3n4QQ8P7K9m4j03p5J7J08P0K5o9j14n3M5J01P3Jp0p9k4
6470h2L9P1N2l2m4m8J2M7J3ml2j2J1K7J7j4m0lJ3N5J7k2n8m6PN0O6pm9o4k3N8
6502b5P9L3l6q9n0J8O0P3J0o7o9l5N1R5L8l2o6n4pO8O1J9m1o6k5K2M4K7j1k5j7
6533a7J0K9j1rj9NL1J6om9n5j6M9Q6O0l9q7p3lQ0R2M0o0j07o6K7Q4R5K8o2r3m9
6565h9J2Q2O6J5m5m9k8PK4K6m%KMk1l7j2KO2O4Mm4j01o0K2J01Q8J6o7j09o7M1
6597i5J05J03J0p3j10o7M3J02P7lm5p6l6J3M6M4Lrj9mj6j7nJ5K8L8Qm2p0n8L2
6628g8Q8Q9Mn7j16o2L9R8J08op3j06n1L1J03P9Mn6n6m3J4N6L5Lk3j3jrqj7LK6
6660EM9Qk7n1n8J7O6P3K3o4q8o9QQ6J10K2n3j04n7L3P2P8J9n4p8l3J9L9L9J8k8
$$ plain form
6691 20 9 2 1 -6 -12 -26 2 43 58 42 -22 -64 -77 -2 67 96 61 -35 -106 -96 -20 78 113 61 -35 -102 -92 -19 59 87 45 -33
6723 -33 -73 -59 -8 49 45 27 4 -7 -14 -12 0 -5 13 27 47 39 -7 -48 -51 -11 62 88 51 -31 -86 -73 5 81 105 49 -41 -103 -88
6756 -88 -7 68 94 30 -38 -76 -53 -5 57 54 5 -34 -38 -13 -3 30 12 0 5 11 23 12 -15 -17 -10 35 57 34 -15 -50 -42 9 50 77
6790 77 26 -40 -59 -45 34 76 60 -9 -51 -73 -23 27 57 27 -28 -69 -48 13 62 49 13 -28 -62 -28 26 47 19 -8 -35 -17
6820 -17 8 35 35 5 -6 -11 18 23 12 -5 -12 -2 30 45 10 -26 -53 -32 23 68 55 4 -59 -71 -25 48 80 59 -22 -86 -89 -22 54
6853 54 100 62 -16 -55 -67 -2 48 70 40 -9 -42 -36 -7 24 39 24 23 8 5 -20 -32 -17 0 39 63 42 -22 -72 -75 -13 64 93
6885 93 45 -40 -101 -96 -15 86 104 61 -21 -103 -91 -18 65 88 50 -7 -58 -55 -5 39 60 47 14 -6 -10 -29 -13 8 20 53 48 20
6917 20 -38 -75 -53 6 70 83 42 -41 -97 -88 -12 79 101 50 -45 -103 -92 -9 72 99 47 -22 -73 -62 -19 29 58 30 5 -19 -15
$$ packed form
6691B0j1pjpoj4K8M1J5j6o4m2j3P5O9K9l5r6p1J0P6R8L5n2r6o7J0P3P8K8m2p8
6723c3m0J4N1N7mj8k3j1pKJ2nJ8J4K0qm6m1lM0P3K6l7q2n5J3P8P6K4n6r0o2J5
6756h8Q1P5K6o4o8l8K3M8O2lm9l9mK5J0L3j8j2NOJ2j1k7kPM5K2k3m9l5QN1M1K7
6790G7n1o6j9J4P9M2j6o9m2k2N0N0L0l0n5m1K1O1M9j3l6m1l4L4N4K1k8k7k7J8
6820a7K5K7%l0j1nK9Nj1j7pJ0L2J5l5l6k7K1N5M5j3n1o3j2M6P3L2k1q1o4lO7P6
6853E4M6l8p8l9j2O5N0K2l0m9l3OK9L1J5j5jj5lk5j2J5J7L9K4k1o4n0lO2P7K9
6885I3m8q5o1NQ1J01J8m3q2q2J2P3Q3K3l8n7n1LN0M4K1j3l3k0mj9J6K1J2L3nk8
6917B0n8l7K2N9O4J3m1q3n6RP6R1K2n1r5n8J1Q3Q1K7n2o9n1J1M3M8K9k8k5k4M
$$ plain form
6948 -15 -11 -9 6 20 44 39 19 -23 -45 -42 3 63 82 48 -28 -94 -87 -16 64 97 54 -38 -91 -93 -28 60 82 37 -27 -69 -68 -27 22 60
6982 60 22 3 -11 -12 -15 -7 -4 7 20 38 18 -8 -52 -57 -7 55 88 49 -14 -83 -88 -16 65 107 52 -24 -88 -91 -39 58 85 45 -22 -68
7016 -68 -66 -20 22 49 31 -14 -37 -37 -20 -11 -3 17 26 37 17 7 -32 -34 -12 45 70 53 -13 -72 -78 -17 53 85 63 -24 -90 -86 -22 53
7050 53 72 55 -34 -79 -57 -14 40 50 22 -22 -55 -42 -9 14 21 15 6 -2 6 7 -7 -16 -11 15 31 30 -10 -31 -31 3 43 70 41 -8 -49
7085 -49 -48 -9 52 52 26 -44 -62 -33 13 55 41 -12 -52 -47 -17 10 45 16 -28 -46 -28 16 40 17 -10 -32 -24 10 28 32 13 -18 -15
7118 -15 4 21 23 -1 -15 -9 4 36 24 6 -26 -24 1 25 44 11 -36 -46 -39 23 49 36 -14 -71 -72 -28 41 72 40 -28 -75 -68 -12
7151 -12 46 68 42 -19 -42 -38 -1 31 44 36 -3 -8 -9 -4 -6 -5 11 25 35 14 -20 -41 -39 -2 50 70 45 -27 -85 -84 -14 54 85 37 -27
7186 -27 -94 -92 -11 68 76 38 -25 -73 -70 -7 46 72 35 -11 -35 -18 -13 1 20 25 25 29 1 -8 -27 -31 13 47 61 30 -47 -90 -68 -13 69
$$ packed form
6948a5MKJ5J4K4nk0m2k2LM5O0J9l4p6o6PP1Q0L3m3r2n3kO5Q8K2m5o4m2JM1M9L8
6982F0l8j9j4jlQLJ1J3J8k0k6m4nN0O2L3l9o3o9nP2Q1M2n5p6o4lN2R7K7m0o7m6
7016f8KM6M2K7j8m5k3%J7RQK0RJ1k0j0l9kK2N7K5j7o6n9oO1P0L2k2q7o6MO4P5
7050E3J9j7q9m5K2M3N4J0k8m4l3J3L3K3PorqQJj4rNK6J6jm0k1%L4M0K7k9m9m1
7085d9JL9O1%k6p0j8K9M6M2j4n3m0NL0K7L5k9m4j8J8M4K4k3k7k2QL4J8Mj9l1L
7118a5J9J7Kk4j4OJ3L2j2j8l2KK5K4J9l3m7j0PO2K6j3n0n7jM4O9L1l2o8m7PN6
7151a2N8K2k6o1k3ML7L2J3ql9njNkJJ6J4J0k1l4k1KL7N2K0k5p2n8JP0O8L1m8o4
7186b7o7KQ1P9Ql8o3m8LO3N3K6l7m6k4J7NJ4J9N%Mk8rj9mM4L4J4l1p7m3K2N5Q2
$$ plain form
7221 69 91 38 -51 -101 -84 -8 68 96 45 -34 -86 -85 -14 42 55 20 -10 -40 -42 -17 17 28 19 25 14 1 -17 -37 -29 2 43 52 33
7254 33 -30 -71 -55 9 68 84 28 -36 -99 -80 -10 63 85 31 -32 -85 -80 -27 45 59 31 -21 -53 -41 -21 9 29 18 14 2 -5 -19
7286 -19 -29 -22 17 43 64 34 -16 -60 -59 0 65 84 48 -29 -96 -69 -14 78 92 42 -30 -80 -70 -19 45 71 38 -14 -54 -50 -26 9
7318 9 26 13 6 -3 -7 -14 -24 -17 7 34 44 32 -3 -59 -56 -8 55 82 56 -21 -64 -60 -10 76 78 50 -18 -78 -66 -9 54 67 35 -21 -47
7353 -47 -35 1 22 21 0 -17 -20 -12 7 -2 -6 -3 11 30 28 3 -29 -34 4 37 70 43 -7 -41 -38 0 45 48 23 -29 -47 -20 21 59 43
7388 43 6 -35 -54 -14 17 38 4 -21 -45 -27 6 23 16 -12 -34 -29 1 15 33 2 -18 -26 4 22 36 7 -9 -21 -2 10 24 15
7420 15 -9 -13 -12 21 22 12 -17 -31 -25 17 43 30 -14 -59 -50 -9 40 63 31 -36 -72 -48 -4 43 62 20 -31 -74 -40 5 42 50 21
7453 21 -18 -29 -19 4 27 3 23 17 6 -2 -6 -23 -7 13 46 51 13 -36 -54 -55 5 58 73 18 -58 -92 -61 5 60 76 25 -51 -84
$$ packed form
7221F9K2n3q9n0J7P6P6K8n1p9n2JP1N6J3l5l0l0kK5L4J1rOj1j3j8k0QL1M1Rj9
7254C3o3m1J6O4N9J6n6o4o3J9P0P3K2n4o3n3NN3P2J4k8n2l2J2K0L0K0j1mj2pj4
7286a9j0PL9K6K1l0n0m4JN9O5J9l6p7o7K7N5R2J4n0p2n0J0N1O4K6l3n2m0MK4L5
7318IJ7j3prmpj0PK4K7J0j2l5n6LM8O3K7k6p7m3MN0Q6Kk8o8o0J2N7O3J3l2n6k6
7353d7J2L6K1jk1j7lQJ9rmLJ4J9kk5l2nL8L3L3k7n0l4LL8M5Lk5n2j8K7M1L8j6
7388D3l7m1j9M0L1K1l4k5k4J8L3J7pk8k2NL0J4J8l1k0qL0J8J4k9j6j2J9J2J4r
7420A5k4mJL3Jj0k9j4OM2K6j3m4m5RM1M9K3l2o7l6K4M4M7J9m2n1m3L4M5L7Qk9
7453B1l9j1J0K3K3k4K0oj1qmj7J6K0L3Nl8m9j8jO0N3J5n5p6l4L1O6N5J6n1p6l3
$$ plain form
7486 -84 -68 3 61 78 37 -21 -55 -41 -2 30 44 33 1 -6 -17 -18 -2 4 37 44 31 2 -44 -57 -29 25 72 69 15 -48 -81 -60 11
7519 11 77 73 11 -54 -97 -63 7 63 62 24 -38 -65 -42 6 35 42 12 -7 -20 -13 -13 -4 12 13 30 23 5 -28 -41 -21 16 59 54 16 -44
7554 -44 -79 -56 15 68 67 19 -54 -81 -52 19 51 62 8 -38 -67 -44 2 35 35 17 -6 -9 -12 -12 -8 6 23 24 13 13 -22 -31 -17 9 61
7589 61 57 21 -19 -57 -51 13 70 75 30 -46 -69 -48 -8 52 52 14 -33 -52 -42 0 29 33 7 -20 -29 -16 -12 -13 -9 -4 3 16 9 -16 -39 -34 -3
7626 -3 44 52 21 -16 -49 -51 4 60 60 30 -28 -58 -55 0 54 55 25 -31 -58 -32 -6 34 34 -3 -31 -38 -15 1 -5 0 -12 -8 5 9 0 -14 -25
7663 -25 -10 11 20 18 2 -39 -31 -1 40 56 30 -22 -39 -21 15 50 42 5 -24 -42 -17 13 27 19 -9 -33 -25 5 27 18 -13 -31 -30 -11
7697 -11 12 15 -1 -16 -35 -10 25 27 21 -20 -21 -9 13 17 13 -8 -16 -15 2 33 17 -2 -17 -8 13 28 36 -10 -28 -41 -18 27 42 34 -21 -53
7733 -53 -40 -3 41 40 15 -35 -58 -46 -2 35 31 1 -32 -25 -20 10 26 26 5 6 -1 2 0 5 1 9 36 32 14 -7 -38 -23 7 45 48 14 -38
$$ packed form
7486h4J6P1N8J7m1n8l4J4L9L2J4j1l2pj1jJ6OL3Pj3k9m6j3K8N4M7ln4o3l3K1P1
7519A1O6mo2o5m3L4P0N6jl8o2k7K3M8K9Pl0j9j3P%RJ6JJ7pj8l3j3K0L7M3nl8o0
7554d4l5K3P1N3jm8p3k7K9P1L2J1n4m6k9K3M6L3%j8k3ll%MJ4J7Jj1%l5rJ4K6N2
7589F1ml6m0l8OO4N7Nm5p6k3K1M0O0%l8m7j9J0M2K9Mk6k7rJ3MjMNPJ3pk5k3NL1
7626cM7Ql1l7l3kN5N6%l0n8l0LN5N4Jl0n6k7K6K6M0%l7k8pK3J6oNj2MJ3Mrj4j1
7663b5J5K1Rkj6m1QL0M1J6k6n2j7J8L6L5ql7k9j8K5L0J4qk8k4QL0K2rl1j8JJ9
7697a1K3Lj6j5j9K5L5Kom1jJ2K2Mmk1qJJ7L1j6j9j5RK1J5Qm6j8j3K3M5J5qn5l2
7733e3J3L7M4jk5n0k3J2M4L7ml0l3PNL0J6%k1JpLkNmQK7mj8k1l1J5L0L8Ll4n2
$$ plain form
7770 -38 -59 -46 6 46 56 14 -37 -79 -46 1 50 60 13 -39 -61 -44 5 41 42 18 -2 -22 -30 -13 14 12 29 22 15 -8 -31 -35 0
7803 0 29 69 45 12 -52 -65 -39 15 75 55 15 -53 -84 -53 6 66 62 17 -36 -76 -47 0 41 43 14 -22 -33 -30 -9 7 23 15 11
7836 11 2 -12 -30 -23 -12 12 38 37 3 -39 -53 -25 17 61 63 13 -47 -74 -40 14 64 56 15 -50 -75 -43 7 30 44 8 -27 -39 -31
7869 -31 -7 6 14 12 11 5 -21 -17 -28 1 23 32 39 15 -33 -47 -27 14 57 49 16 -36 -59 -32 10 57 56 21 -26 -59 -34 1 37 34 10
7904 10 -26 -35 -20 -3 4 10 0 -13 6 -11 -10 -23 -18 9 27 41 18 -14 -46 -30 9 51 63 19 -15 -30 -29 14 47 66 30 -14 -38
7937 -38 -30 3 42 34 5 -24 -33 -30 -3 12 1 -6 -8 -2 -2 9 -7 -16 -5 0 16 10 -3 -14 -24 4 34 53 24 -18 -32 -17 11 48 46 8
7973 8 -20 -36 -9 25 33 37 9 -27 -25 -3 4 26 2 -22 -26 -21 6 22 -4 -11 -15 -22 3 20 12 -13 -24 -6 -5 12 20 5 -8 -16 5 23 29 8
8011 8 4 -14 6 8 30 14 -7 -28 -7 20 34 28 0 -32 -23 -1 29 30 -1 -22 -45 -36 -4 23 19 -5 -26 -33 -27 0 24 11 1 -20 -22 -3
$$ packed form
7770c8k1J3N2M0J0m2n1m2L3M7M9J0m7n2k2J7M9L6Jk4k0k0qJ7K7kJ7ppk3k3mL5
7803@K9M0k4l3o4j3K6N4O0k0m0o8l1L1N9O0mm5n3m0K9M7M1Kk9l6j1LK1J6J6qm
7836A1rj4j8PJ1K4K6jl4m2j4K8M2M4Kn0o0k7L4N4N0qm1o5k5L2N0K3J4l6l5j2Q
7869c1K4J3Qkjok6Mj1K9K2RPk4m8j4K0M1M3ql3n2k3K7M2M7jl5m7l3K5L5L6lk4
7904A0l6rJ5J7POj0j3J9j7Jj3NK7J8J4k3l2l2J6L9M2J2m4l4j5JM3L3J9l6m4k4
7937c8QL3L9qk9k9rLK7J5j1pkO%J1j6rJ1NJ6oj3j1j0K8L0J9k9m2j4J5K8L7kl8
7973Hk8j6K7L4QMk8l6KK2PK2k4k4mNK7J6k6pmpK5J7qk5j1J8JJ7Qj5j3qK1J8Ok1
8011Hmj8K0KK2j6k1k1K1K7J4ok8l2RK2L0Jl1k1k3RL2K7mk4k1pOK7K4j3j0k1kJ9
$$ plain form
8047 -3 4 2 5 -9 1 7 12 -14 -19 -16 17 34 35 6 -14 -44 -31 6 44 57 14 -29 -56 -36 2 55 37 5 -45 -65 -44 1 36 32 14
8082 14 -35 -29 -34 -3 13 16 19 3 -7 -6 -8 -9 2 24 35 33 5 -35 -37 -24 13 58 47 10 -47 -58 -35 18 53 46 -1 -44 -62 -29 9
8117 9 35 39 15 -21 -39 -28 -8 20 21 9 4 -18 -23 -18 0 -10 12 20 35 4 -23 -29 -7 22 57 43 19 -33 -47 -32 15 40 49 14 -27
8152 -27 -55 -36 -1 43 46 6 -27 -50 -32 -16 13 23 4 -5 -16 -12 -14 -6 -17 4 25 19 2 -14 -38 -18 7 41 47 10 -18 -43 -35 13
8186 13 49 46 11 -16 -51
$$ packed form
8047cPkLj4J0ONk6nLL3J7Jk9k0l0J3L7L8J3m3m3k7K0L8N3j8l2n0k0K1M5L5mj8
8082A4m9OnL1J6LLj6j0JkjJ1K2J1kk8m0kJ3L7M5j1l7n7j1K3N3L5pm7m3j8L3L8
8117IK6Mk4l6j8J1K0K8Jj2nk2nNJ8j0K2QJ5l1k7oK2K9L5j4k4n2j4J5M7K5Rl5m1
8152b7k8J9L5M4Lm0l3k3J8J6K9J0j9rj1MkQj1K1K1oj7j6k4K0K5L4Ol7k8k5QM8
8186A3L6ll5k7l5
8191e1
$$ Imaginary data points
##PAGE= N=2
##DATA TABLE= (X++(I..I)), XYDATA
$$ plain form
0 0 0 0 0 0 0 0 0 0 0 0 0 0 0 0 0 0 0 0 0 0 0 -1 4 -8 8 -8 8 -8 8 -12 16 -16 20 -20 24 -28 30 -36 37 -44 49 -52 60
43 60 -66 74 -82 89 -98 110 -118 134 -145 161 -178 195 -214 239 -265 294 -331 369 -420 479 -554
64 -554 649 -779 953 -1194 1447 -273 109022 182459 111008 -28434 -144737 -150455 -47909
77 -47909 95159 172605 136553 16608 -102157 -155695 -123932 -37458 52555 97138 83843 32447
89 32447 -21682 -52684 -43922 1609 57875 82629 50545 -28048 -108599 -137591 -83689 30435
101 30435 133187 151798 71761 -51911 -134606 -120845 -20746 93260 136640 77924 -34782
112 -34782 -115383 -108439 -26142 68244 107196 64738 -25154 -95212 -97934 -38651 37981 86674
124 86674 87373 48713 -2999 -41757 -55746 -47551 -24791 3784 25254 25795 3350 -25891 -36752
$$ packed form
0@%%%%%%%%%%%%%%%%%%%%%jNj2J6j6J6j6J6k0K8l2L6m0M4n2N8o6P3q1R3j01J12
43F0j26J40j56J71j87K08k28K52k79L06l39L73m09M53n04N59o25P00p89Q99j033
64e54J203j428J732k147K641j720J09295P3437p1451j39442j16303n718J02546
77d7909J43068P7446l6052j19945j18765n3538L1763Q6474R0013M4583j3295n1396
89C2447n4129l1002Q762M5531N6266K4754l2084p8593q0551k8992N3902J14124
101C0435J02752J8611q0037j23672q2695J3761J00099J14006M3380n8716j12706
112c4782q0601O944Q2297R4386L8952m2458q9892p0058k722N9283P6632M8693
124H6674O99l8660n1712l8758j3989Q195K2760K8575K1470N41k2445k9241j0861
$$ plain form
137 -36752 -13392 35791 78309 77350 22752 -54577 -102324 -86374 -17148 57636 86793 52182
149 52182 -16901 -66302 -59877 -7423 46829 61757 29693 -21122 -50756 -38276 2961 38907
161 38907 43900 19102 -13694 -33176 -33256 -22492 -11511 -2707 8807 25158 38450 36306 14746
174 14746 -14515 -31408 -24370 -1920 13546 5639 -20382 -40575 -32410 4799 47042 63299 40518
187 40518 -4725 -39762 -42188 -16423 12691 21683 6812 -14560 -20680 -5493 16094 23348 9429
200 9429 -12931 -24114 -14616 6968 21808 17588 294 -11560 -5507 12158 22149 10367 -18306
213 -18306 -43016 -43089 -15640 20780 41112 34232 10933 -7412 -8011 4022 12169 4384 -15430 -30761
227 -30761 -28000 -9313 10262 17405 11546 3710 4701 14032 19373 8612 -15646 -35252 -31639 -4087
$$ packed form
137c6752K3360M9183M2518r59n4598p7329m7747J5950O9226P4784K9157l4611
149E2182o9083m9401O425N2454N4252J4928l2064n0815k9634J2480M1237L5946
161C8907M993k4798l2796j9482q0J0764J0981Q804J1514J6351J3292k144k1560
174A4746k9261j6893P038K2450J5466p907k6021k0193Q165L7209M2243J6257k2781
187D0518m5243l5037k426K5765K9114Q992j4871k1372o120J5187K1587P254j3919
200I429k2360j1183R498K1584J4840m220j7294j1854O053J7665R991j1782k8673
213a8306k4710p3K7449L6420K0332o880k3299j8345n99J2033Q147p785j9814j5331
227c0761K761J8687J9575P143n859p836R91R331N341j0761k4258j9606L613K7552
$$ plain form
241 -4087 27831 39631 21329 -13660 -38366 -33037 -2186 28415 33522 9797 -21802 -34651 -17610
254 -17610 16660 42531 40695 12559 -21909 -40763 -36273 -17439 1148 11712 15542 16631 15856
267 15856 10865 1008 -8875 -10587 -969 11784 13025 -4486 -30656 -43440 -26458 14975 54171
280 54171 61252 27244 -26061 -61109 -52781 -7766 40623 57290 31131 -16459 -48914 -42916 -5880
293 -5880 32540 44770 23887 -13772 -41868 -42053 -16073 17899 40598 43109 27268 577 -26518
306 -26518 -42426 -38905 -16579 14016 36099 34597 7828 -26472 -40971 -20274 23932 59374
318 59374 56103 9934 -51142 -84236 -62876 602 62829 81408 45267 -18285 -64054 -61166
330 -61166 -15093 37862 59555 37693 -8452 -45690 -50022 -20959 20181 46362 42951 14882
$$ packed form
241d087L1918J1800j8302l4989k4706N329L0851L0601N107k3725l1599j2849J7041
254a7610L4270K5871j836k8136l4468j8854M490J8834J8587J0564L830J089p75
267A5856m991r857r883j712R618J2753J241j7511k6170j2784J6982M1433L9196
280E4171P081l4008n3305l5048Q328M5015M8389J6667k6159m7590l2455N998L7036
293e880L8420J2230k0883l7659k8096j85K5980L3972K2699K511j5841k6691k7095
306b6518j5908L521K2326L0595K2083j502k6769l4300j4499K0697M4206L5442
318E9374l271m6169o1076l3094K1360O3478O2227J8579l6141o3552m5769K888
330f1166M6073N2955K1693k1862m6145l7238m332K9063M1140K6181l411k8069
$$ plain form
342 14882 -20616 -45591 -47951 -25430 12138 45734 56503 36807 -4219 -43512 -55684 -30409
354 -30409 16336 50720 45568 2121 -49044 -68846 -38213 25567 78761 82157 31182 -39852
366 -39852 -82949 -70511 -14170 45018 66964 40504 -10709 -48513 -48240 -14078 27305 47677
378 47677 35896 2752 -29607 -42868 -31545 -3453 26324 42780 37097 10760 -24098 -48782
390 -48782 -47077 -16939 24851 51745 45002 8228 -33310 -49075 -25763 20226 53656 46949 2261
403 2261 -49615 -71463 -46113 10257 59168 67914 33675 -16266 -47430 -42413 -10197 23118 33854
416 33854 17335 -10418 -28141 -25721 -8045 12621 25408 24659 12037 -5432 -20281 -26877 -20956
429 -20956 -2017 21829 35372 27387 1334 -26596 -38042 -24267 6103 30688 29681 3818
$$ packed form
342A4882l5498k4975k360K2521L7568L3596J0769j9696m1026l9293j2172K5275
354c0409M6745L4384n152m3447n1165j9802L0633O3780N3194L396n0975p1034
366c9852m3097J2438N6341N9188K1946k6460n1213l7804K73L4162M1383K0372
378D7677j1781l3144l2359j3261J1323K8092K9777J6456n683k6337l4858k4684
390d8782J705L0138M1790K6894o743l6774m1538j5765K3312M5989L3430o707m4688
403B261n1876k1848K5350N6370M8911Q746l4239m9941l1164N017L2216L3315J0736
416C3854j6519k7753j7723K420J7676K0666J2787p49j2622j7469j4849o596N921
429b0956J8939K3846J3543p985k6053k7930j1446J3775L0370K4585j007k5863
$$ plain form
441 3818 -25205 -33412 -13487 20527 43877 37811 4751 -31948 -46357 -31088 -858 22489 26071
454 26071 12144 -5214 -11346 -3132 8955 12727 6057 -3981 -10410 -10939 -7239 -3161 -1168 835
468 835 6398 13517 14025 3682 -11381 -20060 -15448 222 16850 21875 10350 -8162 -17522 -10540
482 -10540 4577 13624 8510 -7354 -21437 -20548 -2808 18638 27210 17970 709 -11064 -10915 -2369
496 -2369 4279 672 -10992 -18777 -12896 3509 18228 21259 11800 -2226 -10257 -7099 2040 6260
510 6260 713 -8753 -12554 -6854 4025 11988 10816 1557 -7447 -8308 -1805 3903 3066 -2132 -4768
525 -4768 -312 9274 15917 11211 -4511 -20140 -22859 -10321 7137 15979 10242 -3953 -13048 -7012
539 -7012 10927 25829 23626 3882 -20080 -32011 -24552 -4165 14310 19045 9962 -2549 -7826
$$ packed form
441C818k9023q207J9925L4014K3350o066l3060l6699j4409J5269L0230K3347L582
454B6071j3927j7358o132Q214J2087L772o670j0038o429n29L700M078J993K003
468H35N563P119N08j0343j5063q679M612J5670J6628N025j1525j8512r360O982
482a0540J5117R047n114j5864j4083Q89J7740K1446Q572r240j7261j1773J49Q546
496b369O648l607j1664p785N881J6405J4719L031r459j4026q031L158R139M220
510F260n547r466l801N700J0879P963j172r259r004q61O503N708q37n198k636
525d768M456R586O643m706j5722j5629k719J2538J7458Q842n737j4195r095O036
539g012J7939J4902k203j9744k3962j1931P459K0387J8475M735r083j2511n277
$$ plain form
552 -7826 -3525 4652 9168 6783 227 -5181 -6568 -5442 -4508 -3678 -316 6256 12023 10726 -14
567 -14 -14931 -22942 -15372 5456 25875 30443 14602 -10602 -26822 -22232 -1190 18993 21448 3370
581 3370 -21198 -32424 -20176 7801 32432 37384 20584 -5444 -23871 -25282 -12635 2813 11041
594 11041 9230 1460 -6095 -9439 -7352 -573 8618 16170 16849 7639 -8710 -23194 -24857 -9516
608 -9516 14924 31920 27703 2777 -26761 -39920 -26184 5616 33166 36770 14362 -16569 -32497
621 -32497 -21564 7345 32037 33553 10032 -22257 -41406 -35325 -9492 18789 33163 27958 9730
634 9730 -8942 -17991 -14519 -2867 9394 15353 11018 -2545 -18448 -26423 -18889 2436 25917
647 25917 35964 23437 -5932 -33281 -38789 -16820 18307 42136 37249 6353 -29182 -44283
$$ packed form
552g826M301Q177M516k385o556n408j387J126R34Q30L362O572N767j297j0740
567a4j4917q011P570K0828K0419M568j5841k5204j6220M590K1042K0183K455j8078
581C370k4568j1226J2248K7977K4631M952j6800k6028j8427j411J2647J5448Q228
594A1041j811p770p555l344K087O779R191P552O79r210j6349j4484j663J5341
608i516K4440J6996m217k4926k9538j3159J3736L1800K7550L604k2408l0931j5928
621c2497J0933K8909K4692J516k3521l2289j9149O081K5833K8281J4374n205j8228
634I730j8672r049L472J1652J2261N959m335j3563j5903p975P534K1325K3481
647B5917J0047j2527k9369k7349n508K1969L5127K3829m887l0896l5535j5101
$$ plain form
659 -44283 -28406 5987 33297 34120 9233 -21987 -36601 -23931 6901 34405 40275 22017 -7232
672 -7232 -29739 -34319 -21222 -221 16308 20623 12778 -987 -12764 -15638 -6601 10269 24368
685 24368 24570 7933 -17124 -35174 -32718 -8576 22681 39330 28699 -2180 -31667 -38963 -18655
698 -18655 15128 38300 34208 6762 -22972 -33756 -19505 7720 27767 26341 4976 -20441
710 -20441 -32306 -23980 -2697 18143 27904 23270 8904 -6317 -15142 -15316 -8548 1441 9457 9867
724 9867 1029 -11623 -18645 -13223 3571 22398 30069 18772 -5861 -27230 -30121 -12569 12726
737 12726 28024 22495 388 -21615 -27181 -12997 8879 22149 18314 1972 -13844 -17480 -7016
750 -7016 8533 17672 15084 4276 -7361 -14142 -14330 -9735 -3454 2693 8097 11324 9945 3653 -3672
$$ packed form
659d4283J5877L4393K7310Q23k4887l1220j4614J2670L0832K7504N870j8258k9249
672g232k2507m580J3097K1001J6529M315p845j3765j1777k874R037J6870J4099
685B4368K02j6637k5057j8050K456K4142L1257J6649j0631l0879k9487p296K0308
698a8655L3783K3172m092k7446k9734j0784J4251K7225K0047j426k1365k5417
710b0441j1865Q326K1283K0840R761m634j4366j5221q825j74O768R989Q016M10
724I867q838j2652p022N422J6794J8827P671j1297k4633k1369k891J7552K5295
737A2726J5298n529k2107k2003n566J4184K1876J3270l835j6342j5816l636J0464
750g016J5549R139k588j0808j1637o781j88M595O281O147N404L227j379o292p325
$$ plain form
765 -3672 -6582 -2812 4539 8798 4681 -6782 -17588 -18268 -6305 10798 21139 17457 2874 -11712
779 -11712 -15880 -7468 5784 13079 9184 -1593 -9936 -9451 -1684 5928 6966 1249 -5680 -7882 -4053
794 -4053 2088 5459 4500 2092 2036 4642 6159 2864 -4902 -12207 -13449 -7023 2712 8751 7266 1178
810 1178 -2916 -824 5492 9913 7384 -1583 -10745 -13115 -7170 1707 6538 4774 -407 -3521 -1343
825 -1343 4013 6820 3343 -3911 -8170 -5175 2762 9232 8824 1394 -7471 -10621 -5557 2666 6391
840 6391 2805 -4094 -7722 -4290 4435 12188 12699 5418 -3824 -8693 -7805 -4412 -2179 -2131 -2714 -1169
856 -1169 3308 7611 7483 2475 -2863 -3810 -80 4274 4454 -1252 -9389 -12629 -6304 5936 14657 12880
872 12880 1821 -10580 -15463 -8886 4434 14282 13222 3136 -7225 -10523 -5648 2654 7743 5632
$$ packed form
765c672k910L770P351M259m117j1463j0806o80J1963J7103J0341l682j4583j4586
779a1712m168Q412J3252P295l895j0777q343M85P767P612J038n717o929k202L829
794d053O141L371r59k408n6K606J517l295p766p305j242O426R735O039j485o088
810A178m094K092O316M421k529q967r162k370N945Q877M831j764n181l114K178
825a343N356K807l477p254m259K995P937O470m08p430q865l150N064Q223L725
840F391l586o899l628L432Q725P753N11p281r242m869Q88L393K233M8n83J545
856a169M477M303j28n008n338r47L730M354J80n706q137l240O325J2240Q721j777
872A2880j1059j2401m883O577J3320R848j060j0086j0361l298M875Q302N089k111
$$ plain form
886 5632 -1806 -8360 -9287 -5082 754 5658 8776 9533 7456 2671 -4051 -10458 -12562 -7434 2535 10115
902 10115 9224 487 -9229 -11834 -3822 10101 19285 15088 -785 -17194 -22321 -12500 5370 18970
916 18970 18867 5536 -10734 -18208 -12564 622 11643 13719 6649 -3630 -9758 -8203 -1279 5866
930 5866 9415 7939 2025 -6059 -12643 -13904 -8141 2912 14137 18691 12378 -1776 -14486 -16643
944 -16643 -6520 8428 16899 11558 -4590 -19761 -21643 -7514 13068 25679 21396 3363 -15854
957 -15854 -23366 -14753 2693 16280 17308 6702 -6951 -14463 -11807 -2127 7494 11241 7788 142
971 142 -7143 -10344 -7709 -139 8883 14456 12461 2568 -10526 -19039 -16584 -3742 11469 18775 12827
986 12827 -2022 -14743 -15389 -2920 13385 20767 12719 -5571 -21227 -23110 -9961 8822 20482
$$ packed form
886E632p438o554r27M205N836M904L118P57k077m785o722o407k104N128R969P580
902A0115q91q737r716k605Q012J3923R184m197j5873j6409n127R821J7870J3600
916A8970j03j3331j6270p474N644J3186J1021K076p070j0279o128J555O924P145
930E866L549j476n914q084o584j261N763J1053J1225M554o313j4154j2710k157
944a6643J0123J4948Q471n341j6148j5171j882J4129K0582J2611m283j8033j9217
957a5854p512Q613J7446J3587J028j0606j3653p512K656R680R621L747l453p646
971A42p285l201K635P570R022N573j995r893j3094q513K455J2842J5211P306n948
986A2827j4849j2721o46J2469J6305P382q048j8290j5656j883J3149J8783J1660
$$ plain form
999 20482 17874 4322 -9690 -14904 -9257 1599 9598 10047 3994 -3601 -7977 -7317 -2909 2592 6640
1014 6640 7445 4258 -2067 -8640 -11308 -7137 2665 12541 15648 8954 -3700 -13947 -14602 -5190 7120
1029 7120 12877 7533 -4537 -13610 -12091 -579 12647 17975 11362 -2250 -13304 -14792 -7217 2774
1043 2774 8277 6804 1186 -3450 -3886 -1091 1837 2832 2181 1112 135 -1060 -2668 -3941 -3227 519
1059 519 5589 7857 4441 -3175 -9750 -10322 -3916 5438 11223 9064 872 -6544 -7424 -1888 4836 6981
1075 6981 2597 -5167 -10169 -8126 -556 6655 8746 5673 980 -1928 -1809 -312 -153 -2254 -4289
1090 -4289 -3491 160 3551 3789 1014 -2213 -2855 126 4250 5236 1298 -4653 -7404 -4461 2062 7348
1106 7348 7395 1911 -5015 -7966 -5031 564 4018 3409 456 -1701 -852 2372 4712 3435 -791 -4285
$$ packed form
999B0482k608j3552j4012n214N647J0856P999M49o053p595m376O60M408N501M048
1014F640Q05l187o325o573k668M171R802R876L107o694j2654j0247o55R412J2310
1029G120N757n344j2070r073J519J1512J3226N328o613j3612j1054j488P575R991
1043B774N503j473n618m636m36K795K928R95o51j069r77j195j608j273P14L746
1059E19N070K268l416p616o575n72O406R354N785k159q192p416q80N536O724K145
1075F981m384p764n002K043P570P211K091l073m693k908J19J497J59k101k035
1090d289P98L651L391K38k775l227o42K981M124R86l938n951k751K943O523N286
1106G348M7n484o926k951K935N595L454o09k953k157Q49L224K340j277m226l494
$$ plain form
1122 -4285 -4417 -2134 -28 -57 -1787 -2901 -823 4200 8409 7568 1541 -5370 -8288 -5521 538 5077
1138 5077 4422 -704 -5430 -5212 -264 5199 6799 3581 -1979 -5607 -4662 -343 3386 3729 1531 -525
1154 -525 -853 -128 -57 -1653 -3978 -4467 -1464 3523 6470 4992 340 -3515 -3375 627 4838 4856 -542
1171 -542 -7655 -10666 -6695 1738 8953 10268 5267 -1912 -5890 -4388 268 3657 3129 -295 -3584
1186 -3584 -4181 -2159 632 2073 1893 1361 1370 1314 -7 -2564 -4325 -3082 1527 6671 8132 3791 -4094
1203 -4094 -10073 -9509 -2563 5630 8930 4913 -2863 -7876 -5806 2023 9700 11199 4943 -4777 -11384
1218 -11384 -10959 -4639 2809 6856 6000 2135 -1475 -2663 -1569 370 2072 3022 2740 779 -2523 -5586
1234 -5586 -6323 -3198 2958 8341 8548 2325 -6487 -11577 -8703 818 10729 13864 7513 -3832 -11867
$$ packed form
1122d285j32K283K106k9j730j114K078N023M209q41o027o911k918K767O059M539
1138E077o55n126m726K18M948N463J600l218n560l628R45M319L729L43k198k056
1154e25l28P25P1j596k325m89L003M987K947j478m652l855J40M002M211J8n398
1171e42p113l011L971Q433P215J315n001p179l978J502M656L389n28l424l289
1186c584n97K022K791J441j80n32Rn6j321k557j761J243M609N144J461m341p885
1203d094n979N64O946Q193L300m017p776n013K070P829P677J499o256r720o607
1218a1384M25O320P448M047q56l865l610j188J094J939J702R50k82j961l302l063
1234e586p37L125O156N383K07o223q812n090K874R521R911L135o351j1345q035
$$ plain form
1249 -11867 -10918 -2379 6901 10038 4758 -4839 -11389 -9718 -1101 8301 12535 9694 2303 -5011 -8443
1264 -8443 -7023 -2787 1348 3601 3505 1306 -2073 -4480 -3932 -14 5343 8697 7065 243 -7929 -11595
1280 -11595 -7359 2276 10664 11713 4223 -6857 -13657 -10909 -572 9702 12658 6833 -2884 -9293
1294 -9293 -7879 -133 7659 9492 4174 -4059 -9693 -9684 -4763 1760 6314 7175 5104 1948 -1072 -3167
1310 -3167 -3480 -1639 1395 3364 2428 -1426 -5801 -7296 -3713 3443 9343 9326 2943 -5422 -9898 -7134
1326 -7134 943 8417 9653 3747 -4583 -9176 -7096 -596 5156 6016 1828 -3558 -5578 -2815 2277
1341 2277 5806 5756 2884 -612 -2846 -3390 -3211 -3126 -2686 -979 1810 3879 3630 1301 -1270 -1814 237
1358 237 3094 3797 867 -3903 -6725 -5160 -140 4711 5853 2693 -2186 -4740 -3163 935 3939
$$ packed form
1249a1867R49Q539R280L137n280r597o550J671Q617R402M234k841p391p314l432
1264h443J420M236M135K253r6k199l379k407N48L918N357L354j632o822q172l666
1280a1595M236R635Q388J049p490j1080o800K748J0337J0274K956n825r717o409
1294i293J414P746P792J833n318q233n634RM921O523M554Q61k071l156l020k095
1310c167l13J841L034J969r36l854m375j495L583P156N900j7o383q365m476K764
1326g134Q077P474J236n906q330m593K080O500N752Q60m188n386k020K763N092
1341B277L529n0k872l496k234n44J79Q5M40J707K789K069k49k329k571n44K051
1358B37K857P03k930m770k822J565N020M851J142l160m879k554J577M098L004
$$ plain form
1373 3939 3539 593 -2125 -2259 39 2359 2222 -572 -3620 -4228 -2023 1149 2681 1688 -374 -988
1389 -988 1000 3916 4841 2259 -2514 -6120 -6056 -2589 1565 3376 2019 -547 -1595 -70 2517 3709
1405 3709 2309 -615 -2777 -2694 -968 483 342 -818 -1283 -106 1799 2452 745 -2286 -3937 -2269
1421 -2269 1931 5464 5457 1615 -3319 -5522 -3505 883 3768 2578 -1676 -5322 -5147 -861 4693 7505
1437 7505 5798 1178 -2988 -4206 -2807 -716 278 -241 -1128 -1028 139 1148 1030 291 228 1288 2435
1454 2435 2174 -174 -3408 -4909 -2902 1763 5445 5031 533 -4866 -7103 -4381 1565 6313 6334 1976
1470 1976 -2996 -4660 -2212 2199 4841 3613 -782 -5030 -6056 -3744 -87 2731 3840 3462 2354
1485 2354 1158 -39 -1482 -2664 -2363 -268 1971 2155 -178 -3309 -4623 -2484 2488 6808 6727 1640
$$ packed form
1373C939m00k946k718j34K298K320j37k794l048o08K205L172J532r93k062o14
1389i88J988K916R25k582m773l606O4L467M154J811j357k566j048J525K587J192
1405C709j400k924k162Q3J726J451j41j160m65J177J905O53j707l031j651J668
1421b269M200L533pl842m934k203K017M388K885j190m254l646J75M286N554K812
1437G505j707m620m166j218J399K091R94n19q87J00J167J009j18p39o3J060J147
1454B435k61k348l234j501K007M665L682m14m498n399k237K722N946M748K1m358
1470A976m972j664K448M411K642j228m395m248j026K312L657K818J109l78j108
1485B354j196j197j443j182L01K095K239J84k333l131j314K139M972M320q1n087
$$ plain form
1501 1640 -4835 -7824 -5199 1184 6843 7624 2807 -3954 -7563 -5736 -473 4118 5115 2398 -1764
1516 -1764 -4014 -2800 610 3547 4352 3229 763 -2208 -4474 -5114 -3850 -902 2920 5633 5178 1316
1532 1316 -3343 -5187 -2799 2277 6250 5729 213 -6654 -9519 -5731 2160 8627 9189 3523 -4388
1547 -4388 -8947 -6906 -83 6276 7838 4191 -1654 -5669 -5500 -1826 2409 4222 2953 -35 -2958
1562 -2958 -4292 -3457 -518 3252 5948 6053 2996 -2177 -6722 -7524 -3615 2560 6629 5647 255 -5631
1578 -5631 -7377 -3092 4444 9637 8209 956 -7135 -10492 -6842 1094 7717 8511 3391 -3501 -7252
1593 -7252 -5733 -650 4254 5795 3539 -492 -3485 -3844 -1928 942 3183 3729 2226 -860 -4142
1608 -4142 -5747 -4362 -65 4941 7437 5499 81 -5187 -6567 -3022 2784 6268 4528 -1366 -6970
$$ packed form
1501A640o475k989K625O383N659P81m817o761l609J827N263M591R97k717m162
1516a764k250J214L410K937Q05j123k466k971k266o40J264K948L822K713m55l862
1532A316m659j844K388N076L973n21n516o867k865L788P891O467N62n666p911
1547d388m559K041O823O359J562l647n845m015J69L674M235J813j269k988k923
1562b958j334Q35K939L770K696J05l057n173m545q02L909O175M069r82n392n886
1578e631j746M285P536N193j428p253q091l357L650P936O623P94n120o892l751
1593g252J519N083M904J541k256m031k993l59J916K870K241N46j503l086l282
1608d142j605J385M297N006K496j938n418n268j380L545N806L484j740n894n604
$$ plain form
1623 -6970 -7872 -3030 4227 8779 7438 1414 -4899 -7208 -4466 844 4660 4547 1292 -2365 -3786
1638 -3786 -2526 48 1985 2329 1329 -49 -1079 -1582 -1563 -724 1024 2930 3581 2021 -1349 -4510
1654 -4510 -5243 -2695 1690 4688 4129 630 -2935 -3609 -840 3173 4972 2885 -1812 -5537 -5512 -1997
1670 -1997 2335 4397 3232 247 -1995 -1834 73 1631 1371 -241 -1592 -1519 -251 1029 1122 86
1686 86 -939 -803 359 1215 709 -841 -1981 -1484 604 2781 3215 1362 -1422 -2948 -2233 -255 1135
1703 1135 793 -760 -1830 -1028 1324 3279 3051 753 -1753 -2572 -1391 474 1186 -20 -1992 -2603
1719 -2603 -792 2201 3907 2920 -38 -2763 -3245 -1226 1581 2760 1461 -992 -2375 -1686 272 1801
1735 1801 1683 77 -1569 -1825 -591 874 1358 899 368 433 896 896 -260 -2221 -3420 -2511 246 2807
$$ packed form
1623f970r02M842P257M552j341o024o313k309K742N310L816j13l255l657j421
1638c786J260K574J937L44j000j378j030n03J9Q39J748J906O51j560l370l161
1654d510p33K548M385K998n59l499l565o74K769M013J799k087m697l725K5L515
1670a997M332K062j165k985k242J61J907J558k60j612j351P3J268J280R3j036
1686H6j025J36J162Q56n06j550j140M97K088K177M34j853k784j526P15J978J390
1703A135l42j553j070Q02K352J955k28k298k506q19J181J865P12j206j972o11
1719b603J811K993J706r87k958k725m82K019K807J179j299k453j383O89J958J529
1735A801j18j606j646k56J234J465M84m59n31O5M63%j156j961j199R09K757K561
$$ plain form
1753 2807 3211 1293 -1332 -2417 -916 2080 3845 2481 -1311 -4618 -4939 -2124 1940 4319 3580 559
1769 559 -2253 -2715 -1012 1141 2018 1324 -90 -1053 -1019 -372 35 -54 -94 370 944 723 -608 -2202 -2582
1788 -2582 -861 2335 4730 4270 823 -3422 -5334 -3663 351 3647 3643 460 -3268 -4318 -1773 2556
1804 2556 5435 4819 1173 -3007 -4865 -3659 -693 1865 2595 1666 121 -1028 -1372 -1072 -322 751
1820 751 1841 2261 1294 -902 -3011 -3318 -1123 2430 4661 3580 -576 -5043 -6433 -3448 2150 6514
1836 6514 6533 2276 -3136 -5706 -3872 692 4377 4368 783 -3723 -5756 -4025 195 4047 5333 3782
1852 3782 614 -2238 -3387 -2702 -898 1062 2364 2304 621 -1888 -3541 -3020 -244 3289 5093 3542
1868 3542 -840 -5007 -5666 -2123 3314 6760 5607 335 -5481 -7642 -4650 1132 5510 5673 2006
$$ packed form
1753B807M04j918k625j085J501K996J765j364l792l307l21K815M064K379p39l021
1769E59k812m62J703K153Q77o94j414r63L4O47M07q9m0M64N74k21j331j594l80
1788b582J721L196K395m60l447m245j912J671M014L296ml183l728j050K545M329
1804B556K879o16l646m180j858J206K966K558P30r29j545j149l44L00P50J073
1820G51J090M20r67k196k109l07K195L553K231j081m156m467j390K985N598M364
1836F514J9m257n412k570J834M564L685rl585m506k033J731M220L852J286j551
1852C782l168k852j149O85J804J960J302o0j683k509j653N21K776L533J804j551
1868C542m382m167o59L543N437L446j153n272n816k161K992N782M378J63l667
$$ plain form
1883 2006 -2647 -4745 -2915 1307 4568 4599 1721 -2156 -4680 -4693 -2453 634 2897 3502 2612 705
1899 705 -1488 -2736 -2077 246 2663 3444 1796 -1636 -4599 -4697 -1358 3222 5585 3981 -552 -4843
1915 -4843 -5747 -2419 2915 6214 5179 797 -3628 -5111 -3122 650 3252 2805 3 -2666 -3219 -1561
1931 -1561 1024 2975 3383 2265 461 -1143 -2138 -2538 -2108 -669 1156 2143 1591 -130 -1847 -2136 -445
1948 -445 2274 3799 2604 -670 -3600 -4013 -1643 1916 3973 2963 -410 -3484 -3870 -1570 1540 3161
1964 3161 2476 335 -1422 -1375 103 1421 1346 78 -1280 -1789 -1359 -576 -123 -97 99 982 2099 2391
1982 2391 1268 -708 -2190 -2171 -684 1032 1474 223 -1581 -2169 -925 1285 2713 2286 308 -1679
1998 -1679 -2133 -788 1054 1804 1003 -502 -1364 -1031 -30 559 87 -928 -1318 -399 1229 2215 1714 171
$$ packed form
1883B006m653k098J830M222L261L1k878l877k524j3K240L087K263O05q90j907
1899G05k193j248O59K323K417P81j648l432k963r8L339M580K363j604m533m291
1915d843r04L328N334L299j035m382m425j483J989L772K602m47k802k669n53J658
1931a561K585J951M08j118j804j604r95m00M30J439J825R87n52j721j717k89J691
1948d45K719J525j195l274k930m13K370L559K057j010l373l074l86K300L110J621
1964C161o85k141j757M7J478J318p5j268j358n09M30P83M53K6J96Q83J117K92
1982B391j123j976j482J9J487J716M42j251j804n88J244K210J428m27j978j987
1998a679m54J345J842P50q01j505q62L33J001N89m72j015l90R19J628R86n01j543
$$ plain form
2016 171 -1104 -1115 41 1105 799 -881 -2603 -2793 -1035 1518 3060 2603 701 -1059 -1387 -335 878
2033 878 1007 -62 -1350 -1723 -900 405 1081 710 -132 -503 -15 746 893 128 -893 -1084 -81 1384
2051 1384 1944 873 -1249 -2825 -2542 -559 1603 2290 1127 -719 -1568 -615 1374 2669 2075 -110
2067 -110 -2281 -2931 -1876 -128 981 956 326 -3 379 978 1009 226 -704 -877 -177 669 716 -275 -1521
2086 -1521 -1813 -598 1340 2381 1533 -651 -2438 -2351 -315 2225 3292 2090 -502 -2476 -2508 -898
2102 -898 880 1438 498 -1012 -1692 -937 626 1762 1833 1174 378 -164 -568 -1029 -1545 -1695 -867 726 1994
2121 1994 1824 239 -1522 -1975 -598 1701 3059 2126 -688 -3235 -3490 -1224 1874 3559 2586 -359
2137 -359 -3081 -3530 -1504 1355 2986 2587 803 -1028 -1692 -996 221 897 691 38 -639 -1164 -1415 -1131
$$ packed form
2016A71j275j1J156J064l06j680j722j90J758K553J542m57j902j760l28J052J213
2033H78J29j069j288l73Q23J305O76l71q42l71M88P61J47p65j021j91J003J465
2051A384N60j071k122j576K83J983K162O87j163j846q49R53J989J295n94k185
2067a10k171o50J055J748J109k5o30l29L82N99L1p83r30j73P00Q46M7r91j246
2086a521k92J215J938J041q48k184j787Q7K036K540J067j202k592j974l2J610
2102h98J778N58r40j510o80P55J563J136P1o59p96n42m04m61n16j50Q28J593J268
2121A994j70j585j761m53J377K299J358r33k814k547k55K266L098J685r73k945
2137c59k722m49K026K859J631l99j784j831o64O96J217O76k06o53o77n25k51K84
$$ plain form
2155 -1131 -185 1217 2513 2841 1598 -868 -2989 -3164 -1173 1579 3034 2052 -803 -3341 -3411 -717
2171 -717 2808 4394 2992 -458 -3536 -4015 -1681 1735 3644 2845 240 -2227 -3044 -2004 5 1582
2187 1582 1837 1029 -14 -714 -872 -546 251 1168 1630 1162 -298 -2117 -3193 -2494 -52 2676 3781
2204 3781 2448 -431 -2789 -2906 -669 2192 3329 1743 -1417 -3758 -3503 -837 2351 3745 2519
2219 2519 -273 -2479 -2671 -1056 995 2043 1638 382 -725 -1078 -835 -427 -94 174 450 529 174 -556
2237 -556 -1082 -755 527 2002 2478 1334 -934 -2838 -2943 -1196 1189 2394 1641 -299 -1776 -1595 161
2254 161 1997 2395 1009 -1104 -2305 -1850 -336 1026 1314 538 -425 -663 -133 431 340 -249 -655 -361
2272 -361 484 1168 991 -83 -1160 -1278 -318 826 1080 214 -1078 -1677 -924 758 2086 2023 712 -769
$$ packed form
2155a131R46J402J296L28j243k466k121j75J991K752J455r82k855k538p0K694
2171g17L525J586j402l450l078m79K334L416J909p99k605k467q17J040K009J577
2187A582K55q08j043p00j58L26P97R17M62m68j460j819j076O99K442K728J105
2204C781j333k879k358j17K237K861J137j586l160k341K55K666L188J394j226
2219B519k792k206j92J615K051J048m05j256j107l53K43M08L33K68K76P9l55p30
2237e56n26L27J282J475M76j144k268j904j05J747K385J205p53j940j477J81J756
2254A61J836L98j386k113j201M55J514J362K88p76r63k38N30N64r1n89m06K94
2272c61Q45O84j77j074j077j18R60J144K54q66j292n99P53J682J328o3j311j481
$$ plain form
2290 -769 -1390 -1009 -167 317 64 -552 -696 -42 804 1030 495 -246 -541 -100 641 849 34 -1291 -1854 -984
2310 -984 794 2084 1889 270 -1683 -2398 -1232 903 2273 1885 224 -1404 -1776 -715 855 1617
2326 1617 965 -481 -1512 -1456 -625 372 1000 1094 868 628 362 -188 -971 -1416 -980 120 1071 1103 121 -1163
2346 -1163 -1613 -582 1369 2618 2057 -83 -2279 -2951 -1589 876 2617 2326 338 -1744 -2371 -1254
2362 -1254 611 1831 1634 326 -950 -1223 -505 440 908 760 328 -140 -522 -832 -1080 -1041 -337 918
2380 918 1965 1919 637 -1062 -1942 -1339 330 1729 1591 -93 -2056 -2623 -1254 1122 2805 2618 709
2397 709 -1495 -2387 -1530 252 1530 1507 444 -748 -1190 -798 -35 433 440 294 221 168 -87 -501 -680 -267
2417 -267 721 1615 1537 186 -1715 -2769 -2055 59 2120 2630 1294 -894 -2149 -1533 482 2181 2204
$$ packed form
2290g69o21L81Q42M84k53o16j44O54Q46K26n35p41k95M41P41K08q15j325n63Q70
2310i84J778J290j95j619j953p15J166K135J370l88j661j628l72J061J570P62
2326A617o52j446j031N6Q31R97O28R4k26k40k66n50p83m45M36J100R51L2r82j284
2346a163m50J031J951J249n61k140k196o72J362K465J741k91j988k082o27J117
2362a254J865J220j97j308j276k73P18R45M68j48m32m68l82l10k48L9P04J255
2380I18J047m6j282j699q80O03J669J399j38j684j963n67J369K376J683j87j909
2397G09k204q92Q57J782J278k3j063j192m42L92P63M68Pj46p3n3k55m14j79M13
2417b67R88Q94p8j351j901j054P14K114K061N10j336k188j255O16K015J699K3
$$ plain form
2434 2204 507 -1683 -2774 -2070 -142 1578 2051 1236 -57 -906 -961 -447 127 482 586 556 282 -263
2452 -263 -908 -1163 -645 498 1509 1537 283 -1478 -2337 -1457 774 2782 3035 1214 -1507 -3177 -2643
2469 -2643 -389 1863 2417 1038 -1115 -2300 -1616 388 2192 2527 1300 -554 -1845 -1943 -1070 57
2485 57 813 950 703 225 -372 -833 -806 -148 862 1506 1254 19 -1470 -2107 -1169 786 2285 2098 263
2504 263 -1992 -2997 -1909 620 2755 2947 1184 -1133 -2294 -1645 188 1696 1656 170 -1540 -2166
$$ packed form
2434B204j697k190j091P04J928J720M73q15j293q49n5N14N74L55J04l0k74n45
2452b63o45k55N18J143J011K8j254j761q59Q80K231K008K53j821k721j670N34
2469b643K254K252N54j379k153j185O84K004J804L35j227j854j291r8Q73J127
2485E7P56J37k47m78n97m61K7O58J010O44k52j235j489o37R38J955J499j87j835
2504B63k255j005J088K529K135J92j763k317j161O49J833J508m0j486j710o26
$$ [...]
8191A
##END NTUPLES=NMR FID
##END=
