##TITLE=1H_DMAA0912
 CDCl3
 8 sc, 
 10.12.2021
##JCAMPDX= 6.0         $$ Bruker NMR JCAMP-DX V2.0
##DATA TYPE= NMR FID
##DATA CLASS= NTUPLES
##ORIGIN= UXNMR, Bruker Analytische Messtechnik GmbH
##OWNER= root
$$ XWIN-NMR		Version 3.5
$$ Fri Dec 10 11:08:55 2021 Russian Standard Time (UT+4h)  she@DPX200
##.OBSERVE FREQUENCY= 200.131346
##.OBSERVE NUCLEUS= ^1H
##.DELAY= (6, 6)
##.ACQUISITION MODE= SIMULTANEOUS
##.ACQUISITION SCHEME= undefined
##.AVERAGES= 8
##.DIGITISER RES= 18
##SPECTROMETER/DATA SYSTEM= spect
##.PULSE SEQUENCE= zg30
##.SOLVENT NAME= CDCl3
##.SHIFT REFERENCE= (INTERNAL, CDCl3, 0, 15.7039)
##AUDIT TRAIL= $$ (NUMBER, WHEN, WHO, WHERE, WHAT)
$$ ##TITLE= Audit trail, XWIN-NMR		Version 3.5
$$ ##JCAMPDX= 5.01
$$ ##ORIGIN= Bruker BioSpin GmbH
$$ ##OWNER= she
$$ F:/spectra/data/she/nmr/H-F/1/audita.txt
$$ ##AUDIT TRAIL=  $$ (NUMBER, WHEN, WHO, WHERE, WHAT)
(   1,<2021-12-10 11:07:19.96 +0400>,<she>,<DPX200>,
      <created by zg, POWCHK disabled, PULCHK disabled
       configuration hash MD5:
       00 E9 B6 7A A2 85 ED C7 34 08 36 98 17 FE 4E 26
       data hash MD5: 16K
       79 64 E0 05 C4 F9 48 19 3F 11 49 FF 8B 75 86 63>)
$$ ##END=
$$ 
$$ hash MD5
$$ 23 B0 9B CB 3B 3C B0 16 42 3E 06 46 E0 62 ED D3
##$RELAX= 
##$RELAX= 
##$RELAX= 
##$RELAX= 
##$RELAX= 
##$RELAX= 
$$ Bruker specific parameters
$$ --------------------------
##$DU= <F:/spectra>
##$EXPNO= 1
##$NAME= <H-F>
##$PROCNO= 1
##$TYPE= <nmr>
##$USER= <she>
##$AMP= (0..31)
100 100 100 100 100 100 100 100 100 100 100 100 100 100 100 100 100 100 
100 100 100 100 100 100 100 100 100 100 100 100 100 100 
##$AQSEQ= 0
##$AQ_mod= 1
##$AUNM= <au_zg>
##$AUTOPOS= <>
##$BF1= 200.13
##$BF2= 200.13
##$BF3= 200.13
##$BF4= 200.13
##$BF5= 200.13
##$BF6= 200.13
##$BF7= 200.13
##$BF8= 200.13
##$BYTORDA= 1
##$CFDGTYP= 0
##$CFRGTYP= 5
##$CHEMSTR= <none>
##$CNST= (0..31)
1 1 145 1 1 1 1 1 1 1 1 1 1 1 1 1 1 1 1 1 1 1 1 1 1 1 1 1 1 1 1 1 
##$CPDPRG= <>
##$CPDPRG1= <>
##$CPDPRG2= <>
##$CPDPRG3= <>
##$CPDPRG4= <mlev>
##$CPDPRG5= <mlev>
##$CPDPRG6= <mlev>
##$CPDPRG7= <mlev>
##$CPDPRG8= <mlev>
##$CPDPRGB= <>
##$CPDPRGT= <>
##$D= (0..31)
0 1.2 0 0 0 0 0 0 0 0.06 0 0.03 0 0 0 0 0.0002 0 0 0 0 0 0 0 0 0 0 0 0 
0 0 0 
##$DATE= 1639120039
##$DBL= (0..7)
120 120 120 120 120 120 120 120 
##$DBP= (0..7)
150 150 150 150 150 150 150 150 
##$DBP07= 0
##$DBPNAM0= <>
##$DBPNAM1= <>
##$DBPNAM2= <>
##$DBPNAM3= <>
##$DBPNAM4= <>
##$DBPNAM5= <>
##$DBPNAM6= <>
##$DBPNAM7= <>
##$DBPOAL= (0..7)
0.5 0.5 0.5 0.5 0.5 0.5 0.5 0.5 
##$DBPOFFS= (0..7)
0 0 0 0 0 0 0 0 
##$DE= 6
##$DECBNUC= <off>
##$DECIM= 32
##$DECNUC= <off>
##$DECSTAT= 4
##$DIGMOD= 1
##$DIGTYP= 9
##$DL= (0..7)
0 120 120 120 120 120 120 120 
##$DP= (0..7)
150 150 150 150 150 150 150 150 
##$DP07= 0
##$DPNAME0= <>
##$DPNAME1= <>
##$DPNAME2= <>
##$DPNAME3= <>
##$DPNAME4= <>
##$DPNAME5= <>
##$DPNAME6= <>
##$DPNAME7= <>
##$DPOAL= (0..7)
0.5 0.5 0.5 0.5 0.5 0.5 0.5 0.5 
##$DPOFFS= (0..7)
0 0 0 0 0 0 0 0 
##$DQDMODE= 0
##$DR= 18
##$DS= 0
##$DSLIST= <SSSSSSSSSSSSSSS>
$$ [...]
##$SUBNAM2= <"">
##$SUBNAM3= <"">
##$SUBNAM4= <"">
##$SUBNAM5= <"">
##$SUBNAM6= <"">
##$SUBNAM7= <"">
##$SUBNAM8= <"">
##$SUBNAM9= <"">
##$SW= 18.0517287032376
##$SWIBOX= (0..15)
0 0 2 0 0 0 0 0 0 0 0 0 0 0 0 0 
##$SW_h= 3612.71676300578
##$TD= 16384
##$TD0= 1
##$TE= 0
##$TE2= 300
##$TE3= 300
##$TEG= 300
##$TL= (0..7)
0 120 120 120 120 120 120 120 
##$TP= (0..7)
150 150 150 150 150 150 150 150 
##$TP07= 0
##$TPNAME0= <>
##$TPNAME1= <>
##$TPNAME2= <>
##$TPNAME3= <>
##$TPNAME4= <>
##$TPNAME5= <>
##$TPNAME6= <>
##$TPNAME7= <>
##$TPOAL= (0..7)
0.5 0.5 0.5 0.5 0.5 0.5 0.5 0.5 
##$TPOFFS= (0..7)
0 0 0 0 0 0 0 0 
##$TUNHIN= 0
##$TUNHOUT= 0
##$TUNXOUT= 0
##$USERA1= <user>
##$USERA2= <user>
##$USERA3= <user>
##$USERA4= <user>
##$USERA5= <user>
##$V9= 5
##$VALIST= <valist>
##$VCLIST= <CCCCCCCCCCCCCCC>
##$VD= 0
##$VDLIST= <DDDDDDDDDDDDDDD>
##$VPLIST= <PPPPPPPPPPPPPPP>
##$VTLIST= <TTTTTTTTTTTTTTT>
##$WBST= 1024
##$WBSW= 4
##$XGAIN= (0..3)
0 0 0 0 
##$XL= 0
##$YL= 0
##$YMAX_a= 518304
##$YMIN_a= -753241
##$ZGOPTNS= <>
##$ZL1= 120
##$ZL2= 120
##$ZL3= 120
##$ZL4= 120
##$ABSF1= 10
##$ABSF2= 0
##$ABSG= 5
##$ABSL= 3
##$ALPHA= 0
##$AQORDER= 0
##$ASSFAC= 0
##$ASSFACI= 0
##$ASSFACX= 0
##$ASSWID= 0
##$AUNMP= <proc_1d>
##$AZFE= 0.1
##$AZFW= 0.1
##$BCFW= 1
##$BC_mod= 2
##$BYTORDP= 1
##$COROFFS= 0
##$CY= 11.3945322036743
##$DATMOD= 1
##$DC= 2
##$DFILT= <>
##$DTYPP= 0
##$F1P= 2.36226072786647
##$F2P= -0.459571619588291
##$FCOR= 0.5
##$FTSIZE= 0
##$FT_mod= 4
##$GAMMA= 1
##$GB= 0.15
##$INTBC= 1
##$INTSCL= 1
##$ISEN= 128
##$LB= 0.24
##$LEV0= 0
##$LPBIN= 0
##$MAXI= 10000
##$MC2= 0
##$MEAN= 0
##$ME_mod= 0
##$MI= 1.114404
##$NCOEF= 0
##$NC_proc= 0
##$NLEV= 6
##$NOISF1= 3.799351
##$NOISF2= 2.8
##$NSP= 1
##$NTH_PI= 0
##$NZP= 0
##$OFFSET= 15.70392
##$PC= 1
##$PHC0= -15513.33
##$PHC1= 13.0008
##$PH_mod= 1
##$PKNL= yes
##$PPARMOD= 0
##$PSCAL= 0
##$PSIGN= 0
##$REVERSE= no
##$SF= 200.130013532006
##$SI= 16384
##$SIGF1= 3
##$SIGF2= 2
##$SINO= 400
##$SIOLD= 16384
##$SREGLST= <1H.CDCl3>
##$SSB= 0
##$STSI= 0
##$STSR= 0
##$SW_p= 3612.71676300578
##$SYMM= 0
##$S_DEV= 0
##$TDeff= 0
##$TDoff= 0
##$TI= <>
##$TILT= no
##$TM1= 0
##$TM2= 0
##$TOPLEV= 0
##$USERP1= <user>
##$USERP2= <user>
##$USERP3= <user>
##$USERP4= <user>
##$USERP5= <user>
##$WDW= 1
##$XDIM= 8192
##$YMAX_p= 0
##$YMIN_p= 0
$$ End of Bruker specific parameters
$$ ---------------------------------
##NTUPLES= NMR FID
##VAR_NAME=  TIME,          FID/REAL,        FID/IMAG
##SYMBOL=    X,             R,               I
##VAR_TYPE=  INDEPENDENT,   DEPENDENT,       DEPENDENT
##VAR_FORM=  AFFN,          ASDF,            ASDF
##VAR_DIM=   8192,          8192,            8192
##UNITS=     SECONDS,       ARBITRARY UNITS, ARBITRARY UNITS
##FACTOR=    0.0002768,     1,               1
##FIRST=     0,             0,               0
##LAST=      2.2672688,     0,               0
##MIN=       0,             -753241,         0
##MAX=       2.2672688,     518304,          0
$$ Real data points
##PAGE= N=1
##DATA TABLE= (X++(R..R)), XYDATA
0@%%%%%%%Qj6J6j6J6k4M0m8N6p2Q9j13J37j61J93k34K81l29L84m46N17n99O89
30C68p86Q97j025J164j316J483j666J870k095K338k605K898l218L571l953M368
46B293m824N321n867O466p119P840q641R530j0520J1632j2890J4324j5981J7917
60I481k0214K2993k6437L0834l6671M4840n7177P8204j23440L90728l65945m96586
72e49390N95838j59798J19231N12423l48558p27397M34652M60534l11265k8663
82b393J92232n56622j9337P73214r8428n11165K66222m2415l59571L91483L29918
93C63138m71760j02048L97823j56025k23733M02280n2824m76267K86276K77694
103B44554l76751J28095L39631l99930k16921L61980m8424j94993L31764N0569
$$ y = [0, 0, 0, 0, 0, 0, 0, 0, 8, -8, 8, -8, 8, -16, 24, -24, 32, -40, 49, -64, 73, -88, 105, -129, 152, -177, 207, -239, 278, -321, 368, -418, 479, -546, 618, -698, 785, -881, 989, -1106, 1232, -1373, 1525, -1693, 1878, -2075, 2293, -2531, 2790, -3077, 3389, -3730, 4110, -4531, 4999, -5521, 6111, -6779, 7545, -8436, 9481, -10733, 12260, -14177, 16657, -20014, 24826, -32351, 45853, -77587, 313141, -52804, -549390, 46448, -113350, 5881, 518304, 169746, -557651, -122999, 337535, 26270, -2393, 189839, -366783, -386120, 387094, 288666, -222499, 43723, 1308, -358263, 33220, 363138, -108622, -210670, 187153, 31128, -192605, 209675, 156851, -319416, -33140, 244554, -132197, -4102, 335529, -64401, -281322, 80658, 32234, -162759, 169005, 219574]
113B19574m65909R8337L53397k57227o4706K94218k78699j84781M82096M7774
123B44074l80719J00016Q7587k53959J69193L35583k82322k30201L03926n01k15678
134a23001K21118J788l47593J88948L06104k34102j01404J71164j52103j05804
144a74885K82855K589k79505J36156J90605k02474o646J54893k13798n6357L20783
155A54216l3226k31449J23892N9818j60751J06913J20636k41219n2770K73658
165A19718j5459j45284J03816o8032j84170K00523J56791k14552l6509J43115
175E9957q6120j9339J64619j09699j93866J66097J34915j29395K8069O7838j76403
186i3327N3K07628p7838j37077J27889L1097j03705Q7687M0984j77743P074J68082
$$ y = [219574, -246335, -147998, 205399, -51828, -116534, 177684, -101015, -285796, 196300, 244074, -136645, -36629, 50958, -203001, -33808, 301775, 19453, -210748, 93178, 92677, -123001, 98117, 99905, -247688, -58740, 247364, 13262, -88142, 83022, -69081, -174885, 107970, 110559, -168946, -32790, 157815, -44659, -51305, 103588, -110210, -166567, 154216, 120990, -110459, 13433, 73251, -87500, 19413, 140049, -101170, -153940, 119718, 104259, -41025, 62791, -5241, -189411, 11112, 167903, -46649, -83158, 59957, -26163, -45502, 119117, 9418, -184448, -18351, 116564, -12831, 15238, 83076, -93327, -93274, 114354, 36516, -100561, 27328, 58425, -45280, 42407, 83391, -94352, -87278, 80804]
198H0804n8028p6265J04387k9535r4576J11788K4034j58785L5586J30589n6741
209A3258k4175P0491q1110p0059J29232L2616j22828K1216P1931n1731K4187O6437
221G9465j11146p2481J17925L9441n8418K9015o471p9822N2284Q5327p9164o3356
233f7401O4527J4683j1431N9980k9976j06535L8655Q1948l6338j7112K8862m1314
245b1452o332P9966j3837r1143J1372N1385q458J8354K0988o6022k5812P0868
257A9877R321m5544P858N882j2607M0015K4073n9360l4726M0921K1116q909J0239
270A8156j4724l0814K9329L1935l3932k8564J1451R469J4831J9560j9824l8067
282c1194P795L2818R24j4821m971l402J2987K6119o274l1830j0747J5846K1693
$$ y = [80804, 22776, -53489, 50898, 21363, -73213, 38575, 62609, -96176, -60590, 69999, 13258, -10917, 59574, -21536, -91595, 37637, 70253, -52575, -31359, 40572, -11159, 13028, 79465, -31681, -104162, 13763, 53204, -5214, 23801, 17330, -62492, -10208, 75119, -4045, -67401, -2874, 11809, 378, 60358, 30382, -76153, -37498, 44450, 8112, -9000, 19862, -21452, -27784, 52182, 38345, -52798, -41426, 9959, 1501, 19855, 40843, -25179, -50991, 19877, 29198, -16346, -8488, -2606, -15213, 24802, 48875, -10485, -45211, -4290, 16826, 7917, 18156, 3432, -27382, 1947, 33882, -50, -28614, -17163, -7694, 7137, 26697, 6873, -31194, -23399, 9419, 10343, -4478, -9449, -12851, 136, 26255, 19981, -11849, -22596, -6750, 14943]
295A4943J0402j2517k2907k393K0319J1261j3509j9991m314J4936J9143Q95k1559
308e291j9166M514J8596J1005p538j6934n59J7527J2399m994j6829r319J1973
321d616J8237P347r072j6368l53J2908N404l728j1723q087J0624J1788l794j3596
335e029j0403M329Q899L206j500j1436l372J4726L972o835k920l974P199J5019
349A1881J97r849n073M791Q205J493r55q785o819J4669O484j2802l131n450o538
364a1682J4267O396j4324p186N544M65q95Q089k668j4951J1043J4512j3498K438
378b450J3031j4659j35K0231q043j2842J6213M110j9166O047J4741k0967m276
391h165K5403j5654k0120K5304q88k5672J7810J0845l0379O191K9892k0774j3389
$$ y = [14943, 25345, 12828, -10079, -12472, 7847, 19108, 5599, -14392, -18706, -3770, 15373, 16268, -5291, -24457, -19943, -1347, 9658, 2120, -14814, -15373, 2154, 14553, 9559, -7270, -16589, -4616, 13621, 20968, 11896, -4472, -4825, 8083, 13487, 9759, -1964, -10051, 573, 12361, 8567, -5029, -15432, -11103, -2204, 1002, -498, -11934, -15306, -580, 3392, -3443, -6363, -10337, -3138, 11881, 12078, 2229, -2844, 1947, 10152, 11645, 10690, 1905, -4914, 9755, 16239, 3437, 306, -5144, -11682, 2585, 8981, -5343, -12529, -6985, -6520, -7415, 674, -1994, -16945, -5902, 8610, -4888, -2450, 10581, -4078, -4213, 16018, 7975, -4867, 11346, 15456, -3710, 2337, 17078, -3889, -8165, 17238, 1584, -18536, 6768, 5880, -19792, -1982, 8863, -21516, -15325, 14567, -6207, -19596]
404a9596L2730r123k9282L2610J4275l6898J4952K8038l5832m505M3672k0866
416A0175l0391L8142j652m2955L3923K5528n3977O11M3912l3969j8373N1520j5971
429F523m8894M4716K2624n6364J8471M3676n1166m752O5150l3479m5454N9798
441B0849R791n8139L2123L3801o3414O747P2914m7668n0619O2765n826n1264O2631
454B4691J6011r3725J7139P7210m1610k4681N4195m4217n4620R6003L7457r3293
466b9440Q994M0117o2669L2914R4332p3981p5723P4310J5826m6131N9278J1004
478D8831j14612J8253J08052m5019l7267O1861n8988o1849J11170K9852r7646
489c7362K3546M2101p5394J9243J01087o2068p5688Q0946Q45p0341Q8326M0287
$$ y = [-19596, 13134, 4011, -25271, 7339, 21614, -15284, -332, 27706, -8126, -12631, 31041, 10175, -20216, 17926, 16274, -26681, 7242, 32770, -21207, -20596, 23316, -10653, -29026, 22494, 6523, -42371, 2345, 24969, -31395, -12924, 30752, -20414, -25166, 39984, 6505, -38949, 20849, 30640, -27499, 4624, 38425, -24989, -18242, 54672, 7004, -43615, 19150, 13324, -37940, 24691, 40702, -53023, -35884, 41326, -284, -24965, 29230, -14987, -69607, 26396, 63853, -29440, -20446, 19671, -42998, -10084, 84248, 10267, -65456, 8854, 24680, -21451, 37827, 48831, -65781, -47528, 60524, 15505, -21762, 40099, -18889, -80738, 30432, 60284, -37362, -13816, 28285, -47109, -27866, 73221, 11153, -64535, 16411, 17256, -53085, 35241, 75528]
501G5528j23660P353Q2435o1930k638J02202o0611j03071Q5537M8689p9215M2511
513A3130M4909j29728l40J50729l7868q0343O3283l8631q0015J25624P6939j35703
525b8014l1296Q3803m7979j363J24073p4380j43834J05469Q0505p9438M0125L0289
537E7960j42812N253J61139l2128r5521O4456j0230q6818J06361P1286j50254
548e1308j5437J14032n7117k1790J11252o1058j11505R9440N1027j04027L4624
559a1867Q0557j00736j9380J22328o2862q8012J16329P967j14895P2287O5197
570F6913j07084J5264R8191r4507o3448J28377L553r6442P7343K3763j30253N3771
582b4559J14054j06653m4499J07746l9461n7429J09719q528j40631N4734R9521
$$ y = [75528, -48132, -40779, 41656, -20274, -22912, 79290, 18679, -84392, 1145, 49834, -29381, 13130, 58039, -71689, -72029, 78700, 40832, -39511, 23772, -14859, -94874, 30750, 107689, -28014, -59310, 24493, -23486, -24849, 99224, 24844, -118990, -13521, 66984, -12454, 27671, 57960, -84852, -79599, 81540, 49412, -46109, 18347, 8117, -78701, 27660, 98946, -51308, -66745, 47287, -9830, -31620, 79632, 18574, -92931, 6509, 57536, -46491, -11867, 68690, -32046, -51426, 70902, 8040, -79972, 36357, 44324, -70571, 1716, 66913, -40171, -24907, 73284, -21223, -84671, 43706, 47259, -49183, 28160, 51923, -78330, -24559, 89495, -17158, -61657, 46089, 6628, -50801, 58918, 50390, -90241, -35507, 64014]
593F4014q3726l193R0330r0192n5113J35899j1170j19432O5573M8548q3763M7277
605E052Q0656j11197m8444J16377j6608p6892Q1899J0372j01449O7877P1745j19961
617d0573k1227J02347m0299l6823R0689l1379j02083P9267O5090j00437l466P4561
629C5667o2366m749J15945n4722j12212P4513M2462o4766M7859M2962j01401l485
641d4293J10582l9261p8787N9109K94o0607Q4157M4658j16930p157Q1602m5733
653a2366k3166P1910l3741n9690Q0931L3922r2254L189N5637n0252O431Q1690
665F2241n3361n8867P9013R109p0795K7301K3392n2827L3074P1048o1790n9192
677e1654N6457K323l8721N3007O26p7676M4081O9484n6259l2559L0240k7288m440
$$ y = [64014, -19712, -22905, 67425, -22767, -77880, 58019, 46849, -72583, -7010, 41538, -42225, 5052, 85708, -25489, -73933, 42444, 25836, -51056, 30843, 41215, -60234, 7643, 79388, -40573, -61800, 40547, 248, -36575, 54114, 22735, -79348, -81, 65009, -35428, -38894, 35667, -26699, -31448, 84497, 29775, -82437, -7924, 34538, -30228, 17631, 60593, -40808, -44293, 66289, 27028, -51759, 7350, 7644, -52963, 31194, 75852, -41078, -48235, 33367, -12366, -35532, 36378, 2637, -57053, 23878, 57800, -34454, -31265, 24372, -25880, -19449, 62241, 8880, -49987, 29026, 38135, -32660, -5359, 18033, -34794, -1720, 69328, 7538, -51654, 4803, 7126, -31595, 21412, 22038, -55638, -11557, 57927, 1668, -30891, -651, -27939, -32379]
690c2379Q0094k46q2555J4249M7135l4220P236L4483o0139j4421Q6226R24n9536
703a3149Q467j345l2998M0202M6356n3508l0832N2830k322l3257K7314j3966m5112
716e1320N0739M7016m3467j7491K1923j8305n919L8599j1077m1428L4844L8350
728D2464l3749j1562Q379l2910R787N1600j5493l6755J6223J1964j3666O446j523
741A205l5694P421N3438j18l1062O97j2015p897L6731Q184l5941m11K8553N777
755A8868m268n006k7439j4290L9473K7154k3700j2905M65r344J5057J3774k8604
768a0765j8859K3629K2461M05q315j9168k0226J5459L2306o404j9217M447N235
781I88P325J0083j8030k5630R364K7607J2088p341j4931j3178K590J9011Q39k1399
$$ y = [-32379, 47715, 47469, -35086, -20837, 26298, -7922, -686, 33797, -26342, -40763, 45463, 46387, -13149, -4682, -6027, -39025, 1177, 47533, -5975, -36807, 16023, 13701, -19556, 7758, -6208, -51320, -581, 46435, 2968, -14523, 7400, -10905, -16824, 21775, 10698, -30730, 4114, 42464, 8715, -2847, 5532, -27378, -17591, 34009, 18516, -18239, -2016, 9948, -3718, 2728, 1205, -34489, -27068, 26370, 26252, -4810, -4113, -16128, -24025, 12706, 20890, -15051, -15462, 13091, 18868, 14600, 9594, -17845, -32135, 7338, 34492, 10792, -2113, -1648, -10992, 4065, 17839, -10765, -29624, -5995, 16466, 16871, 8556, -10612, -30838, -15379, 16927, 10523, -8694, -4247, 988, 8313, 18396, 366, -25264, -15900, 11707, 23795, 16454, 1523, -11655, -9065, 9946, 10785, -10614]
795a0614m394J4348J2882O650j3919k5868l827J9583J6598j916j2504o828O051
808c758J3857J953j9765j3319J1282K0319J1803o878k1267r979J0995J3856j98
821H901j1990o365Q426J4406K917j7192j9464J500J8295J4031k608j4051q243
834a1437P321J1338j702j3701p972R261J8591P948j1881j7806n119J1957J3457
847A0255k054j1243m398P995J2033r53j5821j2532L190J6822J3228o419j5812
860e709n982P954J0555k283j0827m571O401J5796O386j5891j5354J260R446J1879
874I060J486j2612p621R469J2313n704j4232l309K111J0866J6770q653k1234J939
888i351J0379K181J452m156j0300M249K0020Q19k1348m552N958n15J3703P131
$$ y = [-10614, -15008, -660, 12222, 18872, 4953, -20915, -24742, -5159, 11439, 9523, -2981, -9809, -3758, 10099, 12052, -7713, -21032, -9750, 10569, 22372, 15494, -5773, -15752, -4757, 9099, 8901, -3089, -9454, -1028, 13378, 16295, -897, -20361, -18861, -566, 13465, 10857, -3194, -11437, -4116, 7222, 5520, -8181, -16153, -6892, 11699, 19647, 7766, -10040, -15159, -3202, 10255, 8201, -3042, -7440, 555, 12588, 11635, -4186, -16718, -13528, 3294, 16522, 10103, -5709, -11691, -3737, 6818, 4535, -6292, -10863, -4462, 11334, 17720, 1829, -13525, -12265, -2819, 9060, 10546, -2066, -9687, -218, 12095, 6391, -7841, -11150, -9039, 1827, 18597, 9944, -11290, -9351, 1028, 3209, 4661, 505, -9795, -5546, 14474, 15293, -6055, -10607, -4649, -5164, 8539, 15670]
902A5670k1805o901J7363K406q354J78m983o315J7577J5204j9914j3159J2289
915g44k424n64J6187r277j7517J6869J3297j4974m865N907j0044K102K3227q669
929H511k2665J4550P955j6154P950O304k1298O393K6210j2846j9205J4027J158
942H90j2610J9313O936l0981O525K9847j5928j1335J6333j4193j2413L3599P677
955B3660l5590K290K0277j7765L553K5378k8174k2499L8036P501k7580J2457M059
968E603l1514J6567L7439k7129k2607K9560m648k0485L3834L082m5103J6790L3827
981B5216k7335m625K8797k5550k2037M1280M521l9739J8875K0146l8992O954L8422
994B5933l2670j8981M1569j0594l2893L5267J3005m2543J2859L2240l6434n807
$$ y = [15670, -6135, -13036, 4327, 6733, -1621, -1443, -6426, -12741, 4836, 20040, 126, -13033, -744, -3168, -3732, 12455, 3178, -14339, 2530, 15827, 853, -4012, 1895, -8149, -6047, 17180, 8511, -14154, 396, 8351, -7803, 147, 6451, -14847, -8454, 17756, 4910, -14295, -268, 890, -11720, 7593, 14529, -16452, -9927, 19920, 3992, -7343, 8990, -5203, -17616, 15983, 23660, -11930, -9640, 10637, -7128, -3575, 21803, -6371, -28870, 9166, 16667, -10913, 1544, 5603, -25911, -9344, 28095, 966, -21641, 7919, 3271, -17214, 16620, 19702, -25401, -8611, 25216, -2119, -6744, 22053, -3497, -25534, 15746, 20267, -19472, -597, 19549, -19443, -12489, 25933, -6737, -25718, 15851, 5257, -27636, 7631, 20636, -21907, -9048, 23192, -13242, -19049]
1006a9049M8547k0951l5899M0355M116m0204L1329K3467n1043N56M6166k5582
1018A808k1161M1207j4795m4736M2855K5524n1725Q457L4620m2147l559N6100
1030C2448k4874m2010M1906Q791m1255L0828K8831n5581k875N5259k6967k6303
1042b1802M8642j3624m9149M3437K5371n1766R637L6447m3045j1313N6884j8532
1054A1187m5206M1364R666m9570L1267L6951n5749o034N2499k6960k3998N1180
1066B6597j0272n2797L8776L1664m9745P867M1626m7076j6823O3268j5997m7784
1078c0696M0906P950n0818L0933L8611n4042j0644N1514k5866k8035N3832n246
1090A8399n6972L6615L1519n1050J0989M6290m4929k0748N6076j1722m1199M1003
$$ y = [-19049, 29498, 8547, -27352, 13003, 17119, -23085, 8244, 31711, -19332, -18776, 27390, 1808, -19353, 21854, 7059, -37677, 5178, 30702, -21023, -12566, 22054, -20093, -23652, 32448, 7574, -34436, 7470, 16261, -24994, 5834, 34665, -20916, -23791, 31468, 4501, -21802, 26840, 13216, -35933, 7504, 32875, -18891, -9254, 27193, -15852, -27165, 29719, 11187, -34019, 7345, 17011, -32559, -1292, 35659, -20090, -26124, 26375, -585, -24583, 26597, 16325, -36472, 2304, 33968, -15777, -7910, 33716, -13360, -30183, 33085, 17088, -30696, 10210, 18160, -32658, -1725, 36886, -17156, -27800, 23714, -2152, -30187, 23645, 18399, -38573, -1958, 29561, -21489, -10500, 35790, -9139, -29887, 26189, 14467, -26732, 14271]
1102A4271J0994n4542K1491M3377m4893j0964M7581k9322l1844N3323K286n1277
1114b9519K6414K4943m4769R884M4586l7967k5020N0009n707l8928L7439J1331
1126B2696n1788K1160M2014m2108j0906M4120k2860k7449M3913j64m7700K6612
1138b460L0631m2621O15L9156l4410j7497N1108j2587m4071L3951J7345l6984
1150a7824J7559K6530m4889r655N2502r517l2789K9500l211l9244L6484L1294
1162C6740m8384r066L3972j7599o235L9030j7150m6089K6818K8415k7660P574
1174C66K1141l9876o946M8836j0610l1293K2949O29k6654K6028K3810l6282r869
1187a7771K9911j4179j4427L4961m691l4244K1802J3379l0224J0744K5096k5840
$$ y = [14271, 25265, -29277, -7786, 35591, -9302, -20266, 27315, -2007, -33851, 19472, 21758, -29519, -3105, 21838, -22931, -13047, 31539, -6428, -31448, 18561, 12854, -26074, 11365, 22696, -29092, -7932, 34082, -8026, -18932, 25188, 2328, -25121, 18792, 18628, -29072, -2460, 28171, -14450, -13835, 25321, -9089, -26586, 24522, 11935, -32136, 1815, 19160, -17824, -265, 26265, -18624, -28279, 24223, 14706, -18083, 11417, 8206, -31038, 5446, 36740, -11644, -20710, 13262, -4337, -10572, 28458, 11308, -34781, -7963, 20452, -7208, 366, 21507, -18369, -25315, 23521, 12911, -18382, 4567, 5196, -21458, 4570, 28380, -7902, -17771, 12140, -2039, -16466, 18495, 13804, -20440, 1362, 14741, -15483, -4739, 20357, -5483]
1199e483j1164K7596o070j6837K4271P98l6248J1664K8021j7178N13J8100k7587
1212i604j4527L5296N358k4732N753M903j6308J5447K4931k6731k3475K0916M750
1225A977m715J9939p326l1548J2113K4421j1349p094P203j1697k196K7008O65
1238A7401k8237R15J1474p022R605J1148k0809p457K0713k34j4069M052K97p955
1252a0178J3643J2224j7717r600J3183o21n135R427m982j0082J5440R639j5852
1265f11o284N125k517M441J2319p680j4199Q336R053q057k955K09p255P452J6175
1280A3552o527j4661N64K959J757O490o45j0353J827J3789Q71j0189m653k856
1294h075L589J4128L146j2335n714L967L747J453l471p462r82J1492Q511p160
$$ y = [-5483, -16647, 10949, 4879, -11958, 12313, 13111, -23137, -11473, 16548, -630, -117, 17983, -9604, -24131, 11165, 16523, -8209, -2456, 2447, -13861, 1586, 26517, -214, -23689, -2773, 1977, -2738, 17201, 9875, -21673, -9560, 14861, 3512, -3582, 3621, -8076, -10272, 16736, 17401, -10836, -9921, 1553, -5469, 4136, 15284, -5525, -12982, 7731, 7497, -6572, -2520, -2223, -10178, 3465, 15689, -2028, -11628, 1555, 934, -4201, 5226, 244, -9838, 5602, 15241, -611, -6895, -1770, -4287, 154, 12473, 4793, -9406, -1070, 7983, -74, -3029, -2820, -10075, -2623, 13552, 7025, -7636, -7072, -4113, -2356, 4134, 3489, -6864, -5037, 8752, 9623, -566, -5219, -8075, -4486, 9642, 12788, 453, -5261, -1294, 2453, 3906, 435, -7027, -8009, 3483, 11994, 4834]
1308D834j1021m112J843R548N528o901n480L404O226K571n778r034r05R419J1080
1323A1222k37r761n745J027N932M203o478o672M249P883M172n134j2295n007O448
1338f193J0111L046p362n784K679N303K659n779r069K293J0750Q456r17j0918
1352g25o819L719O948L779n111o299M757P155J565n786j1712l264R333Q974R25
1367G439p751o667K708N320J623n497q239M205J1914M859k739j0417p957O732
1381d467R730J871m788n312K697O765K356n739j2251j473J2494O672r70n297r677
1396g389J36R202Q60p048l737M576P162L190j663j1329p437J1428Q750l737q20
1411B144k454j981Q100L565j1378q530O506R509K815P90p703j3400O560J3300
$$ y = [4834, -6187, -10299, -8456, 1092, 6620, -281, -5761, -2357, 3869, 6440, 662, -8372, -9277, 142, 11222, 10985, 1224, -4521, -3494, 2438, 6641, 163, -6509, -2260, 5623, 9795, 4661, -7634, -12641, -6193, 3918, 6964, -398, -6182, -3503, 1800, 4459, -1320, -10389, -8096, 2654, 11110, 10193, -725, -7544, -3825, 3123, 6902, 1791, -4508, 249, 7404, 8969, 3183, -8529, -11793, -2460, 6514, 7439, -312, -6979, -4271, 1049, 2672, -2825, -11064, -6859, 5055, 9914, 7175, -3242, -11199, -4467, 5263, 7134, 2346, -2966, -269, 6496, 8852, 3113, -9138, -10611, 1883, 8555, 7585, 2288, -7389, -7253, 1949, 2809, -4239, -7976, -3400, 3762, 6952, 5289, -6040, -13477, -2049, 6701, 2964, 2144, -310, -2291, 5809, 9374, -2004, -10534, -4028, 5481, 8296, 9086, 1383, -12017, -5457, 7843]
1425G843o620o479K451j328N478J0676q684j7155J944J2429K952K453J103j3428
1439f365k304J7376j494j3883L442K597j497J2005M265j8694p246J3014J248n182
1453b718P415l031j0577J2987P759j9371m122J2694l415P15J2658r008j4491J3903
1467A398Q869j5978o99R977p565M806J7988j5547k0139J4718Q758r347P848K181
1481G268j9820O176K4061j2018j8482R241n61m301K2436K849l0502J43K0556p474
1495d28j835J3034j6203j1970K7920P830k4639P22P662j4408J0253K3535j9144
1508B329j7894K0498Q35j5721J4754L638k4280J0733K3532j8250j0379J8594r227
1521h38j5048K2809L949k3870J3227J6968k4652m027K1977j2915r455K5679n781
$$ y = [7843, 1223, -5256, -2805, -4133, 1345, 12021, 3337, -13818, -11874, 555, 3507, 5960, 7063, -6365, -8669, 8707, 7213, -6670, -3228, -631, -2128, 9877, 14142, -4552, -11798, 1216, 2464, -2718, 4697, 1666, -8911, 4076, 11835, -7536, -11658, 1036, -2379, -1664, 10994, 1986, -12505, 1398, 10267, -5711, -6410, 3567, -3998, 808, 18796, 3249, -16890, -2172, 6586, -2761, 5087, 7268, -12552, -6376, 17685, 5667, -12815, -3574, -4135, -8436, 14000, 16849, -13653, -13510, 7046, -428, -2263, 10771, -5432, -17402, 10518, 18348, -6291, -5569, 2093, -12315, -2062, 21473, 2329, -15565, 4933, 5768, -9953, 4801, 8439, -15841, -5108, 18424, 174, -10205, 8389, -838, -15886, 6923, 10872, -12998, 229, 17197, -7455, -11482, 10495, -2420, -11875, 13804, 8023]
1534H023k6077J8501J5793k3753J393J6747k1430k527L4126r197k8272J6209N975
1547E511j9181J8014J5831l1343m932L1191q931j6144J9636p959k4330K6461J8500
1560B2324k9835j116J9985j8860m620K8451j2205k4920K5409J0903k6442Q286
1572b640J5919k5152J408L0423j7444k0686K6258L253k2385J5552P867l0729Q348
1585a0008L3466j8826j7901K0455r036j6415L0895O260l6772N476K4274j5807
1597c939O74K2890k4741k2728L4029J1181k4414J1529O596l0945J0766L3796k0058
1610D636j8579K1647o859j6993K8711P955l5851M189K2504j9201N10K8828k0113
1623A384k4898K5916O249k0505J7154J0161l2164J452L1645j1468j3036K0158
$$ y = [8023, -18054, 447, 16240, -7513, -6120, 10627, -10803, -13330, 20796, 11599, -16673, -464, 5511, -13670, 4344, 20175, -11168, -16100, 15091, 6160, -9984, 9652, 1693, -22637, 3824, 22324, -7511, -8627, 11358, -7502, -12122, 16329, 4124, -20796, 4613, 15516, -10926, -2640, 13279, -11873, -10465, 19958, 2514, -18172, 8086, 11339, -11046, 4506, 12373, -18356, -10008, 23458, 4632, -13269, 7186, -1850, -18265, 12630, 18890, -17882, -12406, 11868, -3939, -3265, 19625, -5116, -27844, 6185, 17366, -7048, 4481, 11077, -19868, -9102, 24694, 4636, -13943, 7704, 845, -16148, 12563, 20518, -15333, -11144, 11360, -7841, -7331, 21497, 1384, -23514, 2402, 8651, -11854, 5300, 15461, -16703, -15251, 16394, 4926, -8110, 12048]
1635A2048j2387k3563L0208J7583k8166l81J2283k0740M140L3245j3917k9277
1647a8924J5593P749j4591J9421J0694l6998m587L1972o011q748J7438j4818k3761
1660b5571K6078K0062k2479l059J2199j8498J126L2165j0933k6845J5469N823
1672E537j5280J7214J1036k8549m777K3422o062r724J7026o704k2667J7718J5621
1685A3811j9945J894J3013j8006k739K4279n462j6654J1728L440j5082J0822J4618
1698A5717j8864n600J7200p954q057J8414m208j8990J1193R556j4023L280J1694
1711I358j4303p153J8049j627j3561J1912K755j6425Q652J2835j3590k286J2743
1724G359p581p546J4318O84j3447O632P117j2389K018J2697j0022p021J1788k952
$$ y = [12048, -339, -23902, 6306, 23889, -4277, -4658, 7625, -13115, -8975, 24270, 10353, -18924, -3331, 4418, -10173, 9248, 19942, -17056, -21643, 10329, 4318, -4430, 13008, -1810, -25571, 507, 20569, -1910, -4969, 7230, -11268, -10142, 22023, 11090, -15755, -286, 5537, -9743, 7471, 18507, -10042, -14819, 8603, 2541, -7183, 9843, 3139, -19528, -1810, 13811, -6134, -4240, 8773, -9233, -11972, 12307, 6845, -9809, 1919, 5359, -9723, 1099, 15717, -3147, -8747, 8453, 499, -7558, 10856, 6648, -12342, -1149, 8407, -5616, -2336, 9358, -4945, -12098, 5951, 4324, -9237, 2675, 5430, -10995, -2343, 10492, -3098, -5384, 7359, -222, -7768, 6550, 7234, -6213, 419, 7536, -4853, -2835, 9862, -160, -7181, 4607, 1655]
1738A655q638J0228K229j2741L139R191p381j874R318n657p524J0400K761r277
1752d171M300M717q639J865Q895o123m657P330j222n635N755K147p898J793O011
1767D468o327k483P508k437m754N793q61o580N253M628o245p30M082k508l30N863
1783D340j671p144K930M901k872J603J607o857k55P059q00l563N65r36j289L654
1799A272K682n338l382M074Q48p03K960k722l806M236K181k639l27J2J17J476
1815I41J791j275l930J261L378j551l02j88k341K587K988l033k403o42J506K939
1831A726M61j561l067q39M651R99k633r39j341J733M703q32l972j879K2L698K126
1848C056j796k196j429K541L218k745k801o61R29M645J001l700k315k09K507K749
$$ y = [1655, -6983, 3245, 5474, -7267, -4128, 5063, -2318, -4192, 5126, -531, -8055, 2345, 5106, -4171, 129, 4846, -3793, -1928, 6967, 844, -3813, 3517, 2295, -3340, 2415, 4562, -3336, -1543, 4468, -1859, -4342, 3166, 729, -4025, 1768, 907, -5673, -420, 4208, -2037, -2767, 1315, -1193, -1523, 4340, 2669, -4475, -1545, 3356, 484, 2087, 3694, -3163, -3418, 3641, 2841, -722, -157, -1093, -2382, 1272, 3954, -1384, -4766, -692, 156, -547, 2413, -309, -4115, 121, 2302, -337, -664, -652, -535, 941, 2732, 1457, -2473, -1212, 2166, 615, 313, 125, -2216, 371, 3359, 326, -2077, -2719, -1213, 1726, 2187, 626, -2441, -3280, 1371, 2370, -263, -1202, -2543, -810, 3893, 3061, -911, -2790, -2768, 930, 3056, 1260, -936, -2365, 176, 3394, 649, -2152, -2813, -1884, 2761, 3762, 62, -2253, -2462, 45, 2794]
1864B794k126k475j46J858M263j307m921j320Q28L525L202l230l228L28J749K701
1880B495j467l896o72K336M717R66n270k228Q74J542L838j096m692J007L775J543
1896C772j461l933k383J459M890L140n049l964K308R42J322R94n338k046N756
1911D09M135j768l567k592m58L328N334k296n937L117L493j839P40k185n225L870
1927a441P047j442m837n52k09j84L724l36p147J520Q076j179l087l23n422p3R867
1944D002J404p461q46L586k40K564J675q554m376J1100N093n398k26l543o698
1959g918P770Q087q103n249N283P34q69N014m246j1366N912J0939n083j645M271
1974C531p100j415J0971l308j0269O461O924m859J525L207j0394k249J3656k184
$$ y = [2794, 668, -1807, -1953, -95, 4168, 2861, -2060, -3380, -2552, 973, 4175, 945, -2283, -1955, -206, 2495, 1028, -2868, -3540, -1204, 3513, 4479, -791, -3019, -2145, -603, 3235, 2139, -2553, -1546, 2229, 3772, 2311, -1622, -4005, -2546, 2344, 5484, 435, -3529, -1221, -279, 1043, 2037, -3301, -5347, 409, 4544, 2776, -791, -3383, -3841, -513, 4821, 2525, -3412, -295, 3198, 1359, 2099, -86, -5311, -1441, 5606, 4164, -673, -1225, -1434, -1618, 2106, 1770, -5377, -3857, 4219, 3040, -47, -370, -5792, -5865, 4002, 5406, -2055, -2901, 685, 445, 3009, 4684, -3870, -8246, 2854, 7947, 2549, 2323, -1220, -7918, -148, 7939, -164, -5413, -130, 604, -265, 4749, 503, -10863, -4951, 5988, 905, -740, 3531, -3569, -4984, 5987, 2679, -7590, -1129, 5795, 936, 2461, 5668, -4726, -6975, 6681, 4497]
1988D497j0260O832K373p001O924L061j5191j277J4193o20n098N582m884j0134
2002a1003J2344Q204j4530j357J0527n527J158J1811r912j3484J1371P206q997
2015b189M054N853j2588K44J4219r235j1204J3053J619r887R193L513j5166L304
2029e217J3768j0805q054J3450J67p425J2225j081k0579O756J7426q607l352Q404
2043G076j0939n575K0091J741k1745J506R996o456Q739J2240k1126j3875J8693
2056C66N057q417Q485k894j7717J1832J9786j4270j1394R970n586l167K1929j095
2070A2885k3027N226J1101j0640L460J2891j4716q703J9702m03j5845R665M078
2083E674j7486P434J5719j3554m183J5846r439j3522J5148N118j3996Q985Q850
$$ y = [4497, -5763, 1069, 3442, -3559, 3365, 6426, -8765, -10042, 4151, 3531, -1567, 4015, -869, -11003, 1341, 9545, -4985, -6342, 4185, -1342, -184, 11627, 1715, -11769, -398, 6808, -2189, 1865, 7718, -4870, -4626, 9593, 358, -10846, 2207, 3826, -6061, 3132, 6645, -8521, -5217, 8551, -2254, -10308, 3142, 3309, -4116, 8109, 7028, -13551, -6795, 10631, 2024, -1328, 7076, -3863, -9438, 10653, 12394, -9351, -7845, 2151, -4305, 4434, 16674, -4452, -18327, 366, 5423, -2994, 5491, 2597, -15120, -3288, 16498, 2228, -9166, 804, -4782, -7949, 13980, 12885, -10142, -4916, 6185, -4455, -995, 11896, -2820, -11523, 8179, 7776, -8069, 1596, 5674, -11812, -4378, 11341, -2213, -6396, 9450, 11, -13511, 1637, 6755, -7241, 1744, 10594]
2096A0594j8815P55K0303r989j1957J2901k968j0191J7868O792k3023k182J4303
2109D391o859m91J5720j2196j6984J8667R291j6120K867M750j5408O788K2490
2122A6906j1230j6610J0790J010q972J4902N143k2515K518J9325r025o459J1242
2135G025r861j0647J9474O161j7959K756R457j2292L58J5540j1081j0903J7964
2148E992J655j5319Q358N510j4919M941J4465j2183p080J5774k044j2458R998
2161B690J960j5221R260J3892j4541m894J2989o581o746J3630k485j5210R963
2174a294J1955j2004j786Q817j1441l125J8318l168j4672Q447M974j0020N923
2187I24P573j4577l240J6267k048r459P885j380j1530R976Q885j3490j514J1333
$$ y = [10594, -8221, -7466, 12837, 2848, -9109, 3792, 824, -9367, 8501, 15293, -7730, -9912, 4391, -2468, -2959, 12761, 565, -16419, 2248, 11539, -4581, -1714, 3036, -12372, -5584, 16906, 5676, -10934, -144, 866, -8106, 6796, 11939, -10576, -8058, 11267, 2242, -4217, 7025, -2836, -13483, 5991, 12152, -5807, -3051, 6406, -5886, -5528, 10012, -1069, -11972, 5992, 7647, -7672, 686, 6196, -8723, -3782, 10683, -1500, -8580, 7194, 5150, -7308, 2690, 4650, -10571, -1311, 12581, -1960, -6854, 6135, -446, -7192, 6438, 3953, -11257, -1294, 10661, -1343, -3129, 5688, -5753, -8878, 9440, 6272, -8400, 47, 5021, -4999, 924, 8497, -6080, -9320, 6947, 4899, -4560, 3325, 1945, -9585, 391, 9276, -4214, -5728, 5605]
2201E605n343m065J0070m948j1051J0199P341j0423Q49P196q593j158J1375n845
2215A209r466R707L746q478M202L638j0575J220J1198n411o834P798J11o383P486
2230C168J930j1391K042R950m696k848O258m841n331R344J664r500J898N585m540
2245a308O32N928o650n462Q524J482o300L490J798o195L123N838n957l474N965
2260A434L83l367M104J04o658L357N776n604j792M486k266j186N354k403o217
2275d495K771M240k765j97J972m228j184O615l97n417K034Q55j753L801J916n026
2291a258j831M051P56j588J928q62l855L197L094l595r27J601j755PK790j313
2307D40k579J279J416j827j28K045j716k65K592j342j726K096M70o32L88J88j170
$$ y = [5605, 262, -3803, 6267, 1319, -9732, 467, 7808, -2615, -1766, 5430, -3163, -4321, 7054, 1209, -8257, 1450, 5196, -3282, 920, 4558, -6017, -4797, 6401, 990, -5844, 1954, 2065, -4318, 3168, 5098, -6293, -4251, 5699, 1003, -1845, 4413, -428, -5759, 3585, 5249, -4251, -2353, 3232, -1308, -676, 5252, -1398, -6860, 1664, 3146, -3154, 336, 2134, -4061, -938, 4900, -1057, -4531, 1434, 1817, -1550, 2554, 2658, -4000, -643, 5133, -471, -2263, 2223, -43, -1229, 4125, 1722, -4495, -1724, 2516, -249, -446, 1526, -2702, -3886, 2729, 2332, -3085, -1051, -196, -1949, 1852, 3768, -1258, -3089, 962, 1718, 130, 2058, 1196, -2659, 538, 3632, 37, -890, 711, -1044, -1037, 1753, 440, -2139, -860, 556, -1271, -1399, 646, -1070, -1335, 1257, -85, -1811, 285, 755, 123, 511, 699, -471]
2324d71J078J664o91k205N37K47j59J585k42k827J35J448p5K39m80j400j92J340
2342d69J134r68p67L20m38R65J630r85q96P77j35K97O90k13o40l6M33mn20M83
2362F58l56j075M31R2l98M50J32j010r6M46M85J37%k91m45M46Q73J70n16M01n19
2383A5J01J098l25n32J22l19k8M75k49j95m24j76K6k93M93K91j030m3N33l18R58
2404A80K72j285n3P83M84K16K76n36q76O22J577r40p99O18q40j34J928p17j706
2423i30L57N03l32J99O94j286q97K031K01k101J175O40j346J503J090k475J46
2440h28K163n85j156P45K73j569J912J979l435j131K691j130l73K545k399k435
2456b733K917J692k484k03J115k316M49M644j846m089L029P97k905L272J170m852
$$ y = [-471, 607, 2271, 1580, -625, -88, 159, 0, 1585, 1343, -1484, -1349, 99, 24, 263, -217, -1617, -1809, -469, 665, -303, -1070, -750, -1188, -223, 1407, 422, -474, 303, 168, 465, 1155, 942, 302, 266, 699, 695, 175, 658, 302, -773, -342, -250, -648, -198, -66, -1076, -1172, -726, -241, -104, -104, -395, -840, -394, 479, 649, 133, 534, 15, 116, 1214, 889, 357, 479, 160, 132, 607, 358, 163, -261, -437, -411, -704, -211, 80, -950, -993, -460, -778, 180, 452, -833, -886, -103, 381, 597, 873, 337, -539, 83, 1660, 720, -79, 539, -301, -435, 1493, 776, -930, -573, -70, -402, -203, 491, -795, -1692, 339, 540, -1561, -386, 254, -1092, 411, 1501, -974, -828, 1335, 750, -406, 339, 612, -957, 955, 2934, -501, -1632, 1059, -71, -444, 2101, -298, -2733, 184, 1876, -608, -811, 304, -2012, -1563, 3081, 1235, -2854, 175, 972, -1933, 1339, 2509, -2343]
2472b343J063M106k056k127K446o48l004L456K477n836Q64M577l913j228M436
2487B270k771k589N403L77n347J413L421l291j92M532m222l540P576O15o175K546
2503B6J150m996L800N464n945l805N334L01l300M496k53q343M406P559n520j991
2519a617L777m940j121Q494p04q108K666M381m334J573N071p958l577J0053n22
2534C134o043M806l45p024N002O084p445k358P486k266m708P018o76q583N942
2549B4N414q386Q25P264n620l148P495k916p286P609M382q636J163N678p221k06
2565c565R594n597p628Q727K272o381M549J891j0276J895J1338m401n954O352
2579B816k495n565R457K344j2288J715Q422m769k95O945p745p373J0749L307r053
$$ y = [-2343, -1280, 2826, 770, -1357, 1089, 441, -2563, 893, 3370, -2466, -1602, 2975, -938, -2166, 2270, -501, -3090, 2313, 2690, -2657, -1244, 2177, -1114, -1306, 3226, -996, -4536, 3040, 3655, -2520, 26, 1176, -3820, -20, 5444, -501, -4306, 1028, 1329, -1971, 2525, 2272, -6071, -1665, 5894, 374, -1617, 2160, -2780, -3901, 4593, 3889, -4219, -1553, 2828, -1506, 67, 5138, -2820, -6397, 3656, 3134, -2909, 1897, 1552, -5472, -470, 5614, -1831, -4189, 3297, 1031, -3677, 3341, 2665, -5918, 24, 5438, -2948, -2123, 5141, -479, -3627, 3868, 952, -6334, 1275, 5657, -2979, -1816, 3862, -3359, -3565, 6029, 432, -7196, 1531, 3803, -2578, 1971, 3862, -6414, -4519, 6819, 2418, -3536, 2816, 321, -5244, 4213, 6557, -5731, -4016, 4406, -363, -658, 6287, -1458, -8831, 1918, 5225, -3828]
2594c828L019M159q155K788R762q393o894R464M28n923P558J278j1169L336R132
2609F562p385l328Q832l593n750R079L77j1477N150O986q779lQ636o239m015R717
2625D770k578j0247P124N806p640K291O123r328j764J2164l266r418O678K050
2639B765o399P315M795j3282k514J1119j986l720O807m343r404R665P114j0650
2653b718j757N733n553J606J1430n557j1416O608M442n702M595M045j0074l94
2667d712J1594l488p408N697p87o529Q243M691j0438n99P797n277l458P977k658
2682F45o382Q044K686r808J890O539n955o94P746m775n022R172R64q758K494L715
2698B501n799L153P471p113n412P429on155M547M28p678M479P764o640m124M800
$$ y = [-3828, -809, 3350, -4805, -2017, 7745, -648, -7542, 1922, 2350, -3573, 3985, 5263, -5906, -2570, 6562, -823, -4151, 4681, 1088, -4662, 4417, 4794, -6683, -1533, 5453, -3326, -3329, 5307, -932, -4947, 4770, 2192, -8055, -931, 4875, -2765, -474, 5649, -3679, -5443, 6721, 3455, -5963, 715, 2765, -3634, 3681, 8476, -4806, -7320, 3799, 1813, -1907, 4900, 557, -8847, 818, 7932, -2718, -4475, 1258, -4295, -2689, 8741, 3184, -8232, -1624, 2818, -2884, 1711, 5756, -4318, -4712, 6882, 3394, -4014, 1683, 896, -5633, 2610, 7301, -3137, -3736, 4061, -1216, -4674, 3303, 645, -5737, 2307, 4993, -4815, -2925, 3614, -2341, -3035, 4711, -64, -5086, 4086, 5050, -3708, -1214, 2501, -3298, -145, 7326, 213, -5199, 2230, 2224, -2931, 1616, 2044, -5634, -1155, 6609, -31, -4155, 645]
2714F45k491k249P664R4q255K978N600m767p50M282m975j403Q515m25p496K729
2730c04K420m404K673L539o408j395P712m35n574J704l65l988N751M577o845k687
2746d029M996r30q31L588l310n196N495N404l531j832O32l631R98O861j997n594
2762b907K419J961k004K218K74n436J21N510j4k832J319j027k783L633J855m521
2778b214N19L655j144q70J538k176j980L681J649l526J16K328j438N4J740l311
2794a379j981M309J373k087r9n50j771J824K726k261k864K233J559l75J140j615
2810A82l700K058L726o87j362k61j067O23K470p84l206J09K576N46K96l53k689
2827a523q65L005Q95j652o19J22M03J570K00k468j455J878J718j23l60j200j032
$$ y = [645, -1846, -4095, 3569, 3663, -4592, -1614, 3986, -781, -1531, 2751, -2224, -3627, 4888, 4463, -3033, -304, 2116, -2288, 385, 3924, -2484, -3879, 3833, 3398, -2176, -472, -837, -4825, 926, 5503, -1342, -4029, 967, 37, -794, 2794, -516, -5712, -217, 5187, 1656, -176, 456, -3175, -2177, 4684, 2687, -2907, -488, 1473, -531, 1687, 1961, -3475, -3354, 2156, 2142, -690, 629, -398, -3181, 452, 2307, -2214, -1695, 1960, 816, -54, 1484, -692, -2672, 1009, 2658, -868, -752, 1576, 138, 192, 1932, -1379, -3360, 949, 2322, 235, 136, -414, -2185, -361, 2365, 104, -2760, -527, 1032, 657, 1797, 182, -3518, -1460, 2266, 1579, 217, -44, -1111, -488, 1982, 1198, -2008, -1899, 677, 1223, 1519, 1166, -1523, -2388, 617, 1512, -140, -759, -637, -234, 1336, 1536, -932, -2387, -509, 1209, 1086, 726, -474, -1506]
2844a506J695J183j349j312M20J034J195L24j952j642P09J898M92q87p82l55R00
2861F5J676p72k128k14R99J525N55r77j638l12J446O38n76q41j70L34J305K49
2879A164j890o90Q30Q16P01o76q28R9Q78O40p40j163J27J019P99M15j483j158
2897a140Q20P84L84l91j291k03J212Q93k61j822m98Q67Q49Q61m80j889L66J418
2915D79K03j58p08p13O95J539n3j074p59N49J83L70N85j428m64J457k55q60J24
2934b88m28j62R93N32j183q70J300K91n28P02n26j125J975J054j621l13J72l70
2952c95Q41J082p88j827P70J331q98m4N46k295L67K751j098j425Q29j70r05J799
2970D71N82k095k91K213p05r77K017r06k010K618P71k358J001J203j799k82J924
$$ y = [-1506, 189, 1372, 23, -1289, -869, 165, 1360, 1684, -268, -1910, -1201, 697, 1189, 302, -480, -835, 65, 1741, 969, -1159, -1373, -374, 1151, 1706, 729, -909, -1221, 225, 863, 287, -554, -724, -390, 915, 1164, -726, -1416, -586, 230, 931, 255, -573, -474, 404, 1044, 304, -859, -732, 287, 1086, 1501, 18, -1140, -320, 464, 848, 457, -834, -1037, 175, 1068, 807, -1015, -1513, -646, 203, 1064, 584, -1305, -939, 479, 682, 524, -184, -897, -202, 1337, 1284, 210, -549, 0, 183, 553, 1138, -290, -754, 703, 448, -412, -288, -716, -878, 115, 647, -536, -1406, -106, 185, -343, 359, -167, -1292, 683, 1737, 116, -197, -25, -395, 446, 1528, 740, -1087, -317, 1014, 116, 72, 618, -1677, -1310, 1441, 343, -1082, -253, -423, -1328, 471, 1053, -1042, -1333, 880, 175, -802, 1215, 309, -1701, 917, 1688, -670, 331, 1534, -265, -547, 1377]
2987A377j198j530K306K81l012J406J770l046R06K421k496j514L095P0k202J672
3003C06O95k861J419L142k682j475L076j271j780L489k95l911J767K448k674p6
3019f83K705k527k182L987M0l685K426J024l945K036L670l644j423L757j560k231
3035b235L996O31m849J762L318l460K97L803l487k705M798L18m004K640R93m856
3051c040J458N112l706k580M081j823k874N208J144o011J263L696l258K28M861
3066C759l703l849N067J204m107K743J623n708R00N837k977k719M222k349l930
3081c987N175K455o121J055L497m439J79O140l018m990M221J108m046M344K617
3096D190p049m17O191k362j869M743k873n568N605L692n210J77K892m887j58P350
$$ y = [1377, 179, -1351, 955, 1236, -1776, -370, 1400, -1646, -740, 1681, -815, -2329, 766, 836, -1366, 306, 1001, -1860, -441, 2701, 19, -1456, 1620, 349, -1431, 2058, 1763, -2148, -381, 2067, -607, -683, 2022, -505, -2687, 1300, 1340, -2345, 81, 1105, -2840, -804, 2866, -778, -2201, 1556, -4, -2235, 1761, 2392, -2457, -695, 2623, -837, -540, 3263, -224, -2929, 1869, 2187, -1817, 823, 1816, -3040, -1582, 3530, -176, -2756, 1325, -498, -3372, 1836, 2980, -3031, -1768, 1928, -1330, -1102, 3759, 56, -3793, 1274, 2478, -1629, 1114, 2737, -2971, -2071, 3766, 789, -1930, 2292, -57, -3987, 1188, 3643, -2478, -1423, 2074, -2365, -2186, 3954, 936, -4054, 167, 1275, -2771, 1573, 4190, -2859, -3276, 2915, 553, -1316, 3427, 554, -5014, 591, 4283, -927, -750, 2142, -2745, -2903, 4447]
3112D447k530n889M202Q58m103M085K827o708n59O009j989k805M858j529n770
3127d596N359L141n964P43M469m551r36N751k691m478N044J437n461K322L553
3142C142n400M2N877l834l643N758k7m520L636J542n898J455N743l776k683M899
3158B313j854l994N814R09o765K353M214m329K76M707m021l586N674L70m882L143
3174C42K616n640J131M891l870k168N260j672m331M460J686m810J634L226n028
3189b273o08O124j777l903L580m79m289M506L197n866j084M360j680n19M481k904
3205H66n838M305L933l387Q27J254n139M18O509j711m440J851K73k060M190K389
3221D240o424j504M500m43r18L364k472m210M157K948l878j74K073k839K09M720
$$ y = [4447, 1917, -3972, 230, 1088, -3015, 1070, 3897, -2811, -3370, 2639, 650, -2155, 2703, 1174, -4596, 763, 3904, -2060, -1317, 3152, -1399, -2335, 3416, 725, -3753, 1291, 2728, -2733, -411, 3142, -2258, -2216, 3661, -173, -3816, 1942, 1915, -2605, 1031, 2573, -3325, -1870, 3873, 97, -2586, 2313, 459, -3535, 2279, 3188, -3577, -1224, 2990, -1339, -1063, 3644, -377, -3963, 1711, 2081, -2801, 342, 2958, -2682, -1551, 3340, -530, -2698, 2562, 890, -3441, 1019, 2705, -2105, -471, 2755, -2273, -2881, 3243, 1466, -2437, 1143, 664, -3625, 881, 4078, -1788, -2872, 1488, -192, -711, 3770, 866, -4972, -667, 3266, -121, 706, 1960, -3179, -2761, 3748, 2037, -2403, -552, -279, -2339, 1851, 4240, -2184, -3688, 812, 369, -549, 2815, 343, -3867, 290, 3238, -640, -814, 1259, -1580, -1371, 3349]
3237C349j812l978K866P86l279K221K025l609Q2L495k205k337L250jk977K459
3253C35J052l131J237L151k945j967K802k28j046K950l78m285J387L103j815k54
3269c2J124k340o96L855L30l623q0J130j099J857K227l382k026K759Q73j270Q45
3286D52n74k088K440K626k119j694J103l31m57K585p13k637J128K089j528n80
3302b98L77j433M65K401m94k358M45J085o43L20N64j858Q0K918j46j743l12j53
3320g83j5J892P80j923r42J526N25l86K0j550p22J931J559j212j344k81j02R00
3338a27J123j254j373J096J300l89l06p80j047J268J847l71r90j77K51M77N07
3355A055n48j409L75J690K99q66q59r20L19J564J11j372n56Q63P86J14p81j258
$$ y = [3349, 1537, -2441, 425, 1211, -2068, 153, 2178, -1431, -1349, 2146, -59, -2396, 854, 853, -2124, 335, 1387, -1744, -507, 2644, -301, -2268, 534, 306, -740, 2210, 1832, -2453, -1066, 2037, 222, -32, 1092, -1248, -1944, 1911, 2241, -1382, -1462, -332, -1431, 426, 2653, -729, -2755, 4, 877, -393, 452, -122, -2210, 230, 2856, 737, -957, 146, -185, -642, 1943, 1230, -1407, -279, 1810, 282, -298, 79, -1354, -889, 1512, 1018, -1340, -895, 190, -453, -133, 431, -1427, -1347, 1571, 1425, -318, -630, -783, -798, 1094, 1874, -49, -991, 535, 1060, 674, 694, -856, -1578, 353, 1912, 700, -644, -925, -1027, -127, 996, -258, -1631, -535, 765, 376, 70, -710, -1757, -489, 1358, 987, -3, -180, 71, 548, 1055, 507, -902, -527, 1163, 1462, 596, -263, -1183, -864, 700, 811, -561, -1117, -254, 532, 646, -135, -1393]
3373a393k00J499J310o14q16m41K15J066L87j067p29M72J463K91n15j356q65Q95
3391c98J448l08q60o73K89Q76K05r51j085J25J528Q18n63q93p25O23J204jq23
3410a64m75N11R23N20o91j380m37J360J060o82n66l80k4J218k8j316q23O38J063
3429C27P35m20j244q53R11J416p03o20M2KR78Q06j245j421O54J135M56m4q11j020
3449i19M80J538n36j364L63J41L47J316o44k078L03J041K99k52M5o55p7J520K83
3468A151j927k22P80J12Q23Q44j997j067J945M26n13l47l45m55J148J488j748
3485I6j630J307K62k05J299o59j999J123J654j134n77M51o75k14K147j63k200
3502a117M20J330j172N27J168j913k88K401o62j778J108K37r86R99J120k120l21
$$ y = [-1393, -1593, -94, 1216, 602, -214, -655, -440, 626, 1013, -54, -783, -311, 1152, 1443, 928, -428, -1293, -398, 1050, 742, -118, -791, -502, 374, 579, -372, -1457, -1332, 196, 1014, 451, -442, -1167, -544, 660, 659, -164, -639, -128, 795, 1315, 624, -756, -1193, 167, 1227, 545, -21, -401, -425, 793, 765, -551, -1374, -736, 327, 1062, 642, -602, -1455, -544, 872, 169, -451, -409, -407, 571, 1377, 132, -1289, -635, 500, 956, 912, 101, -919, -439, 1099, 563, -801, -438, -297, 50, 1366, 722, -1356, -1053, -12, 287, 35, 80, -575, -652, 868, 1151, -776, -998, -218, -106, 717, 1561, -436, -1503, 442, 868, 355, 8, -337, -792, 356, 1844, 96, -1534, -227, 35, -170, 1129, 470, -1529, -406, 1248, 114, -463, -12, -687, -901, 1246, 1083, -1117, -697, 633, -539, -12, 1156, -757, -1045, 1356, 694, -1084, 24, 261, -725, 274, 1394, -726, -1047]
3519a047K517q97j638J308l03j250K212Q01k717l70J749m36l28J650j502j945
3535b196K455J781k495n9R10k050J137L115j832k577J927O82j517J700P86l310
3551a543P2L404j416j353J750j209j742K881Q20l170P19J968j849l18K547j736
3567a75j906K965Q32l342J534J669k871Q35K738k848j185L406k66k524J896L33
3583A091k980J548K929l062j303L027j368j821L412l86l870J937K714k779K12
3598f99K333k351j553L943j58l337K539R89l693J671L096l316p31L029j427k498
3614b163L364N49l509J413K026l506J99M213k455k631L278n47k553L492J069m375
3630b136M43L589j673r83L177k187l266M056J848l733Q48J728l768P10M553k259
$$ y = [-1047, 1470, 573, -1065, 243, -60, -1310, 902, 1703, -1014, -1384, 365, -71, -399, 1251, -251, -2196, 259, 2040, -455, -514, 396, -1654, -517, 2598, 766, -1811, 116, 798, -719, 981, 1767, -1543, -1471, 1933, 517, -836, 914, -295, -2037, 844, 1664, -1506, -787, 1181, -668, -986, 1561, -175, -2081, 884, 1716, -1626, -92, 1577, -1294, -459, 2279, -569, -1754, 1652, 1386, -1138, 758, 1091, -1889, -341, 2588, -474, -1777, 1250, -118, -1939, 1473, 1087, -2783, -846, 1868, -911, -699, 1634, -717, -2270, 1673, 1515, -1822, 717, 1706, -1987, -316, 2780, -536, -1267, 1762, 335, -2163, 1201, 1750, -1759, -346, 1680, -1826, -1627, 2586, 131, -2500, 778, 231, -2322, 1170, 2239, -2136, -1693, 1896, 223, -760, 2417, 230, -3036, 1020, 2868, -865, -17, 1711, -2057, -1347, 3206, 947]
3646I47l428K688J51k395K908J583m729k33M009j759q09L240k235l387L739K029
3662B319l126P86J950l497k36M525j427k894K787m43k851L016J783l948k74K941
3678A411k057p99L556j257l722K424J877k842J304K024l434o42L730p82k318K625
3694A098k21k944K195K495l169l26K417j870j171L301n21l300J996J301k804J026
3710d97K520k932j122L295j099k002K845N5k997J623K052k494kK357j662j558
3726a618L045j54k609J884Q23k751J343K103k382j197K502o56j991K390K52l035
3742b051J341K146k468J5K276j631j108K608k93k164J204J328k027L85K137k070
3758c72r82K611m50j827J693J01k042J098J629j916n22J953p89j509J918J02k160
$$ y = [947, -2481, 207, 358, -2037, 871, 2454, -2275, -2508, 1501, -258, -1067, 2173, -62, -3449, 290, 2319, -807, -21, 1929, -1568, -1804, 2721, 1294, -1600, 1187, 744, -2107, 909, 2692, -1256, -1530, 1411, -646, -1445, 2111, 854, -2868, -444, 1433, -1409, -105, 1919, -1515, -2157, 1573, 791, -1527, 1098, 877, -2067, 128, 2623, -546, -872, 1545, -325, -1496, 1805, 1284, -2016, -20, 1281, -1523, -497, 2023, -909, -2031, 1264, 165, -1837, 1008, 1063, -1934, -311, 1741, -753, -755, 1602, -60, -1618, 1427, 1273, -1336, 548, 1371, -1380, -37, 2066, -316, -1513, 989, 333, -1658, 732, 984, -2051, -710, 1436, -1032, -1017, 1259, -372, -1480, 1128, 835, -1329, -125, 1203, -824, -439, 1698, -372, -1354, 1257, 807, -1020, 673, 774, -1268, -170, 1459, -457, -979, 974, 185, -1324, 594, 696, -1464]
3775a464J393J312k090J85J608j143n49J729o99j518J404R37j688K94J184j578
3791f83J57J987j243j382J387M82j228J010J70j686J44J759n95r57R27m44p26
3808i21J550L48j802J70J009l85j7Q12r02p92J249L87j047J28N03o53L27R71p77
3827A58j133J002M25n35M12k23p61N30J146p49r52O44j13J10O48l18j170M04J036
3846E61j73m79l6m16R5J104J03j215L5K85K58N24L1q30l82O77M64l74l10k07k07
3867d92O00N85p27n71M36LJ85J66m45l52N17P95o68l79m3K67L02N93n76o21L09
3888a16M35J81j79m03m15M79Q64kr83m39K66K61M68j53r37O3P91J37p2o47n04
3909i05K62N63P23n58n58K73o2N95L05q55RN49M42k30n04m41K10L07M63l71o85
$$ y = [-1464, -71, 1241, -849, -664, 944, -199, -748, 981, 282, -1236, 168, 1105, -583, -289, 895, -683, -526, 1461, 218, -1164, 223, 705, -523, 487, 657, -1029, -885, 874, 279, -678, 249, -195, -921, 629, 977, -825, -655, 354, -31, -48, 764, -138, -930, 319, 706, -341, -213, 290, -363, -36, 935, 158, -975, 27, 452, -83, 329, 106, -655, -125, 1021, 272, -680, -36, -149, -39, 609, 291, -879, -475, 561, 388, -91, -127, -543, -448, 656, 759, -456, -421, -136, 122, 646, 677, -153, -535, 142, 606, 232, -78, -285, -492, 108, 693, -34, -605, -169, -166, 19, 185, -260, -612, -95, 700, 32, -347, -390, -123, 179, 772, 196, -425, -116, 319, 500, 321, -82, -497, -18, 846, 844, -139, -578, -312, -51, 417, 264, -673, -610, 181, 318, 246, -401, -905, -643, -80, 643, 85, -473, -200, -262, 333, 638, -217, -208, 341, 783, 553, 49, -392, -182, 125, 588, 217, -468]
3930d68R4O08j09p2n89m40O16J061j08q39m73J78N61O50j72j024l9J076K14o5
3950F60m31r55J02J172N60j013l97R3R1N24Q0j194m56J027O64l04k29n89n23Q86
3970b32P83m94p95O62K40J05K89n83q81P32J269l70o15J63m82L26R85o70j466
3989a034N13R86k21K12l61j387J96J746k56j144M30j69M6J210R0j791j49J510
4007D27J70p0M19j041q27J338Q27j347l19Q42o82M27J157j635j172J228O84o95
4025b69K96J74j343O97J586r89j472J398N7k54J057k91j902Q57J831j285n08Q91
4043E31p87k49J817j42k491M82J414r96O03J190k212q44K267nj445O02L35j069
4061i99J220J472k109j261K228l73q84J619l64j808J574J497k145n94J713j084
$$ y = [-468, -374, 234, 125, 53, -536, -976, -360, 701, 593, -246, -719, -541, 20, 670, 498, -526, -565, 511, 725, 660, 229, -726, -624, 548, 1108, 95, -302, -209, -118, 406, 486, -708, -1164, -137, 527, 223, -6, -595, -1118, -232, 551, 57, -738, -76, 164, 269, 558, -25, -906, -174, 1095, 725, 110, 273, -209, 117, 1102, 432, -1034, -521, 465, 244, 456, 95, -1292, -1096, 650, 394, -750, -320, -489, -443, 767, 857, -934, -1083, 427, 597, 527, 946, -95, -922, 416, 1243, -104, -423, 419, -263, 164, 1321, -314, -1486, -258, 426, -269, 27, 201, -1142, -445, 1141, 152, -1320, 78, 135, -119, 938, 647, -1255, -398, 1433, 148, -360, 531, -256, -505, 1312, 1170, -1321, -839, 575, -421, 182, 1372, -840, -1684, 583, 578, -867, -265, 70, -999, 221, 1693, -416, -1677, 551, 178, -706, 913, 549, -1259, 315, 1812, -333, -927, 786, -298]
4077b98k76J968o45k579J888J263k261N08J163j821L07K616j459k458J858Q71
4093F45j306J119P92k548l8L260j227j717J524n70j451K597R67l252N6K070j188
4110b67k32K055j432k354K916J049k646M94J063k302Q37L086j985k053K142M86
4126H57j990J428R07k780O34L096j933j539K325r28j600K485L36k748R13K237
4142A700j986q04K191j372j509K922K37l073J202J970k229L11J861k213j008L253
4158A453l04k525J150R31k240J524K098k855j144L131n50j462K002o63k789K269
4174B6K195k441n49J656j527n06K858p27k941J519J580j752O72J327k639m87K997
4191A261o77j657J669r6j979J620J672k550k86K455j394j223K544n95k242J984
$$ y = [-298, -574, 1394, 749, -1830, 58, 1321, -940, -432, 731, -1090, -783, 1833, 374, -2084, -226, 645, -661, 458, 1250, -1298, -1336, 1924, 697, -1020, 504, -66, -1517, 1080, 2047, -1205, -1149, 921, -267, -499, 1556, 124, -2230, 686, 1735, -911, -417, 646, -1656, -819, 2267, 282, -1771, 371, 857, -1133, 295, 1202, -1578, -944, 2152, 219, -1320, 1005, 77, -1523, 962, 1298, -1450, -537, 1700, -286, -1090, 1101, -271, -1780, 1142, 1379, -1694, -492, 1478, -751, -440, 1421, -792, -1800, 1453, 1149, -1376, -226, 705, -1535, -11, 2087, -768, -1912, 1219, 669, -793, 1209, 546, -2243, 26, 2221, -220, -769, 887, -640, -1146, 1712, 985, -1956, -437, 1143, -609, 63, 1390, -1249, -1736, 1261, 584, -1073, 596, 500, -1479, 141, 1813, -737, -1023, 1432, 38, -1185, 1359, 764, -1478, 506]
4207E06P66k506P28K173j772j090J943p97j641K440N93k707O74J711j779M49J864
4224A555j991j436K493N64j632O99N48k287Q50K627j576j548J779o66r92K168
4240A155O9k818O84J797j162j26J284j511j234K455L66k116Q76R16j688R15J677
4257A539j813r94J972j82j038J332J67j811O90J680j580o69J551q27q72J781l96
4274E30j681Q80Q61j290K1J242j152n67J810k80j573J348N65j576R26P92j222
4291c66m0J254n37q89J018L57j326Q58N55j515n1J475o80q96J040k16q61R63L32
4310D75j151M7Q62n91j63J195o46q78J284L65r28K15P36j072K08Q99n31o42P14
4329C98J5p98N91K40r14K50O07n49m68Q52k43m91N12ml89o4Q00o13J73O62n87
$$ y = [506, 1272, -1234, -506, 1667, -105, -1195, 748, -49, -1690, 750, 1343, -1364, -690, 1021, -758, -309, 1555, -436, -1872, 621, 1185, -447, 252, 800, -1487, -637, 1990, 414, -1134, 645, -21, -1013, 1155, 1224, -1594, -910, 887, -275, -401, 883, -628, -1862, 593, 959, -1157, -281, 635, -1053, -138, 1539, -274, -1268, 704, 522, -516, 816, 983, -828, -138, 1542, -38, -707, 844, 17, -855, 926, 530, -1151, -271, 590, -700, -679, 563, -589, -1156, 654, 374, -1199, 149, 714, -862, 64, 856, -366, -406, 848, 311, -578, 440, 797, -529, 329, 884, -631, -682, 793, 113, -783, 257, 41, -820, 143, 475, -676, -629, 233, -358, -521, 674, 28, -850, 434, 799, -129, 86, 822, -250, -42, 857, 326, -316, 398, 413, -385, 206, 446, -468, -218, 389, -160, -628, 224, -19, -510, 2, -2, -391, -455, 345, -268, -95, 567, -20]
4350b0l81P86O3n28K59J89o00L02N31n90l49N55L0m70J96O1m01n1N31m11r6N71
4372A77l88l52N82P6k27J89j42k0J87L49k48j96K77k11j48M02J10n52n8L66j05
4393F8L0n6l06j91M27J13l16M2qO0P4K19l12j15K54L6n6K46m2k18k1L65j73l98
4417b78L29K37k15K38k72j22M5K60n4k98J14j15K08N8j17m73qN36j42J50J51m58
4439b26j78N86M1m05K97j20j30K80J26l42r8M33M2k92R9j40q2L75n6m25p4K43
4461d6n9M6L65l61o08O25N24n38l2o7l05M04O55n08n32L18J80k8K75J53r64K07
4483b96O90l5l16Q1k44k34P51Q5p75j1M76k36r6M57o36o7P49J00p78Q9J37j01
4505b10O5N99o68n63J155R4o08M36k08p30P43R36q14o49N20k14J5P87l78j197
$$ y = [-20, -401, 385, 448, -80, 179, 368, -232, 70, 601, 11, -338, 217, 247, -223, -27, 34, -367, -418, 113, -298, -394, 177, -211, -563, 19, 95, -132, 57, -85, -105, 82, 431, 183, -13, 264, 53, -95, 307, 417, -135, -193, 173, 68, 98, 42, -264, -455, -28, 85, -231, -189, -197, -137, -63, 156, -156, -271, -17, 19, -37, 209, 167, -51, -72, 293, 120, -278, 51, 288, 73, 311, 39, -83, -38, 222, 168, -130, -16, -131, 77, 135, 18, -455, -463, 73, -69, 81, 232, -226, -404, 182, 223, -182, 115, -5, -135, 145, 271, -71, -169, 264, 306, 14, 113, -27, -109, 266, 210, -215, -289, -46, -105, -59, 306, -55, -663, -38, 486, -52, -84, -151, -456, -52, 603, 95, -437, -119, 61, 33, 308, 461, -503, -296, 394, 359, 43, 124, -120, -354, 397, 482, -293, -304, 172, -64, -160, 297, -339, -406, 343, 443, -335, -246, -109, -210, -145, 454, -214, -777, 378, 472, -136, 300, 92, -638, 105, 1041, 227, -422, 98, -116, -101, 686, 308, -889]
4525h89O46R55q26r1M32r02L5J344l81r56L57M52n10M19O51j330l27J568o7j022
4545d42R88l14r66J212L60j359J33J002n54k58N88l81j279J532Q01j785K10Q99
4563C87j009K54J374j355j140J658O11j024M42K43j340M87J994j258j050J120
4579C94j06o82J340J8k140L94J679p22n55Q31o63j202J783M98k002O23R59j321
4597h74N59J592j517q91J777pj323J088O91j584N27J441j829p67K267n44j328
4614g22J193J33j863J398J331k393n93J898l61m78J483q55k395J840J907j741
4630b18J44P74j794JK953o95k229Q66M84p85J514J036k724j112K577k05r54J212
4648H45p48k047J834J846k303m25J352j205l18K659p61k375J629P84j935J092
$$ y = [-889, -243, 712, -114, -205, 227, -675, -640, 704, 323, -633, -276, 176, -334, 85, 736, -594, -921, 647, 580, -442, 546, 232, -734, 478, 838, -521, -388, 614, 60, -198, 390, 9, -1270, 262, 1063, -722, -512, 387, -622, -368, 1006, -349, -1489, 169, 780, -244, 198, 441, -899, -412, 1582, 324, -726, 394, 288, -394, 946, 964, -1176, -782, 897, 175, -380, 451, -212, -1414, 369, 867, -1135, -512, 447, -874, -315, 1277, -240, -1131, 646, 639, -684, 404, 1095, -489, 38, 1479, -350, -1117, 1150, 606, -722, 471, 604, -1259, 139, 1470, -923, -1516, 382, 21, -457, 1026, 171, -2224, -384, 1523, -218, -74, 700, -1094, -1093, 1860, 1165, -1064, -198, 286, -499, 1015, 2051, -673, -1785, 792, 587, -367, 845, 97, -1950, -116, 1730, -573, -998, 354, -851, -1169, 1490, 729, -1646, -17, 767, -1168, -76]
4664g6J444k038q4K131j037j357J899N0j957R61J240j881K83K108j960j388K058
4681C96m5j417J892O4k645R35K309j403q06J241j156m57K557J65k623L56J194
4698E57j029O40J701k238j295K459K13j669Q76J80j888J314J873j798j313J893
4714D76m47j045J957j91k371J371J538j342n19J301j046n72K286m00k372J164
4730b12J316j510M23R97j968j81K520n49j787R82Q7j162J131J090k004m42J934
4747F65l38r33J375p34j530J638J367j779k80J044r62j95J752p63j496J420O11
4764H62j340L49Q57j355M8J516p38j109J147L14j175P04M44j483N29J436j109
4781a03p81J127k51m85R53J17j633N20J448p85k81P45j102m60J870K7j383J20
$$ y = [-76, 1368, -670, -754, 1377, 340, -1017, 882, 932, -1025, -64, 1176, -705, -422, 1686, -274, -1662, 396, 351, -1066, 826, 890, -1755, -820, 1489, 86, -720, 521, -635, -1092, 1465, 1630, -993, -637, 557, -472, 168, 1869, -369, -1664, 795, 1008, -661, 215, 395, -1493, -179, 1694, -104, -1417, 476, 29, -1016, 941, 750, -1621, -250, 1288, -54, -573, 728, -318, -890, 1396, 996, -1376, -212, 1104, -406, 17, 1014, -954, -1135, 1385, 836, -951, 31, 118, -1044, 87, 1177, -827, -1269, 665, 327, -606, 769, 35, -1495, 143, 1510, -269, -549, 495, -467, -662, 1090, 327, -1169, 251, 862, -478, -129, 728, -627, -579, 937, 199, -910, 237, 551, -624, 80, 524, -959, -430, 1006, -103, -884, 243, -8, -493, 460, 577, -1056, -536, 912, 127, -154, 591, -511, -971, 899, 926, -457, -337]
4799c37M95n32O88P71j285j056J568K69n59K78k49j223R09J251r93o44Q01l84
4817b32L4R86m52j078L56R38n60p4N56r05j3J168j67j053L76M69m98L81M15j006
4837c59j66Q09p8o47L35L9n25N93M71q41k54O70L7K1J49m14m71Q76K95o18j37
4858b15L59L7L2M44m53o66M59M05m60J14J30o39J65O88k07o03j4J74O8M34J09
4879C61r38M7O20N7j59J00j55k08O13J81n42j94M83q8J25J60m65k99L80J45k94
4900g0m2K9k29K79J05l06k21J15L66r4j28j7m0J94M18k95j33J0R8J60N22m37l56
4923g2O8L44o3j62n8k89L7L24j14k18p1r9J21J73J86k68k21K32K04m5J02l1k08
4946a28J50K63k06J35N2q6M1j05L7k72L63ok68j32K72k84J87O1n9l52K68jj0J01
$$ y = [-337, 158, -374, 314, 1085, -200, -1256, 312, 581, 22, 300, 51, -1172, -263, 988, -5, -649, 152, -232, -198, 788, 336, -742, -386, 552, -8, -82, 474, -431, -444, 724, 557, -496, -120, 349, -149, 232, 647, -359, -525, 284, 206, -441, -106, -67, -592, 1, 472, -369, -623, 47, 84, 105, 254, -160, -631, 245, 540, -78, -215, 144, 181, 213, 657, 204, -462, -3, 402, -58, 56, 186, -453, -288, 400, 193, -410, -424, -250, -182, 252, 361, -577, -530, 90, 147, -12, 88, -67, -275, 338, 519, -23, -217, 266, 178, 303, 463, -2, -301, 79, 224, -70, -112, -83, -312, -33, 72, -234, -455, -340, 26, -68, -196, -213, -253, -59, 359, 64, -69, -59, 39, 199, 721, 284, -72, -4, 340, 277, 115, 57, -232, -195, 129, 15, -203, -274, -373, -252, -79, 107, -161, -382, -150, 54, 9, 111, 80, -128, 22, 285, 79, 214, 266, 180, 221, 116, 153, -119, 244, 238, -30, -162, 110, -174, 13, 74, 15, -337, -69, -70, -80, 21]
4970B1m3j87PN07j24k39M4J71j95L27N1k61J85J06k53k12L41j33k61K54kj82m8
4993a26K00l00j84M59k75k08N79L5n68L11N67p57L46K92m56m6M84j23m16M87j3
5014B88n23L74L19m92k21N47m01k32N27m4n51K43J77l71R0N91m92k89M89j3m93
5035d77P61K44r15L46N30n40m0Q29o65p20J094N2o90K83K57p92pJ168q17m87Q25
5056B39k00o15Q73M1q94K52O97n31j16J029p15q67J140l8q25P47N80j224j05J324
5076G92n95n24J019m68j144J046Q15j290K27O66j003k64J754n88j296Q67M1p51
5094f96R13R30j684l28J294m07l36R46n30j416J437P13r98R9O14j138l5J492k08
5113F62j521R93M90j275R46P48j569k54J327l66r33J292j03j534J274O96j556
$$ y = [21, -22, -209, -202, 305, 181, -58, -14, 157, -38, 289, 340, 79, 264, 370, 117, -95, 246, 113, -148, 106, 104, -78, -126, 74, -226, -410, 49, -226, -434, 145, 180, -388, -77, 490, -267, 79, 371, -85, -131, 353, 230, -186, 301, 288, -235, 139, 458, -34, -255, 292, -109, -341, 186, 142, -409, -166, 11, -360, -270, 321, -171, -460, 29, 16, -477, 284, 528, -387, -41, 489, -51, -91, 738, 73, -647, 447, 499, -191, 92, 349, -443, -450, 718, -99, -586, 239, 39, -576, 297, 338, -556, -304, 393, -138, -254, 775, 60, -807, 333, 295, -530, 217, 797, -427, -532, 792, 197, -327, 692, 224, -920, 126, 941, -349, -122, 544, -459, -723, 1031, 443, -853, 14, 55, -696, 217, 1147, -537, -865, 429, 22, -314, 632, 102, -1314, 123, 836, -162, -63, 551, -587, -622, 870, 662, -859, 134, 624, -651, 295, 1043, -526, -780, 547, 181, -752, 540, 437, -1097, 177, 873, -683]
5130f83M00J374j309o15J465l51j156J443K59j834O33J489j262j66J230j143p67
5147i93J651J97j604O79O95j537O07J603j418j025J639k60j049J360K16j950O85
5164e04J366r86m03J341p18r29J484O8j650R94R14j530L20J227j171n80J580m27
5182C96j412R47P27j221O00Q74j957j18K325r80r49J014k17j059J489J067k024
5199d98n26J479l48l77J752r66j947J364J130j209J80P80j476o0J949n42j695
5216a010R66K93j189J010J058k023mJ700r41p73J652m77j072J017O81j445K95
5233b62J420j325n65J613n67j048J546p1j813O61R78j005L36Q73j211r72J781
5250C69M81j423N15M01j455J205J483j515j176J216J5m46J179k9j753M88J538
$$ y = [-683, -283, 1091, -218, -833, 632, 281, -875, 568, 827, -1007, -374, 1115, -147, -313, 917, -226, -993, 658, 855, -749, -70, 625, -912, -305, 1298, -120, -1145, 494, 234, -815, 545, 761, -1189, -504, 862, -124, -527, 814, 96, -833, 651, 719, -931, 63, 977, -553, -233, 994, -177, -757, 823, 396, -1016, -69, 658, -563, 37, 911, -1046, -1164, 1161, 181, -768, 246, 29, -1030, 459, 1526, -498, -1024, 455, 107, -270, 1482, 516, -1431, -67, 1063, -146, 34, 814, -662, -722, 1227, 685, -1010, -44, 249, -940, 70, 1128, -895, -899, 801, -140, -913, 739, 262, -810, 207, 888, -557, -262, 1158, -167, -732, 881, 314, -734, 812, 741, -1072, -411, 567, -438, -102, 771, -440, -1412, 369, 850, -573, -58, 343, -1112, 93, 1576, 61, -1115, 101, 116, -330, 849, 820, -933, -445, 1093]
5267A093j105l89R00q13m20J720j08j884O05N72n48M16O09j008o97J685p5j222
5285f69N90L01p89P86Q17j208m46J394n56m07O95k17r90R67O48j209p5O41l87
5304a14k20R66n74j046Q32R33j117J48L24q00L36J132m88q82L42P03m98L10K22
5323E09j156K17J169j67p78M02m50k64R87K18j148j35P13j48Q1K51n31p49J131
5342A52M60p68KK44m51L43M83m33n51N10L89k12J65l1p44L32Q53n95m47L54k67
5363b12L1M97j32o58j14Q49j35r9K46n62j17Q42J5p66J11K54J74l7J03o05k82
5384e97Q29K64m52n0O4l54L94L59m85m22L71K50j23K08l06o39M82N21j0o66L84
5405B2m4j5M84n07l58L17L72l3Jm58k52K59P49j29n74L4Q7M6K08J88p69j22P01
$$ y = [1093, -12, -401, 499, -314, -734, 986, 878, -1006, -401, 171, -377, 39, 648, -360, -1057, 628, 553, -669, -79, 222, -567, 219, 1036, -172, -618, 776, 220, -187, 508, 291, -699, 268, 916, -293, -368, 273, -114, -334, 632, 58, -988, -156, 777, -340, -192, 132, -668, -332, 800, 312, -570, -228, 475, -23, 287, 509, -647, -430, 739, 572, -206, 196, -254, -518, 469, 687, -461, -596, 117, -31, 50, 301, -230, -979, 152, 612, -156, -154, 90, -361, -18, 465, 32, -519, -9, 380, 168, 333, 302, -442, -110, 743, 148, -299, 55, -212, -181, 316, 184, -474, -588, 261, 126, 27, 273, -289, -406, 436, 451, -315, -204, 50, 224, 187, 290, -315, -597, 232, 496, 44, -6, 58, -296, 98, 457, -28, -450, -79, 171, 48, 256, -50, -689, -207, 314, 304, -362, 22, -22, -37, 447, -60, -418, -101, 271, 238, 239, -219, -471, -212, 537, 408, -166, -132, -45, 1, 209, 397, -372, -494, 207]
5428B07r7R5j83l91L65K37L12n39l07nM10J09J67n05n63O79J55k9j96o1j80K98
5450b2L15j62l99K16K01N3K3j25l62K39L21r6j88M1k50J18M69l23n27M2M40J70
5472A94j46l4l67J27M37P7n42P3Q7K41R5J69n33l11O57J90k17p2j83k77O20K46
5494E31m97l94J77N6K47R9l80l83L56L29j15j51J42l12J68M55j02l64J39J43l92
5515b48M15K10n20J10N75l10l41M2p5J3K75J08o16JP53l74k99L30m81k0P04J05
5537C57n38k07L38j02O2Q08o99q10Q79M93n31L94j80p15L37Q01l69p70N87j10
5557B5m75O58J20j005K63O77n45j75Q22n72j67O99j67o79N73M37n81L5N23n11
5577d5l84J121j7j252O06M10q24N15N19j177j01Q55o6o19O77k11r50Q81O33r78
$$ y = [207, 110, 205, 22, -369, -4, 233, 545, 6, -301, -306, 104, 213, 380, -125, -688, -9, 146, 117, -79, -140, -320, -22, 293, 131, -268, -52, 149, 202, 225, 100, -262, -23, 298, 202, 14, 55, -195, -77, 392, 69, -458, -416, 24, 194, 48, 14, -353, -226, 211, 288, -254, -181, -94, 147, 242, 411, -122, -433, 224, 414, 197, 125, -58, -335, 285, 531, 34, -360, -183, -127, 120, 219, -161, -544, -188, 141, 26, -125, 17, -295, -127, 328, 226, -138, 1, 144, -248, 167, 377, -143, -33, 542, 232, -109, -67, -142, -129, 146, 254, -362, -361, 392, 18, -281, 49, -432, -452, 252, 357, -181, -388, -50, -152, -90, 718, 19, -791, 88, 581, 50, 444, 264, -451, -114, 687, 318, -452, 135, 25, -450, 208, 328, -677, -414, 263, -282, -457, 365, -207, -374, 325, 158, -521, 52, 489, -92, -57, 466, -45, -429, 692, 675, -577, 29, 439, -385, 130, 649, -528, -629, 226, 160, -459, 218, 7, -943, -62, 571, -407]
5597d07o7Q77p22q4J045k17j137R38K73o53J99Q30q67m02J018l02j002R49J9p99
5617e11M36N28j011N6J139q72o71J007Q3q43R23N96j459K16J079q73j37J124q35
5636b5p90J358K94j186M26N74j200R9J313p77q71J232j82j210J123N39j400Q2
5654f01J247r89k55J237m82r15R73N02j365N07J086j433J1J381q32o54J159j55
5672D22j062N80R40j370o8J344r60o54J480k99j323J228J96j302O34Q83j011k14
5690e56J306n19r37J291L9j517J114O51j171jJ109q25o60J293k69j184J010M64
5708F38j476M60J075j008l99J302m78q34J248jj466R47P91j118j3J099q81o42
5726g56J375Q5j454P25Q09j328N38J050j294l87J204l05q93J256j14j429R00Q46
$$ y = [-407, -474, 403, -319, -403, 642, 425, -712, 226, 499, -154, 45, 875, 8, -394, 624, 322, -680, 269, 288, -511, -75, 453, -558, -502, 637, -235, -906, 101, 184, -659, 264, 860, -599, -383, 696, -177, -314, 810, -25, -815, 543, 837, -349, 77, 651, -549, -450, 863, 86, -785, 447, 265, -945, 178, 717, -683, -601, 646, -343, -598, 639, 157, -758, 215, 717, -648, -141, 945, -488, -477, 904, 72, -582, 577, 422, -640, -60, 880, -490, -558, 786, -174, -828, 652, 353, -970, 258, 454, -848, -214, 669, -342, -556, 750, 231, -706, 585, 624, -893, 221, 872, -299, -300, 809, -16, -676, 617, 348, -836, 174, 638, -838, -378, 697, -311, -710, 592, 114, -720, 528, 527, -939, 8, 799, -319, -332, 767, -114, -756, 619, 704, -750, -25, 784, -544, -6, 1044, -250, -637, 567, 262, -631, 625, 511, -918, -18, 828]
5744H28j116m3J068r37m04J182j60j303Q80N58j131N26Q61j127l59J141m27p55
5762g18J009K57j276N60Q42j057J54J053q61p17J158P2r60R43N8j303L03J108
5780F25o08m04P59l37q44J153L71j133P0P38p70J23J006q56p66R38N10o48J68
5799I5M84j115K57J324r46o37Q41k17n74R00J2j065L10P23n99j05O62m30p30J036
5819B26K86r72K98N55p08K27O61q54l32R71j12m48L84J58p90L55R12r94k56Q14
5839C81j97m42N19j45o86N22M02n34m00P94k90l23Q38l41o92M98M43m73J15J08
5859I7m47K65P35l52o48L08K94l38K53L29q95K0O12j88k46J49k36j77O45J40n48
5880b28j24M39Po0N28p51l53R01J2j07k48J05j96L31L52m78n58L84K79j74n1j86
$$ y = [828, -288, -331, 737, -200, -604, 578, 418, -885, -5, 553, -578, -52, 809, -318, -677, 464, 37, -718, 291, 548, -728, -168, 674, -383, -229, 824, -37, -754, 404, 476, -484, 459, 517, -786, -483, 625, 17, -387, 372, 35, -809, 344, 715, -418, -348, 390, -380, -257, 749, -107, -873, 65, 575, -73, 95, 579, -536, -279, 1045, 99, -538, 303, 86, -488, 412, 424, -641, -331, 392, -207, -312, 350, -80, -810, 226, 512, -460, -162, 393, -315, -88, 573, -281, -613, 358, 246, -202, 182, 340, -450, -95, 817, -177, -433, 381, 184, -258, 261, 116, -570, -48, 354, -180, -580, 214, -76, -399, 439, 98, -594, -96, 347, -126, -11, 97, -350, -85, 650, 298, -350, -42, 252, -86, 167, 496, -399, -379, 233, 45, -201, -52, -288, -465, 180, 320, -228, -352, 87, 94, 34, 562, -189, -542, 359, 371, 264, 16, 121, -75, 256, 608, 130, -428, -44, 235, 61, 10, -176]
5902a76l17K18O21n05j23P2j5Q6L27j01n09J10N31Nk79J03j42j39P42pl89j75
5924f2J41r7J48J46l03l76K51L63k22j61j22OK79K49k90k47K24J53P0Pj96m03
5946d42M47M22j35j35j23j58K54M35l43l92M5J27J25J17l46l72J85L39J05l89
5966b34j18L67j40K82j23n15J36M61J23n4q6k43j61M97M08n56k74L09j65K88K07
5987D09p30j02L88L66m02M1k79n9K54M91l18m69N5L45l8L87l16l75P6P34j91j94
6009G3m1k34L01R6J30n73j51N84j44j7K27n47NL89K24n03M1M3j30N31J02o95k81
6032e70N60K80k60J48k12n76P51M60n97m94M92J9J53L46m43n08L69M71j58k47
6052a6K11m83J56N96k16n35J67K54j29K30R7o89o7O37N7m62J81j20l55Q47L15
$$ y = [-176, -493, -275, 346, -159, -282, -210, -225, -139, 188, 87, -422, -312, 219, 224, -55, 48, -94, -233, 509, 502, 113, -62, 79, -18, 130, 276, -27, -403, -152, 211, -11, -172, -294, -288, -9, 240, -50, -297, -73, 80, 150, 157, -39, -442, 5, 427, 292, 157, 34, -124, 130, 565, 222, -170, -125, 2, 127, 244, -102, -474, -289, 50, 155, -234, -352, 15, -125, 157, 34, -481, -345, 116, 239, 185, 99, -144, -305, 192, 600, 44, -230, 79, -86, 202, 409, -321, -423, -35, 331, -71, -30, -309, -368, -114, 377, 59, -410, -355, -10, -48, 339, 23, -352, -276, 458, 267, 73, 32, -202, 99, 195, 325, -248, -399, 185, 41, 24, 251, -296, -291, 98, 322, -181, -140, -97, -227, 304, 406, -289, -570, -10, 270, 10, 158, -54, -630, 121, 581, -16, -510, -18, 1, 154, 500, 57, -451, -82, 389, 231, -16, 195, -288, -132, 464, 248, -287, -120, 134, 5, 235, 332, -357, -424, 213, 270, -192, -11, -131, -486, 361, 676]
6073F76r39k44P36l71j2M65m68m23P85K43n71j19M61n57R5P84n16o05O32K83m88
6094a53L9M37q81L19Q59n96o42N13K23n66O68J56r86L83Q80o02l60O85n73m80
6114f77J275jj111J37N70m40K53O85q72o02J049K51q53L06L47r62M84R19q67n93
6134g02J015l65l48O25J94j031N48P95r37j77Q41n84k07P81p7r72N80O43p65j55
6154b98P01q31k44J523n91j222R80K8n96P40L69j167K7J106k02p75Q64k12r73
6173g73R46Q80j368K09O51r25J55J006n13r18P55L95j028M50P75j076k37J131
6191E15n97m88R43l4j130Q27N07q11K67P55p54o62J251p9r46Q41J54j287N42R66
6211G80q44l52Q65o19n79J305J29j495L02Q21n22P9Q44j037q05J555K3n77L17
$$ y = [676, -263, -507, 229, -142, -154, 311, -157, -580, 205, 448, -123, -242, 219, -338, -243, 541, 25, -580, 52, 335, -153, -114, 323, -558, -239, 620, 24, -618, -105, 118, -448, 220, 376, -610, -227, 653, 51, -309, 376, -197, -677, 598, 597, -514, -377, 193, -247, 6, 691, -181, -783, 266, 517, -336, -30, 317, -645, -161, 758, -109, -702, 313, -52, -400, 225, 419, -612, -64, 731, -206, -383, 458, -126, -333, 448, 371, -601, -21, 622, -143, -298, 403, -428, -672, 851, 260, -962, 18, 46, -550, 190, 559, -608, -581, 525, 323, -452, 412, 200, -773, 173, 1053, -315, -106, 545, -380, -225, 781, 268, -650, 105, 500, -528, -78, 697, -379, -616, 515, -82, -570, 373, 339, -791, 36, 543, -268, -1, 754, 0, -662, 589, 510, -436, 405, 559, -728, -186, 780, -64, -416, 449, -170, -749, 556, 685, -810, -508, 313, -209, -130, 714, -323, -1128, 427, 450, -127, 190]
6230A90R6r10M59J252j014n68P99l57l62J033r4j338N47Q05q49P5R23j079n79
6249i71J518j85r67O48L00j058M52J027q52n17J151m48p95J201J23j038L24N28
6267D41q71J96R33p24n73P60l9o32O14N51j231J4R02m74k15O39k32q49R23M17
6287E50q99L10O25q76n9J192p11n12P06j52m91L98N68j129K87O68m66l97R48l70
6307A90p75P30K09o49M8N60o93JP60k69n12P63p7o55M13L20n20q6O68n84j76N68
6329B34K83q81M10L26q33K37O52o01r7N11l33j90M43J70p92L55M61n58J67N22
6349D86m38n13P98p9n98M30R8m93K86L41m63o6L94l19k24P41k00m67K56J50l51
6370b31J40L44k72l32O41k45k10L93Q5n06R2L42j81l33M94k18l19M81q8k4l2K82
$$ y = [190, 286, -624, -165, 1087, 73, -495, 304, -53, -415, 618, 524, -814, -267, 538, -311, -236, 687, -392, -971, 547, 362, -605, 43, 343, -715, -263, 764, -88, -605, 546, 98, -697, 504, 627, -411, -87, 441, -430, -234, 699, -25, -598, 162, 123, -509, 105, 656, -575, -561, 341, -133, -348, 291, 59, -790, 133, 550, -349, -39, 586, -290, -349, 843, 132, -380, 326, 174, -317, 81, 649, -480, -193, 475, 9, -388, 560, 190, -585, 145, 354, -295, -247, 313, -380, -379, 381, 112, -400, 363, 286, -369, 44, 364, -156, -242, 426, -158, -334, 234, 517, -364, 46, 372, -461, -224, 428, -173, -270, 241, -92, -282, 161, 331, -461, -106, 355, -203, -36, 486, 48, -465, 333, 254, -344, 86, 184, -309, -23, 318, -145, -211, 183, -136, -360, 381, 181, -286, -30, 120, -231, -91, 253, -19, -351, 290, 45, -165, 228, 313, -193, -101, 241, 60, -273, 221, 3, -316, 165, 77, 53, 21, 303]
6392C03m64J25J95r4j96K85j50k45K47K50j86J2J97l39J5K16M1n24K22K72l63
6413a81L33P9m47P5L18Ok72L9M7j08J51J92k89j73K82K4j65N53l86l33J92K86
6435B23k21Q4p3j85J41J95j56k38l2K85l43M10O9l86n7M60k09OR6j85J47J91J40
6458C62m32J62P1J42j68L5k51k01M44J19n34L7J17O5Q4K8k12r7J23P5n4J96m5
6481F6j53K28J53j69j77L2J21p8K88l68k00K64J72J91k86lk43l7L61J0m57P6J15
6504i4PJ49q7k87L2N66p1k50P7k01J21K01J67m23O0J66R9j43N5j18k18K15L10
6527C33k91j15Ojq6K87m28k08M64J78j75L5o5j06K44L12l07k65K89M4j27K49q8
6550A79m26K74L37k30k65K02j76k89M46J43n84p0O25k87k1M31m39j44M31P1j83
$$ y = [303, -161, -36, 159, 65, -131, 154, 4, -241, 6, 256, 70, 82, 279, -60, -45, 171, 212, -312, -90, 182, -181, 152, 231, -216, -141, 177, 183, -89, -50, -3, -111, 40, 232, -57, -230, 52, 76, -89, 464, 78, -255, -63, 223, 2, 86, 13, -172, -31, 164, 8, -230, -262, 23, -320, 90, 159, -227, -284, 176, -33, -27, 69, -116, 31, 222, 362, -70, 92, 163, 305, 137, 172, -79, -280, 164, 283, -251, -214, -97, -32, 52, 80, -132, -229, -106, -31, -85, 111, 66, -87, 141, 294, 125, -52, -20, 101, 23, 311, -57, -257, 7, 179, 370, 84, 81, -162, -199, 162, 172, -285, -209, -94, -87, 62, -25, -312, -280, 286, 215, -35, 42, -159, -38, 163, 330, -93, -33, 133, 232, 89, 144, 26, -192, 23, 333, 42, -73, -67, -68, -154, 133, -295, -503, -39, 139, -36, -1, -66, -172, 72, 384, 77, -188, 101, 145, 18, 267, 179, -247, 27, 364, 134, -131, 71, -105, -394, 52, 195, -389, -459, 166, -121, -142, 289, -150, -294, 137, 208, 25]
6571B5m4J18l45L32L28k82l85M37J55l29L53k74m93L00N41l98l76M24j79n0M76
6592C34k48n79L43M50l79n8L84n39j34Q17N4q97L96K57j85K37L04q98o6Q12k21
6613A84l35J42M1m26O15J72q07l9O04r6k42M73k96o13P96L22p07m4L37l13J31
6634a01O19k33p16M16M27o37N79M5p44R5O85l44l45K58q9n05P49L57j177M50P87
6655E76p50q8N72l68m00P50J95r66M00M54n20o9N49m88l34J039j72p72L33O8k78
6676b69M74N38r81m51R45o4m27M54k32o77O37O79o71k14M11k63k79J023j45j213
6696g25N26N65o53K78O38j036j37J066j28q75M39L33q55M83Q00q56m63J037l35
6715A02m69O29j32o61N79L41q17J63P78l60m62Q31l56o23P59M67j078J72M27n30
$$ y = [25, -19, 99, -246, 86, 414, 132, -253, 184, 339, 10, 363, 89, -404, -104, 437, 39, -337, 87, -92, -142, 334, 86, -493, -150, 300, -79, -137, 247, -292, -426, 391, 445, -452, -56, 201, 16, 253, 557, -341, -407, 405, 184, -151, -9, 32, -394, 221, 393, -414, -453, 151, 55, -187, 286, -10, -623, 173, 495, -212, -256, 81, -232, -101, 518, 285, -431, -15, 412, -225, 354, 399, -345, -250, 435, 91, -254, 4, -85, -590, 159, 516, -661, -211, 576, -174, -262, 310, -58, -458, 292, 487, -479, -79, 375, -145, -214, 335, -153, -487, 552, 380, -392, -59, 9, -269, 205, 743, -238, -689, 256, 192, -235, 219, -13, -690, -53, 626, -45, -259, 152, -111, -390, 633, 488, -725, -199, 366, -287, -9, 629, -407, -544, 522, 394, -481, -42, 291, -564, -81, 719, -137, -600, 437, 102, -367, 262, 130, -531, 48, 389, -428, -265, 513, 153, -309, 522, 166, -457, 302, 769, -309, -137, 290, -240]
6735b40o5R78n60p36O76J97m32M69J50q61r3J258o39m28O53l41m97O50L43q72
6755c90J39O64o04p1P35n59m28P63J57r39L36N69n15N3O02o35m31R43j10o41O27
6776B65M8q83N23Q13p53p00R71o8m76P31m95n96N70O02o50p6M03n93l1Q30q8q15
6798d68L28N19o57L57L76p52k68Q32J11n47L24k1n63M24N53p97L4L51j42k88O34
6819C40k09o72O64L48p77J85K45j22k84O77q5o85N61K14n12Q9K29m15M0N86l97
6840B0l34K33J81l33L44K53p28p7P58k75k30L61j81m91O40K01m91J16J47j15r5
6861i6M19k34l24J81M88n15o4L85m78J55K63k85k22L76p3j81K97J40m07P0K99
6882A94k29j09K79M0k46K41j0l56K16K43o8k08K34l14j39M83j25m31L33l7m5K8
$$ y = [-240, -305, 673, 113, -623, 53, 250, -182, 287, 437, -424, -517, 741, 102, -326, 327, -14, -511, 139, 482, -390, -251, 413, -191, -262, 473, -86, -514, 249, 406, -533, -197, 372, -143, -90, 512, -123, -554, 389, 279, -362, 265, 313, -570, -47, 766, 13, -687, 284, 216, -260, 471, -24, -620, -50, 552, -98, -174, 229, -364, -395, 435, 347, -468, -140, 379, -278, 79, 455, -297, -565, 267, 378, -169, 155, 134, -429, -5, 548, -249, -215, 136, -6, -294, 340, 131, -541, 123, 471, -306, -121, 124, 2, -282, 395, 310, -375, 186, 400, -112, -23, 206, -209, -169, 417, 20, -314, -81, 100, -233, 111, 364, -364, -441, 317, 42, -188, 173, -8, -499, 141, 342, -149, -33, 114, -1, -96, 323, 89, -235, -54, 434, -81, -145, 240, -238, -83, 180, -105, -327, 49, -24, -205, 92, 232, -175, -105, 194, -35, -144, 135, 175, -71, 170, 160, -196, 20, 263, 195, -13, 221, -93, -232, 251, 126, -305, 28, -9, -54, -26]
6904b6K78l41j0j2J41k92K19p1l02M09K42j80k41K41j23P9L10k29j85NK94k28
6926b2j72L11k14J43J43k20k75K63J11k76J73J98k94P2J33P2k66J74ok29K83q0
6948B2j58J79K5J22k72J61l00L23m2N9k17O1Q3j49L12o7l22J67J00O1k46N5J15
6971G2j35m1K72j35o3N2j33R7R2k5j61KJ48Q7n1N5M2k94J34P2j14k3L61l82k6
6996i7K59j66j88J52J01j29J70m4j70j29M61j69k80L68j54j44K17m4j95K40J3
7017G2p5P7J50j27n6Q0K8l41L13j6k81J28K84j49o9J44pk85J92O2k66O7K45j88
7041a8L4k9M8k36M33o5l48K56Mr3k6L22k83k31J60K26l47L16Q8k81k6K88k78o2
7065a48K40r0j75K48J00m54M45j28j81p3N61n35J30L73l69j18K34P0l03K08J84
$$ y = [-26, 252, -89, -99, -111, 30, -262, -43, -114, -416, -7, 235, 55, -186, 55, -68, 11, 321, 92, -93, -88, 206, -22, -194, 117, -97, 46, 189, -31, -306, -43, 68, -208, -35, 163, -131, -59, 74, 146, -120, 54, 48, -181, 102, 22, -136, 43, 68, 190, -82, 79, -221, 102, 60, 119, -98, -37, 46, -103, 209, 142, -180, -13, 87, 148, -98, -43, 72, -63, -104, 168, 33, -30, 22, -111, -14, 78, 53, -108, -106, 42, 129, 78, 133, 175, -119, 15, 87, -27, -50, 311, -71, -97, 162, -4, -192, -40, 61, -68, 102, 58, -112, -241, 220, 51, -229, 139, -15, -159, 58, 14, -181, 59, 72, -3, 74, 224, 97, 41, 121, 149, -192, 121, 105, -176, -48, 236, 87, 18, 162, 155, -130, 62, 124, -142, -75, 170, -18, 16, -13, 35, -201, 232, 167, -181, 75, 79, -14, -40, 282, -1, -232, -72, 154, -193, 123, 211, -70, -96, 192, -86, -148, 92, 2, -173, 75, 175, -279, 166, 38, -143, -216, 345, -190, -60, 313, -56, -174, 60, 130, -173, 35, 219]
7086B19k50n5L14j65l20K68R9k79K23J91n27J12J06P7j09J01k0k77L82k1k62R7
7108i6L51l49j2M66l01k57M04P2k72J06J40l46J4L47j59n37N06Oj99K01k9n18
7130d62K47O39m82j13K04p8l23N95j67l39J56L56k78q7M64m38j03N60j88m57L69
7151G5P5l74K25K27m63k07P77j19l43K26o9m10M36M23o30R1K41k92mL29j43m63
7173c92M32M55o61j6M67m54k14R63m01n67M79J85n20K40L93o53k7N33k26m26L61
7194d9N7m46N85K22n72nM06j48j99L61j09m39O40L81j034K09N14l79r6O10m85
7215B4n77P22J69n80K59J99n88J69P53m51o25P04R6m68N25O4p37J82N64m86j6
7236i8L89j07m22N34Q3p65M26K34j44k23L89m62j64N00J16o64L63L01m64K64L40
$$ y = [219, -31, -86, 228, 63, -257, 11, 110, -169, 54, 245, -282, -170, -64, 13, -96, 5, -15, -292, 90, 69, -193, -96, 255, -94, -106, 360, 59, -198, 206, 278, 6, 112, 252, -94, -80, 267, 108, -429, 77, 83, -116, 85, 56, -462, -215, 424, -58, -171, 33, -45, -368, 227, 60, -279, -123, 233, -45, -132, 332, -106, -209, 351, 163, -294, 75, 150, -224, 1, 228, -235, -442, 335, 216, -127, 99, 30, -380, 56, 479, -151, -60, 181, -111, -115, 214, 71, -392, 40, 495, -166, -182, 285, -169, -383, 580, 179, -388, 91, 276, -244, -4, 389, -264, -291, 242, 16, -410, -49, 8, -438, 147, 369, -203, -208, 198, 50, -149, 212, 103, -336, 304, 685, -349, -140, 374, -5, -101, 509, 24, -553, 169, 338, -242, 17, 216, -372, -203, 550, 99, -526, 178, 274, -194, 331, 395, -342, -160, 404, -82, -98, 291, 184, -238, 296, 379, -386, 40, 274, 130, -93, 296, -166, -330, 170, 286, -378, -15, 286, -178, 86, 426]
7257D26n18k12O99k84k59K33J9l98L00P16p57k44M28j48k24M87K1o90L38M76o19
7278b10O5L27m00n1N42o6o02L28L00n60M20L36n96n5N35k50n23P05j26k28L29
7299B20J35o56L0P06m32k87M88k59k97O00J33o26J10L60l45q2N79l68n16N28J52
7320A73k2p6L8m51K49O24m43j20K48l13j41L20K68o27R0L92k11MJ01o5m21N67
7342A84M8l75m0M07k44o3L20k39m06N17J36l20Q2J57j93m5L71n54NM21J5k29R1
7365D6k3m06L26L86l50k03J98k6J02L40k50m77L30K15j82q6K42j93k13N61k12
7386A25m83L40l6m3K20m4j67j8K47P7k83K68k46q4J21M21l90j97L35m2jj8j45
7409d3l23K61K15j06j63Q4q2J57K74j61l80J28L48j36Q2j1j94NL28j55k14Q2K5
$$ y = [426, -92, -304, 395, 111, -148, 85, 104, -294, 6, 722, -35, -279, 149, 1, -223, 264, 285, -405, -67, 409, -210, -145, 182, -218, -269, 273, 207, -395, -67, 233, -327, 93, 429, -167, -222, 313, 63, -460, 245, 119, -109, 220, 355, -301, -271, 435, 3, -284, 204, -55, -352, 248, 381, -245, -135, 225, -120, -202, 377, 9, -507, 21, 173, 151, 75, 113, -338, -89, 535, 92, -28, 220, -93, -234, 86, 354, -273, -183, 209, -2, 2, 103, 38, -383, 184, 232, -143, -183, 224, -20, -83, 237, -2, -408, 109, 245, -75, 7, 164, -29, -74, 297, -257, -252, 169, 184, -45, 46, 23, -383, -57, 329, -21, -224, -26, -52, 50, 390, 140, -337, -7, 208, 26, -60, 182, -11, -224, 337, 125, -358, -18, -54, -97, 123, 79, -88, -106, 141, 218, -65, 203, -43, -127, -6, 415, 25, -172, 163, 121, 120, 102, -43, -366, -105, 110, 4, -159, -75, -157, 0, 274, 113, -267, -139, 209, 73, 155, 144, -50, -45, 283, 128, -86, -4, 21]
7432B1j31L51j59k81rL63J6k10K57k41j35P1J11j72P7P3kP7l8n7j01L03L0k89
7456g5K00k20M2K09J14k43j18r7K52Mj12Q0j96J22J77j54j63L2q3K22O1J52l43
7479a37q6L30J9j17K9j06j63L70m9K0m8n5N3J04J03l32p6J84l9p3J4Ll5Q8N0k11
7505a60o4K60J3n1J99l12m7J75Q1q6O7l1j26nK97k14j71K77k9j48M1M3k11M2K90
7530A30k88J12q8N8j70K38Q7j88N8o4L2K11n2j84R2J97qk29L3Q3oL9k9j39K3J39
7556H7J2l06J59j6j54J15L41m07N6Q9l3P8J07j2l66K84R8j36K26n0k68L1K98K3
7580B56l41N1J9M2p4J90k84m4L97k59p4J21k1j26J02K88l45M2K04k59N6K20Q3
7603B44m90L87o1r7j44K85j05j18L11k07j94L27Mk09O7P0j42r7L79j74r2J54j06
$$ y = [21, -110, 241, 82, -199, -208, 155, 171, -39, 218, -23, -158, -87, 24, -148, -71, 2, 0, 77, 39, -18, -119, 184, 214, -75, 125, -95, -53, 156, 270, 27, -91, -188, 64, 68, -44, 36, -160, -38, 139, -15, -178, -146, -229, -7, 54, 206, -137, -223, 107, 126, 9, 38, -68, -231, 139, 90, 110, 62, 7, 60, 164, 267, -65, -141, 43, 4, -69, -55, -52, -87, 1, 51, -160, -224, 36, 49, -2, 197, -115, -162, 13, 94, 8, 75, 44, -82, -87, 210, -4, -175, 102, 73, -75, -34, 9, -202, -160, 130, -158, -46, -134, -76, -246, -8, 79, -109, -51, -115, -83, 128, 76, -108, -16, 181, 173, -56, -23, 60, 54, 93, 64, -75, -52, 87, 99, -207, -48, -64, -218, -103, 238, -169, -113, -24, -57, 21, 128, 116, -250, 34, 132, -4, 222, 172, -96, -65, 233, 256, -85, -34, -15, 27, -47, 143, -141, -185, 212, -47, -121, 0, -21, -147, -45, 243, -102, -60, 144, -115, -59, 161, 244, -246, 141, 80, -17, -161, 124, 19, -99, 212, 5, -189, 138, 142, -67, 0, 70, -72, -169, 210, 36, -56, 98, -8]
7626hk85K87J96j69j80L59j79k20L63n1m41O39k51l36K77J46k97J25K25l31lK47
7648A13K14n80J15K42l09J60K95m27j24L58k8l16M25Jm12K95K25j53k08L87l16
7669d3l18N92j6m76L34l7l16P5L92k49l19M82J2m19O14r8l12j1M90l89k05M21
7691B04k29k33N39j52l23K62Q4k30l8M07k28m24M08K11m82K62K44n77K13J89l31
7712b24J13L44Jl93K39J20n90M77J81l31j5L66n18J82K85J5m39Q6L86o02K96K43
7734B22k71l02M69m5l35M19o8m42M87K85n40j8M19l28j96M87r5n12K72M27m43
7755a08n8L89l17j01K28j92j89L07J54l06jK64k19J10M33l76l29M68o0k22K16
7776I1J02m00J39M10k79k14J96k6l66M61J81m85r6M73k55k0L32k07k96K90J40
$$ y = [-8, -293, -6, 190, 21, -159, 200, 21, -199, 164, 113, -328, 311, 60, -276, 1, 147, -150, -25, 200, -131, -134, 113, 327, -253, -138, 104, -205, -45, 250, -177, -301, 57, 29, -287, 138, 139, -273, 22, 247, 94, -114, 273, -43, -361, 231, 215, -261, 73, 36, -280, -205, 187, -62, -381, 101, 113, -306, 308, 210, -102, -113, 377, -12, -217, 204, -25, -258, 281, 129, -194, 68, 152, -78, -116, 291, 63, -361, 47, 258, -224, 38, 282, -295, -82, 107, -224, -111, 233, 234, -159, 80, 200, -390, 87, 268, -63, -78, 288, -230, -48, 237, 252, -187, -101, 285, -317, -21, 222, -49, -351, 118, 73, -262, 157, 89, -353, 134, 419, -121, -139, 280, -48, -244, 243, 148, -364, -92, 335, -108, -166, 223, -94, -195, 33, -159, -348, -41, 113, -193, -194, 70, -149, -39, 394, 18, -311, 157, 97, -125, 91, 193, -207, -68, 342, 63, -151, 45, 19, -347, 114, 295, -190, -286, 187, -68, -88, 244, 37, -259, 31, 171]
7797A71n2l5J48l63J93K54k40k30N26l77l12M50jk06j1L52l59j16M09k21l60M13
7819C3J01k82J34K86k45j13K92k97j31M34k6k96K44R3l13K16K21m30j84N11q2
7840A66l17J66q3r6J47K99l45j71L12q9K7J14j20k18Q2M25k09r2J55j83n3K06
7862A23Q6m37L65N1j36k6P3l10K25J05j91j04O9po6K50J80n18N2L19j6k1kj48
7886h4k0J68K19j83j46J90k09J01Q5k00p9K91j40K6k3Pk59J29K67k37q8J77N5
7909D7r0L4M6j69L3L23p1k46L34m53K48J34k42j22J12K30qj64K37k89j87M50j33
7932E4j03J18q6j89K06L9Kl48L89k7L2j34K15k59J03O2j96J45r0J07J13J36m24
7955a35M2N0k4J32J6L4j10K4l9Q3k02J42O5k8m0J17m04J20K20J19j63K8n3l8L59
$$ y = [171, 119, 84, 232, -131, 62, 316, 76, -154, 372, -5, -317, 133, 132, -74, -85, 267, -92, -208, 201, -20, -380, 33, 134, -148, -14, 272, 27, -86, 206, -91, -222, 212, 186, -110, 134, 227, -86, 130, 351, -79, -263, 248, 166, -151, 15, -68, -164, -17, 282, -63, -234, 78, -11, 16, 130, 10, -208, -126, 299, 90, -2, 153, -30, -83, 123, 209, -228, 137, 188, 52, 26, 99, -211, 14, 119, -72, -176, -107, -114, -180, 70, 250, -268, -216, 103, 87, 66, 64, -84, -104, 64, 283, 100, -46, 144, -65, 36, 121, -79, -158, 133, -7, 19, -4, 3, -256, -127, 140, -97, -185, -8, 47, -43, -9, 37, -132, -99, 224, 153, -93, 241, -212, 36, 170, -72, -194, -82, 148, 140, -24, 213, -76, -263, 187, 54, -49, 69, -17, -206, 0, 39, 41, -307, 82, 55, 87, -47, 168, -91, 12, 74, -122, 23, -67, 40, 153, 289, -135, -93, -43, -67, 65, 81, 115, 5, 29, -10, 73, -129, 13, 78, 50, 10, 127, -277, -157, 63, 182, 19, 47, -6, -44, 315]
7980C15k13j92LQ3R4j61L6J7j11K59q4Kj52R5R4j06L01l37j32J93o0K09q4O3j78
8005d6J14m4Q4k52J21n9J36j0Jp2j32J88P0P5j10k53J79Q6Q8j84o6K58k23J81
8029A30q5j01q5L43j07j25j22j2K7J39K56k86k26J68J33j22J76k12l2J50O6l6
8051C7Q2k17J79M4O0j30j61o3K89p4j70K6K59j41J24J1k58J02M4K5l0J43l20J57
8075A8O2q0J2m1J09j76K05N5k66M0Q2rK01j05j89J04KR7k48J75Rk33J35K56l40
8100a25r4L13L0k63J73K1j79mL42k70k7KL2J2J75j7l29K55J16j89j37K76k77J33
8124c1O9J14l65J88M0k93K48J45k39j64L75J01l33K63M5k20M1K08j86j02L49k98
8146d5j48L56n6l10J94R2r4q0J65j05r2J64J9p6Q5L7k12M9J7k99K25K20L2k10
$$ y = [315, 102, -90, -87, -4, 90, -71, -35, -18, -129, 130, 46, 48, -104, -9, 85, -21, 280, -57, -189, 4, -56, 153, 69, 132, -46, 68, 24, 108, -144, -23, -82, 54, 44, 45, -27, -159, 29, 99, 174, 64, -189, -10, 76, 164, -20, -86, 172, -51, 130, 45, -56, -141, 202, 95, -30, -152, -164, -137, 2, 258, -28, -254, -86, 47, -75, 101, -111, -143, 7, 73, 37, 119, -98, 81, 125, 185, 55, -106, -169, 120, 46, -124, -98, 161, 20, 144, 155, -103, -1, 43, 68, 38, 181, -139, 18, 80, 0, 12, -29, 80, -96, 109, 164, -102, -62, 20, 11, 212, 107, -82, 22, 24, 121, -127, 48, 57, -176, -41, 215, -125, -219, 94, 124, -139, 34, 55, -124, -128, 214, -56, -83, -81, -49, -37, 138, 121, -208, 47, 163, -26, -163, 113, -164, -31, 38, 152, -213, -25, 15, -278, -30, 115, -124, -288, 87, 188, -145, 118, 163, -57, -16, 192, 6, -96, 253, -45, -193, 163, 107, -203, -9, 83, -11, -91, 74, -31, -123, 41, 60, -16, 69, 106, -106, -57, -40, -339, -114, 106, 138, -72]
8170g2J20j4r2M4K13l38q5L65j62MR2kk73K69p2j5q9K06j29j25M17
$$ y = [-72, 48, 34, -58, -14, 199, -139, -224, 141, -21, -17, 75, 73, -200, 69, -3, -18, -107, 99, -30, -155, 262]
8191B62
$$ Imaginary data points
##PAGE= N=2
##DATA TABLE= (X++(I..I)), XYDATA
0@%%%%%%%%%%%qJ6j6J6k4L5m3N6o4P2q9J07j25J45j69J98k30K63l00L43l92M42
33B33m98N64o33P10p96Q86r85J096j218J350j494J650j822K010k214K439k685
50a407K958l261L597l971M388m862N406o035O770p642Q697j0005J1674j3878J6936
65I365k1464K8824m2694P7249l10713m93808Q14819J43457j80895L41574k54260
76A11454o79289M29210O23655l74506k79243K60920k84349j00411P18462l9016
86C86887p10679J80643K27971l25637K50684L69108m62953k29834M44528k3977
96A06741l26025K92980R3362m63985J87252M20033l47631p7431L71647k97157
106d0214k92419M16283R8898k79767J97935J17213m30195J6347M35091j87332
$$ y = [0, 0, 0, 0, 0, 0, 0, 0, 0, 0, 0, 0, -8, 8, -8, 8, -16, 19, -24, 32, -32, 40, -49, 58, -67, 78, -91, 107, -123, 140, -160, 183, -209, 233, -265, 299, -334, 376, -420, 466, -519, 577, -641, 709, -785, 865, -957, 1053, -1161, 1278, -1407, 1551, -1710, 1887, -2084, 2304, -2558, 2848, -3187, 3583, -4059, 4638, -5367, 6307, -7571, 9365, -12099, 16725, -25969, 51280, -259433, -753241, 61578, 205035, 24140, 365714, 111454, -567835, -138625, 485030, 110524, -168719, 92201, -192148, -292559, 425903, 386887, -323792, -143149, 84822, -240815, 9869, 378977, -83976, -313810, 130718, 106741, -219284, 73696, 167058, -296927, -109675, 310358, -37273, -114704, 256943, -40214, -332633, 83650, 182548, -97219, 100716, 217929, -212266, -195919, 239172, 51840]
116E1840k28634K94475j13551k53345M10602J14079m70443K3440K43584j77598
126a05551N9132L16005k38506l04136L06007J24100k74287J20815J20723k99222
136a74920J08910L50805k31660k20410K06300l3478j40227K35118N9524k96458
146a36496O5596K43328j86569j11862J89111j08337j06726K91689J1947k95372
156a43691Q2196J49232j50466K8308J50200j78573q4708K77772K1173k28009N6897
167a9669L8055j51797J49665J85747k21395j04431J85444l1180q7506J29019n0621
178B1331j87884J49718J78538j56109o1313R8917j12726l4325K09083l7456j79063
189a11289J11780Q7575j23728K9000P2840j40982j4688J86895l0978j28337Q4386
$$ y = [51840, -176794, 117681, 4130, -249215, 161387, 275466, -194977, -171537, 72047, -105551, -46419, 269586, 31080, -273056, 32951, 157051, -117236, 3579, 124302, -174920, -66010, 284795, 53135, -167275, 39025, 5547, -134680, 100438, 159962, -136496, -70900, 172428, -14141, -126003, 63108, -45229, -151955, 139734, 151681, -143691, -61495, 87737, -62729, -34421, 115779, -62794, -147502, 130270, 151443, -76566, -19669, 18386, -133411, 16254, 202001, -19394, -123825, 61619, 30439, -57067, 71952, 21331, -166553, -16835, 161703, 5594, -55719, 43198, -69528, -103853, 105230, 67774, -111289, 491, 88066, -35662, -6662, 66178, -74804, -89492, 97403, 66425, -61912, 22474]
200B2474K0441j09937P3133O2126j42455J0431J55700n0076q3662O3187l3763
211a2401p3774J13021N6217j31173l809J04270l9671k7462O0036p3831p1869J26299
223B5853O2342r2482o981K3446o0129L1193Q7181o9513p7479P8439M3276m0224
235D922K1702j3414r0750L7510J03049l7169n0727L4451j4029j9134O2876o342
247C2945r0738J4624P7217q245j7650J3274m8063k6581P2926J8814o0807R33K7282
260E931j0636J8304J7458n4050l0655N4613L2580k3695n059l454k2622K3179L2795
273C4689l4256l1060K5310K0645K669M080k1712l2749J3427L6798l062k5050l291
286a3562N594R063J5131j1628l1635r18K7359J9455j035j7598j7681N874K3782
$$ y = [22474, 42915, -67022, 6111, 68237, -74218, -63787, 91913, 41837, -41825, 21362, -12401, -86175, 26846, 83063, -48110, -51919, 52351, 12680, -14782, 45254, -28577, -100446, 25853, 88195, -4287, -11268, 12178, -47951, -16758, 70423, 910, -76569, 1870, 45146, 4922, 26624, 13210, -77540, -40030, 63019, 25850, -24877, 9574, -4455, -23589, 39287, 32945, -57793, -43169, 34048, 25803, 8153, 21427, -26636, -53217, 19709, 38523, -22284, -21351, 5931, -4705, 13599, 31057, -22993, -53648, 965, 33545, 9850, 4791, 1337, -21285, 1894, 34689, 433, -30627, -5317, 15328, 17997, 22077, 365, -32384, -18957, 17841, 14779, -10271, -13562, -7968, 1095, 16226, 4598, -27037, -27955, -596, 18859, 17824, 226, -17455, -11581, 12201]
299A2201Q162j6914j5780N631J9617J2347q775k3906j2584J3076J9590L095j4580
312A180j6245J764J7198N684j2971j5909k309J6901J6493j533j3736j2228N301
325a0410J7792M412p262p229j201J2920J1230q321j3890m219Q731J0275k001p047
339C780r000l659J2272K414j3741m134J063M949J0433l964j3363j972Q442R230
353B750j06l638l004j512J3901R079j4524m490M875k046J1203O701j6666q181
367e658Q441K625m421J792k070j3951N067J5485j3677p581J4111r171o575J9812
381D229k959j6011J3986J0489j6849K278J9428j2456r328K5350n389k4592K1580
394I756R674k7984Q672J7972k6959l732L0309j5287k4758K6744J625l3501K1728
$$ y = [12201, 20363, 3449, -12331, -6700, 12917, 25264, 16489, -7417, -20001, -6925, 12665, 15760, 1180, -15065, -13301, 3897, 9581, -3390, -19299, -21608, -4707, 11786, 10253, -3483, -15711, -10410, 7382, 11794, 4532, -2697, -3898, 9022, 20252, 11931, -1959, -6178, 2553, 12828, 10827, 3780, -5220, -8879, 3393, 5807, -7934, -12068, -11005, -6056, 4377, 413, -12950, -14922, -6480, 2750, 2644, -994, -3998, -5510, 8391, 17470, 2946, -1544, 3331, 1285, 12488, 19189, 2523, -5658, 2783, 5408, 987, 2779, 709, -13242, -8175, 7310, -6367, -13948, 163, -9008, -15583, 4229, 1270, -14741, -755, 9734, -7115, -4837, 14591, 2135, -7193, 18157, 12768, -11824, 9756, 19430, -8554, 118, 18090, -8869, -12601, 17708, 2421, -22337, 4407, 6032, -27469, -5741]
407e741K3656l6734R78L5379k5990j5904M3625p002l7931L2384J7090m1764J9330
420A376L7132m6720j3865N1868j8594l3656M3934k2n4911L0464L6808n4682l682
433b4550N2617l7505k6606O1670j5432n8051N0220K9830o1298J3024M9934m8312
445a4459j3357P3055k7999o5561N9951K5154o0385L5958L4544q3961M46R0199
457E3585l1813n5726M7786j0706n7182P3888M8446j03096j7384P1901l6371k330
469a9002Q4253n7857r0713Q0018N0561o1006K2869K9134r1593M928J21103l2225
481D0470p9463N4734j2659o5627R2559M8822j12696n500P1688n2213j1061R2771
493F1825m3800r5871P4840M3615p8845M6685N7966j15254j7633J12447l4182m2698
$$ y = [-5741, 17915, -18819, -17841, 17538, -8452, -24356, 19269, 12267, -25664, 6720, 23810, -17954, 1376, 38508, -8212, -22077, 29791, 11197, -22459, 21475, 21453, -33458, -2994, 33814, -20868, -24550, 28067, -9438, -36044, 25626, 10194, -47857, 2363, 32193, -29105, -16081, 33853, -14459, -27816, 45239, 17240, -48321, 11630, 36784, -23601, 12357, 46901, -37060, -36614, 53585, 21772, -33954, 13832, 3126, -54056, 19832, 68278, -34818, -52202, 19699, -16672, -19002, 65251, 7394, -83319, -3301, 47260, -13746, 9123, 38257, -53336, -48408, 72695, 40470, -38993, 15741, 3082, -62545, 30014, 78836, -33860, -39360, 32328, -19885, -30946, 61825, 18025, -77846, -3006, 40609, -38236, 8449, 66415, -48839, -66472, 45975, 11793, -30905]
505c0905Q6165l2791j08555P7912Q2551q6155n917O4704r0698k3330J51156k0719
517F3418j26989N1618K1234p3538R0211Q2199j40503n9738J15515n745m4126R0236
529F3792l9672j43361R7752J22904r8162k3092N5123r8817j0226J64371j8500
540G2112j36601M7765M4397p9364O2092Q4814j37582m7536J42000k0364p1149
551c9416Q8763k4066j19639Q5727Q7599j04890q284R6758p1972n4802J17835k2205
563C1408j12189R5448N1500j22762L5387R5200r6725k7756J06834n7987q3214
574h4856J19513L7514j19690L6456O3304j10606J6509J31601q4772q3069J14892
585C6796K448q7180P7513K3416j32817L4248J29152p1294n5714R0569m8106p9039
$$ y = [-30905, 55260, 22469, -86086, -8174, 74377, -11778, -17695, 47009, -43689, -67019, 84137, 63418, -63571, -11953, 9281, -64257, 25954, 108153, -32350, -92088, 23427, 17682, -26444, 63792, 24120, -119241, -21489, 101415, 3253, -19839, 35284, -63533, -73759, 90612, 72112, -64489, -16724, 27673, -51691, 10401, 95215, -42367, -89903, 52097, 31733, -39416, 49347, 25281, -94358, -8631, 78968, -25922, -34206, 62552, -9420, -64222, 53613, 31408, -80781, 14667, 66167, -56595, -21208, 73992, -22733, -50489, 56345, -1642, -84856, 34657, 72171, -47519, -11063, 52241, -58365, -41856, 89745, 4973, -78096, 36796, 39244, -47936, 29577, 52993, -79824, -45576, 83576, 12282, -43432, 47137, -969, -80008]
597h0008J19983K2992j35626M2175Q9876p8862K6Q4969q5592o8443J21239J9636
609E2365r9847N3192M7013r8142K9173R1478j00663m7932J20198r486p2698O8108
621C2759Q8j03606N7458Q7505r5220l6201R3619l0135m2601R2940k9504j23197
633i6095P0031Q4291p1033N191N6558p9749k4379J11812j8675r9740N2821M4764
645C5797o1490M5173N4885j10186k9622J04781k0794n3609O3253p074o9795N8755
657A0074M6738r3312j7621P9118k5870k4555P1507l2153p5906P0086L5257p9085
669c5722J2203N2077l9480P414O4300n1895p0925O1772L4107m9906K7593K1799
681C3337p0772K2138P5923n6891n5996M5409L714j5170N7349J267q8043N190O8865
$$ y = [-80008, 39975, 62967, -72659, -30484, 59392, -19470, -19444, 65525, -20067, -88510, 32729, 52365, -47482, 5710, 52723, -45419, -16246, 75232, -25431, -73363, 46835, 37349, -35349, 32759, 32847, -70759, -13301, 74204, -21016, -57217, 36402, 6267, -36334, 56606, 27102, -96095, -26064, 58227, -12806, -7615, 48943, -30806, -55185, 56627, 37952, -61788, -8967, 35797, -25693, 19480, 74365, -35821, -65443, 39338, 18544, -35065, 28188, 21114, -48681, 10074, 56812, -36500, -54121, 24997, -873, -25428, 46079, 13926, -61980, 8106, 43363, -35722, -23519, 28558, -10922, -3508, 60792, 8897, -62028, -256, 33851, -16055, 11538, 33337, -37435, -15297, 60626, 3735, -52261, -6852, -3138, -18308, 39041, 40308, -47735, -42545, 26320]
694B6320k4739j9852L8934l3853k3840P9859O799p8815L117L0282j9150K5089
706A0151M2853m9481m2761N3782J3424m7851J5227J0350l8078L6033M8446n2366
718b71l6279L2172j577j3188L1572n47m0101K4730M2368l7255k7745K3231j0118
731a3008L746M8146j3099m7177J6061K3403j6714l749N875k0775N601M7575n396
744C0489m8321k101Q188m670K7638R499l8096l442L3654K530j8100p115j1139
757b0986k186L8199K4500l3217k2056J1723P28P973J3228k3146j5742K8629K1193
770B8840j3620j9151j3146p028J8769K9128j0721k7694N057J1683J2K230j4043
783i684j8002J7441L0299K879j8585j5975l788R360J7863Q81k0326j496J9583
$$ y = [26320, 1581, -18271, 20663, -13190, -37030, 42829, 49628, -29187, -26070, 4212, -14938, 10151, 53004, 3523, -39238, 14544, 27968, -19883, -4656, 5694, -32384, 3649, 52095, -271, -36550, -4378, -5955, -19143, 12429, 11882, -28219, -3489, 38879, 1624, -26121, -2890, -13008, -9262, 38884, 25785, -21392, -5331, 18072, 1358, -2391, 3484, -17291, -11690, 35885, 30489, -17832, -19933, -11745, -16415, 11223, 20722, -17374, -20816, 12838, 15368, -2732, -9847, -20986, -23172, 15027, 39527, 6310, -15746, -4023, -3295, 4678, 17906, -5240, -20982, 7647, 28840, 15220, -3931, -17077, -24105, -5336, 23792, 13071, -14623, -9566, 2117, 2129, 4359, -9684, -27686, -10245, 20054, 22933, 4348, -11627, -15415, -6055, 11808, 12689, -7637, -9133, 10450]
796A0450Q353n706j6588j9015N799K5227J1623j0909j6671m112Q630R362k589
809C854j7414p267J8364J9328J87j5218j8952k145J8112J4168m415j2412k740
822f550J0881J0193m234j7846j2334J1059K1298P413j1330j6164m906J0201R593
835G274m581j2709k663J3289J4702j350j7542j4915L590J6764J1431o277j2525
848e512j164R868Q197n461j5599n725J1584J6686N930j3118j7157o51J2107Q940
862H925m793j1092m14R537J0275o76j8003j2457R902J4136O729l332j3359n239
876i861J1092R487p654j4389J498J0309P676P882j1160k1513N107J6862N71l965
890A942l172n944M908J5553k078k2478l410J5401L188M747M503j9698q103K0581
$$ y = [10450, 18803, 13097, -3491, -22506, -16707, 8520, 20143, 9234, -7437, -11549, -2919, 6443, 3854, -13560, -20827, -2463, 16865, 17052, 1834, -17118, -19263, -1151, 13017, 8602, -3810, -6550, 4331, 14524, 10290, -7556, -19890, -8831, 12467, 19880, 8550, -7614, -12520, -2319, 7274, 2693, -10016, -12679, 610, 15312, 13962, -3580, -18495, -14905, 1859, 13290, 7013, -5512, -6676, 3192, 11389, 5928, -9671, -15396, -3812, 12874, 18804, 5686, -11471, -12122, -15, 8925, 4132, -6960, -7374, 2163, 12438, 11762, -6241, -18698, -8796, 5340, 12069, 8737, -4622, -9861, 1231, 10718, 3064, -11325, -9827, 482, 8158, 16040, 4880, -16633, -11526, 5336, 5907, 1942, -1230, -7174, -2266, 13287, 11209, -11269, -14679, 722, 3910, 8657, 13160, -6538, -14641, 5940]
904E940M421j3401j142J896k722J1753J0859k0226j6774J6607O509o461J0469
917G728m327j8191J4017J5995j6917r456J0766j775r46J8341n486k4876J1954
930c173J6255j6651K79J2095j5600L54K4398j0906k4612J3333J0707j3964R316
943A831J0793k7018n64L2544j2266k1923J7253o73j4098K6160J0785l6568l185
956a6929K9897r698q960K3088j6612k5683L5453J5930l6041J920J5832k3459O665
969h597L6235k3224l2932K9353R931k6859K0361J2794m1874P774M2563k2634j9836
982a6945K9697j1057k5949L6182J5090m2721P201L1813l0722p136M0992k1642
994D803l0750L8729L802l9704K3962K3118m1811q10L9559k5812k0178M4991p504
$$ y = [5940, 10361, -3040, -4182, -2286, -5008, 6745, 17604, -2622, -19396, -2789, 3720, -2741, 7728, 3401, -14790, -773, 15222, -1695, -11151, -385, -2160, -3106, 15235, 9749, -15127, -3173, 13082, -3569, -3290, 8805, -6795, -6441, 17957, 7051, -17561, -4228, 6479, -7485, 1831, 12624, -14394, -14958, 17586, 5320, -16603, 650, -23, -14121, 12039, 22824, -13744, -16929, 12968, 3270, -5690, 17398, 786, -24897, 10556, 26486, -9555, -7635, 8197, -15262, -8597, 27638, 4414, -28518, 835, 10766, -16093, 4268, 17062, -24812, -17038, 25525, 2891, -16945, 12752, 1695, -24254, 11928, 27018, -15703, -8502, 23311, -7411, -14547, 26445, 4803, -25947, 12782, 16584, -23120, 842, 23960, -17851, -18661, 20898, -4914, -25092, 19899, 12395]
1007A2395m5488L3064K2330m2150J5131L4053m3477j1205N2377j3394l5172L4929
1019A3393L175m5297L0460L7585n0990j0191M5352k7359k0621N1883j2261n2921
1031c7792L5015K6674m3393J1458L6678m5785j6540N9405j1600m2748M0440P078
1043A8890n1548L1435M0105m9889q650M6550k7857k4693N2724m059n5070L0642
1055a420K9069m8615J1083M5296m7317k3232N7475j1283m0299M0997O940n4631
1067c5937K6411M5622m6126j2540M8559k8537l0194N9352R62n9105L0292K9351
1079B8110m8349J2529M7156m5740k6711N5237p978m2484M1524J1270n9640K1793
1091a3283M7002m6267j0837N1298k9914l4961N3975N208n0914K8148K7741m9699
$$ y = [12395, -33093, -29, 22301, -19849, -4718, 29335, -14142, -25347, 27030, 13636, -21536, 13393, 16568, -28729, 1731, 39316, -11674, -21865, 23487, -3872, -24493, 27390, 15129, -37792, -2777, 23897, -19496, -8038, 28640, -17145, -33685, 25720, 14120, -28628, 11812, 18890, -32658, -1223, 38882, -11007, -19657, 26893, -964, -25657, 27067, 23008, -32062, -1420, 27649, -20966, -9883, 35413, -11904, -35136, 22339, 11056, -29243, 11754, 18694, -35937, -9526, 36096, -10030, -22570, 25989, -2548, -32742, 26610, 27572, -31533, -1241, 28110, -20239, -7710, 39446, -6294, -33005, 22232, 14254, -28230, 13294, 24564, -35076, -13283, 33719, -12548, -23385, 27913, -2001, -36962, 17013, 22221, -28693, -545, 27196, -22503]
1103b2503O012N2706l4834k9102M8949r411m1915M4132J7375n6104J2545L9861
1115B7711l8107p936M6450k5488l7267M6134J0209m7272K2682K6823m7746N700
1127a8107N0676l3534k7505M5832o235l7411L5772J4718m8053J4236M1539l6548
1139d620j6207M3544j8767l0489M5177K135n0807K5036L2006l8105LL2754l3315
1152a1655j8377N1951M48m5768K0124J6074l6025K1701L7813m5467k1204M4195
1164A3810m212k0324K9374o904m5536K3822M0310k8098j1669K5252k6073j5258
1176b5506M7902k199m2903J8210J6120k5895J4231K6318l3429j8216L4806j410
1188H029k2842K6713M965l7688J3898K5619k7705n93K9278k0229j8567K8313K501
$$ y = [-22503, -16491, 36215, 1381, -27721, 21228, 11817, -30098, 14034, 31409, -24695, -12150, 27711, -10396, -18332, 28118, 2630, -34637, 11497, 21706, -25566, -2884, 23939, -23807, -18107, 32569, -965, -28470, 17362, 11127, -26284, 9488, 24206, -23847, -9611, 31928, -4620, -20827, 22717, 3950, -26539, 18638, 20773, -30034, -4998, 27008, -11097, -11094, 21660, -11655, -30032, 21919, 22367, -23401, -3277, 12797, -23228, -1527, 36286, -9181, -30385, 13810, 9598, -10726, 18648, 11744, -33792, -9970, 30340, 2242, -9427, 15825, -10248, -25506, 22396, 20197, -22706, -4496, 11624, -14271, -40, 26278, -7151, -25367, 9439, 8029, -14813, 11900, 16865, -20823, -6925, 18694, -9011, -9604, 19674, -555, -19122, 9191, 11692]
1201A1692k3298J5068Q685l1861O290L5291j5088j5270J8245j5895j6782L4097
1213A1174J0667l1713K46J5717j1371N710K1100k3051k5966K5563J6090j3577
1225E89Q127k232k8633J0864K9938j2478j6311R549k156m106K0449R80k9893Q2
1239a5231K1668l416l24R958j6401j0726K1912L712j8724K473P794o062P203J0303
1253A4139j7273j2526J5781M802r381N730O01j0516J0894J0119j7070q338J1411
1266a627K778Q59Q244o394j4094Q032J2264r029o170M943k126M226J2265q413
1280E758j7290L063R016J044K139j406q897J261J2318j116j3346k685M643N406
1294i2J0174o8j4253m731Q205M966o53l375m079K017R904M781j0627j1682J232
$$ y = [11692, -11606, 3462, 12147, -19714, -13424, 21867, 6779, -8491, 9754, -6141, -22923, 11174, 21841, -9872, -9626, 6091, -5280, 430, 21530, -1521, -27487, -1924, 14166, 589, 8716, 6484, -22149, -11285, 18653, 6175, -10136, -587, -2743, -6849, 13600, 14580, -15313, -15231, 6437, 3021, 2697, 12655, -3746, -14472, 7440, 11152, -7572, -5099, 2695, -3367, 3836, 14139, -3134, -15660, 121, 4923, -4458, 1272, 1873, -8643, 2251, 12370, -4700, -13038, -1627, 1151, 2010, 10254, 3860, -10234, -2202, 10062, 1033, -5137, -194, -2320, 1906, 14171, 5758, -11532, -8469, 547, 1591, 3730, 2324, -6573, -5312, 7006, 5890, -7456, -10141, -5498, -92, 10082, 10014, -4239, -8970, -765, 4201, 3548, 173, -3906, -1889, 8015, 12796, 2169, -9513, -8281]
1309h281O714P777K349r050o464M975N303j278o453o244L676J0707O839n065j1744
1324f239l134N934O680K524n519n055O225P655m32p599r576j1J0569Q361j110
1339I273r929o177M560N060p20n745o282M784J1387L099o804j0892l735Q187Q306
$$ y = [-8281, -1567, 6210, 8559, -491, -6955, -1980, 3323, 2045, -4408, -10652, -6976, 3731, 10570, 5505, -6239, -9373, -3439, 3241, 5765, 246, -4809, 1416, 9071, 8639, 1040, -8536, -8547, 2022, 10383, 9273, -656, -6833, -2273, 2787, 2067, -3678, -9960, -5176, 6211, 9310, 2506, -8386, -12121, -3934, 4372]
$$ [...]
8191A01
##END NTUPLES=NMR FID
##END=
