##TITLE=1H_DE-TEST_isomasl_dry`
 200.13Hz, CCl4.
 8 sc
 18.8.2026
##JCAMPDX= 6.0         $$ Bruker NMR JCAMP-DX V2.0
##DATA TYPE= NMR FID
##DATA CLASS= NTUPLES
##ORIGIN= UXNMR, Bruker Analytische Messtechnik GmbH
##OWNER= pz
$$ XWIN-NMR		Version 3.5
$$ Tue Aug 18 13:07:11 2026 Russian Standard Time (UT+4h)  she@DPX200
##.OBSERVE FREQUENCY= 200.131
##.OBSERVE NUCLEUS= ^1H
##.DELAY= (6, 6)
##.ACQUISITION MODE= SIMULTANEOUS
##.ACQUISITION SCHEME= undefined
##.AVERAGES= 8
##.DIGITISER RES= 18
##SPECTROMETER/DATA SYSTEM= spect
##.PULSE SEQUENCE= zg30
##.SOLVENT NAME= D2O
##.SHIFT REFERENCE= (INTERNAL, D2O, 0, 14.3821)
##AUDIT TRAIL= $$ (NUMBER, WHEN, WHO, WHERE, WHAT)
$$ ##TITLE= Audit trail, XWIN-NMR		Version 3.5
$$ ##JCAMPDX= 5.01
$$ ##ORIGIN= Bruker BioSpin GmbH
$$ ##OWNER= she
$$ F:/spectra/data/she/nmr/H-C/1/audita.txt
$$ ##AUDIT TRAIL=  $$ (NUMBER, WHEN, WHO, WHERE, WHAT)
(   1,<2026-08-18 13:04:38.67 +0400>,<she>,<DPX200>,
      <created by zg, POWCHK disabled, PULCHK disabled
       configuration hash MD5:
       00 E9 B6 7A A2 85 ED C7 34 08 36 98 17 FE 4E 26
       data hash MD5: 16K
       C8 07 01 A1 9B 94 BA E5 D0 7B F0 47 76 88 71 AC>)
$$ ##END=
$$ 
$$ hash MD5
$$ 12 5D 95 F7 4F 49 5A 92 A0 1D 11 83 AC 78 36 15
##$RELAX= 
##$RELAX= 
##$RELAX= 
##$RELAX= 
##$RELAX= 
##$RELAX= 
$$ Bruker specific parameters
$$ --------------------------
##$DU= <F:/spectra>
##$EXPNO= 1
##$NAME= <H-C>
##$PROCNO= 1
##$TYPE= <nmr>
##$USER= <she>
##$AMP= (0..31)
100 100 100 100 100 100 100 100 100 100 100 100 100 100 100 100 100 100 
100 100 100 100 100 100 100 100 100 100 100 100 100 100 
##$AQSEQ= 0
##$AQ_mod= 1
##$AUNM= <au_zg>
##$AUTOPOS= <>
##$BF1= 200.13
##$BF2= 200.13
##$BF3= 200.13
##$BF4= 200.13
##$BF5= 200.13
##$BF6= 200.13
##$BF7= 200.13
##$BF8= 200.13
##$BYTORDA= 1
##$CFDGTYP= 0
##$CFRGTYP= 5
##$CHEMSTR= <none>
##$CNST= (0..31)
1 1 145 1 1 1 1 1 1 1 1 1 1 1 1 1 1 1 1 1 1 1 1 1 1 1 1 1 1 1 1 1 
##$CPDPRG= <>
##$CPDPRG1= <>
##$CPDPRG2= <>
##$CPDPRG3= <>
##$CPDPRG4= <mlev>
##$CPDPRG5= <mlev>
##$CPDPRG6= <mlev>
##$CPDPRG7= <mlev>
##$CPDPRG8= <mlev>
##$CPDPRGB= <>
##$CPDPRGT= <>
##$D= (0..31)
0 0.7 0 0 0 0 0 0 0 0 0 0.03 0 0 0 0 0 0 0 0 0 0 0 0 0 0 0 0 0 0 0 0 
##$DATE= 1787043878
##$DBL= (0..7)
120 120 120 120 120 120 120 120 
##$DBP= (0..7)
150 150 150 150 150 150 150 150 
##$DBP07= 0
##$DBPNAM0= <>
##$DBPNAM1= <>
##$DBPNAM2= <>
##$DBPNAM3= <>
##$DBPNAM4= <>
##$DBPNAM5= <>
##$DBPNAM6= <>
##$DBPNAM7= <>
##$DBPOAL= (0..7)
0.5 0.5 0.5 0.5 0.5 0.5 0.5 0.5 
##$DBPOFFS= (0..7)
0 0 0 0 0 0 0 0 
##$DE= 6
##$DECBNUC= <off>
##$DECIM= 32
##$DECNUC= <off>
##$DECSTAT= 4
##$DIGMOD= 1
##$DIGTYP= 9
##$DL= (0..7)
0 120 120 120 120 120 120 120 
##$DP= (0..7)
150 150 150 150 150 150 150 150 
##$DP07= 0
##$DPNAME0= <>
##$DPNAME1= <>
##$DPNAME2= <>
##$DPNAME3= <>
##$DPNAME4= <>
##$DPNAME5= <>
##$DPNAME6= <>
##$DPNAME7= <>
##$DPOAL= (0..7)
0.5 0.5 0.5 0.5 0.5 0.5 0.5 0.5 
##$DPOFFS= (0..7)
0 0 0 0 0 0 0 0 
##$DQDMODE= 0
##$DR= 18
##$DS= 0
##$DSLIST= <SSSSSSSSSSSSSSS>
$$ [...]
##$SUBNAM0= <"">
##$SUBNAM1= <"">
##$SUBNAM2= <"">
##$SUBNAM3= <"">
##$SUBNAM4= <"">
##$SUBNAM5= <"">
##$SUBNAM6= <"">
##$SUBNAM7= <"">
##$SUBNAM8= <"">
##$SUBNAM9= <"">
##$SW= 18.0517599122864
##$SWIBOX= (0..15)
0 0 2 0 0 0 0 0 0 0 0 0 0 0 0 0 
##$SW_h= 3612.71676300578
##$TD= 16384
##$TD0= 1
##$TE= 0
##$TE2= 300
##$TE3= 300
##$TEG= 300
##$TL= (0..7)
0 120 120 120 120 120 120 120 
##$TP= (0..7)
150 150 150 150 150 150 150 150 
##$TP07= 0
##$TPNAME0= <>
##$TPNAME1= <>
##$TPNAME2= <>
##$TPNAME3= <>
##$TPNAME4= <>
##$TPNAME5= <>
##$TPNAME6= <>
##$TPNAME7= <>
##$TPOAL= (0..7)
0.5 0.5 0.5 0.5 0.5 0.5 0.5 0.5 
##$TPOFFS= (0..7)
0 0 0 0 0 0 0 0 
##$TUNHIN= 0
##$TUNHOUT= 0
##$TUNXOUT= 0
##$USERA1= <user>
##$USERA2= <user>
##$USERA3= <user>
##$USERA4= <user>
##$USERA5= <user>
##$V9= 5
##$VALIST= <valist>
##$VCLIST= <CCCCCCCCCCCCCCC>
##$VD= 0
##$VDLIST= <DDDDDDDDDDDDDDD>
##$VPLIST= <PPPPPPPPPPPPPPP>
##$VTLIST= <TTTTTTTTTTTTTTT>
##$WBST= 1024
##$WBSW= 4
##$XGAIN= (0..3)
0 0 0 0 
##$XL= 0
##$YL= 0
##$YMAX_a= 354567
##$YMIN_a= -367182
##$ZGOPTNS= <>
##$ZL1= 120
##$ZL2= 120
##$ZL3= 120
##$ZL4= 120
##$ABSF1= 10
##$ABSF2= 0
##$ABSG= 5
##$ABSL= 3
##$ALPHA= 0
##$AQORDER= 0
##$ASSFAC= 0
##$ASSFACI= 0
##$ASSFACX= 0
##$ASSWID= 0
##$AUNMP= <proc_1d>
##$AZFE= 0.1
##$AZFW= 0.1
##$BCFW= 1
##$BC_mod= 2
##$BYTORDP= 1
##$COROFFS= 0
##$CY= -3
##$DATMOD= 1
##$DC= 2
##$DFILT= <>
##$DTYPP= 0
##$F1P= 0
##$F2P= 0
##$FCOR= 0.5
##$FTSIZE= 0
##$FT_mod= 4
##$GAMMA= 1
##$GB= 0.15
##$INTBC= 1
##$INTSCL= 1
##$ISEN= 128
##$LB= 0.25
##$LEV0= 0
##$LPBIN= 0
##$MAXI= 10000
##$MC2= 0
##$MEAN= 0
##$ME_mod= 0
##$MI= 1.114404
##$NCOEF= 0
##$NC_proc= 0
##$NLEV= 6
##$NOISF1= 3.799351
##$NOISF2= 2.8
##$NSP= 1
##$NTH_PI= 0
##$NZP= 0
##$OFFSET= 14.38212
##$PC= 1
##$PHC0= -4491.741
##$PHC1= 11.5923
##$PH_mod= 1
##$PKNL= yes
##$PPARMOD= 0
##$PSCAL= 0
##$PSIGN= 0
##$REVERSE= no
##$SF= 200.129724274929
##$SI= 16384
##$SIGF1= 3
##$SIGF2= 2
##$SINO= 400
##$SIOLD= 16384
##$SREGLST= <1H.CDCl3>
##$SSB= 0
##$STSI= 0
##$STSR= 0
##$SW_p= 3205.1282051282
##$SYMM= 0
##$S_DEV= 0
##$TDeff= 0
##$TDoff= 0
##$TI= <>
##$TILT= no
##$TM1= 0
##$TM2= 0
##$TOPLEV= 0
##$USERP1= <user>
##$USERP2= <user>
##$USERP3= <user>
##$USERP4= <user>
##$USERP5= <user>
##$WDW= 1
##$XDIM= 8192
##$YMAX_p= 0
##$YMIN_p= 0
$$ End of Bruker specific parameters
$$ ---------------------------------
##NTUPLES= NMR FID
##VAR_NAME=  TIME,          FID/REAL,        FID/IMAG
##SYMBOL=    X,             R,               I
##VAR_TYPE=  INDEPENDENT,   DEPENDENT,       DEPENDENT
##VAR_FORM=  AFFN,          ASDF,            ASDF
##VAR_DIM=   8192,          8192,            8192
##UNITS=     SECONDS,       ARBITRARY UNITS, ARBITRARY UNITS
##FACTOR=    0.0002768,     1,               1
##FIRST=     0,             0,               0
##LAST=      2.2672688,     0,               0
##MIN=       0,             -367182,         0
##MAX=       2.2672688,     354567,          0
$$ Real data points
##PAGE= N=1
##DATA TABLE= (X++(R..R)), XYDATA
0@%%%%%%%%Qj6J6j6K4l2M0n4O3p3R1j14J38j65J96k32K72l16L66m24M92n67O47
31C44p37Q37r49J073j209J360j524J706j905K120k355K613k895L204l540L907
47B050m308M747n230N760o343O990p709Q512r416J0439j1612J2967j4555J6449
61H741j8749K1609k5276L0167l7045M7465o5208J02965l05988K54371K88329o68563
73c67182O37225j61725m03623N32365l25601j09588N18544n32511J52412L55581
83B95897n59018L30693J46730n20389M37842r9612k50176M73855k94814r3738
93a32730L65188m03976P8542L13028l63583J30938J73700l11389J82974M0112
103G2804j83388J83357r6654n1742J83427j27246J281R5975j40768m307J14259
$$ plain form
0 0 0 0 0 0 0 0 0 0 8 -8 8 -8 16 -16 24 -30 33 -40 51 -63 75 -90 106 -126 146 -170 196 -228 264 -303 344
31 344 -393 444 -505 568 -641 719 -805 901 -1004 1116 -1239 1374 -1521 1683 -1857 2050
47 2050 -2258 2489 -2741 3019 -3324 3666 -4043 4469 -4947 5492 -6120 6847 -7708 8741
61 8741 -10008 11601 -13675 16492 -20553 26912 -38296 64669 -241319 13052 301381 -367182
73 -367182 270043 108318 -295305 237060 -88541 -198129 320415 -212096 -59684 295897
83 295897 -263121 67572 214302 -306087 131755 32143 -218033 255822 -38992 -132730
93 -132730 232458 -171518 -92976 220052 -143531 -12593 161107 -150282 32692 72804
103 72804 -110584 72773 -23881 -75623 107804 -19442 -18161 77814 -62954 -67261 46998
114D6998o1957P585Q8321j04386o801P3765r7956M0769P1269j26317O4201J02528
126I8019j63559Q7320P0086k37157J54161M8591j70187K27605q1229j23623J95656
137A05683j83322J8522J88932k43099J12943J28282k73245K16289K9788k74914
147a74141K73485j08743j40400L32575k28197j0390K26639l26531J29467J53863
157A27627k81267K25343J6398k40504K69159j10687j25381K74162k53568K4171
167g4547K37170k93696J75057R2288l03586K25413l2691j68619K73372j28912
177A249p9714K15945k21171L6286J71989k48181J39221O3221k03696K20231n8477
188C6903j23831J84035j62540o972J67936j52676O9726Q3074j80131R4720K8485
$$ plain form
114 46998 -14959 -7374 80947 -23439 -30240 43525 -54431 -13662 57607 -68710 -4509 98019
126 98019 -65540 21780 91866 -145291 8870 57461 -112726 114879 33650 -89973 105683
137 105683 -77639 -59117 129815 -113284 -341 127941 -145304 70985 100773 -174141
147 -174141 99344 -9399 -149799 182776 -45421 -55811 170828 -155703 -26236 127627
157 127627 -153640 71703 88101 -152403 116756 6069 -119312 154850 -98718 -74547
167 -74547 162623 -131073 43984 136272 -167314 58099 25408 -143211 130161 1249
177 1249 -78465 137480 -83691 -47405 124584 -123597 15624 78845 -124851 95380 36903
188 36903 -86928 97107 -65433 -72405 95531 -57145 12581 95655 -84476 10244 38729
199C8729j27652J42567m3838p2409J38168r5793N778P9361j23585M0844L7463
210A9633o1066P4001R722o3080L3574k1018l6459O5646j7489j5903M2331l6966
222g074L211K1482k2521j1958Q024M475j0110M9951j2370l9222L7014n7439L999
235c2538O5661m9381K8898K7976p6155L9576K3006p7561O9330o328p2764J18019
247E7739m8789l8779J01824j24610J3754Q4617j03071Q4539L3923j15182Q2955
258B8920j4252q6909J20903n0271n4656J28997j00040R934R6594j41131N6779
269e132L4670j05246J14672n76p6370Q9176n8562n1991J01493o5201k590Q8155
281F2498r9275L9854M5717r8162O8015j3179o0461Q2948k0430j5972N3062n1408
$$ plain form
199 38729 -88923 53644 9806 -62603 75565 -20228 -14450 64911 -58674 -17830 19633
210 19633 -41433 32568 42290 -20790 12784 -8234 -44693 20953 3464 -12439 29892 -7074
222 -7074 -3863 17619 -4902 -16860 -8836 -4361 -14471 35480 23110 -16112 20902 -36537 -32538
235 -32538 33123 -16258 12640 40616 -35539 4037 27043 -50518 18812 12484 -60280 57739
247 57739 8950 -29829 71995 -52615 -38861 45756 -57315 27224 61147 -54035 28920
258 28920 14668 -72241 48662 -1609 -56265 72732 -27308 -17374 79220 -61911 -5132
269 -5132 29538 -75708 38964 38388 -37982 51194 -7368 -59359 42134 -23067 -25657 62498
281 62498 -36777 3077 48794 -49368 18647 5468 -54993 27955 7525 -8447 44615 -6793
293f793k2586M0595l7931J8615M3627n0017K7039L817m0786L7371j9986j1983
305a9018K3586r359J3194J0235q214j6553m373o153L525K3749j874N944q873j0944
319e128J588r735J4562q770N568J4356j3696J8093j0988j7924M468p870P174J8749
333A0447Q232j4936O734j5610j9936L2837j9219P357K7522l2698J8226O905l2510
346a6649J4005K066k5739L4046J4246l3343M1198k8166l9043N7787m4127R832
358a3887N4746n9826K7557J9811o1574L8570N403n3981O2108l199m3598P8210
370E0340n3804l1689P1015p9971L1984N7028p7447N6662M584p1778O2740j7469
382B195m7187P8251l5667k2846Q1400p5031M684N0855r1555N7705K2928o1355
$$ plain form
293 -6793 -29379 11216 -26715 -8100 35527 -14490 12549 16366 -24420 12951 -7035 -19018
305 -19018 4568 -4791 8403 18638 10424 -6129 -10502 -16655 -13130 10619 8745 14689 5816 -5128
319 -5128 -3540 -13275 1287 -7483 -1915 12441 -1255 16838 5850 -12074 -7606 -15476 -8302 10447
333 10447 18679 3743 10477 -5133 -25069 7768 -11451 -4094 23428 -9270 8956 15861 -16649
346 -16649 -2644 -578 -26317 7729 21975 -11368 29830 1664 -37379 20408 -23719 -13887
358 -13887 40859 -18967 8590 28401 -33173 5397 10800 -43181 18927 15728 -27870 50340
370 50340 -3464 -35153 35862 -44109 -12125 44903 -32544 24118 28702 -43076 19664 2195
382 2195 -44992 33259 -2408 -25254 56146 -18885 -14201 36654 -54901 2804 25732 -35623
394c5623P5439k5523m5256N7411m2480j4867O0566m4852Q349M9127o4706K7628
406E213J4528o3219N3682q429k2789N4097k8387j1425K1447k9419l980K6480j3672
419e873L751K7171k8952M435J0440l2826J6114R407j3479J7093J3598k5642M266
432d97J3462m4969L2903J1083m0304O3161k7058l0754N9586o1200k714O1273o5255
445c1283K9289N2971q8273N1897J7360j00408J03001k9112o6491J37674r4360
456a7735j5884J14863j42588M3545P7357j39574J08345K8309j34810J44611n3186
467A3253j07378J81859j23272k6244J75897j83352O0698J05321j99445J32160
477B9497J9365j62019J86423n1118j08663J98015j37642n1710J84050j85979N2619
$$ plain form
394 -35623 39816 14293 -30963 26448 -16032 -30899 29667 -15185 -6836 42291 -22415 5213
406 5213 19741 -43478 10204 1775 -21014 33083 4696 -6729 14718 -14701 -18681 7799 -5873
419 -5873 -2122 25049 -3903 532 10972 -21854 -5740 3667 -9812 7281 20879 -4763 -497
432 -497 12965 -32004 899 11982 -28322 34839 7781 -22973 36613 -24587 -27301 33972 -31283
445 -31283 -1994 50977 -37296 14601 31961 -68447 34554 5442 -61049 76625 -17735
456 -17735 -33619 81244 -61344 -17799 59558 -80016 28329 56638 -78172 66439 13253
467 13253 -94125 87734 -35538 -61782 114115 -69237 -8539 96782 -102663 29497
477 29497 48862 -113157 73266 22148 -86515 111500 -26142 -77852 106198 -79781 -27162
488b7162J34536k02758J30311L1331j74809J75929n4241j11791J87801j05682
498a6535m6644J72023j50506J665J22951j67130Q1086P0934j43860J27187j6095
509C5076j13714J34553n7414o4246J25657o7974l5089J06243p7228j1095P3943
520D8712r5374L1990N7329q7743O5140L0450j01965N6550L1109r6310O8131L7759
532D5778r9974Q3154J267q6407J08647o2671n2398J32903j03912n471J39364j46088
544d5808J3124J14078j64839Q0604P6114j65451J53202k2965j47097K12939j16024
555a2123r1647K24217j71593j3395J92949j97877N6502J06619k13908J54594K4452
566E8790j83636K35136r2548j36838K47955j73710l3633K04239k11917O7517J24052
$$ plain form
488 -27162 107374 -95384 34927 66258 -108551 67378 13137 -98654 89147 -16535
498 -16535 -63179 108844 -41662 -39997 82954 -84176 -3090 67844 -76016 51171 35076
509 35076 -78638 55915 -1499 -65745 59912 -8062 -43151 63092 -14136 -25231 48712
520 48712 -46662 -14672 42657 -45086 20054 50504 -51461 5089 36198 -60112 8019 45778
532 45778 -54196 28958 30225 -56182 52465 -10206 -62604 70299 -33613 -39084 100280 -45808
544 -45808 -32684 81394 -83445 -2841 73273 -92178 61024 38059 -109038 103901 -12123
555 -12123 -103770 120447 -51146 -64541 128408 -69469 -12967 93652 -120256 34338 58790
566 58790 -124846 110290 17742 -119096 128859 -44851 -78484 125755 -86162 -18645 105407
577A05407k11825J51833K8110k06726K04665m9486j39809K33626j22159o3425
587f9789J72988j70627M1514J03382j60215J12723K0322j36724J46665l4774j04414
598g8949J44485q1310m8049J37078r8274J2950P4675j16170N1173K9410p5096
609d8077P2563k33n6964N2825r078l6951M2272j8176j9840L4511j8964J1604J8298
622B3790l5526N420J0898k4842J2031M0554l8366p849M7921n8977J1810M6391
634C3255o5564L4565J8210n2791O2568j2053n6763O7789m0883l4801R7631o0144
646h981n388O6197j00475N0879K8863r0713J04348l3232p2879J24080o8700l6557
658d2558J08631j04778M022R0242j06335P2396L2968j24388J09197l5755p4191
$$ plain form
577 105407 -106418 45415 73525 -133201 71464 21978 -117831 115795 -6364 -69789
587 -69789 103199 -67428 -25914 77468 -82747 29976 50298 -86426 60239 25465 -78949
598 -78949 65536 -15774 -63823 73255 -25019 -12069 62606 -53564 -2391 27019 -48077
609 -48077 24486 24253 -32711 20114 11036 -25915 16357 -1819 -21659 12852 -6112 5492 23790
622 23790 -11736 -6316 4582 -20260 -8229 32325 -6041 -13890 34031 -24946 -13136 33255
634 33255 -32309 2256 20466 -32325 30243 18190 -38573 29216 -11667 -46468 51163 -8981
646 -8981 -14369 51828 -48647 2232 31095 -59618 44730 11498 -61381 62699 -6001 -42558
658 -42558 66073 -38705 -34683 55559 -50776 21620 54588 -69800 39397 3642 -70549
669g0549J41967q7454j9696J05120j19391M5126O4282j26154Q7719J0197j10979
680g9812J38170l6842q0767J32456j06236j7204J17151j16529N7172N1008j23721
691f5154R1520j814q7457J12364m8231n6909J13759p7431l520R1046j15299L6098
703a1028M7750r6259Q7939N292p5071P5049l5476l8335P4111m0819j4889N5260
715C3524n3943J2785M4083n9439K5768Q622m7122M6289M519k3365K6324j5045
727C000k6255K5019L614j9111L0894j1775k5585L7683j7030j2752L0470l0309
739a2137q001L9515k2214M83L5028n5073P202L5799n4104M9830J1760o2303N7878
752B3663k1399l5731O8765m2101k1332O1011n3508J0270N8762p7306K6652K6524
$$ plain form
669 -70549 71418 -16036 -35732 69388 -50003 -4877 59405 -66749 20970 31167 -79812
680 -79812 58358 21516 -59251 73205 -33031 -50235 66916 -49613 7559 58567 -65154
691 -65154 26366 24552 -62905 49459 1228 -55681 58078 -19353 -22873 68173 -47126 -11028
703 -11028 36722 -59537 28402 33694 -41377 33672 -1804 -40139 33972 -6847 -21736 33524
715 33524 -20419 -7634 36449 -22990 2778 11400 -35722 10567 15086 -8279 18045 3000
727 3000 -23255 1764 5378 -13733 17161 5386 -20199 17484 454 -12298 18172 -12137
739 -12137 -20138 19377 -2837 -2354 32674 -22399 -15197 20602 -33502 16328 28088 -34215 23663
752 23663 2264 -33467 35298 -6803 -28135 32876 -20632 -10362 48400 -28906 -2254 24270
764B4270p7050P3675K534n6031P2374m6467k8609O9839n1307L188M9646o4740
776b8678K4228L8184o3098M5076P34o1119O4501j8488k0710N9732m9810o485L4007
789A8074m1590K2124K4344l9783K1145Q059l2500L5799q894k7278L1933k3076
801a1643M673K9281k4510N780k164j7562J3335P404k898M258k687j0893Q872M65
815A711l267M620j0443M998L077M449N252j3072J401r259K481J6161n836N803
829H076n109j1231N811K923j080K608j66j0221J1901L126q272J1042j7629l340
843a1561J3904n728J2441J791j3875k368K477l010P438Q535j6551Q076J729j1501
857h203J9653j1400r630J1998j0004O808J4694j1260n850O311j6994Q904J8628
$$ plain form
764 24270 -52780 20895 23429 -32602 39772 -6695 -35304 34535 -16772 -13584 36062 -28678
776 -28678 -4450 33734 -29364 15712 16446 -44673 19828 1340 -19370 40362 -9448 -15933 18074
789 18074 -23516 -1392 22952 -16831 4314 12373 -20127 15672 6778 -20500 11433 -11643
801 -11643 -6970 22311 -2199 3581 1417 -16145 -2810 4594 1696 5954 3267 -7626 1246 1711
815 1711 -1556 3064 -7379 -2381 696 5145 10397 -2675 -1274 -10533 -8052 8109 2273 8076
829 8076 2967 -8264 -2453 470 -610 1998 1832 -8389 3512 6638 -1634 9408 -8221 -11561
843 -11561 2343 -3385 9056 10847 -3028 -5396 -2919 -5929 1509 10044 -6507 1569 3298 -8203
857 -8203 11450 50 -9580 2418 -7586 -778 13916 2656 -3194 3117 -13877 -4973 13655
870A3655k1400J6097k530k2321K8079j1954q432J9808k1209L085K1182j6239M796
883B617R336l0934J4826J2530k2362L2234j2160k2519L0397k3894L096K3941k9399
896a2291R658J3006k1939J9503N801l0425K0354m847j7464L9648j8783r217K3734
909A6738l4268J2130J8091k4204J7391K018k1652J9889K606j9805K0320j1446
921b192j6112L1819j4630k61J9429k9554M172J2666j4540J1862R695j9981O075
934a552J1134k2373J8652L166k8630K7748n746j4253L2256j9506j5828K5804k1143
947a0271k071L7250l3025K209K9231n0011K9368J8759n2066M7780q931l8903O0192
960B9511k7814k5008N4315m9855l427O0361o2565K4705L8966q3981N6707J0713
$$ plain form
870 13655 -7745 8352 5822 -16499 11580 -374 -8806 11002 -10207 -7122 14060 -2179 2617
883 2617 11953 -18981 -4155 8375 -13987 18247 6087 -16432 13965 -9929 -6833 17108 -12291
896 -12291 -2633 10373 -11566 7937 13738 -16687 3667 -1180 -18644 21004 2221 -6996 16738
909 16738 -17530 -5400 12691 -11513 5878 7896 -13756 6133 8739 -11066 9254 -2192
921 -2192 -18304 13515 -1115 -1376 18053 -11501 -7329 5337 -9203 2659 12354 -7627 -1552
934 -1552 9582 -12791 5861 9027 -19603 8145 2399 -11854 20402 896 -14932 10872 -10271
947 -10271 -12342 24908 -8117 -5908 23323 -26688 2680 21439 -30627 17153 8222 -30681 29511
960 29511 1697 -23311 31004 -18851 -22278 38083 -24482 223 39189 -44792 11915 22628
972B2628o9738Q2753k9730m6736Q4434n5913j2845P3592q0048J5173N9333q7238
984d4335N6664K9105r3911P9986j5835o4170R8502n0654k7607Q1658p6300Q909
996a7988O5612q4785L4573M0066q5943O4689J3635p2426P5814l0844m3753P8551
1008C7201n0202n560O1005o5559J1150M4602o1523K8200K9023o0770M1585Q879
1020A8031m6977N3265j9145l4209N1112k7750j4291M7928k9470j5873L8837l1802
1032a0344n010M0138l9902J0680K7828m7905L1116J5068n0656L8226N285m6667
1044c2143N0268k412m5113N6662k9537k9542O8448n4305J443N9561p5877K8976
1056c571M0470p6054M8995J4972o8073O7716j2104n0051Q0712n3272k3106Q1003
$$ plain form
972 22628 -47110 35643 5913 -40823 43611 -12302 -25147 48445 -31603 -16430 42903 -44335
984 -44335 12329 41434 -52477 27509 11674 -52496 46006 -4648 -32255 49403 -26897 -17988
996 -17988 47624 -37161 -2588 37478 -48465 16224 29859 -42567 33247 2403 -41350 37201
1008 37201 -13001 -18561 42444 -23115 -11965 32637 -28886 -686 28337 -32433 9152 18031
1020 18031 -28946 24319 5174 -29035 22077 -5673 -19964 27964 -1506 -17379 21458 -10344
1032 -10344 -15354 24784 -15118 -4438 23390 -24515 6601 21669 -28987 9239 14524 -32143
1044 -32143 18125 15713 -29400 27262 -2275 -31817 36631 -17674 -16231 43330 -32547 -3571
1056 -3571 36899 -39155 9840 24812 -43261 24455 12351 -37700 43012 -10260 -33366 47637
1068D7637q0327K1421N9627r1012N2011K1614p8603P3439j2339n7212Q2444m3584
1080d884k7502Q1705p3402P382N9577q5787M8977K5771p3183O8043j6482m7329
1092c7114P0102m1424j6011O2274n9297J0376M7855o7598L4888K0372o0163N2492
1104A6752r462l1429N1876l5000o466L6716m0909J2580K5811l7578J9590J1982
1116A4463l1642K6461n591j8789K9228k0835n54K3440k3786N671J0294j5239L375
1129c504P501n155P88M525o851M071L80q223R518r56q334R174L744j3295P758
1144A141N648j8961J7106j805j4187K6594k1130k260K5875l3778J2881J9897l5356
1157a8335K3344R481l4882L3507p826k8977M7145l0991j0137N0015n2705J5403
$$ plain form
1068 47637 -32690 -11269 48358 -42654 9357 30971 -47632 25807 13468 -43744 38700 -4884
1080 -4884 -32386 49319 -24083 -16701 42876 -42911 6066 31837 -41346 26697 10215 -37114
1092 -37114 32988 -8436 -24447 37827 -21470 -11094 36761 -30837 4051 24423 -35740 16752
1104 16752 7290 -24139 27737 -7263 -13729 22987 -17922 -5342 20469 -17109 2481 14463
1116 14463 -17179 9282 3691 -15098 14130 -6705 -7259 16181 -7605 -1934 8360 -6879 -3504
1129 -3504 3997 -1158 -370 4155 -2696 1375 1755 -6468 3050 2094 -6240 2934 6678 -6617 1141
1144 1141 6789 -12172 4934 3129 -11058 15536 -5594 -7854 18021 -15757 -2876 17021 -18335
1157 -18335 5009 14490 -20392 13115 5289 -23688 23457 -7534 -17671 32344 -20361 -4958
1169d958L3289n8611L8302Q767m8169N3010j5094l4393N9019l9669j5151N9331
1181C5673n9263J5376M3428o9377M4737J1430o0204O2805j9317l7679O5195m0515
1193g711j3652N7421n6525R707M2656o3954L7694J8882n8705N5614j2956l8928
1205c0457N7887l3888j2977M7499m2401N622L4121m4874J8767J9682m3184L2231
1217H028L690l2132L6796j4703j6932K9988k0196k797K0862j8003M23J5933j6726
1230e769K369J3599j9402P558R709j6477J1944L632j5083Q856L810j3937J2189
1243B998N078j9524J8438k662j8030K6576j4535r723K5488k1849K157K1772k6106
1256i922P623J5209k9790K0015R678l0672L0822q578k3704L7558k3314o395L1059
$$ plain form
1169 -4958 28331 -30280 8022 16789 -31380 21630 6536 -27857 31162 -8507 -23658 35673
1181 35673 -23590 -8214 35214 -34163 10574 22004 -38200 24605 5288 -32391 32804 -7711
1193 -7711 -21363 36058 -20467 -10760 31896 -32058 5636 24518 -34187 21427 8471 -30457
1205 -30457 27430 -6458 -19435 28064 -14337 -8715 25406 -19468 -701 18981 -24203 8028
1217 8028 11718 -20414 16382 1679 -15253 14735 -5461 -8258 12604 -5399 -4976 10957 -5769
1230 -5769 -3400 10199 -9203 -1645 8064 -8413 3531 7163 -7920 936 4746 -9191 2998
1243 2998 8076 -11448 6990 4328 -13702 12874 -1661 -11384 14104 -7745 -5588 16184 -9922
1256 -9922 -2299 12910 -16880 3135 12813 -17859 12963 4385 -19319 18239 -5075 -11470 19589
1269A9589l2426Q296K1417l1432J7925R397l1926K6550q45k3764L4634j8133j2771
1282a3489L0480k8329O870K0042k8606J5687O032k1954K0391j523j7373K0488
1294H716j0067q739K3048j7302J511J3004k1297J2432L830j2469J3758n704o310
1307e589R964n201j626P262p751K32O644p383O537k60p434O938n493K517M466
1322C823n552M063l604p75L843k527J605k64k641J547K478k641K681j292n692
1337d948P163l587J085O003r412M060J8m337P464k576k588K778k162r27N555k978
1353F11l090N005o869L887N179p181N437l274m294O369j623j95K493k855k785
1368c185N092j749j540N721q110K050M853o166O550j541n988M467q50j640N646
$$ plain form
1269 19589 -12837 -4541 16876 -14556 3369 12766 -19160 7390 6545 -17219 17415 -718 -13489
1282 -13489 16991 -11338 -4468 15574 -13032 2655 8687 -13267 7124 5601 -11772 8716
1294 8716 -1351 -10090 12958 -4344 -2833 10171 -11126 1306 5136 -7333 6425 721 -5589
1307 -5589 4375 -826 -2452 4810 -2941 -2709 3935 -3448 3089 2829 -4605 2333 -3160 -643 3823
1322 3823 -1729 2334 -1270 -2045 1798 -729 876 612 -2029 -482 1996 -645 2036 744 -4948
1337 -4948 2215 -1372 -287 5716 -3696 364 382 -3955 3509 933 -1655 1123 -1039 -1966 3589 611
1353 611 -2479 2526 -4343 -456 4723 -2458 2979 -295 -4589 1780 157 -38 2455 -400 -3185
1368 -3185 1907 158 -1382 4339 -3771 -1721 3132 -3034 3516 1975 -4013 454 -396 -2036 3610
1383C610j729n917O681m247j509R917j0276K269M872r740R160P86q059O527k837
1398d92n072J0180k661n850R843j0021o20J2438j2719O405L818j3818J1382R3
1412B906p657J0384n410p399J1648m885l166J2727j3326l13J0899j3804R914M320
1426F838j4178R952j293p675J1873k798q894J0363n370n180J5488j0538k706J1229
1440G111j4740O056R577j3205O616L397j3433J0149M883j4184J3150k451j4719
1453a1793K0712q483p952J9636j8410o70J8026j8512O845J2712k4086J2117R425
1466I567k3828K3165k024k3528K9419j4479j0533L0688k6003l98K3365k9102J2984
1479g07J7157l2442K0533N399l0455L3726p679k3103L5931k4493p023L3586l1403
$$ plain form
1383 3610 1881 -4036 2645 -1602 -3111 6806 -3470 -1201 3671 -6069 3091 3877 -4182 2345 -492
1398 -492 -5564 4616 1955 -3895 5948 -4073 -4693 7745 -4974 1431 5249 -8569 2813 2906
1412 2906 -4751 5633 223 -7176 4472 -413 -3579 9148 -4178 -4491 6408 -7396 2518 6838
1426 6838 -7340 2612 1319 -6356 5517 2719 -6175 4188 -1182 -6362 9126 -1412 -4118 7111
1440 7111 -7629 -1573 8004 -5201 1415 4812 -8621 1528 6411 -7773 5377 2926 -11793
1453 -11793 8919 436 -7516 12120 -6290 -6960 11066 -7446 -601 12111 -11975 142 9567
1466 9567 -14261 8904 6880 -16648 12771 -1708 -12241 18447 -7556 -7954 15411 -13691 -707
1479 -707 16450 -15992 4541 9940 -20515 13211 5532 -17571 18360 -6133 -13156 20430 -10973
1492a0973P176K0553l4281J9050J2327l0764K6566k132k7456L3636j3183j3862
1504a3343L2278k6862r43K4184k7426J2446J3221k7195J5906N418k0912K1657
1516H429k642j8275K1635j1301o862K1937j6984k30J2918j6701O499J0080j3771
1529e268N350N463j3998R926N097j3745J1789k261j1726J4954l323p773J1891
1542F376p007o978J4310p542l960J4915j6559J893J4764j9405J1593O621k1406
1555a2385J6761R6j5402K1163q575j3454K3296j5742m151K4657k5321N319J6228
1568A2490k7150J9675M210k3275K4049r563j3603K7466j7277n285K2996k5688
1580a0955P172J8255k8339J9586K951k6486K8947r188j4130K7580k0767k949K0922
$$ plain form
1492 -10973 -3797 16756 -17525 1525 13852 -16912 9654 7522 -19934 13702 519 -13343
1504 -13343 18935 -7927 -8870 15314 -12112 334 13555 -13640 2266 7684 -13228 8429
1516 8429 5787 -12488 9147 -2154 -9016 12921 -4063 -4293 8625 -8076 -1577 8503 -5268
1529 -5268 82 5545 -8453 1473 6570 -7175 4614 2353 -9373 5581 2258 -5515 6376
1542 6376 -631 -7609 6701 -841 -4801 10114 -6445 -4552 10212 -9193 2400 9021 -12385
1555 -12385 4376 4472 -10930 10233 1658 -11796 11500 -4242 -8393 16264 -9057 -3738 12490
1568 12490 -14660 5015 9225 -14050 9999 436 -13167 14299 -2978 -8263 14733 -10955
1580 -10955 -3783 14472 -13867 5719 8670 -17816 11131 1943 -12187 15393 -5374 -8323 12599
1593A2599k2176R947J1371k5129J8106R40j9986K6997j1917j2158K4851k1626
1605h181L556J8441k4274J2112O308k1087J8686J82j5547J8169r101q200J8869
1618I933j4480K416J1862j9722J1174M925j4584J4492l297j0652J2597m799m527
1631d662J1750q370l638J0396r013J680Q154r512K273L046m970L603J976m491
1645a778J366K213n856N816K461r578Q257j661p938J2381m625o408J1864r122
1659b608l609J5850j3698j91J5154k0705Q628J1778k1725J6567j31j8418K2356
1672I248q823j0073K3241j8689l330K2536k4219Q104J6654k9922J9262N260k6219
1685a6970K9235q892j8557K9692j8756n927K6614k4642L576J8362k7595J5813
$$ plain form
1593 12599 -9577 370 11741 -13388 4718 5658 -14328 12669 752 -11406 13445 -8181
1605 -8181 -4625 13816 -10458 1654 7962 -13125 5561 5743 -9804 8365 -736 -8936 9933
1618 9933 -4547 -2131 9731 -9991 1183 6108 -8476 6016 2719 -7933 4664 -135 -4662
1631 -4662 7088 -1282 -4920 5476 -3537 -1857 6297 -3215 -942 2104 -2866 737 2713 -1778
1645 -1778 -412 1801 -4055 1761 4222 -5356 2901 1240 -6698 5683 1058 -5350 6514 -2608
1659 -2608 -6217 9633 -4065 -4256 10898 -9807 -1179 10599 -11126 5441 5310 -13108 9248
1672 9248 425 -9648 13593 -5096 -8426 14110 -10109 -2005 14649 -15273 3989 9249 -16970
1685 -16970 12265 3373 -15184 14508 -4248 -10175 16439 -8203 -4627 13735 -13860 1953
1697A953R437k6648K4283m845j9388K8718j5343p666K3694k2305L067J7500k2125
1710i668J0442R112k2123J5899K201j6785J9465p241j0132J7387j1991m32J2012
1723H146j3018L292O680j0137N757M284r887N816J601p779Q339r21n802O191k499
1738F3l301N474p09m541N043j220n145Q488l969l867Q515p849M93Q013q714K895
1754c31M973j0171N901M194j0654R859j060j0321J3948p042m571J3402j2641J639
1768b875R719j2796O910M900j2969R574O47j0588J3603n310p047J3732j1378P61
1782c117J0596j3389O569L841j1012R758o53p789R569m638m673J0325p387L7P526
1797E563j0330N167K783p903P992k700l910O614m425j56M251m807J043K831m417
$$ plain form
1697 1953 11390 -15258 9025 4180 -15208 13510 -1833 -9499 14195 -8110 -5043 12457 -9668
1710 -9668 774 9886 -12237 3662 5863 -10922 8543 1302 -8830 8557 -3434 -3866 8146
1723 8146 -4872 -1580 5100 -5037 720 5004 -4883 933 2534 -5245 3094 2173 -3629 2562 63
1738 63 -3238 2236 1527 -3014 2029 809 -4336 4152 183 -3684 4831 -3018 -2525 5488 -3226 -331
1754 -331 4642 -5529 372 4566 -6088 3771 2711 -7610 6338 -704 -5275 8127 -4514 -2875
1768 -2875 6844 -5952 958 5858 -7111 2463 3110 -7478 6125 815 -6232 7500 -3878 -3117
1782 -3117 7479 -5910 659 4500 -6512 3246 2593 -5196 4373 -265 -4938 5387 -2000 -1963 5563
1797 5563 -4767 400 3183 -4720 3272 572 -3338 3276 -1149 -1305 2946 -1861 -818 2013 -2404
1812b404L476P46m338M614k943q54M256m371K504M27l042L398j652n55J906k021
1828h53L36J626j831J076R31l163K744q48j636M022l545R89J759l730L263q18
1844C22j741K696j651l34K052j595m83K050k674J063J886l385L157q78k210L474
1860A749k719M54J753k295J289N58j317N93O71j924J295O52k039K711j388r68
1876i25K139k226Q80P15j150P20L41n99k22J272j850N84J356k490K466m30j675
1893a094K168j411n86J643p56q12K171j420j039L162l608J060K512m333L492Q3
1909A232l324L700j457k021L423j715j637M212l043p82M531n589K072K835n635
1924c198M780m5m164M645j774k706M553k164k208N240l946p65N385o179K103L218
$$ plain form
1812 -2404 1072 1818 -2520 2094 -849 -1703 2553 -1818 686 1113 -1929 1469 -183 -738 1168 -853
1828 -853 -517 1109 -722 354 1285 -1878 866 18 -1618 2404 -1141 -152 1607 -2123 1140 322
1844 322 -1419 1277 -374 -708 1344 -251 -734 1316 -1358 -295 1591 -1794 1363 485 -1725 1749
1860 1749 -970 -516 1237 -1058 231 789 -528 65 736 -1188 107 759 -1280 1431 43 -925
1876 -925 1214 -1012 -132 583 -567 153 494 -105 -327 945 -905 -321 1035 -1455 1011 581 -1094
1893 -1094 1074 -337 -923 720 -36 -848 1323 -97 -1136 2026 -1582 -522 1990 -2343 1149 1232
1909 1232 -2092 1608 151 -1870 1553 -162 -1799 2413 -630 -1412 3119 -2470 -398 2437 -3198
1924 -3198 1582 1537 -2627 2018 244 -2462 2091 -73 -2281 2959 -987 -1752 3633 -2546 -443 2775
1940B775o257M561R15m763M583o31m425N073j129l920O727l841k605P149o546
1955b334R22N411p518L489L234o799M886J642p384O512m51o676R526m283m273
1970d096R643q398M86P703r580M022M617r448O618K128r363Q995j817p717J1804
1985E597o394l232J0744j0664K035P420j0710O055L429r930Q081L45q358R966
1999D384l932n818J0925p773l87Q781j0340L725M363q938O581J359p075O645j231
2014A269n403P716l764l024P241o381Q53N528o601K859J807n114L470J027l242
2029a759L084k07l659M074j187k531M653l069j055L639k697L29J973k566l4K387
2045A375k605J284K531m907K707J101m564M902r28l127M234k442j200M295l665
$$ plain form
1940 2775 -3482 1079 1994 -2769 1814 1183 -3242 1831 702 -3218 3509 -332 -2937 4212 -2334
1955 -2334 -1412 3999 -3519 -30 3204 -3595 1291 2933 -4451 2061 1610 -5066 4460 177 -4096
1970 -4096 5547 -2851 -2365 5338 -4242 -220 4397 -5051 1567 3695 -5668 3327 1510 -6207 5597
1985 5597 -797 -4029 6715 -3949 -1914 5506 -5204 851 4280 -5650 2431 2776 -5582 4384
1999 4384 452 -5366 5559 -2214 -2601 6180 -4160 -435 3928 -5010 1571 2930 -4145 2500 1269
2014 1269 -4134 3582 -182 -3206 4035 -2346 -1493 4035 -2566 293 2100 -3014 456 1483 -1759
2029 -1759 1325 1118 -2541 1533 346 -2185 2468 -601 -1656 1983 -714 -385 1588 -978 -1012 1375
2045 1375 -1230 54 2585 -2322 385 1486 -3078 1824 896 -2231 2003 -439 -1639 2656 -1009
2060a009m89M321n545K386M055p108M946N2n979P406l173k416O633o076K37N695
2076C936o905K685L918q107N867J102o892Q683m479l945Q891p778J685O559r278
2091d058M485K910q339P356n2p268Q917m224l860R971q433P91O782j0423O254
2106H09L064q742Q130j767o552Q854m102l173Q732p791J88P670r607M680L841
2121D234r509O965Q5n566P274l092l298N881m585n33O272o074P97M720o827L407
2137A51K560n606M018k52l452M401p72l125L735j289l606N433j531k897M998l586
2153h20r90M145l692Q52K956m869K082L458o145L951J978p803O910m20n726Q651
2169D518m880l383Q306o942O3P772q943K219O192r883O234K726r971R421k706
$$ plain form
2060 -1009 -1498 2823 -2722 -336 3719 -3389 1557 1609 -4370 3036 -137 -2553 4080 -1996 -1759 3936
2076 3936 -2969 -284 3634 -4473 1394 2496 -4396 4287 -192 -4137 4754 -3024 -1339 5220 -4058
2091 -4058 427 3337 -5002 2354 2302 -4966 3951 -273 -4133 5838 -2595 -1804 4978 -5445 809
2106 809 3873 -4869 3261 1494 -5058 3796 -306 -3479 5253 -2538 -2350 5320 -4287 393 4234
2121 4234 -5275 1690 1775 -3791 3483 391 -2907 2974 -1611 -2144 4128 -1946 -1149 3571 -3256 151
2137 151 2711 -2895 1123 871 -2581 1820 1048 -2077 1658 369 -3237 2196 665 -2232 2766 -820
2153 -820 -1810 2335 -1357 -505 2451 -2418 -336 3122 -3023 928 2906 -4897 2013 1593 -4133 4518
2169 4518 -362 -3745 4561 -2381 -2318 5454 -3489 -1270 4922 -4961 1273 3999 -5972 3449 743
2184G43o133J1461p279k244R277r940K197P644j0394N301L942j0868R025J9q664
2199e913J0884n328m507J0396p718N19O718r048L437L957p642O189Q42p290P417
2214B913k525m264Q216n606j024N969o257K211L456n370K372J317l924L314Q39
2229A637l308L053j299k069L527j874k71J864j984K69J296q10n71J328j416n16
2245a144K754k126M41J677l279J342J496k431J780Q65l185K319N80l119L826j724
2261G2k301M473l365O08L092m553J892J261l483L429K80l424L568j444k365M817
2277B557l369m72L722m717K553J718l952L247j084k351L587j408q89K894k972
2292i36o1K616l338K270Q64l491L416j311j234L147k811K17J577k182J652Q23
$$ plain form
2184 743 -5390 6071 -1208 -3452 5825 -4115 -1918 5726 -4668 633 4575 -6293 2732 2751 -5913
2199 -5913 4971 -357 -4864 5532 -2186 -1667 5051 -3997 -560 3397 -4245 1944 2786 -4504 2913
2214 2913 388 -3876 4340 -1266 -2290 3679 -2578 -367 3089 -2281 91 1408 -2516 798 1637
2229 1637 -1671 1382 83 -1986 1541 -333 -604 1260 -724 -455 841 31 -540 788 -628 -1144
2245 -1144 1610 -516 -75 1602 -1677 -335 1161 -1270 510 1375 -1810 509 1089 -2030 1796 72
2261 72 -2229 2244 -1121 -513 2579 -1974 -82 1179 -2304 1125 1405 -2019 1549 105 -2260 2557
2277 2557 -812 -1284 2438 -2279 274 1992 -1960 1287 203 -2148 1439 31 -858 2036 -936
2292 -936 -997 1619 -1719 551 1415 -2076 1340 29 -1205 1942 -869 -652 925 -1257 395 1218
2308A218k087J355l36j736K704j156o19K191k785J237J104k327K161r73j049J963
2324H65r94M4J099j573p2J131j312J215N49j915J662r26n47J869j681N61L65j069
2342g29J206j11n21L10m66k94R00o5k03O26j283N26K65p31J351j053M3O35r16
2361e10J035l30n59L92l71K12N76r7m52L83p43Q2J024j050Q89k96q07J191p65
2380a96K14K64o88K50K31J44r7K57o87j23N57n25Q40j80m54L16l43K92q5J34k88
2401a67q8O34o90P88k38q92Q75n78J80P84m88l00M36n21j89J225j213L02R00j720
2421i60J541q7j341J502j010l57J528p58l63J122j348j55J691j845R59R24k319
2438a276J920k47j389J909j083p59J679q55l65J703j690l40J862k196J193J237
$$ plain form
2308 1218 -869 486 150 -1586 1118 -38 -657 1534 -1251 -14 1090 -1237 924 -49 -1098 865
2324 865 -129 -85 1014 -559 -631 500 -812 403 952 -963 699 -227 -774 1095 -586 -25 340 -729
2342 -729 477 366 -155 155 -311 -605 295 230 27 653 -630 -104 161 -570 781 -272 -229 406 -510
2361 -510 525 195 -364 28 -343 -131 445 348 -104 279 -464 -382 642 -408 481 185 -622 569 -196
2380 -196 18 282 -406 -156 75 219 122 379 -308 -431 126 -399 441 261 -193 123 -220 72 -13 121 -167
2401 -167 -255 379 -311 477 239 -653 222 -356 -176 608 120 -180 256 -265 -454 771 -442 -140 760 -960
2421 -960 581 494 -847 655 -355 -712 816 58 -305 817 -531 -686 1005 -840 119 1043 -1276
2438 -1276 644 397 -992 917 -166 -925 754 -101 -466 1237 -453 -793 1069 -1127 66 1303
2454A303k517J850j77j688K104p13j175J840q86q72K374j757n10K219k753J145
2470b13J634k714J992J6k198K238m78j539K368j089j254K815k014l28K450l202
2486a516J370J409k748K456k23k163K363r01j315K591j495p99K569k437M48J912
2502A521l047J846M35k224K571p55j282J979j365n86J894j384J7J590k111R21
2518B0Q54k122J902m08j252J859r09k75J032j015r6Q43q40L08Q87j372P28L13
2536D57j276J210l25m86Q09m66O1L58l86k41M99m25r1J014r87K59M86j067P67
2555A70q6m68P10k73l55O94l18o82J222r43k45J580j587O89O94j799J434k58j126
2574i47J819p90r01J940j423n56K204k297N53J822k873K114K71k615K972j333
$$ plain form
2454 1303 -1214 636 459 -1229 875 162 -1013 827 -59 -931 1443 -314 -824 1395 -1358 -213
2470 -213 1421 -1293 699 715 -1483 755 277 -1262 1106 17 -1237 1578 -436 -764 1686 -1516
2486 -1516 -146 1263 -1485 971 748 -1415 948 47 -1268 1323 -172 -971 1598 -839 -391 1521
2502 1521 -1526 320 755 -1469 1102 347 -935 1044 -321 -907 987 -397 -380 1210 -901 20
2518 20 874 -1248 654 246 -1006 853 -56 -331 701 -314 -410 433 -407 -99 788 -584 144 457
2536 457 -819 391 66 -420 389 -77 -16 342 -44 -285 214 -211 -302 712 -275 -16 470 -597 170
2555 170 84 -384 326 53 -302 392 74 -608 614 -329 -574 1006 -581 108 802 -997 437 179 -947
2574 -947 872 82 -819 1121 -302 -858 1346 -951 -398 1424 -1449 665 936 -1679 1293 -40
2590d0j455L173k162m96K822k834M08K270l427K104R31l389L655j143k380M009
2606B046k648q28L409l067N57K392l374J721J199l605L286k80k971M158j986j591
2622a582L502k818J07K381k809J235J394k916K036N84k967K746k92k191K917j295
2638C2r25K122j862Q4J560j777M90J540k123O39J429k413J266P85j971J676j06
2655D46j337J717o70j269K036r18j138K583j715o39K477k620O84J680k736J797
2671C78O77k548K398j95k433K951j077j835L609k437n56L152l592J231J937l544
2687a884K504N19k994L067o37k362L427j974j196L633l129N09K518l775K048Q79
2703A153l023K962n09k120K887j339j232K712k043k42K198k511J260J031k488
$$ plain form
2590 -40 -1495 1678 -484 -980 1842 -992 -584 1686 -1741 363 1294 -2095 1560 417 -1963 2046
2606 2046 -602 -1430 1979 -1088 -531 1861 -1513 208 1407 -2198 1088 808 -2163 1995 9 -1582
2622 -1582 1920 -898 -791 1590 -1219 16 1410 -1506 530 1114 -1853 893 601 -1590 1327 32
2638 32 -893 1229 -633 -549 1011 -766 -276 1264 -859 -220 1209 -1204 62 847 -1124 552 446
2655 446 -891 826 156 -1113 923 5 -1133 1450 -265 -904 1573 -1047 -363 1317 -1419 378
2671 378 1055 -1493 905 710 -1723 1228 151 -1684 1925 -512 -1068 2084 -1508 -277 1660 -1884
2687 -1884 620 1139 -1855 1212 575 -1787 1640 -334 -1530 2103 -1026 -517 2001 -1774 274 1153
2703 1153 -1870 1092 583 -1537 1350 11 -1221 1491 -552 -794 1404 -1107 153 1184 -1304
2718a304J995m46j356J974r06m75J342j120r6J010j103L95O59j251R76O4p93Q46
2736D11n55r1K69j75L31j49O3j34q0J37j35J88m5p7R1J01j93O3J01n80O64j97
2758Hk25Q77r98K23M40r31Q80r5n13O60l11k75O11m53j63O32q26N38M45j030J014
2779E08n73n58J208r83M53N19j101O91R3p42Q53k49p29J141o78j24J211j563N77
2798d6N05j453J637l87q47J426j203j25J229j221K91R39j513R57N19j607J552
2815F53o04j031J877j259J37J202j659O57M50j183J104R6j109J158l45p80J468
2832H32j124j32J100j346R04L39j045Q48m00m71P55k15k40N68m73j50O30o36K79
2851B3J59o06O71k42L5K42n41K73k50J77K49j99J92k25j13J87K0j55J92j24k22
$$ plain form
2718 -1304 691 245 -1111 863 -43 -518 824 -296 -392 618 -485 -90 569 -682 294 358 -435 411
2736 411 -144 -235 34 -141 190 41 104 -30 -110 27 -108 80 35 -42 49 150 -43 20 121 -459 205 8
2758 8 -217 660 -338 -115 325 -606 274 179 -334 326 15 -260 351 -102 -265 367 -459 79 524 -506 508
2779 508 -65 -623 585 -398 55 574 -527 164 257 -485 368 119 -610 531 -147 -271 940 -623 -46
2798 -46 459 -994 643 256 -591 835 -368 -493 736 -485 -194 745 -768 189 708 -899 653
2815 653 49 -982 895 -364 -227 975 -684 -27 423 -760 344 440 -669 489 144 -636 832
2832 832 -292 -424 676 -670 234 573 -472 376 -24 -495 260 45 -195 373 -100 -250 380 -256 23
2851 23 182 -424 247 5 40 282 -259 14 -236 -59 190 -9 183 -42 -155 32 52 -103 89 -35 -257
2872b57O60m74J14L15r31O87pl44P68n43j51K82l05R0L72l57l3L97n81M55J32
2893B89o89N90l84k8O35m13J11o2k58Q5J55O0r6K21l51J25J41k05J69k42J44o9
2915g2K03J48m46L60m56L6N49n51M49on21M06jk81L14m9n21P40j84l65Q72j062
2937d38J80O60r35Q93%p79O46j95m76Q18k53n92R70o72j07J045j205M07L39j003
2957f97J049m1n87O49l85m83P77k48l75R42q77l2R70j112O23J72j031R46j10m39
2977b89P69l53o19P40l30l05J130j007M2Q00j251R07J87j041R85l73l90R53m34
2996A21m94P80p59p3J212j216N44M79j445J254k31q18J292q10k72J068q20JR05
3015G18j357M37Q43j453J352l2j455J659r59l67J503j293J63R60j299O12P15j551
$$ plain form
2872 -257 403 -71 43 358 -573 114 107 -237 531 -12 -163 119 -186 -96 276 -81 -114 283 -298 157 289
2893 289 -400 190 -194 -222 413 0 111 49 -209 -124 31 91 -5 216 -135 -10 131 -74 95 -147 -3 -72
2915 -72 131 279 -167 193 -263 -227 322 -229 220 214 -307 99 98 -183 131 82 -439 301 117 -248 624 -438
2937 -438 -258 402 -533 360 360 -419 227 32 -444 374 121 -471 499 -173 -280 765 -440 -33 306 -697
2957 -697 352 311 -276 373 -12 -495 282 34 -341 601 -276 -308 662 -450 173 345 -686 260 150 -289
2977 -289 480 127 -492 248 -82 -387 743 -264 -222 578 -673 234 421 -620 365 -8 -398 555 121
2996 121 -373 407 -352 -425 787 -429 115 594 -851 403 172 -646 646 -164 -436 632 -188 -187 718
3015 718 -639 -202 641 -812 540 508 -947 712 -247 -614 889 -404 -241 719 -580 32 747 -804
3033h04R49L15j501J791l93j071J613j363j00J399j337M60Q17j430O41P50j526
3050g90J003L04j590J697m04r11J649j251l38J332j165J89J224j427J46J239j759
3067h52Q73Q36j988J638j26j386K063r57j067J935j262o63K338j739k88K125k667
3084a187J008J531k964K333N3k507L020q86j939L018j745j200L256k482kK722
3100B029l768J726J626l866L351p9l148L676j270j982L554k332q32L327l350R54
3116c84K655m337K441J079l846L618m53k549L407j806j219L155k521j76K852l338
3132a422J109K205l570K166N36k843K712n48j533K511j446r34K282j660m73K371
3148A463k221K14J924k399J149Q33k132J478K05j446J553J6j678J714m44j524
$$ plain form
3033 -804 145 460 -1041 750 357 -714 899 -464 -564 835 -502 -42 775 -655 -14 736 -790
3050 -790 213 517 -1073 624 220 -691 958 -293 -631 701 -464 -275 949 -478 -332 907 -852
3067 -852 21 857 -1131 507 381 -1005 1058 101 -966 969 -293 -956 1382 -357 -645 1480 -1187
3084 -1187 -179 1352 -1612 721 774 -1733 1287 401 -1538 1480 -265 -1465 1791 -691 -693 2029
3100 2029 -1739 -13 1613 -2253 1098 1019 -2129 1547 277 -1705 1849 -483 -1315 2012 -1338 -384
3116 -384 2271 -2066 375 1454 -2392 1226 773 -1776 1631 -175 -1394 1761 -760 -936 1916 -1422
3132 -1422 -313 1892 -1678 488 1024 -1819 893 345 -1188 1323 -123 -1057 1225 -435 -908 1463
3148 1463 -758 -544 1380 -1019 130 963 -1169 309 514 -932 621 637 -1041 673 229 -1295
3164a295K477j276q28K274k039K66J642k164P97J130k170J459Q52k546K232k39
3180E72k369L096j339j103K810k446K68J890k619J283J076k655K080M43k589K826
3196A224r19j899L163k232o3K488k978J310J134k757K039L19k265K309n24j524
3212a175K551j772m06K243k752J316J178k535K113k81j651J998r00p03J794j401
3228c83q7J612j968P97Q76k061J756k69j076J842j332n6J048j355N77P09j145
3245e15O26M65j261J054j13j003J364q68r2J059j048M05J65o47L78J46j97J01
3263A9L37o26L07J48o65O86j46l08M94r8l22K61J06p78Q71j47p10J427j140r8
3283c82J179j576P82O47j362R97K78j358J299j62j467K055j073p83K417k307N35
$$ plain form
3164 -1295 1182 -94 -922 1352 -687 -421 1221 -943 -146 984 -1186 273 1125 -1421 811 572
3180 572 -1797 1299 -40 -1143 1667 -779 -511 1379 -1240 43 1119 -1536 544 987 -1602 1224
3196 1224 305 -1594 1569 -663 -726 1762 -1216 94 1228 -1529 510 829 -1436 873 349 -1175
3212 -1175 1376 -396 -802 1441 -1311 5 1183 -1352 761 480 -1171 827 -73 -776 1018 -383
3228 -383 -470 1142 -826 -29 847 -1214 542 273 -803 1039 -293 -349 699 -656 -79 630 -515
3245 -515 111 576 -685 369 256 -747 617 -251 -343 716 -332 73 238 -409 -31 115 -82 19
3263 19 356 -270 37 185 -480 206 60 -248 246 148 -174 87 193 -585 286 139 -571 856 -284 -382
3283 -382 797 -779 3 650 -712 285 563 -795 504 342 -1125 930 -143 -926 1491 -816 -281
3300b81J564k675J662M93k055K090l10j705K302j111j235K700k162K4K385k987
3316a301J536R20k740K333l76j656K406j058j012K192j623m31K091k292Q62J359
3332A210k438J890j28j669J947r58n23J478j007j33J057j066J9R41j273P08M37
3349D92j077J094m59l87O73o23K47O5L7l3l0K20m87L98j72j52L34o8k6%J99n82
3371c37L79J07o56J130p37j60R31j190N95K45q22O90N8n69O10L4q89R54m06n93
3391f26J393j117K77P22j280Q50q0n78P15k35k57M48n3m65N91m10l03Q47o95M10
3411A54J82o32M91l87J25P5K2J25k98M43l97J2K32m28K76M9k1rK06l27j38N61
3433C16q50P25J29q77J192p89j86Q93j005L21N04p00L58N52j048N37L20j306J484
$$ plain form
3300 -281 1283 -1392 270 763 -1292 798 488 -1217 1085 -26 -1261 1439 -723 -699 1686 -1301
3316 -1301 235 1155 -1585 748 372 -1284 1122 64 -948 1244 -379 -810 1281 -1011 -149 1210
3332 1210 -1228 662 534 -1135 812 -146 -669 809 -198 -331 726 -340 -321 620 -653 55 492
3349 492 -585 509 50 -337 336 -287 -40 25 62 29 -1 219 -268 130 -42 -194 140 72 46 46 245 -337
3371 -337 42 149 -507 623 -114 -274 657 -533 62 307 -515 175 233 -336 274 308 -581 373 -33 -626
3391 -626 767 -350 -73 649 -631 219 139 -439 276 41 -216 232 179 -286 305 -105 -408 439 -256 154
3411 154 336 -296 195 -192 -67 8 30 155 -143 300 -97 -85 147 -281 -5 44 23 14 220 -107 -245 316
3433 316 -534 191 320 -557 635 -154 -340 553 -452 -131 373 -327 31 583 -465 72 392 -914 570
3452E70m15q20J655j427J29J055j418P17M36j077P63L77j200J059j15j293J753
3469G49r22l57J694j797N34P47j473J066K14j071R38Q3j142J345l99j154J860
3486I15j372k9J668j910Q66N22j617J200K10j194J249o2j389J748p16j051K191
3503A229j867J13J795k227J226N69j979J447J54j510J793k49j686K308j313r04
3519a101K670k507N08J837k720J738N63k338J906n0j894K396n79j712K847j966
3535d02p63K951k948R00J836l064J909O22k425K115j77k149K661o61j850L243
3551A798k168r40L099l008Q50K042l055J627Q87k627K081L93k766K671k13k481
3567a810L623j840j419L333k993L81K578l127J207J730l355J835J410l612K934
$$ plain form
3452 570 155 -665 990 -437 -308 747 -671 46 482 -595 168 545 -655 404 289 -1004 749
3469 749 -173 -530 1164 -633 -99 648 -825 241 455 -616 322 405 -737 608 209 -945 915
3486 915 -457 -486 1182 -728 138 660 -957 243 453 -741 508 446 -943 805 89 -962 1229
3503 1229 -638 -525 1270 -957 269 838 -1141 306 460 -1050 743 494 -1192 1116 -197 -1101
3519 -1101 1569 -938 -430 1407 -1313 425 988 -1350 556 506 -1388 1008 429 -1283 1564 -402
3535 -402 -1165 1786 -1162 -262 1574 -1490 419 1041 -1384 731 554 -1595 1066 405 -1445 1798
3551 1798 -370 -1310 1789 -1219 -369 1673 -1382 245 1132 -1495 586 979 -1787 884 671 -1810
3567 -1810 1813 -27 -1446 1887 -1106 -725 1853 -1274 -67 1663 -1692 143 1553 -2059 875
3582H75J65l334M151j709j950M062l317k38L538l647R41K769m224J844J959m437
3598b552L667J28l974M981k253k163M956l901l94M022m185J146L057m643K378
3613B70J592m801M473m48l833N328k828j836M807l911Q9L360m038J496K401m124
3629b003K681Q29m213M157q25k802M476k689j058L450l109N02K256k960J130J650
3645A472l000K028P56l176K866n75j952L093j594q01K103j821kJ747j753J70J720
3662A281k321R68J491k846J820L23k169K273m18j268J823j051r34K115j463m82
3678h58K550k684N00K115l108J891M63k471K525o69j413K567j502j195K739k138
3694f88k15K750l066J243J286l137K914o64k052L175j902p47K861k378p5K240
$$ plain form
3582 875 1040 -2294 1857 148 -1802 2260 -1057 -1295 2243 -1404 -463 2306 -1918 -74 1885 -2552
3598 -2552 1115 1243 -2731 2250 -3 -2166 2790 -1111 -1505 2517 -1668 -522 2535 -2108 270
3613 270 1862 -2939 1534 1086 -2747 2581 -247 -2083 2724 -1187 -1098 2262 -1776 -280 2121 -2003
3629 -2003 678 1507 -2706 1451 626 -2176 2300 -389 -1447 2003 -1106 -604 1652 -1308 -178 1472
3645 1472 -1528 500 1256 -1920 946 371 -1581 1512 -82 -883 1220 -601 -603 1144 -609 -439 1281
3662 1281 -1040 -72 1419 -1427 393 716 -1453 820 402 -866 957 -94 -1028 1087 -376 -858
3678 -858 1692 -992 -492 1623 -1485 406 869 -1602 923 254 -1159 1408 -94 -1289 1450 -688
3694 -688 -903 1847 -1219 24 1310 -1827 1087 423 -1629 1546 -356 -1103 1758 -620 -695 1545
3710A545k927J243J626l277K870l06k800L748k086r27L159k917O13J910k782J620
3726C12Q93k997K527jk644L719j816j422L364l116O44K183l059J722P62k489K116
3743F98rk095K383q76j462K971k080j73K226k889J243J089k221J731J25j643J413
3760D31N5j514J727m59j380K170j219m46J812j777K28J036j247M96R24j351L59
3777a55J069k018J361O57k322K284n13j609K491j275r77K124j581m76K492k212
3793f60J24K226l284J675J265l215L018o17k227L250j728j066K875k387k92K908
3809A865l051R51K200l991K539N87l273L747j285j861L288k216m90K628k555L08
3825f09K215k988J525J362l247K658m41k164L131j664n73K165k061K06J465j679
$$ plain form
3710 1545 -1382 -139 1487 -1790 1080 774 -2026 1722 -364 -1291 1868 -1049 -436 1474 -1308 312
3726 312 1205 -1792 735 734 -1910 1809 -7 -1429 1935 -1181 -537 1646 -1413 309 1071 -1418 698
3743 698 689 -1406 977 101 -1361 1610 -470 -643 1583 -1306 -63 1026 -1195 536 661 -982 431
3760 431 486 -1028 699 240 -1140 1030 -189 -635 1177 -600 -372 664 -583 -87 837 -514 -155
3777 -155 914 -1104 257 914 -1408 876 363 -1246 1245 -30 -1007 1117 -464 -940 1552 -660
3793 -660 -536 1690 -1594 81 1346 -1869 1149 532 -1695 1555 -173 -1239 1636 -751 -1043 1865
3809 1865 -1186 -235 1965 -2026 513 1100 -2173 1574 289 -1572 1716 -500 -990 1638 -917 -609
3825 -609 1606 -1382 143 1505 -1742 916 475 -1689 1442 -222 -795 1370 -691 -485 980 -699
3841f99N15J135j842J045O27j806J695n89q92J489r82J97N80o54O7J99j44j96
3859b55O30m95o0N60o60L87L7k97P4J30K3k83P19p21l0P53j230R91J31r95J113
3880E22n36l73P75m06m18Q26n28k88J251j285L85O71j540J344j81p96J263q30
3898a44j66O87n69q0P07o37l3Q59j064O01K20j043J068n28p2O19o08L07j40n9
3918g5j3J30K5k02L73l55J63R5l31K63k66L45k57J72J82o58P34o11N3P04q93O12
3940A90M4n86N20o5m45M94M4p13J048m60n70J330j486N14P76j456J309k13q69
3959e94J118n25n50J083o11n07J444j255J05J281j977J257K39j584J880p29p19
3976f44J458j049l18J277j070j03J444j718P19R32k111J747k32j434K093j110
$$ plain form
3841 -699 -184 951 -891 154 781 -1025 670 81 -811 678 -304 -107 473 -181 -114 85 -59 -255
3859 -255 375 -120 -180 380 -280 107 144 -153 -79 51 74 -209 510 -211 -241 512 -718 273 404 -591 522
3880 522 -14 -387 388 -18 -436 390 -138 -426 825 -460 -75 596 -944 400 219 -577 686 -144
3898 -144 -310 377 -192 -272 435 -202 -235 624 -440 161 381 -662 406 -122 -194 425 -183 124 -16 -75
3918 -75 -88 42 67 -135 238 -117 46 141 -190 73 -193 152 -105 67 249 -409 325 -286 -233 471 -422 190
3940 190 234 -352 168 103 -342 152 196 -517 531 71 -499 831 -655 -141 635 -821 488 275 -594
3959 -594 524 -1 -551 532 -79 -586 858 -397 -292 989 -988 269 508 -1076 804 75 -644
3976 -644 814 -235 -553 724 -346 -449 995 -723 -4 928 -1183 564 332 -1102 991 -119
3992a19m60J484j271j36J350j388J67J507k076J079Q28k287K086m44j512K236
4008A044j184o00J800j429k93J728j768K19J841k493J298R46k655K398m66j739
4024a353K530j255q33K164j568n56K251k232K70K157k982J683J001k984K637m71
4040D59j978K756j249j128K542j701p47K649k547K75K440l341J840J099l193K775
4056I51l77k194K783j022j488K815j636j052L014k696Q8K731l483J660J412l276
4072a770K537L3k440K683n86k028L003j310j653L436k645l34L114l549J449J735
4088A675l458K333N51k869K664j48k593L269j164j989L785k811m17L323l793J514
4104a28J916l654K399O81l115K829j18k759L540j465j810L881l169K4L050l828
$$ plain form
3992 -119 -579 905 -366 -502 848 -540 -373 1134 -942 137 965 -1322 764 320 -1192 1044
4008 1044 -140 -740 1060 -369 -662 1066 -702 -483 1358 -1135 163 1109 -1546 852 386 -1353
4024 -1353 1177 -78 -911 1253 -315 -871 1380 -852 -582 1575 -1407 276 1277 -1707 930 459
4040 459 -1519 1237 -12 -1140 1402 -299 -1046 1603 -944 -669 1771 -1570 270 1369 -1824 951
4056 951 574 -1620 1163 141 -1347 1468 -168 -1220 1794 -902 -814 1917 -1566 94 1506 -1770
4072 -1770 767 800 -1640 1043 457 -1571 1432 122 -1531 1905 -740 -1074 2040 -1509 -60 1675
4088 1675 -1783 550 1101 -1768 896 748 -1845 1424 260 -1729 2056 -755 -1172 2151 -1642 -128
4104 -128 1788 -1866 533 1214 -1901 928 810 -1949 1591 126 -1684 2197 -972 -948 2102 -1726
4120a726J786J528l386K509K91k755K765n21k199L342j800j185L324l103N93K233
4136A696l308J917P19k419K153k00j807K102p24j315K496j630m87K278k508Q39
4152a98J306k235J503R2j280J355k67j018J353n21j043J930j164m59J769j781
4168f58N24P91j417J057J01j040R72Q3j204J263r2j426J868r14o02J814j769N16
4186a33R07j720J143M75j546J219K93j767J865m21j493K453j807j68K223k576
4202a053J067J062k374J697L42j910J935l44j751K603j484r36K975k928O45K118
4218A664l290K139M98k687K616o02j793K830j347j353L009k445j46K815l457J684
4234A35J275l299K905l71k263K944j307j349K772j760o32K658k754N32K124l191
$$ plain form
4120 -1726 60 1588 -1798 711 1002 -1753 1012 491 -1708 1634 -166 -1351 1973 -1130 -537 1696
4136 1696 -1612 305 1024 -1395 758 558 -1249 853 129 -1186 1310 -320 -807 1471 -1037 -198
4152 -198 1108 -1127 376 468 -812 543 276 -742 611 90 -953 977 -187 -646 1123 -658
4168 -658 -134 657 -760 297 398 -642 330 413 -791 472 380 -1046 822 -92 -694 1120 -649 -133
4186 -133 774 -946 197 672 -874 345 638 -1129 736 315 -1178 1275 -532 -700 1523 -1053
4202 -1053 14 1076 -1298 399 741 -1169 766 422 -1329 1274 -210 -1146 1829 -1099 -454 1664
4218 1664 -1626 513 1011 -1676 940 338 -1455 1375 28 -1325 1684 -761 -907 1908 -1549 135
4234 135 1410 -1889 1016 645 -1618 1326 19 -1330 1442 -318 -950 1708 -1046 -514 1610 -1581
4250a581K023O43k712K552n91j485K156j036r24J979j299n00K142k122K86J740
4266A271k514J451O84j991J564l7j344J423r1j379J636m12j349K238j300o85K049
4283A214j996M52J352j810Q23Q70j864J051Q38k194J905N2k248K827j289j155
4299a172K707k242N3J964k223P39J439k410J205J012k620K353j45k266L031j702
4315b77p76K655k454M47J630k272J038J130k241J460N03k302K352n60j505K507
4331A335j809j40J761j953P94P35j498R34L69j230J074Qj274J563o91n98J536
4348I16j357L09O08r53O39K3l85J81J78l33K03K70n93M64j73k00M36l10J74j22
4368b5M9o6q3M71o18M32l0m99Q03n82L1L73m80J39L07k52j44N47o86K00N66r81
$$ plain form
4250 -1581 442 1085 -1627 925 334 -1151 1005 -31 -955 1024 -275 -775 1367 -755 -469 1271
4266 1271 -1243 208 892 -1099 465 428 -916 507 416 -963 673 261 -1088 1150 -150 -835 1214
4283 1214 -782 -330 1022 -788 35 905 -959 92 930 -1264 641 693 -1555 1272 -17 -1172
4299 -1172 1535 -707 -654 1310 -913 -174 1265 -1145 60 1072 -1548 805 660 -1606 1425 -277
4315 -277 -1053 1602 -852 -405 1225 -1047 -9 1121 -1120 340 843 -1459 893 333 -1172 1335
4331 1335 -474 -614 1147 -806 -12 723 -775 159 528 -702 372 380 -894 669 -22 -620 916
4348 916 -441 -132 476 -477 162 185 -200 -19 159 -174 29 299 -294 170 -3 -203 233 -77 97 -25
4368 -25 24 -42 -125 346 -272 160 130 -369 434 -148 -117 256 -224 -85 222 -30 -174 373 -313 -113 453 -528
4390e28Q92k47o36J018p29J25M38n94K16K12k77J13L34o72L77K10o94Q96n23j57
4410b26O28p95N32kk64K77j97K7K0J65k59J23K4k59M29l81K59J3l73M88m65L53
4432A17k0k57L75m51L27k8j88K73k22K4L1J28k24K35n4l81P15o14J98M06q80P88
4454B98k80l04O82n79P8L17l49L8M44n66Q0N57r91Q83j7q95J215q84l5Q74r69
4475d03M36L28p96M55L75q24O00J65j090J276n45n11J388j311K64P78j128P18
4493A75K13q85O35K57r53R02l7j049J412q36l89J424j381M08O63j193P12L49q92
4512d65N80L03j126J045Jj153J569q87m70J468j323K95Q18j221M97O23j113O28
4530F9N99j534J217R4j410J815q72p01J621j317J01J102j249K50R12j311N94Q16
$$ plain form
4390 -528 364 117 -519 499 -230 -105 333 -261 -45 167 -110 3 337 -335 42 252 -442 454 -69 -226
4410 -226 402 -393 139 137 -127 150 -47 -20 0 165 -94 29 53 -206 223 -158 101 114 -259 229 -236 117
4432 117 97 -160 215 -236 91 63 -125 148 -74 -50 -19 109 -115 120 66 -315 400 -214 -16 390 -490 298
4454 298 18 -286 396 -183 -105 212 -137 -99 345 -221 -141 416 -575 308 291 -604 611 -273 -308 566 -403
4475 -403 33 361 -435 20 395 -429 171 336 -754 522 -23 -534 854 -457 -193 585 -543 175
4493 175 388 -497 138 395 -558 344 307 -742 670 -166 -555 869 -512 -104 559 -634 78 427 -465
4512 -465 115 418 -708 337 338 -815 754 -133 -603 865 -458 -163 655 -566 -69 554 -559 69
4530 69 668 -866 351 445 -965 850 -22 -723 898 -419 -318 784 -465 -215 697 -614 -20 796
4548G96j706J290R7j520J885q48p38J657j273m7J207j218Q4J162j478N12J051
4565I13j885J364J30j588J848p49p43J566j117k08J227j086n0J275j521M60J033
4582H69j849J354J78j565J716o38p93J477q74m10J228r62k15J391j496M13J047
4599H71j853J356J22j420J576o18o97J358q28l96J256j038j56J346j518N84Q81
4616H26j783J395r4j140J511p87m95J221q59j88J116j086P9J089j569R26M29j494
4634i03J542o11o81J364r72n6Q72r04J60P64j015M13N64j273J071n0r69J332q16
4653a68j86R42r40L11M40p38L24M01p99N25L02j005R93l16n65J048q53J17O27
4672D60q47L77L45o24K34M18p56M62K95r55R90l35o26J164q59j1P64p95J10O51
$$ plain form
4548 796 -910 380 477 -1043 842 -6 -744 913 -360 -407 800 -418 -334 828 -650 -138 913
4565 913 -972 392 522 -1066 782 33 -710 856 -261 -469 758 -328 -378 897 -624 -164 869
4582 869 -980 374 552 -1013 703 65 -728 749 -125 -535 693 -269 -484 907 -589 -176 871
4599 871 -982 374 496 -924 652 34 -663 695 -133 -529 727 -311 -467 879 -639 -55 826
4616 826 -957 438 344 -796 715 -72 -567 654 -205 -393 723 -363 -284 805 -764 162 591 -903
4634 -903 639 28 -653 711 -261 -317 555 -349 -189 575 -440 -27 537 -736 335 285 -684 648 -168
4653 -168 -354 588 -352 -41 399 -339 -15 386 -413 112 414 -591 402 86 -479 569 -284 -167 460
4672 460 -387 -10 335 -289 -55 363 -393 69 364 -591 399 64 -562 602 -257 -268 496 -299 -189 462
4692D62p66J58O92j140O84M17j329J372l76r08J460r31k06J085j035Q3R91j254
4710e41L96R54j676J116L74j679J801n97r98J787j261j45J370j441K21J218j669
4727g70P03R65j968J519R0j686K111j025q17J968j544jJ382j541L85J101j642
4744g70Q63O70j839J644j95j410J982j052n70J568j296N6J071j217L02R00j363
4761f56P00O17j505J263j04j089J417o78m45J038p31j86Q63o84j80R76r72J63
4779a93Q52j289P73K67j024R65j77o83Q81k30o69R66l95o04J257r42j18J114j329
4798e78N62N46j168Q72P9q97R11p8q96J162m56o97J399j071l0J103j403P00M42
4817E02j139Q59Kp33Q17j04p15R86n49l86J126j037K20P38j139P45O7o62O65j70
$$ plain form
4692 462 -304 -146 546 -594 90 507 -822 550 174 -734 726 -205 -411 674 -361 -278 713 -541
4710 -541 -145 809 -867 249 623 -1056 745 148 -850 937 -324 -469 901 -540 -319 899 -770
4727 -770 -67 898 -1070 449 539 -1147 964 -61 -878 1090 -454 -455 927 -614 -229 872 -770
4744 -770 93 763 -1076 568 373 -1037 945 -107 -677 891 -405 -349 722 -495 -193 707 -656
4761 -656 44 661 -844 419 315 -774 643 -35 -480 558 -173 -359 504 -180 -360 616 -356 -193
4779 -193 659 -630 143 410 -614 351 174 -509 372 142 -527 439 44 -560 697 -245 -363 751 -578
4798 -578 -16 530 -638 234 313 -584 327 249 -647 515 59 -638 761 -310 -340 763 -640 60 502
4817 502 -637 222 224 -509 308 204 -511 475 -74 -460 666 -371 -151 587 -552 193 260 -402 263 93
4837I3l81N13j89l24O26m44j30O29p05L79K03n91N32k62j07K83j96P6N9m8r9J99
4859A16j47j0K01l09K41o9j10K40k91K23j34L4J23k23K14j27RO8j08J11p8K8o8
4882f6J29m4r8K15l38K86jk65L99l41J47Q1k48K33j00j5J4M0p5N9Q1k23K58j86
4906e8K8K20l66L28j39j36L11l02J76l1n3O3m6K1o5J19j73J54K7j82K72k88J32
4929A2N9k39L24k32N0J17j73J24p8K7k2N6n3j9J78k46K35j45m7K37l18K51q5j38
4953a25K64k53J37J9r6Q7j3m1l9K19k74J75k3k40M15l40P2K25l92L35r1j79K84
4976A26j12j28J75j2k14L78k87o4M32n58L40J45n19N06j98j63L61k20r1K75k18
4997d6j13M10l95Q4L38o04M73om10N15k95j05L01j55j05K93k31j16M12m19Q9L70
$$ plain form
4837 93 -288 225 36 -288 338 -106 -236 393 -312 67 270 -321 211 -51 -158 125 -71 5 64 16 -83 116
4859 116 -31 -41 160 -149 92 23 -87 153 -138 85 -49 -15 108 -115 99 -28 -19 49 -59 52 -26 2 -66
4882 -66 63 19 -79 136 -202 84 83 -182 217 -124 23 104 -144 89 -11 -26 -12 28 -47 12 93 -130 128 -58
4906 -58 -30 190 -176 152 13 -123 188 -114 62 31 -22 41 -5 16 -49 70 -103 51 78 -104 168 -120 12
4929 12 71 -168 156 -76 -26 91 -82 42 -36 -9 -31 25 -28 -47 131 -115 120 -25 -72 165 -153 98 13 -125
4953 -125 139 -114 23 42 -54 33 20 -21 -60 159 -115 60 37 -203 212 -128 -56 169 -223 112 21 -158 126
4976 126 14 -114 61 49 -165 213 -74 -138 294 -264 76 221 -298 208 10 -153 208 -12 -103 172 -46
4997 -46 -159 251 -144 -60 278 -326 147 141 -269 246 -49 -154 147 -8 -113 180 -51 -167 245 -174 -85 285
5019B85n87M35Rl83M33j89j63K61p3j86L43j43k62N06m60J04L91n85L61N8l84
5040b29L60o9k21K34mk82L84r4l37N77m70K0M12m90K65R5l76L11j2k30K36L6m03
5063b87M90j69k93N82n04P3L84n29L71P3l92K65K3k48K44O2m28M71j99j88N21
5084C22n20J51K74m68L36K9k86K14M2k62K62J1l59M44k55j12M48m44J63J68l58
5105b00K66l8j32J79j5k14K49m5k50M34l41j1L72m43K73L9k77K74r7j00J89o2
5127E0j67K45j45j41L95l82J50K07m97M27j42k04L77k08r6K88k03o9L31l54J7
5148a21L55m74L44M9m23N05k58j76M51l42k5L05k55j4L28m06R1L04n33M42k2m26
5170c01N54k82j55M05l20QK65k19o0L40m44J85K87o16M78J7l92M57k07k05L69
$$ plain form
5019 285 -302 133 142 -241 192 3 -160 101 28 -158 185 42 -220 286 -174 -70 321 -264 97 155 -229
5040 -229 131 62 -159 75 71 -211 173 79 -258 319 -151 -131 281 -209 56 151 -225 86 74 -156 80 116 -287
5063 -287 203 34 -259 323 -181 -108 276 -253 118 191 -201 64 87 -161 83 145 -283 188 -11 -199 322
5084 322 -198 -47 227 -241 95 124 -162 52 94 -168 94 105 -254 190 -65 -177 271 -173 -10 158 -200
5105 -200 66 28 -104 75 60 -154 95 50 -200 234 -107 -118 254 -189 84 123 -154 120 23 -77 112 50
5127 50 -117 128 -17 -158 237 -145 5 212 -285 142 0 -204 173 -35 -131 157 -46 -115 216 -138 -121
5148 -121 234 -240 104 153 -270 235 -23 -199 252 -90 -115 190 -65 -79 249 -157 -66 238 -295 147 125 -301
5170 -301 253 -29 -184 221 -99 -91 174 -45 -105 235 -209 -24 263 -353 125 142 -250 207 0 -205 164
5191A64j99j14L67k50j50M89n21J49M03o57L88J09m69N14j35l16M48k13k80N67
5211B94k64k98O42o02Q1N26p33M47J31n39N02o9m32N08j30l68N99k97k78O93o62
5232b49J52M51p08M34J56n56M76jm25M80j19l76N84l33j88O21o40J62L78n96M02
5253A05Q2l83L33n5l16L74m8l85N13k51j68M73m19J09K14l83K62N1k51J78P7k50
5275a38J81N4k99L62j19j86L07k25L9J35j98Q9J12j86RK24k38N9J63l23K81q2
5297B1j63L12k08NJ32j32j7J42j41m5K46k76J27J39l38K89q4r8K21j56k0J26j14
5320c2J5P0o2m1J55k00J52N2k70K93j69kJ48j79J10l3l6M4o5M3j5N7p8P7o7l8
5346g1J66j97J34Nr8J48j53Q0L8r5N5j5J1KM3j03M8O9j48J87j38NJ50k00J51l7
$$ plain form
5191 164 -35 -149 218 -32 -182 307 -214 -65 338 -319 69 178 -291 223 88 -228 220 7 -273 294
5211 294 30 -268 374 -228 -147 379 -354 93 224 -315 187 118 -314 194 64 -304 295 -2 -280 413 -249
5232 -249 -97 354 -354 80 236 -320 156 155 -270 210 91 -285 299 -34 -222 399 -241 -79 299 -297 105
5253 105 187 -196 137 82 -234 140 92 -293 220 -31 -199 274 -145 -36 178 -205 57 108 -143 35 112 -138
5275 -138 43 97 -202 160 41 -145 162 -63 -24 111 -87 2 114 -72 -63 161 -77 -18 145 -178 103 21
5297 21 -142 170 -38 -33 99 -33 -50 92 -49 -94 152 -124 3 142 -196 93 9 -89 132 -24 -44 82 -32
5320 -32 -17 53 -9 -50 105 -95 57 109 -161 132 -37 -39 109 -70 40 7 -29 15 -50 -7 -22 35 -43 34 -33 -71
5346 -71 95 -102 32 37 -61 87 -66 14 52 -43 12 -3 8 10 53 -50 -2 67 -81 106 -32 -27 123 -77 74 37
5372C7q0P3m4J8K3J9r9P7or0J55j63O7J01j72J79j04m1O8j8J2n5Q3q5N2K3r9J25
5400E6j08M3O9q6O2n1L1m3O0L6j16J62j25oJ15j80J46o8k4K7L0l4qN2j22J38p6
5427b0o6K14k03Q9M3j63J56m9k3L2lk2J5J8q1J37q1l4J26j35R1mq5J16p2M0l0
5454FJ5j3k1O1q2Q5p5J7M3o5J03n3l8M2o4Q4p5J8K2m8P0o2L9J2o9N6k9L3n3R7
5484E6l3o1J47j73J56n8r0J58j02J7K8n1jJ1Kl9J10j16L1J00k15J82l2r2J47j25
5510d3M9J1l2j7N4k4o1J27j16M6P5j80J84o3m2Q6j00N3J6k4l6O4Jo7J16j03L5
5537IM9j36J23n3JN5m1Kk4O2r6P2k6m1J28j29M5L2j33J22o6N5J8m6J3l3N4o8J08
5566E6p3j2J06j32Q9Qj01J24j09K2N1j2lj3J4r6J51r5J8R4j85J77o9p5Q2p2MP8
$$ plain form
5372 37 -43 30 -14 4 27 46 -53 24 18 -72 83 -80 -13 88 -84 95 -9 -50 18 0 12 -43 40 -45 7 30 -69 56
5400 56 -52 -9 60 -26 36 -15 16 -27 33 69 -47 115 -10 -16 99 -81 65 -3 -27 0 30 -4 -12 40 -82 56 -20
5427 -20 -86 128 -75 14 57 -106 50 1 -22 10 7 -15 0 18 -63 74 -7 -41 85 -50 41 37 -48 68 -4 36 6
5454 6 21 8 -13 48 -34 51 -24 -7 36 -29 74 21 -17 25 -39 45 -30 -12 10 -38 32 -30 9 21 -48 8 -21 12 -41 56
5484 56 23 -38 109 -64 92 34 -56 102 0 17 45 -6 -7 4 6 -33 77 -39 -8 92 -123 59 27 -65 82 -43
5510 -43 6 17 -15 -32 22 -2 -63 64 -52 -6 69 -111 73 10 -32 54 -46 7 23 -1 -37 27 28 -39 77 -26 9
5537 9 58 -78 45 -8 -7 48 7 9 -15 47 -49 23 -3 -44 84 -45 0 32 -101 21 -45 10 28 -18 -5 -38 16 -52 56
5566 56 -17 -29 77 -55 34 42 -59 65 -44 -22 29 17 14 1 15 -81 70 -25 -7 87 -98 79 10 -65 17 -55 -51 27
5594B7m9pM9k5k6J31k03J09J11k53K38j02r5J30r5K4Q6q0K0Q9j18k0J92k68J77
5619D2M0j84K46j35q2J99j84%J56j48J0J46j68PJ96l16K14L2k11K68j34j23K38
5642A09j61j0J48q7r0K44k36M1K06l28K14M6k37K80j05j56K09r4q8K43j47p7K25
5665A49k88P8K45l57K34L7k60K69p5j61K16r0j09J99r3r5K72k74K3K56l54K09
5687C1N2k13K25m2j55K08l3j97K03p7j53L21k48lK42k44P8R7j96J49K5j71J45
5710D4M0k00K19o0k13L59k37m0K36k54P6J23j88J08O1j78J27N5k02J95k8j88L26
5733A81k22k4K18k32N3R2j45J00O5j72J36K1j84K25o7j60K46j93L2J03j56J00
5755A7K6r1O5N1j56P5O6j45J42o1n5J40j42Q2N0j19P1L1o1J4M6o5K0N3j49J45
$$ plain form
5594 27 -22 -29 20 -5 -31 100 -103 6 117 -136 102 0 -95 35 -60 -36 50 -30 -10 79 -39 -59 133 -135 42
5619 42 82 -102 144 9 -73 126 -58 -58 98 -50 -40 106 -62 -55 141 -175 39 71 -140 128 -6 -129 109
5642 109 -52 -62 86 -1 -91 153 -83 -42 164 -164 50 96 -141 139 34 -122 87 -7 -95 148 1 -76 149
5665 149 -139 -61 184 -173 61 98 -162 107 32 -129 87 -3 -112 87 -6 -101 171 -103 -80 176 -178 31
5687 31 83 -130 95 53 -102 106 73 -124 79 2 -151 170 -78 -81 161 -83 -5 92 -104 45 70 -101 44
5710 44 84 -116 103 43 -170 189 -48 -88 148 -106 -30 93 -95 13 74 -104 23 78 -124 71 43 -145 181
5733 181 -41 -65 153 -79 -26 66 -79 21 86 -86 50 71 -113 112 45 -115 131 -62 -30 73 -83 17
5755 17 43 -48 17 68 -88 -13 53 -92 50 -11 -66 74 -68 14 64 -55 16 47 -14 0 46 -19 1 54 -95 50
5781E0o6k4J23j46J00m1k7O1k2j3k0R0q8K6L4n6O2o5j7O5l5K1k5PKj0L2n7P6o3
5811b6O5j3o0Q8n9nM7o7N1j7k8O4k0k9k3P0n7P3l3m9J27j79P7M9j40J46n5LL4
5840C4k0o0M5Np1J40j26RJ45k19J52Mj45J75n7l3O0m6n7J43o5q4J93j45K8R1j83
5867h7J25rj14J77j00k1Q3n5o7J44o8p1J55j31M1O3j61J21k4l3J00o2l7L1Kp0
5893f8R0qr8J38r4K0N1j00Q7k2l2K7J2k1j9Q0j28J02K2j36J80q3k4Q7m7l9L0m0
5921c3l8J18n9n0J28j62Q2O4j52J75n9o0J00q2K9J5mo0J09q6k2J35j39P6K0j26
5947h1J39q8J3L5lj5oN1p4O9k7m7R6q4K6Jp6J12q2M6k4M1k2n7J12j19O6Rm1O6
5977C6m0mj5J6Ml7Q4q4Q9pj21J84j36M4lm0M6nkj7N0r1N4P2j46J00k3n5J32j44
$$ plain form
5781 50 -16 -40 83 -63 37 -4 -31 30 8 -5 -25 65 -23 3 37 -19 43 -22 -39 26 -9 12 -13 -6 -4 -14 18 -39 37 -26
5811 -26 39 26 -34 54 -5 -10 37 -30 21 4 -24 40 20 -9 -32 38 -19 54 21 -28 99 -80 -3 46 -94 52 -3 0 34
5840 34 14 -46 -1 4 -67 73 -53 -44 101 -118 34 38 -107 68 11 -22 38 -8 -65 78 13 -71 122 -23 5 96 -87
5867 -87 38 29 -85 92 -8 -29 54 -1 -68 76 8 -63 92 -39 2 65 -96 25 1 -32 68 6 -31 0 2 -68
5893 -68 22 14 -84 54 -40 -20 31 -69 18 -4 -36 -9 3 -18 -37 43 -85 17 39 -97 83 0 -24 63 16 -23 7 -33
5921 -33 -71 47 -12 -62 66 -96 -14 50 -102 73 14 -46 54 -28 1 16 12 -48 61 -25 -47 88 -51 25 45 -81
5947 -81 58 -30 -17 18 15 0 -6 45 -29 40 13 -34 62 -22 4 5 -71 41 -41 5 -19 22 0 -57 55 -64 2 11 -30 36
5977 36 -4 -8 -23 -7 -3 -40 44 -40 49 42 -79 105 -31 13 10 -30 16 11 9 -8 42 -49 5 77 -69 31 8 -47 85 -59
6007e9O1O2p8M3pj5l5N4p1M1M9j35J62p3m6R1q6P2l4l2N3J0l7KM2q4O7L8j08J20
6037F7n5k4O4r3M4J0nl0M6rk6O5r1O2J5j23J38r4kQ0j09R4k5j2k1N0j6l0J05j38
6067f3J11j3q7J24q5J7L7n5lM7l0n4J09p3j1Q6j37J43k4j26J81j32pP9q6K7M0
6094A5m2l0J35j53O9O8j84J97p3j13K05j35QJ10j05lR3j01L7J24j85J10O4k42
6118a31K33o9j21K29j81J7J34j49QJ16j45rJ88k51J28J10k67K56p9j03K28j93
6140e1k4J77j32k5J75j78k7K29k78J55R1k69K40o3j45K41q6j15J97r6j20K51j97
6163e0l1K47l04J67J37l38K79o9k10K67p3j53K04o6j26K46j58m6K86l64J74J01
6185A20k83K40k6j86J97jj92K28q0j40K58j71o6K88l27J39J51k82J89K2j68J34
$$ plain form
6007 -59 2 64 -14 29 22 7 -28 26 -45 -4 45 -90 72 -1 -47 44 -42 30 -4 -36 17 27 -10 -8 34 -50 17 55 -53 67
6037 67 12 -12 52 -41 3 13 8 -22 24 15 -11 54 -37 25 40 -83 55 -39 -41 39 -70 24 -1 -13 -34 16 0 -30 75 -63
6067 -63 48 35 -52 72 -13 4 41 -14 -17 30 0 -54 55 -18 -29 57 -80 63 39 -87 94 -38 -45 34 -52 -25 15
6094 15 -27 -57 78 -75 -6 62 -122 75 2 -111 94 -41 -33 77 -28 -31 62 -39 -2 122 -63 47 111 -131
6118 -131 102 33 -88 141 -40 -23 111 -38 -30 86 -59 -68 120 -131 -3 107 -160 96 17 -86 142 -51
6140 -51 -75 102 -30 -55 120 -58 -85 144 -134 21 112 -157 83 20 -125 116 30 -85 112 16 -104 147 -50
6163 -50 -81 166 -138 29 166 -172 107 38 -172 95 22 -131 73 7 -119 127 -31 -77 209 -155 19 120
6185 120 -163 77 51 -135 62 61 -131 97 17 -123 135 -36 -102 186 -141 -2 149 -133 56 78 -90 44
6207D4Rj37J53k3k24L53k37p0L12l02J25J13k18J17R5k17J43M4k15J95kk14L31
6230A75j92q9K96l06J17J02j96J18M9j65R0P5k26K44K2k66K78j67m1K15k30J02
6252EO6j55J06J6j29R8P2k07K20n5j47K00j62L1J39k17J23J9q9R7K2r8L7O6j53
6277i5J63l1j02J76j83Q7M5j32J05l5k2K6J8n0N4L5j13J15n1l5J33j58M1J5p9
6302g3R8k3j0J8J6m6L5J9j02J29r0k3J44j67J06j3o3P7Lm8K6L7j19R5L2j55K24
6329A27j66qJ93k16J34k5j25J15j3p4R1K7j60J63p9j12K50k27Q6J53k78J85K3
6352F4j62J48m1p9J18Kj66K26j54p8K76k53Q6J41k48K03o9q7J53n2q5J06Kj63
6376a12K21j19r4K50k60J29R0k05J35l2p2R1Qj01Q6L4j65K03q8j05K06j73P8P1
$$ plain form
6207 44 53 -84 69 46 -178 175 -62 -132 180 -122 3 116 -102 15 110 -107 36 80 -135 60 58 -156 175
6230 175 -17 -106 190 -116 1 103 -93 25 74 -91 -1 74 -152 92 114 -152 126 -41 -82 133 -97 5
6252 5 71 -84 22 38 -91 7 79 -128 92 37 -110 90 -72 -41 98 -119 4 23 -66 31 53 -45 -8 58 -95
6277 -95 68 37 -65 111 -72 15 60 -72 33 -2 -24 2 20 -30 24 59 -54 61 10 -25 108 -50 -9 6 -73
6302 -73 25 2 -8 10 26 -20 15 34 -68 61 -29 -52 92 -75 31 18 -45 32 35 -13 13 50 -69 26 58 -97 127
6329 127 -39 -47 146 -70 64 39 -86 29 16 -58 33 60 -100 63 -16 -128 122 -105 -19 134 -144 41 64
6352 64 -98 50 9 -70 48 50 -116 110 -44 -122 154 -99 -13 128 -120 83 14 -73 80 28 -57 49 51 -112
6376 -112 109 -10 -104 146 -114 15 105 -100 35 3 -69 22 30 -71 15 49 -116 87 -1 -106 100 -73 5 76
6400G6j17N8jl5j7J16j31N5Q3j96K02p2r9K24k06M7P5n7k2N9o0m5J54j41L1J29
6426A10k25J75l8j16J62j30L2P2l9m5Q3n1n7J56j42J4J44k05J75o6n6J11j10L6
6450a0L6l2k5J03n8o5J14j36P8N1j15J33j15L8N5o5K1n6Q5m2K8Jp4Q9n4J4Km5
6478d4Q8j11R8p5MR3j43J56r9KR3j05P0k3K1k0k3J6J2P0j71J14M7j83K29j32k7
6505d3J20j71J22Mn4J6J7n5L2J25k10J43k8j28K05j57N5P8j64J08nk6L6K6j06
6530f0L6J06j67J70r7n8J91j81P5O0p6J6qj1j1L0n0K7R9k01J81o6q4J66j23M9
6556A3J0q1O0k2J2k1J08j44O9P5j91K02q9o6J78j68L8J00j18J5J01j02j6J41j75
6581g1J13N7k46K72j41q9K38k19P8P6j11kJ39j55J8J56k74K23K3k74L43j83r1
$$ plain form
6400 76 -41 17 16 -19 -36 80 -51 4 87 -109 93 21 -78 146 -60 -13 62 5 -17 42 -18 -63 91 -50 -19 110
6426 110 -115 60 22 -94 68 -62 -30 42 3 -42 41 -10 -67 89 -53 -39 105 -100 75 9 -47 64 -46 -10
6450 -10 26 -6 -31 72 14 -51 63 -73 5 56 -59 74 -41 -3 52 -13 8 -48 37 -5 23 24 -50 39 -15 -1 1 -44
6478 -44 44 -67 31 -44 -40 53 -90 66 -33 -31 62 -43 27 4 25 5 -18 -2 10 80 -91 23 70 -113 116 -16 -43
6505 -43 77 -94 28 32 -22 -6 11 -44 -12 113 -97 46 18 -110 95 -62 -7 71 -93 15 10 -16 20 46 -60
6530 -60 -24 82 -85 85 -12 -70 121 -60 15 75 -1 15 7 -4 -15 15 -35 -8 91 -110 71 5 -79 87 -36 13
6556 13 23 -58 2 -20 -8 -29 79 -65 4 79 -112 90 1 -65 113 -55 -17 83 -35 -20 81 -21 -37 104 -71
6581 -71 42 99 -147 125 -16 -105 133 -86 -8 68 -43 -45 94 -61 -43 113 -161 62 85 -189 154 -29 -120
6604a20K68k07M3J32j70OJ89k43J11J43l37K53K6k87L92k10r4K62k37N4J51k21
6626i6N5K34l35J13K21m24L15K6l31M06k28q5K62j93JJ86k05NK57l08Q8K38m12
6649b10L20j7k99L98k20q3K53j95o6K78j96q3L24l60J24K30m44L46j9k72L76j84
6671Aj53L15j78j34L20j88j30L80l72J08K35m33L27ml22L78j46j37K34q1j48K90
6693A62j84j07L71l82R4K39m07L10j9k65L05o6j60K28r6j75K93j69j12L53l85
6714a72J55J93l70K58Ok18K25l0j64K13m9k14L02j75j04L78l80J46J43l16K60
6735H7m3j56J65qj51J82m9j49L07k27o8K90l59K13Q6k73K78j23r8J93q9j32K02
6758G8q7j55L09k35K5J84k87K61n1j79K59j48n6J62n8r2J66j33m6K35k68J28J07
$$ plain form
6604 -120 148 -59 -16 116 -54 -48 141 -102 9 152 -185 68 94 -193 199 -11 -105 157 -80 -26 125 -96
6626 -96 -41 193 -142 -29 192 -232 83 109 -222 184 -44 -129 133 -60 -59 127 -78 -73 184 -124 -36 202 -210
6649 -210 110 93 -206 192 -28 -111 142 -53 -119 159 -37 -120 204 -156 -32 198 -246 100 81 -191 185 1
6671 1 -152 163 -15 -149 171 -17 -147 233 -139 -31 204 -229 98 94 -228 150 4 -133 101 20 -128 162
6693 162 -22 -129 242 -140 -46 193 -214 96 77 -188 117 51 -109 119 23 -152 141 -28 -140 213 -172
6714 -172 -17 176 -194 64 70 -148 77 47 -117 96 47 -167 135 -40 -144 234 -146 0 143 -173 87
6735 87 44 -112 53 45 -106 76 27 -122 185 -42 -110 180 -179 34 120 -153 125 2 -96 97 8 -124 78
6758 78 -9 -164 145 -90 -65 119 -168 93 42 -137 122 -26 -82 80 22 -70 96 -37 -83 152 -116 12 119
6781A19k89L10j12j18K15j55%J20j22k8J65j52k1J92k80J97P1k90K93j33j17K44
6803A09j61k9J29m9q8J88j63j3K45l31K09O5l00L42j48j24K19q9j03J70l8j24
6825h4K48k17l4K98l80K28Q8l33L02r0j38K14o6j51K59j71j47L94l13J2L31m82
6847b32K60J18l42L25q0j76K13r5j34K42p3j91L77l17K3L21m38K43Q3l01K88q8
6869B6j24J89p6j34K32q3j48L08k94O6K14l77K72j4k01K24m9j10J17Oj50J99r2
6892Aj49K95k28J4J68k51J66L3j52J15J9p2L5J03k08J92l3j61K38j56pJ35j81
6915h4Q5K5n6L4P6j18QJ42k66K01L1k51K94j58k5J22j27P4K2l9m7J33j29LJ58
6940A08k11J74k0j47K22j40M0K2r9M5O0m5n9R1p1qJ28k04J58l0r0J52j40Q3lm
$$ plain form
6781 119 -170 140 28 -90 125 -30 -30 90 -32 -60 105 -47 -68 124 -156 41 112 -178 115 -18 -135 109
6803 109 -52 -81 48 -1 -89 99 -64 -77 168 -163 46 111 -189 153 5 -119 100 11 -92 78 40 -84
6825 -84 164 -53 -87 211 -169 59 147 -186 116 26 -112 102 36 -115 144 -27 -174 220 -93 -81 250 -232
6847 -232 28 146 -196 129 49 -127 86 -9 -143 99 26 -165 212 -105 -82 239 -199 44 127 -174 114 26
6869 26 -98 91 15 -119 113 30 -118 190 -104 -38 176 -201 71 57 -144 80 31 -79 38 44 -106 93 1
6892 1 -148 147 -81 -67 101 -150 16 49 -103 12 31 -41 -6 97 -111 81 48 -113 125 -31 -38 97 -84
6915 -84 1 26 -30 4 80 -38 -30 112 -154 47 78 -173 121 -37 -62 60 -67 7 29 -10 -57 76 -53 -50 108
6940 108 -103 71 51 -96 126 -14 26 48 -51 -6 54 9 -50 41 -30 -38 90 -114 44 14 -76 76 -64 19 16 12
6966A2k4j6O3r8Q8l2l2J19j39P5n5L7J0m2R2r2O8k8r6J96j71P7K2o0R4p6kj3M8
6995B5n4M4N3j72K02q1r5J77j93J36j3p3R3m9k3K8L5j00P1J7j24J99j44j7J77
7020A19k28J72o1o9J24p2l4M9J8o1M2M1j40K11j68J6J46j83J28n8l5P1m5K3j3
7045gM6q2Q1k7j07K12j76O7L6j44J55q6rP7n1mj0Q1j65J67p3n8J96k09J10O2j71
7072h9J51k1r1R5K3j37J03N1j93K25j14j10K72k58P9J37k24J02L1j28R9Q1k10
7095a26J75K6k72L52k00j14L62l21J06J52k72J48Q3k15J55O0k65K63k0k91M14
7116B00k32j04L58l50J11J44k52J59Q8k60J46J08l00K80k0k78M05k75n0L21l41
7137a42J22J60k80J26J44k61J25J58l53L05l2k59L63k38n9L30l26J13J14k16J13
$$ plain form
6966 12 -12 -28 35 -63 25 -7 -39 80 -59 16 -39 -2 8 -34 58 -34 34 6 -90 106 -65 12 34 -26 68 -8 -10 -23 25
6995 25 -29 15 68 -104 98 17 -78 99 -94 42 29 -44 49 0 -23 5 40 -60 11 28 -96 103 -41 -58 119
7020 119 -109 63 2 -67 57 -15 -49 0 18 -43 -1 40 -100 111 -57 -41 105 -78 50 -8 -43 28 -17 6 -7
7045 -7 39 -43 38 11 -96 116 -60 7 43 -101 54 -32 -41 36 -15 -19 -29 52 -113 54 -19 -77 119 -90 20 82 -89
7072 -89 62 41 -50 45 68 -69 34 85 -108 117 3 -107 165 -93 -14 123 -101 1 32 -96 3 84 -126
7095 -126 49 75 -197 155 -45 -159 203 -118 -12 140 -132 16 99 -116 39 99 -166 97 77 -214 200
7116 200 -32 -136 222 -128 -17 127 -125 34 122 -138 8 116 -184 96 76 -202 203 -72 -122 199 -142
7137 -142 -20 140 -140 -14 130 -131 -6 152 -201 104 72 -187 176 -62 -121 209 -117 -4 110 -106 7
7158GJ47k92J19J86l68L03l0k68L66k34j8K45k73Q0J39j76nK07k72J58J33l53
7180a99L27p9k20L40k45j6K34j94K7J52j86J5K03k79J00J84l45L07r5j99L63k60
7202f5J8J72j80J9J24j12j0J78k63J69P7l31L50j25j80L14k04kJ48j69K9J39j27
7225c1rJ88k76J63Q2l12L38j58p0K32k36N0J41j62N3J23j74N1J40k81K08Pk53
7248a86L77k64%K17k08Q8M5j32M3J21k12J17Q4k77K90r7j80L71l07M1K28k84J21
7271dR1j51P7R8k52J75R3l26L59j55j70L67k83N9J57k59J52N0j96J30J12k50K02
7294G6J9l05L84k09j12L60l16N6J61k39J22J24k13Q1J68l37K75Kk98L71j93j40
7316a63L59k82K5K32k09oJ61k06M3K39l70K31N6l18L78j38j97L38k27k0J97j38
$$ plain form
7158 7 154 -138 -19 167 -201 102 72 -196 170 -64 -82 163 -110 -30 109 -67 -72 135 -137 21 154 -199
7180 -199 128 49 -171 169 -76 -92 142 -52 -25 127 -59 -44 159 -120 -20 164 -181 126 31 -168 195 -65
7202 -65 -47 125 -55 -36 88 -24 -34 144 -119 50 127 -204 146 21 -159 155 -49 -51 97 -72 -43 96 -31
7225 -31 -40 148 -128 35 117 -195 143 -15 -85 147 -89 -39 102 -60 -7 116 -58 -7 133 -148 60 67 -186
7248 -186 191 -73 -73 144 -64 24 69 -63 -20 101 -111 6 90 -187 103 6 -174 197 -110 -69 159 -125 -4
7271 -4 87 -64 13 111 -141 34 127 -199 160 5 -165 202 -81 -22 135 -124 28 78 -118 12 124 -126 76
7294 76 95 -210 174 -35 -147 213 -103 -47 114 -125 -3 121 -92 -11 157 -180 95 97 -201 170 -23 -163
7316 -163 196 -86 -61 171 -38 -44 117 -89 -46 193 -177 54 110 -208 170 32 -165 173 -54 -74 123 -15
7338a5o8K00j91K8K69m43K67J02l72L81j59j59K96k11j4K13j77m7K81k97N0K62
7360A96m04K75O0l11L17j30j10K46j70m1J62j22o2K76k52RK15l17K22L7k81L11
7382A26j12j27K00r3n5J00n3j03K26j93O3J78l28K08L6j86J90q2m5O8J8j11J10
7405C5Rj46K14j22l8K04k30J12k0p0J00k4n2NJ07j47O0O5k11K40j26j9J60j73
7429f7O9J5o0K3M7o8l0J28j45O9O0j60K30j18o5J58j64J12l9L2k4J8Ko5J47j83
7455g8J10K8j58J67j20N0M4r8Q9q1O6k1j8M9r3R0q1P7Kn4P5j26J13m6j7Q4j29
7482g6J23q1K2J11j52O1m7L8j0QL0n2P3j06Q2Mj00J72j40M1O6j35J05q2N1J4o
7509A4ok3N3r0Q5k5o0J59j99J12jp5J38j27O0qk1PJ3J2o4J25r6l1J28j60J49o3
$$ plain form
7338 -15 -83 117 -74 -46 223 -220 47 149 -223 158 -1 -160 136 -75 -89 124 -53 -100 181 -116 -66 196
7360 196 -208 67 127 -184 133 3 -107 139 -31 -72 90 -32 -94 182 -70 -61 154 -163 59 96 -185 126
7382 126 14 -113 87 -6 -61 39 -14 -117 109 -84 -21 157 -171 37 73 -113 77 -5 -50 18 36 -75 35
7405 35 44 -102 112 -10 -48 156 -74 38 18 -52 48 24 -28 -23 84 -63 -3 62 -149 91 -35 -54 106 -67
7429 -67 2 17 -43 -20 27 -41 -71 57 -88 -19 41 -119 111 -7 -72 86 -78 34 -5 27 3 21 23 -42 105 -78
7455 -78 32 60 -98 69 -51 -1 43 -55 34 -47 19 -2 -20 29 -64 26 -55 22 24 -30 45 -81 32 -14 -31 53 -76
7482 -76 47 -34 -12 99 -53 8 -39 -1 -11 -3 27 -25 48 -58 24 28 -72 100 -40 1 67 -68 37 -45 6 20 14
7509 14 8 -15 38 -52 33 8 -52 107 -92 20 19 -56 82 -45 15 7 -14 -7 6 18 -46 79 -17 -48 80 -80 69 6
7537Fl1J08j35J03n7L3l0J6k0l8J03j05L9M7j49J73q6l4J38j38P5J6l9mL2J0j06
7564g3J73j56P6M7j62J88j09j7Q5q5M3K2Pq2R3n2n3J99k31J05O8k11J88p2n4R4
7590C1l0l0L7M3j29J59j12o0K23k58J11Q1k32K29n0q0J44n4r1J18k5j21K19j50
7614b7m4K42l15J87M3k20K31o8r7J28j3j05J25l1j38K57j91l0K41l09J70N4j75
7637h5J03j0q8R0Op2J17m3j28K30j84jJ56k17J80j3j07J31p6o0J23j3j06J34m1
7662B6j39K53j98K7J46k26J46J1j35J28Kj17R4N8j69J75m4j53K51k24M5J56k38
7685a25J85m7q5Q2L7q4P0J4j33K05j35p4K41k48J28N2j73J54o8l2P6pp0N2M6j38
7711g7J71j06q8K56k88J64L0j67J79j09j3P7k0q3J17Jj58K34j57j8J88k70K01
$$ plain form
7537 6 -25 83 -52 51 -6 27 -3 13 -7 -45 58 -47 -8 39 -110 63 -23 -57 81 -57 18 34 -5 -9 23 33 -73
7564 -73 100 -56 20 67 -95 93 -16 -33 52 -33 10 32 39 -43 50 -2 -55 144 -87 18 86 -125 63 -9 -63 31
7590 31 1 -29 8 51 -78 81 -31 -91 132 -126 -15 66 -166 63 13 -67 77 23 -68 50 25 -96 123 -27
7614 -27 -71 171 -144 43 86 -134 97 29 -68 60 47 -58 67 36 -102 155 -36 -66 175 -134 36 90 -85
7637 -85 18 8 -80 10 16 -56 61 18 -110 120 -64 -65 91 -126 54 41 -66 65 -11 -71 52 39 -67 67 26
7662 26 -113 140 -58 -31 115 -111 35 46 -89 39 41 -76 18 76 -93 82 38 -115 136 -88 -43 113 -125
7685 -125 60 13 -72 10 47 -37 33 47 -86 119 -16 -90 151 -97 31 83 -90 64 -4 -36 40 33 -37 15 61 -77
7711 -77 94 -12 -100 156 -132 32 62 -105 74 -35 -48 29 9 -74 43 44 -114 120 -37 -55 133 -137 64
7734F4l3j20J69q0n1Q0Lp5J12m1j11K32k36Q6J08k39K17m6j27J51p3o8J10j7j22
7759a07K06j21q3K62k86J06J41k98K38l5j26J63n0q9J56o4j25K46j79p3K97k99
7781a20J27J36k93K38m1j48K16q0j16J57l5j69K31j28q3K71l01J50J06k58K24
7802H4o4j07J20L7j54J34%k12L06j75o6K84k96J12J04k13J33Rj08R4N6k00J82
7825F0K3k00K57j67p0K73k49O2J30j94R4M2j19N4Q9k07J43O3k18K45j32r5K48
7848A32k34O7J00j24M1P1j01L0J06j87J41M0k15K64j68j6J71j69L5O9p3L2O7j10
7872c1j2J62k04J27N7k44K65j47j8R6r7M1K7l3l7Q5l3l4J17j81J18kj28J64j09
7897e1L1M1o4O4k3M5p5P6n0k7R3j19R5Pj02J57j15M8k0k7M7m3L7q3J02o9j3Q6
$$ plain form
7734 64 31 -89 80 0 -51 29 32 -43 69 28 -83 149 -87 -1 107 -132 85 39 -88 63 -10 -78 32 15 -107
7759 -107 99 -22 -105 157 -129 -23 118 -180 58 23 -103 60 10 -79 77 13 -112 134 -45 -118 179 -120
7781 -120 7 143 -150 88 47 -101 115 35 -81 76 41 -128 103 -25 -108 163 -138 12 118 -140 84
7802 84 20 -87 33 70 -84 50 50 -162 144 -31 -97 187 -109 3 107 -106 27 36 -72 22 78 -122 60
7825 60 83 -117 140 -27 -97 176 -73 -11 119 -75 19 61 -58 -4 85 -122 21 84 -134 111 -21 -116 132
7848 132 -102 -35 65 -59 -18 53 -48 -18 88 -99 42 82 -133 131 -37 -53 118 -51 -16 53 -20 12 79 -31
7872 -31 -43 119 -85 42 99 -145 120 -27 -45 51 -46 -5 22 -11 -48 37 4 -30 87 -94 24 22 -106 58 -51
7897 -51 -20 21 -43 21 -2 43 -32 44 -6 -33 60 -59 36 43 -59 98 -17 31 11 -16 31 -12 25 -58 44 -25 -38 48
7925D8j25J10n9j8O8o0O5m9K6k7J5M5r2R4q9M0N4r0Q1n1j8P9n7M8p5N3jn9O3k8
7955iO1j04Q6K9j36J33j01L8L4q3P0m3O6n8%kj5Q7p0K9qp5J37j29O7Po9P7l9M2
7985B2m1L0k2KN8p5N2pl9N9q2Q6m3k7Q9r4Q6n4J3Jl8O1p5N0k6j1O7o7N7n3L9k2
8017dm9O8o2L0J0l5P1l4K7j5K7j3l7N4l3L3j2m9P6q7N3l1k2R1r6L6j0NLNK2q8
8049f6R8q1J6Q0q5N4k4l6O9l5KlK7k7L6Mp8J17q2JP4q3O8p4K6L1m3N2k3M0q6N7
8081B6K5j05J23o7l9N1o5O9l6j3L1k0Pl3J05j02L4N2r6R7p5pR9r4M0j7j8j1Q2
8110D3n1mO4r8J12j1p4R2p5l0J06j03L7K8m4PN1n1j2J01j52Q5j7n9J20q6OO1q5
8139c9M6nj3qL7l6K1M8j27J46n7m4Q8q9J3M6n1L3J5k5l4R1p6RN3j05R9l2l1J05
$$ plain form
7925 48 -77 33 -26 -44 24 -36 29 -20 6 -21 -6 39 -53 41 -48 -8 46 -44 37 -14 -32 47 -10 38 -37 16 15 -44 19 -9
7955 -9 52 -52 34 63 -73 60 -41 -3 31 -52 18 -25 41 -17 -17 -19 -34 53 -17 12 4 -71 66 -63 4 11 -58 19 -20 22
7985 22 -19 11 -11 -9 49 -26 26 19 -20 39 -43 43 0 -27 62 -32 54 0 13 14 -24 37 -38 12 -14 -25 42 -25 32 -21 18 -4
8017 -4 -53 15 -47 -17 -7 -42 29 -5 22 7 34 21 -16 38 5 38 26 -23 53 -34 19 -12 -34 57 -39 -3 -13 -8 -5 0 22 -66
8049 -66 32 -49 -33 47 -38 16 -8 -44 25 -10 -8 -11 16 -11 25 29 -49 68 -14 -13 61 -22 46 -28 -2 29 -14 38 15 55 -31 26
8081 26 51 -54 69 2 -37 14 -51 18 -18 -31 0 -20 -13 -46 59 -43 -9 43 -53 44 -31 -38 61 -33 7 -10 -28 -39 43
8110 43 -8 -12 52 -46 66 55 -19 73 -2 -32 74 -29 8 36 -8 -1 50 -1 -13 88 -64 21 4 -55 65 -21 -15 46 -39
8139 -39 7 2 -11 -19 18 -18 3 51 -76 70 13 -31 57 -32 -19 27 -24 9 24 -1 -35 56 -20 -11 42 -63 36 4 -27 78
8169G8j12K9L4l7kL0k3%O2j32N3M9o7J00q3l3J11p8N4k0l4M3
$$ plain form
8169 78 -34 -5 29 -8 -10 20 -3 -3 59 -73 -20 29 -38 62 -21 -54 57 -21 33 13 -21 22
8191B2
$$ Imaginary data points
##PAGE= N=2
##DATA TABLE= (X++(I..I)), XYDATA
0@%%%%%%%%%%%%%%Kj0J6j6J9k7L2m0N0n8P2q5R7j12J34j57J82k13K44k78L16l59
36a91M07m60N17n80O52p27Q10r04J004j114J234j363J505j662J830k013K217k439
54a277K681k950L248l578L947m363M831n360N963o646P407q216Q934q979N497
69A139K8004L25424o50134K41600L51036o36542M90497J9229m28471N04342k88182
80d2058k47213N81518m26479J8203M55021n48413J78284K34476m67271L82637
90A18705k5076l32360M35749j96263j80976M18108k96323j01561L30088k64845
100i4754M1645K20137k47829R4741K5922j65582J86943m1907q2592J51088q9348
111a536o1272J20677n3483o7911R4308m4270l4910J22489n6941l8303P6850j14118
$$ plain form
0 0 0 0 0 0 0 0 0 0 0 0 0 0 0 0 2 -8 8 -8 11 -16 16 -24 26 -32 40 -45 52 -60 74 -83 99 -114 130 -148 168 -191
36 -191 216 -244 273 -307 345 -382 428 -476 528 -586 648 -715 790 -872 958 -1055 1162 -1277
54 -1277 1404 -1546 1702 -1876 2071 -2292 2539 -2821 3142 -3504 3903 -4313 4621 -4358 1139
69 1139 29143 354567 -295567 -53967 297069 -339473 151024 170253 -258218 246124 -42058
80 -42058 -289271 292247 -134232 -116029 338992 -209421 -31137 203339 -263932 118705
90 118705 93629 -238731 197018 755 -180221 237887 -58436 -159997 170091 -94754
100 -94754 -53109 167028 -80801 13940 39862 -125720 61223 19316 -63276 87812 -1536
111 -1536 -62808 57869 4386 -63525 30783 -13487 -48397 74092 17151 -21152 55698 -58420
123e8420j5432J47042j03892J332J59370j97621K3582J59222k25372J13245P2634
134G5690k05538K03858l1133j26451K18757j82084o7013K36832k22454O7865K13004
145A81333l06562J41888R0891k90555K77200m9708k04414L15640j92609o1877
155i8773K87616k81794L5627J84017k85005J80989J00230k51221K43402r4713
165B0375j86275L08416k03245k5160K67626k94588R5169J53746k71648J84129
175D8545J3633k15042K38693p2165j05975K49090j96524l9194J87252k28818J17309
186c196J08976k06803J72595l7912j36676J92112j09616n4922J60209j38221K4831
197b8623J32466j52430N7562L6386j47941J27276m863o6194J27868q9798k9117
$$ plain form
123 -58420 -73852 73190 -30702 -29370 130000 -67621 -44039 115183 -110189 3056 75690
134 75690 -129848 74010 42877 -83574 135183 -46901 -113914 122918 -99536 -31671 181333
145 181333 -125229 16659 107550 -183005 94195 44487 -159927 155713 -36896 -98773
155 -98773 188843 -92951 -57324 126693 -158312 22677 122907 -128314 115088 20375
165 20375 -165900 142516 -60729 -85889 181737 -112851 -17682 136064 -135584 48545
175 48545 62178 -152864 85829 13664 -92311 156779 -39745 -78939 108313 -120505 -3196
186 -3196 105780 -101023 71572 33660 -103016 89096 -20520 -75442 84767 -53454 -28623
197 -28623 103843 -48587 8975 45361 -102580 24696 19833 -46361 81507 -8291 -37408
208c7408Q0125q2128K5971M7206o5589L2384L1292m8106L8587n054o1652M1387
220b985n489m622M9496j7258k1348l214l158j6288K6186J9880m2323M2458r193
233A2142l6885O1766m7982k5774N6547m7535K0890O8543p4234R675L3309j02043
245g1581P5179L1828q8017J13076m9845o5859J19224r3350n403Q9740j11225M7678
257h555P2828j05712P1505J0727j25805J09706j9931o4999J44005r1051k6739
268c4021J00098j22900M3926O1682j08725P4426K2124q2563R1541k1898q1506
279e7816R0496n8012j9398J10216q1081J9149M3122r9179N2377J4526n2724O1421
291B3097r910l5820N2050k1405l0021M1606m4313p04N0685l4232K9839M287m4993
$$ plain form
208 -37408 42717 -39411 -13440 33766 -31823 561 31853 -16253 22334 17280 -44372 -2985
220 -2985 -8474 -13096 36400 19142 -2206 -5420 -8578 -24866 1320 21200 -21123 21335 12142
233 12142 -24743 37023 -10959 -36733 19814 -27721 -6831 61712 -12522 -2847 30462 -71581
245 -71581 3598 35426 -52591 60485 10640 -55219 64005 -29345 -34748 54992 -56233 -8555
257 -8555 64273 -41439 30066 40793 -85012 24694 4763 -60236 83769 -7282 -34021
268 -34021 66077 -56823 -12897 48785 -59940 14486 36610 -45953 45588 23690 -57816
279 -57816 32680 -25332 -44730 65486 -15595 3554 46676 -52503 -126 14400 -38324 23097
291 23097 13187 -22633 29417 8012 -22009 19597 -24716 -25420 25265 -8967 20872 25159 -19834
304a9834J7361j1903J02K2086M63k821O28k22j1758O863q698n419J1498jJ8077
319A6422m353l082j1493k0144J6838o199J7334J5450j9061O973r925r957O311
332d886K645p148R809J4319j7950K1810j1627l1259K7585k1923P623L7868k4154
345B712M179Q793l5350O076K4572l3011K6820K0636m9000M9998j4186m6673N7460
358B3026m4472n550O3313m5781J4477L3010o8547J9966K8855o2648O1136J1281
370B8066o5026Q0527m1243m0332P8974p4586J0050O3648o9234M3183K7968p8675
382c6680M5346J213o3899Q2883j7943m1360Q5564p0383p703O2339q4350M1490
394c483L0995o2899O1758k002n2038N0454k8017l5602O5718l3533l233N7966o3999
$$ plain form
304 -19834 -2473 -14376 -14274 7812 8275 5454 6082 5860 -5898 965 -7733 -13152 -1654 -1655 16422
319 16422 12069 8987 -2506 -22650 -5812 -12011 5323 20773 1712 8685 -1240 -11197 -4886
332 -4886 -2241 -9389 420 14739 -3211 18599 6972 -24287 3298 -18625 -11002 26866 2712
345 2712 6891 15684 -19666 -13590 10982 -22029 4791 25427 -23573 26425 12239 -34434 23026
358 23026 -21446 -26996 36317 -9464 5013 38023 -30524 -10558 18297 -44351 16785 28066
370 28066 -36960 43567 2324 -38008 40966 -33620 -23570 40078 -29156 14027 41995 -36680
382 -36680 8666 9879 -54020 28863 10920 -30440 55124 -15259 -22962 39377 -44973 -3483
394 -3483 27512 -35387 26371 24369 -27669 22785 -5232 -40834 24884 -8649 -11882 46084 -17915
407a7915J6494K1342n8609M4174O35k5437M1455j1543j8081J9486j5912j9408
419b3319K7897q846l199L3701k5100k902J2421k7556L803J8678j0344J864K9888
432B6986l0690k913K8233n5966L1873J9682n0879O5588j5915m5204O5177m8400
444a2428k6820P5989o0757O089P8320r6302M2121M0392j22174J03251r056r0904
456g2279J46041p5047m8087J30463j27204J0566J07014j45650Q1045O6468j59377
467h6047J41828j5126j47709J87225r7289o6206J97184j60993J9417J32104j98249
478i3861R7188O7207j81740J65526n243j54006K01401r2692r6061J98883j66046
489e9444O052J60413j88583R8783O9612j90692J43568m047j42891J80736n5135
$$ plain form
407 -17915 -1421 19921 -38688 5486 6121 -19316 22139 10596 -7485 12001 -3911 -23319
419 -23319 4578 -4268 -7467 26234 1134 -1768 10653 -16903 -13100 5578 -4766 -2902 26986
432 26986 -3704 -6617 21616 -34350 -2477 17205 -33674 31914 15999 -29205 35972 -12428
444 -12428 -39248 36741 -24016 -17927 60393 -35909 6212 46604 -75570 27681 18625 -72279
456 -72279 73762 -1285 -49372 81091 -46113 -35547 71467 -74183 6862 73330 -86047
467 -86047 55781 40655 -107054 80171 -17118 -83324 113860 -47133 -27716 104388 -93861
478 -93861 3327 70534 -111206 54320 49077 -104929 96472 3780 -92281 106602 -59444
489 -59444 -53392 107021 -81562 17221 86833 -103859 39709 35662 -107229 73507 18372
500A8372r7768J72940j14732l5302J42749j49781M3949Q8878j43387J03611K8243
511E7772j27545J03614j3813r4609J11305j8267o2082R7504n7425l5005Q6549
522D7998q0569P120P7719q9284K3129P6591r2000J0090P1829j02695K8557P4016
534E2501r9192P2411J8189j12230J12108l5361q9250J53110p3172p0720J62690
545I1084j11131l2811J45585j61784M5863J05487j85562J52966K6471j98730K03517
556H0955n8155j49719K29944j10010p4704J98999j73720K0650J48262k24666J28895
567A6731O8932k29573K23756k1741j79700K33704j26672q7824K13996j73345K6626
578c5110J59841k23904J04670R1589k25328J76183J0366j78632K01176p1502q0106
$$ plain form
500 18372 -79396 93544 -21188 -56490 86259 -63522 -19573 69305 -74082 29529 57772
511 57772 -69773 33841 20028 -74581 36724 18457 -43625 53879 -3546 -38551 47998
522 47998 -32571 -25451 52268 -37016 -13887 62704 -29296 -19206 52623 -50072 -21515 52501
534 52501 -46691 25720 43909 -68321 43787 8426 -80824 72286 -886 -71606 91084
545 91084 -20047 -52858 92727 -69057 -23194 82293 -103269 49697 76168 -122562 80955
556 80955 22800 -126919 103025 -6985 -81689 117310 -56410 -35760 112502 -112164 16731
567 16731 85663 -143910 79846 58105 -121595 112109 -14563 -102387 111609 -61736 -35110
578 -35110 124731 -99173 5497 97086 -128242 47941 58307 -120325 80851 9349 -70757
589g0757J71047j43649M044J12319j54125Q8728O9562j51904J10205N245j27770
600h7055J33961l6050o9868J20588q0900p868Q5518r0336K5381L7789p5551M2075
612b316L2372m7391L2222L950m5979K8668l907j0773L2690k3141k369K3540k2439
625d873o883K9224k3552k7141N8735k1155k3598O3055n6352j4122N0179n4790
637c1273L3832L4443o8930M7335P893p2664P8211j5013o4090R0758n4474r706
649b3678Q5988j00360L9786L5512j13727J03237R774r3747J12500m5931p2318
660f2964J16768p4590j2232R9379j20192N2774O0077j25765J08020j5307j05039
671g9071J28495n9926l0689J20887j10427Q474Q1013j30658P7897N3627j33087
$$ plain form
589 -70757 100290 -43359 -39315 73004 -81121 7607 77169 -74735 35470 40715 -87055
600 -87055 46906 10856 -59012 61576 -19324 -27192 58326 -32010 -6629 31160 -44391 -2316
612 -2316 30056 -17335 14887 18837 -27142 1526 -2381 -13154 19536 -3605 -5974 17566 -4873
625 -4873 -11756 17468 -6084 -33225 25510 4355 -19243 43812 -12540 -26662 23517 -31273
637 -31273 2559 37002 -31928 15407 23300 -49364 28847 13834 -50256 40502 -13972 -23678
649 -23678 62310 -38050 1736 37248 -76479 26758 36532 -57215 55285 9354 -62964
660 -62964 53804 -20786 -33018 66361 -53831 -1057 59020 -66745 41275 25968 -79071
671 -79071 49424 -10502 -41191 79696 -30731 -22257 58756 -71902 5995 59622 -73465
682g3465J14865j4279r9815J38901p4410l9724J10410j12775L5232Q0274j13365
693d8151O8860J7657j11611J00024j0460o9395J14839o8273l5537R9823r4313
704c6537K3784O2020r9660N4863K5919o7234O6752j0188n9287N6414k3992k1767
716b8913O8275m2051r340L9558n4166K1097K6823m0123K1657P441k5395K1559
728F422J2853l1051J0114O113l1826L5951J0339k9204K7386j6402k7894L7306
740A0107o236k0281M0083k6479k0196N5085m4036J046M2558o9908L4860L1416
752B8019n6602N6390q601o0834N9167j9941k9852P5528m8074k0065O5855p1819
764c0829K3569M8360q3439N1178J0213n9693P4862j9710m5065N8158m4282j4161
$$ plain form
682 -73465 41400 27121 -72694 66207 -8203 -47927 62483 -50292 -15060 65214 -48151
693 -48151 20709 38366 -73245 26779 16319 -53076 61763 -6510 -42047 57776 -36537
704 -36537 -12753 49267 -50393 4470 30389 -36845 29907 19719 -39568 16846 -7146 -28913
716 -28913 39362 -2689 -12029 27529 -26637 -5540 21283 -18840 2817 10258 -15137 6422
728 6422 19275 -11776 -1662 4451 -27375 8576 18915 -10289 17097 695 -27199 10107
740 10107 3871 -16410 23673 -2806 -23002 32083 -11953 -10907 31651 -38257 -3397 28019
752 28019 -28583 27807 19206 -41628 17539 -2402 -32254 43274 -4800 -24865 40990 -30829
764 -30829 -7260 41100 -42339 8839 19052 -40641 34221 14511 -30554 27604 -16678 -30839
776c0839O8771m9703O784M1704p2451L6202K2240n6455N5473j5975l5170N5283
788B5864k6613r432L4690m1198p19L2871k8672K0874J6582m3468K3116l264k0185
801a9554L6484j7229o793J6760j6549Q467P933j2538k536K366m226J0596R485
814A2666j0188M15r950k674R769K44Q476q399j340J496o186J3316q395m393M989
829a54p068J0671O747n987n235k771p804P645J4069r882P745o219j3847J6691
843D601o426L95P330j2045K376Q955r15k344L686j5606p83J6606r889J4496L66
858A0803k1643J1934n275l089J6186o873q113J1424o040m080J9123k1128k725
871i496J6868k2204K3222P145k5255J7814j2975j1324K6236q610o167J8321k0598
$$ plain form
776 -30839 37932 -11771 -4987 36717 -35734 468 22708 -33747 21726 5751 -29419 25864
788 25864 -749 -10181 24509 -16689 -17408 15463 -13209 7665 24247 -19221 3895 631 -19554
801 -19554 16930 -299 -7092 9668 -6881 1586 9519 -3019 -5555 -3189 -7415 3181 12666
814 12666 2478 2893 -7057 -9731 38 282 8758 359 -981 515 -5671 7645 -750 -5143 -154
829 -154 -7222 3449 10196 4209 -1026 -3797 -11601 -3956 10113 231 7976 1757 -12090 4601
843 4601 -1825 -1430 5900 -6145 -3769 5186 4271 1927 5613 -9993 -10776 5830 -4059 10437 10803
858 10803 -10840 1094 -4181 -7270 8916 2043 -6070 5354 -686 -4766 14357 -6771 -9496
871 -9496 7372 -14832 8390 15535 -9720 8094 -4881 -16205 10031 1421 -4746 13575 -7023
884g023j129K4679k7512J0816J0242l2781L2117j98j8513K8347k5501r945K5454
897I053j7250P628K0073k9018O272J4052k8588K6062R77k9162L2586j4968o857
910i140L0870k7800j259J4037k1993J4137J7535k1824R308L943k7130K4610Q02
923F096j8833K6346j6667p070K4020j5518k126J1293j7024n90K2195j3988K781
936I15J5727l3193J2293J3748k5747K7142o14k6983K6425n201k0502L2335j6658
949c13k2110M2936k8815j842M4255n4954J5133K6572n4942M5940R823n0684N1041
962B2040j5965m0115O5578l5989k4071O8706o5063J0615O1563q3884M3155K3595
974C0165q2643P4443l908n8276Q2115m2385l9922Q4769o5040l457P7281r2519
$$ plain form
884 -7023 -8152 16527 -10985 -169 10073 -22708 9409 9211 -9302 19045 -6456 -16401 9053
897 9053 -8197 -569 19504 -9514 -3242 10810 -17778 8284 9261 -19901 12685 -2283 -9140
910 -9140 21730 -6070 -7329 6708 -15285 -1148 16387 -5437 3871 7814 -19316 5294 6096
923 6096 -12737 13609 -3058 -10128 13892 -1626 -3752 7541 -9483 -10073 12122 -1866 915
936 915 16642 -16551 -4258 9490 -16257 10885 10271 -16712 9713 4512 -15990 16345 -313
949 -313 -22423 20513 -8302 -10144 34111 -20843 -5710 20862 -34080 11860 21683 -29001 22040
962 22040 6075 -34040 31538 -4451 -28522 40184 -24879 -14264 47299 -36585 6570 30165
974 30165 -52478 21965 18057 -40219 41896 -489 -40411 44358 -20682 -24139 53142 -39377
986c9377L3939N0668r4669P1264M856q0342Q5853k9851m2046Q9710n8749k1136
998b9880P5080p6926J4519O4384q4682M3126K6836p7603O8911q973n3429P0575
1010C1938l7029k6302O8649m4600j0594N2743n7205P174M4374n4389L1437J8505
1022B4701n5049M3041n41m0174M5218r061l4037M1799q203k7733M1901k3132k0789
1035b2059M3686l5063L612M1012m9531J2723L1348n2412K5068K8598n6352L7277
1047G907J3467n6239O0058j6060m6141P2508m7218j7445P4576o4836N317N4460
1059D0354p4966L1199L6274p3655O0154K123o7787Q4803l7650m1010Q9064p1654
1071b2751j829P2796q2160L3825L9581q4203N8211Q739o9147Q1247k6648m7489
$$ plain form
986 -39377 -5438 45230 -49439 21825 26681 -53661 32192 2341 -39705 50005 -8744 -29880
998 -29880 45200 -31726 -17207 47177 -37505 5621 32457 -45146 23765 14792 -38637 31938
1010 31938 -5091 -31393 37256 -7344 -17938 34805 -22400 -15226 29148 -25241 6196 24701
1022 24701 -30348 12693 12152 -28022 17196 8135 -25902 15897 7694 -20039 21862 -1270 -22059
1035 -22059 21627 -13436 -9824 31188 -18343 -5620 25728 -26684 -1616 26982 -29370 7907
1047 7907 21374 -34865 25193 9133 -37008 35500 -11718 -29163 45413 -19423 -14106 40354
1059 40354 -34612 -3413 32861 -40794 19360 21483 -46304 38499 849 -40161 48903 -22751
1071 -22751 -24580 48216 -33944 -119 39462 -44741 13470 22209 -46938 34309 7661 -39828
1083c9828Q5426o2231q178P0446p9652L0855L6591p2388N7079J120n5688O3969
1095B7521k8132l2308O9111m7553o844N6147o3201K0858K9774n5464M3097k926
1107A0080l4859M7197k3991j4948L9029l2590k605L1371l0925J1360J6905l0995
1119a4971K2188l409k0084K9554j5110p223K1130j4239k574J0175o155l736O294
1132A840l067M86O109q439M209K835j1160N846P251j0079J921J2453j6420M133
1146b082J1427k2252J8658j531j9022L1685j9506r775L2287l1021J631K8600l4632
1159a5533J5228J9350m0823L2774j07l9744N2189k5207k2006N6894m7614L150
1171a1449M1519n6593K7784K1347n4200M7370j097m7885O1638k8027l0564O6203
$$ plain form
1083 -39828 45598 -16633 -24811 45635 -34017 -3162 33429 -38959 18120 19240 -36448 27521
1095 27521 -611 -32919 36192 -11361 -18205 37942 -25259 -4401 25373 -30091 13006 10080
1107 10080 -24779 22418 -1573 -16521 22508 -10082 -12687 18684 -12241 -881 16024 -14971
1119 -14971 7217 3808 -16276 13278 -1832 -9055 12075 -2164 -4738 5437 -718 -4454 1840
1132 1840 -1227 -741 5368 -3071 1138 3973 -7187 -1341 5910 -4169 -2248 10205 -6215 -2082
1146 -2082 9345 -12907 5751 4220 -14802 16883 -2623 -12398 19889 -11132 -9501 19099 -15533
1159 -15533 -305 19045 -21778 10996 10889 -28855 23334 -1873 -23879 33015 -14599 -11449
1171 -11449 30070 -26523 1261 22608 -31592 15778 14681 -33204 28434 407 -30157 36046
1183C6046n3943J842N3606o7525L3532K4347o4952N3276k695m8350O2652k5822
1195B014k9998O2327m7679m785N2894o2051K5269K9996o0100M6690N40m4996N0953
1208B1074k0378k4184M8258l0830q464L9892l9930P230K8669m1458K3113J0819
1220A3811l2905K9910m903j9639K4312j1147j0632K0373r066p491J8319j3664
1232b722m848J7248j5623K604J2455j5242M154J0143j3255K924J1387j8732P328
1245b179J2947k2826J8412K454k4304K4813q428j4189K7667j6488q177K5483k3028
1258g843Q48K4847l2154J2948J6064l4822L0197k2k8885L4461j8001j3651L4034
1271A8021k4393j003K5484l1156R539J9279l2647K2606M705l0069L2575j0917
$$ plain form
1183 36046 -17897 -16055 37551 -29974 3558 27905 -37047 16229 13534 -34816 27836 2014
1195 2014 -27984 34343 -13336 -18121 34773 -27278 -2009 27987 -32113 14577 15117 -29879 21074
1208 21074 696 -23488 24770 -6060 -14524 25368 -14562 -7332 21337 -20121 2992 13811
1220 13811 -19094 10816 5913 -13726 10586 -561 -11193 9180 114 -7377 10942 -2722
1232 -2722 -7570 9678 -5945 -3341 9114 -6128 -1974 8169 -5086 -2162 9225 -9507 -2179
1245 -2179 10768 -12058 6354 8808 -15496 9317 889 -13300 14367 -2121 -10298 15185 -7843
1258 -7843 -6995 17852 -14302 -1354 14710 -20112 10085 10063 -18822 15639 -2362 -16013 18021
1271 18021 -6372 -7375 18109 -13047 -3508 15771 -16876 5730 10435 -19634 12941 2024
1283B024j5230L0575k4434j506K1410k3240J0481J2416k3353J3165M058j9350
1295a2984K1130n109j3270K0986j5512J34J5298j7615P574L239j1758J1010J55
1308C278o419P072m268n117R031m799K55N931r467N479L21m054P007o426J088
1323a088J722l127N698k188j356O53k796J181L285j500j95J816o078M608J419
1338B054n060P338o671n74O650o254N078j05o227L403J38j263M449m00n888M671
1354A339k542j809Q415p270J128K964o565O477K38l855K233j561k300M466J698
1369C056m808M553m140l283Q746n665J913L286p821M059K095l629L250K93o495
1384d590M959K143n997R021n626n651J0190q204L382O807j0594L984K463p087
$$ plain form
1283 2024 -13206 17369 -7065 -8571 12839 -10401 80 12496 -10857 2308 6366 -12984
1295 -12984 8146 3037 -10233 10753 -4759 -4625 10673 -6942 632 3871 -7887 3123 3278
1308 3278 -3141 3931 -337 -5454 3577 -1222 -967 4964 -4503 976 1297 -2757 4250 -2176 -1088
1323 -1088 634 -2493 3205 1017 -339 314 -2482 -1301 1984 484 289 2105 -3973 635 2054
1338 2054 -3006 4332 -2339 -2913 3737 -2517 2561 2456 -3771 -368 -230 -1493 2956 2556 -3332 1339
1354 1339 -1203 -3012 5403 -1867 -739 2225 -4340 2137 2375 -1480 753 -808 -3108 1358 3056
1369 3056 -1752 2801 -1339 -4622 4124 -1541 372 3658 -4163 -104 1991 -1638 1612 1905 -4590
1384 -4590 369 2512 -3485 5536 -90 -5741 4449 -3755 -373 6434 -4160 -176 2287 -4800
1398d800P181J877r784P823j421p475J4525q068m412J0944j3334N618Q539j1774
1412d561O903P99j0788R742J800r315J1072n319q670J5690r193r70J1511j5569
1426f868M505P603j0502Q331K467j2321P253K517r865J2843k500j1647J4166q007
1440b025l437J4919j2345j103R884j1583L906J1074j4550L977Q094j7767J4133
1453C177M839j8425J8145o648j2890K2414j1326o767J9274j8261r64K1141k2220
1466h511P386J4696k9955J9778O349k5790K9060r907j9512L0809j8242o551K8845
1479A8455k7725J694K4317l2141J6966J5066l6580K7990o57k7463L7246j6038
1491A130j6173L2609k6421o68K8796l0825Q937J8282l4011K2297Q999l0600K9428
$$ plain form
1398 -4800 2381 4258 -5526 2297 876 -6599 7926 -142 -4554 6390 -6944 -1326 7213 -4561
1412 -4561 2342 3141 -7647 2095 3895 -5420 5652 333 -8337 7353 -1840 -2810 8701 -6868
1426 -6868 -2363 5240 -5262 3069 5536 -6785 468 2985 -6880 5963 3463 -8184 5982 -2025
1440 -2025 -5462 9457 -2888 -3991 5893 -5690 -1784 9290 -5260 -1283 6811 -10956 3177
1453 3177 8016 -10409 7736 1088 -11802 10612 -714 -7481 11793 -6468 -7432 13709 -8511
1466 -8511 -1125 13571 -16384 3394 9743 -16047 13013 3106 -16406 14403 -3839 -10390 18455
1479 18455 -9270 -7576 16741 -15400 1566 16632 -19948 8042 7385 -20078 17168 1130
1491 1130 -15043 17566 -8855 -9523 19273 -11552 -2615 15667 -18344 3953 12952 -17648 11780
1504A1780q618k0663L2719j7721o501K4989k5086K459J9517k2596J0253J1331
1516A1863k4836J5386M090j8307K1389o999j3196J8956j1088k977J5691j2478
1528b506k405J1177j1300K387J1925j4483L993P287j4803J0797M649j3429R349
1541B638K74j1015J2274K03j1662J3731o876r109K0110j3305k461J6841k0938
1554i295O483J3239k0057J3021M607k1488J9325o76j7929K5428j2830j2721K6985
1567A4092k1198K257K0217k7866J3246Q543k4006K3360k277k0581K5378j2551
1579a386j0616K8250k2655M65K0844l0008J6786J0839k7728K4219n009j8873K6660
1592A1788j2938o707K1474k2229L943J7085k4650J6443N645k5466K4053o562j3668
$$ plain form
1504 11780 3162 -17501 15218 -2503 -9004 15985 -9101 -6642 12875 -9721 532 11863
1516 11863 -12973 2413 6503 -11804 9585 2586 -10610 8346 -2742 -5719 9972 -2506
1528 -2506 -4911 6266 -5034 -2647 9278 -5205 -1212 6075 -8728 2069 6718 -6711 2638
1541 2638 2912 -8103 4171 4374 -7288 6443 -433 -9542 10568 -2737 -5198 11643 -9295
1554 -9295 -2812 10427 -9630 3391 7998 -13490 5835 5159 -12770 12658 -172 -12893 14092
1567 14092 -7106 -4849 15368 -12498 748 9291 -14715 8645 6368 -14213 11165 -1386
1579 -1386 -12002 16248 -6407 -5942 14902 -15106 1680 12519 -15209 9010 4001 -14872 11788
1592 11788 -1150 -7857 13617 -8612 -4669 12416 -12234 4209 9854 -15612 8441 1879 -11789
1605a1789K6103j8446l238J9188k1286Q248J2739k1336J1677L949j6843J8050
1617G016m213j0858J7454j4550k13J5660j6817O964O402j5523J0305K768j0111
1630e716J0061k250r300J1493l433n443J0752p522k805P562m953J193L542m515
1644a334n95L891l843J261N853r335L110N420j0328Q473K111j1485R899j086r677
1659g665J4810n176j0818J7957j2185m980K1008j9291L108J4104k2711J4373N976
1672H510k0669K0139m834j6825K5654j2578r887K6117k3881J074K2962k9215J5363
1685A930J1163l0429K4677p95k2212K8621j1997j4033K7160j9714j952K3659k7201
$$ plain form
1605 -11789 14314 -4132 -7370 11818 -9468 -1220 11519 -9817 1860 5809 -11034 7016
1617 7016 2803 -8055 9399 -5151 -5364 10296 -6521 443 6845 -8678 1627 4395 -5716
1630 -5716 4345 2095 -7205 4288 855 -4588 6164 -1358 -4163 3399 -1554 -361 3181 -1334
1644 -1334 -1929 1962 -1881 -620 5233 -4102 -992 4428 -5900 2573 4684 -6801 3098 2012 -7665
1659 -7665 7145 1969 -8849 9108 -3077 -8057 12951 -6340 -3232 10872 -11839 2534 8510
1672 8510 -12159 7980 3146 -13679 11975 -603 -10490 15627 -8254 -7180 15782 -13433 1930
1685 1930 13093 -17336 7341 6546 -15666 12955 958 -13075 14085 -5629 -7581 16078 -11123
$$ [...]
8191E
##END NTUPLES=NMR FID
##END=
