##TITLE=1H_DE_PhEtNH2
 200.13MHz, CDCl3,
 8 sc
 
 24.1.2025
##JCAMPDX= 6.0         $$ Bruker NMR JCAMP-DX V2.0
##DATA TYPE= NMR FID
##DATA CLASS= NTUPLES
##ORIGIN= UXNMR, Bruker Analytische Messtechnik GmbH
##OWNER= pz
$$ XWIN-NMR		Version 3.5
$$ Fri Jan 24 15:04:17 2025 Russian Standard Time (UT+4h)  she@DPX200
##.OBSERVE FREQUENCY= 200.1313
##.OBSERVE NUCLEUS= ^1H
##.DELAY= (6, 6)
##.ACQUISITION MODE= SIMULTANEOUS
##.ACQUISITION SCHEME= undefined
##.AVERAGES= 8
##.DIGITISER RES= 18
##SPECTROMETER/DATA SYSTEM= spect
##.PULSE SEQUENCE= zg30
##.SOLVENT NAME= CDCl3
##.SHIFT REFERENCE= (INTERNAL, CDCl3, 0, 14.3821)
##AUDIT TRAIL= $$ (NUMBER, WHEN, WHO, WHERE, WHAT)
$$ ##TITLE= Audit trail, XWIN-NMR		Version 3.5
$$ ##JCAMPDX= 5.01
$$ ##ORIGIN= Bruker BioSpin GmbH
$$ ##OWNER= she
$$ F:/spectra/data/she/nmr/H-C/1/audita.txt
$$ ##AUDIT TRAIL=  $$ (NUMBER, WHEN, WHO, WHERE, WHAT)
(   1,<2025-01-24 15:03:00.85 +0400>,<she>,<DPX200>,
      <created by zg, POWCHK disabled, PULCHK disabled
       configuration hash MD5:
       00 E9 B6 7A A2 85 ED C7 34 08 36 98 17 FE 4E 26
       data hash MD5: 16K
       A0 31 98 A6 CC 28 BB 14 04 72 22 DD 58 E1 5F F2>)
$$ ##END=
$$ 
$$ hash MD5
$$ 12 B8 95 5F BD EF 58 7C E1 79 3E BF 07 B5 ED 64
##$RELAX= 
##$RELAX= 
##$RELAX= 
##$RELAX= 
##$RELAX= 
##$RELAX= 
$$ Bruker specific parameters
$$ --------------------------
##$DU= <F:/spectra>
##$EXPNO= 1
##$NAME= <H-C>
##$PROCNO= 1
##$TYPE= <nmr>
##$USER= <she>
##$AMP= (0..31)
100 100 100 100 100 100 100 100 100 100 100 100 100 100 100 100 100 100 
100 100 100 100 100 100 100 100 100 100 100 100 100 100 
##$AQSEQ= 0
##$AQ_mod= 1
##$AUNM= <au_zg>
##$AUTOPOS= <>
##$BF1= 200.13
##$BF2= 200.13
##$BF3= 200.13
##$BF4= 200.13
##$BF5= 200.13
##$BF6= 200.13
##$BF7= 200.13
##$BF8= 200.13
##$BYTORDA= 1
##$CFDGTYP= 0
##$CFRGTYP= 5
##$CHEMSTR= <none>
##$CNST= (0..31)
1 1 145 1 1 1 1 1 1 1 1 1 1 1 1 1 1 1 1 1 1 1 1 1 1 1 1 1 1 1 1 1 
##$CPDPRG= <>
##$CPDPRG1= <>
##$CPDPRG2= <>
##$CPDPRG3= <>
##$CPDPRG4= <mlev>
##$CPDPRG5= <mlev>
##$CPDPRG6= <mlev>
##$CPDPRG7= <mlev>
##$CPDPRG8= <mlev>
##$CPDPRGB= <>
##$CPDPRGT= <>
##$D= (0..31)
0 0.7 0 0 0 0 0 0 0 0 0 0.03 0 0 0 0 0 0 0 0 0 0 0 0 0 0 0 0 0 0 0 0 
##$DATE= 1737716580
##$DBL= (0..7)
120 120 120 120 120 120 120 120 
##$DBP= (0..7)
150 150 150 150 150 150 150 150 
##$DBP07= 0
##$DBPNAM0= <>
##$DBPNAM1= <>
##$DBPNAM2= <>
##$DBPNAM3= <>
##$DBPNAM4= <>
##$DBPNAM5= <>
##$DBPNAM6= <>
##$DBPNAM7= <>
##$DBPOAL= (0..7)
0.5 0.5 0.5 0.5 0.5 0.5 0.5 0.5 
##$DBPOFFS= (0..7)
0 0 0 0 0 0 0 0 
##$DE= 6
##$DECBNUC= <off>
##$DECIM= 32
##$DECNUC= <off>
##$DECSTAT= 4
##$DIGMOD= 1
##$DIGTYP= 9
##$DL= (0..7)
0 120 120 120 120 120 120 120 
##$DP= (0..7)
150 150 150 150 150 150 150 150 
##$DP07= 0
##$DPNAME0= <>
##$DPNAME1= <>
##$DPNAME2= <>
##$DPNAME3= <>
##$DPNAME4= <>
##$DPNAME5= <>
##$DPNAME6= <>
##$DPNAME7= <>
##$DPOAL= (0..7)
0.5 0.5 0.5 0.5 0.5 0.5 0.5 0.5 
##$DPOFFS= (0..7)
0 0 0 0 0 0 0 0 
##$DQDMODE= 0
##$DR= 18
##$DS= 0
##$DSLIST= <SSSSSSSSSSSSSSS>
$$ [...]
##$SUBNAM0= <"">
##$SUBNAM1= <"">
##$SUBNAM2= <"">
##$SUBNAM3= <"">
##$SUBNAM4= <"">
##$SUBNAM5= <"">
##$SUBNAM6= <"">
##$SUBNAM7= <"">
##$SUBNAM8= <"">
##$SUBNAM9= <"">
##$SW= 18.0517328524113
##$SWIBOX= (0..15)
0 0 2 0 0 0 0 0 0 0 0 0 0 0 0 0 
##$SW_h= 3612.71676300578
##$TD= 16384
##$TD0= 1
##$TE= 0
##$TE2= 300
##$TE3= 300
##$TEG= 300
##$TL= (0..7)
0 120 120 120 120 120 120 120 
##$TP= (0..7)
150 150 150 150 150 150 150 150 
##$TP07= 0
##$TPNAME0= <>
##$TPNAME1= <>
##$TPNAME2= <>
##$TPNAME3= <>
##$TPNAME4= <>
##$TPNAME5= <>
##$TPNAME6= <>
##$TPNAME7= <>
##$TPOAL= (0..7)
0.5 0.5 0.5 0.5 0.5 0.5 0.5 0.5 
##$TPOFFS= (0..7)
0 0 0 0 0 0 0 0 
##$TUNHIN= 0
##$TUNHOUT= 0
##$TUNXOUT= 0
##$USERA1= <user>
##$USERA2= <user>
##$USERA3= <user>
##$USERA4= <user>
##$USERA5= <user>
##$V9= 5
##$VALIST= <valist>
##$VCLIST= <CCCCCCCCCCCCCCC>
##$VD= 0
##$VDLIST= <DDDDDDDDDDDDDDD>
##$VPLIST= <PPPPPPPPPPPPPPP>
##$VTLIST= <TTTTTTTTTTTTTTT>
##$WBST= 1024
##$WBSW= 4
##$XGAIN= (0..3)
0 0 0 0 
##$XL= 0
##$YL= 0
##$YMAX_a= 194087
##$YMIN_a= -162815
##$ZGOPTNS= <>
##$ZL1= 120
##$ZL2= 120
##$ZL3= 120
##$ZL4= 120
##$ABSF1= 10
##$ABSF2= 0
##$ABSG= 5
##$ABSL= 3
##$ALPHA= 0
##$AQORDER= 0
##$ASSFAC= 0
##$ASSFACI= 0
##$ASSFACX= 0
##$ASSWID= 0
##$AUNMP= <proc_1d>
##$AZFE= 0.1
##$AZFW= 0.1
##$BCFW= 1
##$BC_mod= 2
##$BYTORDP= 1
##$COROFFS= 0
##$CY= -3
##$DATMOD= 1
##$DC= 2
##$DFILT= <>
##$DTYPP= 0
##$F1P= 0
##$F2P= 0
##$FCOR= 0.5
##$FTSIZE= 0
##$FT_mod= 4
##$GAMMA= 1
##$GB= 0.15
##$INTBC= 1
##$INTSCL= 1
##$ISEN= 128
##$LB= 0.25
##$LEV0= 0
##$LPBIN= 0
##$MAXI= 10000
##$MC2= 0
##$MEAN= 0
##$ME_mod= 0
##$MI= 1.114404
##$NCOEF= 0
##$NC_proc= 0
##$NLEV= 6
##$NOISF1= 3.799351
##$NOISF2= 2.8
##$NSP= 1
##$NTH_PI= 0
##$NZP= 0
##$OFFSET= 14.38212
##$PC= 1
##$PHC0= 251.5331
##$PHC1= 12.7922
##$PH_mod= 1
##$PKNL= yes
##$PPARMOD= 0
##$PSCAL= 0
##$PSIGN= 0
##$REVERSE= no
##$SF= 200.129724274929
##$SI= 16384
##$SIGF1= 3
##$SIGF2= 2
##$SINO= 400
##$SIOLD= 16384
##$SREGLST= <1H.CDCl3>
##$SSB= 0
##$STSI= 0
##$STSR= 0
##$SW_p= 3205.1282051282
##$SYMM= 0
##$S_DEV= 0
##$TDeff= 0
##$TDoff= 0
##$TI= <>
##$TILT= no
##$TM1= 0
##$TM2= 0
##$TOPLEV= 0
##$USERP1= <user>
##$USERP2= <user>
##$USERP3= <user>
##$USERP4= <user>
##$USERP5= <user>
##$WDW= 1
##$XDIM= 8192
##$YMAX_p= 0
##$YMIN_p= 0
$$ End of Bruker specific parameters
$$ ---------------------------------
##NTUPLES= NMR FID
##VAR_NAME=  TIME,          FID/REAL,        FID/IMAG
##SYMBOL=    X,             R,               I
##VAR_TYPE=  INDEPENDENT,   DEPENDENT,       DEPENDENT
##VAR_FORM=  AFFN,          ASDF,            ASDF
##VAR_DIM=   8192,          8192,            8192
##UNITS=     SECONDS,       ARBITRARY UNITS, ARBITRARY UNITS
##FACTOR=    0.0002768,     1,               1
##FIRST=     0,             0,               0
##LAST=      2.2672688,     0,               0
##MIN=       0,             -162815,         0
##MAX=       2.2672688,     194087,          0
$$ Real data points
##PAGE= N=1
##DATA TABLE= (X++(R..R)), XYDATA
$$ [...]
1864c0k0N2K1j10p1K81l89K05N9J58R0l85K44k52K21j13J62o7k94K33K33j47J02
1887A83j12J47O0j73k0k26P2QJ95K30k18q5l9p4K82j49K98m54J24k77N02j69j47
1910d2m6J94q5J49j86NJ88m09N75j74ll27K34j56O2K29k92k2O0j05r0L05j92N7
1934g1J44p4p7J68k51J58L6j15K95l3j33k13J92mj47J19j13j43K83J35l53J21
1956g6l3J48k1j79K14J52k96m5J78k99pJ40rJ67k57P2J96k31K97q4l6Mj85L89
1980A99j45L7K36n02J45J43j55J81k00m6K37j08l88K82%N1J2j11m5J22K54k18
2002a9j48j3K17m5O2j54L6pl0N2j3J52k68K09j78K38Q2q7j63Q5R0k70K77K7J07
2027B39m04R2q4J74J63j32k76J90J00J8k9j10k7l9J73K4j65j4J22J98m0m47M34
$$ y = [-30, -50, 2, 23, -87, -158, 123, -266, -61, -2, 156, 246, -139, 105, -147, 74, -39, 123, 56, -238, -5, 228, 81, 183, 71, 218, 278, 105, 85, -141, -69, -61, 134, 364, 146, 61, 22, -52, 230, 81, 379, -75, 49, -228, 274, 105, -42, -88, 106, 21, 170, -16, -11, 177, -232, 343, 169, 166, -161, 73, -83, -21, 208, -84, -106, -46, -151, -241, 64, -128, -71, 73, -1, -78, 90, -161, -3, 33, -82, 213, 180, 47, -166, 26, 22, -125, -6, -119, -262, 21, 156, -197, -76, -109, 39, 18, -161, 53, 205, -91, -136, 42, -257, -264, -124, -133, 34, -223, -151, 45, -186, 111, 27, -9, -5, -190, 199, 54, 91, 327, -175, -30, 113, -42, 139, -61, -107, 130, 22, -366, -84, -84, -33, -21, -132, -177, -55, 199, -19, -167, -180, 37, -8, 54, -100, -64, -71, -101, -49, -62, 90, -178, 31, -147, 91, 173, 86, -77, 8, 98, -172, 105, 132, 239, -165, -73, -157, 17, 180, 48, -228, -38, 62, 80, 51, -59, -86, -125, 48, 72, -93, -107, 15, 213, 173, -274, 160]
2050A60r3K43m71K63j1m05R1J78m6J86p9k90J50r9K65m8R3m3j17J65k67J20oK20
2074A59k12K4J88Pj49M0J68l86R1N4n5j40N73l33j20K64k05K9r3K86n3k41Q3r4
2098a15K03k23PQ1P7J13nj34R5k06mj74J41K2K56k60J03k30J97K60m60K06J14
2121F4Oj52k25L11Q5k12L52n10L90j17J98j49j41K01n5j93K50j00j72N8L15k32
2143b8O7j87J94K24Kk73L3J47l7l1L4n6m2o4j89K77q3k16N9K59j9k57R6n5K2L77
2169B54k49k04L82m63M17j89J45j7Jp7K41p0l18R1j35J60p4L44j26k5k93pL40
2192A28L8l64K20J63j86oR9p2l14O90l90P1j5j6K40o07J53L4K42Q6j50k46J78
2215b4O7J55j49r7L30l16j07k8J52p4j21J50L02k81J17j41r7J83Rkm36N01j35
$$ y = [160, 67, 310, -161, 102, 91, -314, -223, -45, -91, 95, 16, -274, -124, -223, 42, -6, 87, 44, -73, 92, -175, -55, -61, 159, -53, -29, 159, 166, 17, 57, 225, -161, -70, -16, -71, -211, 362, 29, -91, 173, -32, -3, -96, 190, 137, -104, -21, -115, 88, -135, -128, -47, 30, 143, 138, 4, 99, -107, -111, -285, -144, -122, 134, -126, -23, -253, -56, 204, -256, -50, 64, 70, -82, -307, 4, 89, -123, 229, -281, 109, -8, 190, 41, -100, 101, 46, -147, 103, 3, -169, -111, 204, -28, 39, -148, 46, 270, 272, -1, 32, 179, 142, 111, 145, 89, 47, -17, -206, 71, -12, -228, -169, 90, 71, -186, -90, -145, -123, 254, 5, -199, 183, -280, 137, -52, 93, 76, 77, 0, 241, 171, -147, -56, -191, -31, -105, 239, 113, 88, -205, -212, 128, 166, -198, 22, 185, -1, -7, 92, 20, -294, 396, 6, 77, 62, 46, 286, -321, -168, -134, 108, 194, 44, -202, -24, 43, 198, 49, -48, 282, -34, -141, -169, -17, -91, -212, -62, 240, -41, 76, -65, -162, 21, 30, 28, -408, 93, -42]
2238d2j93L23k23o7K39k81M17k51J04l9j9j99K04J25j42O5K98m70L80k75J00k9
2260B5oL8K6k07K41k47K98j88j36K06j17J11N5j49J21o8J84k25np3K4K03Q3m07
2284b13L93j78Q2l68K94j27K01k42Q5L7J63l89K24J50k44K2K19j87j9K39r4j19
2306g1J8K59l87J13O5l9L04j73m19L40j39M8J72j21J12k90l9Q9j85M45M9kNj73
2330a9l7R1m9L5J02K04J8k30k10R1L39k35j49J73p5l8M6J14k17J78K63n85R2J49
2354E1lk31J94ro7J5N5Kq4q8K66k64r7K76j91R2%J41R2l09M37j56l53J86k61M91
2380A85k98r1L74k08J7m7K95p8k46P8J04J87j35l39OJ47J36k02L75j72j37J72
2402A23k14o6K06k54N0k0K97j62J54J58k87M1K07m45K53k3k87M04%k19K52J43
$$ y = [-42, -235, 88, -135, -202, 37, -244, 173, -78, 26, -13, -32, -231, -27, 98, -44, 21, 319, -151, 229, -46, 54, 25, 19, 57, 83, -124, 117, -130, 168, -20, -156, 50, -67, 44, 99, -50, 71, 3, 187, -38, -43, -116, -92, 111, 194, -213, 180, 2, 84, -284, 10, -117, 84, -158, -73, -36, 127, -262, -38, 112, -132, -110, 109, -78, -97, 142, 48, -71, -53, 206, -181, -68, -3, -42, 262, 89, -330, 10, -129, -81, 91, -30, 82, -208, -247, -158, -343, 102, 151, 149, 154, -19, -56, 35, -14, 21, 123, 327, 345, 115, -95, -4, 335, 100, -49, 124, 49, 11, 57, 171, -46, 132, 395, -190, -98, 51, 48, -183, 11, 2, -65, -50, 5, 7, -77, -165, 101, -163, -260, 16, -175, -83, -83, 58, 150, -159, 278, 122, -231, -45, -306, 185, -113, -204, 170, -38, -21, -68, 227, 149, -97, -19, 85, 272, 137, -202, -196, -49, 87, -115, 260, 88, -49, 123, -91, -157, 49, -205, -155, -175, 122, -40, 114, 272, -15, 26, 233, -212, 41, 18, -269, 135, 135, -84, 168, 311]
2424C11j38l53K90k50J02j66K60o3m9K25k79j6J65mj75J0K51q9Q9K61m99nR2q7
2448a17p2NJ96J50j53L49j65k53K52j01j63J73J5k33j6J80L8J11k68K13l50J40
2470f9J0m7j14P8J85K2R9l11K30l08K08k75M38Oj31Pl3N9o8o8p0L95j65j51O8
2495eK86m22J13j86J85o3J20k39K34N6M5l50K25J8J68k34J7L29j0k72l1L18n14
2518b12K10j32R5L9O5J61k44J60J25l10j3J06Nl37M32l69J07P3k5J05k5J68k12
2541b8J54j47J04j74L8K02j2J18l36J85q9k16K61jQ3n74K91J35P2l48K64j89K47
2564D0O1j19J31j61J1L67k09j71J96p4o9Op9Q7J63j17l2N3q6r5j37M4K14L0j64
2589a10L17m11K47J8K4j09J88m36o1M49j9k59J77R5m6o2M8M0o1j01K9j21J89J08
$$ y = [311, 173, -180, 110, -140, -38, -204, 56, -7, -56, 169, -110, -126, 39, 35, -140, -130, 121, 32, 121, 382, -117, -122, -30, -117, -189, -184, 12, 162, 9, 358, 193, -60, 192, 91, -72, 101, 116, -117, -133, 47, 85, 196, -72, 141, -209, -69, -59, -106, -220, -142, 43, 65, 164, -147, 83, -225, -17, -292, 146, 152, 21, 28, -5, 54, -14, -82, -152, 243, 78, -73, -5, 281, -141, -28, -214, -29, -92, 28, -211, 23, 79, 124, -226, -1, 17, 185, -49, -32, 297, 287, 15, -16, 302, -212, -2, -134, -39, 0, 65, 226, -18, 142, 267, -43, -56, 50, 55, -282, 150, -219, -112, -39, -64, 41, 16, 184, -28, 126, -21, 83, -91, -53, 149, 137, 255, -81, 104, 15, -201, 60, 59, 142, -432, -141, -6, 66, -282, -18, -207, 40, 101, -18, 113, -48, -37, 330, 121, -50, 146, 72, 3, 9, -70, 17, 180, 63, 31, 84, -2, -97, -234, -190, 24, 54, -110, 207, -204, 43, 61, 85, -24, 164, -272, -333, 116, 97, -162, 15, 110, 64, 2, 50, 90, 29, -72, -43, -164, 25, 133]
2613A33k30J19N2j28L09l17N6L3p2K89o33J74K92J05j60j35J08K7J43l79L38n8
2635F6J89m44L19k67M3K0J76q6J09k51K23l69K56K27j12o7j62J64j71l4L59q2
2657A06l1J76l00j27J97j51Q8n6J03N9j5J09j1m3J7J09p6L3K3k35Q8J29k65J38
2681F5k75L68k44R1m9j3K45l57Q8K0rJ62m1Q1k44J26R9k27P4k43l0N40k62L35
2705C00n41K84J31l96L18J49l10o9J99k8j67L5j90J98J60P7q4n1j35L17k22J07
2727H2Q4k02q0R7Q6k3j80K58Q6k38J87m1k72L89l33K77l33r2K39O7J1j7J71l02
2751g9q3M0r8K34j09J59j96K58k08J13m5j21K71p1q7P2j10M6M96n33J60j55l1
2774g7J26n6K05k20M0k55J01K43o0p9J51j39nK20k41j64K23J99p0m62M37kk36
$$ y = [133, -97, 22, 74, -54, 255, -62, -6, 27, -45, 244, -389, -215, 77, 182, 22, -113, -5, 22, 165, -214, 124, 66, 255, -189, 130, -137, -94, -74, 102, 16, 125, -126, 97, -272, -16, 211, 99, 32, -130, 34, -137, -171, 188, 106, 75, 251, -49, -176, 21, -130, -42, -98, 5, 64, 49, 158, 147, 104, 121, 230, 154, 187, 210, -25, 63, 192, -73, 65, -210, 158, -86, 5, -44, -57, 188, -169, -81, -61, -70, 92, 51, 132, -112, 14, 113, -114, -40, -283, -313, 227, -35, 300, -241, 43, 174, -222, 96, 245, -65, -134, 65, 37, -130, -95, -285, -87, 73, 150, 66, 15, -120, 197, -25, 82, 166, -36, -116, -19, 67, 44, -136, 122, 208, -30, 157, 116, -156, 233, -100, 177, -156, -248, -9, 58, 69, 52, 223, -79, -162, -122, -220, 14, -95, 64, -132, 126, -82, 31, -14, -135, 136, 65, -22, 50, -60, -14, 482, -51, 109, -46, -77, 49, -7, 198, -22, 18, -237, -136, 107, 47, -32, 119, -20, -25, 195, -46, -210, 13, 212, 142, -320, 117, 115, -121]
2797a21P8N0L2j32O1Q0J00k03P5l7J19L59m46j45J57j9J15j02j61K2Q2k33M20
2820A51j45l6J24k38K45Q4ll74K81L37l65p0l59K38M4J57J28m95M39K5m7j32l7
2843d8J40o3Qj50J09j0l68N76l72J59q8L2q1q6L63j02p8Q6Q9j86L21m14J70j60
2867a53j11J43K44r3p0K04qL8l94K69j80o1P5J22K23k34l4k60K86j83K89l4j86
2890a08J58j6k09K97K7k88jK4j17M11j98j07K31K91m76J17J61r7o6r6L33k19J37
2913A89j13K0O0l33R3J48k59Q8m2K35j76L41k07K0r7r5J01o0K33j45o3J51j52
2936f3L9o0j55K65Rj50j49K38O9n4j25RK45K32m05L63l09P5P9l38J18j2R5J55
2960A71Q7l60r8L05k62J08J09k9j67N9O4j30M04n7k69J50j78K85j52J2K96j17
$$ y = [-121, -43, 7, 39, -93, -32, 48, 148, -55, 20, -17, 102, 461, 15, -130, 27, 8, 123, 21, -140, -118, -36, -269, 151, 6, -30, 94, -144, 101, 185, 182, -192, 89, 426, 61, -9, -368, -130, -86, 71, 199, -296, 143, 168, 121, -11, -48, 92, 29, 37, -113, -4, -14, -382, 194, -178, -19, -107, -75, -156, -242, 121, 19, -59, 27, 116, -70, 251, -163, 7, -153, -264, -121, 123, 30, -40, 164, 156, 194, -200, 69, -111, -172, -97, 25, 248, 14, -20, -280, 6, -177, 112, 78, -108, 50, 34, -175, 122, 149, -139, -140, -116, -233, 178, -20, -127, 104, 395, -81, 36, 197, 100, 34, -62, 271, 52, 189, 76, 96, 156, -177, -84, 64, -195, -107, -149, 86, -90, 251, 44, 64, -33, -128, -27, -87, 146, 1, -62, 89, -63, -24, -84, -239, 26, 35, -115, -264, -26, 43, -11, -136, -127, 118, 350, -55, 308, -1, 74, 153, -185, -67, -79, 16, 171, 258, -102, -200, 105, -157, -49, 60, 31, -136, -77, -13, -143, 261, 204, -65, 85, -93, 192, 40, 52, 348, 231]
2982B31j43j07p0M2K3J53k61K6K03q0J8ll72L26L43m10k87J56L07j33K6kj12L44
3006B18j70n1J15N4m3L7p2Nj3k29M32m38N46m77k7K75r5L0j17J54m61K67J89J18
3030B47j91k5j69POj45K21j1J57l7j33K37k50j2j36K77j58N2n1j84N01l12J1J64
3054F6k95L93p7j56K26l71M37l10J25q5j76J24L22l40J19Q7l8l04K18j27P5K25
3076A38l30L87o49M62j00J42j25K37J03k44l3J42R5k64o4n1K48j27o6R6l5qJ09
3099F3j4j05K8j83N7M4K84k31k1O7p5kK02k24L46j00q6N1L5j25o1r4JK64K7j42
3125FJ19O7k6j92L05m90L66j83L39j91n8J91m18j39M00n2j45l0P9o2J03L6J53
3148A78l2j1L4j51J94l56L24j07j8j31K0J66K50l50K71k51j76R9J4o2k19J4L18
$$ y = [231, 88, -19, -89, -47, -24, 129, -132, -106, 97, 17, 35, 32, -340, -14, 329, -81, -368, -212, 95, -38, -12, -14, -126, 218, 48, -3, 112, 166, 123, 160, 88, 93, 80, -149, 283, -155, 391, -86, -113, 162, 67, 97, -20, 134, -327, -60, 129, 247, 56, 31, -138, -131, -125, -270, -49, -60, 97, 60, -73, 164, -86, -98, -234, 43, -115, -63, -114, -298, 203, -109, -98, 66, -229, 164, 87, -69, 157, -214, 223, -87, 38, -47, -223, -99, 223, -117, 2, 89, 51, -253, -35, -162, -87, 138, -192, 195, -454, 8, -92, 50, -75, 162, 265, 21, -12, 130, 225, -39, -103, -154, 94, -33, -99, -3, -38, -46, 63, 49, -56, -28, -211, -154, -110, 174, -57, -78, -11, -86, -88, 114, -110, 236, 136, 50, 101, 136, 11, -50, -144, -143, 121, 148, 6, 125, 192, 166, -26, 279, -211, 155, -28, 311, 120, 62, 253, -165, -304, 96, 44, -101, -131, -52, -114, -11, 25, 178, 146, 135, 169, 18, 212, -144, 180, 73, 55, -76, -56, 110, 360, 10, 281, 30, -146, -47, -33, -95, -314, -300, 18]
3171A8J28k81J08m9N8K09k44K7qK14k55J40r1L1j41m3J02j5j37L88k37k40J87
3194a31L53k22l2L7m2%lJ98j49K91l19J50l98J67J09J20q4N5k35L84j52j25jJ15
3218H6k66R3J78j08j8oK53o4k73j07L32j6l33L33L2m5q8P5j23J05k82K33J69p4
3242H6J24j72k8p5O2J75n3L8M3p1M5k65J88j64P2k65N1N56l81l8k2M2j56M06j58
3267D0K41q6n4Nl04K2K94k38j81L29L6l15K54PJ5n3r8j98M88N0l50L07l5k04m6
3292g4K78k2k16L0J29Q3j54m7J32l43N32k69J2j41M19m50J95k82K54q2J25nj63
3315e9j48J49P2M0k94M32O7l77Q9mr1j26J18nK84j68J04mk12J63J94k19j46J39
3339bn1m0N0J24j28J07J10l1l34J47J78j61L0j03L9PK38n14K41L80k14j23k8j23
$$ y = [18, 146, -135, -27, -76, -18, 191, -53, -26, -34, 180, -75, 65, -26, 5, -136, -179, -77, -92, -229, 159, -78, -318, -131, 222, 0, -32, 5, -37, -37, -40, 158, 9, 300, -19, 131, -267, -100, 9, 129, 45, 100, -135, 249, 97, -28, -29, 86, -180, -87, 91, -17, -35, -41, 212, 148, -125, -232, 100, 84, -249, 84, 116, 71, -17, 58, -65, 40, -242, -9, 160, 86, 210, 38, 10, -65, -3, 172, 119, 157, 200, 129, 174, -91, 97, -67, 5, -260, -209, 347, -34, -72, -94, -52, -208, 198, 40, 281, 195, 141, 146, -158, -136, 158, -80, -261, 68, 104, -211, 43, 50, 65, 12, -86, -284, 204, 254, -96, 211, 176, -28, -74, 204, 182, -34, -4, 125, 208, 54, 7, 139, -204, 328, 59, 71, -70, 349, -101, 94, -188, 66, -16, 109, 104, -59, -207, -58, 14, 54, -240, 192, 259, -118, -29, -33, -124, -250, -132, -137, 147, -21, 83, 79, -133, 30, 224, 5, -141, -2, -53, -93, -43, 81, -47, 60, 170, 139, -195, -48, 130, -31, -1, -104, -65, -58, 180, -334, -93, 287, 73, -50, -78, -201]
3363b01K01l1N3oJ69l18j63R2K63k30L14k51R7J73j13rr6K4L06j96j46mj01K98
3387A25j29oo6j11K56q1K6J6k9K88k15Ok4p2o6J82M8k55r6L04j06j16j79K35K7
3412c8K46k43K77j95Q2j08j14L42l97K89m5l9Q4JM9l34K17m06L41k0o8J31J47
3435A99k87k1J53p8P2j23kJ57k54L5o8J59J25k00nj00M37k11j11K48j97K37m9
3458A16j97J49Q8j48j28J72J3j16K8k4K84p8j05l11K90Lj09K69k06J13j26J59
3480A36j7j17n2oo3J53k4p2qK42m59L28j51j1R3M17l10l01L48k03R9j35o0N8L69
3505B54l53J59J55j43k98L97k64K44j49M03j74k32k37L38J01j34M2K88k21Nj8
3526A63O8k39L8Q9j49P6J23j14O7j53M29n65J56q9L39k74J10l5J97k65k3J81J7
$$ y = [-201, 0, -31, 22, 16, 185, -133, -296, -204, 59, -171, 143, -108, -11, 162, 49, 40, -56, -32, 274, 78, -68, -72, -173, 125, -4, -10, -76, -187, 69, -12, 14, 30, 1, 289, 74, 80, 56, -16, -82, 100, 148, -107, -203, 101, -5, -121, -300, -65, -38, 208, -35, 242, 47, 129, 21, -93, 249, -148, 141, 96, 57, 141, 142, 191, -143, 74, -332, 9, -11, -79, 52, 199, -88, -109, 44, -34, 38, -85, -87, 70, -184, -149, -217, -58, 67, -133, -138, -238, 199, -12, -123, 125, -72, 165, 116, -81, 68, 156, 8, -120, 52, 65, -51, -23, -47, 237, 159, 54, -257, 33, 36, -73, 196, -10, 103, -23, 136, 119, 2, -50, -56, -119, 34, 10, -62, -70, 172, -287, 41, -110, -121, -28, 389, 79, -222, 126, -77, 22, -113, -173, -115, 254, -99, 60, 215, 72, -226, 171, -93, 151, 2, 405, 231, -1, -238, 100, 201, 67, 109, 397, 176, 181, 163, 231, -8, 30, 119, -30, 46, 169, 55, 122, -31, 398, -167, -11, -100, 239, -35, 75, 40, 237, -28, -51, 130, 147]
3549A47K22n27K6J87j41P1k29J32J5J16j97j3R6j84L19k0j78N0K22j60r5k4K80
3572A15j76J29K50l38J86Q2k70K24l66K32J34j62K0K02k13l6kk53L48j15q2q4
3594a75L47m8j78N8j20m5L02j47J32k85L74j86N5q4K09l52R2J75j89J45o2K4k4
3617A8N1k57N99m14j96J70k4K55p5k0l23M09k47q1m9K64km2k1lJ38j25p8j33L94
3642B08p6P6l37L20j76K07l91l1J88j6J92j85J2RK1J36L9l01j47J69J0J63k8R3
3666A55k4k46K32j69j00M5J01P8Q1j36K01k31K9j54K21l58J26lN6J5J7L67l24
3689b1K66K3l27K9J21J2j82K7lp9M1j45L27O1Q0m99K88J84nm15L33m95M69M0j20
3714A0K2N9k44L76L2j41j55J00J42j90j68K92j21p4n2K4K97k5l00J13N0m3K87
$$ y = [147, 369, -158, -132, 55, -86, -15, -244, -112, -97, 19, -178, -191, -95, -279, 40, 20, -158, -108, 114, -46, -141, -165, 115, -61, 68, 318, -20, 166, 248, -22, 202, -164, 68, 202, 40, 60, 262, 49, 13, 11, -242, 106, -9, -91, -175, 172, 124, -54, 4, -116, -161, 141, -6, 126, -159, 215, 29, 84, 0, 209, -143, -51, 124, -65, 80, 18, 42, 18, 69, -188, 411, -3, -199, -29, -53, 202, 127, 107, -216, 193, -54, -135, -184, 80, 78, 36, 15, 12, 150, 25, -53, -186, 208, 132, 208, -129, 191, 15, 222, -169, -200, -12, -28, 164, -21, -9, 0, 21, 157, 196, -105, -252, -83, -73, 90, 62, 155, 131, -115, 117, -52, -152, -107, -6, 72, 153, 17, 218, -13, 16, -138, 83, -275, -149, -152, -96, -81, -64, 303, -21, 245, 268, -59, -30, 91, 103, -79, -52, -55, -134, -93, -238, 89, 150, 230, -269, 19, 203, 198, -217, 116, -379, 90, 130, 10, 32, 91, -153, 223, 255, 114, -41, 59, 201, 11, -157, 135, 14, -60, -112, -88, 209, 184, -116, -3, 47, 4, 291]
3737B91j14L2l38M4N08l37Q8k24p1j8J22k13K64j28j99L62lj26P9o8K72l78J7
3760a38L4Q2M9L5j5k23J87k73L14l63L83Rl5j64K29k32L11m7l72N09k34j89m7
3783a90K24j72R7k18M49k28Q2K9l19K05K0j3J15K1q4O5l8o6J28j03J53m46J00
3806a89K52n3O4%L3o1J2LJ88j74p3J45M3j23Nl3J53k18K86l33j36K61p3k4Q0N1
3832H6k8K1q5j25P9J41J01j62K54m3l77m0L20k59Q2L75m04K11q7k2j45J87j95
3855a15J65j87J51q1j51L76l07L57j85P5J4j88R1K47l51K34k5Q3k43l0L70n00
3877b00J89J69j24j50R6J88j6k2l24J67K51j20n1l32K75J72l58L33k32L17l05
3898g7j07M12l74K37P6k4qn1k05k33J87J92J4L9JJ70k54RJ30l08L95k32r9Q9l08
$$ y = [291, 177, 209, -129, -85, 423, 86, 174, -50, -121, -139, -17, -230, 34, -94, -293, 69, 66, -60, 19, -49, 223, -155, -138, -104, -22, 27, 62, 47, -176, 11, -262, 52, -311, 72, 81, 46, -118, 111, -121, 190, 143, -229, 280, 46, -143, -190, 34, -138, -41, -259, 190, -38, 44, 73, -246, -41, -21, -34, 81, 102, 18, 83, 45, -21, 107, 4, 157, -289, -189, 63, 10, 74, 74, 107, 46, 58, 61, 249, 75, 2, 147, 190, 67, 72, 39, 192, -26, 260, -73, -209, 52, -21, -45, 35, 86, 58, 79, -6, -131, -52, 89, 190, 28, 282, 239, -138, -178, 142, -117, -35, 340, -64, 147, 60, 38, -107, 80, -115, 50, -137, 14, -67, -218, 158, -149, 208, 23, 98, 112, -76, 15, 262, -89, 145, 120, 203, -40, -70, 300, -200, -11, 158, 34, -116, -20, 168, 152, 130, -194, -27, 224, 104, 53, -279, -4, 168, -190, 143, -89, 228, -77, -184, 228, -146, 91, 167, 143, 135, 84, -121, -354, -167, 25, 39, 78, 79, 249, -5, 4, 134, -174, 221, -11, -110, -21, -329]
3923c29L76j86J25J2p4M6L8j09J5J58K8j16L28l77O6K0l40K13k7K50k42j44R1
3946a78J4j2K51M8o1r9Q9O3j69o6J98J87l65K12lj90R3P6P2l20L61k27p1J17k91
3971b71J68l0n8J83J14J67k85j32J44r0k6K32j42M2j57L20j72l9m5J40QLj50j62
3995b38J88o1J13r2m0Q5J07ro9l2n0J65k19J49J16j22k47L36J23l62N3r7N0k13
4019c66L96J1J45l19J76O7j12l3j25J18M7j07J21n9J2K89j33l94M03l9m14N29
4041B13l08L95m49Q6K58k53n8j10J76kJ45%q7M4PM7j36L02l39O4kn6J91k41j60
4066b73J76R3M1J79n9j48J3O1r2O2j73%o9J79J78j58J23l12O7K05Q4l61J64r2
4090a12n9K54j00J31j40K28k18K09k55K11j58l9K37n1N2j33j0l07M49m0Q2l06
$$ y = [-329, 47, -139, -14, -2, -76, -30, 8, -101, -86, 72, 100, -16, 312, -65, 1, 21, -319, -106, -133, 117, -125, -269, -178, -164, -176, 75, 123, 62, -37, 52, 115, -54, -120, 78, 265, -100, 112, 109, -81, 12, 88, 160, -160, 201, -26, -97, 20, -271, -103, -133, -191, -8, 106, 273, -12, -144, 0, -90, -116, 116, -26, 16, -141, 179, 7, -32, -77, 63, 71, 74, -76, -238, -50, -111, 2, -90, -130, -45, 62, 53, -16, -48, -98, 67, -152, -3, 113, -9, -256, 80, 203, -159, -106, -203, -153, -366, 30, 41, 186, -133, 43, 110, -2, -35, -160, -42, 5, -102, 19, -40, -28, 261, 128, -266, 137, 98, -316, 213, -95, 300, -149, -63, 195, -58, -116, -226, -50, -52, 93, 93, 6, 50, 57, 104, -32, 270, -69, -5, -7, -63, 128, -113, -273, -97, -4, 37, 216, 157, 9, 22, 83, -9, 53, -120, -120, -189, -10, 168, 10, 133, -179, -112, 93, 177, -184, -20, -112, -171, 83, -17, 114, -26, 202, -16, 193, -62, 149, -9, -48, 189, 138, 190, 57, 47, -260, 189, 149, 231, -75]
4112g5J11K45l44K81k39l0K89k58P3p3K68m41J80j34L56k04K09j68n3p5M0k2m9
4135a13J64n2j26L08l9k00N3p0j19K03Q0k05M9L53j22j17O2j97J77r7j46J44Q8
4158G8l53J67k8L53L9l39K35k66J95P5k0k78K84n3j24n8K7l4K87j88p9K18K51
4181C89m21j91K33n2N6Lq3R4K1j66K35p3J2j24j4q7J23J51k21M6J03Q8J10l10
4205g8k62M64m46J13K17p1kJ19k50K19j69j1O2j50K80j20k17M59j18o7p8K28k7
4228I5j60L89l21J75j23k55L10k7j92K48j61j25K60j87R4PO4j38K96j24j44MK08
4251A93j89O6j26K1L44m12K14J44l57q6N28n03K53J04l80M67K4m12K74l22L77
4272B22j48l4p0J29K58m23K93m07K49J21k64L6J73j24j02N8o7K1N07m52J69m2
$$ y = [-75, 36, 281, -63, 218, -21, -51, 238, -20, 53, -20, 248, -193, -13, -147, 209, 5, 214, 46, -7, -82, -42, -64, -113, 51, -1, -127, 181, 142, -58, -5, -75, -194, 9, 89, -116, -67, 286, 164, 47, 109, -88, 89, -8, -154, -10, 78, -275, -108, -136, 217, 256, -83, 152, -114, 81, 156, 136, -142, 142, 89, -35, -93, -66, -100, 187, -1, -80, 138, 389, -32, -223, 10, -42, 14, 17, -66, 28, 49, -117, 118, 45, 57, -67, -81, -168, -45, 106, -115, -69, 34, 122, 232, -78, -340, 124, -322, -209, 8, -63, -65, 54, -196, 23, -146, -157, -95, -245, 35, -85, -302, 157, 39, -28, -106, 122, 95, -65, 324, 3, 178, 55, -200, 110, 83, -109, 139, -22, -147, 113, -74, 20, 27, 91, -47, 249, 125, -19, -15, 193, 4, 70, -56, -35, 309, -103, 111, 255, -102, -188, 340, -163, 90, 194, -186, 281, 305, -107, 167, -155, 222, 74, 40, -30, 99, 357, -66, 227, -180, 69, 190, -74, -38, 135, 11, -91, -33, -100, -79, 428, -24, 145, 103]
4294A03J35j5k46K51o1l0j69rM8J26o7k00l8K35l8k06N6OO1M3j40l7J75r6j48
4319b61K93k24oL54N9j33j88J72M8j51P6j68K31l24M12k30J39m0k66M42k41kK30
4342B22m7k32L4Q1J52o9k41m6L13k93mL11k70J66J95l12K40j68J44m11O4J35K9
4365gL16m36K59n2k11j10J87M4j00K16q9K07l39P5K62j76K48k85lm4K9K53n27
4388b83L46R5j13l0R4N6Q3k31j1J33l14J31J68p0J2Q7k08J63q9j74K26j3j18p7
4412a37M4r3J20r9P5rO8r9MM6N0R8j69M5L2J44j52k6J12k2j61J68j48L16k85N7
4438b1l2M5Q2J2j14J59k96J71j24K00j31J20j12j80J63pNL93m39K02J50l16jK7
4462d4K0l4j14J14M9j02J43j70n8K20J52j1j5q8N2k81O5j17L25Lk24j77L77l04
$$ y = [103, 238, 223, -23, 228, 167, 137, -32, -41, 7, 133, 66, -134, -172, 63, 25, -181, -125, -119, -58, -15, -155, -192, -17, -113, -261, 32, -192, -198, 156, 215, 82, -106, 66, 114, -37, 39, -129, 102, -222, 190, -40, 99, 59, -207, 235, -6, -8, 222, 175, -57, -23, 58, 210, 141, -100, -146, 167, -126, -130, 181, -89, 77, 272, -40, 200, 32, 176, -235, -171, -36, -7, 309, -127, 132, 80, -131, -241, -54, -10, -110, 106, 17, 224, -115, -40, 222, 46, 294, 9, 6, -38, -9, 244, -283, 63, 158, 45, 15, 109, 165, 248, 17, 6, 139, -175, -44, 124, 54, 66, 153, -55, 108, 19, -155, 71, 58, -60, -137, -93, -186, -66, -165, -90, -99, -31, -130, -126, -80, -30, 68, -101, -56, -24, 120, -32, -58, 54, 32, -129, 39, -109, 207, -78, -21, -53, -8, 74, 86, -28, 131, -165, 6, -118, 82, -49, 71, -41, -221, -58, -65, -60, 333, -106, 96, 246, -70, -71, -44, -24, -58, -172, -58, -9, -111, 32, -138, -196, 24, 176, 165, 150, 62, 114, -167, -102, -219, 106, 109, -115, -292, 85, -219]
4486b19N6K31r9P2j49J01N3q3N3k55o3L74o2j82J84O8j58m0J39J70k14q7L00r5
4510I5j1n5J25j06l50K48Q1m40N28k00n4K67j41j8J61j45m8k3Q9P0K6M0j36j94
4534a91K83j20J49J54m14K38k7k31L06k83j3J09K97l76M3pk03L78k8j02J37J8
4556A17j24k25M6j08L99k43K41p1J87l29r3p0J90p0J80P7j64R3k80M06k91j6O
4579a42K17n4J73k24M5n7j15J24L7k68M87k52k62K10J90J41l59J2M5k34L03J7
4601C4r6r1n0p2M74l25J0L6J08K48l97J70Q1m0j65r5K63l67L57j41k6N6k15M54
4625B11m35L03K3r7J30K54k52k72K26m9r8J19l06K61lM9j41R9r3j53K2K59K90
4648C47l13j22K5J87n1l30J6J82M45o9l87qM65m60l6J86J49k8k29k7M3J75j54
$$ y = [-219, -163, 68, -31, 41, -108, -7, 46, -37, 16, -239, -302, 72, 10, -172, 12, 80, -78, -118, 21, 191, -23, -110, 190, 95, 84, 29, 154, 48, -302, -54, 27, -413, 115, -85, -139, 128, -13, -31, 130, -15, -63, -86, 3, 73, 99, 139, 3, -191, 92, -28, 121, 275, -139, 99, 72, -159, 147, -136, -149, -40, 257, -119, -76, -83, -286, 92, 64, -38, 99, 117, -7, -232, -186, -294, 105, -138, 103, 32, 219, -110, -203, -273, -83, -153, 27, 104, -60, 33, -247, 159, -132, -148, -142, 75, 21, 194, -30, 15, -42, -157, -33, 4, -264, 223, -29, -291, -81, 109, 250, -109, -97, -52, -286, 17, 34, -62, -153, -203, -275, 199, -126, -116, -80, 28, 276, -121, 49, 130, 90, -75, -170, 93, -274, 83, -58, -84, -28, -243, 211, -224, 79, 102, 5, 135, 389, 137, -135, 91, 42, -56, 63, -243, 18, 15, 64, -77, 22, -71, -224, -202, 57, 347, 34, -88, -63, 124, 73, -257, -241, -59, 386, 317, -70, -78, 387, -73, -109, 77, 226, 198, -31, -58, -15, 160, 6]
4671Fk00K54j1j05J8L1j60P8K9p3J14J97m13J4J36M7m04J79K92j38L3K41o4j14
4695a3J77j56J66k46O7J61k0j64J40k71L30j47J99j05PJ24m60K76n7l4N8k0R4
4718A06m2j73P0o2j9R8K51k47L8J61j44j75N7J88j72O8J05k27k9K72kj83R9j47
4742a09Q4K30o36J69R8L49j56o2o2K33n1j75O0K44k61j14J75m03L98R4j08j15
4764a18Lm1l5K64J87l98J87J27p1l75L96j73K74n84K83O5q8J38k1k88J97J83L4
4787A46l07L99j17r0l5j22J53j21J5L1J81k83O3MJ31p3J36j59J26q1O3K2k63k15
4811c96L65J9j1J26p2j79J70m1K09K5k46j35M00k95j4K45K43l56J07l61J49M07
4833C59k55j75j12K48Q1k21j51J41K52j52j14lj25P6j0K50l09j0J33J8j38J65
$$ y = [6, -194, 60, 49, -56, -38, -7, -167, -89, -60, -133, -19, 178, -235, -221, -85, -38, -442, -263, 29, -109, -76, 165, 101, -13, 164, 8, 174, -72, -5, 156, 136, -28, 112, -159, 171, 24, 223, 118, 125, 249, -211, 65, 8, -26, 32, 12, 106, 64, -109, -39, -101, -120, -22, 229, -18, 20, 181, 37, -138, -81, 107, -65, 3, 108, -119, -148, 124, 122, -61, 38, -109, -25, 205, -431, -262, -164, 185, 29, -33, -95, 138, 87, -88, -28, 216, -45, -159, 16, -387, 11, 105, -3, -118, -115, -156, -191, 73, 260, -138, 49, 176, 105, -270, 126, -47, 227, -357, -74, -9, -97, 41, 20, -268, -71, 112, 146, -161, 238, 121, 31, -4, -126, 27, -94, -79, -48, 133, -150, -87, -83, 48, -25, 111, -48, 78, -3, 60, 82, -181, -396, -31, -12, -23, 103, 31, -148, 22, -19, 190, 215, -31, -166, 234, -61, -75, 170, 413, 57, 164, -197, -48, 359, 104, -71, -183, 65, 146, -75, -226, -85, 167, 15, -99, -102, -227, -151, -161, 89, -220, -230, -97, -79, -217, -52]
4855e2k2K09j38J26k86K2J02N7Q7o2l63J84J50k75J56K5J67ro1l8j22K71L5r5
4879F8j64M06l06K05l39m6O4J37k58K29J82k44j12M39j60j08m6J14O3k43R3K6
4901@J25p6L5j33J58j87k4O2R2j62J89p6J66p6q3N3l5o2J97r0j73J4O3J21j74
4926g6R9K3Pj53L5J2J71q9l11L10J55m5j93J52j23J2m5K9j06P6N7K5J43J4Q6j81
4952H4j74L1pJ33P0K32l62j4K4nk05N2n0J19J3l7l2L8O3k51J71J41k01L14j23
4977B4J34k83M01m52K52j29J98j57O9q7J40q9Q3Rj65J01lo1O4J84l71j80J97J83
5001F2Q1j75m7k1J90Q5j15Ml15K85k20J48N5J2j0r0J27R9l71J96K45k81j50M7
5025a59L14p0l7Q6l98J59J60n0p8MK76K86m16k41K15j40J92Q3j12k15Q4J98O0
$$ y = [-52, -74, 135, -3, 123, -163, -141, -39, 18, 105, 43, -320, -136, 14, -261, -105, -80, 87, 78, 17, -21, -143, 128, 163, 68, -96, 310, 4, 209, -130, -176, -112, 25, -233, -4, 178, -66, -178, 261, 101, -7, -53, 61, 124, -119, -26, 0, 125, 49, 84, -49, 109, -78, -102, -40, 52, -110, 79, 3, 169, 93, 10, 63, 28, -34, 163, 73, -100, -86, -23, 98, -76, 23, 46, 53, -100, -65, -53, 118, 29, -282, 28, 183, 138, -55, 97, -26, -14, -59, -30, -136, -60, -3, 22, 165, 179, 265, 84, -90, -59, -66, 67, 137, 369, 7, -7, 17, 12, -193, -141, -191, -72, -59, -96, -128, -90, -27, -278, -107, 34, -167, 147, 24, 158, -125, 276, -176, 76, -53, 145, -12, 57, -30, 110, 21, 104, 113, -52, 49, 46, -15, 49, 233, -138, -318, -121, 62, 143, -32, -79, -100, 90, 175, 60, 64, -251, 34, -186, -38, 17, 29, 19, -71, 56, 155, -216, -20, 225, -56, -206, -159, 155, 85, 48, 134, -264, -105, 55, 5, -73, -69, 207, 493, 77, -164, 51, -89, 103, 186, 74, -141, -57, 141, 201]
5048B01j95lJ63m66J10L5r4J95J13j51J53M3j71J92k35M2J25j52J15K36K9m54
5070a69j7K93M4k30j89M16l55J27L66n1K6k06j40K56j32J53j37j03j82n5K97Q2
5092I4m4l1J94J29j88J09l24RK6P9m1J42k64K01k86n4J54n7K40l6L6JL4m5j30
5117e2LJ55k2j21jm8jj47R4J15l07M37j62J0R2k81M39r6R6n3o8OK7j50J9J70j30
5144B4J91m34m0L05m1j00R6J4k93L17kn4J92j36l8n4L99j26m08M09m60M77k08
5167C0r2N6K00l92J66K1j62K12L4J0k1K03m0q1l27J28p9K97k22J40j64n2j0J75
5191C0q5j45J1J0K09M4m56M19Qk11j25N81l02k16L72r4j66j17J39k7K44k94M6
5214a25K5K04K0p7J3J24k66N2J40j97N6J04j22K01l91K62r4n9pJ04J16j05Qj70
$$ y = [201, 6, 3, 166, -300, -190, -155, -249, -54, 59, -92, 61, 104, -67, 125, -110, -68, 57, -95, 20, 256, 285, -169, -186, 107, 151, -79, -268, 148, -207, -80, 286, 235, 261, 55, -85, 171, 39, 192, 55, -48, -230, -285, 12, 94, 50, 19, 213, 342, 154, 263, -61, -52, -26, 53, 12, 154, -110, 91, -195, -249, -95, -152, 88, 52, 88, 89, 123, 78, -52, -49, 106, 84, -37, -38, -86, -87, -234, -140, -25, -332, 105, -57, -47, 45, -236, 203, 107, 203, 150, 82, 88, 115, -35, -16, 154, 24, 215, -219, -259, 46, 5, -95, 1, 15, -278, 39, 37, -17, 175, 39, 1, -53, 346, 220, -188, 221, -239, 238, 30, -62, -6, 194, -198, -32, -11, -173, 39, 73, 83, 62, 265, 225, 144, -183, -55, -134, 163, -59, 81, -83, -135, -145, 30, -55, -200, -189, -179, 30, 74, -382, 37, 45, -166, -291, 290, -12, -228, 144, 50, -116, -233, -94, -121, 123, -171, -125, -100, 104, 124, 47, 60, 184, -82, -30, 110, -87, -31, 73, -49, 152, -239, 23, -71, -130, -137, -33, 83, -22, -14, -184]
5238a84M49p1k48R5Q5l1j46k75L39M2J19m36M31o10M19j88Q5J56l57K43N8n8j1
5261i4n8L05k25J62L4R9j61K2j72J96o6K44j32r4J36j9k67J40J58m66K01J32J22
5284A97j14K8k54N4J52l46J89L54O5k14k63Q5J02R6k38N5J34L3j72L79j82l1k06
5307i7J58k17L05R0k60M2m0J54J5K3l89K00j03k5J40r7L6K75q6l68J39R8P7j22
5331e2K71j60P8j11k3j71J44j32J94%j27J60j24J4k9K14p8K9j62J12p2J83k04
5354d6J19j29J1Q0m5j6j74R7J03j53l6L80l38K28mJ69m99J27J63j18j39L57k64
5377a27J28j45K57r2j3l08L92m9K64m75J73P3J40l61J20Q1J8j92r8K86k3L6k39
5400a54K2M4P4J87k65R0J8N2qp8J93L9l39L35j88K58l23K33l31J41r1r0J71k22
$$ y = [-184, 265, 194, -54, 41, 126, 95, -51, -326, 13, 55, 174, -262, 169, -441, -22, -210, -125, 31, -326, -83, -25, -83, -94, -152, 153, -72, 90, 124, 223, 62, 84, -88, 108, 42, 286, 154, 60, 196, 177, -90, 50, 208, -258, -57, 75, 197, 83, 111, -143, -89, 63, -283, -94, 260, 325, 111, -152, -67, 35, 131, -107, -52, 82, 115, -57, 322, 140, 109, -97, 61, -156, 149, 239, -21, 21, -19, 135, 150, 173, -216, -16, -119, -144, -4, -101, -65, 210, 124, -244, -105, -7, 70, -52, 219, 59, 137, 26, 3, -168, -24, -156, 38, 38, -89, 71, -53, -39, -68, 146, 68, 97, -65, 47, -25, 158, -46, 73, -56, -45, 35, -10, -26, -200, -103, 0, -153, -189, 191, -147, 81, 77, 246, -253, -126, 37, -81, -220, 137, -127, 1, -144, 113, 21, 8, -300, 92, 43, 307, -168, 5, 78, 218, -143, -23, 58, 76, -116, -214, 72, 49, 85, -154, -132, -88, -14, 173, -92, -2, 16, 68, 60, -18, 175, 214, -125, 210, 22, 280, -43, 190, -141, 0, -91, -181, -10, -232]
5424b32L42p3L64m30l5L62m89O8J4K6J43M2N7k15m5q4J94q2J78k45M0j58K24j73
5448b07J48K33o6j79L7J63j96lM3J17j05N6o9N8k81J46J65k17J46J05j3p4J90
5471A97n53L85j78K60l33K51j79K75K9k3O8n05M79j13k01J14m8N9J55j39K17k85
5493f8J21R8j32j33K98j60Q4m8K09l36K11l05J33k86M08J18k93J6kJ68r9o7J40
5516G5k07l5%J83j38K10O5k54K70k67j13J82m3P3j62J03L6P3j97k30M86J55l81
5539a16k6O5r2J51J4J80r0o9r2k60L07j43J43J97k54J05N9K3o6j47J28J08l15
5562a90K22k22K02n2J2q5M00j37l0n6j65R2J72k35L02l2n7p4j04q6K35r1Q7l63
5586b55J80K64l73K82j42J43j77M7K54m9k38N4j01K02k10%K40m8rk4j44J60J5
$$ y = [-232, 110, 37, 401, -29, -64, 298, -191, -123, -109, -83, 60, 102, 159, -56, -101, -185, 9, -73, 105, -140, -100, -258, -34, -207, -59, 174, 108, -71, -34, 129, -67, -70, -27, 90, -15, 41, -28, 30, -251, -105, 60, -157, -11, 94, 81, 7, 197, -356, 29, -149, 111, -222, 29, -150, 125, 154, 131, 199, -306, 173, 60, -141, -27, -75, -16, 139, 0, 217, -68, 53, 151, 19, -114, 184, 24, 108, 60, 269, -67, 144, -161, -28, -314, 94, 212, -81, -65, -67, 101, 2, -65, 75, -132, -167, -167, 16, -122, 88, 153, -101, 169, -98, -211, -29, -72, 1, -161, -58, -22, 51, -146, -376, 110, 265, -116, -142, -77, -169, -18, -4, 176, 86, 17, -75, -335, -28, -171, -28, 169, -85, 20, 79, 102, 36, -111, 17, 125, -190, 32, -190, 12, -40, -28, -113, 287, 150, 120, 64, -101, -9, 163, -72, 230, 198, 141, 67, -37, -123, 112, 21, 108, -255, -75, 189, -184, 98, -44, 99, -78, -31, 223, 174, -64, -10, -111, 91, -119, -119, 121, 73, 64, 40, -104, 56, 71]
5609G1Q9k90L90m18K99j5j95L89j37j6k05l48M68j50j55M10k79k26N45m05O0l9
5631a57j20l4P1J71R7k1j0N9m9J13k13J41O8k32M6J95m1k4j57L36k05K79k27j39
5655e3j05L71k38J10J45J46o45p9K67J50k22QM7j64L78k85L19j6r9r7Lj08L01
5678A34k31K34j28p0K3K41l78K14j02J45o2J00j08K25n15J05L40j52r4J31J66
5699B18l23M1j40J20M8j15P3J54n6J05l82k7Q8K82J41m49K34j48Q3M8k15L62k04
5722f2N3K2j56L19j10m3J4j78L45l71K02M1k31J83l8j9m9m4J26Q3L6r2K9p2K80
5747B68k38J56j25r5j27r2J43K70l05K31q3o8QL0N4rm9K7N5K20k39r5n8K68k85
5772a38K85q6qm9Q6j65K54m6J15p7N1j7P7k45K35k07j97L30O2Ll65J11m4k8j67
$$ y = [71, 160, -130, 260, -158, 141, 126, -69, 320, 183, 167, -38, -386, 82, -68, -223, 187, -92, -318, 227, -178, -118, -157, -277, -311, -240, -69, 28, 7, -3, 56, 7, 120, -93, 48, 116, -116, -70, 125, 84, 60, -97, 239, 34, 313, 86, -53, -158, 213, -25, 85, 230, 376, -269, -348, -81, 69, -153, -145, -98, -262, 116, -169, 150, 134, 35, -62, -59, -167, 134, -97, 137, 9, -61, -38, 203, -175, 39, -63, 82, 20, 120, 12, 237, -278, -173, 167, 15, -79, 52, 218, -105, -64, -204, -84, -36, -151, -78, 76, 20, 125, -257, -284, -196, 86, 227, -222, 12, -136, -53, -5, -220, 142, -62, -9, 13, -143, 176, 66, 23, 37, -141, 204, -167, 35, 76, -155, 28, -10, -29, -78, -122, 4, 87, 123, 31, 60, -12, 268, 30, 186, 61, -34, -161, -253, -110, 160, -145, 86, 3, -65, -57, -27, 27, 18, -31, -4, 51, 271, 32, -63, -121, 147, -138, 147, 61, 53, 4, 90, -75, 179, 133, 248, 171, 222, 205, 282, 37, 272, 65, -132, 198, 260, 263, -102, 9, -35, -63, -230]
5797b30J44J79L7l90R3K00KN7O1J0l19j63N24j29k03L26k55J59L5O3j69J05L1
5820A68n6j57k28N36l56J52k77K26o2ML50k10k20J53p0m6J67J39l34L37k3j53
5842D0K7k12MJ32O1Q7l29M01k73J12k48N00j3l66KN3J94k47K91n1p3r4M8R5j56
5867a5o6J66N2l48%L24JL82p23J75J94r3j94L3J13j20J42J1K74k44k65J09MJ10
5891B2j99o0R5K90k23K24l53J45o9j42L96K0J45l66J1K91K3k67K42l71j40L12
5913B6n8j40L55M2k79K12l54K42k04J78m3L0J20J11l75j2Q7J31j40q3K87Q6l30
5936a11J77p9K07QJ2m75K75m4r1o4O8L99p2j98j62r9M1P9J53K00k43K09J9J06
5960C15n31j1J51J18P7J20o91N02j32r2L50j05o7l0R9m6j6j69pj8K37k00K65p2
$$ y = [-230, -86, 93, 130, -260, -167, 33, 35, 92, 153, 163, -156, -319, 205, 76, -127, 199, -56, 103, 138, 201, 32, 137, 168, 112, -45, -273, 263, -93, 59, -218, 8, -54, -50, 300, 90, -130, 23, -47, -93, 74, 213, -121, 216, 193, 40, 67, -145, -141, -9, 52, 139, -190, 211, -62, 50, -198, 302, 289, -77, -75, -22, 172, -75, 216, 165, 92, -2, 46, 141, -15, -81, 85, 137, -211, -211, 113, 114, 496, -227, -52, 142, 49, -145, -112, 1, -119, 23, 34, 308, 64, -201, -92, -88, 22, -177, -237, -142, 148, -75, 149, -204, -59, -128, -270, 126, 146, 291, -75, -64, 227, 250, -17, 225, -146, -286, 26, -32, -172, 183, 225, -54, 158, -196, 46, -158, 20, -23, 7, 127, 238, -137, -149, -62, 69, -71, -154, 133, 219, -111, 66, -13, 194, 202, 214, -261, 14, -30, -121, -185, -117, 282, 210, 12, -150, -249, -208, -129, 24, 224, -19, 190, 209, 315, -216, -227, -76, 42, 119, 239, -452, 50, -82, -174, 176, 71, 4, -26, 73, 27, 11, -158, -165, -183, 54, -146, 119, 47]
5984D7j29r9Q4j27K19K20l48M5J15O2q4o9J79j88K44l56Q6J20R5J79m71K12j38
6007a02J26k10J51m6J98j45m3L19j81k66K19J33k48J07m9k1J47r8j12J83J94q3
6029A73r5l1o8q3R1M3j01J59L1r6J53q4j80N3J11j0JJ7nj13J69L22n44p3R7j45
6055b08J13o9J78k23K59j69M94l58L29j86k10K09j94J4j80K39k7j32K50j91Q5
6076B3q3N9pk43P5M1L12k67P1J84k88K33k65K43pJ31l14J68j75L60k67J0o5L4
6100c7j9P3k36J03L22m40L51jRl14J64J21K5Qj47L4n0K14r1L0j4j44j89P4L63
6125B09j67o4Rj69L25p1j03M5O6j91K09J22j74K66l45O5m15J04L40j42K33j13
6147C9k52K82j28P3J64J37l28L86l41P5m40L95k38K41j84q4L39j76R6o1Q8k31
$$ y = [47, -82, -181, -97, -224, -5, 215, -133, -88, 27, 89, 5, -64, 115, -73, 171, -185, -99, 21, 116, 295, -176, 36, -102, 24, -186, -35, -81, 117, -28, -71, 248, 67, -199, 20, 153, -95, 12, -37, -58, 89, -9, -121, 62, 256, 173, 78, 47, -21, -104, -13, 30, -71, 88, 119, 23, 176, 92, -88, -35, 76, 66, 67, 84, 79, -34, 135, 457, -87, -160, -63, -208, -95, -164, 14, -209, 50, -119, 375, 17, 346, 160, -50, 159, -35, -21, -201, 38, 11, -121, 129, -62, 23, -60, -1, -8, -251, -176, -135, 177, -90, -19, 165, -123, 110, -155, 88, 81, 212, -102, 66, -109, 251, -16, -6, -71, -37, -56, 17, -219, -116, 206, -234, 117, 116, 125, -189, -25, 96, 121, 129, -18, 16, -34, 180, 89, 119, 105, -39, -228, -154, 209, 42, -22, -13, -182, 143, 72, -31, 14, 80, -111, 98, 220, 46, 312, -33, 32, -383, -279, 61, -81, 152, 39, -213, 69, -59, 14, 178, 315, -13, 373, 32, 107, -333, 62, -176, 65, -119, -203, 136, -40, 56, -5, 83, -148]
6169a48J20k6N3MJ2j1k21K28J75Kj61j73K10j2k62K22J41l54J73K0M0j88J01J80
6193A25n9j25J30j60J03j76k21L79J8J33j8j39j16M0N04q06M56J40k54J89j58
6214a5J36q8j51L80n74L29J57l44p3L41j97K93k56K13q0J9o5l5q6k13L25p9Q4
6237B1p4j6J00j50O4K70l61J79J02m5k65n5J75o6J94j04N7J13j00P8l3o1j29R4
6261a2J37l00L23m93L37o0l7P5k76J28j2J97j06L2K2mR0m7R2n4j63k3L58j57n7
6286a0J87j84j38K73N2m1J79j29j48k0J6J13l18J96k15K41j96n4J07j76J52j5
6308a28J78Q0k36k16J74o9J48k1n2R3oJ83K8j59o8K71j26L9k99Q4J66Q5k05pJ10
6333D7J07j05Qj9r4k8r0Q1J26k78L80k06J03J38j99j65M09j17Q3J32l67j01J74
$$ y = [-148, -28, -54, -1, 3, 15, 4, -217, 11, 186, 188, 27, -146, 64, 52, -210, 12, 153, -201, -28, -8, 32, -156, -55, 125, 66, -59, 71, -89, 14, -162, -383, -4, 14, 147, 129, -10, -126, -86, 418, -388, 68, 208, -46, 143, -15, 121, 33, -118, 262, -312, 17, 174, -170, -243, 98, -99, 194, -62, 151, 71, 90, 25, -10, -96, -309, 16, -63, 21, -53, -69, 31, -119, -55, 215, -146, 33, 135, 90, -175, -230, -55, -121, 73, -31, 26, 139, 39, 117, 84, 23, -106, -12, 125, -175, 148, -345, -8, -68, -105, -30, -306, -178, -190, 7, -99, -67, -45, -49, 41, -6, 86, 32, -131, -154, 204, 47, -10, 177, -7, -145, 128, 180, 139, 318, 189, 41, 21, 37, 150, -168, 28, -187, 54, -142, -196, -89, -265, -113, -128, 50, 130, -106, -322, -148, -217, -69, -90, -142, -49, -55, 128, 156, -3, -71, 200, 74, 113, -186, -102, 64, 149, -56, -63, 47, 154, 49, 57, 38, -56, -84, -174, -93, 33, -245, 135, -71, 32, 170, -29, -194, 215, 98, 181, 313, -54, -155, 19]
6356A9m7q0n1J62l4J53k64j33L24N9j89K8k6K65J1j22o2r9j2M35k05l55j6J71
6380f8J89j27j12L77m04J71RJ43r3P5k16j42L44k27J03m7R4j61K66j74k4p9j83
6403b86M13j27J28k45J68j36J11l9Q0j00k45p9K52J28K3J12j51J53l32Q8M3J4
6425b7P2J11k01K18j47k15R0N7J88j63J21k12J64l01K09K3j28K24Op0j12J48P8
6448A33k57J77L37m56j26p2L06o2J25j10o3M8q6L72l68K52Pj06k19k14K45N21
6470C84n28o8K61p2K41K50m37L11l90q2l06K67K31k01J70LJ56l19J09j37P9R8
6492B0k17J80K36l54P9K9J94l48nK69j75j78J89J70l1K17k69j09N7J27j6j25L4
6515b6Q2j40kJ75j7P9n2m1j77o6J70J36K8j80R4K63m71J96or4O1J41k28J5q4J93
$$ y = [19, -28, -108, -159, 3, -31, 122, -142, -275, 49, 108, -81, -53, -79, 186, 197, 75, 13, -86, -98, 337, 132, -223, -239, -68, 121, -6, -118, 259, -145, 26, 35, 178, 85, 160, -56, -198, 146, -81, 22, -25, 69, -92, 174, 0, -24, -103, -286, 127, 0, 128, -117, 51, -85, 26, -13, 67, -33, -278, -357, -105, 23, 46, 158, 7, 160, -172, -84, -41, -27, 45, 156, -45, 173, 26, -189, -99, -42, 146, -17, 104, -108, 56, -245, -36, -13, -141, 83, 89, 19, -93, 55, 133, -124, 53, 390, -66, -192, -264, 42, -20, 105, -5, -68, -20, -106, 266, -102, 150, 157, 51, -168, -382, -137, 384, -144, -212, 49, -23, 218, 468, 31, 342, -48, -130, -436, -169, 62, -139, 31, 34, 190, -129, -20, -157, -78, 20, -197, -17, 219, -135, -56, -27, 167, -181, -186, 83, -92, -270, -81, 89, 58, 275, 6, -103, -46, 81, 65, -60, -26, 56, -84, -86, 89, 72, 151, 99, 58, -119, -185, -15, 121, 149, -31, 63, 326, -145, 51, 45, -49, 12, 153, -75, -60, -144, 49]
6541D9K34n22L94r2J31m45J96k49L89k29K15k51K63J00k38k7j3RK0O4k17J33K0
6564f6K27k36l2O1m5k6L72m54K38j37j19J68k64J37RJ42k1M8j69J55j78J84j38
6587a44J36J14p2j2j03M2n5j6J2J57m0K21k36k3J23k8j86j28J0M33k04k50L73
6610A24l0k4k26L62l61K10k28K74l24J93K48k13K25l13K17j63j49K15J3M2j80
6631h8Or7R6j17K39M9o2k8N0l08K70j93J94p2K71j84j81J12q2J78j36R2p5K44
6655A78m8k9o5j50M12j06l05O5k15P0K49nQ3k79J82J71m23J71K02m8j71n8K43
6678A24J3r6k63J09K13L3R7n2j78K3J50k72N4L2J02l72M83j13p2R1k60O9j31K50
6702C4O8p2J25l51O7K23j30L1j02K69k63L20j78j9K41j94r5J1r2J30r0o6J71j09
$$ y = [49, 283, -239, 155, 63, 194, -251, -55, -304, 85, -144, 71, -180, 83, 183, -55, -82, -95, -86, -66, -2, -219, -86, -66, 161, -75, -107, -46, -91, -117, 255, -199, 39, -98, -217, -49, -313, -176, -167, -25, -46, 2, -167, -12, -190, -6, -144, -8, 106, 34, 22, -81, -39, -94, -110, -98, 59, 19, 240, 4, -19, 104, 76, -110, -238, -228, 205, 1, -249, 124, 94, 70, -156, 206, -155, 55, -173, 101, -223, -30, 218, 5, 230, -83, 134, -29, -178, 37, 50, 92, -88, -82, -179, -83, -200, 39, 88, 26, -2, 48, -260, 10, -183, 11, -61, 210, 26, -155, -43, -125, 53, -83, 9, -66, 178, 130, 101, 36, -114, 298, 192, -113, -48, -263, -193, 56, 51, 134, -145, 37, 208, -215, -44, 158, 110, -61, -119, 124, 137, 41, -222, -113, 100, 133, 230, 178, 0, 23, 173, -99, -45, -13, 89, -283, 200, 87, 15, 106, -154, -85, -216, 34, 102, 30, 155, -196, -129, 94, -36, -5, -107, 162, -101, 219, 41, 22, 263, 69, -26, -15, -107, 23, -67, -133, 38, -71]
6726g1J91j55L18l19K32l66q0M95j49J71l26J47j76PJ68r6j64K1Q2m9K7K48j95
6749c9J8K5r2N8k68M09j90J42k86N7j01L11O6k99L92m23M76l65J80N2j62k5J20
6772E6p1j00J87j05O1j57J95o8R1j0p5J13r1k0J38l80K25j22l7J52K43k51K12
6795A86j97J06k2k59K62J30k01k86K77n1J42l47L59J09k47J73j48j94M03l22j03
6816b30M21j71J46j52q2k46L16l43K88k6k8J19q1j46K4J66q8O1j09J30NP7oO6
6840A11J12j38j86L45n20K18K85j93J0k00L81k4j12l73K24j44L07q3J38K53k01
6861B10j15j52m55M36J82j92Q6M9K7J5n4o8J71k49L2J0O3j96p9K57q2L18j81l3
6885@L6M6j82L08j83k01l6M15M1j03o7k78M45k14l53L16J72l3ll5J33l3j37k21
$$ y = [-71, 120, -35, 283, -36, 196, -170, -250, 245, 96, 267, -59, 88, -88, -81, 87, -9, -173, -152, -70, -119, -92, 156, -39, -21, 4, -88, -30, -298, 111, -79, 63, -223, -166, -267, 44, 110, -189, 203, -220, 256, -109, 71, 123, -39, -64, 56, -15, -115, 72, -33, 28, -129, 66, -2, 89, 79, 4, 117, 26, 6, 144, -236, -11, -133, -170, -18, 225, -26, 186, -11, 95, 73, -186, 76, 206, 5, -281, -4, -55, 87, -260, 99, 208, -39, 134, -14, -208, 195, -127, -230, 191, 20, 166, 14, -68, -314, 2, -341, -53, -79, -107, 12, -69, -215, -191, -25, -113, -52, -161, -31, -26, 51, 45, 111, 223, 85, -101, 244, -276, -58, 227, 34, 44, -156, 225, 201, 89, -284, -60, -204, 103, 20, 158, 411, 210, 95, -57, -512, -76, 106, -86, 0, 49, 76, 91, 37, -31, 140, -109, -77, -67, -4, -200, -279, -22, -104, 214, 33, 0, 36, 82, -100, 208, 25, -176, -212, 203, 244, 141, 74, -204, 241, 27, -326, -10, 162, 129, 126, 91, 224, 191, 54, -167]
6909a67Q7P0m1J78j76j15K72l44L85j33K1j20j24N6L10r9k3k79J86m6O9J07j83
6932a09J38k5N2N9J40l53p0K2q5L2L10k41J69j03N5r8K40o5k23J79J35k32K35
6955A62l6j68P7p9J12M6j85J55j75Q4L31k80k11K47k83L50k16K55j84Q0k7l73
6977c18K34K63l9J57k32k12O7j6JJ41R9K52k38j13M2J08r1j22J19r0J12J26j93
7000E7k93J17N2K91l98J52j03K59l12J00J2L4J92r3J73k41j48K26j12J14Mk77
7022a94K21k20L65j54M0K2o1r3J03j00j86N38n6k71j13R6j5J21j41J91r5R2k37
7045a47J19K35L3k21j53j06K32J79o0o8k12L07j12J67%j01J0n3J5J26j24lj92
7068a29j63M13P1p0j07j18Q9J09k50J80K84j18j34k43L41J3j32j38K81j68l25
$$ y = [-167, -80, -10, -51, 127, -49, -164, 108, -236, 149, 16, 37, -83, -207, -151, 159, 60, 37, -242, -56, -102, -33, 74, -109, 29, 4, 56, 115, 255, -98, -168, -146, -231, -199, 111, -130, 39, -64, -9, -107, 133, 68, -155, 24, 159, -73, 162, 126, -42, 35, -44, 68, 114, -71, 84, -91, -7, 324, 44, -167, 80, -203, 147, -69, 186, 2, 82, 55, -318, -84, 179, 140, 297, 65, -147, -80, -96, -95, 46, 145, 397, 159, 46, 88, 196, 105, -17, 102, 12, 124, 250, 57, -236, -119, -67, 224, -174, -22, -125, 134, -178, -78, -66, -32, 160, 67, 240, -1, -149, 77, -35, 79, 83, -194, 27, -193, 172, 18, 58, 80, 19, -74, 29, -71, -257, 281, 225, -46, -159, -63, -78, 43, -98, 93, -2, 90, -147, -28, 207, 240, 19, -134, -240, -8, 171, 111, 43, -169, 138, 26, 193, 193, 92, 102, 49, 64, 190, 66, 63, -129, -292, 121, 192, 122, 15, -103, -14, 95, -155, 25, 309, 191, 57, -186, 155, 168, 36, -102, 179, 11, -314]
7089c14K08J41J38k04J5%K07k48K47j09j00j8K18j32j32J46r8k4K8J83M0m7R0
7112B35n03J86L51n76L12l3K14NJ02k72Q1J18Ok17j25L8J72k17K84j76K84j30
7134A39j86m0K96j38l45M64j10j74m82M71J97j31l1J58J60l84K23J8j34k8L53
7155B96o00M41k03j4J13k92K81n5L14n19Q0l1M6n3J58K97k19j42Q6J57J5J21k24
7178E3n2k26N37l06O9j05j05J77J72l58K91J3j40o1l10K87NO6k91K50J80P5k60
7201c9Q6l32M13k5k73K06O4K17l53K52l70q5K21pN5l9j80M2Q9K28j08j58K10j92
7225g8J55q7p7K77J71k53l50K4K44J0k20j15m1K24K18j20k8P8j5k7m9m7k47K05
7249a48N1J16L8j52J96r4k17L04n3l36M01j17P7K56m30J68K09k87J66l23L04j19
$$ y = [-314, -106, 35, 173, -31, -16, -16, 191, -57, 190, 81, -19, -37, 181, 49, -83, 63, -35, -59, -31, 152, 192, 145, 235, -268, -82, 269, -307, 5, -28, 186, 191, 293, 21, 102, 220, 226, 9, -116, -78, 94, -123, 161, -15, 269, 139, -47, -87, 209, 71, -274, 190, 80, -94, -576, -105, 92, -39, -70, 88, 248, -136, 87, 105, -29, -57, 296, -304, 137, -66, -80, 33, -259, 22, -33, 281, -238, -158, -189, -143, -196, -38, 259, 40, -102, -16, 141, 156, 277, 53, 1, -225, 312, 6, 75, -30, -135, 42, 214, -144, 147, 160, 20, -41, -351, -64, -59, 7, -284, -34, 146, 221, -39, 47, -285, 128, 103, -170, 36, 100, 317, -36, 216, -154, -239, -18, -25, 30, -9, -189, -147, -58, 170, 62, -96, 114, -78, 77, -10, -87, 190, 361, 108, -242, -218, 26, 36, -184, -299, -340, -116, 102, -18, -46, 32, 17, -10, -59, -106, -353, -148, -97, 19, 57, -95, 101, 7, -210, 94, 41, -295, 106, -11, 66, 322, -108, 60, 269, -18, 148, -175, 129, 10]
7271A0j05q0K27J57m63J78J34j02p2m1j2M5J49r3K08j16r3n0R2n0P9j3O4r8O0
7296A5j37P5L36m64J00P2l8lq6q9M17l25J22K67m90M04p5p1r0L03k58L9k47L89
7320A66N9l9k18O8P3l8J0j49L9J37j14p8k0K22l8j46RN0K36l81K1K16j81r4N2
7345a38k6J92%k34L61L8k79Q5K49j66n3j17J7J77j50N5j41k00P8M57k20j5o9J40
7369D1M4o6j82J04J89q0Jo7K90j63k67LR3K37l0k77K15k13K66q7m1j98K06l5P1
7394E4N0k59L13o3N1j49l29K73L9K43k76J87r7J32n37O52R2m18O7P8q4l1j33K96
7418A51j67r1J46K8j80M02p2k58J07J7j8P2j90k67M20l33L34j18j76L79l22O3
7440g3R1R9j16j04K98j32mk0k1J34m7j36J67l36RK03j08P9r9L48l22J59k51m7
$$ y = [10, -95, -175, 52, 209, -254, -76, 58, -44, -116, -157, -169, -124, 25, -68, 140, 24, -69, -119, -27, -77, 2, -11, 53, -45, 15, -122, -47, 289, -175, -75, -3, -41, -44, -130, -219, 198, -127, -5, 262, -228, 176, 101, 30, -60, 243, -15, 24, -223, 166, 225, 186, -32, 36, 109, 71, 81, -68, -29, 108, -6, -84, -104, 118, 80, -66, -57, -7, 229, -152, -131, 85, -96, -190, -138, -164, 28, 28, -206, 155, 193, -86, -1, 248, 82, 29, -88, -71, 106, -44, 11, -130, -330, -252, 205, -15, -30, -99, 41, 85, 19, -163, -59, 130, 50, 51, -16, 274, 111, -156, -153, -60, 177, 147, -130, 85, -128, 138, 51, 10, -188, 18, -17, 54, 104, -155, 158, 95, 146, -3, -332, -59, -20, 223, -53, 134, 37, 169, -368, 284, 376, -42, 25, 103, 19, -12, -145, 151, -16, -107, 39, 67, -113, 289, 217, -41, 66, 83, 65, 137, -53, -320, 100, -233, 101, -17, -193, 186, -136, -73, 18, 117, 1, -103, 195, 63, 59, 39, 18, 152, 105, -31, 136, -200, -191, 12, -96, -17, -116, 232, -90, 69, -182, -229]
7464b29N7K9J12K09Lk72Q5K05j73j31nK25L9o2Kj91j6J14l5l2o3j13M03j17j0
7489C4Q2m4J33q3j84K3r0J26J09j88k06K80J65m4N6j40P3l3J2j53K26k60K21q2
7513C3o4k4M5Kk78K70M2q6o5K49j84j2K16P8k91J11l0n7P8j0L6k1J73k93O0l7
7539e9K16J54j76J98l54pk05K7L55N1j43q1j28l3J91k96K23J09k11K29o2pJ1n3
7563e1K19k61N6p4j12J86O1j28R5k30K08J98r2j20P0j85M4J68j90J89pq3j37K6
7587a50J22j30M9j52K01K1P7k2J75k52l0J9j01%P7J60N4Q5k92K65k05j51J85l41
7611c36Q7K65J49j70m26M24L25j90j02R9o0j91L2J57k25L62k29L13r6k51K50l56
7633a69J43o1k0r1J9p3Q6J65n0p8O9L10n12K97r9J92kj26k66K96p6K87l44O1J07
$$ y = [-229, -172, -143, -31, 178, 181, -91, -6, 199, 26, -105, -110, 115, 154, 92, 94, -97, -113, 1, -34, -66, -129, -242, 161, 44, 34, 116, 72, 205, 122, -62, -39, -129, -3, 106, -82, -288, -8, 157, 113, 169, 29, 102, 69, 81, -72, 154, -106, 115, 33, -31, -55, -10, -8, -286, -16, 26, -60, -125, 124, -60, -72, 144, 222, -69, 42, 12, -45, 33, 23, 59, 38, 211, -82, -22, -59, 157, 311, 135, 333, -21, -28, -233, -206, 149, 200, 57, -24, -152, -185, 6, -290, -67, 42, -169, 60, -2, -9, 2, -51, 168, -93, -37, -111, -223, -37, 24, -104, -9, -239, -31, 167, 75, -45, 25, -160, -116, 52, -138, 51, 44, -39, -176, -150, -28, -158, -109, -261, -60, -39, 38, 16, 191, -61, -91, -72, -173, -173, -96, 64, 118, 203, -89, 176, -29, -180, 5, -336, -249, 16, 165, -5, -431, -7, 318, 128, 26, 125, 65, -126, -94, 63, -162, 200, -29, 284, 188, -63, 187, -169, -26, -87, -107, -198, -179, -252, -166, -1, -51, -129, -60, 250, -262, 35, -64, 128, 126, 0, -266, 30, -46, 241, -103, -42, 65]
7658F5M4o0P0J19j63oj20K89m38L53k06J82j31K85k62o6L53j32j09M6j45LJ89
7681A60j99J30j36J15j52J30q2J50ok59J84j78J30r1K39P9k44M2q9L38j61j39
7703c9J33j94J37l45L05q0P5O3%o6j32M13l97m1L9P0K4pl0J94m8l0J72q9r2j22
7729h7k6M15l8j22j76l2j99J06Q9J35n3j08J26n9J78j88R7qM1J17k23K21k09J93
7753A90K17m19j07k18L93l32J43L6r0L58l90M58l15K4J63p4l24J47K60o2J54m38
7775b26N17j70k04J24Rk44Q1l9J33p7o3n0R6O7K31j1k65N7J71l23J64J61l0j86
7799g7o4L83R7n06L07kK9o8Q1l51J51R1o4k67M56m70J75J58r9l8J99k30L50L7
7823B78j22k62R9J5J44q1j30J10L5l3n4L2R5l4j67k89M21r6L1k7o7m8o6M08j00
$$ y = [65, 109, 49, 119, 238, 75, 69, -51, 238, -200, 153, -53, 129, -2, 283, 21, -45, 308, 176, 67, 113, -32, -29, 160, -39, 91, -45, 70, -82, 48, -34, 116, 110, -149, 35, -143, -13, -104, 135, 214, -30, 12, -77, 261, 100, -39, 94, -100, 37, -308, -3, -83, -8, 55, 55, -11, -143, 270, -127, -168, -129, -59, -35, -42, -72, 122, 74, 44, 216, 127, 35, -87, -113, 302, 264, 142, -34, -66, -265, -159, -70, 65, 12, -96, 30, -29, 149, -39, 58, 50, 91, 208, -15, 206, -3, 190, 407, -12, -119, -337, 56, -276, -133, -97, -187, 171, -219, 239, -76, -52, 111, 37, -287, -140, 120, 58, 212, -226, 291, 121, -83, 41, 50, -194, -113, -152, -19, -96, -159, -209, -113, -46, 185, 174, -91, -34, 137, -186, -22, 139, 109, -77, -141, 242, 339, -167, 140, 138, 167, 99, 180, -171, -20, 71, 7, -260, 196, -274, -99, 59, -40, -78, 121, -109, 241, 278, 156, -106, -7, 8, 152, 71, -59, 51, 86, 53, -1, 31, 126, 92, -75, -364, 57, -39, -8, -35, -102, -150, -216, 192, 92]
7848I2l07M95k14l22M45l83n0L72j29J09J28k08j5J57j69J64o9l13O50m92K6L9
7870FK01j74k71M34m86N03k19jK77l60K83n8J24k97l9K2N9j91J85j03J63k81M52
7893B29k90M4k14J66l5K15J64l31k47K52R4j85J24Q8j16L48m70nO2O7L93k33j07
7916A3j99J31J67p3j03n5J55P9q3k91K32p8p9J27J33n2j60k3l1J11p0J53l3O0
7940C1M9l7j0n1R1Nk71j32L5L30J12j3J25l67L0l2J26j45J01J11q5j09q2L09k62
7965a41J34OJ20j32j85Q1k2K47Ll53N2L52j08j79J92K38n08K46J25o5l86K80n7
7988f0J59J91j63r5q6K53r0r7P4j06j07N7n9M6o1O2J02J40m81K68L0L5j30K75
8012A57J15k68r0L71r8j00J39l24L79l04MP6l2J9K64l02J4o9j88J01J91j65o5
$$ y = [92, -215, 280, 66, -256, 189, -194, -244, 128, -1, 108, 236, 28, 13, 170, 1, 165, 96, -217, 433, -59, -33, 6, 207, 33, -238, 196, -290, 213, -6, -7, 270, -90, 193, 135, 259, -38, -77, -55, 4, -187, -2, -105, 58, -223, 229, -61, -17, -231, -65, -100, 115, 279, -52, -299, -47, 47, -138, -14, 74, -42, 306, -164, -169, -107, -40, 353, 120, 13, -186, -55, 112, 39, -64, -119, 36, 115, 32, -259, -27, -105, -184, -57, 76, 24, -136, -159, -190, -79, -149, 4, -29, 31, 80, 43, 33, -18, 73, 78, -193, -325, -290, 40, 152, 139, 264, -103, -73, -105, 21, -124, -23, 88, 3, -106, -188, 121, -141, -7, -1, 119, -13, -198, -117, -139, 108, 111, -242, -190, 162, 54, -125, 67, 305, -203, 43, 168, 103, -283, -3, -60, 99, 290, 127, 32, -54, 199, 109, 12, 86, -20, -127, -70, -129, -83, -144, -82, 20, 160, -321, -53, -23, 12, -118, 157, 272, 4, -86, 285, 187, 87, 226, -98, 281, -23, -19, 57, 25, 44, 308, 6, 20, -49, -237, -136, 55, -110, -175]
8035a75J13J3J98j88j15J47l1k19K09J94o5L9l80M29j41j9J98k96L67k45l92K93
8057f6K67k03J53j13%k1j94J32j39K49k46J54K24j66RJ57l5m1k83L7K31l30K57
8080C3j38J53Ll5L8J66j13k53J16L5m4O0m2j8J98j32k99K23p8l1M00k95Q6j2J01
8105A22k09J20o0l5j78j84O28j58r0n6K64k40K31l40L66m5k79J9k34M31n1j19
8127i7q2J93nk23K60j43r7K01j28L00j51m1p5M7J35m3N1k78K05J18l97N4L36J8
8151A58l00J82K5R2o3k10L7K3p2J22K25k62R5R8l7O0q1l55L9L24j56j99N08l36
8175h3L0K6P7J47j03k58q7M69m33L01o1k48J34m9O9K7
$$ y = [-175, -62, -49, 149, -39, -154, -7, -38, -257, -48, 146, 81, 120, -260, 169, 28, 9, 207, -89, 278, 33, -359, -66, 201, -2, 151, 38, 38, 17, -177, -45, -184, 65, -181, -27, 197, 31, 40, 197, 162, 121, -162, -125, 106, -224, 33, -105, 48, 51, 16, 54, 220, 107, -146, -30, 5, -39, 21, -21, -39, 159, 27, -272, -49, -127, -158, 242, -53, 33, 21, 122, -87, 33, -27, -62, -240, -424, 204, 46, -44, -100, 164, -76, 155, -185, 181, 136, -143, -124, -358, 73, 22, -97, -179, 14, 9, -214, 46, -97, -194, 7, -121, 179, 28, -13, -88, -41, 94, 51, 102, -176, 29, 147, -250, -196, 140, 158, -142, 40, 65, 157, 94, -116, -79, -56, -128, -6, 219, -43, 52, 150, 113, 173, 92, -263, -224, 100, -56, -255, 253, -83, -53, -27, 50, 197, 94, -164, -251, 218, -215, 86, 25, -223, -89, -138, -69, -42]
8191d2
$$ Imaginary data points
##PAGE= N=2
##DATA TABLE= (X++(I..I)), XYDATA
0@%%%%%%%%%%%%Qj6J6j6K4l2L2m0N6o4P2q8J04j20J41j65J90k17K49k86L23l65
34a94M13m66N25n88O57p35Q19r10J011j122J242j372J514j669J840k029K235k463
52a292K713k991L305l655M052m507N033n650O384p275Q388r821J1738j4464J8679
67A0637k6114M3147j59145l1340J90351r0207n4879L2739P5200N1163Q3738l1535
79I3755q6361M1977J44716k3831j37210l7663N8640n660m2052m2376n9975k9430
91a25470O6325L4711p4066m4767Q0245O9419j1098n833L1127J4020K1585M0752
103I6950n683m6758M521L0823k7160n1259l464j280l6495j9336J3685o161j7490
116f9107R782J6471K968K1259L1014m366j3156L1609M0880r623l1362q87J6372
$$ y = [0, 0, 0, 0, 0, 0, 0, 0, 0, 0, 0, 0, 0, 8, -8, 8, -8, 16, -16, 16, -24, 32, -32, 40, -48, 56, -64, 77, -88, 102, -115, 134, -152, 171, -194, 219, -247, 278, -310, 347, -388, 431, -479, 532, -590, 652, -720, 794, -875, 965, -1064, 1171, -1292, 1421, -1570, 1735, -1920, 2132, -2375, 2658, -2992, 3392, -3883, 4505, -5316, 6422, -8042, 10637, -15477, 27670, -131475, -162815, 27536, -62671, -117550, -84811, -9611, 41552, 125290, 93755, 7394, 49371, 194087, 170256, 33046, -4617, 54023, 48363, 6311, -36065, -96040, -125470, -59145, -24434, -98500, -143267, -63022, 6397, -4701, -10534, 20593, 34613, 56198, 96950, 91267, 44509, 49030, 79853, 52693, 1434, -2030, -3310, -39805, -59141, -45456, -51617, -69107, -59325, -42854, -39886, -18627, 12387, 8021, -5135, 26474, 67354, 57731, 26369, 25482, 41854]
129D1854M735j2300k9856l3185L834L2476n237m9254k1417L4137L2928n610k3504
142c0399p283K3287L9793J3423l1093k2867K9048M0386p806l9933j7696J6644
154E504K0857l845l1281k6798J1868L2338O34l3920j7274K2901K7520k25j8227
167i948j0118J2076K4463P709j8765j6027J3399K1415l034j9135p494P286Q319
180A0146K0j0981j1418K667J2009q1j2102m630P513M876j311j155N70Q26L275
195B24L094j388k26M113J509l528L06M875m97o151j964K532K54k880m129m189
211h045P81N603J1q016l614P585P969j489m496pN749P156J703o627n049N927P282
228A2423k832r962m250L497M297k112p328n315L317P351k38o651k108O261P342
$$ y = [41854, 46589, 34289, 4433, -28752, -24918, 7558, 2321, -46933, -68350, -34213, -1285, -6895, -30399, -37682, -14395, 25398, 38821, 7728, -15139, 13909, 54295, 46489, 6556, -11140, 5504, 26361, 22516, -8765, -35563, -23695, 8643, 9277, -24643, -41917, -19016, 8504, 8279, -9948, -20066, -7990, 16473, 24182, 5417, -10610, 2789, 24204, 21170, 2035, -5459, 1827, 10146, 10166, -815, -12233, -9566, 2443, 2362, -9740, -14370, -6857, -1981, -3292, -4447, -3877, -3051, 224, 3318, 1930, 1704, 5817, 7326, 3798, 4104, 8979, 8482, 2331, 367, 2899, 3153, 273, -3856, -8045, -7264, -1661, -1650, -9666, -13280, -5695, 2274, 785, -3711, -3718, 2031, 9187, 10890, 4263, -786, 5141, 12423, 9591, -371, -4621, -1124, 3173, 1061, -6267, -11582, -8265, -914, -1152, -7803, -9911, -3650, 3692]
243C692K49l800j253M281N859P60n772l822L060L803k306n976k987Q93K215o30
259a734l624k497K098M057M24k164M12K993K841J041j089n91R44J707J37k573
275B382j470K17L65j167k108j283K65J32j60p10J71R44J133K33P10P72J006O11
293B043P17j63m1L74q88l16p28m59n32j108n02r75R1L31j89p0N39N87P67M78Q50
314H06L41N38O71j98Rk16n1m15o14p90m29o99m57j81m81m23L60Q46j88M73O30
335d68Q09R34L07K21K94j42L50m86n25m23k76o46j024l88l34m11oJ30j81N57O61
356a047P40K89N96Q08L70n8O30j50j93j77k30q73l25m45q32o83j25J44m89k68
376b318J96J57Q08P11K45L31P62P69O00n5pJ40n0n19p88o75m16l77n01p88o54
$$ y = [3692, 3941, 141, -1112, 3169, 9028, 9788, 4016, 194, 3254, 7057, 4751, -1225, -4212, -3319, -1104, -1734, -5358, -7855, -5757, -1700, -1276, -3440, -3028, -35, 2806, 3847, 2758, 2167, 3111, 4818, 4955, 2382, 912, 1129, 1494, 327, -1781, -3064, -2799, -2667, -2827, -3537, -3366, -2422, -1289, -1056, -346, 426, 1432, 2043, 2760, 2597, 2556, 2930, 2042, 1726, 998, 539, 7, -1101, -1603, -2578, -2487, -2156, -2345, -2415, -1876, -1289, -522, -44, 806, 1147, 1685, 2356, 2158, 2167, 1951, 1900, 1485, 871, 81, -348, -1047, -1504, -1685, -2166, -2589, -2229, -1383, -1571, -1098, -468, 341, 1275, 1582, 1803, 2097, 1955, 2305, 1819, 1294, 871, 595, -51, -1075, -1463, -1797, -2208, -2214, -2084, -2265, -1708, -1047, -307, -18, 578, 1386, 1756, 1698, 2328, 2178, 1985, 1808, 1578, 705, 380, -65, -897, -1580, -1705, -1561, -2050, -2318, -2122, -1965, -1157, -446, -201, 130, 892, 1661, 2261, 2206, 2199, 2339, 2289, 1770, 982, 307, -109, -486, -987, -1775, -2429]
397b429J48J84p5N5P33J17Q95P55K66J91J050O77j45q2k34m06j98l76n44j019
417d37o52r1n80m03k39k05O4L75P77K90N38R54O45O50Q08K74k83o5j1j9n78j454
439C58o32j72l21j057r46n64M22P37Q5m58M15J739J110Q81n28L09J313R09n90
458C010j086k89J62j7p70k273j314R16M43j112j450K96J086J613J98o63J91J781
476G22K108L14j411l60J150P51p15j951q65J38N34q79j868p47P54P65k67m85K88
495b024J093J645J75k89N7N54J306j53o96j10k74j82o09p10n33m68r6l11L4r4
515a685L39L4M81L82N77M54m6J25L75Q21m29n67k54K89K38r76r21p0L01O41m55
536c46j209k94J201J161o08q02J5J455O50l64j162k46J280P71m57j542l16J161
$$ y = [-2429, -2281, -2097, -2172, -2117, -1384, -1267, -372, 383, 649, 840, 1890, 2567, 2422, 2340, 2106, 1700, 1502, 1126, 582, -437, -1089, -1180, -1760, -2163, -2402, -2607, -2543, -2168, -1391, -1101, -563, 391, 1036, 1686, 2494, 2768, 2485, 2420, 2409, 2390, 1812, 358, -274, -446, -767, -1824, -2770, -3334, -2912, -2175, -2090, -2548, -2133, -394, 716, 1597, 1069, 1378, 2691, 3600, 3010, 1924, 1635, 1797, 1780, 1010, -1263, -2577, -1661, -1218, -2330, -3780, -3484, -2398, -785, -587, -1250, -1059, 722, 2830, 3144, 1733, 1373, 2523, 3274, 2559, 608, -257, -119, 415, -464, -2332, -3079, -2325, -1560, -1827, -2312, -2024, -931, 714, 889, 600, 657, 1211, 2517, 2364, 1668, 1558, 1284, 1102, 493, -217, -750, -1218, -1314, -1625, -1591, -1685, -1346, -1312, -831, -449, 128, 582, 536, 661, 1036, 1857, 1428, 861, 607, 896, 1134, 158, -763, -833, -532, 109, -346, -1555, -1849, -648, 513, -95, -897, -882, 573, 1223, 859, -303, -549, 731, 1502, 1045, -497, -813, 348]
554C48P32o85j256j62Q02J036j44j220p60J456O73n07q61n58R60R52k96j229k90
573a009J083M54k40o61k68P74R68n8j047J18O09P8l50o52j11J89LL7q38K63j88
594h46L13j65J99L75J9L52o0L04M38j20j92O9k9L22l22q77k17K48R1p78o24P8
616a422O86M51j92l18k01J124Q71q4r02LJ169K55l43o13o14N92L45p55r32o87
636a567R51Q6l42n22j85Q52P35J01n76J14J236L90j0r49K87N25K39q92o87j03
656c17l2N81o57m62k24J3P24k74k95N75M61K46L73n23K15K73M04k38n31k5O5p
678C45m33k97j75J10m9m05O0L26J2O1m6M98K70J24l2O1L63k67M56q57K48o5Jj1
702B98p59J91l06M63m14k15n8M12M21k01j39J96N12K35j04k79p8K80L29k67k72
$$ y = [348, 1080, 395, -861, -1023, -221, 815, 671, -549, -1309, 147, 820, 313, -548, -1106, -146, 806, 510, -719, -1009, 74, 528, 288, -373, -641, 133, 1101, 1043, -4, 114, 723, 801, 451, -201, -312, -123, -120, -83, -921, -658, -846, -533, -698, -499, -124, -105, 247, 187, 491, 929, 809, 617, 686, 657, 979, 657, -220, -437, -189, -98, -876, -1500, -1422, -736, -285, -477, -795, -996, 128, 999, 915, 13, 16, 1185, 1440, 1097, 484, -130, 462, 807, 52, -880, -1567, -616, -530, -872, -1394, -1579, -727, 8, 109, -467, -353, 883, 1273, 1263, 314, 601, 1126, 1365, 473, -214, -317, -349, 232, -425, -887, -1111, -1098, -374, -648, -943, -368, 93, 339, 712, 189, 404, 677, 1081, 843, 312, 287, 352, 345, -88, -385, -560, -450, -499, -904, -844, -518, -506, -445, -491, 7, 277, 401, 369, 430, 793, 526, 982, 125, 373, 308, 309, 298, -461, -270, -576, -113, -527, -742, -800, -388, 33, -168, -307, -111, 401, 636, 532, 253, 175, 455, 784, 517, 245]
723B45k83P7q8k13k50k08N0N95k91K4K2J65N39l62r8J50L23J10o9m21K72O6Q2
746D37l97j87m7q2J53m19l2oM75j15K08l20J98L47K43p1l78l5L40m5K15k72k13
769cL6m3r0J59m79J15J42k08l7K0L92qL7J00J0K29k07j5M9M6j92R3k16J30o4r
795a3Q5k49p0J8L32l13J59K8J49l1K30k83J35N3k30KP7oK50l35j78K44k08K01
819D7k17j31K27J23j58J87k80J45j6L61K50l84r8K02p2j85J0n0j4o8K4k90K77
842a10k57K38Qk39M69q7J87j1l1K43l14kL38l43j16J86k82p2L96j18j90K3J13
865B9j94R2R1N9Q1Jj34M7lR8Q5K9m47M6j51L87J0j51J02k10L44l10j16J39j37
890b13J49j12J49O9K03k51j27k7J91l25N32l16K48q1N4n4j65K10l15O7O0J65q6
$$ y = [245, -38, 39, -49, -262, -512, -720, -670, -75, -366, -342, -320, -155, 384, 22, -76, 74, 397, 507, 438, 17, 289, 355, 437, 40, -147, -194, -276, -123, -542, -574, -580, -105, -220, -12, -332, -134, 213, 456, 385, 7, -28, 312, 267, 482, 210, -3, 33, -10, -100, 59, -420, -305, -163, -371, -408, -388, 4, -4, 33, 133, 143, 372, 165, 150, 199, 245, 53, 146, -70, 60, -4, -13, 72, -177, -247, -229, 103, -210, -51, -23, 126, 95, 325, 42, 177, 230, 0, 2, 79, 73, 323, -12, -190, 54, -154, 47, -170, -301, -74, 49, -109, 78, -202, -57, -73, 288, 538, 154, 56, 258, 186, 1, 11, -39, -53, -121, -97, -387, -110, -367, -129, -121, -360, 109, 22, 209, 198, 167, 410, 96, 94, 432, 89, -27, 159, -123, -195, 201, 83, -107, -84, 29, -165, -73, 18, 77, 158, 159, 25, 72, 69, 167, 252, 281, -166, -120, -271, 116, 126, -25, 77, -133, 211, -99, -215, -76, -213, -64, -176, -27, 42, 245, -6, -133, -160, 31, -294, 238, -78, 170, 89, 143, 89, -76, 134, -181, -114, -54, 111, 25]
913B5M5J66k46L9j07o8p1K88L7j54o2R6M8M2K74k07r3n2K23j32j70J88n9Q2l05
938a73j31J69J21m5r4K42P5j35O8o8k80K90K5n7K04J2o7o4j16K98l03l9j82Q3
962a67J39j99J50k0j28K48j16M11m00p2L62j89J07l2ok2J4m3J03j18J47k39K07
985A37o0j4k89L00j57qQ7p5J31J20k86KP4J94K9J02Rj32k17K6N0j12M33l41m13
1010d10L32K29l81K87J19k55K7Q4Nq7J29L27j07Nj69j19K01q8l2k07L1P8j76J89
1034A2k01J18j55L14k25J86J81j58Q0k18Q3J08N7R9k09J01k06k7J70nl44Q3J61
1057EJ18M3k63rJJ86J84l43J02L09l03M9J72k14Oo4J09p7J27j36l14J79J53K9
1081D9k66K40n6J17J1j61L7P2k4N6L12l54K9k5m0K02k66P9P0O1m02M81k04j52
$$ y = [25, 70, 236, -10, 29, -78, -146, -217, 71, 108, -46, -108, -12, 36, 78, 352, 145, 52, 0, 223, 91, -79, 109, 50, 132, -173, -304, -135, -14, -59, -153, 89, 164, 29, 97, 29, -251, 39, 64, 7, 211, 223, 156, 92, -24, 274, -29, -68, -250, -167, -28, -227, -77, -97, -225, 23, -93, 318, -82, -154, 208, 19, 126, 94, 88, 66, 80, 37, 140, 22, 169, -70, 137, 77, 63, -226, 74, -83, -91, -4, -79, 52, 172, -114, -112, -38, 156, 185, 287, 296, 164, -53, -27, 23, -89, 344, 3, -410, -78, 151, -230, 57, 176, -79, -52, 32, 37, -50, 79, 406, 299, 304, 135, 16, 217, 129, 97, -110, -79, -1, -177, 12, -189, -71, -226, 88, -137, 49, 230, 72, 152, -66, 17, 125, 182, 281, 72, 173, -33, -60, 110, 105, -239, -156, 5, 123, 166, -97, -106, -105, 81, 265, -78, 24, 333, 30, 79, 251, 37, 43, -21, 88, 11, 138, 2, -312, -133, 20, 49, -217, 23, -33, 84, 95, -66, -29, 43, 19, 75, 387, 33, 62, 37, -3, 199, -67, 12, 82, 143, -259, 222, 18, -134]
1105a34K90k88J61k5MM46k97Q0l9Q3k34j83J20j80K99l49L1J12O8M5j02k37Q5
1128b44Q1P6L38m55J59J86J95j25Q8j52q4R5j93K19l46L33j84p7L2k3R0p8R9r4
1152f4J03K6J57l08Q5j29QJ97K58j16L4j25j34j67J47K57k27l55M10Pj75q3K28
1175C4m7K30j53j17j09P9k8K33K6l13K6K01n2P5n9K96j50k47o1M00k73L7Qj16
1199h0J88j25N9K27o5k06N8j38J49l07J82k6l0j04l3n6K63m1J61k67L4J17J6O4
1223D0L33l86j6K91j32o1r0L9l80L64J85k02N4j40J67j05j77r1K10K15q2o0K8
1246DK30l7k02K4J73k96p9L1J61M3k05K51l37L19Q4J5n06L67j79J00K15k07L8
1269Gj60M58l87j09J28M2Lj05K6j56M01l10L17J07k12j5J13p2l8j15J09J9j47
$$ y = [-134, 156, -132, 29, 4, 8, 454, 157, 237, 198, 281, 47, -136, -16, -196, 103, -246, -215, -103, -35, 10, -92, -329, -244, -163, -87, 251, -204, -45, 141, 336, 211, 299, 147, 63, 158, -35, 184, -162, 171, -13, -90, -58, -81, 9, -69, 30, -64, 39, 65, 222, -86, -1, -130, -122, 75, 333, 217, 251, 126, -8, -175, -28, 229, 2, -353, 57, 64, -111, -194, 34, -13, 217, 64, -53, -162, -83, -111, 122, 148, -165, -139, 62, 10, 85, 26, 322, 172, -75, -136, 264, -9, 28, 36, -80, 108, -17, 42, 269, 204, -2, 56, -82, 67, -240, -58, -84, -114, -218, -251, -307, -44, -85, 76, -191, -157, -40, -24, 40, 373, -13, -29, 262, 130, 69, -21, 18, -362, 2, 187, -15, 39, -101, 66, -39, -216, -307, -97, 118, 36, -24, 4, 234, 197, -5, 19, 192, -104, -183, -152, 9, 52, -153, 98, -239, 80, 164, 179, -327, 40, -139, -39, 176, -31, 7, -153, 305, -82, -191, -63, -21, -18, -123, -97, -253, 148, -162, 155, 262, 50, 35, 148, 76, 38, -77, 32, 51, -96]
1292i6O4n1J50r8k1m8M11j35k20N2M6p2j74J89l20K18Q8J39j06k5l6N7r5n3O3
1317g3l0j24KL11k9m08J77n3R9L31k39j43R0J19Q9mk7M4j81n1L00l33J28j22O11
1342D84m84j5N0j26J40j89J09J16k48k56P13r8k2j72qK84l38n0L09j38J04j51
1364A4K33j51Ok2j96J63N9j87j43Q6J45j0J85l10J6K20l27L15l42L40j95K76j44
1387C1l19L07m8r9K35m3j32Q8k14J61K51j83j13J88l49K80J70j19k84O0J06j88
1409b14K23N9n0L17k57m44M38j77K42l04J42L6j11K88l8k64J16j47J50P3k60J53
1431b9LJ20j6L8k95J74j70o2K91K05m01J77k9J02R9l56J22R5P3P5p8j03o4L61
1455C32l34j2k83N11q8m00K48j51J63J60l4o3N5ll77J36K81j73q3L05l56K06R6
$$ y = [-96, -32, -83, 67, -31, -52, -100, 311, 176, -44, 8, 54, -18, -192, -3, -323, -105, -17, 122, 16, -9, -45, 12, -83, -136, -73, -103, -227, -225, 86, 57, -351, -174, -227, -128, 203, -36, -179, -89, 30, 119, 115, 88, 132, -49, -100, 200, -133, -5, -127, 484, 0, -15, 35, -91, 49, -140, -31, 85, -163, -419, 294, 196, 174, 2, -6, 278, -60, -110, 199, 61, 165, 14, 247, 96, 102, 80, -116, 47, 106, -81, -224, -138, 7, -3, 182, -128, -112, 108, -219, 96, -246, 94, -101, 175, 31, -288, 19, -29, -128, 107, 64, -68, 20, -194, -33, 218, 35, -78, 110, -239, 41, 211, 92, -192, -132, -26, -214, 9, 68, 18, 335, 78, -366, 72, -105, 137, -167, -25, 11, -100, 188, 150, -114, 2, -145, 5, 78, -182, -29, -26, 94, 78, 116, -179, -5, -175, -237, 54, 259, -142, 35, 6, 108, 207, -149, -27, 68, 141, 216, 138, 35, -29, 332, -2, -14, -297, 214, 126, -274, -26, -177, -14, 146, 112, 49, 104, 101, -276, -140, 141, -32, -115, 190, -166, 40, 136]
1478A36j16l4Q9N4r1k02J46J50j10O6K36j89o7k1P5j24K91j44K3j94l07K63J55
1501H5l06L37p7k37K02j77L45j81J47Oj57N5m3k06K05k0j7J43ro3O3l71M19j36
1525Gj00n3k14K30J3J33j43j00J80j2K63l76J53j08J64j55R5J98r2K2j45o2J58
1548E6roj93K7K33j04J50l2j08n8n1j61J51K74o1N3j60q4KK08k61J08R8j10n7
1573i5L93n01L54Or5nj98P7R0j1L7p4j01M6l33K97J9N5j51K85j81r3K64j69k43
1598c27J67J42R8k16j13K29j4R2J5k61K03K1j56J31o0Q1j17n8M26k52J47r2l40
1621b54K91k67M51l62p5K8J04j15J53J25k17L08j63J1j65J13J50j41K6K40j14
1642A27l78K44K43k34j4o9jn3K55j71K16k79K41M1j23j15L03m6k06K41l33R6l4
$$ y = [136, 20, -14, 75, 129, 38, -164, -18, 132, 22, 88, 324, 135, 68, 47, 122, -2, 289, 145, 168, -26, -333, -70, 85, -221, 116, 39, -198, 4, -173, 172, -9, 138, 144, -13, 42, -1, -207, -2, -22, -39, 104, 95, 32, 95, -276, 143, 7, -93, -146, -360, -130, -117, 16, -127, -227, -47, -59, 204, -172, -19, -127, 37, -118, -23, 175, 83, 105, -40, -102, 56, 47, 41, -152, -125, 108, 4, 154, 122, 14, -44, -95, -256, -105, 169, 108, 161, 1, -83, -81, 127, -134, -26, 72, -38, -95, 298, -203, 151, 157, 62, 57, -141, -64, 26, 15, 52, -22, -123, -77, -410, -113, -94, -39, -190, 95, -86, -179, 85, -84, -327, -160, -18, 80, -136, -249, -20, -34, 58, 73, -188, 15, 36, -120, 11, -49, 32, -85, -143, 283, 31, 178, 86, -254, 37, -230, 221, -141, -216, -188, -84, -199, -46, 79, -138, 170, 7, 18, -147, -34, 116, -25, 1, 241, 127, -251, -7, 236, 2, -12, -81, -82, -135, 120, -51, 165, -114, 127, 168, 45, -70, 233, 187, -19, 222, -111, -15, -49]
1665d9j63JM17k67l01L33k19K23R6j79K61j73j10J97q2o6M1kK74j91n1Q7k68j3
1689b04K65r4K19p8l2j72J26pj57K54R8m11j3J32n2N4J85l0j46J08l26L04Q2l05
1713b00K30K6J4o8l8k49K33M6j27R5L78k33l32L98j85Mj11L98l35L5k75L01j57
1736a52M99Kk36M9j25O0k15K00J35k94J5K15k00K68K8l38J86p2M7N0j10L48k90
1759G0m8Jm23L88r8OJ44j0j94R3j62L61j37L5j10R3J96l78J20J95j33J0j5m8J13
1784F9j25r8J13K92l05K89J49n09Q0J42j09J01M1k23K81j35k35R1qJ56k95J31
1806a07p5J85l2p1M02J8l97m8N6o3p6m2L66j21K7J42j29p3J6Q6k09K71j22j5K4
1831A3Q8p1O7pJ78k58j63N6R5J42l40L33j49o3J96j45M3oj06J44J05j14j55K86
$$ y = [-49, -212, -211, 206, -61, -362, -29, -248, -25, 71, -108, 153, -20, -130, 67, -15, -81, -40, -42, 232, 41, -10, 77, -191, -204, 61, -33, 186, 108, 76, -96, 30, 23, -134, 120, 218, -193, -206, -74, -126, -72, 113, 83, -63, 45, -281, 23, 105, -200, 30, 56, 70, 2, -36, -285, -52, -6, -133, -38, 340, 107, -225, 173, -12, -8, -119, 279, -56, -21, -296, 5, -152, 347, 349, 113, 162, 37, 97, -118, 82, 217, -77, -62, 153, -47, 221, 249, -89, 97, 25, 72, 122, 12, 360, 70, 22, 23, -400, -12, -110, -104, 40, 30, -164, -71, -233, 128, -9, 26, -84, 9, 205, -173, -53, 142, 9, 19, 4, -44, 69, -56, -154, -41, 251, -54, 235, 384, -125, -45, 97, -12, 89, 130, -93, 188, 53, -182, -91, -99, 57, -238, -107, -182, 3, -29, -100, 302, 320, -77, -125, -69, -132, -208, -250, 116, -5, 22, 164, 35, -38, -22, 64, -145, 126, 4, -11, 13, 101, 30, 97, 90, 268, 10, -153, -97, -2, 140, -200, 133, -16, -79, 117, -28, 15, 9, -97, 47, 152, 38, -117, 169]
1855A69j12kj40K7K79k00K44k73k01L48j78o1o9J86o3k05L39Mn1L08n19K08j60
1878a22J96l41M54j21l08K52O4p0Q3O6o4Q1k85o2J28j2M3J08j38k38%L02K46k79
1902a7J3R4j9nj42j22K14m6P7o9Q0k8o8r5J31j1P9k21p3M63m98L20p3r3K9N1R7
1929F8P4m6R7q1Q1l66K22l70J26J96j80K48j24j29K81o4k73L24k30J29m4%K01
1952A40ok37J86l20J22J52m0Q3k21K31n4R7r7j50J61n2k9Q6p0J55J67j58k43o7
1976a64j77J75K82j60j33K58k0Kr5j25O5J60p9K1j22K10r8q3J95l19L05j1q9j34
2000a36J39R2j82J57L1j54j95K55j44j13K95j89L39k18q2R5KJ39r1J04j64p0r2
2023a82k9L55mj63J07Jk32J67P0k32o6K14q5J53j54J49m1j62J77j12L05l10m9
$$ y = [169, 57, 55, -85, -58, 221, 21, 265, -8, -209, 139, -39, -100, -169, 17, -46, -251, 88, 92, 41, 349, -170, 38, -122, 74, -267, 187, 66, -242, 10, 74, 4, 87, 153, 89, 170, -115, -177, -49, -61, -18, 90, -48, -286, -286, 16, 262, -17, -4, 90, 71, 66, -76, -198, 16, -30, 47, -22, 58, 30, -38, -133, -2, -13, 66, -155, -228, 235, -263, 57, -16, -109, -80, -29, 68, 142, 96, 193, 112, 193, -173, 49, -321, -195, 1, -179, 69, -55, -184, 97, 33, -240, 84, -146, -17, -61, -61, 140, 134, -103, 83, -237, -115, 37, -3, 80, -141, 90, 36, 133, 36, -114, 47, -5, -34, 52, -18, 137, 304, 146, -97, -164, -341, -166, 116, -44, -177, 81, 61, 63, -32, -157, -92, 68, -11, 10, -112, 98, 0, -83, 112, -207, 98, 87, -2, -136, 3, 95, -87, 70, 101, -53, -248, 7, -137, -250, 45, -144, 195, -23, -105, -10, -8, 131, 40, 144, -20, -90, -182, -211, 144, 140, -23, 84, 85, -147, 20, 90, -142, -208, 6, -79, 74, -80, 69, 28, -134, 43, -69, 236, -74, -123]
2046a23J20q9R5j68Q9J99j9l64J34J64N5p4j01K74m90M47j3j20J05K80o20L3m3
2069b29K25j01M7o9J62j08J28M8j45nj15K41j4J17j99O5j7J06k91J71%j72L33
2092A78j66k57K73K26n34L71P1q6K13j34j20K45j03j82K19l79K26k52M6n6M34
2113B33j67N0j06J21k71J95J16p6p3n0K28j44Q1k52J60J3k70M00m6j60P1N4l2
2136G5pl17K06L6n6J21j44p7J95k34J72o2o5J14P5o3J5K5p1K9j74KJ99n8J19J6
2162G1n8J06l01J93J85l35j71L06m9l1J28L4l83K42Q7Ok23J57OK28j55o9P9J11
2186A64j0k40o6n8L64n8l06J26j28L08k08J23J69k01J94p7m0j14J71R8J23m47
2208a13L5j25J47j29P9J61J00l2q6q1q6J66l1J7j17J18J25k26K00l81K71n4j76
$$ y = [-123, -3, -92, 3, -165, -76, 123, 104, -260, -126, 38, 93, 19, -82, 192, -298, 149, 136, 16, 121, 401, -219, -186, -229, -4, -105, -58, -127, 35, -73, 55, 103, -42, -47, -162, 79, 65, 182, -17, 48, 31, 137, -154, 17, 17, -155, 178, 12, -245, 28, 254, -280, 91, 162, 76, 289, 155, 35, 280, 177, -5, 214, -165, 61, -191, -145, -201, 233, 66, 116, 10, 131, -140, 55, 171, 95, 22, -28, 200, 56, 137, -115, 45, 58, -212, 188, 142, -18, 53, 107, 75, 68, -249, -43, -7, -63, 58, -86, -163, 32, -202, -30, -92, -157, -43, 32, -31, -16, 9, -62, -33, -207, -205, -6, -64, 55, 71, 13, 119, -182, 11, 196, -139, -310, -4, -53, -84, 44, 78, -305, -63, 24, 30, -193, -36, -30, 198, 43, -26, 53, 164, 154, -86, -152, -210, 154, 96, -210, -84, -212, 96, -112, 11, 180, -21, 173, 96, 56, -58, 113, 211, 334, -113, -78, -203, -56, -185, -106, 55, 155, 123, 37, -44, -130, 36, 5, 22, -95, 23, 148, -78, 122, -259, 12, -42, -218]
2231b18K77k19L59Q5o05N16l13R0J28J1m88L79j98L16r5J36o3j96Q9J19l90J34
2253a46J45q8L56j99j5p4K49l26P0k03J66N8J09k54K73k18%M6j9J69j87O7j84
2276b05P8J61j08R7m2K23l4pm08K14K17K56l04o4J20k93Q0J1j93J63j34M5J36
2299IK92lj10j64Mk17K42j38K18k00J6p1K46J52o17N09j64Q9M5k48P6m8L4q2K68
2324A38j90L40j23n5k51J47m3J22J06m6j79J23k91K26j39J58q8J87n1Q1k29J17
2346F0J44j61j40j67K37j2J14m2K49k58j70j10K15J71Ol33L24l62J68j9O4j07
2368a29J82l8j74K46J38k06j10K62k28o7L12q9j08J9j2Lj71J33L7k01M09Pj47
2391F8R7j83K60l30K38k30P5q2K29O8j44j8J9k94K27N0K49n39M49m51K28j59J91
$$ y = [-218, 59, -160, 199, 284, -321, 195, -118, -28, 100, 111, -377, 2, -196, 120, 25, 161, 98, -98, -9, 110, -280, -146, -1, -89, 267, 68, 53, -21, 228, -98, -28, -231, -65, -7, 102, -152, 121, -97, -97, -51, -70, 99, -88, -21, -205, -127, 34, -74, 23, -19, 204, 170, 163, -245, -31, 186, 442, 138, 74, 194, -99, -19, -8, -201, -38, -172, -127, 9, 301, 298, 188, 24, 28, -189, 53, -85, 133, -67, -51, -122, 124, 276, -341, 168, 4, 93, 138, -110, -34, -82, -48, -130, 138, -52, 288, 165, 110, -141, 6, -37, 85, 191, 145, -34, 89, -202, 24, -115, 43, -45, 142, 91, 172, -57, 60, 204, 43, -97, -264, -27, -39, 75, 33, 282, 24, -146, -256, -41, 130, 136, -197, 127, -235, -67, -86, -22, -129, 53, 15, -159, 87, 225, 19, -91, 171, -57, -124, 188, 99, -9, 10, -2, 1, -170, -37, 0, -201, 208, 215, 68, 165, -18, 242, -88, 150, -80, -5, -87, 142, 210, 66, 48, 67, -227, 0, 50, 299, -240, 209, -242, -14, -173, 18]
2414A8J3j53J07J03j14j62Q7J44J37m91O38j94j99k7l3RR6o2K81l46R0J02J88
2437B32m05L62j40j18L09j82j32J98j8k27J45Jj66L29j88Q6j34k5K26k99K51k32
2459a27M5J33j68Q4K04l80M57n7l00j48k03L93l1l0k0K95K61k60K5k57O8K2k18
2482b12L45l2j36l7oM7j14p3L22J08k88J22q1j18J77r7j5K49j77L44l61l3o3K
2506a27l3K64M7j95J95l29M26j43j87J01J09p7p8OQ1K5r5j17J60Pj12J74p8k04
2530a80N8J06nK59k71j53K17J43k55J42k32oK61L4j72k1K71l59L59k00J87k32
2552d9m3l0J0J63j43m5k79P96m23j16K40j79J88j75K6K4J51j13J82k17j90n4J92
2575h4K39L0n4nj26j59j38K26K11k34K31o2r8Q5j29Q2j73O3K18n3m5j20L13l92
$$ y = [18, 31, -122, -15, 88, -26, -188, -101, 43, 180, -311, 327, 133, -66, -93, -126, -117, -21, -83, 198, -148, -58, 44, 232, -173, 189, 49, -69, 240, 58, -74, 124, 106, -121, 24, 25, -141, 188, 0, 86, -48, -73, 153, -146, 105, -127, -82, 51, -117, -33, 171, -209, 248, 191, -109, -257, -460, -67, -98, -128, -148, 147, 408, 148, 173, -84, -16, 6, -212, 133, 101, -35, -72, -78, -31, -145, -218, 104, 212, -76, 46, -35, -153, 24, -73, -88, 161, -16, 328, -33, -66, -129, -127, -160, 104, 151, -44, 151, -178, 248, 105, -82, 19, 128, 51, -27, -21, 60, 85, -10, -127, 33, 40, -72, 102, 24, -180, -122, -16, -21, 238, -33, -186, 31, 174, -81, 61, -171, -177, 84, 118, -54, -75, 196, -163, 196, -4, 183, -49, -92, -122, -112, 51, -92, -137, -416, 380, -43, -159, 81, -98, 90, -85, -59, -35, 116, 3, 185, -32, -222, -276, -84, 155, 185, 131, 126, 0, -159, -297, -71, 140, -94, 137, 75, -23, 62, -67, 15, -158, -95, 123, 70, 25, -95, 218, -174]
2599a74K60l03L69j70L6n0J3N6K8l11kM44L7Jl25J67j03P5O8l3p4RO0j50P1M9
2625D8R7l27K97k30o0J61n7K18l7q5J45j87K14l09k0K30k12J91j69j57N6L48k6
2648A29k96K18j70j29J02j6N42m83j19p7L57j49J67q3J08K4q7J39j34k64K8J39
2670e4j41M02j9k53q4l2L40K16n82M43l65K38j0j8r0P9J04l65J78J60j1j79P3
2693C0j10Q0NJ24j97J79k90J28q3J29q5J19J92k96k0K58k50J65k00oK98q2m6l47
2717c05O10l48j32N04n05K59o6N6k09L13J12l11l40L55n1j08QJ9L04k33r3K29
2739F8j89J0K0J81j78J10J89k98j32L60l64K97j49m9j2J47j4J01q7K40m3l44J91
2762E5j09K39J28o59L64j34J71j4l6j5po1J56N0k46K88l97J41J1N7L7P5m3j4J5
$$ y = [-174, 86, -217, 152, -18, 18, -32, -19, 37, 65, -246, -248, 196, 233, 234, -91, 76, -27, 48, 116, 83, 9, 18, 78, -72, -1, 48, 145, -182, 115, -115, -175, -14, -71, 147, 110, 25, 170, -17, 197, -112, -132, 98, -114, 77, -92, -249, -193, 155, 129, -167, 51, -119, -248, -146, -162, 380, -103, -222, -299, 58, -91, 76, -7, 101, 125, 38, 177, 43, -221, -193, -54, -195, 207, 188, -65, -149, -181, 159, 375, -207, 236, -129, 109, 99, 81, -9, 70, 174, -191, -13, 147, 136, -43, 30, -80, 0, 5, 129, -68, 111, -179, -51, -134, -5, -90, 29, 221, -75, -95, 163, -87, 78, -122, -128, 170, 88, 42, -305, 305, -43, -175, 329, -176, 83, 17, 73, -136, 177, 289, -22, -362, -7, -58, -166, -158, -139, 165, -68, -161, 68, -121, -111, -91, 90, -88, 22, 211, -87, -219, 141, -223, 74, -75, -124, -136, 11, -3, 98, 11, 251, 208, -136, 55, -54, 185, 313, -346, 18, -116, 55, 41, 5, -10, -17, -78, 78, 128, -118, 170, -227, -86, -75, -18, 19, 94, 51, 37, 52]
2787E2P1k03J47j04j44J63J64o0J32k05j01J59k39J90j4j3Ok99L73K76j90j91
2809c0J24j62O6L9k32L96k53J89lP6k84J26j03P4Q9k49k9K11J33K4j10Q5k80J62
2833E9J36j77j23J44j13L25n23N64m97J21N88o80K15kj12J23n4K44k88j86L39
2854A03O2m26M07k89J6r1L49n8J61j41j98L45k24r2n7O5M7J79l55K64k5K7j0j
2878E8k00J15r7OK13K1K0l37Q6J55j13J56l42L56j03j00K21o2j36o2L33l30K55
2901A13k63K53%R5k67n2L51m24q1P6M4J01kMj48L12qj47M4l27L34l0m2l9Q3j14
2927a34J87j06J26rL6j19J32m6n7m8J14k12K66j64o2K70p1q7L20j45J04l6r0k06
2951c7J3K74k86J87k76n4M38k43K49j81j72P1J61q2j8p1l5J95Pj86j39P1R8J9
$$ y = [52, 123, -80, 67, -37, -181, -18, 146, 86, 218, 13, -88, 71, -168, 22, 8, -5, 1, -298, 75, 351, 161, -30, 94, -68, -2, 37, -195, 201, -52, 137, 134, 210, -74, 52, -51, 23, 112, -137, -166, 45, 178, 202, 92, 177, -103, 59, 195, 18, -105, 39, -74, 251, -272, 292, -205, -84, 504, -176, 39, 37, -75, 48, -6, 238, -50, -236, 103, 165, -261, 146, -143, -127, -218, 131, 73, 234, 93, -105, 240, 16, -76, -133, -68, -21, 158, -197, 67, 42, 69, 59, 58, -142, -27, -124, -118, 95, 116, 136, -201, -115, 40, -73, 83, -259, 97, -6, -106, 115, 53, -83, -145, 188, -142, 113, -150, 103, 103, 198, -69, -121, 230, -194, -275, -199, -155, -54, -56, -52, -200, 112, 104, -43, 1, -326, 8, -22, -64, -103, -20, -134, 53, -53, 73, 64, 100, -19, 113, 67, 10, -38, 76, -136, 130, -34, -96, 174, 103, 16, 336, 191, 295, 259, 169, -37, -24, 250, -36, 151, -125, -179, 259, 16, 265, 84, -88, -17, 144, 62, 44, -27, -62, 133, 140, -46, -185, -114, -16, 3]
2975CK22j81K68j80j99J64l84J35K17l3R7n9j0j00l9K01M6k56l0M37l74k35K70
2998b0j59R5J50k7l7Q1J81l79O2K00l0Jj97rPqk43K93J73k94J43k36L33o9k5J96
3024A82k89J12O8o1K06m8l43L51J74m38K57j48KK43l71J39k7J19%N9m6k74R8l1
3048f6MJ86k31PK55j85m5O4Q1j38P3J08j98K06k63P5l5J83k29N1L27l46K78N1
3072B13m32J34K8o0M50l29q1K01k64R2r0Q9o0J26M9pOj86K57m0L2r3Q4j14k17
3097b12L36j82R0J07k10J68K0N0r0j87K04q4J0J13m10J13J08O8J65j89j33K01
3119E6M5j75K61n8r4lq6k3l3L8J91Q0l55K12j09Q1k5J02jo4M5J3qk20K09P9L1
3146A89k56K21k75J74J03j91K35l38k7J60Rj08K14q0j13R0K98m40J96k28J83j66
$$ y = [3, 225, 44, 312, 132, -67, 97, -287, -152, 65, 32, 129, 70, 60, -40, -79, 122, 168, -88, -118, 319, -55, -290, -20, -179, -84, 66, 39, 2, 83, 264, -115, -53, 147, 117, 118, -79, -88, -81, -89, -332, -39, 134, -160, -17, -253, 80, 11, -14, 182, -107, 5, 73, 12, 218, 170, -173, 178, 352, -86, 171, 23, 25, 268, -103, 36, 9, 128, 128, 187, 141, -133, -35, -66, -62, 124, -107, -100, 155, -30, -75, -11, 70, -68, 5, 113, -85, 121, -142, -67, -102, 81, -148, -97, 230, -116, 162, 213, -219, -85, -57, -117, 333, 4, -77, 124, -140, -48, -138, -49, -109, 17, 66, 59, 65, -121, 136, 96, 128, 35, 119, 5, -212, 124, -58, 32, 139, -71, 97, 117, 167, 77, -110, 94, 10, 20, 133, -277, -164, -56, 12, 177, -12, -145, 56, 101, -74, 187, 129, 35, 32, -54, -77, -110, -72, 119, 199, -156, 56, -53, 28, 3, 105, 104, 40, 85, 98, 90, -130, 79, 158, 189, -67, 154, -121, 53, 156, -35, 200, -138, -165, -5, 4, -104, 110, 30, -83, 7, 305, -135, 61, -167, 16, -150]
3168a50L5M36l17J32j00K1M9j45J83k64J04K60j21R5m10nK33J3nk22M1J54O4L2
3192A13o9O1j21P5K93l53k4P9j0p4J12J99j50j83J20j54P8n2J04j1Q7Kl49L73
3216A46j47j82L23nl47K11j29K66j15m3k0p2K93k55J25L7j3j73L2l7O2p0j25O6
3240a72P7o5n7Q7j77L01J5j26n2K02Q2j42p0R5P9j28L4j05M08N2l63p0J03m4L8
3265BJ15j93RJ99l27N82k75k36n8Lj4Q2L63k42Q7j3k53O1J82R8m9j24j68K85l32
3290b16L63j88o5pQ4jj20J07k30K57P9l17J50K40o9k62R0J60k12K03p4Q3j36K08
3314A27j31L4r2j76K10J28J26k63J50r3j75j10L36r8J93k13K97j35k05K06l13
3335a97L8N3K62k65K05j6J7k05m2L9L26o6r3n5j97J63N9q9N4J95J5j78j47M1N
$$ y = [-150, -115, 321, 4, 136, 36, 57, 106, -39, 144, -120, -16, 244, 123, 218, -192, -197, 36, 49, 44, -178, -137, 17, 81, 113, 44, 105, -16, 59, 352, -1, -25, 54, 44, -30, 82, 281, 131, -52, 68, -86, -8, -60, 44, 33, 120, 122, -227, 146, -1, -183, 140, 135, -212, -1, -130, 136, 21, -22, -42, -114, 179, -76, 49, 86, 73, -100, -68, -105, -43, -113, -238, -172, -95, -160, -217, -130, -307, -6, 9, -117, -169, 33, 115, -27, -97, -2, 77, -51, -17, -122, 286, 338, -25, -95, 8, -36, 2, 117, -76, -67, 132, -195, 387, 112, -124, -182, -179, -193, -111, 252, 10, 97, 84, -169, -108, 74, 172, 123, -1, -169, 116, -216, 147, -41, -106, -113, -29, -30, -150, -43, -273, -16, 63, -254, -104, 136, 67, -195, -105, 55, -157, 46, -28, 55, -81, 127, -4, 30, -62, -238, -28, 100, 226, -37, 113, 20, -155, -265, 71, -27, 166, -47, 250, 115, -90, 116, -197, -159, -106, 156, -109, 96, 80, 97, -108, -150, -111, 215, 149, 56, 1, -196, -33, 26, -63, -9, 186, 201, 23, -124, -83, -78]
3360g8M39k42qm72K95J39k25K50j37J07j18J02j33K36m59M77o0j46N3J30O3l29
3382a16J25Q7P0j13O8k35J31J99m36Q4J79m2k43L09N7m29K60q0Q3K87j64j3k55
3405a87JJ85J55k91K93j33r6J78l7M3k23j85K83j58K26j83L53k83o9R4J34j83
3427h3R4J10j82L19j33j22o0J17j06K23n8J50r4K9l22K18j17j19J77J64n1l27
3449a73K66l45M01k34j17K73k15L03l7j8k05K43j40J99k54J5K71k45K3p1J20M9
3471A09r7j57K09q0k9J06l2L1j01l22K10L48k83J37J41q8q1p7r1J31J81j51K37
3494B51l07n7K24j27P4j60N7N9j25q4L71n0l87M81k97R5j9J76k90l1N9q9K77J64
3518B65l12L3rk8j2P0k72m6L88k54K67K0j24o7J70k03p4J62P6k06J00k09L68k05
$$ y = [-78, 361, 119, 111, -361, -66, 73, -152, 98, -39, 68, -50, 52, -81, 155, -304, 173, 113, -33, 20, 150, 213, -116, 9, 96, 166, 53, 121, -114, 17, 216, -220, -136, 43, 1, -242, 67, 124, -305, -45, -125, -42, 245, 81, 68, -187, -186, -1, 154, -137, 156, 23, -73, 105, 68, 111, -112, -297, -14, -172, 54, -129, 224, -59, -128, -34, 100, -83, 11, 121, -61, 258, 125, 3, -57, 60, -46, 177, 119, 269, 175, 204, -118, 100, -17, -136, 41, 205, 154, -173, 93, -252, 149, -85, -202, 71, -144, 159, 122, 104, -101, 142, 2, 201, -53, -38, 233, -12, 11, -60, 60, 109, 12, -145, 64, -16, -45, 61, 29, 60, -41, -363, -153, 195, -88, 49, 190, 102, 21, -56, -147, -16, 165, 14, 251, -56, -113, 111, -16, 58, -102, -45, 14, -111, -195, 176, 126, -261, 220, -77, 18, -1, 175, -115, -146, -87, -176, 101, 265, -47, -14, -23, -51, -63, 7, -265, -311, 77, -177, 90, 110, -14, -81, 89, -114, -188, -26, 50, -156, -56, -265, 103, -102]
3542a02K81j14o3k23O06k50k00L12q7k93K01J14l53L22p8k33J66N9k00Q0J65k14
3564a04m6j17K3k8L81mm1j85o8L68j1j54PJ05l26M35o6J39k54j53P9j17O6m0L82
3589B71n73J01K09j52K17M1k07M04m84L66l1k05J94k85J4J64Q0Ml%n5j0L1K7k15
3614i7M1K26o7N2m82L24L7j82K8J29q9J78m2O1j7q6J0j86K36l53L25j58J61o4
3638a5QP8J8Q2l45L41j90p1K70k63J58m06J88r2N7K98j10j23%L7j30K04P1o6k52
3663b53J99M8j6J67j01q6m4Q1o7L19k23l9rl8K30j58P7K2J78l82J58j51J2k6L1
3688g1n6J69Rj96P0q3J07K51%l30R9K1J3J90j36j93J70k30L95j79k8L52m19J99
3712A24RR8k15L9j4q2O6k45L39j36m7J56r9K2j26J17K20J94m53K63j61j53j80
$$ y = [-102, 179, 65, 2, -221, 385, 135, -65, 247, 160, -133, 68, 182, -171, 151, 73, -160, 6, 65, -135, -55, 110, -104, -150, -267, -244, -272, 109, 105, 64, -121, -189, 179, 168, 14, 21, 126, -200, 235, 169, 308, 54, -99, -20, -137, -71, -111, 271, -302, -201, 8, -144, 73, 114, -93, 311, -173, 193, 162, -43, 151, -134, -120, 44, 124, 128, 125, 125, 70, 60, 91, 118, -97, -56, 170, 103, 155, -327, -3, 34, -148, -120, 9, -80, 98, 56, 117, 100, 14, 24, -162, 74, -279, 46, -112, 49, -15, -7, 71, 89, 171, -174, 167, -23, -94, 176, -87, 71, -335, -147, -239, -182, 116, 6, -117, -117, -80, -210, -6, 65, -1, -253, -54, -6, -22, 145, 44, -42, -86, -5, -72, 247, 24, -15, -24, -62, 168, 10, 87, 109, 287, -95, 63, -88, -76, -102, -71, -127, 42, 51, -145, -75, -158, -51, 200, 200, -130, -31, -10, 3, 193, 57, -136, 34, -196, 199, 20, -8, 344, -75, 124, 133, 231, 16, 55, 41, -41, 25, -220, 119, -17, -64, 92, -7, 15, -111, 6, 226, 420, -33, 230, 69, -84, -264]
3735b64L28l54M89j00k04P6mK55l86J41k00K91K6l98L5L12q2r7Q6J84j11K2r9
3758e4J79j90K31r0l22r1J64J52q6J32R9k84J16j04J60mL4o0p6M5P5k24N08k69
3782D1N4j29p7J64j91q2K93J37k38j38M72k48k97K01K01j11M3m11L41Rj99J48
3804a7JL4R3l64J74K37k72K3N4L24k68K26n27P7jL84l77R9J09O6k9K78k79p0P0
3829D5J4j36J02%j76L57j61J13k62J25l4k7j32J09O5K7O8j47l7k21L65l3k31M06
3853A99R6q9m12n6L97j51r8P9j7K10k75r9J54K21m83M04j70L4J15K2q8pJ57j43
3877@J41k73K19p2k76J50J94j26J61m7O9j40J19j14j64J64K72n5k56K06r4l07
3899b29K99Mj9J0O9j81K97j87k33J05o4J38K1M7j19l2K42q9n9j23P2j82L74k34
$$ y = [-264, 64, -290, 199, 99, -105, -29, -33, 222, -164, -23, -223, 68, 94, -304, -269, 43, -39, -136, -50, 134, 23, 45, -54, 125, -65, 166, 76, -246, -337, -173, -21, -107, 25, 124, -160, -44, -148, 12, 8, 42, -18, -94, -49, 26, -198, 310, 41, 95, -34, -111, 53, -138, -220, 73, 210, -28, -166, 306, 58, -239, -38, 163, 52, 95, -316, 25, 34, -165, -17, -16, 18, 111, -253, -79, 158, -114, -91, -37, 287, 19, 245, -282, -205, -206, 178, -199, -100, 9, 75, 46, 324, 45, -25, 45, 59, -77, 25, 25, -151, 206, 45, 158, -104, 21, -13, -40, -172, -63, 2, 29, 97, -50, -87, -308, 57, 24, -207, 199, 295, 206, -206, -262, 135, -16, -114, -35, -52, 158, -117, -216, -62, 159, -324, 80, -90, -56, 59, 81, -7, -14, 143, 0, 141, -132, 87, 15, -261, -111, 83, -43, 118, 71, 140, 0, 119, 5, -159, 5, 277, 222, -34, 172, 78, -229, 70, 74, 55, 65, 134, -47, 250, 63, -170, -65, -129, 9, 30, 77, -42, -74, 168, 79, 20, -103, -31, -213, 161, -73]
3923g3j00O0J80j51j17R0J7j75J56J13j13J09J85j66J53J45j48n4j03Q0O1j98
3945d9J36k3Q3j28K2J27j92k4J06q4J23j50K18m24M02n07M05l1P8j15L04l19j31
3968a73L21n23L70k6Q5j58L09j26k28L41l77K95l40J85K04l41O2O5M51m53L31
3989B74l79J31k33N3k9N0L59k99p6K03M5J90j98j58%p5L18k8k18J02k01j21M04
4012A14k63lK82M8j27MJ21j08j75oJ30q3J55o7J7l7k78L78n1j93jJ59j49J93J00
4037A60k59pJ24j24J2J97j3k6j58j08j5L05j36k8j63R2J3L07l09l37M14K34J2
4060A87j90J78k76O7l8J70j94J47o1P2j02Q4Q4l47J33K9K28j42r6R0l03K27Q7
4083C4l98L10M0j49L84q0j82J14J95l28K6J48l01L51l75p6K08K09j3qP6k58j33
$$ y = [-73, -173, -113, 67, -84, -201, -111, -94, -269, -113, 0, -113, -4, 181, 15, 168, 313, 165, 111, 8, 88, 149, -49, 87, 64, 147, 19, 41, 168, -24, -48, 58, -26, 97, -53, 165, -259, 143, -364, 41, 10, 88, -27, 277, -42, -173, 148, -375, -5, -31, 54, -104, 205, 79, -149, 192, -185, 110, -230, -45, 159, -182, -120, -55, 396, -57, 274, -105, 26, -207, -154, -183, -133, 226, -73, -149, 54, 99, 289, 91, -67, -67, -142, 176, 148, -70, 32, -169, -290, 114, -149, -152, 130, 178, 51, 55, 176, 68, -107, -113, 17, -66, 89, 22, 39, 2, -276, 102, 51, -142, -143, 16, -133, 60, 160, -99, -106, 18, -106, -94, 103, 90, 64, -94, -202, -217, 88, -48, -76, -239, -147, -134, 173, -136, -473, -59, 175, 187, -3, 175, -101, -34, -72, 98, -96, 51, -10, 62, -40, 44, 128, -219, -86, -57, 171, 29, -67, 23, -280, -53, 34, -364, -54, -14, -163, 221, 141, -41, 73, 268, -60, -34, 114, -187, 164, -211, -287, -79, 130, 117, 109, 185, -73, -206]
4106b06J14L17l02J73o5j81K2r0L81j09J51k89J67j04j39J11k4J1J03k50o6K44
4128c1l5J19r3J88j16k46j35p4K40M86l60kJ82l92L83k39K8K9P8Q1l18J88J02
4151F3k27L79l2j90j97J83o9j61J98K91m0l67J38J3k26L29j63P7pL9j26P4N2R3
4175A24k20J11O3j3J59n66N66k83O8LQ1j54J11M5j49K15j63J40j64N5j14M11m47
4198a21K80j24j63L53j63j3j05Q3J60k53J14P8J00j26j71M62l06m1j81M58j56
4219A65j27J78j25j01RJ02k28K71k07J29j70K62l9J0l53L88k79l6J98j25J12K9
4241F3N3J09n3l04J33J01J8k35J67j98N9J62M1j90K49j98J25O7J0m04p8L37k13
4264a79K56r8r3%M0K01m72K32K19j37M3j46N0J77l17K01M25o59J97K5j16K60j74
$$ y = [-206, -92, 225, -77, 96, 31, -150, -128, -218, 163, 54, 205, -84, 83, -21, -160, -49, -73, -62, 41, -209, -275, -31, -66, 53, -40, 148, 32, -214, -349, -423, -183, 303, -57, -59, 123, -269, 114, -125, -97, -68, 10, 91, -227, -39, 63, -164, 215, 183, -7, -204, -21, -90, -251, -53, 238, 198, -169, -31, -18, -244, 85, -78, -1, -8, 31, -95, -21, 31, 124, -96, 15, 78, 65, 224, -342, 224, -59, 9, 12, 93, -61, 50, 95, -54, 161, -2, 138, -26, 29, -85, 326, -121, 159, 35, -128, 225, 62, 49, -56, 27, 187, -66, 48, 126, 226, 100, -71, 391, 85, 44, -137, 321, 165, 38, 216, 91, -10, -1, 101, -127, 144, -63, 66, -104, 158, 119, 129, -224, 164, -115, -151, 47, -78, 34, 63, 116, 225, 172, -132, 1, 102, 120, -115, 52, -146, -87, 75, 116, -74, 175, -23, 102, 169, 179, -225, -303, 34, -179, 77, -21, -114, -114, -74, 127, -345, -113, 106, -31, 12, -134, -84, 93, -224, -23, 402, -257, -60, -35, -151, 109, -65]
4287f5J35Q0j26j78L60m41Q7L39o3M0m07L89J09j90j12j76M1Q7P6o9m5K66l80
4310b43L22j60O1J7j2K41rj74o6j3L7J50j35o3JJ90M5P6l22j12J21%J9J15q4J62
4336A64J14n28L18k04K23P7k71J47j74K57k61J55m4j41K68j39m5jk7N0j31K82
4358H9j6K7n0j9ok24M00Q5l48J04l4k24K99k00l2K33k55J23O7R5J68j74k11K87
4382A84j48J43k38J27j41M0J77k96j15M75m4m63L55M0j56l8J69J3j84K04Q7l49
4404a58J10o6K55l16L36k92M8K27j26O5n8n2J2J33O0j69J16j65J3j11N40l32j18
4427d8L11j76k46M29l8k41K49k28j09K3K52j66k68J82O1P1N4K8j54J15k87L16
4449A30l50K49O4k07K68K63m34J6R1j86J01k06L87j50QJ32k07p1J21PR3l29L14
$$ y = [-65, 70, 150, 24, -154, 206, -235, -148, 191, 128, 168, -239, 150, 259, 69, -43, -219, -178, -91, -15, -84, -129, 137, -243, 79, -81, -20, -3, -15, 226, 217, 43, -23, -36, 1, 151, 16, -47, -46, 144, 189, 265, -57, -169, -48, -48, -29, 86, 2, 164, 278, -250, 68, -136, 87, 164, -107, 40, -134, 123, -138, 17, -27, -168, 100, -39, -84, -85, -112, -62, -193, 89, 73, 100, 50, 31, 25, -199, 201, 286, -62, 42, 8, -216, 83, -117, -149, 84, -171, -48, 19, 114, 282, 108, -103, 184, 36, 179, -59, 68, -73, -33, 144, -152, -267, 208, 164, -299, 56, 96, -60, -98, 71, 84, -100, 104, 191, -158, -48, -114, 141, -175, 161, -131, -83, 144, 18, 83, 25, -27, -15, 118, 178, 9, 125, -40, -27, -138, 402, 70, -48, 263, 87, -159, 270, 232, -9, 240, 12, -97, -74, 178, 12, -256, -74, -13, 58, 112, 140, -14, 101, -186, 130, -220, 29, 93, -114, 154, 417, -17, -1, 90, -96, 5, -201, 186, 36, 44, 176, -31, -102, 19, 26, 119, -210, 104]
4472A04k14QQ8K07p8k68n1J26J92l19k4L98l59L17k85Q6jj1M53k65j82K51m5k49
4496a21Q8J50m1l1j67jP3N0K76l80L4n2m4N05j20o1p0P3l4j16K7J85j84n1L9O7
4522I4j06j20J41J0J12m18J41Q8K22j35j27J90k03MO5k00K40J1j16N2O1J55R5
4545B56k46J10p4k97J69K63Pl27K58o9j71l5J87L2j79K95j55L4k43J6L49j41M4
4568H3N5j4j28K40K5k6l68K94j36j73L2K05q1q0K22o0Q1k37R9J09n21N63m4k41
4592a01L29r6k77K35q1q9K2l32K86k3J46K71l52Q9lk8j29L13k13K3J59q0j31j06
4616a68k3M89l30PJ12j15J66j5j13m6k80K13K86l55K33l82K90Q5Q0L45m23P8k8
4639A06J56l35K68l48J75J56k75O7r9M1Q7J59R1l29J70l68J61j3K67k09J14q5
$$ y = [104, -110, -102, -14, 193, 115, -153, -204, -78, 114, -205, -229, 169, -190, 127, -158, -72, -73, -84, 369, 104, -78, 173, 128, -121, -33, 117, 76, 45, -122, -123, -50, 0, 276, -104, -70, -122, -166, 339, 219, 158, 88, 161, 127, 11, 38, 223, 39, -12, 27, 94, -12, -132, 9, 19, 131, -287, -146, -58, 164, 29, -98, 92, -111, -107, -42, -242, -2, 9, -107, -55, 6, 161, 256, 10, 120, 46, -251, -82, 181, 188, -139, 119, 50, -121, -156, 31, 63, -116, 179, 24, 58, -185, -169, 180, 39, 83, 138, 124, -4, 236, 261, 235, -133, 161, 25, -148, -116, 89, 8, -72, 150, 90, 171, -66, 33, 142, -379, 184, 140, -101, 228, 132, -145, 90, 9, -80, -58, -390, -104, -127, 19, 290, -62, 27, 24, -4, -133, 180, -33, -10, 149, 69, -62, -168, -191, 298, -32, -25, 87, -28, 138, 123, 10, -36, -316, -103, 183, -172, 61, -321, -31, 54, 134, 479, 56, 134, 106, 262, -73, 195, -153, 22, 178, -97, -30, -129, -88, -1, 158, 249, -80, 90, -278, -117, -130, 137, -72, 42, -43]
4661d3kK5J64J38m73N9K02m7J0j61J16k01L70l21M54k36Q0K2j28p7J74j95m7P1
4685d6p5K13j47J86j62J54j94K14j69j55K5L40l35K17P2n0n4O5O1k07K74k90N2
4708a1J08m4k81J03M1n3J21r3J77j99K51j97j3j46K88m9Q3j15J24j07j24K06j54
4731h4J98j91J8L42k01l20K91K67j79k23J5nK0J27n7j14n9j64K11Q0K60l99K18
4754E1j47J31k82J46Q0j00J58j65L11k8k94k0J42K64M5k71o5J2Rn6L45j33o0M0
4778A13K7%Jj90J46Q5j63K82nm1m69N8K58r9K25p9l43K31J93k69o9J50j08L00
4802B34l37M55m87N0K96k09k05J29J77l23K32o2J68j85J52O3q5K6j22l7J04r2
4824e8n6J20k87K07m0K29j92qM07l65j92L21k25R9l6K8J09k8l3o7K47k69N7N3
$$ y = [-43, -45, -20, 144, 282, -191, -132, 70, 23, 33, -128, -12, -213, 157, -164, 290, 54, 134, 156, 28, -49, 125, -70, -117, -46, -121, 92, -55, 131, -31, 123, -71, 143, -26, -181, -156, 184, -151, 66, 138, 88, 34, 99, 160, -47, 227, -63, -11, 97, 53, -228, -125, -84, -137, -16, -109, 68, -131, 120, -77, -90, -236, 52, 3, 86, -29, 95, -12, -136, 70, -84, 114, -77, -59, 283, 82, -238, 53, 320, 141, -82, -67, -72, -52, 75, 18, -96, -155, -319, -108, -28, 232, -167, 51, -96, 35, -247, -101, -21, -121, 37, -128, 183, 155, -139, -159, -17, 247, 292, 21, -44, -32, -23, -79, 266, 133, 73, 113, 140, 140, 141, -49, 97, 182, 19, 301, 296, 255, -214, -156, 102, 3, 228, 149, -194, 37, 230, -39, -108, 42, -66, 234, -103, 352, -135, -85, 211, 2, -203, -74, 103, -220, 12, -50, 118, -67, 85, 148, 63, 89, -33, -70, 34, -58, -114, 6, -281, -74, -114, 115, -77, -85, 322, -43, -235, 86, -139, -40, -76, -48, 61, 33, 0, -67, 180, -89, -32, 21]
4848B1J30k63L28k48j18j14J29O7K33n26K99n8J08p1J77k16J21K47l55L43m7k84
4870i7J29j4J10j46J73m5k42L7j09J53M14k76l34K68r3L43j9l1j83r1n0p8N03
4893C22n31Q6J49k07m09L42J94J46j89J60j18O8R3j85N7O3J88k43j35m5K68q4
4915a0J38l00n2L87p3k85k12K02J09J17K34k39j7J16l21M48o17K11K35K59k59
4936G1J51l42L57p8R0k68j77R2L15k30j18L9M7K50m08L93nl03P9L42k86k30M18
4959A99p8j20k33L24J43k94J61M1m9j22j6j91K03Rr4J37K29m46J52KJ3K44l39
4982a25L22l88J72l2K01j7l51K77lJ19k34M4qk06n8L43l67K52R2j21J54k04K20
5005H2l5j78M8M46k60m5j93L06m0O5j85j21j14L77k39j88J19R3K34j28o2K6rp0
$$ y = [21, 151, -112, 216, -32, -150, -264, -135, -68, 165, -361, -62, -120, -12, -83, 94, -122, -1, 246, -109, 234, 187, -97, 32, 18, 128, -18, 155, 110, -132, -95, -204, -51, 363, 87, -247, 21, -72, 271, 252, 221, 38, -53, -103, -181, 322, -209, -123, 26, -181, -590, -248, -54, 92, -97, 63, -55, 13, 106, -79, -22, 41, 229, -14, -149, -194, 74, -10, 128, -172, -224, 163, 90, -195, -407, -205, -96, 21, 255, 16, -1, 115, -206, 242, -375, -164, 71, 330, 71, 222, -120, 237, 159, 249, -19, -196, -104, 211, -19, -137, -98, -51, 199, -209, 184, 179, -124, -45, 297, 11, -219, 199, 121, 1, -232, 92, 235, -59, 102, 143, 94, -28, -44, -235, -32, -23, -117, 20, 249, -197, -45, -43, -30, 214, -125, 197, -191, -19, -51, 150, 133, -218, 59, 56, 175, -59, -15, -23, -229, -287, 56, -311, -59, 33, -88, 66, -138, 82, 47, -131, -83, 363, 103, 58, -135, 171, 131, 196, 11, -110, -224, 153, -86, -274, -155, -62, 172, 44, -18, 8, -1, -71]
5029g1J06J6l16K47j38OL54k78k2M31m85J00J28l17J10L67j40j71J13J8R5l50
5051a97L18O3p6k65L39j60j7J69k03J51m3R4j54o1K92j96o6J73l14J54j28J62
5073C5M6o5j76M3j51M04j6J12j71P4nj84OJ89O8m5k67j83K72P6J02n07K95K69
5097B21o8mn0k58K84k5o0P6k73J11J31r0o3R7J19q8m7mK23m64J68J28j88P2j29
5122a81P4Okm7J93r7O5l02K21q3K44n1J21L4l7j59k20N4l4k09L67M1k9o7R0J58
5148A50k00j41J30N8J67j1j36M4n7k42J46M00m13j0j78K21K81l50p6M73l08O1
5170IP0k7j79K11J88l19P4l6m9K13m17J91K00m60M78l7l49K86k80R9J34K3J51
5193A74n3LJ64k2k85K66j38l12L14j60R4k08m2J93j29m6J50K16p8o2r1K95l33
$$ y = [-71, 35, 51, -265, -18, -156, -150, 204, -74, -96, 335, -150, -50, 78, -239, -129, 238, 98, -73, 40, 58, 153, -197, 121, 184, 108, -157, 182, 22, 5, 174, -29, 122, 79, 173, 19, -42, 250, 54, -12, 161, -153, 1, -127, 35, 81, 16, -160, -117, -268, 136, 120, 232, 61, 135, 130, -54, -48, 141, 209, 164, -103, -286, -14, 62, 164, -343, -48, 221, 153, 149, 99, -159, 125, 100, 40, 116, -157, -46, 85, -5, -68, 29, 148, 60, 13, 9, 232, -232, -64, 64, -124, -52, -181, -107, -101, -103, -150, 43, -54, 11, -291, -70, -153, 91, 40, 161, 195, 158, -1, -221, -167, -201, -410, -43, -2, -31, -98, -8, 150, -50, -191, -61, -3, 164, 153, 17, 61, 4, -238, -92, 308, -105, -115, -293, -72, 209, -141, -217, 256, -52, 9, 79, 52, -127, 84, 272, -47, 27, -9, -58, 155, -262, -71, 129, -331, 147, 110, -239, 47, -233, -134, 0, 23, 174, 121, 124, 288, 266, -19, 247, 109, -203, 111, -49, 45, -163, -205, -12, -141, -187, -37, 179, 101, 39, -52, 243, -90]
5216i0J29j98L63j05l20K74l47M13Q5m27KK08j66Q4K04j47R0L7m3J9k20QJ92K1
5240F6P5k83O3Nj67K69j86L4J26L72k77k35K41k52N8j07K40j71J17J82j54J93
5262B09j90k7J10j69J30j4K20l77k0L67k03K51m74J81n7J51l39L35N6N9j31j19
5284e1P2k76M28J6N1k5J28l75k3K99k74j17R7J01P8j8j02j26L7P3J55m6l0l3j42
5309a03J02K07l16K62K5j20J00l24J19K5M4j45nl4J09JJ68L6r2r8k8L53j80n26
5333d20L92K07l27J52j3j75R3J18j57J50j15J92j78R9j10K59n1k65J13j99J07
5354a28Q9j1P7q0J16J42k99Q3J05j83J48J4R2k37M5J47J53k29j00K11O6k26K15
5377B10J72k53J24k57k53J12k6K45M5k15l17M46R7j59l41M21J21j91K98l81L15
$$ y = [-90, 39, -159, 204, 99, -221, 53, -294, 119, 204, -223, -221, -13, -179, -95, 109, -38, 52, 89, 46, 65, -155, -147, 45, 66, 141, -142, -79, -74, -241, 28, -158, -124, 2, 374, 97, -138, 103, -149, -91, -198, 42, -129, -12, 170, 16, 209, 19, -8, 102, -67, 63, 49, 269, -108, -128, 239, 36, 287, -187, -6, -63, 88, -251, 84, 140, 199, 68, -51, 21, -255, 173, 189, 240, 215, 343, -32, -55, 244, -30, -147, -50, 51, 129, 111, 9, -117, -80, -7, 148, 102, 72, 39, -103, -1, 206, -110, 152, 177, 57, 157, -167, -48, -23, 21, -124, -129, -163, -54, -53, 115, 151, 59, -39, -67, 286, 106, -420, -28, 179, -148, 4, -9, -184, -91, 27, -130, 20, -95, 97, -81, 18, -92, 167, 116, -149, -36, -235, -128, -39, -50, 27, -53, 63, 205, -94, -11, 94, -89, 59, 73, 165, -72, -27, 120, 273, 44, -56, 155, 221, -5, 210, 382, 129, 253, -4, -257, -145, -171, 74, 119, -96, -413, 33, 130, -29, -370, 51, 172, -19, 279, -102, 213]
5398B13m5m1j39J93l68J18j8j59K37M4P4j28J68J4M6j28k7j16r3L16m18J26K19
5421H8j07Lj11N2K53K4j23j95J59J30j7p6j08P6j80M17l30J66q5r7k39M41k33
5444i2J50L3k33j62L26K73m93J62L8O9j52N7J9rq3j54L9N08k15j89J2j29J33m
5468i6j26K37J32k61o2K6J14K96k36j09j25J03j04L23k18Q6L0j15j5Q1O9q9M2
5491a7j41JO8J01K2K32n7j01Op7m5J46J44j01k8p1m07K74k3n9N9Q0j3O7J4K9k11
5518a08k11K44K12j62j36K93n5Ql45J69J70j48J50K08k02k78K93n2k52K84k59
5539a77K14j23K65j23M24l34j66m1Nr1J83J20k00J90o5P4l69L56n8L54m39l40
5561c41L20n2R0k7j21M70l53J3o5o0K28k2Kk27J34K31j15k11N5K28k78L30l62
$$ y = [213, 168, 127, -12, 181, -187, -69, -87, -246, -9, 35, 109, -19, 149, 163, 209, 81, 54, -62, -155, 161, -257, -131, 88, -19, -16, -127, -75, 178, 202, 79, -116, 43, 173, 156, 80, -28, 48, -132, 285, -45, 121, 36, -61, -300, 141, -92, 58, 91, -142, -304, 22, 295, -198, -36, 2, 71, -81, -24, -5, -14, -97, -251, -212, 296, 81, -108, -96, -225, -92, -96, -222, 15, 147, -114, -176, -150, -36, 260, 24, -85, -210, -107, -211, 112, -106, -20, 10, -105, -120, -39, 30, -59, -17, -158, -157, -89, 12, 34, 266, 209, 108, 114, 37, -8, 138, 282, 181, 153, 82, -325, -51, -74, -133, -74, 6, -7, 60, 74, 103, -108, -319, -75, 137, -25, -161, 132, 77, 85, -260, -91, 79, -69, 81, 289, 87, -191, 102, 50, -202, 82, -177, 37, -86, 179, 56, 480, 146, -20, -61, -56, -147, 36, 156, -44, 146, 81, 155, -214, 142, 84, 438, -1, -341, -21, -73, 17, -10, -131, 339, -14, -1, -66, -126, 102, 80, 82, -145, -11, 220, 105, -106, -51, 177, -101, 229, -133]
5584a33K63m0K05l15k5N5q3m2L59k01J7p9J14L5KN4j38J17m78J71M2J18k22l3
5608b37K39p3n7J7k08L82L2j1n2QN3k38M9L65m17l4J8K25k67M37k05k27m3J34
5632a10J39j60J72K47l25M9K9m7J5L7J39k48J13M6m3j86K44o3J87k05Q9j47K62
5655B34nk43j1l9K55k18n4q5L45l41J41J39k45n4q1P1K71M2k73L25j39J6k54L71
5679A68j83pJ30j03n8K3L6M4j95K78K8l19M9R3L42n85K27O2n2K61k29J47OQ1m9
5704A95j7q1j34j08K30q1j06j11K04l38L28K31j81J30j75j05j35K2J69R2J77l96
5726a90K48J81k62K35m56J23m1L91J4k81j55J77L20l18L56l52k00L26n5o4K5r
5748A3k68J68L96m08K84l32K48j12N5j47k5K24j30Q7l04O6o8L19k11L23j6j63
$$ y = [-133, 130, 90, 295, -20, -45, 10, -73, -115, 244, 43, 60, -19, 95, 130, 132, 186, 48, 165, -313, -142, -100, 18, -204, -237, 2, -71, -128, -111, -319, 63, 95, 84, 32, 40, 93, -145, -96, 269, -148, -182, -164, 61, -206, 231, 26, -201, -244, -110, 29, -131, 41, 288, -37, 12, 41, -6, 9, 46, 185, -63, 50, 96, 53, -133, 111, 48, 235, 30, 119, -28, 234, 229, -14, -25, -64, 191, -27, -81, -166, 179, -162, -21, 118, -127, -181, -262, -191, 80, 122, -151, 174, 35, 51, -203, 168, -15, -22, 108, 5, -53, -30, 6, 50, -145, 133, 161, -158, -109, -16, 326, -259, -32, 30, -22, 239, 10, 157, 163, 244, 195, 178, 97, -37, -145, 85, 4, -102, -213, -9, -347, -19, 212, 31, 161, -14, -119, -254, -232, -63, 29, 206, -190, 58, 239, -23, 212, -244, -121, -162, 229, 243, -38, -193, -16, 304, -14, 342, -10, -210, 116, 61, -3, 22, 13, -255, -87, 309, -99, 185, -147, 101, -11, 44, -103, -128, 96, -34, 53, -251, -185, -253, 66, -145, 178, 162, -1]
5770aJ38q4j18mm6j64M17R9j23m36N65j28J57k9j14j85J32j42k25M66l45J09j29
5793a90K50l22Q5J22J3J24K97l70Q4j94J46P1q6o8l6O2j92R8J01O1j44J39j61
5816a10N9N1k18M7K89r4j76K85k29K40k72L13m10K30k82K93L7J04l0Oq1J56j47
5839F1J20N0k76J7o8P8o8K79l60K89j29K9r2N0L3j1R3J0n5M4k63L8j4L36l42J33
5865a8k5j95Q3K17o4J84k27J28k0j63K84l91N16k45K1k4j06J04k9L6j16N8l0m7
5889f9J56o4KJ17q5j19M5r6J83j41J64q7r5j03K60p5j12K05L5q3j65K05J4j51
5913e9l3J54K7j52P7n9J60J88k24q5Pm3o1M9J38J67M6k48j22J91j19j36K00Kj19
5938e4M9p7J54O4m6j07K6pJ4k07J80k01L23J05O7m31k41K76J61j55O1lJ29J3j9
$$ y = [-1, 137, 53, -65, -69, -115, -279, 138, 237, 114, -322, 243, 115, 272, 243, 129, -56, 76, -66, -291, 175, -170, -61, -190, 60, -262, -177, -55, -42, 82, 379, 9, 93, -101, 45, 116, 30, -38, -74, -12, -204, -106, -5, 56, -88, 51, -110, -51, 0, -218, -171, 118, 24, -152, 133, -96, 144, -128, 185, -225, 5, -277, 16, 53, 157, 127, 133, 52, 208, 61, 181, 231, -45, -28, -96, -18, -86, 193, -167, 122, -7, 22, -70, -20, 13, 2, 95, 105, 50, 94, -169, -131, -145, 191, -151, -18, -43, -238, -155, 62, -2, 182, -45, 83, 63, -100, 184, -207, 309, 64, 85, 61, -45, 59, 30, 66, -50, 8, -22, -69, 87, 23, 25, 142, 57, -62, -17, -113, 70, -71, 93, 6, -89, -192, 68, -7, -119, 86, 121, 38, -127, 78, 92, -59, -92, 62, 89, -63, 14, -45, 115, 303, 79, -6, 1, -42, -103, -54, 84, 251, 297, 49, -73, 118, -1, -137, 63, 65, -54, -5, -82, 72, 136, 90, -17, 9, 2, 16, -191, -11, -212, 111, 216, 283, -148, -389, -113, 48, -107, -46, -49, 80, 93, 74]
5963G4k67K91l8j16L32k33k29M6J07j92J58K87k04O4J38j96M4k41L47n9l83J43
5985a27J63n4J17l23J96j5k9Ql0K8oJ31k98K59j96Lj0J56j98L58k25n3M5N3j26
6010a73J13k1J16j61q5L39m25M60k63K09J07m87K65K33k35J79l61K80pj87J73
6031F9n4M9P3j65Q0j48k1J10N9p9j5J35l0j25J17m0n3J35j94K96k48j14N5J97
6055H9Q1lk32K10k45M1l3p7K17p6j19J57p3j48L24R2k20J15r1n9K20j31j97K58
6079A00k43J49l90K63M64j13m0j47k92L62r5j28J91k9j16J63n7n8J22NJ89j61
6101A39j19M9j01n8k4J77Q2l13M98k27k73O08m84j35J40N7K7k17K05J31k90K98
6123A70j7j74o7J97k67R0J15n4J05N2j92Q7Oj85J98j27p2K8L0L27l40j56J41J92
$$ y = [74, -193, 98, 60, -56, 276, 43, -186, -140, -33, -225, -67, 220, 16, 80, 218, 22, 66, -175, 172, 113, -270, -127, 36, -18, 99, -224, -28, -43, -72, -64, -94, -66, -72, 59, -239, 20, -176, -173, -183, -27, -225, 133, -92, -145, -100, -47, -173, -60, -81, 35, -126, -211, 128, -297, 163, -100, 109, 216, -271, -6, 227, -8, 171, -190, 90, 83, -104, 69, 15, 64, 137, -28, 52, -96, -117, -7, 52, -27, -42, 93, 63, -62, 55, 15, -38, 97, -97, 199, -49, -163, -108, 89, 170, 167, -65, 145, -100, -59, -92, -169, 48, -28, -147, 10, -63, -211, 113, 205, -15, 100, 9, -50, 170, 39, -158, 100, -143, 6, -384, -121, 343, 230, 190, 43, -249, 113, 18, -110, 81, 52, -64, 99, 42, -16, 106, 111, 300, 139, 20, 69, -32, -90, -114, 63, 145, -168, 330, 103, -170, 438, -46, -181, -41, 16, 43, -174, 31, 162, -128, 170, 153, -21, -88, 109, -158, -68, 47, -7, 98, 150, -42, 45, 51, -134, 64, -63, -135, -107, -77, 250, -90, -246, -105, 87]
6147H7J12j76R7K80m99M7K31l38L27k62L29J27l67R5j7j22K8N4J12j70j22K19
6169G2N3j06j68O5K52k74K15j68K0L29L9l47p0J18q2o8K90o6m28L44KJ14j20o9
6193e3j14J51K63k76K45Rl63K18l37J51J86K46l45l3OJ16n0L9j82K55P2j85P7
6216I6k69N9K22O7L0l88J50K21j77J3o8j5K49k61L38j26j44J84k45J7K51k19j45
6239a60J33J05P1p9j19J05k36K99O4n39L32J44k34KK15kj04k27J66J4K76k34j44
6262a52L38k87L4j4L48k10j78J25K26l07R7J72l71J47L8n6J14m3j23L88l81j53
6284b48K85k47J97o0K93j22p4k98L80j09J24k89L20j7j63j14K61k00K30Q2m41
6305b10P2m1K49o9j13Q5j27L54j77np9JoO7o7l4J28K16k28j10R0M3L2k04R5Q5
$$ y = [87, 199, 23, 120, 400, -99, -52, 179, -159, 168, -94, 235, 362, -5, 90, 73, -49, -21, 33, 145, -25, -147, 72, 125, 19, -149, -84, 168, -106, 109, -59, -39, 290, 329, -18, -88, 30, -52, -120, 170, 104, -324, 20, 22, 136, 16, -53, -167, -16, 247, -29, 216, 225, -138, 80, -257, -106, 80, 326, -19, -52, -46, 70, 20, 59, -123, 132, 204, 19, 96, -173, -114, 108, 175, 205, -183, -33, 188, 11, 24, -44, -59, 190, -71, 267, 141, -3, 181, -64, -47, 204, -15, -160, -27, 78, 149, 70, -49, 56, -180, 119, 183, -356, -24, 120, -114, -112, 103, 101, -3, -230, -64, -50, 226, -8, -152, 186, -101, -67, -81, 267, 57, -121, 4, 230, -77, 20, 192, -179, -32, 6, -50, 64, 21, -102, 286, -95, -248, 37, -210, -13, -73, 220, 98, 24, -274, 106, -3, 121, -168, 152, 135, -28, -142, 119, -81, 149, 231, -210, -138, -179, 70, 1, -112, -27, -154, 200, 23, 18, -61, -60, -66, 1, -66, -100, 28, 244, 16, -94, -4, 39, 71, -133, -38, 47]
6331D7J82j69J94r3k30O4O8K4k5k28n9L82K6l58K33j43J04j94J64n2N1j83K73
6354G8l34L12O9k18J89q2N9J06k64j9J36m1k3Mj38j17K88j60L68l76J27j44O4
6377a16J10J68Pj86J07k33oM5O3J60r4j31J93j55K77l98L49k49J15lJ63Pn2oj32
6402CK59k38m9mJ29k38N5K14l26K02P3o5j00J15J49j98K34m72n7L88m9k83K78
6425B0K38l62j05J01M5J28k64K20r9m7J69m45M35j07Q3j84J49j37R1J71k34L70
6447B36k57j40K03N3q9n5J5m1K56j17l27M60k62j34O2k3Q1j71J97j02J70N9j68
$$ y = [47, 229, 60, 254, 161, -69, -5, 63, 87, 62, -166, -225, 157, 183, -175, 58, -85, 19, -175, -11, -63, -12, -195, 78, -256, 56, 125, -93, 96, 14, 73, 179, -85, -104, 32, -9, -32, -28, -166, -283, 5, -155, 213, -163, -36, -180, -116, -6, 162, 169, -17, 90, -143, -149, -104, -41, 119, 25, -106, 87, -68, 209, -189, 160, -89, 26, 23, 186, 193, 141, 135, 3, 262, 24, -25, -29, 100, -138, -83, 131, -195, 7, 80, 15, -85, 30, 179, -19, 215, -257, -314, 74, 25, -258, 20, 258, -104, -209, -108, -63, 65, -199, 21, -78, -125, 44, -401, 34, -73, 10, -174, -25, -162, -71, 100, -134, 236, -21, -161, 42, 95, 6, -49, -34, -75, 181, 64, -263, 197, -65, -199, -137, -160, -79, -250, -53, -155, 15, 74, -94]
$$ [...]
8191A9
##END NTUPLES=NMR FID
##END=
