##TITLE=1H_DE_PH-Ala_sum
 200.13MHz,D2O.
 8 sc
 
 19.2.2026
##JCAMPDX= 6.0         $$ Bruker NMR JCAMP-DX V2.0
##DATA TYPE= NMR FID
##DATA CLASS= NTUPLES
##ORIGIN= UXNMR, Bruker Analytische Messtechnik GmbH
##OWNER= pz
$$ XWIN-NMR		Version 3.5
$$ Thu Feb 19 16:18:01 2026 Russian Standard Time (UT+4h)  she@DPX200
##.OBSERVE FREQUENCY= 200.1313
##.OBSERVE NUCLEUS= ^1H
##.DELAY= (6, 6)
##.ACQUISITION MODE= SIMULTANEOUS
##.ACQUISITION SCHEME= undefined
##.AVERAGES= 8
##.DIGITISER RES= 18
##SPECTROMETER/DATA SYSTEM= spect
##.PULSE SEQUENCE= zg30
##.SOLVENT NAME= D2O
##.SHIFT REFERENCE= (INTERNAL, D2O, 0, 14.3821)
##AUDIT TRAIL= $$ (NUMBER, WHEN, WHO, WHERE, WHAT)
$$ ##TITLE= Audit trail, XWIN-NMR		Version 3.5
$$ ##JCAMPDX= 5.01
$$ ##ORIGIN= Bruker BioSpin GmbH
$$ ##OWNER= she
$$ F:/spectra/data/she/nmr/H-C/1/audita.txt
$$ ##AUDIT TRAIL=  $$ (NUMBER, WHEN, WHO, WHERE, WHAT)
(   1,<2026-02-19 16:16:49.87 +0400>,<she>,<DPX200>,
      <created by zg, POWCHK disabled, PULCHK disabled
       configuration hash MD5:
       00 E9 B6 7A A2 85 ED C7 34 08 36 98 17 FE 4E 26
       data hash MD5: 16K
       7E 6C 77 E4 9F C8 24 CC AB 0C B3 0B CE 37 98 0E>)
$$ ##END=
$$ 
$$ hash MD5
$$ EA 42 28 4F 3C 09 5E 74 42 DF BD 3B FC 72 1C A1
##$RELAX= 
##$RELAX= 
##$RELAX= 
##$RELAX= 
##$RELAX= 
##$RELAX= 
$$ Bruker specific parameters
$$ --------------------------
##$DU= <F:/spectra>
##$EXPNO= 1
##$NAME= <H-C>
##$PROCNO= 1
##$TYPE= <nmr>
##$USER= <she>
##$AMP= (0..31)
100 100 100 100 100 100 100 100 100 100 100 100 100 100 100 100 100 100 
100 100 100 100 100 100 100 100 100 100 100 100 100 100 
##$AQSEQ= 0
##$AQ_mod= 1
##$AUNM= <au_zg>
##$AUTOPOS= <>
##$BF1= 200.13
##$BF2= 200.13
##$BF3= 200.13
##$BF4= 200.13
##$BF5= 200.13
##$BF6= 200.13
##$BF7= 200.13
##$BF8= 200.13
##$BYTORDA= 1
##$CFDGTYP= 0
##$CFRGTYP= 5
##$CHEMSTR= <none>
##$CNST= (0..31)
1 1 145 1 1 1 1 1 1 1 1 1 1 1 1 1 1 1 1 1 1 1 1 1 1 1 1 1 1 1 1 1 
##$CPDPRG= <>
##$CPDPRG1= <>
##$CPDPRG2= <>
##$CPDPRG3= <>
##$CPDPRG4= <mlev>
##$CPDPRG5= <mlev>
##$CPDPRG6= <mlev>
##$CPDPRG7= <mlev>
##$CPDPRG8= <mlev>
##$CPDPRGB= <>
##$CPDPRGT= <>
##$D= (0..31)
0 0.7 0 0 0 0 0 0 0 0 0 0.03 0 0 0 0 0 0 0 0 0 0 0 0 0 0 0 0 0 0 0 0 
##$DATE= 1771503409
##$DBL= (0..7)
120 120 120 120 120 120 120 120 
##$DBP= (0..7)
150 150 150 150 150 150 150 150 
##$DBP07= 0
##$DBPNAM0= <>
##$DBPNAM1= <>
##$DBPNAM2= <>
##$DBPNAM3= <>
##$DBPNAM4= <>
##$DBPNAM5= <>
##$DBPNAM6= <>
##$DBPNAM7= <>
##$DBPOAL= (0..7)
0.5 0.5 0.5 0.5 0.5 0.5 0.5 0.5 
##$DBPOFFS= (0..7)
0 0 0 0 0 0 0 0 
##$DE= 6
##$DECBNUC= <off>
##$DECIM= 32
##$DECNUC= <off>
##$DECSTAT= 4
##$DIGMOD= 1
##$DIGTYP= 9
##$DL= (0..7)
0 120 120 120 120 120 120 120 
##$DP= (0..7)
150 150 150 150 150 150 150 150 
##$DP07= 0
##$DPNAME0= <>
##$DPNAME1= <>
##$DPNAME2= <>
##$DPNAME3= <>
##$DPNAME4= <>
##$DPNAME5= <>
##$DPNAME6= <>
##$DPNAME7= <>
##$DPOAL= (0..7)
0.5 0.5 0.5 0.5 0.5 0.5 0.5 0.5 
##$DPOFFS= (0..7)
0 0 0 0 0 0 0 0 
##$DQDMODE= 0
##$DR= 18
##$DS= 0
##$DSLIST= <SSSSSSSSSSSSSSS>
$$ [...]
##$SUBNAM0= <"">
##$SUBNAM1= <"">
##$SUBNAM2= <"">
##$SUBNAM3= <"">
##$SUBNAM4= <"">
##$SUBNAM5= <"">
##$SUBNAM6= <"">
##$SUBNAM7= <"">
##$SUBNAM8= <"">
##$SUBNAM9= <"">
##$SW= 18.0517328524113
##$SWIBOX= (0..15)
0 0 2 0 0 0 0 0 0 0 0 0 0 0 0 0 
##$SW_h= 3612.71676300578
##$TD= 16384
##$TD0= 1
##$TE= 0
##$TE2= 300
##$TE3= 300
##$TEG= 300
##$TL= (0..7)
0 120 120 120 120 120 120 120 
##$TP= (0..7)
150 150 150 150 150 150 150 150 
##$TP07= 0
##$TPNAME0= <>
##$TPNAME1= <>
##$TPNAME2= <>
##$TPNAME3= <>
##$TPNAME4= <>
##$TPNAME5= <>
##$TPNAME6= <>
##$TPNAME7= <>
##$TPOAL= (0..7)
0.5 0.5 0.5 0.5 0.5 0.5 0.5 0.5 
##$TPOFFS= (0..7)
0 0 0 0 0 0 0 0 
##$TUNHIN= 0
##$TUNHOUT= 0
##$TUNXOUT= 0
##$USERA1= <user>
##$USERA2= <user>
##$USERA3= <user>
##$USERA4= <user>
##$USERA5= <user>
##$V9= 5
##$VALIST= <valist>
##$VCLIST= <CCCCCCCCCCCCCCC>
##$VD= 0
##$VDLIST= <DDDDDDDDDDDDDDD>
##$VPLIST= <PPPPPPPPPPPPPPP>
##$VTLIST= <TTTTTTTTTTTTTTT>
##$WBST= 1024
##$WBSW= 4
##$XGAIN= (0..3)
0 0 0 0 
##$XL= 0
##$YL= 0
##$YMAX_a= 84617
##$YMIN_a= -88907
##$ZGOPTNS= <>
##$ZL1= 120
##$ZL2= 120
##$ZL3= 120
##$ZL4= 120
##$ABSF1= 10
##$ABSF2= 0
##$ABSG= 5
##$ABSL= 3
##$ALPHA= 0
##$AQORDER= 0
##$ASSFAC= 0
##$ASSFACI= 0
##$ASSFACX= 0
##$ASSWID= 0
##$AUNMP= <proc_1d>
##$AZFE= 0.1
##$AZFW= 0.1
##$BCFW= 1
##$BC_mod= 2
##$BYTORDP= 1
##$COROFFS= 0
##$CY= -3
##$DATMOD= 1
##$DC= 2
##$DFILT= <>
##$DTYPP= 0
##$F1P= 0
##$F2P= 0
##$FCOR= 0.5
##$FTSIZE= 0
##$FT_mod= 4
##$GAMMA= 1
##$GB= 0.15
##$INTBC= 1
##$INTSCL= 1
##$ISEN= 128
##$LB= 0.25
##$LEV0= 0
##$LPBIN= 0
##$MAXI= 10000
##$MC2= 0
##$MEAN= 0
##$ME_mod= 0
##$MI= 1.114404
##$NCOEF= 0
##$NC_proc= 0
##$NLEV= 6
##$NOISF1= 3.799351
##$NOISF2= 2.8
##$NSP= 1
##$NTH_PI= 0
##$NZP= 0
##$OFFSET= 14.38212
##$PC= 1
##$PHC0= -3701.536
##$PHC1= 4.592316
##$PH_mod= 1
##$PKNL= yes
##$PPARMOD= 0
##$PSCAL= 0
##$PSIGN= 0
##$REVERSE= no
##$SF= 200.129724274929
##$SI= 16384
##$SIGF1= 3
##$SIGF2= 2
##$SINO= 400
##$SIOLD= 16384
##$SREGLST= <1H.CDCl3>
##$SSB= 0
##$STSI= 0
##$STSR= 0
##$SW_p= 3205.1282051282
##$SYMM= 0
##$S_DEV= 0
##$TDeff= 0
##$TDoff= 0
##$TI= <>
##$TILT= no
##$TM1= 0
##$TM2= 0
##$TOPLEV= 0
##$USERP1= <user>
##$USERP2= <user>
##$USERP3= <user>
##$USERP4= <user>
##$USERP5= <user>
##$WDW= 1
##$XDIM= 8192
##$YMAX_p= 0
##$YMIN_p= 0
$$ End of Bruker specific parameters
$$ ---------------------------------
##NTUPLES= NMR FID
##VAR_NAME=  TIME,          FID/REAL,        FID/IMAG
##SYMBOL=    X,             R,               I
##VAR_TYPE=  INDEPENDENT,   DEPENDENT,       DEPENDENT
##VAR_FORM=  AFFN,          ASDF,            ASDF
##VAR_DIM=   8192,          8192,            8192
##UNITS=     SECONDS,       ARBITRARY UNITS, ARBITRARY UNITS
##FACTOR=    0.0002768,     1,               1
##FIRST=     0,             0,               0
##LAST=      2.2672688,     0,               0
##MIN=       0,             -88907,          0
##MAX=       2.2672688,     84617,           0
$$ Real data points
##PAGE= N=1
##DATA TABLE= (X++(R..R)), XYDATA
0@%%%%%%%%%%%%%%%%%%%%%%%%%mRj2J4j4J4j4J4j5J9k3K6k9L2l6L9m4N0n2N6o3
$$ 0 0 0 0 0 0 0 0 0 0 0 0 0 0 0 0 0 0 0 0 0 0 0 0 0 0 -4 5 -7 7 -7 7 -7 7 -8 11 -12 14 -15 17 -19 20 -24 26 -26 30 -33
46c3P0p5Q2r1J00j12J23j35J50j66J86k10K36k70L14l71M45n44O88r19J324k151
$$ -33 37 -38 44 -47 53 -59 64 -71 79 -87 99 -111 125 -145 169 -202 243 -301 387 -532 792 -1359
68a359M454k1487p0515N4978K9556m8948L0126P3773q427j6484J6897l6468n1876
$$ -1359 3095 -18392 -88907 -33929 -4373 -53321 -23195 50578 42151 25667 42564 6096 -45780
81d5780J2528Q281j3669L6796M0645r331J4296J5705o4746n0029L6075o29m8434
$$ -45780 -33252 -24971 -38640 -1844 38801 29470 43766 59471 -5275 -55304 -19229 -19858 -68292
94f8292M0086P3385j0414j3001K7039l0371n4381J3986M525l6418L0120O5885
$$ -68292 -28206 45179 34765 21764 48803 18432 -35949 -21963 -17438 -53856 -23736 42149
106D2149n804j4912K5652k2256n5540J357L667l2255K2704O2664L702j1987K4663
$$ 42149 36345 21433 47085 24829 -30711 -29354 -25687 -57942 -35238 27426 31128 19141 43804
119D3804j1067m6464o974m002k6888K6245N4485o502q343L6947j1352o1525q354
$$ 43804 32737 -13727 -20701 -24703 -51591 -25346 29139 22637 14294 51241 39889 -21636 -29990
132b9990J0317l1739P219N8252J0929j2415L0965M969n1495k2400O808j9174J428
$$ -29990 -19673 -51412 -44193 14059 24988 12573 43538 48507 -2988 -25388 -18580 -37754 -36326
145c6326M1359J4029j289K8261l392m9733j6440O207k6635m530M6021K0167m290
$$ -36326 5033 19062 17773 46034 42642 -7091 -23531 -17324 -43959 -48489 -2468 17699 13409
158A3409K8328R107m5569k2522P096k3080j3407L8721K5136k845K1644J0327l8917
$$ 13409 41737 50844 5275 -17247 -10151 -33231 -46638 -7917 17219 14374 36018 46345 7428
171G428k4190K580k3163j4515L6826K7633n58K2409J6854l2950k6710Q60k1626
$$ 7428 -16762 -14182 -37345 -51860 -15034 12599 12041 34450 51304 18354 -8356 -7496 -29122
184b9122j9166L0119K8177n88J9107J8554k7993k8626j817j9396k0105K5959L0331
$$ -29122 -48288 -18169 10008 9420 28527 47081 19088 -9538 -11355 -30751 -50856 -24897 5434
197E434L428J9041K2449k1838k9575m321j7385k2783J8194K8427M999J5847K2112
$$ 5434 8862 27903 50352 28514 -1061 -5382 -22767 -45550 -27356 1071 6070 21917 44029
210D4029j6315k8561o778j6658k2289J4806K8376Q178J7072K4545j1754k7577
$$ 44029 27714 -847 -7625 -24283 -46572 -31766 -3390 4788 21860 46405 34651 7074
222G074q114j5911k5043Q636K6831P873J4090K4637p055k6805r670j3033k4682
$$ 7074 -1040 -16951 -41994 -33358 -6527 1346 15436 40073 33018 6213 -3457 -16490 -41172
235d1172M060K6661J2610J3150K3766j21k2759j4163j4941k1830l42J8731J1911
$$ -41172 -37112 -10451 2159 15309 39075 38954 16195 2032 -12909 -34739 -35081 -16350 -4439
248d439J6241K2637j395j9327j0044j4807k5204r43K1987J1568J1705K5710P346
$$ -4439 11802 34439 33044 13717 3673 -11134 -36338 -37281 -15294 -3726 7979 33689 41035
261D1035j9933j5820j0867k1314j0606J3783J6725J3491J8371P822j0442j4021
$$ 41035 21102 5282 -5585 -26899 -37505 -23722 -6997 6494 24865 32687 22245 8224
273H224j6188j9919n765J1148J2021J5652K2771Q626j1754j2030j3114k2517j2148
$$ 8224 -7964 -27883 -33648 -22500 -10479 5173 27944 36570 24816 12786 -328 -22845 -34993
286c4993R409J2817J1962J9946J2990p275j3576j2311j7924j2952M858J3820J4880
$$ -34993 -25584 -12767 -805 19141 32131 24856 11280 -1031 -18955 -31907 -27049 -13229 1651
299A651J7169J2889j941j1856j6482j7981j1975M7Q727J5309J8899J2024p16q280
$$ 1651 18820 31709 29768 17912 1430 -16551 -28526 -28479 -19752 -4443 14456 26480 25764 17484
313A7484j2949j8158j3728J60R603J3485J6285J4859L370q938j5384j5962j3333
$$ 17484 4535 -13623 -27351 -27191 -17588 -4103 12182 27041 30411 21473 6089 -9873 -23206
326b3206o067N524J4937J6777J2264N731l825j3386j6050j3148n936M536J3619
$$ -23206 -29273 -23749 -8812 7965 20229 25960 22135 8749 -7301 -20449 -26385 -21849 -8230
339h230J5209J2721Q696k790j5107j5663j1542r561j228J4158J6435J0847R154
$$ -8230 6979 19700 28396 25606 10499 -5164 -16706 -26267 -27495 -13337 3098 13945 23099
352B3099J732j1111j5795j1688r362j212J2283J3663J1723J1088K565j2366j4944
$$ 23099 24831 13720 -2075 -13763 -23125 -24337 -12054 1609 13332 24420 26985 14619 -325
365c25j0073j2087n979J1211J5523R343J1126P996r269j5400r186j1279p667R367
$$ -325 -10398 -22485 -28464 -17253 -1730 7613 18739 26735 17466 2066 -7120 -18399 -26066 -16699
379a6699J4690R021J2338Q710r753j4928p969j3005j0967P324J6036P381J1605
$$ -16699 -2009 7012 19350 28060 18307 3379 -4590 -17595 -28562 -21238 -5202 2179 13784
392A3784J3029n970j5083p077j0974j3285O191J3649P034J1105J4303n037j5169
$$ 13784 26813 20843 5760 -1317 -12291 -25576 -19385 -5736 1298 12403 26706 21669 6500
405F500o340j1577j5691K923J5344O329J0461J6963j440j4314n586r636j7255
$$ 6500 160 -11417 -27108 -24185 -8841 -2512 7949 24912 23472 9158 3572 -6064 -23319
418b3319K51J4595N563Q575J7643R24j4147o001q804j8819k472J4081N570P905
$$ -23319 -23068 -8473 -2910 5665 23308 24232 10085 4084 -4720 -23539 -26011 -11930 -6360 1545
432A545J9579M438j2622n881o799j9371m765J1953N652O033J9377O429j3298n257
$$ 1545 21124 25562 12940 7059 260 -19111 -23876 -11923 -6271 -238 19139 25568 12270 7013
446G013n458j9891q179J2262N613M199J9976J1204j1627o162l423j8629j1409
$$ 7013 1555 -18336 -26515 -14253 -8640 -4441 15535 26739 15112 8950 5527 -13102 -24511
459b4511R808N321L911J9164J1214j0714n175k078k0242j2641J0324N133O86K0185
$$ -24511 -14703 -9382 -5471 13693 24907 14193 9018 6940 -13302 -25943 -15619 -10486 -9800 10385
473A0385J5878r804o515J164j8035j7316P083P389O34J5773J5904n430o218n56
$$ 10385 26263 16459 9944 11108 -6927 -24243 -17160 -9771 -9137 6636 22540 17110 10892 10336
487A0336j7471j6529O481N873j496J7130J8597n155o608K412j4931j9343L319
$$ 10336 -7135 -23664 -17183 -11310 -12806 4324 22921 17766 11158 13570 -1361 -20704 -17385
500a7385N914k361J5103J9118l537n387L312j4897k1783M227P035n766J3546K3940
$$ -17385 -11471 -13832 1271 20389 16852 11465 14777 -120 -21903 -17676 -10641 -16407 -2861 21079
514B1079p75r824M534q258k3250m013Q164m78Q709J7450L646l013K445j2641k0850
$$ 21079 20304 10480 15014 6756 -16494 -20507 -12343 -12821 -4112 13338 16984 13971 16416 3775 -17075
529a7075O31M737p027J1285K4868Q90q160Q150n740k7150n980J0814l416M47K0971
$$ -17075 -16444 -11707 -18734 -7449 17419 18309 10149 18299 12559 -14591 -20571 -9757 -13173 -12726 8245
544H245J0495n462J701o514j8875n648L891m946N179K1409P911n285N551m051
$$ 8245 18740 13278 14979 8465 -10410 -16058 -12167 -17113 -11934 9475 17386 12101 17652 13601
558A3601k2566p829P030o416l66K2217J2141n783K084q48j8064r409K903o082
$$ 13601 -8965 -16794 -9764 -16180 -16546 5671 17812 12029 14113 13265 -4799 -14208 -11305 -17387
572a7387M16K2234J2167o698L579L308j8091j4117K449l908j656J8559J4045m081
$$ -17387 -16971 5263 17430 10732 14311 17619 -472 -14589 -12140 -16048 -17704 855 14900 10819
586A0819K425L595j4750j4326K32m106r46J7657J2227m691N817P377j6882j7870
$$ 10819 13244 16839 2089 -12237 -12005 -16111 -17057 600 12827 8136 13953 21330 4448 -13422
600a3422K113j682n036J3004J4695m84L105P319j3133j7487m97l14m497J0068
$$ -13422 -11309 -12991 -18027 -5023 9672 9188 12293 19612 6479 -11008 -11505 -11819 -16316 -6248
614f248J4667P89M587P058j3625j7491J494j536q454Q249J6484L189K576P547
$$ -6248 8419 9208 13795 20853 7228 -10263 -8769 -10305 -18759 -10510 5974 9163 11739 19286
628A9286j0050j6349p78j634q906P335J6070M210J901P259p893j4968j777k422
$$ 19286 9236 -7113 -7891 -9525 -18431 -11096 4974 9184 11085 18344 10451 -4517 -6294 -8716
642h716j1016N830J7424M953L07P795l746j4446m193k891q994L312J6704M666
$$ -8716 -19732 -13902 3522 8475 8782 16577 12831 -1615 -5808 -8699 -17693 -14381 2323 6989
656F989J281Q319k160j4159n527k709r563K130J4938N096J507R476M76j3680p022
$$ 6989 8270 16589 14429 270 -5257 -7966 -17529 -15399 -461 4635 6142 15618 16094 2414 -4608
671d608j790r214o1J3358O308J899R404J689j3117p960k041q611j753J1676P105
$$ -4608 -6398 -15612 -15673 -2315 3993 5892 15296 16985 3868 -4092 -6133 -14744 -16497 -4821 2284
686B284K571R240L142j1814p927j812q301m009J0244Q041K147Q992M165r972q128
$$ 2284 4855 14095 17237 5423 -2504 -4316 -12617 -16626 -6382 1659 3806 12798 16963 6991 -1137
701a137k676p957n743R063Q929L114P100N459p164q670k777q101n391O349Q169
$$ -1137 -3813 -11770 -17513 -8450 479 3593 10693 16152 8988 318 -2459 -10560 -15951 -9602 -1433
716a433L809P815N908o605p793l002p913p039N823Q345K780P598P232m701q450
$$ -1433 2376 10191 16099 9494 1701 -1301 -9214 -16253 -10430 -2085 695 8293 15525 10824 2374
731B374l100o415p593L165P817M068O621P499l299o193m833o888p420K633O557
$$ 2374 -726 -7141 -14734 -11569 -3752 316 6937 14436 11137 4944 111 -6777 -14197 -11564 -5007
746e007L705P019Q294j724p026l835o598q425J405O436M074O065Q202K43o377
$$ -5007 -1302 5717 14011 12287 5261 1426 -5172 -13597 -12192 -5756 -1682 4383 12585 12828 6451
761F451m264n898q323j016N599M766O030Q018J632m750n050o038p808j683M671
$$ 6451 2187 -3711 -12034 -13050 -7451 -2685 3345 11363 12995 8245 3195 -2843 -10651 -12334 -7663
776g663L597O233P967K152l780m187n903p971k955L908M056N207P864L777k570
$$ -7663 -4066 2167 10134 12286 8506 4319 -1584 -9555 -12510 -8602 -4546 661 8525 12302 9732
791I732m382n902p403l879K059L778N770P686M241j432l843n619p654m795R50
$$ 9732 5350 -552 -7955 -11834 -9775 -5997 -227 7459 11700 10268 6425 806 -6848 -11643 -10693
806a0693L929N724P084M923o7l617n721o942m926m19K796N904O837N210P17k847
$$ -10693 -6764 -1040 6044 10967 10900 7283 1562 -5380 -10306 -10725 -7929 -2025 4812 10022 10739 7892
822G892n098p082n393j276K554N399O414N592K014k240n439o181n481k571J596
$$ 7892 2794 -4288 -9681 -10957 -8403 -3004 3410 9002 11016 8776 3337 -2844 -8325 -10896 -9300
837i300N094O695N280K994j252n095o326n436l186Q43M977N907N585L821p02m867
$$ -9300 -4206 2489 7769 10763 9511 4416 -1910 -7346 -10532 -9689 -4712 1195 6780 10601 9899 5032
853E032n631n172m512K6M486N902N222M498O85m639n623m891n123r25M171N566
$$ 5032 -599 -5771 -10283 -10257 -5771 131 5353 9851 10536 5897 274 -4617 -9740 -10665 -6494 -928
869i28N334N007J259l966n444m485n727j866L954N176M503N588K435l616m894
$$ -928 4406 9413 10672 6706 1262 -3223 -8950 -10816 -6862 -1686 2817 8405 10840 7224 2330
884B330m576n614k857L086N132M156N751L432l074m860m004n875l993K868M899
$$ 2330 -2246 -7860 -10717 -7631 -2499 1657 7408 10840 7766 2906 -1098 -6973 -10966 -8098 -3199
899c199L819N744M264k445m531l717n659n035K054M927L332N646N388j678m614
$$ -3199 620 6364 10628 8183 3652 -65 -5724 -10759 -8705 -3778 -446 5200 10588 8910 4296
914D296l228n699n655J305M685K771N361O120r56m262k828n149o291M45M084K478
$$ 4296 1068 -4631 -10286 -8981 -4296 -1525 3836 9956 9000 4738 1910 -3239 -9530 -9085 -5001 -2523
930b523N201O624j48m208k161m905o898m39M238K087M655O869R19l967k056m476
$$ -2523 2678 9302 9154 4946 2785 -2120 -9018 -9457 -5219 -3132 1523 8392 9311 5344 3288 -1188
946a188p005j440L885J927M307P206J651l644j444m038p652j866L556J466L257
$$ -1188 -8193 -9633 -5748 -3821 486 7692 9343 5699 4255 217 -7435 -9301 -5745 -4279 -1022
961a022P725K665l289j631l200p571l127L358J438K782P506L359k756j128k757
$$ -1022 6703 9368 6079 4448 1248 -6323 -9450 -6092 -4654 -1872 5634 8993 6237 5109 2352
976B352p722l480K729R12K092P516M670k702j288j778p391m305K075P69J469P565
$$ 2352 -5370 -8850 -6121 -5209 -3117 4399 9069 6367 5079 3301 -4090 -8395 -6320 -5551 -4082 3483
992C483N209k221j449q87p022n272J504J091R51P126N400j361j237l03o523n884
$$ 3483 8692 6471 5022 4135 -2887 -8159 -6655 -5564 -4613 2513 7913 6552 5315 5012 -1511 -7395
1008g395R94P84L43O605N959j210n88L63o433o512M90J191m64O002O509m27p98
$$ -7395 -6401 -5617 -5274 1331 7290 6080 5492 5855 -578 -7090 -6600 -5409 -5873 129 6638 6211 5413
1025E413Q69n771o775j85R65o08M940O969K08m50Q35m769p188n44Q59j313M185
$$ 5413 6282 511 -6264 -6449 -5484 -6092 -1152 5817 6025 5575 6410 1641 -5547 -6091 -5232 -6545 -2360
1042b360P111J203l89J302m186p432r59N56j773L643P374J783q12J677l155p324
$$ -2360 4751 5954 5565 6867 2681 -4751 -5710 -5154 -6927 -3284 4090 5873 5061 6738 3583 -3741
1058c741j636L39j860K853P037K373m40J984k475p231k359L50k149J944P260K501
$$ -3741 -5377 -5038 -6898 -4045 2992 5365 4925 6909 4434 -2797 -5156 -4806 -6955 -5011 2249 4750
1074D750k18K302j604p135k743K70k308J151O602L225k2K468p61o922l295K02
$$ 4750 4532 6834 5230 -1905 -4648 -4378 -6686 -5535 1067 4292 4270 6738 5977 -945 -4240 -4038
1090d038k818R30O034L984j5K382j85o283l496j81k512n15O041M391n5K489M73
$$ -4038 -6856 -5926 108 4092 4077 6459 6274 -9 -3505 -3686 -6198 -6713 -672 3719 3664 6153 6626
1107F626n445m052m78k722r78N468M471L66K347J223m701m456o97k827j198M919
$$ 6626 1181 -2871 -3349 -6071 -7049 -1581 2890 3256 5603 6826 2125 -2331 -3028 -5855 -7053 -2134
1123b134M475M49K332K023m115m578j226k455j851L995M362R83K775K165l709
$$ -2134 2341 2790 5122 7145 3030 -1548 -2774 -5229 -7080 -3085 1277 2260 5035 7200 3491
1138C491m548j339k471j969L211M378J138K728K764l085m956j380k043k564K112
$$ 3491 -1057 -2396 -4867 -6836 -3625 753 1891 4619 7383 4298 -658 -2038 -4081 -6645 -4533
1153d533M531J583K213K890j951m697j696j729l329J867M169K064K333K978j825
$$ -4533 -2 1581 3794 6684 4733 36 -1660 -3389 -6718 -4851 -682 1382 3715 6693 4868
1168D868l956j787k202l498R52M567J794J968L482p78m022j976j884l648L77M103
$$ 4868 912 -875 -3077 -6575 -5623 -1056 738 2706 6188 5410 1388 -588 -2472 -6120 -5743 -1640
1184a640K298J750L401o4l443k402k195l353m7L143K372K056L549J08k944j855
$$ -1640 658 2408 5809 5745 2302 -100 -2295 -5648 -5695 -2552 -180 1876 5425 5533 2589 734
1200G34k513l488m67L010K148J840L627J228l166k263j653l641j504K535K517
$$ 734 -1779 -5267 -5734 -2724 -576 1264 4891 6119 2953 690 -963 -4604 -6108 -3573 -1056
1215a056J809L243J786j933k661j821l400j439J902J910K137L464J628j565j977
$$ -1056 753 3996 5782 3849 1188 -633 -4033 -5472 -3570 -1660 477 3941 5569 4004 2027
1230B027k086l714j973J932J758J620L553K442j450k053j582l141k785J061K245
$$ 2027 -59 -3773 -5746 -3814 -2056 -436 3117 5559 4109 2056 474 -2667 -5452 -4391 -2146
1245b146J847K763K664m79k182j837l157k294L83J568J839L016K649q9j464j696
$$ -2146 -299 2464 5128 4649 2467 630 -2527 -4821 -4438 -2870 -1031 1985 4634 4545 3081 1385
1261A385l246k735L30J389J581K981K706K08j405j841k788k814n05J471J581K643
$$ 1385 -1861 -4596 -4266 -2877 -1296 1685 4391 4599 3194 1353 -1435 -4249 -4754 -3283 -1702 941
1277I41K982M36r58j515k409k816j025P91J650K545K659J090n61j660k505k738
$$ 941 3923 4359 3401 1886 -523 -3339 -4364 -3573 -1923 622 3281 4371 3810 2150 -355 -3093
1293c093j177N22J220K576K963J326n26j291k092k889j682K24J157K188K866J614
$$ -3093 -4270 -3748 -2528 48 3011 4337 3811 2520 428 -2461 -4143 -3919 -2762 -574 2292 3906
1309C906o4j416j914k576j875j47R12K434K442J941M29j083j679k813j829o81
$$ 3906 3842 2426 512 -2064 -3939 -4086 -3174 -740 1702 3643 4072 2989 1310 -1503 -3332 -4013
1325d013R28J773K566J943P60q58j920k441k100n91M90J827K350K361R82m63j759
$$ -4013 -3085 -1312 1254 3197 3957 3099 1179 -1262 -3362 -3953 -3463 -1636 714 3075 4057 3594 1835
1342A835k437k110j038K60J590K259K270J088l04j557k090k022j635K11J661J928
$$ 1835 -602 -2712 -3750 -3490 -1900 359 2629 3717 3413 1856 -234 -2256 -3891 -3680 -2019 -91
1358i1K181J742l09j216j871k209j563l51J277J872K113J651K50j177j667k004
$$ -91 2090 3832 3523 2307 436 -1773 -3336 -3687 -2410 -538 1575 3226 3476 2299 632 -1372
1374a372j795n27J390J435K033K194M52j032j854j791j923q83J026J596J653K122
$$ -1372 -3167 -3694 -2304 -869 1164 3358 3810 2778 924 -867 -2790 -3673 -2647 -1051 602 2724
1390B724Q44q76j492j768k090r08Q36J328J655K220J117n88j225j796k362j169
$$ 2724 3568 2692 1200 -568 -2658 -3566 -2730 -1402 253 2473 3590 3002 1777 -19 -2381 -3550
1406c550O20J187J325K197J703p30j155j332k146j541N09J273J180K154J566l4
$$ -3550 -2930 -1743 -418 1779 3482 2752 1597 265 -1881 -3422 -2913 -1640 -460 1694 3260 3226
1422C226j144j485k105j502J0P15J337K106J676k04o54r88j839k111j1R72P56
$$ 3226 2082 597 -1508 -3010 -3000 -2285 -948 1158 2834 2630 1976 988 -851 -2962 -2973 -2001 -1245
1439a245J932K237K27r40r04j668k231n17N96J086J771K063L49n11n15j871k311
$$ -1245 687 2924 3151 2211 1307 -361 -2592 -3109 -2513 -1427 344 2407 2756 2245 1730 -141 -2452
1456b452k31M41P27J504K137Q32m92o92j655j980q95J86N20J602K222N64m5k37
$$ -2452 -2683 -2242 -1515 -11 2126 2958 2466 1774 119 -1861 -2756 -2570 -2050 -448 1774 2338 2293 2056
1474B056j545k217q91M04K99J063K499J084l27j62j462k125j078k37K72J348K017
$$ 2056 511 -1706 -2597 -2193 -1894 -831 1668 2752 2425 2263 801 -1324 -2402 -2639 -2367 -1019 998
1491I98J387j01q2p26k518j205J30j98R92K234J357On3o07k147j501l52j48Q92
$$ 998 2385 2284 2202 1476 -1042 -2247 -2117 -2315 -1323 911 2268 2274 2221 1614 -533 -2034 -2386 -2534 -1642
1510a642J912J507N79K89p84k174j407k06l70M72J961J641L50J93m51j612j867
$$ -1642 270 1777 2356 2645 1861 -313 -1720 -1926 -2296 -1824 137 1778 2128 2321 1870 258 -1609
1527a609n47k23M05J743J572N42M36j45j674j600n31o35J06J697J654O41L89N5
$$ -1609 -2156 -2379 -1974 -231 1341 1883 2319 2174 500 -1100 -1631 -2266 -2160 -463 1191 1832 2221 2276
1545B276j311k151o57n70j2J582J451J049N43K24j220j886p56o86k51J327J741
$$ 2276 965 -1186 -1843 -2413 -2425 -843 608 1657 2200 2424 1204 -682 -1438 -2124 -2375 -1048 693
1562F93N31R19K69j189j826q72o41l76R88J704J058Q39M49r25j675j139n93n44
$$ 693 1224 2143 2412 1223 -603 -1475 -2116 -2492 -1504 200 1258 2097 2546 1621 -54 -1193 -1786 -2330
1580b330P53J832Q91N84O64p63j711j118o99n11N01J603J222Q63P69o21j508j032
$$ -2330 -1577 255 1146 1730 2394 1631 -80 -1198 -1897 -2408 -1907 -304 918 1781 2550 1929 421 -611
1598f11p47r45L70J391J213P88Q01l51j515j039q68q83K27J574J034R52P61J48
$$ -611 -1358 -2303 -1933 -542 671 1459 2260 1909 394 -645 -1513 -2396 -2169 -595 439 1391 2152 2300
1616B300j457j196n32j056j06J028J311P64P53J12r46j174q93r13j73J144J091
$$ 2300 843 -353 -885 -1941 -2047 -1019 292 1056 1809 1921 975 -199 -1092 -2005 -2178 -1034 57
1633E7Q88J105L60j188j048r16r89l41Q68J051P52P92N81p21j065r63r19l23M64
$$ 57 945 2050 2410 1222 174 -742 -1731 -2072 -1204 -153 599 1391 1972 1251 186 -777 -1696 -2019 -1555
1652a555J388P21R76P69o71r54r90r77m85L50P67P67J177O40m77r50p88j034q55
$$ -1555 -167 554 1530 2299 1628 674 -316 -1293 -1778 -1428 -661 106 1283 1923 1446 496 -292 -1326 -2181
1671b181O26R57P98R04R88m25o59q36j081j009J81O45J073Q46P23R6o90q96q23
$$ -2181 -1555 -598 200 1104 2092 1667 1008 172 -909 -1918 -1737 -1092 -19 827 1550 1646 956 60 -763
1690g63q68rO49Q41R90Q72l7n22o10j140j075k33R15N05Q25J164L67p19p57r63
$$ -763 -1631 -1640 -991 -150 840 1712 1675 1153 543 -597 -1672 -1905 -990 -485 340 1504 1871 1152 395 -568
1710e68p96l41O28N67R86Q79K30p7o60j105j021l20J97N44Q92P87P82l36m79p23
$$ -568 -1364 -1705 -1077 -510 476 1355 1585 1508 848 -257 -1278 -1598 -1401 -857 35 822 1604 1268 789 66
1730F6r01n74QM66Q72J166M71n4p54l72j257o17j56N11P93Q85O09J64k46p95q30
$$ 66 -835 -1409 -1401 -935 -63 1103 1574 1520 766 394 -863 -1480 -1636 -1125 -332 553 1162 1326 1080 285 -545
1751e45o07n4K15P79P54O12K66m08n65q23q81j58L81N69N36J077K09l68m78o92
$$ -545 -1152 -1206 -991 -212 542 1154 1420 1012 447 -376 -1257 -1415 -1034 -465 71 1148 1357 989 511 -181
1771a81p57k76R0L90R47Q96K57r9m52r86p75m03J52K74O34R27O77J0n73m53r22
$$ -181 -938 -1214 -1124 -734 213 1109 1366 1267 815 -171 -946 -1349 -1197 -923 -289 638 1315 1325 752 299 -623
1792f23n02j61N12N84O38P25K10m80o14r02n72j32K40P58Q72M26K98k86o76n35
$$ -623 -1125 -1286 -774 -190 448 1173 1383 903 289 -613 -1185 -1317 -1077 -319 553 979 1277 991 315 -220
1812b20p53j87J15N38Q31O55K20Np90p65m55o47J20P63O22N73O94j76k33q41p30
$$ -220 -973 -1160 -1045 -507 324 979 1199 1204 414 -351 -806 -1453 -1333 -570 52 625 1319 1143 910 69 -661
1833f61m06J50J98Q73P06L16j8o38o82m61n20N0J63P06O82O88J58k93o73q71l24
$$ -661 -1067 -917 -719 154 860 1176 1158 520 -162 -623 -1143 -1093 -930 -224 458 1146 1304 1011 338 -533 -857
1854h57j21K19M97O11M84K87k14l22j153m62l30L20K62O73J088J00J23k85r70
$$ -857 -978 -759 -262 349 833 1120 906 584 -569 -1031 -1361 -1041 -779 -106 982 1082 1205 920 -50
1873e0p80j47K74P13J77N31N3k7l41n24p39m23R7N22P79K95M83M53l89n56p30
$$ -50 -830 -977 -703 10 187 718 771 744 403 -121 -860 -1283 -1186 -664 115 410 893 1346 957 401 -329
1894c29j062N49M4N82M85O32M8k75n77n42m26k13L58L62Q16L77K07l22m09o69
$$ -329 -1391 -842 -798 -216 269 901 949 674 97 -445 -871 -1084 -726 -364 452 829 1036 714 305 -364
1914c64l74l36M1N27O35M74M09j74l14p76n13k37L9M94O09O89J98j68k61o27o27
$$ -364 -738 -1074 -1033 -506 129 603 1012 838 524 -252 -765 -1002 -963 -469 140 829 1027 859 598 -29 -656
1935f56k03jL54M58N19M63j69k57n24m63l54j62L78M84O76K29L68n43n21l47m06
$$ -656 -859 -860 -506 -48 471 934 765 508 -16 -479 -833 -995 -617 -133 543 772 1140 597 76 -271 -677
1956f77m68L18P55K61M12L53k02m21m21o06k78K16N15M25O36Q5l19r0n43m93m13
$$ -677 -1145 -827 -72 189 601 954 752 331 -90 -696 -974 -758 -243 182 818 903 584 494 -49 -542 -955
1977i55J14L83M56M09L60j1l53m32m73k99kJ87N64N31M34r3j73l63o46m19o3L64
$$ -955 -841 -458 -2 407 767 756 403 -29 -502 -801 -803 -616 -52 479 913 820 647 284 -362 -781 -844 -480
1999d80K69K99M94L11k55n43l48m58o8R9M53O61J02J32k3k19l08q77p5L13J27
$$ -480 -211 88 582 893 638 95 -253 -711 -779 -680 -227 434 536 668 645 426 118 -759 -834 -521 -394
2020c94N26L77J92J03m65l78n33k08J37K31M64N28J65J3k13n37n23k67j0M7O36
$$ -394 132 509 701 804 339 -39 -572 -780 -643 -412 52 580 745 758 545 8 -515 -782 -792 -745 -109
2041a09M92J20K49k11m32k78m28p5J63M50L56K47k7J05l21p70l22J50R2L12L89
$$ -109 383 503 752 541 109 -169 -597 -672 -509 -59 297 544 517 622 301 -469 -791 -641 -549 -237 152
2062A52L81P1j48j18l39m06k42k20O01M40L02J02L3k70l90n21o4L7J29N30K41
$$ 152 533 604 456 338 -1 -407 -649 -869 -268 172 474 576 609 339 -51 -572 -636 -599 -470 60 301
2083C01K30K23l06k65m58k33p1J97J47O30J27L6j20l39n17J03l06j33N69L50K91
$$ 301 531 754 448 183 -275 -508 -579 -382 -235 395 522 558 438 99 -418 -315 -621 -754 -185 165 456
2104D56K31n1m29k57m24j57J1M52L55qK71P8k48l95k23m02J7M26K01M06L59k15
$$ 456 687 636 207 -50 -474 -631 -620 -168 187 179 450 528 280 -115 -338 -740 -723 -297 -96 310 669 454
2126D54N5j19o80J71m19K05LJ212l37l52M56m96n33l57J30n4P11K51J46K30l07
$$ 454 509 390 -290 -119 -538 -333 -330 882 545 193 649 153 -380 -737 -607 -661 50 301 447 677 370
2147C70l35m9n89o2K88L58K69K45K59j22n86r4m24k61K13K56K80L07J71Ro2o01
$$ 370 35 -14 -603 -665 -377 -19 250 495 754 632 46 -48 -472 -733 -520 -264 16 323 494 503 441 -160
2169a60o6k29j50L13K05J80N81n3j63n39l44l77J92K67K38K92J52K27j51l17o6
$$ -160 -226 -455 -605 -292 -87 93 674 621 458 -81 -425 -802 -610 -343 -105 187 339 566 415 98 32
2190C2l80k81K90J30K26N83M8j86l41q0o92O9L50K98J16J80L47O9l67o87N5n22
$$ 32 -348 -629 -339 -209 17 600 648 462 121 41 -651 -582 -232 66 182 362 709 778 411 -276 -221 -743
2212g43M11L7M67K90J32r2j71n64p5l28L28l3L60J28L68J09l20k93k43l10R7J39
$$ -743 -332 -295 172 462 594 502 331 -233 -308 -636 -308 -341 19 147 515 624 304 11 -232 -542 -445 -306
2234c06J44K65K76m7n3l65r2l16j08K59Q6M54J36K55k03k97l09j74k57J6O19n
$$ -306 -162 103 379 332 279 -86 -178 -494 -602 -343 -257 197 333 588 385 88 -221 -395 -652 -636 -17 -22
2256b2M96J38N0k69l30k80n96L40J51K51N42Q3n8j58l16n29J36P5o5P92j1j13
$$ -22 474 612 662 393 63 -217 -813 -473 -322 -71 471 554 496 338 22 -507 -371 -296 -361 431 420 307
2278C07O3R6n10m71J17j28M47n3M14J1J66j22l9j99m85K1K73j77K4J38J023q45
$$ 307 370 466 -44 -515 -398 -526 -79 -132 282 293 459 337 298 99 -386 -365 -92 -269 -245 -107 916 71
2300G1L75o98j133J210N10m24l17J188m45N22n72p20K47o57M65l59J058L63l0
$$ 71 446 -252 -1385 -175 335 -89 -406 782 337 859 287 -433 -186 -843 -378 -737 321 684 654
2319F54pj95K61j268K91PO88k49O26l39K8L16l06m51o72j19L17J27K06K06Q41
$$ 654 647 452 713 -555 -264 -257 431 182 808 469 497 813 507 56 -616 -735 -418 -291 -85 121 962
2340I62N6j107L74p63K54k42L84M35N1L50k84o79N17p29k80R37n19K51l44J434
$$ 962 1018 -89 285 -478 -224 -466 -82 353 404 754 470 -209 308 -421 -701 236 -283 -32 -376 1058
2360A058r47l12O14j220R2R24m36l9K90P00j01k20n15l4j66j60L17O0kJ016o78
$$ 1058 111 -201 413 -807 -715 209 -227 -266 24 724 623 403 -112 -146 -312 -472 -155 -95 -97 919 241
2381B41m30k13O4Q4P8k11j8O09o4P09p18R2k49o23O04lj24K77L68J49j61Mp18
$$ 241 -189 -402 -338 -254 -176 -387 -405 204 140 849 131 223 -26 -649 -45 -48 -172 105 473 622 461 465 -253
2404b53L53m14l67K62M00L46L70j7j26m60l64j13K30K31o90R58J17O6p8l82r1
$$ -253 100 -314 -681 -419 -19 327 697 680 554 94 -270 -383 -153 78 -612 346 463 529 451 69 -22
2425b2o48L94K8P83k47R1Q9j24J18l16l65k53K84L03L90j90j28N0j26O8l68r7
$$ -22 -670 -276 -248 535 288 379 468 344 462 146 -219 -472 -188 115 505 315 187 237 111 179 -189 -286
2447b86K74J6l56P95o0j09O2n59j20J40k08j03P83l70P42k67K02n86l00j27j57
$$ -286 -12 4 -352 443 383 274 336 -223 -343 -203 -411 -514 269 -101 641 374 576 -10 -310 -437 -594
2468e94L83K00K90J12J01m18J19l14k10J57j6J08L66P6N4j68j90l05k18J31M2
$$ -594 -211 -11 279 391 492 74 193 -121 -331 -174 -190 -82 284 360 414 246 56 -249 -467 -336 -294
2489b94J43M06M5k7O3m04j31J02o17L95P3N61j30J77L1k72j68k91J67j96j2M83
$$ -294 -151 255 300 273 336 -68 -199 -97 -714 -319 -246 315 185 362 393 121 -47 -338 -171 -367 -379 104
2511A04K12j36M47m07k62k31k66K08Q2L31J54J81K42l16m70J73l10l80L69J18
$$ 104 316 180 627 220 -42 -273 -539 -331 -249 82 236 417 659 343 -127 46 -264 -644 -275 -157
2531a57L31L02R2m32pk29j18l19l7M84q2M06L44j57l94k64M7l02J65J18L38m7
$$ -157 174 476 568 136 129 -100 -218 -537 -574 -90 -172 234 578 421 27 -237 -190 -492 -327 -209 129 82
2553H2L73j2o2m54k6j78N4K14k52N51K47r0j99m73J29k23J22K25o6p2M14M58n36
$$ 82 455 443 381 -73 -99 -277 -223 -9 -261 290 537 447 248 -225 -96 -319 -197 28 -38 -110 304 762 226
2576B26J6k02p57Q5J36J87O0O65n9l49m88M89j10m01K64J68j51P13m51L19l3q36
$$ 226 242 40 -717 -632 -496 -309 -249 416 357 8 -480 9 -101 -502 -238 -70 -221 492 41 360 327 -509
2598e09K06m61K87M72J67L65k55j52N8l5n52k51M70L00j71J96K78Q7m5j33n11
$$ -509 -303 -764 -477 -5 162 527 272 120 178 143 -409 -660 -190 110 -61 135 413 500 455 322 -189
2619a89k75m51J007K57J96l54j52M67q34K32k92K53n8L13L81J99k53k01k21m73
$$ -189 -464 -915 92 349 545 191 39 506 -328 -96 -388 -135 -193 120 501 700 447 246 25 -448
2639d48O6K0nL83M2M65k04J29J51o48p91J45J442j002K39M53J9j95j80k05n16
$$ -448 -382 -362 -367 16 58 523 319 448 599 -49 -840 -695 747 -255 -16 437 456 261 81 -124 -640
2660f40P2M62k38L45L23L39l40j36j06j15n09M8J98K26M64j56M7N4k47l29j21
$$ -640 -568 -106 -344 1 324 663 323 187 81 -34 -543 -495 -297 -71 393 237 284 338 91 -238 -359
2681c59J15K07K5J54R2L9J73r30J27J23J91k34j32Q70k05k04p5P05r60j10O21
$$ -359 -244 -37 -12 142 234 273 446 -484 -357 -234 -43 -277 -409 461 256 52 -23 682 -278 -388 233
2702B33j35m46M81L31j47J32j83j71%n28K39J68M8L18K87l95R2o15m2J11j69J89
$$ 233 98 -348 133 464 317 449 266 95 95 -433 -194 -26 22 340 627 232 324 -291 -333 -222 -391 -202
2724b02J40K92NR4M5m06l7l75J61J03m5L64K03l7J01m31j90R8r8J38j21L53j91
$$ -202 -62 230 235 329 374 -32 -69 -444 -283 -180 -225 139 342 305 406 -25 -215 -117 -215 -77 -198 155 -36
2747c6O14j28n94M4K0k53j48L33L27J51J21p2o3m27j39k00J18K57K57J18oK15
$$ -36 578 450 -144 -100 -80 -333 -481 -148 179 330 451 379 316 -111 -250 -450 -332 -75 182 300 294 509
2769E09K14p67N3l03j29L32K3M06O6o4p4l58m2l40N3K62Q4K51J32J06j80k71p6
$$ 509 723 -44 9 -294 -423 -91 -68 338 404 340 266 -92 -134 -474 -421 -159 -75 176 308 414 234 -37 -113
2792a13k46r1K80J06J90K32j98K3j16K13o19J52j03L18M2K67J47m25L08l15k94
$$ -113 -359 -450 -170 -64 126 358 160 183 67 280 -339 -187 -290 28 70 337 484 59 367 52 -242
2813b42Qr5J76J29K29O9O2k02l8k58j72J1J15K82P9pK80Nn34j81Q3m7k72K32N57
$$ -242 -234 -329 -153 -24 205 274 336 134 96 -162 -334 -323 -208 74 153 146 426 431 -103 -284 -201 -248 -520 -288 269
2838B69Q3P8J14k36j156M13M28k64L0O35k43M23m93m65K19p80N68O4J4Q49q65
$$ 269 352 430 544 308 -848 -435 -7 -271 -241 394 151 574 81 -384 -165 -945 -377 -313 -299 550 -315
2859c15Q93j93k96J2n28K07j40M41M7j49K86O0m43Q61j198J19M51j5lJ81j59O68
$$ -315 578 385 89 101 -427 -220 -360 81 128 -21 265 325 -118 743 -455 -336 115 100 97 278 119 787
2881G87m94J3p12m13P89k14l19J01J117o60K31k17l70J35o0M92J41o83R92l76
$$ 787 293 306 -406 -819 -30 -244 -563 -462 655 -5 226 9 -361 -226 -286 206 347 -336 656 280
2901B80Q3k25k07K2K47p18K30P62L40p28L63l77jk02j99J64J80J93J6J71k03O9
$$ 280 363 138 -69 -47 200 -518 -288 474 814 86 449 72 71 -131 -330 -166 14 207 223 394 191 260
2923B60n57K38p5q3R3K0M78K10k90j41j77m25N4L91p26Q95J97O9j61O9J7o70J28
$$ 260 -297 -59 -134 -217 -124 -104 374 584 294 153 -24 -449 -395 -4 -730 165 362 431 270 339 356 -314 -186
2946a86P1m36N94J46O00m87K6k45m34p3M41k63L56k00L11K72l16J63n55l76L25
$$ -186 -115 -551 43 189 789 302 328 83 -351 -424 17 -246 110 -90 221 493 177 340 -215 -591 -266
2967b66o4L52K91k05L39j91jj69l38O5j97L93l6K90J7m6J01k94k23j45J32J13
$$ -266 -330 22 313 108 447 256 255 86 -252 -187 -384 9 -27 263 280 234 335 41 -182 -327 -195 -82
2989h2J77qK24J33j36l51Mm08P0J13M00P5P8Lj35j98j23j94J40o9K91j3N37l43
$$ -82 95 87 311 444 308 -43 -39 -447 -377 -264 136 211 289 292 157 -41 -164 -358 -218 -287 4 -9 528 185
3013A85j95J40k80J0l26M27J44o5J18J99j46j74j75K31l34J28J71K38MN1j04k11
$$ 185 -10 130 -150 -140 -466 -39 105 40 158 357 211 37 -138 93 -241 -113 58 296 300 351 247 36
3035C6j02k70J7K47j44L48K41j6j62j40l93J64Q3q9J46o7L91j5R8l7k01l00j3
$$ 36 -66 -336 -319 -72 -216 132 373 357 195 55 -338 -174 -91 -180 -34 -101 290 275 373 336 135 -165 -178
3058a78p6K7J6L18m8K53J88l73k16m2M32n16Q2l43N76p6L75k11q10L92j10L78
$$ -178 -254 -227 -211 107 59 312 500 127 -89 -131 301 -215 -133 -476 100 24 399 188 -622 -230 -340 38
3080C8k86J85L41R4j94l05N19q0l25Q1l86L42K63K7M4l45M7l14m3J35K23l68M12
$$ 38 -248 -63 278 372 178 -127 392 312 -13 68 -318 24 287 314 358 13 60 -254 -297 -162 61 -307 105
3103A05J41j8k72n2J27l13k3J88L4K06M7L17l65j39mj98r7n4K37K74Q9J93r6j65
$$ 105 246 228 -44 -96 31 -282 -305 -117 -83 123 170 487 122 -17 -21 -219 -316 -370 -133 141 230 423 327 162
3127A62l80O6K73m42L14j15j03N55J05j46l79m91R6M45k96L63K81k58O6k57l16
$$ 162 -218 -152 121 -321 -7 -122 -225 330 435 289 -90 -581 -485 -40 -336 27 308 50 116 -141 -457
3148d57N89n90K61J82J35J0O9j75J60p0k95m4K%L50j3J14n2L64o44R2j20l30L81
$$ -457 132 -458 -197 -15 120 130 199 24 184 114 -181 -225 -223 -223 127 114 228 176 540 -104 -12 -132 -462 -81
3172h1K7O5Q0N7J94j55m42J80j45K42k90L94R6R4J32p14R9l0j65K30L29J3P1J1
$$ -81 -54 11 91 148 342 187 -255 -75 -220 22 -268 126 222 316 448 -266 -167 -197 -362 -132 197 210 281 292
3196B92k4l27n5j11J41k36J09K96J2K67l78L35j88k54P1k26M7J82P7M13n0k66
$$ 292 268 -59 -114 -225 -84 -320 -211 85 97 364 -14 321 133 -121 -50 -276 -229 -47 30 443 393 127
3218A27j65l15N89m57j76M44J26mK98l80L48j45n85p3P8L71k9M16j09j20m00%
$$ 127 -38 -353 236 -221 -397 47 173 169 467 87 435 290 -295 -368 -290 81 52 468 359 239 -161 -161
3240a61Q9n2j83L17K1N4K99j4l53j64K13k81M1J5J64K57k05K38j31j8k48K9j73
$$ -161 -72 -124 -307 10 31 85 384 370 17 -147 66 -215 -174 -159 5 262 57 295 164 146 -102 -73 -246
3263b46Q4J64J39J11j00O9j81j25o3k07J96n1K64R3J50j90q7j8l57j5jK99K36
$$ -246 -162 2 141 252 152 221 40 -85 -148 -355 -159 -210 54 147 297 107 20 2 -355 -370 -371 -72 164
3286A64n8J12K9j95ol03j11J71P8J98lJ92j02j13m7j40n6J24r5L11l2J2N9N0k09
$$ 164 106 218 247 52 46 -257 -368 -197 -119 79 76 268 166 53 6 -134 -190 -66 -161 150 118 130 189 239 30
3311C0m3m26K07o1L21k7P9j8J27l56J50l52K71j02K20K70j01j9o4k23Q6j80k20
$$ 30 -13 -439 -232 -293 28 1 80 62 189 -167 -17 -369 -98 -200 20 290 189 170 106 -117 -31 -211 -431
3334d31K57j0L28J00O7o6j22j62jk54O1J32J88J15lQ0k55J5k69nm9J99j04K29
$$ -431 -174 -184 144 244 311 245 123 -39 -40 -294 -233 -101 87 202 199 279 24 39 -230 -235 -284 -85 -189 40
3358D0K36j35n9l4l7k33r0Q9J75J01K90m6j87m0j95M6j56K94j84K13l1K22j24
$$ 40 276 141 82 48 11 -222 -312 -223 -48 53 343 297 110 70 -125 -79 -235 59 -125 88 57 279 155
3381A55m7k25J18j90r7J94k2J57P5n5r3p1j51O0r0r6N11Q9jR0j60j60j17j13J47
$$ 155 108 -117 1 -189 -286 -92 -114 43 118 63 -30 -101 -252 -192 -282 -378 133 222 221 311 151 -9 -126 -239 -92
3406i2nPK94P3J48k22k85j69M0P1J62j17J24J89j45J0J33l73nj27J10N6J44J40
$$ -92 -97 -90 204 277 425 203 -82 -251 -211 -140 22 -95 29 218 73 83 216 -157 -162 -289 -179 -123 21 161
3430A61K5N2j23k79j07K7J44J9J24K94j43ok05j04o4q0Q0O2K00J48L4r8j39O2
$$ 161 186 238 115 -164 -271 -244 -100 -81 43 337 194 188 -17 -121 -185 -265 -185 -123 77 225 259 161 22 84
3454H4k82j19J70J2O2K96j20J36j69r8r6L7l3p8J60L33J7l9j15j35r9j53j0P3
$$ 84 -198 -317 -147 -135 -73 223 103 239 70 -28 -124 -87 -120 -198 -38 295 312 273 158 23 -76 -229 -239 -166
3478a66J12K08p5P3J51k34j77qJ44l6k15L58Q5r3k8o3j97J09j3n7K24j4o8J81
$$ -166 -54 154 79 152 303 69 -108 -116 28 -8 -223 135 220 127 99 36 -161 -52 -65 -122 102 88 20 201
3502B01Pl8j48m7l71L75j91K35J47lL0j39k16j3J18j37Q4M8J06J39kk62J19j97
$$ 201 208 170 22 -25 -396 -21 -212 23 170 167 197 58 -158 -171 -53 -190 -106 -58 48 187 185 -77 42 -155
3526a55R7j12J10p3R5L04L2k05M3k59J20j29j49K25L06j31l2j04J9o1J7r8o7L2
$$ -155 -58 -170 -60 -133 -38 266 298 93 136 -123 -3 -132 -281 -56 250 119 87 -17 2 -59 -42 -140 -207 -175
3550a75K08K55k83K75j44p1l13On3K31J67J10j36J37j49j30N9k90J91k3k42M27
$$ -175 33 288 5 280 136 65 -248 -242 -295 -64 103 213 77 214 65 -65 -6 -296 -105 -128 -370 57
3572E7k1J07j10L0j30mp5K0O1K81j50R2M3j60k02N4M4o3p2J63J66q9L95l80j79
$$ 57 36 143 33 63 -67 -71 -146 -126 -65 216 66 158 201 41 -161 -107 -63 -126 -198 -35 131 42 437 57 -122
3597a22M1mJ00j11M5J31O9M5p9j02r8No8J65m0J63N9M6j59j43j01J10l5j77L73
$$ -122 -81 -85 15 -96 -51 80 149 194 115 13 -85 -80 -148 17 -23 140 199 245 86 -57 -158 -48 -83 -260 113
3622A13j30J36J6nk14J71k16N4p4K20O8L4o0J07j20j34n0k06J60J31o5J71J38
$$ 113 -17 119 135 130 -84 87 -129 -75 -149 71 139 173 113 220 100 -34 -84 -290 -130 1 -64 107 245
3645B45L4l90J48k25J03L3l0J91J01n6p3P0j49j23J8k08K85P0L7J6o0R4r3j87
$$ 245 279 -111 37 -188 -85 -52 -82 109 210 154 81 151 2 -121 -103 -311 -26 44 81 97 37 131 38 -149
3669a49j50J40PK49J4k6o4L0n7Q7m50J04J41O7K10J18j80J1q5k19m7J3J94n1L63
$$ -149 -299 -159 -152 97 111 85 21 51 -6 81 -369 -265 -124 -57 153 271 91 102 17 -202 -249 -236 -42 -93 270
3694B70j39R3r6j8k00j0J14j23j52L09j03L40j19k95J94l16J16p0R5K8J41J56
$$ 270 131 224 128 110 -90 -100 14 -109 -261 48 -55 285 166 -129 65 -251 -135 -205 -110 -82 59 215
3716B15n9j0r3m1q3j09n8K57j29L65Q9j60k07k6o5K02k39J92j07J31J56j87r0
$$ 215 156 146 53 12 -71 -180 -238 19 -110 255 344 184 -23 -49 -114 88 -151 41 -66 65 221 34 -56
3739e6J41k04j99K52J26m8J32j91J09J09j12p1j44O4l3K05J0j6n8n0M9k37P3p5
$$ -56 85 -119 -318 -66 60 12 144 -47 62 171 59 -12 -156 -92 -125 80 90 74 16 -34 15 -222 -149 -224
3763b24J09j19L33J20r0j8l1p7j48j01Q6R1J50J44k83K01k02k6j48m4Q9J89Q8
$$ -224 -115 -234 99 219 129 111 80 3 -145 -246 -160 -69 81 225 -58 143 -59 -85 -233 -277 -188 1 89
3786H9J14k9k0l9j58j67PR8J19n0K22k5m3j39P9j03k3j11K8P6K66j81R3p7m7j42
$$ 89 203 174 154 115 -43 -210 -203 -105 14 -36 186 161 118 -21 58 -45 -68 -179 -151 -75 191 10 103 26 -21 -163
3812a63n7J43J04MK27k10J39j66j54r5m1J71Rj4J91J29R9j31j90r2j32l7O5L26
$$ -163 -220 -77 27 31 258 48 187 21 -133 -228 -269 -98 -89 -103 88 217 316 185 -5 -97 -229 -266 -201 125
3836A25j36J62j07P6k3r9k46K51n3J00L8K0Q8k1k12Rm8j22r3L24r6J76M9j9j35
$$ 125 -11 151 44 120 97 -2 -248 3 -50 50 88 108 196 175 -37 -28 -76 -198 -291 33 -63 113 162 143 8
3861Hn6k4r6J03O1L5K09q6j25Q9j92O1l8Q3l9j29K16R1m5q7K4k00kp3j2NJ48K45
$$ 8 -48 -72 -168 -65 -4 31 240 154 29 118 -74 -13 -51 32 -7 -136 80 171 126 39 63 -137 -139 -212 -224 -219 -71 174
3889A74j10p2M6l2j48K11q6M7j7J38J94l90J05jo4k43J79M9J9l6L3J40o8qj16
$$ 174 64 -8 38 6 -142 69 -17 30 13 151 345 -45 60 59 -5 -248 -69 -20 -1 -37 -4 136 68 60 -56
3914e6j02k6J22K59m7j67J02R9j13j90m9J85k5R2p3J71k29m4J92j50l6j13J85
$$ -56 -158 -184 -62 197 150 -17 85 184 71 -119 -168 17 -8 84 11 182 -47 -91 101 -49 -85 -198 -13
3937a3J89j48J97nk16J17k55Q8j09J56LJ27R2j70O4k1j05j79o1OJ06O0J74n0Q6
$$ -13 176 28 225 220 4 121 -134 -46 -155 1 4 131 223 53 117 96 -9 -188 -249 -243 -137 -77 97 47 133
3962A33n7m2j35j78J44Q0O1J41j26J10l8j32Nn4J35m5k8J93j0Oj44J89k30n4n0
$$ 133 76 34 -101 -279 -135 -55 6 147 21 131 93 -39 -34 -88 47 2 -26 167 157 163 19 208 -22 -76 -126
3987a26K8Q9J37o1Q7P4j12j35k2k1r4J39K2J84j15k7mN9q1k37P7K37n7M11k85
$$ -126 -98 -9 128 67 154 228 116 -19 -41 -62 -156 -17 5 189 74 47 43 102 21 -216 -139 98 41 452 167
4012A67l8j53n0Q6j9o1KM0K28j14j7j23j54J21R1j74K20j93J57K2Q1p3j59j45
$$ 167 129 -24 -74 12 -7 -68 -66 -26 202 88 71 -52 -206 -85 6 -168 52 -141 16 38 119 46 -113 -258
4036b58O9L7J59o2J73q9P0J01k73k8n3M4n9p0L85j26Q9J27k52O6k17J3l4J62L8
$$ -258 -189 -152 7 -55 118 29 99 200 -73 -101 -154 -110 -169 -239 146 20 109 236 -16 50 -167 -154 -188 -26 12
4061A2%N1L7m9O6j19p6j49K36n3K77L8j01L2j88k7k54K27l9J48P1j18J64j55N0
$$ 12 12 63 100 51 117 -2 -78 -227 9 -44 233 271 170 202 14 -13 -267 -40 -79 69 140 22 186 31 81
4086H1K9k76R2l3J70L6q7J43r8M0j51R8j27l0J01R4J13j08J09k63J64k56J23j05
$$ 81 110 -166 -74 -107 63 99 12 155 57 97 -54 44 -83 -113 -12 82 195 87 196 -67 97 -159 -36 -141
4110a41K5K36Ql0j34R3j81L4j26m8M25k40K06j38J02j51M6n0R7j46R5L8R0m0J47
$$ -141 -116 120 128 98 -36 57 -124 -90 -216 -264 161 -79 127 -11 91 -60 -14 -64 33 -113 -18 20 110 70 217
4135B17k43j35P1k0K8N0R2j70L97j12j18j68J78k98K09k44K08O0R6k6Nj82J28
$$ 217 -26 -161 -90 -110 -82 -32 60 -110 287 175 57 -111 67 -231 -22 -266 -58 2 98 72 77 -105 23
4158B3k65J97O8j32J43J35j25J55j18r9n3r8k1Q0J49k7J84J8k72N7N3j22r8K15
$$ 23 -242 -45 23 -109 34 169 44 199 81 -18 -71 -169 -190 -110 39 12 196 214 -58 -1 52 -70 -168 47
4182D7j4K8q7J12j92J37p7j56J04J84j4J3pq2l0q6J16j41m8J82k4Q3P6l5m7Ln2
$$ 47 33 61 -26 86 -106 31 -46 -202 -98 86 72 85 78 -4 -34 -120 -4 -145 -193 -11 -35 48 124 89 42 45 -7
4209gj82q0J22J29N3K4J12p3j45p2j62K00M5M7j07K10pm1j55L6j09p2J48J59K9
$$ -7 -189 -269 -147 -18 35 59 171 98 -47 -119 -281 -81 -36 11 -96 114 107 66 -89 -53 -162 -234 -86 73 102
4234A02m1o9M0J21k76j13K4J67L3L2O5P4p8n9j14K33j25p7m8J99o5L0J08l4k54
$$ 102 61 -8 32 153 -123 -236 -212 -45 -12 20 85 159 81 22 -92 141 16 -61 -109 90 25 55 163 129 -125
4259a25M5j06n2J0pK84m8J40k55J96Jk57J48m5q4K99q0j14J14j69K5P5n0l8Q2
$$ -125 -80 -186 -238 -228 -235 49 1 141 -114 82 83 -174 -26 -71 -155 144 64 -50 64 -105 -80 -5 -55 -93 -11
4284a1J00O6j06L6j86%J7l5J51o4q8L52k02K6o1j27Q6j77P1rK30j04J31O2j06
$$ -11 89 155 49 85 -101 -101 -84 -119 32 -32 -120 232 30 56 -5 -132 -46 -223 -152 -161 69 -35 96 158 52
4309E2J06j67O6k39J15m7J95k26K00l9j85j3n4J59J50J3l8j33K47j64j1J05j16
$$ 52 158 -9 57 -182 -67 -114 81 -145 55 16 -169 -182 -236 -77 73 86 48 -85 162 -2 -13 92 -24
4332b4N4j5j87J09L26j65j17P0j51r9K11k90K66M1P7M7j35L0q4j06J13R8m5m9
$$ -24 30 15 -172 -63 263 98 -19 51 -100 -199 12 -278 -12 29 106 153 18 48 -36 -142 -29 69 24 -25
4356b5J94j29O9J67j31j97O5p5q8P7K50k45J66O4k22Rj45J57n4J40O0J07k33J97
$$ -25 169 40 109 276 145 -52 13 -62 -150 -73 177 -68 98 162 -60 -51 -196 -39 -93 47 107 214 -19 178
4380A78j47k95K88j21p3J71LJ42n9j09Jj98m9J23N1Q9O0J1Q4j19M7P3k8l33J52
$$ 178 31 -264 24 -97 -170 1 4 146 87 -22 -21 -219 -268 -145 -94 -5 55 66 150 31 78 151 123 -210 -58
4405e8o3K28l0l3P5r9j44l9K4Q1J00j06J44m4k2K77k62j15n7Q6Q0j2J3J64p3q4
$$ -58 -121 107 77 44 119 20 -124 -163 -139 -58 42 -64 80 36 14 291 29 -86 -143 -57 23 11 24 188 115 31
4431C1l9j25J04j5%J26q7j04L20j23j54O4m9k7J03kR8M3j93J78j43n6j38R5j55
$$ 31 -8 -133 -29 -44 -44 82 -5 -109 211 88 -66 -2 -51 -78 25 23 121 164 -29 149 6 -50 -188 -93 -248
4456b48k4L36LoJ40j16j19r4P5l3Q0Q9j3j12J25j39OM0j58J72j0J08j82J30J36
$$ -248 -272 64 67 61 201 85 -34 -128 -53 -86 -6 83 70 -42 83 -56 -50 -10 -168 4 -6 102 -80 50 186
4481A86k90J03j22K3J20j08R0Q6q4N9M0j61L9L1r7M2K1K64j44R6r6j41M7j76Q0
$$ 186 -104 -1 -123 -100 20 -88 2 88 4 63 103 -58 -19 12 -85 -43 -22 242 98 194 98 -43 4 -172 -92
4506i2o8N3L56q4q8m3M4q0j3K17l36J98m5O8O3j37P6j7j5j25R5N0Q2k30P7J02
$$ -92 -160 -107 249 165 77 34 78 -2 -15 202 -134 64 19 87 150 13 89 72 57 -68 27 77 159 -71 6 108
4532A08l7P0k93k3m7J02Q1K93k68j1JJ00j92K3m0p9K26N6q8K01l44J80O0j04L7
$$ 108 71 141 -152 -175 -222 -120 -39 254 -14 -25 -24 76 -116 -93 -133 -212 14 70 -18 183 -161 19 79 -25 12
4557A2K3m0l6K65k50K4j10J55j05m1J2R9j64J51K33K1k05K5l01K01j12P2oO1Q4
$$ 12 35 -5 -41 224 -26 -2 -112 43 -62 -103 -91 8 -156 -5 228 249 44 69 -232 -31 -143 -71 -77 -16 68
4582F8n0J89j89j25M0m7K08j12J24PJ42k02j16K13k48Q4P3o6L1oj09NM9r7J71
$$ 68 18 207 18 -107 -67 -114 94 -18 106 113 255 53 -63 150 -98 -14 59 -7 24 18 -91 -86 -37 -134 37
4607C7k32P9K31k19J50j16J94k98K74j22O8m9j56N03n20J37J01o8j78J02J61j34
$$ 37 -195 -116 115 -104 46 -70 124 -174 100 -22 46 -3 -159 344 -176 -39 62 -6 -184 -82 79 -55
4629e5Q8J0J62k19O0j11L7j42J46L0J33j31p5Q7M4j04L4j57K39j67l7K14j14M4
$$ -55 33 43 205 -14 46 -65 -28 -170 -24 6 139 8 -67 20 64 -40 -6 -163 76 -91 -128 86 -28 16
4653A6j1P9j50Q5k67J67J41m3j36J76P4R0k61j9j37L3k0l4K18Q6pq5L8j63J7p3
$$ 16 5 84 -66 19 -248 -81 60 17 -119 57 131 221 -40 -59 -196 -163 -183 -217 1 87 80 -5 33 -130 -113 -186
4679a86K69j20P0M7j14J75j62j84J16K07j69J60j17J5J59k9k10OO3N4m28k26R87
$$ -186 83 -37 33 80 -34 141 -21 -205 -89 118 -51 109 -8 7 166 137 -73 -67 -4 50 -378 -604 383
4702C83K3k10m75J19J99M56p60J75j14N53n01J59j60M08o30J9M78L81m15j98J26
$$ 383 406 196 -279 -160 39 495 -265 -90 -204 349 -152 7 -153 255 -375 -356 122 503 88 -110 16
4723A6j66M81l53r7LL82j86Q9J34L6J29n18K09k50k42K26k45R3J65p8q7o7M65
$$ 16 -150 331 -22 -119 -116 266 80 169 303 339 468 -50 159 -91 -333 -107 -352 -259 -94 -172 -259 -326 139
4746A39Q2l91k58J14K43K4L24q5k29L2J93o14N98k88P3K49m01N7K73J56p06M89
$$ 139 221 -170 -428 -314 -71 -47 277 192 -37 -5 188 -426 172 -116 -43 206 -195 -138 135 291 -415 74
4768G4r8L9j28Q2j15M87Kl06j07R5l69L99k79J62K35j85L09m04P3J50k05K35Q3
$$ 74 -24 15 -113 -31 -146 341 343 37 -70 25 -344 55 -224 -62 173 -12 297 -107 -34 116 -89 146 229
4791B29m31J32j88L99j22j51K56n8q8J2Q6j76J92j80N3K03p4l79J01J05J63j52
$$ 229 -202 -70 -258 141 19 -132 124 66 -22 -10 76 -100 92 -88 -35 168 94 -285 -184 -79 84 -68
4813f8L59m3l96L61j80Q5o7K12n12J86O1K41k66J15k04R1j34p7K47j29J00K76
$$ -68 291 248 -148 213 33 118 51 263 -249 -63 -2 239 -27 88 -116 -25 -159 -236 11 -118 -18 258
4835B58j2l55K19p1Q8j97m4J00J24k30K68k07j05J48l7j05K41j64O7P3N6n0r0
$$ 258 246 -109 110 39 127 -70 -114 -14 110 -120 148 -59 -164 -16 -53 -158 83 -81 -14 59 115 65 -25
4858b5J51k49j50J23K30m9K0o1ql3L6J3J20j27j53K48Q3k18J19k28J94j7J3J23
$$ -25 126 -123 -273 -150 80 31 51 -10 -18 -51 -15 -2 118 -9 -162 86 169 -49 70 -158 36 19 32 155
4882A55Q4k46j18J90m3jj28L20j86j68R0j03J02l5Kl4L4p0N7M1K17j21j03J1K05
$$ 155 239 -7 -125 65 22 21 -107 213 27 -141 -51 -154 -52 -87 -85 -119 -85 -155 -98 -57 160 39 -64 -53 152
4907A52k73Q1J42k34J07M0j40O4l1k4K68k50J78k18J24j06j67M26M1M5j61K9l6
$$ 152 -121 -40 102 -132 -25 15 -125 -61 -92 -116 152 -98 80 -138 -14 -120 -287 139 180 225 64 93 57
4930E7j79J63k18K03q5J86k82M24j89L6k51M8N9J11j01Q6lj87J70QJ4P2j76J54
$$ 57 -122 41 -177 26 -59 127 -155 269 80 116 -135 -87 -28 83 -18 68 65 -122 48 56 70 142 -34 120
4954A20k43K11mq5J24k11J52j62J22r8m8K61L8K3j17r2n8J0kj14J4J68R9M1j07
$$ 120 -123 88 84 -1 123 -88 64 -98 24 -74 -122 139 177 200 83 -9 -67 -57 -59 -173 -159 9 108 149 42
4979D2L0k18J28N9q4K63m38P1J86L8Lj29l8j9L09K49j11m28L13l0l41M24k53j34
$$ 42 72 -146 -18 41 -43 220 -218 -147 39 77 80 -49 -87 -106 203 452 341 -87 226 196 -145 279 26 -108
5003a08K37K74l36K97k36o3No6kM6Q7j86K33j91J05K42l87k04K58j81L00l35Q1
$$ -108 129 403 67 364 128 65 70 4 2 48 135 -51 182 -9 96 338 -49 -253 5 -176 124 -211 -130
5026a30J45K50m08M23J0k80j43j75R0j58N17r2j97K45R8k18k06K00p1J8R8m3J52
$$ -130 15 265 -143 280 290 10 -133 -308 -218 -376 141 49 -148 97 195 -23 -229 -29 -100 -82 16 -27 125
5049A25L20p29k36L53Q6J98Mq7j2J7K29l78J57N1o37P15j38k98J19K93%J43l6
$$ 125 445 -284 -520 -167 -81 117 121 34 22 39 268 -110 47 98 -539 176 38 -260 -141 152 152 295 259
5072B59l13j69P56m37L48m71p2M0K1N14o39J65K33j49N21n51k21L89K9P1k82o4
$$ 259 -54 -223 533 96 444 -27 -99 -59 -38 476 -163 2 235 86 607 56 -165 224 253 324 42 -22
5094b2k35K13j89K59j54L13NJ41o88K49O20m48m88R36m29J31q0J29l70j68L30
$$ -22 -257 -44 -233 26 -128 185 190 331 -357 -108 512 64 -424 512 83 214 134 263 -107 -275 55
5115E5l36L93q2K41J17m71o8R0o8m47L30m08N16j29J19K90l15K97j85m8J47o11
$$ 55 -281 112 30 271 388 -83 -151 -61 -129 -576 -246 -654 -138 -267 -148 142 -173 124 -61 -109 38 -573
5137e73M52L86n84N35k86L89m53L09m70M44N2j62J54l5k81m2L78l08J41L52J21
$$ -573 -121 265 -319 216 -70 319 -134 175 -295 149 201 39 193 158 -123 -165 213 -95 46 398 519
5158E19l94j50j3k3j90Q3q4J6J65J35%L1R7L4k72j02m9K7L56j49N0j55L28l00
$$ 519 125 -25 -38 -61 -251 -168 -252 -236 -71 64 64 95 192 226 -46 -148 -197 -170 186 37 87 -68 260 -40
5182d0K14j88j97K34k07K33j65L37m57J01K27l6k09K22M8J35k7l63n8O01j79n63
$$ -40 174 -14 -211 23 -184 49 -116 221 -236 -135 92 56 -153 69 117 252 225 -138 -196 405 226 -337
5204c37L08j8Q5R5O9j0j78l9L20j40k52M14m24PL10M1j38J90j96J96j78k87M02
$$ -337 -29 -47 38 133 202 192 14 -25 295 155 -97 317 -107 -100 210 251 113 303 107 303 125 -162 240
5227B40m53k00O13K31k53k25J97o1J84j20l66m4M40l50R5L74k14P8k2k35m2N5
$$ 240 -213 -413 200 431 178 -47 150 89 273 153 -213 -257 183 -167 -72 302 88 166 144 -91 -133 -78
5249g8P2j3M25j064K49O36j93J83k57M90l50j22j69m31J39O39l94K92p9j02J86
$$ -78 -6 -19 406 -658 -409 227 34 217 -40 450 100 -22 -191 -622 -483 156 -238 54 -25 -127 59
5270E9J11J34k93O1k05j53K39J55l37K09n7QK14j25j31K97l67J14L37l01Mok7
$$ 59 170 304 11 72 -133 -286 -47 108 -229 -20 -77 -69 145 20 -111 186 -181 -67 270 -31 -27 -33 -60
5293f0m9K39k27j07Q4R4l6O42n75K06m09K10j23P3j22K0M81m92K10J97l74M45
$$ -60 -109 130 -97 -204 -120 -26 -62 580 5 211 -198 12 -111 -38 -160 -140 341 -151 59 256 -118 327
5315C27j95j79N7J47J16j57J66N1j71k67Km8K77k79J01O4K5R6j62L96m97M4kL9
$$ 327 132 -47 10 157 273 116 282 333 162 -105 -103 -151 126 -153 -52 12 37 133 -29 367 -130 -86 -88 -49
5339d9j14K17j55J76R0n0k14J04Q7k66K85l05R6O6J40Pl25l8J41J73l66L82J84
$$ -49 -163 54 -101 75 165 115 -99 5 92 -174 111 -194 -98 -32 108 115 -210 -248 -107 66 -300 82 266
5362B66l54K40n9j20l3J76K10l55L0k18K67p0k2K46m10L21j18j15K4p0Q6JK00
$$ 266 -88 152 93 -27 -60 116 326 -29 1 -217 50 -20 -42 204 -206 115 -3 -118 -94 -164 -78 -77 123
5385A23j56J08j76q7Q0j33K40n0R2J40j44k01k4L9K21k96L95j11Pj02K27k50n7
$$ 123 -33 75 -101 -188 -108 -241 -1 -51 41 181 37 -164 -188 -149 72 -224 171 60 67 -35 192 -58 -115
5408a15K30k64J32Q0j74j10L60j97O8J09j6j64j4J66j31K06q0pK9j39q6k02O2
$$ -115 115 -149 -17 63 -111 -221 139 -58 10 119 103 -61 -75 91 -40 166 86 79 108 -31 -117 -319 -257
5431b57L07j89K02J50j23r4Q2k53k0M1J9J43j2NJ31k02j74L36o0j57J38R9j62
$$ -257 50 -139 63 213 90 -4 78 -175 -195 -154 -135 8 -4 1 132 -70 -244 92 32 -125 13 112 -50
5454e0m5p7L20L1k95J29j13K35J44k20k5k1M1j1j09M2L14j69k7o4J05j65J39l1
$$ -50 -95 -172 148 179 -116 13 -100 135 279 59 34 13 54 43 -66 -24 290 121 94 30 135 -30 109 78
5478G8k39J06K6J24j33K42l24K58j48M4k91M55k37k24K57K16Lk71J59L2m34K06
$$ 78 -161 -55 -29 95 -38 204 -120 138 -10 34 -257 198 -39 -263 -6 210 213 -58 101 133 -301 -95
5500i5N8M2j14N1J31J15m91J26L77m28J17K60l91p6J25P0K12j61J24K12l17q4
$$ -95 -37 5 -109 -58 73 188 -303 -177 200 -228 -111 149 -242 -318 -193 -123 89 -72 52 264 -53 -137
5522a37J22k3L25m01Q6j84K88l4L8j73K52k10J59r4L82m5m26J40k95o9K98J14
$$ -137 -15 -38 287 -114 -28 -212 76 42 80 -93 159 -51 108 14 396 351 -75 65 -230 -299 -1 113
5544A13K86m4k38K51j39n83P6J72k7J56jK33k99J80K17k02j29J84m44N07m95O31
$$ 113 399 355 117 368 229 -354 -278 -106 -133 23 22 255 -44 136 353 151 22 206 -238 269 -226 405
5566D05n4k70K33o39J41l23N77n9K47l91L4N3LLK5l66L86j67J28J17m00O47l21
$$ 405 351 81 314 -325 -184 -507 70 11 258 -133 -99 -46 -43 -40 -15 -381 5 -162 -34 83 -317 330 9
5589IJ52k68K4N74m39K68j04%k25P4L53l89LM0P9k21l15R97p12j95Q17o47j83
$$ 9 161 -107 -83 491 52 320 216 216 -9 65 418 29 32 72 151 -70 -385 612 -100 -295 522 -125 -308
5612c08J02l5K8M43k50j8k02O66m51J52m29O7J15M05k91J85j51K75l31J99j90
$$ -308 -206 -241 -213 230 -20 -38 -240 426 -25 127 -302 -235 -120 285 -6 179 28 303 -28 171 -19
5633a9q9J38p8k44K92k39K72m0k36k3M22j58k9l05P27kk28k06P1j05q2J33L09
$$ -19 -108 30 -48 -292 0 -239 33 -7 -243 -266 156 -2 -31 -336 391 389 161 -45 26 -79 -161 -28 281
5656B81l32K0K61l24J83j70j83J41O3P4K04j07M25k04l93Q4k71J87J30r1J00M0
$$ 281 -51 -31 230 -94 89 -81 -264 -123 -60 14 218 111 536 332 -61 23 -248 -61 69 -22 78 118
5678A18k55K62m7j16q8J09k00p8P75o20N24o2m05R5p2L8k7K17m8l98N95o02K43
$$ 118 -137 125 78 -38 -126 -17 -217 -295 480 -140 384 322 -83 12 -60 -22 -49 168 120 -278 317 -285 -42
5701d2J34%k19N49l87J39l07j21O32m09J27J51j97j63K46K64r22R07JQl07J22
$$ -42 92 92 -127 422 35 174 -133 -254 378 -31 96 247 50 -113 133 397 -525 382 383 391 84 206
5723B06n65j0M27k0M9k0K08N3j99n38K13J81k50J12K9J81m02J02M96k40K91n17
$$ 206 -359 -369 58 38 87 67 275 328 129 -409 -196 -15 -265 -153 -124 57 -345 -243 253 13 304 -213
5745b13J18J56R3j61m29K98O2q6J30j36m9K4N39k24q5m0K07l26K33L23l31n0n1
$$ -213 -95 61 154 -7 -436 -138 -76 -162 -32 -168 -217 -193 346 122 37 -3 204 -122 111 434 103 53 2
5768BJ17k39N43m19K75j08j33K59l03r1K58j85O8p8J72l57J26l59M28P4J43l37
$$ 2 119 -120 423 4 279 171 38 297 -6 -97 161 -24 44 -34 138 -219 -93 -452 -24 50 193 -144
5790a44N22J37n70o9q0k22K20k16N87K69l48j84n6n8R8J38L06m9R4k31j91j32
$$ -144 378 515 -55 -124 -204 -426 -206 -422 165 434 86 -98 -154 -212 -114 24 330 281 375 144 -47 -179
5812a79j06N24l23m4j41O1m8J47L41p8j26m40N66l1l18K22k87K72j46K5KLK97
$$ -179 -285 239 -84 -128 -269 -208 -256 -109 232 154 28 -412 154 123 -195 27 -260 12 -134 -109 -107 -104 193
5835A93J44Qj93j52j30J50Q5Pj69n2L1J15j61J45l0J12j5J05p8j66J08m00K8J11
$$ 193 337 345 152 0 -130 20 105 112 -57 -109 -78 37 -124 21 -9 103 88 193 115 -51 57 -343 -315 -204
5859b04R6J78r3lOM3N0m7k69J40k7J71R5j07p5p9K71j85J35j10K9J8P5M3j25J05
$$ -204 -108 70 -23 -26 -20 23 73 26 -243 -103 -130 41 136 29 -46 -125 146 -39 96 -14 15 33 108 151 26 131
5885A31j11q8P8j15J17j11L1J48J05k87p2K14l21J76L0K43q4j42L5m7M6P5l74
$$ 131 20 -68 10 -105 12 -99 -68 80 185 -102 -174 40 -281 -105 -75 168 84 -58 -23 -70 -24 51 -323
5908c23K75rk8L2M3N3q8R1k44N2K13o3K22k36KK03j54K06k54M30m12L5l6K05j32
$$ -323 -48 -57 -85 -53 -10 43 -45 46 -198 -146 67 4 226 -10 -8 195 41 247 -7 423 11 46 10 215 83
5933H3J17k11j32n2O9L7j5J65k6J38l25J39Q9j35j13M59l76m8J28j3K45k27J99
$$ 83 200 -11 -143 -195 -126 -89 -104 61 35 173 -152 -13 76 -59 -172 287 -89 -137 -9 -22 223 -4 195
5956A95J99n43m8K25qj94J00k18K74K50k68j40o3K05K4j89O99n95R7J28k78j36
$$ 195 394 -149 -197 28 20 -174 -74 -292 -18 232 -36 -176 -239 -34 -10 -199 500 -95 2 130 -148 -284
5978b84M59o37N95K02n43K01L08n5k06m61L27L85o11M81l66M35N32p85N4L1m60
$$ -284 175 -462 133 335 -208 -7 301 246 40 -421 -94 291 -320 161 -205 230 762 -23 31 62 -398
5999c98M93k91N74l31j11N7R4J80l82J83l07m1J93L99j16M34n00J92l88K27L2
$$ -398 95 -196 378 47 -64 -7 87 267 -115 68 -239 -280 -87 312 196 630 130 322 -66 161 193
6020A93m07o1K35l2p1O1N41m85L62m11N57l37q9M3K4O0J3m50J50J89k18L50k15
$$ 193 -214 -275 -40 -72 -143 -82 459 -26 336 -75 482 145 56 99 123 183 196 -254 -104 85 -133 217 2
6043BJ40J54l27J05l82K90K31j22j10m28M67P2J63q2l71L59m97O46K5l53K98l67
$$ 2 142 296 -31 74 -308 -18 213 91 -19 -447 20 92 255 173 -198 161 -336 310 335 -18 280 -87
6065h7K62J13l24o4R3k67M03l94J25K93j94k1Q9K75n39r6J85N02n69L94j38jj57
$$ -87 175 288 -36 -100 -7 -274 129 -265 -140 153 -41 -62 27 302 -237 -333 -148 354 -215 179 41 40 -117
6088a17j51L64k02j62o4J40L66k67j29o0K95k03o3K56l72P13k22l4K08n06M42
$$ -117 -268 96 -106 -268 -332 -192 174 -93 -222 -282 13 -190 -253 3 -369 344 122 88 296 -210 232
6109B32j11J4n35O31m45l35Q08k95L90p12k0N49K01l86n00O43P5K12p13K25M62
$$ 232 121 135 -400 231 -214 -549 259 -36 354 -358 -378 171 372 -14 -514 129 204 416 -297 -72 390
6130C90k31o03K21L61J37j75j62j16L91M16j028N24l19N76p32J029p16kmL88k89
$$ 390 159 -444 -223 138 275 100 -62 -178 213 629 -399 125 -194 382 -350 679 -37 -39 -43 345 56
6151E6k05L26J65o96K42O20j034J243o44m15j40R41k73p51K97j43R8K98k48N16
$$ 56 -149 177 342 -354 -112 508 -526 717 73 -342 -482 459 186 -565 -268 -411 -313 -15 -263 253
6171B53l66OL88J66k36N82o39m7j5m39O95k70k59N21o66O34K62m98L49j98K0p2
$$ 253 -113 -107 281 447 211 793 154 107 92 -347 348 78 -181 340 -326 308 570 72 421 223 243 171
6193A71O2m53l36J238m21o50K30j08P80n28j08k51N86n15O93l95r6O28l32j17
$$ 171 233 -220 -556 682 261 -389 -159 -267 513 -15 -123 -374 212 -303 390 -5 -101 527 195 78
6213G8k62K60j18j07M75j59n63K88K58n92P54Oj43l03L81K07o02R3m73K77M03
$$ 78 -184 76 -42 -149 326 167 -396 -108 150 -442 312 318 175 -128 253 460 -142 -49 -522 -245 158
6234A58K76n00L52r9j67J47m0m49o9O9L86J05k12k57k4J89J31N5n0J3j79M96J69
$$ 158 434 -66 286 187 20 167 127 -322 -391 -322 64 169 -43 -300 -324 -135 -4 51 1 14 -165 331 500
6257E00m99k25J63M58n38k35L72Q6r6r1M71j16L4M36o27J64l95KM9M39m18L1K05
$$ 500 1 -224 -61 397 -141 -376 -4 82 -14 -105 366 250 284 720 93 257 -138 -136 -87 352 -66 -35 170
6280A70j33j64N5K24m4l87L67P8l98O5O33o57L17l6m24O63m40J0L08j052O63K28
$$ 170 37 -127 -72 152 108 -279 88 166 -232 -167 466 -191 126 90 -334 329 -111 -101 207 -845 -182 46
6302D6L34n04j1n9K71l90M4L17k4Q4j80J7R9k99K09q3J10k04J60J23l7j54pJ00
$$ 46 380 -124 -135 -194 77 -313 -269 48 24 108 -72 -55 44 -255 -46 -129 -19 -223 -63 60 23 -131 -138 -38
6326c8q2K6J08J4J5n0P8j42K44j90J9J46k25J62o2k7N1j27l42M80j32N3O9kj80
$$ -38 -120 -94 14 28 43 -7 71 -71 173 -17 2 148 -77 85 23 -4 47 -80 -422 58 -74 -21 48 46 -134
6351a34k81J31j56%NQ17q7J21m50M62n34j68K43m6l50N50j78N87j90j18P2j03
$$ -134 -415 -284 -440 -440 -435 382 295 416 -34 428 -106 -274 -31 -77 -427 123 -55 532 342 224 296 193
6373A93q2K71j39k20K80m48M00q0m51L75J36k86L58m32Nj91K43M05k98k24M74
$$ 193 111 382 243 23 303 -145 255 175 -276 99 235 -51 307 -125 -120 -311 -68 337 39 -185 289
6394B89o70N94k47j80K0J90nK24o26m2J76M96p06O04j51j70k69L80qp9J80k19
$$ 289 -381 213 -34 -214 -194 -4 -9 215 -411 -453 -277 219 -487 117 -34 -204 -473 -93 -101 -180 0 -219
6416b19J91K69J85k12P0o44L90q0l44j34O32K14j82N3m16M01k39J72O75n19j62
$$ -219 -28 241 426 214 284 -360 30 -50 -394 -528 104 318 136 189 -227 174 -65 107 782 263 101
6437A01k3k49R3j4j9Q6M14q20P88q46N49R7m89N49m09J89K5l26K50M98p49k3O41
$$ 101 78 -171 -78 -92 -111 -25 389 -431 357 -489 60 157 -332 217 -192 -3 22 -304 -54 444 -305 -328 313
6460C13k8m95J73J91l22m53L35J68J15K21n42J72O28n47kl64J78J0K97K80K94
$$ 313 285 -210 -37 154 -168 -621 -286 -118 -3 218 -324 -152 476 -71 -73 -437 -259 -249 48 328 622
6481F22j111j17J64J253q53k18o7O55k5m3j68p7M67J97j197M32P3L6M59k58M1
$$ 622 -489 -606 -442 811 -42 -260 -327 328 303 260 92 15 482 679 -518 -86 -13 23 482 224 265
6502B65k86l60O32j20l86J76j21L76n67N96N27o53J20l74O4j77J27k2j18Q55o34
$$ 265 -21 -381 251 131 -255 -79 -200 176 -391 205 732 79 199 -175 -111 -288 -161 -183 -301 554 -80
6523h0j75k78M98Nn42M25J51L04n7K38q45M93m68O28m43k54N50j69M24m88Nj10
$$ -80 -255 -533 -35 -30 -572 -147 4 308 251 489 -356 137 -331 297 -146 -400 150 -19 405 -83 -78 -188
6545a88m3j50Q2J66M26l26p82M75k08P69j96p87O27k38j17J005k32q3N3r14P78
$$ -188 -231 -381 -299 -133 293 -33 -815 -340 -548 221 25 -762 -135 -373 -490 515 283 200 253 -661 117
6566A17R5n26M96L9j76M72k48rP8N13j189K61j29P66q17O24j02J4l56M44K3j247
$$ 117 212 -314 182 221 45 517 269 260 338 851 -338 -77 -206 560 -257 367 265 279 -77 367 390 -857
6588h57J442l97l99J48J08J90j93K4J34j67j77PK26r7l89K63K7N8P8J56k74N2
$$ -857 585 188 -211 -63 45 235 42 66 200 33 -144 -137 89 -8 -397 -134 -107 -49 29 185 -89 -37
6610c7j89R3J21m5p3J18m4K4K46j24j10J21j49p4J26j61L64j55k0k3j79J15M5
$$ -37 -226 -133 -12 -57 -130 -12 -56 -32 214 90 -20 101 -48 -122 4 -157 207 52 32 9 -170 -55 -10
6633a0KJ01K3j99Q5j39J44o0N3O9qN5j17p9J96m8p7ML5o9J32n9J6N7n0K3N3k55
$$ -10 -8 93 116 -83 2 -137 7 -53 0 69 61 116 -1 -80 116 68 -9 -5 30 -39 93 34 50 107 57 80 133 -122
6661a22L1O0MP6j48LJ10j72J60L8p9lJ12j48M2J5K6p5k5N5K35j22p7P5rK3o3J7
$$ -122 -91 -31 -27 49 -99 -96 14 -158 2 40 -39 -42 70 -78 -36 -21 5 -70 -95 -40 195 73 -4 71 62 85 22 39
6689C9k02J29n2J1N9k9N5J52j85L4J74j16q0L9k8j05K61k08k0P2j39J82k4M8k32
$$ 39 -163 -34 -86 -75 -16 -45 10 162 -23 11 185 69 -11 28 0 -105 156 -52 -72 0 -139 43 19 67 -165
6714a65PN6K12j65l7k09L63R1j7j76Q2J66j49o2K3q9Q1nK29k06R6j09k11M28q7
$$ -165 -158 -102 110 -55 -92 -301 62 153 136 -40 42 208 59 -3 20 -69 12 7 236 30 126 17 -194 234 147
6739A47j66J7N0j06nQ0L1N4j32P3k2Jo3P2j94K28K8k03K23j93J56j53Q1j94J40
$$ 147 -19 -2 48 -58 -63 17 48 102 -30 43 21 22 -41 31 -163 65 93 -110 113 -80 76 -77 4 -190 -50
6764e0q0M1J69Lk91L06k16M3J75p0J66k27K36k08O3J13j02Qk5k9n3L7n5J55j49
$$ -50 -130 -89 80 83 -208 98 -118 -75 100 30 196 -31 205 -3 60 173 71 79 54 25 -28 9 -46 109 -40
6789d0N6J02j50l3M2K3O1L8k40J14O2M7o3l8k0M8J03j89K5K75k91K68k64N2J86
$$ -40 16 118 -32 -65 -23 0 61 99 -141 -27 35 82 19 -19 -39 9 112 -77 -52 223 -68 200 -64 -12 174
6814A74k46KJ6L7o4J02k7J10p1k1P5n6k7J22j77L17m7k72j6J80k11K87j64J1M5
$$ 174 -72 -70 -54 -17 -81 21 -6 104 33 12 87 31 4 126 -51 266 219 -53 -69 111 -100 187 23 34 79
6839G9j18R0Kk14K47m4kL0o9J11J28j66l4O6j42r8R2nO0r3J66p6OR0o3q2M2r4
$$ 79 -39 51 53 -161 86 42 40 70 1 112 240 74 40 106 -36 -134 -42 -47 13 -80 86 10 16 106 43 -39 3 -91
6867i1l5K81j05m1L4j21J95q5p1mo4L6l4J02m2L4m6R9J4p9J20j72j8J21o1J22
$$ -91 -126 155 50 9 43 -78 117 32 -39 -43 -107 -71 -105 -3 -45 -11 -57 42 56 -23 97 -75 -93 28 -33 89
6893H9j1l1R4k03J45l5n1K0K2q2O7j2np5J14j6P8l3q9OP1j56L3J45j19P4j61J8
$$ 89 78 47 141 -62 83 48 -3 17 39 -43 24 12 7 -68 46 30 108 75 -14 -8 63 -93 -60 85 -34 40 -121 -103
6921a03K13K4j08M5o7lL4K9NR5q1J55l48l0P6kj2oP3m4j6J77j59J04j97J99n6
$$ -103 110 134 26 71 4 1 35 64 69 164 83 238 -110 -140 -64 -66 -78 -84 -11 -55 -71 106 -53 51 -146 53 -3
6948cj28J52r4O1Kl4J02P0k82K7O9q5L4J80J0j59M9k1P5l4l6N3j0M8m1l5J44O6
$$ -3 -131 21 -73 -12 -10 -44 58 128 -154 -127 -58 -143 -109 71 81 -78 -29 -50 25 -9 -45 8 -2 46 5 -30 114 180
6976A80k04OJ11o3R9j68J44o6q3Q0o9n2l9K34k7o6lL1j29l8N8J63j63P5M4oQl2
$$ 180 -24 -18 93 30 129 -39 105 39 -44 36 -33 -85 -124 110 83 17 14 45 -84 -122 -64 99 -64 11 55 49 57 25
7004B5K4j67P5N6J8o6N0P5j96J95j19Q3L9q0j18K57p0j18K6K3o3J06N2j30O0j08
$$ 25 49 -118 -43 13 31 -35 15 90 -106 89 -30 53 92 12 -106 151 81 -37 -11 12 -51 55 107 -23 37 -71
7030g1RK11o1PL3l27J17J86j81J42Nq6J10K6j7j18N8l4L6k06Q7J05J02j80R3q1
$$ -71 -62 149 88 95 128 -199 -82 104 -77 65 70 -16 94 120 103 -15 43 9 45 -161 -74 31 133 -47 46 -35
7056c5J17j13j47K02j18K06n7j55JJ16p8J13j09K4J75j36M1k6kP9j97Q7k6JL1
$$ -35 82 -31 -178 24 -94 112 55 -100 -99 17 -61 52 -57 -33 142 6 47 21 19 98 -99 -12 -38 -37 -6
7081fj1J17r0L7r4K1J00j01J0j49J93QJ44j29j98J47p0L9p9p9K43%j23J05QOn8
$$ -6 -17 100 10 47 -47 -26 74 -27 -17 -166 27 35 179 50 -148 -1 -71 -32 -111 -190 53 53 -70 35 43 49 -9
7108iN6lj35N6M7P1j22R8j6M1l3KO5j27J59k11N1O0Lo0M4m9n3J24Q9p9l3j1q2
$$ -9 47 44 -91 -35 12 83 -39 59 43 84 51 53 118 -9 150 -61 -10 50 53 -7 37 -12 -65 59 148 69 36 25 -57
7137e7J39j64J36J12j53j99J88L9J24l4k00J5j41J95J47p1j2qr3J72k22PJ53J5
$$ -57 82 -82 54 166 13 -186 2 41 165 131 -69 -54 -195 0 147 76 64 56 -37 135 -87 -80 73 88
7161H8j99j16J48J10j3P5j72J24j13Q4o2P3q4L2p3J19k2j66J85p1N8j03J28j15
$$ 88 -111 -227 -79 31 18 93 -79 45 -68 16 -46 27 -57 -25 -98 21 -1 -167 18 -53 5 -98 30 -85
7185h5J86j84m2J51K5q5J04K1Q1k0j83NJ69j57k1K7j00K12l27L06n9p5J57j33
$$ -85 101 -83 -125 26 51 -34 70 91 172 152 -31 -26 143 -14 -35 -8 -108 104 -223 83 24 -51 106 -27
7209b7j26L14k05M5j57Q0J06p6N9QJ03k54J51j31k1M9mo5K66j61q8J87k92J55
$$ -27 -153 161 -44 1 -156 -76 30 -46 13 21 124 -130 21 -110 -131 -82 -86 -151 115 -46 -134 53 -239 -84
7233h4K42l11J88Q0j71J87k94l0K56m4P8q8J19k86K51k0p7p8N5Q4M8j98J16OJ1
$$ -84 158 -153 35 115 -56 131 -163 -193 63 19 97 9 128 -158 93 73 -4 -82 -27 57 105 -93 23 29 40
7258D0j20j3N6R3o0j69J37j52L51j92J70K3n3j21J17j22nN6K4n6j2R6o0q2J6J94
$$ 40 -80 -93 -37 56 -4 -173 -36 -188 163 -29 141 164 111 -10 107 -15 -20 36 60 4 -8 88 28 -54 -38 156
7284A56j78j30J42P8n0k9k0O0O1j76P8j22K78k04J59j25JpJ55r4j70L3K28j03
$$ 156 -22 -152 -10 68 18 -11 -31 29 90 -86 -8 -130 148 -56 103 -22 -21 -28 127 33 -137 -104 124 21
7308B1J12j52R2k9q9K4N0qJ95j90l0P2r2l2j5J11nl6j28J44J4M0l7k6N9k56J36
$$ 21 133 -19 73 44 -45 -21 29 21 216 26 -4 68 -24 -56 -71 40 35 -1 -129 15 29 69 32 6 65 -191 -55
7335e5R5kL2j52j04K51m3k3O2j06p7J38o1K2J1j10q9L14lN9j44Q2r3J67j97N5
$$ -55 40 38 70 -82 -186 65 22 -1 61 -45 -122 16 -45 -23 -12 -122 -211 103 100 159 15 97 4 171 -26 29
7361B9J7r5J09o0R2m8J17j30r3J31m6l6m7L5l3n2K00k43J38Q6k6L8K4j47mJ04
$$ 29 46 -49 60 0 92 44 161 31 -62 69 23 -13 -60 -25 -58 -110 90 -153 -15 71 45 83 107 -40 -44 60
7387F0k08J78j32K03k72L9PJ34o8j0LL12k18J33k80N96R9o87q3L02K27k25m9o44
$$ 60 -148 30 -102 101 -171 -132 -125 9 -59 -69 -66 246 28 161 -119 477 576 -111 -194 108 335 110 61 -583
7411e83N80l09L50j22L9J78k68L29l71K59j89O73k39n48K19l01L98q5n4J89m39
$$ -583 -3 -312 38 -84 -45 133 -135 194 -177 82 -107 566 327 -221 -2 -303 95 10 -44 145 -294
7432b94N40K14m44n19K90R35p19K4j4O7L4j38L82k81N2n5m25L89j72p2j95L04
$$ -294 246 460 16 -503 -213 722 3 27 13 80 114 -24 358 77 129 74 -351 38 -134 -206 -401 -97
7454i7K63m79R1j02l36N39n2L26j52k70N17Ol53J26j10J25l2J33j50R0j25J41
$$ -97 166 -313 -222 -324 -660 -121 -173 153 1 -269 248 254 -99 27 -83 42 10 143 -7 83 -42 99
7476I9k33K94j42n2j3k2K34k51J68j8j33L1R5r7J43k3j72R1L5l3r3N5O1J13j26
$$ 99 -134 160 18 -34 -47 -69 165 -86 82 64 -69 -38 57 -40 103 80 -92 -1 34 1 -92 -37 24 137 11
7501A1r4KJ08k4j36J78j72O3J17K5j06Q4O7j36O9J2M1L1j10n0P4O6j37j02K02
$$ 11 -83 -81 27 3 -133 45 -127 -64 53 78 -28 56 123 -13 56 68 109 140 30 -20 54 120 -17 -119 83
7526H3j23n4J11l5o9K37j82J25k7N0J45k97j03K1J77j20J56j0j28R0J3k67M09
$$ 83 -40 -94 17 -18 -87 150 -32 93 66 116 261 -36 -139 -118 59 -61 95 85 -43 47 60 -207 202
7549B02j58L86m23J84k52JK86j20K0k35M3J68j64J47m4n4R4j39J19j32Q4j64J18
$$ 202 44 430 7 191 -61 -60 226 106 126 -109 -66 102 -62 85 41 -13 81 -58 61 -71 13 -151 -33
7572c3K61j82J08j74J80j58q8J21j9n9P9M5P5k8j41K06k48J86k1l4j45J8K7L1
$$ -33 228 46 154 -20 160 2 -86 35 16 -43 36 81 156 128 -13 193 -55 131 110 76 -69 -51 -24 7
7596Gj07l1J49N2o0l1l0k6M8J62j78N1Qr1N7J81K1j83l2J5mJ41l6m3N6p8j08R4
$$ 7 -100 -131 18 70 10 -21 -51 -77 -29 133 -45 6 14 -77 -20 161 182 -1 -33 -18 -22 119 83 40 96 18 -90 4
7624DJ65j09J07j48j06P5j38J22N7q5O6l7K7P0n3q6N5j16N1L00j99j87J74N7j37
$$ 4 169 60 167 19 -87 -12 -150 -28 29 -56 10 -27 0 70 17 -69 -14 -130 -79 221 22 -165 9 66 -71
7649g1J29k15J63J44q6j10Q5p9j19L1n7J45KJ28l0p0j86J25R3O5r4o4O9oj10N2
$$ -71 58 -157 6 150 64 -46 39 -40 -159 -128 -185 -40 -38 90 60 -10 -196 -71 22 87 -7 -71 -2 -8 -118 -66
7675f6m9J89r5P8J5q7L2j00M09l4m12O9L5o3K1R4k8m4O6j08j42L47Kk8k02J37
$$ -66 -115 74 -21 57 72 -15 17 -83 326 292 -120 -51 -16 -79 -58 36 8 -36 30 -78 -220 127 129 101 -101 36
7701C6j90N6J0O8K4M1O1pj58k1j28J70N5J51j64j02L06k2m01L40M1l30K39j08
$$ 36 -154 -98 -88 -20 4 45 106 99 -59 -80 -208 -38 17 168 4 -98 208 186 -215 125 166 -164 75 -33
7725c3j42K03L6O5l76J95j3j28K52j14J60K1j55j1j51J9RJ50j0L1l1n3O7K7L1
$$ -33 -175 28 64 129 -247 -52 -65 -193 59 -55 105 126 -29 -40 -191 -172 -163 -13 -23 8 -23 -76 -9 18 49
7750D9N8k00L6L4R7l7K13l20P5K25k14j2km2J43k26J75M6o4L5k9o6J21j44LK37
$$ 49 107 -93 -57 -23 74 37 250 -70 5 230 16 4 2 -40 103 -123 52 98 34 69 40 -26 95 -49 -46 191
7776A91j19r5j10N6J89j96L0pK25j78L0J22p4qj52L9J22k03J84N8j38P6l6k37
$$ 191 72 -23 -133 -77 112 -84 -54 -61 164 -14 16 138 64 56 -96 -57 65 -138 46 104 -34 42 6 -231
7800b31L61j19p2R5l67L78N7j94J17m2r9j64L96p7j64J60j21K08j90J81k32J82
$$ -231 130 11 -61 34 -333 45 102 -92 25 -17 -116 -280 116 39 -125 35 -86 122 -68 113 -119 63
7822F3j2r6oK07j19l1pp4J14j73J91j12J55k79K01r8J94n2p7M0J22j48j35K31
$$ 63 51 -45 -51 156 37 6 -1 -75 39 -134 57 -55 100 -179 22 -76 118 66 -11 29 151 3 -132 99
7846I9k17J83k0O8J2n8j21L0j51K17k7J02j96J07N3K2L4j61n9j9K8n0J62n4R1
$$ 99 -118 65 45 113 125 67 -54 -24 -175 42 15 117 -79 28 81 103 137 -24 -83 -102 -74 -124 38 -16 75
7871G5j98K51l8k40J31J58j57P6l2l4j05l8J54J25M9j46p2r2J18J06k18J53o7
$$ 75 -123 128 90 -150 -19 139 -18 58 26 -8 -113 -151 3 128 177 31 -41 -133 -15 91 -127 26 -41
7894d1r7ll0RK81j24k44L26n93M89J12k09J4J21L6j64J49m2m3QL7j09J30j2q4
$$ -41 -138 -141 -171 -162 119 -5 -249 77 -516 -27 85 -124 -110 11 47 -117 32 -10 -53 -45 -8 -117 13 1 -83
7919h3L14l08J06k8O0q5P9k32J62M9J5O0j96J25n2j26J46k68J65M3J63p3O3k6
$$ -83 231 -77 29 1 61 -24 55 -177 -15 34 49 109 -87 38 -14 -140 6 -262 -97 -54 109 36 99 73
7943G3p7m3j26J50K7J76o2l02J21o5J73K4r8M4j15J05j8N0lj06J3J45k89J60O
$$ 73 -4 -47 -173 -23 4 180 118 -184 -63 -128 45 69 -29 15 -100 5 -13 37 34 -72 -59 86 -203 -43 -37
7968c7o9K86r5J8j95J75o0j09L9j3mj6J63k2q3j03j0J59j34J29Lqj05J12n9J00
$$ -37 -106 180 85 103 -92 83 23 -86 -47 -60 -64 -80 83 61 -22 -125 -135 24 -110 19 22 14 -91 21 -38 62
7994F2j91K5J77k20K32o1J30j91K07j64j46J03J11n3n5K03l4k67K13J9j43O2j52
$$ 62 -129 -104 73 -147 85 24 154 -37 170 6 -140 -37 74 21 -34 169 135 -132 81 100 -43 19 -133
8017a33J98m4p6j05J66kj04p7O5J8R9m1j2L6M1k6M2p0N0J10kj95J05o5L4K3k20
$$ -133 65 21 -55 -160 6 4 -100 -177 -112 -94 5 -36 -48 -12 29 3 45 -25 25 135 133 -62 43 -22 12 35 -185
8044a85L48j96j1J16j56J02j21J59j42P6o8J96j49j97K48J03o7m1l7P6o5N7j35
$$ -185 163 -33 -44 72 -84 18 -103 56 -86 -10 -78 118 -31 -228 20 123 56 15 -22 54 -11 46 -89
8067h9k6M3M3J2j56J99Q7p2k2j39K06k00J37j6N8K3j75J33j6k7q2K95o4j21J23
$$ -89 -115 -72 -29 -17 -173 26 113 41 19 -120 86 -114 23 7 65 88 -87 46 30 3 -79 216 152 31 154
8092A54k07j06K05M4k6j21K41j62no3J05m9m4R4q9n8R0r9L0j48K34J30p0l10L95
$$ 154 -53 -159 46 90 64 -57 184 22 17 -46 59 10 -34 60 -29 -87 3 -96 -66 -214 20 150 80 -230 165
8117A65J56l34Q3o4J26j65Q8j24J90j40k5n7J07nJ59k05K3O4R3l27K79J0j24J38
$$ 165 321 -13 70 6 132 -33 55 -69 121 -19 -44 -101 6 1 160 -45 -22 42 135 -192 87 97 -27 111
8141A11o2p1P2L0P4j32j50j1l9J17J16J67k28o2J26j70J14P0p3p2q8K32O4l4j80
$$ 111 49 -22 50 80 154 22 -128 -139 -178 -61 55 222 -6 -68 58 -112 2 72 -1 -73 -161 71 135 101 -79
8166g9OK74l25J11j20QK8JR8K1l4J0J02PR2j52j23O7J12N9n6j57Q9M9k35
$$ -79 -73 201 -124 -13 -133 -125 -97 -96 2 23 -11 -1 101 108 200 48 -75 -8 104 163 107 -50 39 88 -147
8191a47
$$ Imaginary data points
##PAGE= N=2
##DATA TABLE= (X++(I..I)), XYDATA
0@%%%%%%%%%%%%%%JqJ5j6J6j6K3l1L2l9M7n5O4p2Q6j00J13j29J46j64J85k08K34
$$ 0 0 0 0 0 0 0 0 0 0 0 0 0 0 0 1 -7 8 -8 8 -8 15 -16 16 -23 24 -31 33 -39 47 -53 60 -69 77 -87 98 -110 124
37A24k63K95l29L67m09M54n03N57o17O81p51Q28r10J002j106J218j343J483j639
$$ 124 -139 156 -173 194 -215 239 -264 293 -324 357 -394 434 -476 526 -580 638 -705 778 -861
56h61J818k023K260k535K861l261L760m400N258o473Q342j1618J9022o8548O681
$$ -861 957 -1066 1194 -1341 1520 -1741 2019 -2381 2877 -3596 4746 -6872 12150 -56398 -49717
71d9717R0633m8882K4412O2473j9534o3735J605k7394l9248K8128M5820q47K9978
$$ -49717 40916 -7966 16446 78919 59385 -4350 -2745 -30139 -69387 -41259 4561 3714 33692
84C3692L2781k8028k8740j923n6308l9638N5559L8330k7387L6220P0059k7821
$$ 33692 66473 38445 9705 7782 -48526 -88164 -32605 5725 -21662 14558 84617 56796
96E6796n5649M809k3007m8861K4956L9976j2274K6208O0013k0928n2589J489j7009
$$ 56796 1147 5956 -17051 -65912 -40956 -980 -13254 12954 72967 52039 -550 939 -16070
109a6070m9246J3578M0538l084K3487N8789r908m7703j362j2984m5592J716L0379
$$ -16070 -65316 -51738 -11200 -14284 9203 67992 58084 10381 9019 -3965 -49557 -47841 -17462
122a7462J357K7585M9625j6490m0889J0224j4140n9465J669M4167J31J1589N5257
$$ -17462 -16105 11480 61105 44615 3726 13950 -190 -59655 -57986 -13819 -13688 -2099 53158
135E3158L801m1942j30l231n1471j6411L5062J1064Q463L9756Q055k7727k341
$$ 53158 56959 15017 14887 11656 -39815 -56226 -21164 -10100 -1637 38119 46174 18447 16106
148A6106j2137m8961r181L4657M516N802M6758J6075k9546m150l773m7135k0512
$$ 16106 3969 -44992 -54173 -19516 -15000 -9198 37560 53635 24089 19939 16166 -30969 -51481
161e1481L0030P115j246M0224K3058k4077r142k841l9748k1373K4086Q016Q18
$$ -51481 -21451 -14336 -15582 24642 47700 23623 14481 11640 -28108 -49481 -25395 -17379 -16561
174a6561M0085K6761k0914q967L46l7660k7378J7784P734k779L4319K9254j6311
$$ -16561 23524 50285 29371 20404 20750 -16910 -44288 -26504 -18770 -21549 12770 42024 25713
187B5713r818K519l1916k9164J4032R553j925L1851L1855j1248r360L052k9080
$$ 25713 15895 18414 -13502 -42666 -28634 -19081 -21006 10845 42700 31452 22092 25144 -3936
200c936l2871P290Q906l904K5288L1960n104r192L251k3404l1289L464Q623k460
$$ -3936 -36807 -29517 -20611 -24515 773 32733 27629 18437 21688 -1716 -33005 -29541 -20918 -23378
214b3378K3311L2525r60p454L432k1862l2977j548O420n015J8479L2276L119o840
$$ -23378 -67 32458 31498 24044 27476 5614 -27363 -28911 -22491 -27506 -9027 23249 26368 19528
228A9528N445j6414l2126m536P472m362J4727L2167Q592o318L066j2622l0256
$$ 19528 24973 8559 -23567 -28103 -20631 -24993 -10266 21901 30493 24175 27241 14619 -15637
241a5637j2074K693k514J1933K6848J0940L77M299j2930k7077q773N40o503J1293
$$ -15637 -27711 -25018 -27532 -15599 11249 22189 22566 26865 13935 -13142 -21915 -21375 -27878 -16585
255a6585L0208J1427k696O409o354k9360j7588J367l585L470K3647J9144L761
$$ -16585 13623 25050 22354 28763 22409 -6951 -24539 -23172 -26757 -23287 360 19504 23265
268B3265J641n786j9505j6263o619l560P980K0997J4780O234O657o035k2816j6799
$$ 23265 24906 19120 -385 -16648 -23267 -26827 -18847 2150 16930 23164 29821 23786 970 -15829
282a5829n695p549K024K1310J8662O214O315n48j7862j9028p767m619R93J5739
$$ -15829 -21524 -29073 -27049 -5739 12923 19137 25452 24904 7042 -11986 -19753 -24372 -23379 -7640
296g640J9692J0266M478j910j4079j8996j3344o936K194J3036J6778J3978R427
$$ -7640 12052 22318 26796 24886 10807 -8189 -21533 -28469 -26275 -13239 3539 17517 26944
309B6944j140j3161j5873j2150r162j064J2525J7683J3000P633J319j0094j7916
$$ 26944 25804 12643 -3230 -15380 -24542 -25606 -13081 4602 17602 25235 26554 16460 -1456
322a456j6324q759m67Q089J5361J7465J1512M71p666j3465j6288j1758j943P454
$$ -1456 -17780 -26539 -27006 -18917 -3556 13909 25421 25892 18226 4761 -11527 -23285 -25228 -17774
336a7774J3943J6569J0888K035n633j3416j8894j3028o33M303J0726J9135J5132
$$ -17774 -3831 12738 23626 25661 20028 6612 -12282 -25310 -25943 -21640 -10914 8221 23353
349B3353K100m495r383j6830j5869l096L466J0235J7160J4090L402k263q995j9009
$$ 23353 25453 20958 11575 -5255 -21124 -24220 -20754 -10519 6641 20731 24133 21870 12875 -6134
363f134j6175k029J857N887J8682J8598L266k082m242j7285j8472m436J448M486
$$ -6134 -22309 -24338 -22481 -16594 2088 20686 23952 21870 17628 343 -18129 -22565 -21117 -16631
377a6631J6930J7827M467q89l594j8026j8844m567N16K071J6663K0985N040l24
$$ -16631 299 18126 22593 21704 18110 84 -18760 -23327 -22811 -20740 -4077 16908 21948 21624
391B1624K09j4991k1169o066K07k32J4138K0762N745M0N59j3418k1713o767K07
$$ 21624 21833 6842 -14327 -20393 -20186 -20418 -6280 14482 20227 20267 20826 7408 -14305 -21072 -20865
406b0865k678J3142K2655Q083j23L942j0865k3364q178k68m792J0295K2444Q411
$$ -20865 -23543 -10401 12254 20337 20214 24156 13291 -10073 -18251 -18519 -23311 -13016 9428 17839
420A7839j37M881q889k2897r442r4n598P918K3683J0719p8O594o009k2798j1485
$$ 17839 17702 22583 13694 -9203 -18645 -18739 -24337 -16419 7264 17983 17905 24499 18490 -4308 -15793
435a5793n70o950N032K2423J0851K63P166l036k3225j2268Q69p965K007K2927
$$ -15793 -16363 -23313 -18281 4142 14993 15256 22422 19386 -3839 -16107 -15238 -23203 -21196 1731
449A731J3126J94Q636l41k2123j4777j39p383j534J9934J4197J269Q372O86k0059
$$ 1731 14857 15051 23687 23346 1223 -13554 -13693 -21076 -22610 -2676 11521 12790 21162 21848 1789
464A789j3761m18q799l020K0397J5477l13R626N745k0533j6841R57q294q256J7587
$$ 1789 -11972 -12390 -21189 -24209 -3812 11665 11352 20978 26723 6190 -10651 -9694 -17988 -26244 -8657
479h657J8220Q32O831O923j6225j6152j773p522p484J5863J7220Q96Q069R747
$$ -8657 9563 10395 17226 24149 7924 -8228 -10001 -17523 -25007 -9144 8076 8972 17041 26788
493B6788j5467j7858l41q069j0544J2365J7718K041P306J1172j2392j7583j176
$$ 26788 11321 -6537 -6878 -14947 -25491 -13126 4592 6633 13939 25111 12719 -4864 -6040
506f040p399j3404J2641K0099n74O518J5762j0066k2110j802k199j5193L855K0056
$$ -6040 -13439 -26843 -14202 5897 5323 11841 27603 17537 -4573 -6375 -8574 -23767 -19912 144
520A44O555M126J0314n032j4521m568q506j3229Q452J7207P94O797J7830o614
$$ 144 6699 10825 21139 16107 1586 -2982 -11488 -24717 -16265 942 1736 8533 26363 19749
534A9749k0683p33k852j9799O66K2863N571j312J4222L987j6152q770l399j2856
$$ 19749 -934 -1667 -4519 -24318 -23652 -789 4782 3470 17692 21679 5527 -3243 -6642 -19498
548a9498N05J5342M147L810J5826J178j6170m762m235j6584j528J7096M143K9
$$ -19498 -18993 -3651 496 4306 20132 21310 5140 378 -3857 -20441 -21969 -4873 -730 -701
562g01J8143O412j6227q623j110j3223n137J3117M971K179J7824O847j6705p634
$$ -701 17442 23854 7627 -996 -2106 -15329 -20466 -7349 -2378 -199 17625 24472 7767 133
576A33J252j4623j0456J2434Q342J545J5030R527j3089q566M71j2447j0861Q722
$$ 133 1385 -13238 -23694 -11260 -2918 -1373 13657 23184 10095 1529 2000 -10447 -21308 -12586
590a2586Q280L297J4402Q323j2433n550K118j5267j4785J0060J0742o1J0935J3040
$$ -12586 -4306 -1009 13393 21716 9283 3733 5851 -9416 -24201 -14141 -3399 -3460 7475 20515
604B0515o959q725J043j1976j5069O791J0299J84R717J2559m799o976L17j2997
$$ 20515 13556 4831 5874 -6102 -21171 -14380 -4081 -3897 5820 18379 13580 6604 6921 -6076
618f076j5100O809R373j583Q367J5719j441q352r24r858j5105L722Q330j378P784
$$ -6076 -21176 -14367 -4994 -6577 1790 17509 16068 7716 6792 -3066 -18171 -14449 -6119 -7497 287
633B87J6200J2q768j505p586j4793J012P983k310P992J7292J098r493K45n659
$$ 287 16487 16499 7731 6226 -1360 -16153 -15141 -7158 -9468 -1476 15816 16914 7421 7666 2007
648B007j5156k357O993j198O871J6941K251p507n10m563j5174m624O303n73O318
$$ 2007 -13149 -15506 -8513 -9711 -2840 14101 16352 8845 8335 3772 -11402 -16026 -9723 -10296 -3978
663c978J6124L952o636l32l324j4925o899N862P46L542J5352N775n446J36l082
$$ -3978 12146 16098 9462 9130 5806 -9119 -16018 -10156 -9410 -5868 9484 15259 9813 9949 6867
678F867j5034p469M535J054L086J4163P327l972J17k277j4519q308M080l5J803
$$ 6867 -8167 -15636 -11101 -10047 -6961 7202 14529 10557 10674 8397 -6122 -14430 -10350 -10385 -8582
693h582J3181R221l496K6j347j3034r067K150J049K50J1965R800n32j274o90j1024
$$ -8582 4599 13820 10324 10350 9003 -4031 -13098 -10948 -9899 -9649 2316 12116 11584 10310 9620 -1404
709a404r521p4M8J473R631J0678K91o02j02j0858j0149j13n70K0J0781J0469Q17
$$ -1404 -10925 -10999 -10951 -9478 153 10831 11122 10520 10418 -440 -10589 -10702 -11272 -11252 -471 9998 10815
726A0815l41J538r412j1396j317K96j206P613J1437K198M89N44p770j0560l328
$$ 10815 10474 12012 2600 -8796 -10113 -9817 -11023 -3410 8027 10225 10714 11258 3488 -7072 -10400
741a0400p64k80P526J0391L273Q11J529p330j0519l660j193j819O588J0743L935
$$ -10400 -11164 -11444 -3918 6473 9746 10557 12086 4756 -5763 -9423 -10616 -12435 -5847 4896 8831
756H831J542J288n298j0691m827j316j296M628R912N739J941J408m282r118o749
$$ 8831 10373 11661 6363 -4328 -9155 -10471 -11767 -7139 2773 8512 10453 11861 7579 -1539 -8288
771h288k336j314M058R088O031L120J873m154q645o441k896j957L336Q260O547
$$ -8288 -10624 -11938 -7880 1208 7239 10359 12232 8078 -567 -7008 -9904 -11861 -8525 -265 6282
786F282L400J865k310p960p031l759j997K306P464O836L804K620j693p164p155
$$ 6282 9682 11547 9237 1277 -5754 -9513 -11510 -9204 -1740 5096 8900 11520 9827 2663 -4492
801d492m188k843J477O683P085M965K702j410n780o993n548k813J014N319P162
$$ -4492 -8680 -11523 -10046 -3363 3722 8687 11389 9979 4199 -2794 -8342 -11155 -10141 -4822 2340
816B340N315L400p32n227o834n370l494J48M743O838N812L425Q3l878o556o653
$$ 2340 7655 11055 10323 5096 -1738 -7108 -10602 -10454 -5711 1127 6939 10364 10447 6569 13 -6640
832f640l491k66L420O261O596M264K30l269n866o606m424n55K765N666O866M272
$$ -6640 -10131 -10397 -6977 -716 5880 10144 10374 7105 1239 -5367 -9791 -10346 -7581 -1915 4951 9223
848I223R74k161n241p271m546r81J791M689P446M898J014j404m468p251n216j387
$$ 9223 10197 8036 2795 -4476 -9022 -10003 -8212 -3523 3923 8821 9835 8431 3963 -3288 -8504 -9891
864i891J395L919P344N360J239n88l866o916n783j445K31L033P441N743J707q3
$$ -9891 -8496 -4577 2767 8127 9366 8778 4912 -2004 -7787 -9232 -9001 -5968 1473 7216 8923 8840
880H840k486o942o281j700k83J983P069O368J741O16j767o832o503j867p27J098
$$ 8840 6354 -588 -6869 -8569 -8852 -6869 200 6568 8309 8925 7158 326 -6177 -8044 -8771 -7673
896g673O724O855K017R94r18o406o904k291j085K49O161P172K453J133L9n545
$$ -7673 -949 5906 7923 8917 7999 1593 -5311 -7602 -8687 -8438 -2277 4895 7348 8481 8520 2975
912B975p618k253j353p99N604P478K481J518J183n139p482l016j417j368M704
$$ 2975 -4643 -6896 -8249 -9048 -3444 4034 6515 8033 9216 4077 -3405 -6421 -7838 -9206 -4502
927d502P383L243J414J687m062p651l243j289k471L894P747L337J536K368l271
$$ -4502 2881 6124 7538 9225 5163 -2488 -5731 -7020 -9491 -5597 2150 5487 7023 9391 6120
942F120p603l551j679k643K821P562L643J510L175k446p599l392j841l619K131
$$ 6120 -1483 -5034 -6713 -9356 -6535 1027 4670 6180 9355 6909 -690 -4082 -5923 -9542 -7411
957g411P803L740J394L612j246p352m136j717l708R20P407M140J359M024l20p019
$$ -7411 392 4132 5526 9138 7892 540 -3596 -5313 -9021 -8101 -694 3446 4805 8829 8509 1490
973A490m642j249m177j44O849M470J325M468O31o430n007j414m070j142O319M587
$$ 1490 -3152 -4401 -8578 -8722 -1873 2597 3922 8390 9021 2591 -2416 -3830 -7900 -9042 -2723 1864
989A864J384M610J784o296n314j230l931k416N596N327J511M210K556n730m981
$$ 1864 3248 7858 9642 3346 -1968 -3198 -7129 -9545 -3949 1378 2889 7099 9655 3925 -1056
1004a056j153m143l059M746N026J754M214L164m810n164j035m298m114M451N586
$$ -1056 -2209 -6352 -9411 -4665 361 2115 6329 9493 4683 -481 -1516 -5814 -9928 -5477 109
1019A09J488L845L961l994n142j323m043m320L267N650J412L579M472k688n164
$$ 109 1597 5442 9403 5409 267 -1056 -5099 -9419 -6152 -502 910 4489 8961 6273 1109
1034A109j526l695n103K667N362J253L535N195j974m979j554l689n251J809N017
$$ 1109 -417 -4112 -9215 -6548 -1186 67 3602 8797 6823 1844 290 -3399 -8650 -6841 -1824
1049a824J318L164N913j297n078j560k739n912O65M780J457K984N936j20m918
$$ -1824 -506 2658 8571 7274 2196 636 -2103 -8015 -7350 -2570 -1113 1871 7807 7687 2769
1064B769j508k850n932r6M521J430K725O038M66m315j441k330o083j218M224J662
$$ 2769 1261 -1589 -7521 -7617 -3096 -1666 1059 7097 7563 3248 1807 -523 -6606 -7824 -3600 -1938
1080a938J894O391J581m050j565j912o656j681M200J750J384N831K595l607j671
$$ -1938 -44 6347 7928 3878 2313 401 -6255 -7936 -3736 -1986 -602 5229 7824 4217 2546
1095B546j765n938k568L602J354J599N732L218l110j758j541n423l203K435J473
$$ 2546 781 -5157 -7725 -4123 -2769 -1170 4562 7780 4670 2912 1371 -4052 -7255 -4820 -3347
1110c347J381N697L765k661j830q25n216m125K175J455J232N642L796k081j800
$$ -3347 -1966 3731 7496 4835 3005 2180 -3036 -7161 -4986 -3531 -2299 3343 7139 5058 3258
1125C258n43m910m491J252J691P60N052M352j274j438l55m593m959O90J758N23
$$ 3258 2715 -2195 -6686 -5434 -3743 -2983 2069 6421 5147 3709 3354 -1239 -6198 -5508 -3750 -3227
1141c227M519M667n47j359j89m550n033J50J675K10L825M975L39j026n59l730
$$ -3227 1292 5959 5412 4053 3864 -686 -5719 -5569 -3894 -3684 141 5116 5455 4429 3870 140
1157A40n082m51J380K07L250M907J086j001l82l428m924o81O97k62L205N313J293
$$ 140 -4942 -5393 -4013 -3806 -556 4351 5437 4436 4054 626 -4298 -4979 -4282 -4544 -1339 3974 5267
1174E267j089K86k848n310j255Q71m57K459N127K025p61Lk130m882k246L18k0
$$ 5267 4178 4464 1616 -3694 -4949 -4078 -4535 -2076 3051 5076 4315 4318 2188 -2694 -4940 -4622 -4642
1191d642K104M840K246O5O3j960m648k371K24o13J706M658K406M1N01j195m735
$$ -4642 -2538 2302 4548 4613 4676 2716 -1932 -4303 -4079 -4692 -2986 1672 4078 4119 4620 3425 -1310
1208a310k993K73n62Q56M467L345M5M48p92l928l388m68n12R95L393L182J103
$$ -1310 -4303 -4030 -4592 -3736 731 4076 4121 4569 3777 -151 -3539 -4007 -4519 -3524 -131 3051 4154
1225D154N02q10l611l140p35j088N48L858L167P41R39K4l675l337r48r36o3L103
$$ 4154 4656 3846 235 -2905 -3640 -4728 -4180 -322 2845 3586 4525 4549 874 -2463 -3411 -4347 -4410 -1307
1243a307L661J276N94j34k527l338j824r37K44K451L320J701J304J10k546l194
$$ -1307 2354 3630 4224 4090 1563 -1775 -3599 -4536 -4292 -1841 1479 3180 4484 4594 2048 -1146
1259a146j696j226m64K464L040J816J258M84k174l221j780j287o82J842L278K001
$$ -1146 -2842 -4068 -4532 -2068 972 2788 4046 4530 2356 -865 -2645 -3932 -4614 -2772 506 2507
1275B507J363P83j460l220k195j356o92J177K811K294J594Q48j578k427k200j753
$$ 2507 3870 4653 3193 -27 -2222 -3578 -4270 -3093 -282 2012 3606 4454 2876 449 -1751 -3504
1291c504j037J183K755K192J888J206r84k714k248j667j332O67K305K554J748
$$ -3504 -4541 -3358 -603 1589 3477 4683 3699 985 -1263 -2930 -4262 -3595 -1290 1264 3012
1306C012R84n75j877k474k042j048M37J857K472K027J384k23j882k252k204j618
$$ 3012 3996 3421 1544 -930 -2972 -4020 -3583 -1726 746 2773 4157 3934 2052 -200 -2404 -4022
1322d022J4J871K252K221J408j04j207k472k271j314k57J345K325K445J465L30
$$ -4022 -4008 -2137 115 2336 3744 3640 2433 -39 -2310 -3624 -3881 -2536 -211 2234 3699 4029
1338D029j292k252k405j626k54R02K100K223J941M86j109k031k223j578n67O01
$$ 4029 2737 485 -1920 -3546 -3800 -2898 -798 1425 3366 3852 2743 712 -1511 -3089 -3656 -3055
1354c055J816K720J816M05n73j617k580j693p95K82J566K428J922P31o2j510k501
$$ -3055 -1239 1481 3297 3702 3129 1512 -1068 -2761 -3556 -3274 -1708 720 2642 3373 3311 1801 -700
1371g00j746p86n5J507K283K187O64J60j261k489j963q94k97J074K379J886J009
$$ -700 -2446 -3232 -3287 -1780 503 2690 3354 3514 2253 -236 -2199 -3093 -3390 -2316 63 1949 2958
1388B958K28q15k171k053j081k80O98K319J701J356P03p50k140k385j100n14K49
$$ 2958 3186 2371 200 -1853 -2934 -3214 -2516 -197 1504 2860 3563 2813 673 -1712 -2812 -3326 -3077
1405c077K298J942J271Q37k57k088k209j220o73K63J722K446J132P66m9j863k266
$$ -3077 -779 1163 2434 3271 3014 926 -1283 -2503 -3176 -2913 -1191 1255 2387 3153 3104 1241 -1025
1422a025j361q55%J716J952J422J072L96j628k159j246j096o12J619K234J380
$$ -1025 -2386 -3241 -3241 -1525 427 1849 2921 3317 1689 -470 -1716 -2812 -3424 -1805 429 1809
1438A809R17P88j463k239j421j022o03R56K173J465J309P08j135k075j270j479
$$ 1809 2726 3514 2051 -188 -1609 -2631 -3234 -2278 -105 1360 2669 3377 2242 167 -1103 -2582
1454b582p68J029K226J221J203R92o60k314j372j288r52O37J890J412J446Q14
$$ -2582 -3350 -2321 -95 1126 2329 3321 2661 347 -1025 -2313 -3265 -2628 -738 674 2120 2934
1470B934m38j815j294j007j359L61J953J257J180J360l56k016j349j013j247L
$$ 2934 2496 681 -613 -1620 -2979 -2618 -665 592 1772 3132 2776 760 -589 -1602 -2849 -2846
1486b846J343J684J250J318K9j528j262j146j619PJ592J190J025J390N51j477
$$ -2846 -1503 181 1431 2749 2778 1250 -12 -1158 -2777 -2770 -1178 12 1037 2427 2978 1501
1502A501j653p16j615n92J255J414J210J701M32j163j120j460j403m89J198Q89
$$ 1501 -152 -868 -2483 -3075 -1820 -406 804 2505 2937 1774 654 -806 -2209 -2698 -1500 -611
1518f11J162J668P35j175j396q03j448j063R90J038J222J615J001r72j090q37
$$ -611 551 2219 2954 1779 383 -420 -1868 -2931 -1941 -903 319 1934 2935 1963 873 36
1534C6j724q43O59Q57J046J515R72m13j042q50j602j298L30R84J148J202J752
$$ 36 -1688 -2531 -1872 -1015 31 1546 2518 2105 1063 213 -1389 -2687 -2357 -1373 -225 977 2729
1551B729k81j204p28j544j413K38P03J064J424J363m36q61m77j533j480o4R69
$$ 2729 2448 1244 516 -1028 -2441 -2203 -1500 -436 988 2351 1915 1054 577 -956 -2436 -2500 -1531
1568a531Q65J368J366L95p20q71j222j577k01N08O72J334J358M34o64o70j265
$$ -1531 -666 702 2068 2463 1743 872 -350 -1927 -2128 -1620 -948 386 1744 2178 1514 844 -421
1585d21j396n49O93N58J296J419O98o12l98j053j643n19L67K85R19J651P08n00
$$ -421 -1817 -2366 -1673 -1115 181 1600 2298 1686 1288 235 -1408 -1927 -1560 -1275 -356 1295 2003 1503
1603A503k09j011j762n38L03L06J071J642R05l78l70p54j754q82M6M14O98J441
$$ 1503 1294 283 -1479 -2017 -1714 -1408 -337 1305 2210 1832 1462 708 -1046 -1928 -1882 -1468 -770 671
1621F71R29M6j77o96j400j087m4J99Q22J441Q80J88p6p19j587r56l20K05N90J231
$$ 671 1600 1646 1469 773 -627 -1714 -1758 -1559 -737 704 1584 1772 1696 977 -610 -1566 -1886 -1681 -1091 140
1641A40J148K58j00m98j306j154k22K19L49J324J149O38j39m52j278j023p60j10
$$ 140 1288 1546 1446 948 -358 -1512 -1734 -1515 -1166 158 1307 1945 1806 1354 76 -947 -1707 -1817
1659a817L90J243J218L51L74j54j343j389k25k20J29J106J295O28J72k34r16j339
$$ -1817 -1427 -184 1034 1385 1759 1605 262 -1127 -1352 -1572 -1443 -337 958 1586 1758 1524 608 -731
1677g31r26m9M7R41J377P63J41k05o42r79r58l28k5R30J271O54M09m5p13j214
$$ -731 -1657 -1706 -1659 -718 659 1422 1563 1358 716 -263 -1221 -1549 -1574 -644 627 1281 1690 1645 932 -282
1697b82q93m86j23O69J292R39J99L34n12j146q25n67o1N23R24R54M49L22p15r24
$$ -282 -1175 -1661 -1784 -1115 177 1116 1315 1649 1137 -9 -834 -1401 -1462 -939 -15 939 1388 1710 995 71
1717G1p24r10k12M98R45Q23P34O22n34r78j027n83k29K15Q98J092L04N49j4j178
$$ 71 -653 -1563 -1775 -1277 -332 491 1225 1847 1313 335 -692 -1275 -1504 -1289 -391 701 1005 1554 1540 362
1737C62q12o38n40J76O07J169O96M99K9p78q25j010m99J62O65R95O94N13k50p25
$$ 362 -450 -1088 -1628 -1452 -845 324 1020 1519 1548 770 -55 -1065 -1564 -1402 -737 258 952 1465 1215 490
1757D90n72q03o72m0N12R87R07N65M7l99q89q63l66l85N00Q36P79P18N2m31o50
$$ 490 -82 -885 -1557 -1597 -1085 -98 809 1374 1421 1022 133 -730 -1096 -1481 -981 -145 634 1352 1404 973 323
1778C23j103m49l10M27O66Q99P67K0k15o04o52o87k78P5O99O20P17M54j82o22
$$ 323 -780 -1229 -1539 -1112 -446 453 1220 1240 1025 421 -231 -918 -1196 -1121 -422 198 915 1369 1187 565
1798E65q10j073j47L84M01Q18Q52K35p3n88n53p48m22k5N10P28M53N86O1m05p06
$$ 565 -245 -1318 -1465 -1081 -680 138 990 1225 1152 564 11 -737 -1159 -1184 -674 54 507 1093 1154 749 43
1819D3q56n08R2O06M46P52N82J15m67n46p13n27l34M06P68N07O01R5k55o90n62
$$ 43 -813 -1321 -1229 -623 -177 575 1157 1272 805 259 -454 -981 -1315 -909 -141 366 967 1062 807 117 -445
1840d45l78l54O7P48O81O51L67k97j87r90p01l72L04M23L10R05K63Q3m09p01p84
$$ -445 -823 -1177 -1110 -362 319 970 1337 1040 853 -137 -838 -1210 -906 -483 -173 732 995 1078 669 -32 -816
1861h16j89l9J65R18P96K62K20n93n81l75r54l72N98Q29L58Q42k86k6q13m57q23
$$ -816 -1005 -1044 -879 39 835 1097 1317 724 143 -232 -1186 -1558 -960 -131 227 1069 783 757 -56 -513 -1336
1882a336L39J73P9J472J20K07k50o3j345j27k08J79N40J86R90m5l1l90n92n71
$$ -1336 -997 -824 -745 727 847 1054 804 741 -604 -731 -939 -760 -220 -34 956 911 880 490 -102 -673
1902f73l17Q3K01Q75O35L19k09k44o25o31l89j1K46M91P86K96P4k80n08n69n36
$$ -673 -990 -907 -706 169 804 1123 914 670 45 -586 -975 -986 -740 -249 537 833 907 627 119 -450 -986
1923i86J54J54N61O07L53P3j42l27p16n12l60L35M84M08O07J60o9m09n72l87k87
$$ -986 -832 -678 -117 490 843 916 774 447 -269 -781 -1141 -806 -322 86 693 853 784 375 -197 -584 -871
1944h71R4M17M20O62P5J28l22o55o49k41r2N35L85N91L43o2k55m74n13n69K84
$$ -871 -777 -360 60 722 797 925 603 -52 -701 -942 -1034 -499 -114 477 820 758 503 29 -484 -1053 -769
1965g69L08L31M98M68K03m82n87l71k74l21N7O74N36M69j4n4k72m98n83l03J71
$$ -769 -461 -130 368 836 1039 557 -30 -401 -675 -996 -939 -265 271 740 726 672 400 -98 -681 -984 -813
1986h13O46J98M67M65j80m95m90m45k31J78K35N34N71l3L80n96l43n89l22O1M67
$$ -813 -167 31 498 963 783 288 -202 -647 -878 -700 -465 69 640 607 987 391 48 -541 -863 -802 -335
2007c35K21N16M39j38j29n22m69l75k6K60M66M18K45K50k07n53l33j98k02J35
$$ -335 -114 402 841 703 574 52 -417 -792 -818 -558 -92 326 571 821 614 61 -272 -470 -672 -537
2027e37K01N67L54K62k61l90m09m85j82Q4M37N16M61J64q2m56m65k50l23O7M99
$$ -537 -336 231 585 847 586 196 -213 -698 -880 -796 -359 157 618 782 700 244 -221 -471 -794 -727 -228
2048b28K52L71J23K51n19k47m07j74l72N47L82L63L43k7q5n13l77l36o5L35L63
$$ -228 24 395 518 769 250 3 -404 -578 -950 -403 -21 342 685 658 573 60 -317 -653 -718 -383 -20
2069b0L92K16K06k69k72m71l76j98J75L15L49P55m8l33j18m63l96j39K53J36J81
$$ -20 372 588 794 525 253 -218 -594 -792 -617 -302 47 802 754 421 303 -160 -556 -695 -442 -306 -125
2090a25O72J35J0l56l28m78l36rL39J95Q03j19L45l86k08n10l93J51J74L82K73
$$ -125 547 682 692 336 8 -470 -806 -815 -476 -281 522 403 748 362 154 -356 -749 -598 -424 -42 231
2111B31N25l9l89l19k13m85J62J56J27O69J4J74l77k17k03m57J68M46k24P47l51
$$ 231 756 717 328 9 -204 -689 -527 -371 -244 425 439 613 236 19 -184 -641 -473 -27 -251 496 145
2132A45M45J77n63m81j76k33K55J08K61Q23j02r8l30j48p51K24k15L01L62M46
$$ 145 590 767 204 -277 -453 -686 -431 -323 -62 761 659 561 231 83 -668 -444 -659 -358 4 450
2152D50K33o9j62k75o21k41K40m0M54L29L21l30K40m37k45m23J13K6M37L72J69
$$ 450 683 614 452 177 -444 -685 -445 -485 -31 298 619 289 529 92 -153 -576 -463 -437 0 372 541
2173E41pj06l57k04l49r8n3L79M38K47J26l1q0o96j07m88L08K45N35J02K74R4
$$ 541 534 428 71 -133 -482 -580 -633 -254 184 431 557 526 446 -250 -357 -845 -537 -292 243 345 619 713
2195G13l03l29m34j49k05N5P70L80k96J86j65j01o11M20l32j33L67K53L81J24
$$ 713 410 81 -353 -502 -707 -652 118 498 202 388 223 122 -489 -69 -401 -534 -167 86 467 591
2215E91j82o24L5j98o29N87K11L10K40M8K1l68k45K2l07l1J95M97J6N84k55k68
$$ 591 409 -215 -180 -378 -1007 -420 -209 101 341 389 410 42 -203 -181 -488 -519 -324 173 189 773 518 250
2237B50m70p0j37k80J38N31N56m2K67l20m04r7l28k98N79N6Q7N11J17j84m04m39
$$ 250 -220 -290 -427 -707 -569 -38 518 476 743 423 19 -78 -406 -704 -125 -69 18 529 646 462 58 -381
2259c81m50J4K39L77L45J41Q6K77j0j028j46j37L35L13K58Q5K61k62K5p16j32
$$ -381 -831 -817 -578 -201 144 285 371 648 638 -390 -536 -673 -338 -25 233 318 579 317 342 -374 -506
2280e06n7L0N32J55K69O66l86o84j23L8j73j39J97o3J30R10k68K10j103L93r28
$$ -506 -563 -533 -1 154 423 1089 703 19 -104 -66 -239 -378 -181 -244 -114 796 528 738 -365 28 -900
2301i00P31l8k02N07L01K61L3m37m13p4j91JR46K30o30J03L68l66N4m97l23M3
$$ -900 -169 -207 -409 98 399 660 693 256 -157 -231 -422 -421 525 755 125 228 596 230 284 -213 -536 -493
2323d93Q42o5N31m97l78N30o00m95j03L95N82k80k58N65J12p02R97j327m3L32
$$ -493 349 284 815 318 -60 470 -130 -625 -728 -333 249 -31 -289 276 388 -314 683 -644 -687 -355
2343c55J54O14j99J49J74m05j17j2n0o14J04O29J32r7J181p97p32j39l1l21R9
$$ -355 -201 413 214 363 537 132 15 3 -47 -661 -557 72 204 107 1288 491 -241 -380 -411 -732 -633
2364f33J78P03Q3RL28k08p00k06L64k89M95m81P60N1k53l9n40M12k44j74N35K15
$$ -633 -455 248 331 340 668 460 -240 -446 -82 -371 124 -357 403 454 201 162 -378 34 -210 -384 151 366
2386C66o91Q26J6r9j5n61m3j05O22q8m38J04J251j130J29k57p17O08j49R45m53
$$ 366 -325 501 517 418 403 -158 -201 -306 316 228 -210 -106 1145 15 144 -113 -830 -222 -371 574 121
2407A21K13k05l5K88m52n31n2K08nJ53P24M0l87J53l64j34j70P1J19L13J52K52
$$ 121 334 129 94 382 -70 -601 -653 -445 -450 -297 427 467 80 233 -131 -265 -435 -364 -245 68 220 472
2429D72r9L7m63j80l12K8M84L1P7J73j92J76j34n56L56l34P0J85K38M43L40o83
$$ 472 373 410 -53 -233 -545 -517 -33 -2 75 248 56 232 98 -458 -102 -436 -366 -181 57 500 840 157
2451A57j44k02m57J13L64j79L89K22K33J0k70l61j82j97K98J05J48L44pk44o9
$$ 157 13 -189 -646 -533 -169 -348 41 263 496 506 236 -125 -307 -504 -206 -101 47 391 384 140 71
2472G1Mm70K03l50K18J71M07J05n4j17l08j73j35Q8J81M9L61R4Q6k43p9n34j04
$$ 71 75 -395 -192 -542 -324 -153 254 359 305 188 -120 -293 -428 -340 -159 -110 251 345 431 188 109 -425 -529
2495e29K1L43N3N28J03j02P5m15k19l16j67L12K44K93J92lj54l38o8j89j00K13
$$ -529 -508 -165 -112 416 519 417 492 77 -142 -458 -625 -313 -69 224 416 413 259 -79 -147 -336 -436 -223
2517b23q4M86L95l27J58j39j65m66J3k42M97j1L34J30Pj81j73l50k32K75P0P1
$$ -223 -307 179 574 247 405 266 101 -365 -352 -594 -97 -108 226 356 363 182 9 -341 -573 -298 -228 -157
2539a57M97J84q0m5m89L6l23K2n1K94N97k3j41j42N2n60j49l15Q84kK85j16M0
$$ -157 340 524 444 399 -90 -54 -377 -355 -406 -112 485 462 321 179 231 -329 -478 -793 91 89 374 258 298
2562B98P0j20m07O0k73k48M24K53M29j6k50q2j46l73l3l1J07L63O1L70q4J87n67
$$ 298 368 248 -159 -99 -372 -620 -196 57 486 470 220 138 -8 -381 -414 -445 -338 25 86 456 372 559 -8
2585hl95K06k7mL37Q4K91k19k8j18l47q0j36K55J55L00j9P4l61kk35J56m4l23
$$ -8 -403 -197 -224 -228 109 193 484 265 237 119 -228 -308 -444 -189 -34 266 247 321 -40 -42 -277 -121 -165 -488
2609d88L16K59K12K36l58o5K3n27r8K10j44R10m22K92K21j35j80p39O67q11P90
$$ -488 -172 87 299 535 177 112 135 -392 -490 -280 -424 486 64 356 577 442 262 -477 190 -621 169
2630A69L19k34J89L7n03l32n3J45j62K37K76N01j22n01J10L6k52L65n84k47l1
$$ 169 488 254 443 480 -23 -355 -408 -263 -425 -188 88 589 467 -34 76 112 -140 225 -359 -606 -637
2651f37O83L91k59K30r35O5m45M03L94P1N95l06J64k31l58k02q4p0J35N35J98
$$ -637 46 437 178 408 -527 -462 -907 -504 -110 -39 556 250 414 183 -175 -377 -461 -531 -396 139 337
2672C37l0M2P4l93j69P2m65j91Q23j38K25N06m57q1m73K4k36K99L07N9L02K53
$$ 337 307 349 423 30 -139 -67 -532 -723 100 -38 187 693 236 155 -318 -294 -530 -231 76 135 437 690
2694F90p73M04p73K04J5Q5l9L96m3j1L53l79k63k45k63K04K46k1K66K56j5K5l99
$$ 690 -83 321 -452 -248 -233 -148 -187 209 166 155 508 129 -134 -379 -642 -438 -192 -213 53 309 294 319 -80
2717h0J45k13l84J65K01N39j13J60l55jk92J9k47J24J36M44rM26l50k81Q1k02
$$ -80 65 -148 -532 -367 -166 373 260 420 65 64 -228 -209 -456 -332 -196 248 239 665 315 34 115 -87
2739h7k93O3M13p6N02q9j3j30k11j43k35j87M21l2L80K3k5j56j03k22j89J93o7
$$ -87 -380 -317 96 20 522 433 420 290 79 -64 -299 -486 -65 -97 283 306 281 125 22 -200 -389 -196 -263
2762b63J04N13J32l30j7o3k09k09J91j65J00K54K04M9p3j15m02L9j30J02K68P3
$$ -263 -159 354 486 156 139 76 -133 -342 -151 -316 -216 38 242 291 218 103 -299 -260 -390 -288 -20 53
2784E3K21J71k19Ql03l56Q7J05J26P6K95K16J46o97j80j19l10K52o1N67J40Q1
$$ 53 274 445 226 234 -69 -425 -338 -233 -107 -31 264 480 626 -71 -251 -370 -680 -428 -489 78 218 299
2806B99r6Q1k25o20J86p2j59N98K49ON7J60n01o6m74M17j79L11J26N25j93j6K62
$$ 299 203 284 59 -561 -375 -447 -606 -8 241 247 304 464 -37 -103 -577 -160 -339 -28 98 623 430 414 676
2829F76j197P28q37Q17pN49p36K76j54J39o75j7R7m6O15j9k07P3J58l01K7l30
$$ 676 -521 207 -630 187 180 729 -7 269 115 254 -421 -438 -341 -387 228 209 2 75 233 -68 -41 -371
2851c71m9M65k04j61M37K96n26K13R8Rm65L46j83j14N92l91M19k55l47p10R69
$$ -371 -420 45 -159 -320 117 413 -113 100 198 207 -258 88 -95 -209 383 -8 411 156 -191 -901 68
2872F8K26n43J37Q97m58k77l04K44l35P7k41N08l48O58J4K28m56J93p83M7q4L33
$$ 68 294 -249 -112 785 327 50 -254 -10 -345 -268 -509 -1 -349 309 323 551 95 288 -495 -448 -532 -199
2894a99L2J75K93L00j55J7o09p1k16L94k5J09j13J47J38m07O4K79n41j31M71L31
$$ -199 -167 8 301 601 446 463 -146 -217 -433 -39 -64 45 -68 79 217 -190 -126 153 -388 -519 -48 283
2916B83j63L51l66j52M69p82K41nO7P0M54l41k33K55j58l85N39m56J4J32q7P94
$$ 283 120 471 105 -47 422 -360 -119 -124 -57 13 467 126 -107 148 -10 -395 144 -312 -298 -166 -253 541
$$ [...]
8191g8
##END NTUPLES=NMR FID
##END=
