##TITLE=1H_DE_Apr_160
 200.13Hz, DMSO-d6 +CCl4.
 8 sc
 
2.4.2026
##JCAMPDX= 6.0         $$ Bruker NMR JCAMP-DX V2.0
##DATA TYPE= NMR FID
##DATA CLASS= NTUPLES
##ORIGIN= UXNMR, Bruker Analytische Messtechnik GmbH
##OWNER= pz
$$ XWIN-NMR		Version 3.5
$$ Thu Apr  2 14:07:26 2026 Russian Standard Time (UT+4h)  she@DPX200
##.OBSERVE FREQUENCY= 200.1313
##.OBSERVE NUCLEUS= ^1H
##.DELAY= (6, 6)
##.ACQUISITION MODE= SIMULTANEOUS
##.ACQUISITION SCHEME= undefined
##.AVERAGES= 8
##.DIGITISER RES= 18
##SPECTROMETER/DATA SYSTEM= spect
##.PULSE SEQUENCE= zg30
##.SOLVENT NAME= DMSO
##.SHIFT REFERENCE= (INTERNAL, DMSO, 0, 14.3821)
##AUDIT TRAIL= $$ (NUMBER, WHEN, WHO, WHERE, WHAT)
$$ ##TITLE= Audit trail, XWIN-NMR		Version 3.5
$$ ##JCAMPDX= 5.01
$$ ##ORIGIN= Bruker BioSpin GmbH
$$ ##OWNER= she
$$ F:/spectra/data/she/nmr/H-C/1/audita.txt
$$ ##AUDIT TRAIL=  $$ (NUMBER, WHEN, WHO, WHERE, WHAT)
(   1,<2026-04-02 14:05:53.84 +0400>,<she>,<DPX200>,
      <created by zg, POWCHK disabled, PULCHK disabled
       configuration hash MD5:
       00 E9 B6 7A A2 85 ED C7 34 08 36 98 17 FE 4E 26
       data hash MD5: 16K
       74 AB 83 FE 4A C4 07 3F AA 9D A7 B3 C0 B1 B2 0E>)
$$ ##END=
$$ 
$$ hash MD5
$$ 24 C1 A0 94 06 84 55 65 84 4D 49 5F D9 21 AE 19
##$RELAX= 
##$RELAX= 
##$RELAX= 
##$RELAX= 
##$RELAX= 
##$RELAX= 
$$ Bruker specific parameters
$$ --------------------------
##$DU= <F:/spectra>
##$EXPNO= 1
##$NAME= <H-C>
##$PROCNO= 1
##$TYPE= <nmr>
##$USER= <she>
##$AMP= (0..31)
100 100 100 100 100 100 100 100 100 100 100 100 100 100 100 100 100 100 
100 100 100 100 100 100 100 100 100 100 100 100 100 100 
##$AQSEQ= 0
##$AQ_mod= 1
##$AUNM= <au_zg>
##$AUTOPOS= <>
##$BF1= 200.13
##$BF2= 200.13
##$BF3= 200.13
##$BF4= 200.13
##$BF5= 200.13
##$BF6= 200.13
##$BF7= 200.13
##$BF8= 200.13
##$BYTORDA= 1
##$CFDGTYP= 0
##$CFRGTYP= 5
##$CHEMSTR= <none>
##$CNST= (0..31)
1 1 145 1 1 1 1 1 1 1 1 1 1 1 1 1 1 1 1 1 1 1 1 1 1 1 1 1 1 1 1 1 
##$CPDPRG= <>
##$CPDPRG1= <>
##$CPDPRG2= <>
##$CPDPRG3= <>
##$CPDPRG4= <mlev>
##$CPDPRG5= <mlev>
##$CPDPRG6= <mlev>
##$CPDPRG7= <mlev>
##$CPDPRG8= <mlev>
##$CPDPRGB= <>
##$CPDPRGT= <>
##$D= (0..31)
0 0.7 0 0 0 0 0 0 0 0 0 0.03 0 0 0 0 0 0 0 0 0 0 0 0 0 0 0 0 0 0 0 0 
##$DATE= 1775124353
##$DBL= (0..7)
120 120 120 120 120 120 120 120 
##$DBP= (0..7)
150 150 150 150 150 150 150 150 
##$DBP07= 0
##$DBPNAM0= <>
##$DBPNAM1= <>
##$DBPNAM2= <>
##$DBPNAM3= <>
##$DBPNAM4= <>
##$DBPNAM5= <>
##$DBPNAM6= <>
##$DBPNAM7= <>
##$DBPOAL= (0..7)
0.5 0.5 0.5 0.5 0.5 0.5 0.5 0.5 
##$DBPOFFS= (0..7)
0 0 0 0 0 0 0 0 
##$DE= 6
##$DECBNUC= <off>
##$DECIM= 32
##$DECNUC= <off>
##$DECSTAT= 4
##$DIGMOD= 1
##$DIGTYP= 9
##$DL= (0..7)
0 120 120 120 120 120 120 120 
##$DP= (0..7)
150 150 150 150 150 150 150 150 
##$DP07= 0
##$DPNAME0= <>
##$DPNAME1= <>
##$DPNAME2= <>
##$DPNAME3= <>
##$DPNAME4= <>
##$DPNAME5= <>
##$DPNAME6= <>
##$DPNAME7= <>
##$DPOAL= (0..7)
0.5 0.5 0.5 0.5 0.5 0.5 0.5 0.5 
##$DPOFFS= (0..7)
0 0 0 0 0 0 0 0 
##$DQDMODE= 0
##$DR= 18
##$DS= 0
##$DSLIST= <SSSSSSSSSSSSSSS>
$$ [...]
##$SUBNAM0= <"">
##$SUBNAM1= <"">
##$SUBNAM2= <"">
##$SUBNAM3= <"">
##$SUBNAM4= <"">
##$SUBNAM5= <"">
##$SUBNAM6= <"">
##$SUBNAM7= <"">
##$SUBNAM8= <"">
##$SUBNAM9= <"">
##$SW= 18.0517328524113
##$SWIBOX= (0..15)
0 0 2 0 0 0 0 0 0 0 0 0 0 0 0 0 
##$SW_h= 3612.71676300578
##$TD= 16384
##$TD0= 1
##$TE= 0
##$TE2= 300
##$TE3= 300
##$TEG= 300
##$TL= (0..7)
0 120 120 120 120 120 120 120 
##$TP= (0..7)
150 150 150 150 150 150 150 150 
##$TP07= 0
##$TPNAME0= <>
##$TPNAME1= <>
##$TPNAME2= <>
##$TPNAME3= <>
##$TPNAME4= <>
##$TPNAME5= <>
##$TPNAME6= <>
##$TPNAME7= <>
##$TPOAL= (0..7)
0.5 0.5 0.5 0.5 0.5 0.5 0.5 0.5 
##$TPOFFS= (0..7)
0 0 0 0 0 0 0 0 
##$TUNHIN= 0
##$TUNHOUT= 0
##$TUNXOUT= 0
##$USERA1= <user>
##$USERA2= <user>
##$USERA3= <user>
##$USERA4= <user>
##$USERA5= <user>
##$V9= 5
##$VALIST= <valist>
##$VCLIST= <CCCCCCCCCCCCCCC>
##$VD= 0
##$VDLIST= <DDDDDDDDDDDDDDD>
##$VPLIST= <PPPPPPPPPPPPPPP>
##$VTLIST= <TTTTTTTTTTTTTTT>
##$WBST= 1024
##$WBSW= 4
##$XGAIN= (0..3)
0 0 0 0 
##$XL= 0
##$YL= 0
##$YMAX_a= 128018
##$YMIN_a= -163061
##$ZGOPTNS= <>
##$ZL1= 120
##$ZL2= 120
##$ZL3= 120
##$ZL4= 120
##$ABSF1= 10
##$ABSF2= 0
##$ABSG= 5
##$ABSL= 3
##$ALPHA= 0
##$AQORDER= 0
##$ASSFAC= 0
##$ASSFACI= 0
##$ASSFACX= 0
##$ASSWID= 0
##$AUNMP= <proc_1d>
##$AZFE= 0.1
##$AZFW= 0.1
##$BCFW= 1
##$BC_mod= 2
##$BYTORDP= 1
##$COROFFS= 0
##$CY= -3
##$DATMOD= 1
##$DC= 2
##$DFILT= <>
##$DTYPP= 0
##$F1P= 0
##$F2P= 0
##$FCOR= 0.5
##$FTSIZE= 0
##$FT_mod= 4
##$GAMMA= 1
##$GB= 0.15
##$INTBC= 1
##$INTSCL= 1
##$ISEN= 128
##$LB= 0.25
##$LEV0= 0
##$LPBIN= 0
##$MAXI= 10000
##$MC2= 0
##$MEAN= 0
##$ME_mod= 0
##$MI= 1.114404
##$NCOEF= 0
##$NC_proc= 0
##$NLEV= 6
##$NOISF1= 3.799351
##$NOISF2= 2.8
##$NSP= 1
##$NTH_PI= 0
##$NZP= 0
##$OFFSET= 14.38212
##$PC= 1
##$PHC0= -3716.52
##$PHC1= 23.3923
##$PH_mod= 1
##$PKNL= yes
##$PPARMOD= 0
##$PSCAL= 0
##$PSIGN= 0
##$REVERSE= no
##$SF= 200.129724274929
##$SI= 16384
##$SIGF1= 3
##$SIGF2= 2
##$SINO= 400
##$SIOLD= 16384
##$SREGLST= <1H.CDCl3>
##$SSB= 0
##$STSI= 0
##$STSR= 0
##$SW_p= 3205.1282051282
##$SYMM= 0
##$S_DEV= 0
##$TDeff= 0
##$TDoff= 0
##$TI= <>
##$TILT= no
##$TM1= 0
##$TM2= 0
##$TOPLEV= 0
##$USERP1= <user>
##$USERP2= <user>
##$USERP3= <user>
##$USERP4= <user>
##$USERP5= <user>
##$WDW= 1
##$XDIM= 8192
##$YMAX_p= 0
##$YMIN_p= 0
$$ End of Bruker specific parameters
$$ ---------------------------------
##NTUPLES= NMR FID
##VAR_NAME=  TIME,          FID/REAL,        FID/IMAG
##SYMBOL=    X,             R,               I
##VAR_TYPE=  INDEPENDENT,   DEPENDENT,       DEPENDENT
##VAR_FORM=  AFFN,          ASDF,            ASDF
##VAR_DIM=   8192,          8192,            8192
##UNITS=     SECONDS,       ARBITRARY UNITS, ARBITRARY UNITS
##FACTOR=    0.0002768,     1,               1
##FIRST=     0,             0,               0
##LAST=      2.2672688,     0,               0
##MIN=       0,             -163061,         0
##MAX=       2.2672688,     128018,          0
$$ Real data points
##PAGE= N=1
##DATA TABLE= (X++(R..R)), XYDATA
$$ [...]
1854A6O5K71o4J58m68K5j20O0j33l28K95L79j62j3L01L41n19j40l44J84J79k25
1876b42K9j24M69J37o7K83k29r0r1l55l44Q8N07j95J23q7O97j54k17l8K24k35
1898H9l31N8N71l05j19%M06l1J10o21L8j21K9k39M86l01P8L11k53L07P2L36k83
1921B87j1o52N06j68J58j74j24J5O14n96J24J25k06J2j43J91j03L13m24j13M28
1942E9L03m4Q8l35J06j68k33l1j22J28J65j26j63P65r6k80K1Q4K43j43l52p5R7
1965a09J41l4L0J59J00k4k2l82J33l49J68j60Q4K28R3J85p1K8L13k70m20N1n6
1988a84J19j30K4o4L71J04p3j86O2o3j55k49J22K84J34l39M53J4L6P1l74Q7j45
2011h1j01J82k92J17M57j79k7j12L63j57j19j90J73r7P0j87J81M26j70l17J42
$$ y = [16, 81, 352, 288, 446, -22, 3, -117, -57, -190, -518, -223, 156, -6, -19, 282, 623, 104, -36, -380, -196, -17, -242, -213, -337, 132, 269, 202, 485, 256, 166, 75, -280, -624, -536, -29, -224, -101, -188, 509, 355, 138, 100, 324, 89, -242, -184, 387, 82, -37, -37, 369, 338, 448, -173, -135, -256, -227, -466, 20, -281, -203, 108, -145, 162, 234, 570, 287, 276, -376, 130, -38, 120, -54, -178, -163, 451, -145, -21, 104, -102, -90, -233, -42, -145, 168, -256, -369, 59, 362, 318, 406, 71, 177, 9, -224, -255, -377, -249, -84, -210, -373, 392, 296, 16, 37, 121, 364, 221, -131, -206, -109, 32, -2, 28, 187, 287, 263, 241, -141, -8, -357, -189, -349, -265, -37, 56, 241, 170, 198, 511, 241, -179, -128, -184, -65, -195, -171, -235, 136, 240, 167, -19, 43, -20, -175, -424, -302, -18, 116, -223, 230, 244, 280, 351, -23, 64, -81, -182, 0, -292, -175, 282, 103, 76, -36, 327, 170, 51, -139, 34, -63, 7, -180, 1, 427, 257, -60, 82]
2032H2k77J98L3m4j46L3M5j32l30M07K90K19n15J20J08J85j67j48J7J44o0l26
2054b64M11j56M50j29m22k55K73Or7o4J3J14M29m86K99L14k94J54q6l25J09l4
2076d0l15K80O6K0p0j5K19q1mj21k44J28j29J35q9K71J74j18k9J71j06p9n2j81
2100b09R8R4jj27L9L51oJ47k48k82L66l10r3l5K31M49k72j17J01k43K56kk27k09
2124b49R8q1m6L5L34p9J13q1K66m30M74l94k17K87J13L13o50N25j33k26O6j85
2146a47l0j07K92l22n6K35J4lL47P6N9l7q1l6m1j68Q9l12Q2k16L28l08M64o2J33
2171A93l52J23k72K00L16q7k61j13K00O8M0m1J69Q3k25j45l37K15mK15J15k47
2193a47L77j4l08J19K65k78n6k17J88R0j94Q0K54m5J21k96J06j99m7q6K57k65
$$ y = [82, -195, 3, 36, -8, -154, -121, -76, -208, -538, -131, 159, 378, -137, -17, 91, 276, 109, -39, -22, 122, 62, -264, 147, -9, 441, 312, -110, -365, -92, -86, -183, -247, -234, -120, 309, -177, 122, 436, 142, 296, 210, -115, -6, -40, -355, -75, -9, 11, -59, -74, 145, 64, 60, -61, -305, -177, -306, -171, -260, 11, 185, 67, 38, 209, 103, 24, -28, -209, -111, -17, -18, -145, -106, 245, 239, 386, 138, -144, 222, -88, -181, -216, 15, 464, 192, 75, 176, -67, 189, 187, -40, -249, -151, -232, -278, -243, 91, 12, 125, 44, 310, -120, 354, -40, -257, 30, 143, 456, -194, 331, 198, -28, 38, -147, -177, -284, 8, -314, -370, -135, -121, -124, 223, 299, 358, 321, 240, 204, 163, -5, 84, -228, -146, -362, -34, -342, 122, 60, 193, -159, -36, -308, -108, 208, 121, -140, -253, -53, 15, 55, 14, 183, 266, 41, -104, -441, -226, -230, -15, 100, -147, 230, 216, -92, 27, 292, 14, -42, -259, -71, 19, -175, -95, 159, 114, 235, -61, 45, -154, -201, -287, -30, -295]
2215b95L03j05K96j68L42l13M7k59k5J44j04J93k26q7M52J68k00L3Jm36J46r7
2237a90L9J02j8j36K75j34j9L79m50L19k87j00J31p1J33J50k81m9K30Rl8J54m0
2260A08m41O58k41J61n20M03k69l0l5m5M6P63k45n14M00kj60oo7K61J61l39P8
2283A25N6J56l78K5n5J93m41K80j25Q4J78lr4J29O2l3p6n6M1R1j57k62L19O0K38
2308C57l79J85j86o4k0p9m5L19ml1J50l88K19J49j34k11p8P5OL89k18J7J22k50
2332i9R8M09m62n5j82L16l21J50K93L3p3j30Q7K8j27r9J13Q6r2j3P1n6K11j64
2356B2k5j20k9K14O8k63K49j35K02N0J6K9k30K2R8N6k13p2KK52p3j42M8k01K32
2381E7k05K15l07L77j45O3j03o4J39OL0k7J40m00J17J58m76K33L02l45K59k21
$$ y = [-295, 8, -97, 199, 31, 373, 60, 107, -152, -177, -33, -137, 56, -170, -257, 195, 363, 163, 196, 197, -239, -93, -190, -151, -49, -67, -203, 72, -62, -81, 298, -152, 167, -120, -220, -89, -160, -27, 123, -158, -207, 23, 32, -6, 148, 108, -333, 325, 84, 245, -275, 128, -141, -171, -206, -251, -205, 558, 313, -201, 199, 197, 37, 31, -36, 225, 386, 47, 125, 181, 337, -41, -16, -71, 122, -319, -39, -164, -80, 98, 95, 1, 130, 192, 159, 83, 27, 68, 159, 2, -260, 59, 119, 357, -22, 163, -23, -87, -107, -186, -231, 88, 84, 53, 203, -185, 34, 183, 49, -162, -240, -165, -159, 230, 12, 29, 151, -99, -1, 408, -54, -109, -291, 25, -296, -146, 147, 180, 107, -23, 64, 92, -35, -134, -21, 65, -27, -40, 31, -25, 186, 22, -3, -123, -152, 62, 130, -133, 116, -19, 183, 233, 249, 278, 48, 70, 168, 224, 11, -61, -59, 193, 120, -22, 26, -175, 57, -148, 67, -240, 137, -8, 55, -48, -112, 27, 33, 63, 36, 176, -224, -107, 51, -425, -192, 110, -235, 24, -197]
2403a97k3L17rJ14J99o7k05m5l08M25m14j5Q1Q6r0K46J5l0J69k41K9J38j29j6
2427C0k1K86j49J19l39L03k92Q0J56l51j5J93m58M23p7L77k89p7L2L22k25k8k5
2450b5J51k41jQ7J96L3J79l72M5J3j50l2j5J8K2J86n32O03m17K03K69j67l96Q7
2474b56L74J49j66k00J11j64N2o5r1j7K59l13L51p9J90j40q1K57l23L11j61M7
2496D5J65j80l4K06n16M38l18J82k52J01O7K71jk11M2L4L3nk76J08J14R6n7K65
2520C17k31L0j29J45k53J50L6k56J90k68K83J0J8k79L64k05J75j03oOM9r9M2j56
2544a70K32j54J50J07k79K52j04j06J92n4O4k35n7M89j97q9l4j42M57j35p8k70
2566a61J08L84m91K05l02M59j88m0M0J22nj9q6k24J90J04n4k45M00l49R3m6J56
$$ y = [-197, -220, 97, 88, 202, 401, 334, 129, 84, -224, 201, -213, -228, -147, -61, -151, 95, 110, 80, 249, 8, 37, 175, 46, 30, 9, 295, 146, 265, -74, 229, -63, 17, 173, -178, -193, 0, -458, -35, -112, 265, -24, -101, -69, 253, 28, 0, -25, 126, -115, -116, -29, 167, 200, 379, 7, 52, 65, -85, -117, -132, -114, -92, 94, -438, 165, -252, -49, 220, 53, -343, -256, 118, 267, 101, -99, 12, -152, -100, -165, -256, -273, -14, -327, 24, -55, 135, -5, -86, 171, -152, 159, -2, 45, 210, 30, -4, 202, -314, 124, -194, -12, -264, -163, -96, 175, 174, -37, 5, 39, 72, 67, -209, -101, 13, 109, 52, 317, 86, 116, -13, 132, -121, 29, 65, -191, -1, -269, 14, 24, 42, -237, 127, -78, 97, -6, -12, -6, 43, -56, -14, -170, 62, -92, 58, 165, -114, 138, 34, -72, 120, 66, 130, -105, -162, 327, 130, 41, 7, -135, 322, 187, 109, -161, -53, 331, -160, 45, -257, 202, 14, -26, 14, 136, 131, 112, 26, -198, -8, 96, 42, -203, 197, -152, -59, -105, 51]
2589E1J22k48mK73j64R7k14J19Q0j05k1J63j48m8n9J36p2m1K95k15K81k03pJ74
2613B42j60k49J81R7k75K01R4j34L76m12J62j07k71JK94n9J18k43J83k4J25J26
2635B66o8m6j83Q4L1j62k7J18j64K41p6K76k00l09J58K1k3J13l2P3Ll0k07K30
2659H7J52l16l12J49J19J2K0L0M5J89l98M33k67N0j20J97k45R2L0q0L36q0R7l10
2683i0lK6J71j84O6l49L63J04M9k81K56Oj13j69J70k41K86J3k98p8K95L34n01
2706a68L82k40J81k33M5o0j28K82l61J51L6L48l75K63o8j74J46l6K61m04L56l78
2728a74N4P6L7j86J65k05O23l73J1j35J35j21P7r3O0L31k39n9j59K65j46L3j36
2751a59K63j25J0j23LK43j84K90l74j2L62m33K69Q4k81J52m0Q2K79k79Mj11OK8
$$ y = [51, 173, -75, -79, 194, 30, 127, -87, 32, 112, 7, -14, 149, 1, -47, -106, 30, -42, -83, 212, -3, 278, 75, 68, 242, 82, -167, 14, 111, -164, 37, 131, -3, 373, -39, 123, 16, -255, -254, 40, -19, 99, -144, 39, 15, 140, 266, 198, 152, -31, 53, 84, -78, -105, 13, -151, 90, 14, 290, 90, -219, -61, -40, -63, 50, 18, 91, 94, 64, -143, 87, 239, -77, -389, -240, -121, -109, -89, -59, -14, 175, -223, 210, -57, -7, -127, 70, -175, -83, -53, -133, 203, 123, 220, -90, -93, -67, 104, -80, -14, -363, 0, 104, 153, -128, 128, 134, 21, -148, 22, -219, 67, 80, -218, -296, -1, 333, -168, 214, -26, 155, -78, -33, -93, -221, 61, -300, -149, -113, 235, -140, 123, 55, -119, 27, -9, 252, -152, 204, -174, -120, -44, -7, -193, -28, -233, 390, 17, 28, -107, 28, -93, -16, -109, -49, 282, 43, -16, -175, 90, -56, -23, -159, 104, -21, -11, -134, -131, 112, -72, 218, -156, -168, 194, -239, 30, 114, -167, -15, -55, 27, 306, 27, 31, -80, -74, -46]
2775d6ll09O18n00L89k4k4J2o3k04L00L00l17KJ11o9K3j14%j49Lk74L10M2j90
2800a76J73N1J47m96L86Q3j43O2j71j7K59j65n8K68j45o4j55J91m2J75k50J26
2822C9j0J0J28l24N2O8O8N2J7j60k23K68J11j79K4RJ6R0k43j77L03L6k33M72k84
2847g0P5P6j2p5P0J62j48j49P6p8K15j15j00o9R2q5K71l49J08J01j08M0k8L23
2871B23j68k22J71j06m3L44m72J51%J0J90J54k37K00Q7o0j49k05K53j45j05j64
2893b93M15n0j30J87j87O2K36l48K42j14Q5k12k9K63p1n5J24j54J18L0k73K26
2915G2j58L1K47k69o1P4j08p8J36p2L1L19j61K31j55r7J09Oo0r6j55J09J74J29
2939A98O8l74J2O3J58m62N18kl30N5J46l03M37q8L5r1lJ1j30M8K1m1Q8j54K9j0
$$ y = [-46, -49, -358, 260, -240, 149, 125, 101, 113, 50, -154, 146, 446, 129, 131, 242, 173, 196, 82, 82, -67, -64, -338, -28, 14, -176, -3, 48, 195, -301, 85, 168, 25, 87, -84, -101, 158, -7, -65, 203, 58, -6, -161, 30, -12, 163, -87, 39, 29, 39, 167, -157, -105, -37, 31, 83, 100, -60, -283, -15, 96, -83, -59, -50, -34, 56, -187, -364, -61, -25, -258, 214, -70, 5, 81, 69, -6, 64, 226, 78, -71, 5, -73, 142, 27, -73, -142, -50, -135, 136, -213, -105, -4, -112, -72, -100, 223, 55, -167, 4, -102, -145, 199, -273, -122, -122, -112, 78, 232, -5, 195, 282, 222, 73, -132, 121, -24, -129, -293, 122, 72, -58, 129, -58, 4, 240, -108, 134, 20, 105, -107, -136, 127, 56, 1, 125, -29, 89, 119, -154, 72, -86, -55, 192, -77, -138, -64, -172, -250, -114, -186, -155, 164, 3, 234, 79, -18, 91, 97, 37, -59, -214, -105, 69, 198, 266, -108, -96, -33, 125, -337, 181, 179, -151, -96, 50, -253, 184, 96, 131, 40, 37, 48, -82, -34, -13, -54, 34, -120, -91, -101]
2965a01o8K56J01m93K27N1K85k85J55j49k32J52K22q8OJ17P4l49J86J67r4l92
2987b52P1J61j30q4J70J32j85K19k77K30O7j19p8l56M74j72J30q0o3J51N5q4k10
3010b30J99J44j92K91k39K71j47n9mj11j33J62P5J28k86J75K33k82j50J69J39
3031A53k36j13K01J41J16l53l5K32j37L3k44K41l19L83N5k62L08k36N4j27j42
3052b87M40k99Q1J03k38L47m50L68K19l71Q1J69l42L31n9j15Qq3p1J69k44M51
3074B08j4m82O4J75j87K13q8K64q1P4k62J4J62j70L54k66j42L0J46j0J97j87M9
3097F1L0j41J06n7k42R3L09l18K18L1L1O6k47L78l33j39J60J03N0j90M1K0k72
3120b42K27j93L97n08M73j01K08m53L3K08L0L8j8j33J15K17p22K38J88j95J3P1
$$ y = [-101, -169, 87, 188, -305, -78, -27, 258, -27, 128, -21, -253, -101, 121, 33, 39, 156, 230, -119, 67, 234, 140, -252, -181, -20, -150, -234, -64, 68, -117, 102, -175, 55, 122, 3, -75, -431, 43, -129, 1, -79, -142, 9, 64, -20, -230, -31, 113, -79, 212, -27, 244, 97, 38, 34, -77, -210, -48, 27, 155, -131, 44, 277, -5, -155, 14, 153, -83, -196, 5, 146, 262, -91, -126, 106, -31, 2, -242, -1, -320, 63, 118, -144, 164, -72, -18, -145, -287, 153, -146, -65, 38, -200, 147, -303, 65, 284, -87, -6, 163, -179, 152, 93, -22, -14, -97, -168, 1, -243, 208, 194, -288, -224, -49, -236, -23, -111, 153, 72, 146, -116, -102, 60, -110, 244, -22, -164, -134, 12, 2, 199, 12, 61, 91, -50, 56, -1, -243, -150, 159, -159, 59, 90, 121, 187, -60, 318, -15, -154, 6, 109, 159, -31, 10, 30, -242, -15, -208, 189, -319, 154, 53, 261, -192, -159, 49, 79, 117, 99, -34, 81, 298, -424, -186, 2, -193, -180, -109]
3142a09J49o5O6m1J18j36j2K7l0MN7K2j66J78j31JJ60l78L17J20l53J99l39M74
3166A32l22K83J10o0m8r6P6j45K60j37j49P3K3k9J8k27K43j8j22J62M6J04j28
3189D9j73J87j86j76K71K21j86J97m62J30q3K64j35q6Q5J18qJ7K19j71P4q8n72
3212d94N38N2n9l6Op1J98j00O1M8j00Pnk22J19J41j51j25M1K83k82kN3J78k02
3237a24K52j94m8J40k08L78l12N7K14k44K84j86J01p0K9o3k4l15K77O5P9j98m7
3260a57L00k90K66K2K78m14M7j98K71M4j56J01m0%q8L5r6L66m33L7J83l21K80
3283C7j20J71o4J98j30M6J2m18L24n2K29m36J83K03r3K6k17L95M0n02l5j22O35
3306C10l85j80K01R4j70K93O1m40K02k0N3qp5r3J70k0JOr4J43j93O2k0L87l06
$$ y = [-109, 40, -25, 41, 0, 118, -18, -30, -3, -33, -29, 28, 50, -116, 62, -69, -68, 92, -286, 31, 151, -202, -3, -342, 132, -190, 93, 203, 143, 95, -1, 75, -70, 190, 53, -96, -23, 0, -29, -11, -238, 5, -13, -135, 27, 73, 177, 49, -124, 63, -123, -299, -28, 193, 7, 204, -258, -128, -211, 53, -82, -168, -83, 35, 27, 44, 263, 92, 166, 78, -494, 44, 96, 37, 1, 7, -64, 134, 34, 95, 143, 43, 50, 45, -177, -58, 83, -68, -193, -152, 131, -151, -153, -100, 78, -124, 128, -66, -114, 26, -182, 196, -116, -59, 155, -89, 195, 9, 110, 40, 69, 6, -18, -333, -56, 9, 88, -110, -157, 143, -147, 119, 141, 419, 5, 52, -146, 125, 169, 13, 114, 74, 74, -14, 21, -75, 291, -142, -105, 78, -243, 37, -83, 88, 24, 222, 92, 138, 150, -268, 56, 4, 233, -203, -20, 183, 90, 116, -101, 294, 334, -168, -203, -325, 310, -75, -255, -54, 40, -130, 163, 224, -216, -14, -34, 19, 11, -64, -157, 13, -7, -6, 0, -94, 49, -144, -82, -102, 285, -21]
3331b1k8QJ30j33J91mO3j63k87M43k14K86m06R1k26L93Q1k92R8qj38J89k53K37
3355C7L2l9l47L49M1m3k93N43k4j63j17L2R4r0N6K1l06K86n0n4j64J86J08P3j17
3380E1k40J43M5J00k56L28j34p7L7j26J00j50L45k45M05m21k00R9N07m82j80L74
3402B3j00m1K18N2l49K78l01J29K01j82j30J35k67L75J67k04m7N5N6K1j03k3l4
3425g1M3j5L2m1J19j58o2L00j53J10j43J85j07j27J10O8q8R1J40P2m37j60K04
3448h8j21K55O4j15j2J86l85K22p7p4M03k74J56j87M2m34K51J40J21m6K0%J20
3471A67j80j04O7n7n7M9J54n6J82j68p6j72Q7L34l5j47K6q7P2k7J80j08K16k83
3495b3o0O5K54q3m5k68J31k62K01k1k87J88J46j34K54j0l7k4J93k13J27Q3j68
$$ y = [-21, -49, -41, 89, -44, 147, 143, 206, 43, -244, 199, -15, 271, -135, -44, -270, 123, 204, -88, 10, 2, -136, 53, -200, 37, 69, 30, -317, 32, 73, 30, -263, 280, 256, 93, -24, 8, 102, 12, 68, 89, -217, 69, 19, -35, -199, -13, 95, 168, 51, -189, -46, -1, 99, -157, 171, 37, -40, -3, -129, -29, -179, 166, -79, 326, -95, -295, -196, 311, -171, -351, 23, -77, -118, 100, 152, -197, 81, -220, -91, 110, -72, -202, -67, -334, 41, 208, 4, -43, 12, 68, 89, -14, -37, -71, -28, -43, -11, -52, 67, -91, -153, 147, -6, 104, -39, 146, 39, -88, 22, 90, 2, 93, 233, 305, -132, -292, -88, -209, 46, 110, -5, -17, 169, -216, 6, -71, -145, 258, -16, 140, -47, -5, -439, -188, -48, 73, 27, 47, 47, 167, -13, -117, -50, -107, -164, -115, 39, -17, 165, -3, -79, -251, -164, 170, 135, -12, 14, -73, -1, -28, 152, 44, 260, -23, -83, -18, 236, 153, 108, -160, -29, -291, -90, -111, -398, -210, -64, -198, 56, 46, 9, -15, 178, -35, 92, 175, 7]
3518Gp5P7o0P8P4j83J11O4m4j17j69L52n5l21L42o7lJ55Jj7l47K32o6J25l38L89
3544A45K28n9l05R4R6l35Q8K94L6k34K9Pj70j37M18k73J28j01j5R5Q8j23n8n6
3568a20M0J85m57M03J8Oq3J96q4j44J00Jk30J62P2K4j68q6J99r2J13rj56O9j8
3593e9J29k77J21J69l24P4N8M25k67k82K17j99K40P8m27L93q0K99l44P1l45M01
3615G1q2j99J76p4J02J25L9k54L67q0j36j39L08j85j98J80L2p9j54J59k3L11k41
3638B6k67J20o4J36k6n7J29J27k10Q1Oj68l2L33j3np6k50J72k38K09RQ7j19J70
3663H0k06k9L2N5n0J57o2J04k44p4K94j31K91P1k73L57k11k56l6K70oj30J20k61
3687a38J34k9J72r5k43J76K3j79J66j7P1j62m1J91j11J46m1lnm9L2j1J9j67K00
$$ y = [7, -68, 9, -51, 27, 101, -82, 29, 93, 49, -68, -237, 115, 60, -261, 81, 14, 11, 166, 167, 150, -197, 35, -31, 94, -244, 145, 373, 314, 9, 103, 199, -136, -48, 246, 282, 48, 77, 84, -86, -223, 195, -78, 50, -51, -66, 29, 117, -6, -64, -120, -80, 105, -352, 51, 69, 75, -8, 188, 104, -40, 60, 61, -169, -7, 65, 89, -79, -165, 34, -58, 55, 46, -110, -41, -59, 70, -207, -86, 83, -241, -167, -109, 316, 49, -233, -16, -215, 25, 103, -324, 69, -11, 288, -56, 15, -330, 71, -11, -210, -34, -108, -6, 119, 158, -96, 271, 191, 55, -84, 224, 39, -159, 21, 53, -26, -180, -21, -44, 267, 26, -241, -121, -185, -49, -75, -132, -3, 124, -86, -5, 1, -167, -199, 134, 121, 116, 40, -210, -38, -276, -67, -58, 29, -90, 80, -126, -155, -123, -68, -118, 39, -23, 81, -163, -237, 57, -74, 217, 288, 15, 372, 161, -95, -131, 139, 133, 3, 123, -138, -4, -33, 139, 44, -199, -23, 0, -179, -13, -30, 41, -121, -162, 29, -82, 64, 23, 20, 15, -34, -2, -13, 6, -161, 39]
3712C9q0Q7j34j2P4kL42m11O8J19o3P0l0j82J20j29L36k59K0P6R0m6j48L9K65
3737B49l95M0j0J31K3j82k43K47Q5m2j0K7N8P5N0L3rN9l65q4J96j4K72l22J83
3762E2O4L7o7J34k21M5j0L6kp5n5J68l94L50k4j85R5j1O1j28J45K45M9n10J21
3787h0J22J07q8j67j09K30K71j93r6m6j77J50k05K84p4K18q3K38q8k55O6J22j05
3810D2L5pk02K12J41K7k75M3J99l37J06P4j88L44n54L73J66k74j47K81j33J04
3832C0p8O9J93k92J42J13j58M0j36J80Lk25J62J96n5n9N7R3l10P3j80L26k58K13
3856A39j71P6k06J79k95K23P5j08O0m5l7J10j41R4K86j6J02m97L31k49L1kJ54
3879I3j40M6o9j01m16O26K18m47L45k34j42M06l34J11K28j56o2L9K62j09m82K50
$$ y = [39, -41, 46, -88, -100, -26, -28, 314, -97, -29, 90, 27, 97, 67, -115, 5, -124, 212, -47, -27, 49, 139, 93, -55, -16, 249, -146, -106, -116, 15, 38, -144, -387, -140, -55, -97, -107, -80, -22, 53, 103, 136, 127, 186, -179, -263, -67, -81, 191, -131, 52, 116, 153, 86, 220, -1, 44, 34, 70, 68, -7, -62, 106, -288, 62, 38, -147, -52, -63, -2, -130, 15, 260, 309, -201, -80, 42, 149, 61, -106, -215, 15, 286, 93, -3, -49, -226, -76, -281, 3, -71, 147, 64, 302, 214, -41, 25, 147, 42, 77, 70, -132, 80, 221, 248, -27, 16, 215, -122, -16, 58, -130, 214, -340, 33, 199, -75, -222, 59, -74, 30, -48, 21, 214, -78, 64, 177, 19, 59, -77, 103, 106, -119, 43, 239, 184, 125, 182, 275, -35, 38, -142, 184, -74, 139, -32, 44, -162, 17, -278, -55, 20, -88, -28, -73, -110, 0, -141, -47, 239, 223, 325, -172, 159, -90, -59, -61, 93, -47, -1, -70, -171, -587, 39, 257, -190, 155, -79, -221, 185, -149, -38, 190, 34, -28, 11, 273, 164, -318, -68]
3901f8J04l7J08k30J61L09k53j43N9p8P7K45p3k27O1O2l5o5K53j03r2Q3r7j0K55
3926B66o15N87k75j80J64j38n7J20r3L95j65l1M9l3J01n1R6n6J10l12m6J31M2
3949Ik8Lk09L91J5J6j62l8J79j92r0pL01J48k84O3m09O4L60K7k72o0K80j76L64
3974B93k94J08k08J27M9j2o0j17P2P0J9k1pj99L05j36K95l23k0j89K89J45l36
3997a50K31l01J92k1L11n69J94L1L54j93k18M10l11J49l02M35l07J2J74k13Q1
4018a1j71K42j96LK50J21j23k82K8r0k39N86j91J10K31o2l82O9P7M3K74j73R3
4041B07k58P5J26k46NK45n4Nr4j65J98l33N45j22k82kJ31r2J97J19k07j41K13
4064G0k89J01k17J48J05J25J00j40k55M42l07M0J65O7j14j17K54j79R6K1R5K4
$$ y = [-68, 36, -1, 107, -123, 38, 347, 94, -49, 10, -68, 9, 254, 181, -46, 15, 77, 42, -23, 230, 127, 35, 118, 21, 11, 266, -349, 238, -37, -217, -53, -191, -248, -128, -221, 174, 9, -22, 27, -6, 95, 44, 140, 84, 194, -118, -164, -33, 9, -19, -16, -225, 166, 181, 197, 35, -3, 176, -16, -106, -113, 188, 336, 52, 115, -294, -230, 130, 157, -115, -175, 105, -71, 293, -1, 107, -101, 26, 75, 63, 3, -114, -42, 28, 47, 26, 19, -180, 125, -11, 284, -39, -59, -248, 41, 186, -150, 81, -220, -28, -49, 262, -307, -113, -82, 272, 79, -139, 271, -40, 109, -193, 242, -65, -53, 121, -92, -11, -182, 60, -136, -133, 117, 238, 115, -167, -139, -229, -468, 118, -73, 37, 268, 206, -176, -107, -30, 13, 287, 114, 207, -51, 24, 150, -96, -91, 154, 100, 105, 11, -154, 44, -289, 256, 134, -148, -150, -19, -111, 86, 205, -2, -143, 70, -219, -118, -335, -187, -82, 43, 143, 3, -252, 190, -117, -77, 88, 155, 41, -76, 178, -1, 95, 116, 211, 235]
4086B35l05l4Q8J09ok0j8l6k28K71j82K41J5l45J57J31N3j52j24J22J45J06n7
4109A66k02J02n8r6R5J7l5j5K27j1q8P3j69J9N0m80N84j76K87j34j71J77N2l18
4133a04J99l16M43m46J90K67K6N9l00J1k18Q6J1K18j54o4J32K48k79o4j3p5K70
4156A27R1k60j25J94j41N2J5k2N2O6l4j92K45n5m2J29qj23M0jJ5K42j89K88m65
4181a01L44l83O03m93M9J89k86M4j73R3L63l26m4J65k38K03Ok33L06k33L6J31
4203B2j27J13J31l8l7L6r7K7q2kr5J52P0P8m3j9j12o3K98n9l04J36K93k04j16
4228d2K2K01j79J80j75J09j32m6J14j80L74j12j1j71k04N93m37q2M5J56j48M55
4250C30l46m4K63n88O7N13j08l12j08N39l97K00q1q7o0J92J23k02J63Q2j68j6
$$ y = [235, -70, -104, -16, 93, 87, 67, 49, 13, -215, 56, -126, 115, 130, -215, -58, 73, 126, -26, -150, -28, 117, 223, 166, -36, 66, 8, -88, 7, 24, -11, -26, 201, 190, 102, 175, 6, 25, 75, -405, 179, 3, 290, 156, -15, 162, 214, -104, 95, -221, 222, -224, -34, 233, 259, 318, 18, 29, -189, -103, -92, 126, -28, -92, 40, 288, 9, -55, -68, -143, 127, 218, -42, -167, 27, -114, -62, -47, -69, -17, 49, 15, -177, 68, 13, -29, 100, 92, -31, 9, 8, 23, 265, 76, 364, -101, 243, -140, 463, -30, 19, 208, -78, -34, -207, -114, 249, -77, -121, 44, -194, 9, 15, -218, 88, -145, -109, 22, -105, 8, 139, 101, 64, 100, 3, 30, -52, -54, -149, 3, 73, 151, 108, 89, -23, -86, 212, 153, -151, -15, 278, 74, -42, -20, 181, 2, 182, 7, 116, -16, -62, 52, -128, 246, 134, 123, -48, -252, 341, -96, -178, -133, 23, -125, 330, -16, -60, 203, -385, -318, 195, 87, -225, -333, 206, -191, 9, -72, -159, -219, -27, 96, -106, 57, 139, -29, -45]
4272d5k33K22j24M91m55J88k95K73k7N9J66j14l6l54K44R6k34K7K68k90L04j27
4294DJ64j70p5J06K56q8j61k53M3L60l4l93K60k23J93P0o1l50K79o9k2J39K2P6
4318G3qj77k9P3jJ63k95K87j09p6p6L15P0m05J41J23j67j90K20n1L13j71q5J90
4342A28m00L80j40k5J14k04oJ64j40k8L00j6j01q5K21l48K77P5k09J87k06J79
4364A17m12J31O5K17K3k15J24q8L21m45K44pl7o9q4K3J53n8Q1l15J72J3l8R7J71
4389A84j67p5J71k78L04m12K41j43J19L4K84l40k4R6J31km01K43Q5j28J12J04
4411A38M3J3p9k05K59l27M20k34kl0%L94n12O2Q0P9K5k49q5PJ21Q3j52J72M9l20
4437b50M01l82K61o9j11L4J20j56K84j75J22J24k28k33j18L45j38K85j12J21k12
$$ y = [-45, -278, -56, -180, 311, -144, 44, -251, 22, -5, 54, 220, 106, 70, -284, -40, 56, -178, -151, 117, -173, 131, 4, 168, -2, -77, 29, 285, 197, 36, -217, -174, 186, 152, -241, 19, -204, -11, 59, -2, -352, -73, -142, -164, -25, -3, 73, 65, -112, -141, -68, -69, 94, -201, 86, -23, -99, -175, 140, 210, -195, -54, 69, -98, -288, -68, -119, 194, 23, -62, 128, -272, 108, -32, -57, 57, -147, -153, 11, -129, -157, 143, 127, 26, -59, 162, -186, 91, 166, -43, 144, -62, 117, -295, -164, -99, 118, 141, -74, 50, -38, 283, -162, 82, 75, 38, -31, -115, -92, 61, 3, 84, -231, -59, -46, -84, 13, 184, 17, -58, 113, -165, 139, -273, -32, -175, -56, -22, 262, -78, -102, -6, 125, 123, -278, -35, 50, -78, 34, 138, 181, 194, 115, -90, 169, -158, 262, 28, 26, -4, -4, 390, -122, -60, 20, 99, 124, -125, -210, -203, -82, 1, -151, 21, 70, -250, 151, -231, 30, -39, -150, -116, 4, -152, 132, -43, 79, 203, -25, -258, -376, -31, -169, 116, 4, 125, -87]
4458h7P5l8J54j86J57k80J85j0n3l9n8P9L1N3KJmj06J75J50M8j72k7j14J64m46
4484c46J82L99k88P1J13m7N1rPj91R1oJ58k10j2m8oK80Q1m89J94N5L1j7l7j80
4510a73Q8J71j93K17m8Q3L4r4K00j13k01j77K31K81k83L9j67N1nr2K01q7qN8j90
4535a77O2K54n9ml8N9m9J79r8j92KL9K22j25Q2j04q6J76j00j32o3j15K90Jj59
4560a35n6J51J02O5R4m8l32O4j6L5n1J13O8j2k47J45j15J6J36j25P4L8J5j66K35
4585D8k56K98j00K03Nk45M3n2j61J69j20K03R7j80J84k05M8K01Jl27N8J03k4N9
4609E0J1K29k45j49K80k78K89k17J97k82J72m2k3J2o3J70o1m32L84k6j08M6k7
4632a13K14k36J53q2K5mK46J00m16j20J83K1J24l30K39j60P0K05q8r5k4Q9n9J86
$$ y = [-87, -12, -50, 104, -82, 75, -205, -20, -30, -83, -122, -180, -101, -70, -17, -15, -14, -18, -124, 51, 201, 249, 77, 50, -64, 100, -346, -164, 235, -53, 18, 131, 84, 135, 126, 133, -58, 33, 27, 185, -25, -37, -85, -91, 189, 270, -219, -25, 30, 61, 44, 7, -173, -85, 86, -107, 110, 62, 145, 179, 85, 285, 172, -29, -206, 25, 306, 23, 62, -105, -54, -59, -151, 50, -37, -45, 13, -177, -115, 139, 80, 76, 38, 97, 48, 227, 129, -63, -61, -22, 200, 75, 157, 53, -33, 143, 43, -89, -152, -267, 23, 24, -135, -191, -40, 62, 127, 221, 173, -159, -95, -111, -76, -127, -14, 54, 42, -205, -60, -175, -159, -23, -148, -74, -36, -21, -187, 48, -208, 90, -10, 193, 198, -47, -4, -56, -217, -48, -168, 35, 132, -48, 136, -69, -21, 180, 181, -146, -88, 15, -9, 50, 61, 290, 45, -104, 176, -102, 187, -30, 167, -115, 57, 15, -8, 4, -59, 111, 50, -382, 2, -24, -132, -86, -113, 101, -135, 18, -64, -39, -43, 203, 303, -113, -233, -50, -29, 95, -235, 4, -156, -86, 119, 31, -64, -88, 1, -58, 128]
4656A28k58L00l36j40L53j9J82o1k63R2Q0o0jJ65j89J17j10l0j11J36K60l27R9
4679Gp0J58m2j03k2K11r0j73O2K00j82p8N7O2L54k19j42K57m37K73n2N0N3o8q1
4704a5ol62M53j62O2J36n0N1j50j56M31l60K49j79K49j76j00J23K1n5r0j15k5
4727b26J24J6qJ33k79Q4K60k48K15k4n1Q1j05r0j8J02j00K53k53K58j21P2K91
4750C66m85K82m30J42L41l12K70k75K44k41R9r9J25J93k63k01J20P4K69o6k55
4771a02J18r2Q9k31M56l03L59k38k4j17j24K00Q0Pj12k03L29J05j54l4K03j40
4793G2L41l20k27n6J29k6K33Ol06P1j71L19J95n9j24N8k17L12n4pj36L1O4L3l22
4818a61j0J25p4J08J68j8k2J15k90j4n6K17k36J87o3o2J55m54M51k09N5p6J59
$$ y = [128, -130, 170, -166, -306, 47, 28, 210, 149, -114, -22, 58, -2, -3, 162, -27, 90, -20, -50, -161, -25, 235, -92, 7, -63, 95, 53, -50, -72, 139, 49, -124, -62, 138, -44, -122, -65, -3, 351, 132, -10, 247, -190, 83, 31, 81, 134, 66, -15, -21, -383, 70, -92, -30, 106, 56, 107, -43, -199, 232, -128, 121, -58, 191, 15, -85, 38, 59, 4, -86, -201, -226, -102, -86, -94, 39, -240, -156, 104, -144, 71, 47, -4, 77, -28, -118, -136, -34, -134, 119, -134, 124, 3, 75, 366, -119, 163, -267, -125, 216, -96, 174, -101, 143, -98, 1, -98, 27, 220, -43, -244, -124, -50, 219, 153, -102, 16, -76, 13, -218, 238, -65, 294, 56, 32, -85, -209, -9, 71, 78, -34, -237, 92, 197, 43, 9, 212, 72, 413, 93, -134, -190, -61, -87, 146, 152, -154, -83, -254, 65, 260, 201, 77, 135, -82, 230, 176, 169, 33, 64, 128, 161, -161, -171, -46, -120, -12, 156, 138, 116, 231, -59, -73, -129, 88, -148, 39, -24, -86, 69, -385, 66, -143, -88, -164, -5]
4841ej36J49j38J0j9K79j31p8J76k58J83J24n3m66L49p4K32Q4k40K54k32m9N0
4864A1Nl68M85j91O0L6Q1q9j27J69j44nL07k64l3K01k43l1r5M51j29n8l4j27J00
4889c2q3K89p9K0k74J57N7o1K3n9K50k49j97O63n37J06j33Rj85M45n4K2O5j25
4913C8Q6j10k5K0J91k22n0J19l2j01M2j11M10m09K5K9r2M74m26j11J43M1K20j88
4937c9M1J17OOl07N1L44j22P0k18K9Pl4K45k47J08j23O3m4K4Q1o7J78J3m43J92
4963f9j80J84Jl0J81l48J67J70Qo2K40m20PM03k51P4M5j71R8J09j96J10l03J24
4987a09K30l7O3j05r6J19J54k80k06K43J23j33K8Q1m7j80j48J89PL3J12K26j35
5010A32J97l68K4j21J36o0J47q1K55k01k2K12j59k71J54J47l66L89j30j44l4L72
$$ y = [-5, -141, 8, -130, -120, -139, 140, 9, -69, 107, -151, 32, 156, 103, -363, -14, -88, 144, 228, -12, 242, 10, -39, 11, 16, -352, 133, -58, 2, 38, 119, 30, -97, 72, -72, -77, 230, -34, -67, 134, -109, -140, -235, 216, 87, 29, -5, -132, -32, -115, 174, 95, 115, -159, -2, 55, -6, 17, -42, 208, -41, -238, 425, -112, -6, -139, -130, -315, 130, 76, 98, 163, 38, 124, 14, -11, 9, 200, -22, -72, 47, 15, -86, -44, -155, 255, -154, -129, -100, -192, 282, -144, -255, -112, -71, 149, -39, 2, 119, 125, 131, -176, -125, 219, 97, 167, -51, -22, -15, -49, 196, -51, 57, -66, -3, -47, -23, 58, -9, 169, 182, -261, -69, -249, -65, -64, -94, 87, -261, -94, 76, 84, 22, 262, -158, -151, 252, 1, 75, 120, -51, 47, 156, -40, 70, -233, -109, 121, 84, 147, 42, -54, 65, 219, -61, -267, -24, 99, -34, -6, 75, 28, -152, -300, -111, -104, -71, 41, 267, 132, 329, -39, -15, -136, 0, -60, 87, 6, 261, 60, 38, 250, 91, -180, -26, 121, -245, 144, 14, -130, -164, 208]
5032B08m26K10J72j73l4q5K35p1l1j30P0K74l00J15l44J67J72l42L35O9j85J61
5054F7R4m08K30J45O1j41J86pkn87N92j72J34k44Q5J32p5N4m74N00m00K76j52
5077a06P8K94k72K01k33j27K52J24K9j93l64J39K9J39m4J9J02Q0k41l8J05J26
5099I9R6O0n37m8L92p8k63L68K0O4k53n1Q9M5M5Mj39J02j65J40o4J88p9k28J01
5124i2k88K08L75l49j78O23n08J56q3J46Olj09P4j35L5K24n4r1l15L10j14J90
5147B8J06k31J26K61j98J18j58j01O7J4J82k99k1K06j91Mj88L49j08l6L82n02
5169a90K75j82J53O2r7J58j33n1k9j41L63k3k02J58j93J29K05n42K34J30j70K80
5191A94n01N14K1k0k17R9m4m2j07L1K35k61N6K42m55K55j29J23m2J54o4k45K85
$$ y = [208, -218, -8, 164, -9, -43, -128, 107, 36, 5, -125, -55, 219, -81, 34, -310, -143, 29, -313, 22, 91, -94, 67, 161, -247, -17, 128, 189, 48, 234, 227, 225, -362, 230, 58, 192, -52, 33, 165, 90, 144, -330, 170, -230, 46, -106, -28, 266, -6, 195, -38, -165, 87, 211, 240, 47, -317, -178, -149, -10, -54, -35, 67, 147, -94, -132, -27, 99, 195, 255, -282, -330, 62, -16, -279, 89, 109, 173, -80, -131, -42, 3, 48, 52, -87, 15, -150, -10, -74, 114, 35, -193, -92, -380, -172, 203, -146, -324, 299, -209, -53, -136, 10, 16, 13, -96, -22, -157, -122, 102, 48, -43, -358, -48, -162, 28, 134, -97, 29, 290, 92, 210, 52, -49, 18, 32, 214, -85, -106, 100, -91, -87, -275, 74, -34, -70, 312, -190, 85, -97, 56, 118, 21, 179, 46, -5, -34, -175, 188, 165, -37, 121, -72, 57, 262, -280, -46, 84, -86, 194, -307, 207, 228, 208, -9, 90, 46, 4, -103, -72, 163, -98, -42, 200, -255, 0, -129, -6, -48, 106, 42, -203, 82]
5214H2J07k26J28N0k41L93o7j23j02N2J33j99RM9l0r8p9O5K16j2q3J37l15J13
5238d1Q2o0l43N53k46J96p6L4j38NJ16O5j63J7j42q8K37n0P9J27j40m1r7j18J63
5263f9O1R5j28J98k81J52n7K76m16L41k97K74O0l47J59q1K05o5q6R8j24K6j18
5286a24J2K59r4Q3j12J93l01J6J65j29M7q7n8J89K8J7p2Q2j85K63j00j31M9K94
5310C04l35k69J44N5L40k35n1QK05k89K23j12J7ln3j54n5P9K55k3r4J6J3J32q3
5335C5j68O9J55j47j11L3K60k94K48p4%r3R9j90L18j07J13j71J18j91L77m5m41
5358b07L3J11RK38o2M5k07R9k28J3K73K1K5n6j99J45K08j93m2L25l54k15N3j73
5382c38L75j50L81j87K6J0P0k39K22j85K15k60K02j73j25K78k83J25J34j45J97
$$ y = [82, 189, -37, 91, 141, -100, 293, 226, 103, 1, 53, 186, -13, -4, 45, 15, -83, -162, -97, 119, 107, 24, 161, -154, -41, 41, -19, -362, 191, -55, 141, 65, 99, -39, -34, 82, 147, -16, 1, -141, -229, 8, -42, 37, 164, 24, -17, -114, -232, -69, -8, 87, -41, 157, -124, 28, -29, 247, -169, 172, -125, 149, 209, -138, 21, -60, 145, 80, -6, 92, -32, -6, -124, -112, 147, 53, 136, 24, 217, -84, -68, 97, -32, 15, -72, -130, 59, 87, 104, 32, 114, -71, 192, 92, -39, 10, 304, -31, -300, -156, -101, 239, 4, -47, -39, 166, -123, 100, -12, 5, 2, -51, -205, -260, -181, 74, 51, -43, -27, -14, 118, 35, -133, -64, 91, -56, -167, -134, 126, -168, 80, 6, 6, -87, 12, -178, 140, 33, 146, -25, 93, -98, 279, 234, -207, -174, -63, -54, 184, 122, 167, -40, 59, -169, -156, 117, 138, 163, 107, -92, 53, 261, 68, 26, 351, -3, -218, -165, -338, 37, -113, 268, 81, 107, 117, 187, -52, 170, -15, 200, -60, 142, -31, -156, 122, -161, -36, 98, -47, 150]
5403A50k51J05k39J97J90j56m2J70M50o98N06k98N2j61k33J85pK08K3J65l33P9
5425F2p2n7l5P2k3R1J78J14l19j64L22j80P8j61j42L92K17n73K71J72n8k29J06
5448F2m4M6P7r9J1P5Kk96M05n54L51k56L50J03q5j55j7q4LK49k19K52L3j74N1
5473H7J19k24JK78j98N0j58m4J46L2j62J93p4lLJ43L7k86j56K26P6j43q7J30q6
5498a00K7O5Q4j01K06m2l86J75J55N8l81J33P5k04M37j26k40R6J24k04J01J82
5520A34k68J89k84L26j80j46M19kj82j78J18J49j70j62L49n7P6mJ0j41K7j56K31
5543I8k4k17j3J74QJ26j35j22Q2J15K37m05J52N4k67L86m05P1O4J00j53L61l21
5566c4l2K87k26m8J48l12Q6k1k03K97o5K38j33P7J43k13kK7l9K19k3j61P3K1Q9
$$ y = [150, -101, 4, -235, -38, 152, -4, -46, 124, 574, -124, 382, 84, 136, -25, -258, -73, -80, 128, 151, 316, -17, 62, -10, -67, -102, -30, -53, 38, 216, 330, 11, -153, 169, -11, 67, -94, -236, 156, 373, -200, 71, 243, 185, -44, 62, 18, 64, 141, 42, 53, 128, 130, -166, 239, -315, 36, -220, 130, 233, 148, -7, -24, -108, -105, 144, -75, 177, 210, 36, 87, 206, -18, -17, 261, 63, 113, -45, -89, 57, 89, -73, 120, 46, 43, 46, 189, 226, -60, -216, 10, 86, -57, -144, -14, -100, -73, -8, 76, -25, 181, 139, -247, -72, 83, 141, -240, -107, -32, -236, 201, 75, -165, -69, 55, -149, -48, 134, -134, 55, -229, 97, -83, -229, 190, 188, 6, -172, -54, 95, -75, -237, 112, 55, 131, 127, 137, -4, 23, -133, 98, 74, -143, -156, 18, 26, 152, 17, -105, -23, 92, 329, -76, 76, 130, -137, 249, -156, -85, -21, 79, -74, 287, -34, -66, 221, -5, -53, 95, -217, -131, -152, -355, -58, -123, 115, -18, 59, 202, -11, -13, 14, -25, 194, 171, 10, 83, 104, 193]
5591A93j06l29K35K0K94p53K09K39p9J58J04j73K68k81j78K33J77k26M6O6k78
5612a61J32K36j39k51K81J18k33K07l36J80N6j7M2k9j27p1J88J98k60k25J01j18
5634b28K96L4k32Q0o0j42j47N02l45L37R1p9q6J4J23K8n1j68M88m55p5k33J24
5657a84J81j5J95l29K54Nj81J32n1K5o7K9j16K1K50k03J61J88m19r8L99k70k51
5680c44L38Nj68K84k31K0K42k13J87j21M9R9j24KKO3j4k60K74K39l97j20M23l98
5704a63L29j51o1O4Q9O2m0o6Pk18lK84j48J62j63m5K29k00j8J44m62K69R2J31
5728A24j80J67oj73Q1J61k03J76p4r6l0L02k90j8j01R9M4J73m8k18J97R3k25K52
5752B07k72l2j1jK92l22K82m4P0k67K30J9j49J26N8k3j15p4J12k7o3P4j78j97
$$ y = [193, 87, -242, -7, 13, 307, -446, -237, 2, -77, 81, 185, 12, 280, -1, -179, 54, 231, 5, 51, 117, -161, -29, 207, 68, -183, 98, 216, -17, 190, -146, 34, 90, 73, 115, 86, -41, -112, 76, 274, 14, -211, -110, -228, 68, 102, -130, -50, -110, -252, -399, 103, -242, 95, 186, 107, 21, 35, 158, 186, 135, -33, 455, 0, -75, -308, -184, -3, -18, 177, -152, 102, 107, -74, 58, 7, 32, -35, -6, -122, -101, 149, -54, 107, 295, -124, -222, 177, -93, -344, -6, -1, -169, 115, -116, -96, 146, -67, 120, -1, 48, 147, 23, 25, 27, 90, 76, -184, 90, 329, -68, -188, 235, -163, 166, 15, -46, 18, 107, 169, 129, 63, 70, -148, -151, 133, -15, 147, -16, -61, 168, -32, -50, 94, -368, -99, -7, 124, -56, 111, 105, -68, 13, 174, -29, 147, 73, -23, -53, 249, -41, -59, -160, -61, -17, 156, 108, -110, 87, 180, -45, 207, -65, -97, -108, -109, 183, -139, 143, 99, 169, -98, 132, 151, 2, 128, 186, 163, 48, -26, 86, 59, -4, 70, -108, -305]
5776c05L15J79k01k08K24J18k70K56J90j19k99M6J67K2%m8j08Q1l99L08J54k06
5798a03J93q3K92k24Kk99L04m8o5R6J3p1K58k91J5L18l55J25k03L00k2j98K1J19
5822I4L4K01m45K21j58j33K40n3m4J37k85J24R0J1k28j77J43J96k40J34M60r5
5844B27nl08R1r9M1k1K04k80J71Q5Q4j75p1kJ49q6ok24L02L3j08j30J04K76k47
5869ER5q5J26mq7l0LJ61k87J35n2J1j38J42M6N9k5m20L65R8j44m6M1j88J50K02
5895A33N8j80q3q8L12p2k77K36j0J86j98k49J02%K14j77M0j77J65m3J4L9j9K35
5919A61k65K00l08Q6M38n37P7J03J89n7l21L46k6j61j34Q0R7J05J33k06K33l72
5941a39n7K89J50j8l89L51j79j79K12j12O3O4k70K08j78K12O2Q4k09J37l2Kj15
$$ y = [-305, 10, 189, -12, -220, 4, 122, -148, 108, 298, 179, -120, -74, 93, 115, 115, 67, -41, 40, -359, -51, 103, -103, 90, 7, 299, 75, 77, -222, 82, 34, -31, 65, 78, 7, 265, -26, -11, 307, -48, 77, -126, 174, 152, -46, -25, 94, 128, 329, -116, 105, -53, -186, 54, 1, -43, 94, -191, -67, 23, 34, -194, -371, -228, -32, -272, -138, 322, 227, 222, -86, 5, -94, -53, -74, 130, -150, 21, 106, 190, 15, -56, -58, 91, 5, -1, -225, 77, 110, 2, -128, -24, 252, 5, 100, 15, 141, 137, 50, 20, 23, 184, -103, 32, -20, -9, -147, -5, 41, 100, 75, -345, 20, 118, -26, -72, -31, -219, -69, 133, 191, 11, -72, -160, 152, 80, -197, 39, 29, 215, 17, -232, -130, -130, 84, -93, -53, -230, -65, -108, -94, -55, -74, 161, -104, 96, -212, -126, 312, -225, -148, -45, 144, 87, -234, 112, 86, -75, -209, -129, -32, 73, 206, 0, 233, -139, -196, 93, 243, 225, -164, 187, 8, -171, 41, -71, -8, 56, -214, -6, -184, 28, 90, 174, -35, 102, 70, 72, -43]
5964d3K99k11k30K58r3m9K07N3l31o0J99K6J27r1k48Q5N3M6J94Rj35m5Q9R0k11
5989a2j67J58n6M31m30k3J18j31L81m70n9N0K69j5j7l41M05p1q6j48K23P1j8j25
6013f3l0J31J5Pn4j52K0J6j4K16j63J9j99J62K0r5J22Q5O4j66K11l33K98j40J05
6038H2J47j62l17J05M13k44l8L6n5j44K98j5j5N8p1j17J77k63LJ74J06j44K4N6
6062I4r4K00l52J31j38p1L5K50J91m18K44N2j88M08n52M4l4K04jj48K91j86O3
6085B5M8k6k05O9j08J1J99J8l94N49k00J55j2k43n2Q0K31r1k15m6K42J70k18k6
6109c9m2j87L75Nq3ON8j1J31j40J5j67K59k00J64l24O5K50J31n39K59k84K75L03
6133B80m13J43n0J35j65M1o6M6K7K12p8j71P1R0m15J56J59P2j10j7J13J4n5L2
$$ y = [-43, 256, 45, -185, 73, -20, -69, 138, 191, -140, -200, -1, 25, 152, 61, -187, -102, -49, -3, 191, 200, 65, 20, 109, 199, -12, -179, -21, -77, 354, -76, -99, 19, -112, 269, -201, -260, -210, 59, 44, 27, -314, 91, 20, -66, -214, 9, 80, 62, -63, -93, 38, 53, 60, 6, -146, -126, -110, -124, 92, -71, -52, -251, -89, -69, -164, -42, 43, 107, -59, 152, -181, 117, -23, 82, 229, 67, -250, -145, 268, 24, -14, 22, -33, -177, 121, 106, 91, 149, 78, -39, 138, -125, -122, 52, 158, 14, 38, 94, 0, 200, -152, -21, -159, -230, -195, 55, 246, -172, 72, 124, -64, 344, -208, -164, -198, 6, 5, -143, 148, -38, 25, 73, 47, -158, -89, -197, -186, 13, 31, -363, 186, -14, 141, 129, -114, -166, -86, 145, 54, -161, -207, 35, 205, -13, -39, -81, -268, 107, 112, 29, 35, 93, 82, 213, 73, 88, -79, 180, -20, 144, -180, -115, 135, 266, -273, -14, -298, -23, 280, -133, 10, -40, 95, -70, -29, -95, -49, -22, 190, 112, -59, 12, 102, -313, -157, 2, 74, -36, -53, 60, 74, 19, 51]
6157E1j22P1j22q5J69j41J61r5J70q2K17r7k67K92r6J20J69m04K18k45J08k1K10
6180A79k0k6J5K8j71R2jo7J99j60r0P5J11j15j41j12K63N0l28M57k7k12j65K74
6204A08l7k11j3L44l09J35o3k04N41n20M15k42K12m7j72N6O8m3K7K46n17K99R4
6227A67J5j42P7k32K34l06K8J5K4q5K74r0j30q4L41J17k78J29k02k38L18LMK92
6251B51j03j57J42n1k52J50j48N0L4K70k30N1k02K79j57J37o4j86L15L6P3m29
6273a91L76j59l10K57l56J61RJ73j12L60k16%r6K09j83J77k66j1J68K8m5O9j19
6296g7J30m0Kn9L86j97k97Q0K88j42j51J24nj48L68l24K4K7K73m28J74r7K49P9
6320B39j45k28J17L81l36J2j63J88r1o5J33J82n9l85K9OK51P0n8j59k07M91n2
$$ y = [51, -71, 0, -122, -207, -38, -179, -18, -113, 57, -25, 192, 95, -172, 120, 24, 144, 313, -91, 127, -118, -10, -31, 179, 159, 133, 148, 176, 5, 97, 96, 29, 228, 68, -22, 53, 164, 49, -92, -204, 59, 109, -219, 238, 211, -1, -166, 108, 71, -140, -153, 191, -118, 17, -46, -250, 291, -229, 186, -56, 156, 109, -63, -7, 61, 18, 45, 291, -226, 73, 167, 182, 40, 117, -115, 119, -187, -159, -144, -120, -205, 69, -21, -151, -235, 106, 223, -55, 74, -128, -366, -48, -45, -41, 251, 148, -9, 133, 82, -170, -20, -168, -118, -84, 186, -44, 7, -195, 84, -73, 64, 0, -186, 129, 165, 238, -191, 185, 26, -284, -27, -383, -222, -213, -40, -152, 208, -8, -8, -104, 105, -78, 99, -167, -178, -10, 18, -27, 42, -77, 53, 13, 15, -44, 342, 145, -152, -72, 216, 74, -77, 47, 42, -106, 262, -62, -38, -11, 262, -166, 8, -89, 160, 239, 94, -134, -17, 364, 28, 40, -123, 65, -26, -91, 42, 224, 165, -220, -191, -185, 66, 136, 78, -81, -288, 203, 151]
6343A51O3k67J48j43n7K18l3q1j07R9J68k71K4L61j34j85P9J28L1J09l96k0J26
6366A1M9J7k19K42J25n5j21m2J20j55n9J43q7K15j66k33J28J08m8K32j69P0M5
6389A51j10R6j76r8L19k29J66l51j5O0M36k37J40M0l90M28k03P6j32K04k72J57
6411F0j55K72j86J53p5l1J04j07K8J25k28J55J2n4j04P4j7%pk8j09O1J97l13R9
6436g4k34K28m3K12N7j95M0pK56m08J59J17l8q8J22j07j4O9j89P5K92Nj42J81
6460B74l79N9L6J95j91j03l2Q0K1mJ4j0j13J67J10n0l05J31J20QJ48j71N1K8r5
6485a1J07k91K85j74M9M6R8J71o2j87O5J2j78J64J15l29J57J56l43J53q5J40j29
6508g1J37J66j47L5n0P3K3l23j52N79k98r7J88M8j16K10l51K28L4k29j75J57N3
$$ y = [151, 214, -53, 95, -48, -105, 113, 80, -1, -108, -9, 159, -112, -88, 273, 139, -46, 33, 161, 192, 301, -95, -115, 11, 60, 77, -142, 100, 225, 170, 49, 7, 127, -28, -87, 56, -31, 184, 18, -215, -87, 21, -27, 205, 36, 106, 151, 41, 137, -39, -137, 182, -47, 119, -232, -247, -187, 249, 12, 152, 192, -198, 230, 27, 103, -29, 175, -97, 60, -95, 177, -9, 144, 69, 38, 142, 35, 63, 188, -40, 115, 127, 73, -31, 43, 26, 26, 19, -9, -118, -57, 140, -173, -74, -308, -80, -123, 89, 146, -49, -9, -16, 240, -168, -9, 108, 70, -18, 104, -3, -17, 52, -137, -62, 230, 235, 93, 274, -105, -46, -10, 185, -6, -109, -141, -61, -40, -44, -30, -40, -153, 14, 124, 74, -231, -100, 20, 28, 176, 5, 56, 84, -11, 96, -195, 90, -84, -35, 11, 109, 280, 218, 31, 96, 108, -70, 94, 209, -120, 37, 193, -150, 3, -82, 58, -71, 66, 232, 85, 120, 70, 143, 166, -157, -309, 270, -28, -125, 63, 111, -5, 205, -146, 82, 116, -113, -288, -131, -78]
6531g8P1J60J25l60Q3J32j07l25M19Q1l95J29j05K25j54L09j79J72l13M34m27
6552a03K01k02J4O7l51N63k18J12nj53Q0N1k07K52j81K4l1J81j49K57n06K58K5
6575b1k33J36K45k41J4L00j59r9Q9r1Q0%J22l6J80l91J6J96J73l73J93m2j38J18
6599C8j63Q2J26K6q8j55K48O7j23j15k20J79J89k02R6K2J34j53J86k87J14m4j60
6622b03K89k21K81r8p9K1k10L89j59L07k03j81p0o1K21k23K22J5K72m58K84j46
6644a1k9N5k67N95l35%rJ11k36m8M03k32J67k66K2R9J2r0L41m18J40M3Q1l32J22
6669h2P2jQ3O1l9j27J31J46k94J78j97r2j31M17j03r0J33L0o3l4K06k89L17l52
6693a20j41L57q6k73N88l8j57k05J40R0RO1j34kp2M6k33k7L37j63j09J53m7k5
$$ y = [-78, -7, 153, 278, -82, 1, 133, 26, -299, 120, 201, -194, -65, -170, 55, -99, 210, 31, 203, -110, 324, -103, 98, -104, -90, -23, -374, 189, -29, 83, 78, -75, 5, 56, -151, 101, -80, -56, -87, 94, -55, 202, -304, -46, -21, -254, -118, 127, -114, -100, 200, 41, -58, 31, -60, 20, 20, 142, 106, 286, -105, -89, 107, 280, -93, 100, 58, -80, 38, -125, -43, 83, 109, 21, -134, 114, 181, 58, -57, -277, -98, 91, -111, -15, 7, 141, -12, 174, -113, 1, -43, -203, 86, -135, 146, 48, -31, -10, -220, 169, 10, 317, 114, -67, -137, -198, 23, -200, 22, 37, 309, -149, 135, -11, -40, 15, -252, 343, 8, 8, -1, 110, -126, -174, 229, -3, 164, -102, -80, 19, 31, -59, 282, -136, 4, 47, 128, -204, -82, -10, -11, 72, 133, 94, -33, 98, 244, -50, 128, -69, -161, -292, 125, 22, -68, 65, 95, 32, -2, 204, -85, 232, -120, -261, 96, 10, -263, 325, 287, 130, -75, 65, 155, 164, 225, 91, 89, 17, 63, -170, -197, 140, -23, -132, 21, -26, -51]
6717e1l4J56n4J52n7j02N0j94J81j39Q3k82P92o09J92j53K1K14k24k2J13j50J06
6740a1J41j93k5o4J11J7J0r9NJ61k46p9K48j31J60Q8j11Q2j32p4J10k6J65n2k16
6765a61K11m4J15j00j83J18K06r3k85J58J51j78j50Q5J39k7J03q9k7j67L05q2
6787Ej5K7J55L6j84j90J72J96P8j35m5l09K76M3k71J15k74K97m7J15m1J37J15
6810B56l21k40N09l41K64k46O0j0m4QML7J45Kj10K52K3k00j36J38j33P4N0j72
6834a31P7J56j98j07J94L4r0J88k69qJ67J98nk90r9J30m1j83K12k6j16L75l11
6857a43J95r7k20L89k6k41J14q1K73k23M22l61o1K16k33L01k49K42l50J43J25
6878A35L5n04N03j10r1K19k42J02Q2j37l02O0J41nrJ59j9k57N70j68j12l9R0k7
$$ y = [-51, -85, 71, 17, 169, 112, 10, 60, -134, 47, -92, -9, -291, 501, -108, 84, -69, -48, 166, -58, -80, 33, -117, -11, 130, -63, -88, -152, -41, -24, -14, -113, -108, 53, -193, -272, -24, -155, 5, 93, -18, 64, -68, -142, -32, -58, 107, 55, -161, 50, 6, 121, 21, -162, -44, 162, 69, -216, -58, 93, -85, -235, -150, -11, -38, 65, -24, -51, -218, 87, 5, -10, 17, 172, 208, 24, -166, 6, 202, 280, 145, 100, -209, 67, 110, -161, -46, -320, -23, -70, 45, 4, 141, 256, -65, -305, 204, -137, 127, -119, -59, -69, -113, -105, -101, -64, 81, 83, -27, 225, 248, 48, -88, 50, -83, -9, 41, -131, -54, 102, -96, -203, -9, 25, -65, 123, -146, -154, 13, 211, 206, -84, -183, -53, -94, -277, -65, -91, -207, 168, -143, 52, -45, -265, 124, 98, -143, -29, -110, 163, -60, 362, 1, -60, 156, -77, 224, -25, 217, -133, 10, 135, 170, -334, 169, 59, -32, 187, -55, 47, 129, -8, -310, -250, -109, -114, -123, 36, 17, -240, 330, 162, 50, 11, 101, 74]
6902G4j67R8j01K48j95rq4J06J07M0P1l14p2K73R3j77j31J11J30J19j97m7j76
6925b00K21K43Nk56J73k50o0K31k17Qk0K73k77j05L59j37l9n2L78n9n6j52j90
6948a79M2J86j01mQ0K58n47L97k12L86m22R9j06j40L28O5M5m6n7L3k10M7j0J71
6972A03k85K21l36J50j70L63j7J02o1o3p3J91m43J51J73J45o1n9p6J61j68J6K71
6995B35l05K08K9k39j02K38Rj68n7K35q2J12j68J28k03J33k06L08J29N9m11p8
7017a96M07j9L9l06%k9Q7K3J4j38K71q1J91j65j26r8l7P9P9l4m6J12j41k39K51
7042a02m5O2J46q3j22r1J29o5L97k84J35j69L49j35j66M5m4R4k62J36J17r2J96
7065A46k57J38nR1r5j25K5Q8k01M25k49k27M38j76m5m4j94J86o6K25l6j88m2J72
$$ y = [74, -93, 5, -96, 152, -43, -52, -136, -30, 77, 117, 188, -126, -198, 75, 168, -9, -140, -29, 101, 220, 23, -24, -200, 21, 264, 269, 13, 186, -64, -124, 107, -110, -102, -122, 151, -126, -231, 128, -9, -48, -100, 278, 219, 163, 11, -179, -137, 49, -52, -56, 24, 282, -265, 132, -80, 306, -116, -17, -123, -263, 65, 130, 175, 129, 72, 105, -105, -58, -68, 103, -182, 39, -297, -147, -317, 46, 29, 131, 70, 7, -66, 125, -318, -167, 6, 151, 90, 31, -45, 116, -52, -36, 235, -70, 138, 167, -72, -174, 64, 73, -95, -152, 83, 1, 113, -55, 73, -130, 3, -203, 105, 234, 293, -118, -196, 211, 192, 231, -75, -75, -104, -17, 6, 20, -118, 153, 72, 263, 98, -28, -126, -163, -84, -5, -39, -85, 27, -114, -353, -102, -147, -85, 61, -22, -144, -235, -106, -171, 226, -58, 77, -92, 257, 122, -44, 1, -43, 51, -211, -75, 42, -50, 146, -111, 27, 22, 113, 18, -107, -82, 6, -195, 230, -19, -246, 192, 16, -29, -73, -267, -81, -147, 78, 42, -146, -188, -16]
7089a6j72m8N02l11r3O3k03K78o5M8k1o6j60K54J37j34j38K5N8N5%j9J26o9L2
7114F3r2J50l80K85J58k48J86n3j64LJ73j43J39O8OL1m0j91N3k3k8mM1ML3n3J63
7141A37k4M0n5j42M5j13J4J1l39M48k7j68K14J95J55p7k10p5l24K68J56k36M6
7164f1j06J60M2Q7j22j04K48N9L3j27m6K3ql75K25P4j49K98n8l17J84K93k83p9
7188a09K37j51J12R2k13m6J76n4j79K66N9l22J55J57l97K61J10k37J49K0k20J01
7210c3L05k57j74J36J07Q0k59nJ21O1j25J39p4k34L04k21K04K4j62K79J33j48
7232B01k06o5J62j45JL45l98O2LK27k90OQ7O4J12j40q8j02j1J91K45p6j55R8k8
7257A00j99j6J15k1j36K11j73J17P1l9p4J06n1r9K71k13q8l6J08R3n1M32l49J8
$$ y = [-16, -188, -236, 266, -45, -138, -75, -278, 0, -65, -17, -38, -104, -264, -10, 127, -7, -145, -120, -62, -7, -7, -26, 100, 31, 63, -29, 121, -259, 26, 184, -64, 122, 69, -95, -92, 81, -62, 77, 145, 151, 182, 142, -49, 4, -19, -47, -51, -10, -6, 27, -26, 137, 113, 153, 98, -44, 1, -112, -98, -87, -426, 22, -5, -173, 41, 236, 391, 314, 104, 29, -295, -27, 129, -107, -61, -167, -7, 35, 122, 0, -104, 144, 203, 236, 109, 63, 86, 78, -297, -72, 2, -147, 151, 93, -224, -40, 253, -30, -109, 128, -23, 89, 181, -32, -78, 98, 44, -135, 131, 190, -132, 23, 180, -217, 44, 154, -83, 66, 86, -134, -33, 272, 15, -159, -23, 84, 164, -95, -100, 21, 82, -43, 96, 22, -212, 92, -129, 75, 99, -63, 216, 349, 201, -5, -70, 92, -53, -52, 293, -105, -43, -40, 187, -103, -97, -10, 54, 166, 26, -62, -164, -175, 16, 261, 185, 30, 128, 100, -99, -115, 0, -21, -157, 54, -119, -2, 69, 30, -44, 62, 11, -88, 183, -30, -118, -154, -46, 47, -4, 428, 79, 97]
7281I7j16J63m14J18J4R6m3K23j97K64N3k45P7l8l10K49N7o5J15p0m1k2K03L7
7305B05j40n5j89R4K11j07Q8j77J5K13J18k42J11m15K33L3P3J8J27k84K05l8j1
7328H6k46L65j94q6j68j10N14j94j0j24K87j71R3m0o9l2K43k96R7p0K05j23k95
7351c38L82k06L78l07L18k78J63j12R4j10j06J4J82j0o9K9j58L78j00J29l10K58
7373B21k48o1n0L21k27J87k08k9J27j4L9N2k55J92j23j45K83r8K5J98k60J38j14
7396d9q2K09j34K7j2J46L5j62l9N5P9j81O8Lm3j1N3J12k13J92o7j7K7n1j78L06
7422G3Ok36K08J03j9k04J57k8k35L18J66j87j45j65j4L98Jn9o2n2k30J40R6R3
7446A23m17O8N46l80O9j36J21l7q6K78l35j14K32J03M6kk47K42K2l0q5N5j59K4
$$ y = [97, -19, 144, -270, -152, -138, -42, -85, 138, -59, 205, 258, 13, 90, 52, -258, -9, 48, -17, 98, 28, -13, -35, 168, 205, 65, 10, -179, -85, 126, 19, 107, -70, -55, 158, 276, 34, 145, -270, -37, -4, 69, 87, 214, -70, 135, 97, 86, -160, 205, 11, -75, -243, -353, 161, -33, -43, -167, 120, -51, 42, 2, -67, -99, 144, -152, -55, -125, 80, -43, -338, 44, -162, 216, -91, 227, -51, 112, 0, 94, -16, -122, -108, 74, 64, -5, 24, -134, 244, 144, 273, -37, 221, -27, -88, -138, 183, -44, 143, -65, -94, 33, 19, 58, 110, -145, 47, -76, -221, 62, -36, -11, 187, -73, 65, -49, -131, 78, -56, -29, -41, 105, 140, -22, -61, -6, 73, -108, -40, -37, -80, -91, -38, 74, -139, 53, -14, -31, -4, -55, -233, 73, 79, -157, 51, 154, 135, -69, 88, 60, -175, 143, 309, 122, -23, -188, -202, 196, 197, 138, 76, 24, -206, -66, 30, 123, -294, -226, 320, -60, 9, -127, -6, -43, -129, 149, -186, -300, -68, 35, 81, 79, -168, 74, 96, 66, -19, 36, -123, -99]
7470i9K0L3MJ2M11o73K60J37O2j6k23k25J51K28r1L41j51k96O1m06K67J1J19n9
7494a22N9L84m13J26k17K00j21L63k43Q9k26L2K23k35j04M24j77M9j93L50l95
7515a47M02l29L05j83R8k70j19L51q6r8j59L69r5J38k1j05m0o8j48J42p8K38N4
7538A51j72J9L7n5m7J49J6j08K83j09J70l35L26k60q7J79j51r1J63J09j60R8j70
7561d5M2k99L35j5K7p8J59k37k90K94Q3n6O3m1j10J96N7m5j70J76J57j95K90j79
7585A19k42L37m6J45k54K32k77Q0R0k20P1j64j8J66J95l13J05N4j00L0r2L90j72
7608A16k74J81L4j9k0n2J1j28M1K76k64K59j19J11k83O7O9k17R3J88k51J05R3
7631A7q5J64K33l17k88J79nO5r1M34l37K79k46j07QO7j59j1L50j07j60m3K21n4
$$ y = [-99, -79, -46, -42, -30, 381, -292, -32, 105, 167, 151, -72, -297, -146, 82, -9, 332, 181, -115, -54, -460, -193, -182, -63, -122, -63, 321, -92, 34, -183, 17, -104, 259, 16, 105, -121, -89, 134, -101, -205, 219, 42, 91, -102, 248, -147, 255, -74, 231, 48, 146, -124, -243, 108, 22, -76, -235, 134, 39, 177, 156, 51, 11, -57, -205, -63, -141, 97, 151, -21, -2, 35, -20, -67, 82, 98, -10, 273, 164, 334, -1, 325, 65, -22, 157, 6, -85, 78, 187, 27, 125, -45, -3, -302, 33, 18, 45, -33, 126, -111, -401, -107, -24, -80, -17, -58, -168, 28, 85, 40, -130, 46, 203, 8, 298, 119, -123, 214, 168, 313, 59, 291, 14, 94, 184, -36, 35, -129, -147, 19, 214, -99, 6, 60, -40, -10, -102, 288, 116, -158, 23, 57, 38, 18, -34, -23, -151, -110, 166, -98, 161, 42, 153, -130, -63, 6, -211, -118, 70, -181, -76, 17, -68, 96, 329, 12, -276, -97, -102, -37, -128, 306, -31, 248, 2, -105, -97, -30, -189, -200, 150, 43, -117, -160, 61, 7]
7655Go0J57L2j05r1J94J98m57Oj26J04M15k30m9j9k9J6J59l93L41Q0j25J85j85
7679B5j47J44j07p6K03J00l60K41qM7M0q3j72N7M7j63k9J71J93P3j8j70J04q5
7703B7j02K50l51K00nP8J27k53K27m99K54pl8K94l44M08q5O9k09j53j05J19n7
7726a55J99P5j68mL14m56O43m74o0J98K1j0l52M69k02j54j66K81j93J90q%k23
7749b35J73J73J9Kj50K32K5k94n1J29L1L2N1J81l43K25k13j61K91l09M7J19N1
7772B5L3J52m24J78n6J09l4q7Q9J20j01j01Q5l5L5J34j39J0L8n3K59k23K11j49
7796G6j27J16K1p5N1l7q8j51J54j46J43M0J35k17L91k10k24k02K48J74j54K01
7818A19l60L00q0mok32K02Q4J54J19l13J02l6j13J56r9rK38k30j00o4L97l69L91
$$ y = [7, -53, 104, 136, 31, -60, 134, 332, -125, -119, -245, -141, 274, 44, -5, -24, -53, -37, 122, -271, 70, 150, 25, 210, 25, -122, 22, -85, -161, 42, 142, -218, 23, 15, 62, 102, 19, -153, -96, -49, -212, -241, -70, 123, 196, 178, 8, 112, 27, -75, 175, -176, 24, 19, 97, 224, -29, 198, -301, -47, -54, -92, 202, -142, 266, 181, 250, 41, -112, -217, -98, -155, 44, 119, -49, -53, 261, -195, 448, -26, -86, 112, 133, 123, -229, 240, 38, -116, -282, -1, -194, -4, -12, -12, -235, -62, 111, 130, 132, -18, 214, 239, -55, -106, 23, 54, 86, 137, 318, -25, 200, -13, -174, 117, -192, -145, -26, 25, 58, 210, -214, -36, -92, 17, -17, -104, -15, 105, 4, -97, -12, -47, -12, 122, -17, -7, 31, -22, 237, 14, 225, 76, -51, 65, 86, 11, 62, 25, -63, -214, -60, -206, -63, -23, 112, -105, 286, 76, -148, -350, -102, 72, -82, 119, -241, 59, -21, -25, -31, -263, -61, 23, 177, 296, -17, 85, 49, -64, 92, -7, -16, 222, -8, -108, -172, 225, -144, 247]
7842B47l64j31L48l8l4j18L9J78l0l37L33j22L1l6O2j21J99j16K7O9K13j79o9
7865E1l4j58K02p9j07k62M63lj21J48J01k66j14M22l48J74n0K41j96Kk02J94k04
7888a46R2K04o3k07N1J00LJ74l68N69n15J36J02l9k0p9r3J91J36l64J8R2j80L68
7912A62pk11J33nJ60k01nk5j40N21m49K46j98lJ3Q2j01o4K46k37J02P0j77J31
7936D3J08l9L3j21K16l71L15k71q8J60O6j10J50k72M76m51j60L88P9J55l13o4
7958g1P8L0LN2j9J08k11j44K4R6R3j56L16m15K89j89L51j79j11PL7O1k97K51R0
7983I4j16J76k62O3R3K6k87K18N8k1k5l17L59j44Q2K47j64r6k29N0j50J49P2L06
8007A82k55lK00j90j72L01j33jK28l27R0L06L1nr1n3K13k93j3j12J33J9j88M9
$$ y = [247, -117, -248, 100, 62, 28, -90, -51, 127, 97, -240, 93, -29, 2, -34, 28, -93, 106, -10, 17, 86, 299, 120, 51, 17, -141, 61, -18, -125, -387, 76, 73, -48, 100, 201, -65, -179, 243, -105, 69, 19, 260, 64, 66, -136, 58, -146, -54, 150, 87, -120, -69, 31, 34, 208, -160, 409, -106, 30, 132, 93, 73, -6, -99, 92, 228, -136, -118, -26, -206, 162, 155, -56, 77, 72, 232, 31, 26, 1, -139, 382, -67, 179, -19, -22, -9, 73, -28, -92, 154, -83, 19, 89, -88, 43, 151, 112, 145, 24, 240, -131, 184, -87, -175, -15, 51, -59, 91, -181, 295, -156, -316, 72, 151, 306, -7, -71, 7, 37, 40, 92, 73, 181, -30, -174, -150, -54, 39, -117, 199, -216, 73, -116, 235, 56, -55, -48, -11, 50, -247, 4, 94, -22, 154, -108, -45, 48, 74, -213, 5, 63, 42, 17, -300, 59, -85, -3, 244, 80, -16, -245, -195, -345, -196, -124, 182, -73, -76, 124, -66, -238, 63, -70, -71, 157, -170, -80, 226, 257, 252, 161, 108, 321, 28, 15, -97, 36, 55, -133, -84]
8031h4J09K3P4J31j91k34J78r7N9J01L1r0K0J27q9m5J3k32J27p1M03r5k36n1J12
8056gJ35jk39J56l06L37JKN1j13Nj05P5k20R9KL59j06k39nJ3K69P4k69l5J52L0
8083A15J1J48r8k11n1rP5P6j51M0nq2R6K35k53J16j21J43J70k30Q5p5M2j45J52
8108G3N0j81o3K02j39K3K22k10J92p3j47K77k57P7L0j03r8L51l54K57k3j70K4
8131d0K2J90j69J77l77J64J19m01M37r9q2j09j46K72K95k71l7K2Q0oj30J24j9
8154A6J19r2O2j89O2k14K44j0qm4L7mrj81J20N7L36m74K91l65J84O3k73M30L1
8179A89k06J12j13OL37J01j05n10j14K35n0J92
$$ y = [-84, 25, 48, 122, 253, 62, -172, 6, -91, -32, 69, 100, 10, 30, 157, 68, 23, 36, -196, -69, -140, 263, 168, -68, -119, -7, 128, 127, -112, 44, -262, 75, 76, 78, 129, 16, 21, -84, -9, -229, -130, -128, 231, 125, -114, -119, -106, 163, 237, -32, -67, 85, 115, 126, 274, 176, -35, -86, -95, -20, 56, -95, -55, -60, -142, -46, 189, -64, 52, -69, 74, 244, 14, 99, 24, 66, -79, 73, 123, -58, -121, 81, -58, -35, 187, -23, 169, 96, -51, 226, -31, 46, 76, -27, -125, 226, -128, 129, 106, -64, -40, -18, 172, 3, 180, -197, -33, 86, -315, 122, 23, -59, -168, -314, -42, 253, -18, -55, -33, 47, 41, -89, 35, 16, 135, 43, 105, -84, -22, -236, 8, -2, -10, -54, -17, -21, -30, -211, -91, -34, 302, -172, 119, -246, -62, 1, -272, 158, 189, -17, 95, -18, -12, 325, 426, 321, -189, -303, -68, -118, 74]
8191G4
$$ Imaginary data points
##PAGE= N=2
##DATA TABLE= (X++(I..I)), XYDATA
0@%%%%%%%%%%%%Mj2J6j6J6k4L2l2M0m8N6p2Q6r9J15j33J51j73J98k25K57k92L30
35A75l73M19m68N24n87O54p28Q09q95R90j094J209j334J470j619J784j967K166
53A135k388K638k918L234l598M020m512N099n812O701p849R389j1583J4981k1009
68a2472L4969j30957n4601J68757P432l0557m0914M0416P3722P0399l0810p2105
80B3279l5636M4634N2630J4973n7582q1438l1392N4997N5801j5335q0967o3869
92a19905N267O3713M2809j8633l7789K4712Q7972P5701k383n9735n4340l207L3465
105C7647J9405k9462n2597k6452J8145L3474R104l3609m6559m730M7323M0814
117A2503j4481m8537k0459M1722P3954M4630j0197k6479K969K0680k437m1418
$$ y = [0, 0, 0, 0, 0, 0, 0, 0, 0, 0, 0, 0, 0, 4, -8, 8, -8, 8, -16, 16, -16, 24, -24, 32, -40, 46, -53, 62, -71, 80, -93, 105, -120, 137, -155, 175, -198, 221, -247, 277, -310, 344, -384, 425, -470, 520, -574, 635, -699, 771, -848, 936, -1031, 1135, -1253, 1385, -1533, 1701, -1897, 2123, -2389, 2710, -3102, 3599, -4250, 5139, -6444, 8537, -12472, 22497, -108460, -163061, 5696, 13128, -17429, -58343, -17927, 55795, 126194, 95384, 23279, -12357, 32277, 84907, 99880, 42298, -39140, -70532, -15535, 40266, 24931, -56036, -119905, -114638, -50925, -8116, -26749, -64538, -39826, 48146, 123847, 121464, 61729, 7389, 4182, 37647, 57052, 27590, -25007, -51459, -33314, 160, 9264, -24345, -70904, -75634, -28311, 12503, -1978, -50515, -70974, -29252, 44702, 89332, 79135, 52656, 55625, 76305, 73868, 32450]
129C2450n8185m1605l989K5052J9767r889k6285o024L2955M9561K4742j4584k4223
142b57O590L3904J9935k0186l2490o784K5424K7472m392m0693m5437j8719M221
155e1412M675k628m069L809K4183M0346K9623j489j9238o036J6282K0022o823
168D7245l7593l4827O16K2701R721j0188j2730J23J0227N391j3426k5024j4970
181e2734O742K3313K8758K0860L939l420Q092J7487L125k3203l1658j7100K743
194a3056M087j3614k2715n221J9995K4781J1108j891o545l266M591P150K857o32
208G629K432J0085J4633J1415o031k4780k5111p510K434o109j7522j2896O529
221d4802K1781J9699O593L071J0805J4203N159n740j2409j4914j0324R0P367N860
$$ y = [32450, -25735, -67340, -71329, -46277, -26510, -36399, -62684, -68708, -35753, 13808, 38550, 23966, -257, 6333, 40237, 60172, 39986, 7496, 712, 26136, 53608, 49216, 8523, -36914, -55633, -51412, -46737, -49365, -53434, -49625, -25442, 14904, 44527, 43038, 23800, 17764, 34046, 54068, 47245, 9652, -25175, -24559, -1858, 7863, -2325, -15055, -14932, -4705, 686, -12740, -37764, -52734, -45992, -22679, 6079, 26939, 30878, 27458, 35550, 53037, 56162, 32959, 1301, -15799, -13056, -8969, -22583, -45298, -50519, -30524, -5743, 5365, 3474, -3071, -6337, -1746, 5404, 8261, 7629, 10061, 20146, 34779, 46194, 40163, 15383, -9728, -17238, -14804, -20913, -38435, -51331, -44802, -23021, -3322, 3271, 6342, 17147, 31350, 36509, 30769, 18360, 3446, -6878, -6788, 579, 6439]
235F439j783o146k500L566J758j0890j8277p948J0233J4536N042p39N583J5729
249A4603J6404O925l955p862q818j0506j0874q042o572o738j256J1037J3998N735
263D079m792o313o14N165K979m704m857O460J4523J0949J985k078j640k299n464
278A3379j1422j4559j2161q105k763N794J3415J0969N128P095J1767P461n042
291B0956j1410q749m90L408J28m230k95O042M726j738o011o761p453p455l827
306b3159K79L488N678P169J0996J4899J0724j655q083n377k561p734j1324q597
320a5257r50M445N514L004L54J772J389j537l874k001k248q18K667P720R135P400
336A6715K759k03j26n92o889j4489j2296l579r1p06q0N311Q811Q203N027J586
$$ y = [6439, 4656, -1490, -3990, -424, 1334, -9556, -27833, -35781, -25548, -11012, -5970, -6709, -1126, 14603, 31007, 37932, 33977, 26115, 17297, 6791, -4083, -12125, -18697, -25435, -26691, -15654, -1656, 4079, -713, -7026, -7640, -2475, 504, -4200, -9057, -2597, 11926, 22875, 24860, 22782, 21142, 18843, 13379, 1957, -12602, -24763, -32868, -35631, -29837, -16422, -5453, -325, 6770, 18537, 25998, 20956, 9546, 797, 307, 3715, 3843, -387, -682, 5360, 10086, 8348, 2337, -4424, -11877, -19332, -23159, -22880, -19392, -13714, -6545, 4451, 19350, 30074, 28419, 20336, 14959, 12398, 4664, -6660, -15257, -16207, -11762, -6248, -3244, -2890, -1118, 271, -1266, -5140, -7141, -9389, -10207, -7540, 180, 9315, 16715, 19474, 19271, 19145, 18553, 11664, -2825, -15121, -18700, -18791, -19497, -19577, -14266, -5455, 2748, 7775, 9361]
352I361M30j376l663m247j88J678L67l45L326N523K184l837p309o941m580l366
368a2983n794m186L036R002Q571O760P014O059J896j985m001n522o069n793m296
383h291l55L901L277O68n6K207M59l242o123n211j290K653M725M343N675R028
399A2368P051J519k489l181o355r323q439m712j304L57J475L613O835P202R52
414E569k882r71k53k058l360r04K926N119N250M119J196L92k657o586p777n977
430h854m503m447j271L642O958O186N330L414L435K547q83n035m906k273j001
445a661n28Q27K407K891K559k12l172l840m241m997m693j001L377M655M086N193
461A650O666N791J984k059l350k468l868o285n829j369J356J815J709L330K902
$$ y = [9361, 9791, 8415, 4752, 505, 317, 1995, 2362, 2017, 5343, 10866, 13050, 9213, 1904, -5037, -9617, -12983, -18777, -22963, -19927, -10925, -2354, 4406, 11420, 17479, 19375, 17390, 13389, 7867, 1798, -3995, -8291, -8646, -4745, -1468, -800, -856, 1351, 1810, -1432, -7555, -12766, -14056, -11403, -6678, -2335, 3340, 12368, 19419, 20938, 18449, 15268, 8913, -410, -8849, -13561, -14865, -14508, -13033, -9420, -2585, 4617, 5569, 2687, 1716, 1463, -595, -3955, -4859, -1933, 3186, 8436, 12555, 13751, 14143, 11486, 4900, -2877, -8854, -13357, -17804, -19075, -15433, -8475, -2289, 3041, 6455, 9890, 12437, 11554, 6519, 1613, -660, -1661, -2189, -1362, 1045, 3936, 6495, 6283, 3111, -729, -4970, -9967, -14660, -15661, -12284, -7629, -3543, 1650, 8316, 14107, 16091, 14032, 10682, 8214, 4346, -1939, -7768, -9137, -7781, -5966, -4257, -927, 1975]
476A975o0k263l104k558j371l26J605L622N811N847L110J342J91j468l699o694
492A960o691m848l265j424P4L300O035O445M054J407N90k039m688l427j037Q63
508b691K331L490L225K400K205j067m818n361l677l571m522k791M16K731N132
523f568N661N114N414L800j401l888l095l028m317j938J905L190K530R88m46k647
539A274k433l295l790k566n5J004K120L692M925M916N128L565O27k062l082n398
555D570p483n135j402J95J436K777L559K141J04j149j938p53j76L26N09K452K685
572B718K159J998J583J369K07j338m507n080n141m385l180p5L649M804M210L046
588B037K265R04p94j925j909L12Q07Q44O05J095N76k7lr70k036l539m003m376
$$ y = [1975, 1915, -348, -3452, -6010, -7381, -7707, -6102, -2480, 3331, 9178, 12288, 13630, 13821, 12353, 8654, 1960, -4731, -9579, -12844, -14268, -14194, -10894, -4859, 1586, 5640, 7047, 7637, 5598, 910, -2517, -3554, -2691, -360, 3130, 6355, 8755, 10960, 9893, 5075, -286, -3963, -7534, -12056, -14847, -14431, -11700, -6568, -907, 4207, 9621, 13421, 12020, 8132, 5037, 2009, -2308, -4246, -2341, 849, 3379, 4367, 3921, 1274, -1159, -4454, -8244, -10810, -10865, -9861, -7741, -4049, 876, 5792, 10920, 14485, 15112, 13050, 9968, 4570, -2913, -8048, -9450, -9255, -7819, -5042, -1483, 658, 762, -387, -2325, -3078, -3254, -2928, -2419, 33, 2718, 4877, 6875, 8458, 9827, 10034, 8696, 4189, -891, -6032, -10417, -13597, -13672, -10023, -5219, -1009, 2037, 4302, 5206, 4412, 2487, 578, 890, 1697, 2541, 3146, 4241, 4817, 4790, 4787, 3817, 1781, -1758, -5761, -10137]
606a0137k941j306J761M633O181O379N188L878l27l173l614l304l302k087o85
621b856mL81N54K47j89M88l46j292j352j000r58P0J658L550M882N059L724L50
639A2966j362l403n434o081l300j335k57R29K298J847J850P30L45K14K95K62o90
656a26o02N31N18J700K936L081J267m43j454m199n813n062k950j943P08K922M323
673d606L722L108K049R71J042K56j241j031r85j775j846p63L03N82J033O77q08
690F88j916k321l124k262m30K315L541L980M569K980J478K9j450k156k448l067
706D06k662k120j470q52Q72K091K544J483R96M32j144k722j559j1Q84J943L604
723B715L635K561m5j157k140l354m107l483k133q52m02R47K323L227K959K753
$$ y = [-10137, -13078, -14384, -12623, -7990, -1809, 4570, 9758, 13636, 13309, 10136, 6522, 3218, -84, -2171, -2856, -2860, -2479, -1925, -1678, -1867, -1379, -1725, -3017, -4369, -5369, -6327, -6257, -4599, -1049, 3833, 8892, 12616, 12966, 11604, 8201, 2767, -3314, -6614, -7949, -8206, -7277, -4979, -3132, -1282, -552, -207, 7, 302, 564, -126, -728, -197, 321, 2021, 4957, 8038, 9305, 8862, 7408, 3209, -2604, -7666, -10616, -12559, -11851, -8929, -4606, -884, 2224, 4273, 5244, 6286, 6542, 5301, 4270, 3285, 1510, -336, -1099, -796, -214, 819, 1496, 688, -1228, -3549, -6673, -8935, -9365, -7050, -3509, 471, 5040, 8020, 9498, 9527, 8077, 5921, 3473, 406, -2256, -4376, -5846, -6698, -5826, -3735, -1191, 292, 1288, 1720, 576, -2146, -3705, -3716, -2832, -889, 2715, 6350, 8911, 8866, 7709, 5569, 2215, -1892, -5375, -7508, -8360, -8762, -7815, -5492, -2265, 694, 3447]
739C447J865Q74r99k251j796j499p83N16J876J641R59o8j052l132l349k174j698
756g623o60R99J944K828L280L096K359J357P66p34k189k899k792k575j640l41
772d824P84J542J742J140l84q08r64n99j049Q0J527J868J859J743J574J465K25
789F921j423j417k267k434l490k114r55m4Q38K458L029K042J088J059L2r81q07
806A535j065L18L40M65J185M16mn72j025j757k250k176k013n38R8J330K093L193
824d27L297K529J998K77j080k226k134k721j808n77J53N24O33R88n7n4n77j046
842b308p70m15l65R43J825K590K430K050J680K71j491j796l414k835k869j763
858f237J57N62P94K377J779J422J74Nk25n04l48p9Q95J276Q37J045J283n8j151
$$ y = [3447, 5312, 6186, 5187, 2936, 1140, -359, -1142, -626, 1250, 2891, 3850, 3782, 2730, -402, -3751, -5925, -7623, -8283, -7284, -5340, -2512, 768, 3864, 6223, 7580, 8346, 7612, 5423, 2524, -268, -2843, -4483, -4824, -4040, -2498, -756, 384, 0, -808, -1772, -2371, -3420, -3340, -1813, 55, 1914, 3657, 5231, 6696, 6921, 5498, 4081, 1814, -620, -4110, -6224, -7179, -7223, -6385, -3927, -898, 1144, 2232, 3291, 3323, 2342, 1535, 470, 788, 1128, 1593, 2778, 3194, 3190, 2618, 1593, -164, -2414, -4590, -6603, -7141, -7043, -5713, -3620, -427, 2870, 5399, 7397, 7674, 6594, 4368, 2234, -487, -2295, -2872, -2719, -2195, -1562, -574, -631, -685, -1262, -2308, -3078, -3493, -3858, -2915, -1090, 1500, 3930, 5980, 7660, 7931, 6440, 4644, 1230, -1605, -4474, -6237, -6080, -5518, -4724, -2347, -568, 854, 1028, 1033, 808, 304, -44, -123, 772, 2048, 2885, 3930, 5213, 5155, 4004]
877D004j880k098k747k533j521m49O64J496K300K598K182J720J139m24k67j067
893C117j238r04p58p1j66L83J71k21m63p62j344j160j233m00j45J618K067J996
911D87K127J993J906J97j031j371j552k429k230j509m72N59K05M72J514R87l06
928d53q7j55l30n97n5J288J225J571J265J420P31n80j567k171k565k131j456j301
946e948K24Q62J582K325J559J017R77k60k68j062q10k48L68O31P52P13P87k06
964B995j105j295j742k278j589l80j04J237K011J698J959J823R45K60p93j216
980B426p00j430q99p26o4J182M63k50M97l06j252p56j063J4m28N55J143J411J655
999A472J814Q14N1J78q55j695j692j151j314m76N15l2L96R15J079L0j56J99l01
$$ y = [4004, 2124, 26, -2721, -5254, -6775, -7224, -6560, -5064, -2764, -166, 2016, 3736, 4875, 4451, 4184, 3117, 1879, 975, 217, 146, -20, 363, 534, 313, -150, -912, -2256, -3416, -4649, -5049, -5194, -3576, -1509, 487, 2614, 4607, 6513, 6710, 5679, 4308, 2756, 327, -1903, -3412, -3884, -3325, -3120, -2648, -1134, -147, -453, -540, -695, -1025, -1622, -1677, -389, 836, 2407, 3672, 5092, 5823, 5243, 3676, 1505, -1060, -3191, -4647, -5948, -5724, -4862, -3280, -955, 604, 1621, 2598, 2338, 2070, 1008, 198, -50, 318, 949, 1701, 2414, 3201, 2995, 1890, 595, -1147, -3425, -5014, -5394, -5498, -4261, -2250, -552, 1407, 3230, 4175, 4435, 3642, 2426, 1726, 296, -603, -1329, -1393, -211, 252, 2, 499, 193, -1059, -1815, -2878, -2864, -3292, -2737, -1594, -183, 1472, 3286, 4100, 4151, 4329, 3474, 1779, 87, -1064, -2378, -2854, -2339, -2371, -1975, -1060, 19, 49, -107, 92, -209]
1018b09k82m18K13P82R48J202K77M93L47o13j609j237j267j068j076n83L03J054
1036b743J677J185P40J361P41n66j087q63l78n73j77M96J075N01L68r9m37n53
1054F68j797j075p53m15j03R29J581J256J268J485Q52l24j112p58j330j298o74
1071a600j71N10P72L03Q39R5j34j154j080l47n09M32L25J198J334J033Q11M23
1089C080Q4m86r96j663j111o50p50j79N54P15J149M20Q00j05j23l56p78l13J47
1108e61L03J34J154R5N62K13j62l23j038q91j009o91l38m36P24J397R89Q01Q22
1127A745P04l90p62n45j80p14m85q0M13N27O20l96J31M5n22j079k39m49n75n4
1147b285J037J079J004J163P93Kk97r02j257j024o43q18J82O94O99L19Q05K71
$$ y = [-209, -491, -909, -696, 86, 1034, 2236, 2513, 3006, 3353, 2740, 1131, -106, -1373, -2441, -3517, -4100, -3797, -2743, -1066, 119, 859, 2220, 2961, 2395, 1308, 445, 67, -506, -683, -187, 888, 1389, 1757, 1658, 1221, 668, -1129, -2204, -2957, -3372, -3475, -2546, -965, 291, 1559, 3044, 3896, 3572, 2460, 1702, 372, -926, -1600, -1771, -1261, -489, -186, 653, 748, 614, -540, -1620, -1967, -2476, -2044, -1719, -521, 813, 1846, 2657, 3080, 3164, 2678, 1682, 19, -1092, -1742, -2492, -2671, -2117, -1402, -253, 167, 967, 862, 739, 383, -395, -708, -561, -258, -124, 1030, 1125, 1687, 1900, 1738, 1415, 377, -514, -1523, -2214, -2552, -2988, -2264, -867, 122, 923, 1745, 2449, 2059, 1297, 752, 572, -142, -627, -707, -294, 233, 853, 457, 588, 633, 111, -968, -1207, -1656, -2231, -2285, -1248, -169, 835, 1998, 2791, 2793, 2496, 1594, 337, -687, -1330, -2148, -1966, -1272, -573, -254, 551, 822]
1165H22k20j11k33q47o38J35L20K96R56Q15P24M8J26l78j128j268j243o68k08
1184b700N90P96J050R47N42j2J61j16p65o82l45K94j64Q2M11N49K59J16O8p44
1204C37n62q80o28l53LM89J179R83L69N69L78oj024j35p02k95k58m49k7J23L50
1225e39K39N21J31L75o40P5o39m08l8M87N14K41J078K95k56k57l03p42p12n38
1245a116k41k44K19M07J61J029N76L84O6J69l64j097l64j23l92N42O09O23J65
1264A009L45p25m64p23m15n60r2J96K48R25P27O93L33J68J49l27q31q88o94m24
1284a350j9J90K74R63L00N54l87l25n10l66k91k33R30K70Q30L55L21K23j94o83
1304H52p67m79o02n23j30J08L31P17P11O55L16K38m21k03n24k74m23L8M82q3L38
$$ y = [822, 602, 491, 258, -589, -1227, -1092, -772, -476, 480, 1295, 2019, 2067, 2193, 1815, 687, -581, -1824, -2492, -2700, -2110, -1314, -264, 683, 1225, 1213, 1374, 1258, 493, -189, -534, -240, -404, -322, 89, 638, 897, 1013, 1081, 337, -225, -1105, -1733, -2086, -2083, -1594, -415, 568, 937, 1506, 1884, 1878, 854, 719, 17, -278, -536, -985, -1012, -889, -539, -300, 221, 352, 727, 87, 162, -477, -885, -923, -436, 78, 319, 1397, 1692, 1436, 1179, 876, 134, -578, -1116, -1357, -1601, -1382, -975, -814, 215, 791, 1175, 1241, 1410, 1046, -51, -415, -538, -930, -388, 221, 844, 1009, 1354, 629, 165, -558, -973, -1533, -1625, -1429, -1181, -256, 471, 1164, 1497, 1665, 1814, 1487, 656, -232, -926, -1350, -1369, -1179, -905, 58, 358, 912, 525, 200, -310, -676, -967, -1200, -270, 0, 830, 1185, 1506, 1729, 1535, 852, 85, -394, -996, -1519, -1649, -1541, -1210, -493, 218, 873, 1189, 1427, 1006, 803, 279, 5, -418, -380, 102, 19, 357]
1325C57J34L63m07m16m67l75k73k51m6M52M5P35P69O21M42J25j18l00j272r7j132
1346a111rN5L97J60M42N3m3J99k35j83j9n1l0j6N79L70L11N12j64K65l82p21o29
1369b50r34p57j05N35J80M18O71P55L77J18m20J96k39n14k45J08O20j59L09K48
1389I12r4k82l84q65k53n65m85K92L61O18Q39Q46N90r9J78n04n72k02l95l88j00
1410e52J94j29L11K51j20n5k31k28m40K50j09N94N9M49M78M26K7N65n5j001l44
1431C40o60l11m85n5J89l8J12L27L23O85j59l73M21q4m6P9J63j63N33m03M84J42
1453A021m08m82n79l25m76J21l52L90J88M92N81O92J4J15nk07m64j67m05n1R5
1474b12j8J60J03K30r2l27J1o46q7m04l7O44Q13K54M80N09O1j76m74m71l23l65
$$ y = [357, 491, 854, 447, 31, -436, -811, -1084, -1335, -1381, -929, -884, -149, 620, 1241, 1683, 1808, 1690, 1390, 118, 21, -1111, -1120, -1065, -668, -508, -66, -13, -56, 143, -92, -275, -294, -345, -375, -391, 188, 558, 869, 1381, 1217, 1482, 1100, 379, -250, -1184, -1941, -2046, -1511, -1331, -913, -242, 513, 890, 1008, 588, 784, 545, 31, -214, -106, 514, 355, 664, 912, 818, 536, 152, -713, -966, -1531, -2016, -1724, -1363, -745, 94, 940, 1530, 1431, 1609, 1105, 533, 331, -64, -452, -552, -358, -487, -176, 75, -45, -100, -331, -559, -999, -749, -858, -264, -205, 244, 722, 1148, 1175, 1740, 1685, 684, 340, -320, -631, -1116, -1171, -982, -1020, -908, -581, -258, 427, 268, -105, 316, 232, 186, 265, 428, 265, 798, 395, 879, 1021, 613, 131, -448, -773, -1249, -1128, -1480, -1090, -902, -410, 171, 863, 877, 992, 987, 780, 316, 149, -256, -307, -212, -230, -70, 33, 263, 171, -156, -145, -791, -878, -1282, -1319, -675, 138, 392, 872, 1381, 1442, 1266, 792, 321, -2, -367]
1496c67o49l07K77Q53l3L92o5j66K57l39Q2l20R6m1K41N14M01N20j6p5n77m41
1518B37p08j40p1r41L24O61K77J48K27N69J14j61j33j08m95K44L1p9L05k5J28
1539D04J44l65J16n97l65l82K38j1M1N83K59N04O3K77j81J32pn44n69J04j79j22
1561d57m5N9O50l12J1L72k98j26j07p9j15k16M95L15P3M38J13o6r1l18l38j63
1583b05j60n33j57P17l7J22M63N6J28L0k98p6R7l42k59P1O91L00N3q7l8n34j07
1606a05l25p1o57M55K36J94n7P48L54j81j2k54j21k30j98j56J88o7R7J93K67q
1628B90j03k39j55J38k15r1m9m1M36O57k98K06l2L08o16k47R2m42pK1m4L4M35
1651C8L53l65Q6L16n63N4j17J01j75J23K82o7k3L39j42K17l82l30PK17p05K1P30
$$ y = [-367, -1016, -1323, -1046, -193, -226, 166, 101, -65, 192, -147, -65, -385, -289, -330, -89, 425, 826, 1346, 1330, 1255, 678, 237, -471, -611, -682, -1623, -1299, -638, -361, -213, 14, 583, 697, 536, 403, 295, -200, 44, 75, -4, 301, 276, 404, 548, 183, 299, -298, -663, -1045, -807, -818, -777, -194, 65, 569, 632, 909, 728, 860, 853, 309, -260, -156, -335, -457, -502, -443, 207, -105, -94, 278, -20, -146, -253, -332, -447, -663, -168, 147, 220, 658, 771, 705, 614, 296, -42, -205, -365, -898, -1055, -338, -375, -253, 210, 266, 394, 424, 126, 50, 147, -195, -454, -383, 308, 608, 661, 574, 536, 2, -105, -430, -501, -1158, -703, -467, -273, -330, 418, 772, 591, 579, 325, 204, -26, -224, -380, -192, -259, -162, 31, 298, 290, 187, -52, -207, -69, -284, -375, -424, -465, -29, 628, 330, 536, 504, 812, 196, -51, 41, -401, -408, -387, -431, -397, 38, 391, 26, 112, 428, -135, -81, -198, -97, -272, -149, 133, 66, 43, 382, 240, 457, 75, -255, -248, -31, -736, -715, 15]
1674A5j15M6J83J84L33k43j56j45J53k38k83J27j32J96R8j30K35K10R5m96l03
1695c66n4j57K6O9O4P40Q8KK42l0l68r0k86l41K93l60L4J81L11K01l2K04l32K95
1719C34p04k32P5J60J25K83L62MJ03M1o2k83k39k93Q8l24K0K73K93K13p2L23k5
1742D63K01n37m38K97J17l09J46J8K66M3j52j17o6J1j71k5k14K70J0J32N6K21
1764B22J64j36m45M30Jk26J9j03k75M76m86K04L51L93m46j60J2lO8k88L7p8K21
1787d8j93K80N4J69J23O3j69L0n52L3p2j10J43m4K32M06l69K35J46l1o95j39O10
1810A02k25k84L84J42K61j22K76o7l67q7m37%J07J92p4K05J23L24q8m09j2Q3k08
1833a81k26L5J20L85N3n8L59k73K91k36j55l33J43k13q9J0N9M73k66K04Q4jP1
$$ y = [15, -100, -54, 129, 313, 646, 403, 247, 102, 255, 17, -266, -139, -271, -75, 23, -107, 128, 338, 433, -63, -366, -420, -577, -551, -482, -418, 322, 410, 412, 654, 624, 256, 166, -120, -461, -168, -528, -494, -313, -2, 199, 167, 371, 39, 334, -370, -602, -527, -367, -242, 41, 403, 407, 510, 551, 489, 206, -33, -326, -238, -562, -542, -269, 24, 237, 165, 488, 463, 664, 127, -311, -14, 103, -206, -60, -42, 224, 267, 115, -2, -68, -57, -228, -253, -467, -197, -187, -55, 1, 222, 386, 250, -195, 235, 236, 10, 29, -74, -349, 127, -359, -155, 196, 589, 143, -17, -5, -8, 60, -228, -191, -269, -48, -241, 39, 93, 262, 385, 448, 279, 309, -243, -210, -282, -392, -249, -293, -61, 345, -24, 211, 357, 326, -369, -508, 102, -123, -407, -23, 119, 380, 258, 534, 467, 100, 13, -424, -424, -317, -125, -199, 6, 129, 453, 365, -44, -56, 27, -181, -407, -372, -252, 133, 186, 128, 487, 214, 505, 269, 114, -219, -76, -289, -378, -368, -309, 164, -102, 102, 186, 185, 256]
1856B56m22l02l6N98k16K04k43L29L07k82r9J43j59j72k2n3J15L53m47q8K84L04
1878C52k88j9oj13J66p1o31J7M93L41m36J18L73R7o5k67j31K30j21l54n3L5L05
1901b8K69k63J64M7j39Q9r5j99o6J43k91K20P4N11j13j24n0K7l2j96k3k93K08
1924a60k0M2J94M70k25k41j70L17k35q9j99j1L57n1M2Q3K26J80J35m35n95L97
1946A2J00l77J17l6Q3M40k73O5j08K21k85k66J25J86k06M5J82p3K90k68M11n1
1968C34j47K5m47o8J59K33J09k61l6Q3j3K21n95M28l42K88r0P5J19R3J89k40J32
1991B49j24M48m52k21J12J53l91j97K07J30M9J11k06K05n8J5O0j02l9rq4m38P68
2014A86j02K44k69K05k37P3n37L2R2J16j27j3K84L82R9n3l9l91L08k59n31M05
$$ y = [256, -166, -468, -504, 94, -122, 82, -161, 168, 475, 193, 94, 237, 78, -94, -116, -169, -54, 299, -148, -236, 48, 352, 64, 45, 39, -74, 92, 21, -610, -593, -100, 241, -195, -77, 296, 393, 328, 61, -70, 160, 39, -315, -368, -333, -28, 241, -22, 142, 189, 50, 139, 44, -155, -221, -78, -369, -149, -75, 436, 323, 199, 149, 176, 144, -52, -75, -368, -160, -180, -138, 56, 526, 301, 60, -110, 207, -28, -117, -316, -327, 30, -21, 21, 104, 330, 510, 645, 210, -385, 12, 112, -265, -148, -184, -101, 339, 66, 131, 23, 244, -41, -307, -182, 4, -202, -157, 25, -48, 242, -26, 385, 334, 187, 212, -235, -303, -144, 89, 198, -63, -99, -16, -29, 192, -403, 25, -317, -29, -119, -44, 75, 168, 357, 117, 249, 125, 573, 121, -100, 12, 165, -226, -423, -216, -86, -37, 74, -132, 73, 15, 30, 90, -12, -51, -60, -144, -582, 186, 84, 328, 59, 264, 27, 100, -437, -405, -313, -197, -324, -337, -53, 329, 428, 375, 336, -55, 253, -6, -537, -132]
2036a32q5K78J29k66L5L75r5j38k78m9K60l01O9K26j42L22j27j83L12L5j0k91
2058e6j6o1J41k34K21J78j46J45k98p2L0L30n0l95j66M32J19J25k61K72K00l60
2080G8M48n04k0J22m06j11K72N8J17k1m1O7J05Nk41l2K73J68k26l26M47J10j35
2103B07J6j1j72K04m15j12L09k68j96L95q0K68k20K20O6l17K45j35M5n6mk33K05
2126c9k57O06q6l48J55j51K05n01j1J87n2P0L65k22MN11Qj61j57m1l04J43j47
2149b23R1j18L65k05M4J82J68n43J62n9J8L71o24L84O1P7K45J03m15L01l9n43
2171a97k3J13J1J57k22K97J08j72l28L23R3k84J47R6j29p9L08j60J73k00l3J46
2193A45n7k51j38K15Ok27K48M8P5j54J9K04J68j34l07K13q5k68N81n33J36L53
$$ y = [-132, -217, 61, 190, -76, -41, 334, 239, 101, -177, -226, 34, -267, -198, 28, -114, 208, 81, -102, 210, 245, 235, -56, -72, -133, 8, -226, -5, 173, 27, 172, -126, -198, -168, 162, 112, -283, -449, -17, 102, 227, -34, 238, 438, 78, 526, 22, 2, 124, -282, -393, -121, -63, 54, 33, -8, 59, 164, 169, -72, -104, 169, 337, 111, -215, 232, 342, 207, 223, 212, 40, 244, -171, -283, 26, -242, -438, -43, -123, 145, -75, 145, 211, -106, 139, 4, 49, -7, -11, -244, -39, -296, 310, 224, -124, 31, -120, 85, -416, -427, -240, -292, -222, 143, -79, -75, 436, 444, 283, 126, 85, -219, -76, -223, -132, -250, 115, -90, -46, 136, 304, -239, -77, -136, -118, 253, -371, 13, 74, 151, 396, 499, 84, 385, 346, -197, -220, -107, -96, 61, -161, 136, 244, 72, -256, 67, 160, -124, 23, 119, -10, -89, 219, 59, 232, 32, -1, 145, 88, -163, -301, -86, -80, -307, -59, -11, 64, -90, -71, 133, 301, 167, -140, 73, -12, -280, 301, -232, -96, 257]
2215B57k28Rk13M57j03Ml04l6K55j05k48J80k1K42k81L73K60l93J4k02Mo7O6J01
2239B1k14M31l59J07J74K3j01j13j21J99q5J1j9J43N8k51K48l13Q6M6M9J52n70
2262c98L56j85K86N3j48L63l61k5k1j43J66m3K00j02K00l50O15l37k58J49Q5J47
2284B49n99J89K7L21P5r2j2M3k51J94k07N0j20J07M6j15K12q4q2L19j56j42L0
2307BK69l40r6M3J04J98k11Q6j09K45k59J37J93l68q4K57P9j40q5m7J84K01J5
2330B74k08J07L5j76M4j37j19j00J95k66J89K67K07L5l15p9K19l19j1o4K17K05
2352B00k47K39k51p6J75k75J03k68J63L6q5R2K85k3K9J8r1K31k61J83k10j24P2
2375h5j7PJ48K12o1j85j12K43m13K59k71j37L97j8O7j34J00j26J22j47J10j92
$$ y = [257, 29, 38, -175, 282, 179, 183, -121, -157, 98, -7, -255, -75, -96, 146, -135, 238, 498, 105, 119, -83, -79, -146, -80, 21, -193, 238, -121, -14, 160, 183, 82, -31, -152, 47, -38, -27, -46, 97, 155, -96, 152, -161, -75, -29, 20, 172, -398, -42, -227, 59, 112, -36, 327, -34, -59, -80, -223, -57, -100, 100, -2, 198, -152, 463, 126, -132, 17, 102, 249, -350, -161, -134, 187, 262, 170, 158, 201, -50, 144, -63, -13, -133, -26, 20, -95, 117, 33, -49, 270, 114, -28, 2, 271, -69, -165, -122, -18, 180, -31, 55, -54, 191, -68, 69, 262, -106, -190, 67, 146, 6, -79, -126, 58, 259, 274, 66, 173, 208, 32, 76, -61, -180, -280, -85, -351, -162, 105, 312, 347, 32, -47, 172, -147, -158, -222, -5, 200, -47, 192, -59, -135, 40, -235, -132, -400, -237, -201, -286, -194, 91, 68, 97, 115, 24, 255, -6, 177, -33, -157, -85, -102, -95, 53, 265, 204, 19, -93, 150, -263, -4, -275, -412, -15, -33, 34, -100, 0, -126, -4, -151, -41, -233]
2397b33R8O1L2P1J42l38L37n0j55j86J00m0J2J82J03J04q8L23k33k58k8PM2J62
2421A67Rj01j44O0o3j35K23l9M3K22q0n9j98K18m7j74qL20j89N7k6j04J00l0K2
2446D4j59K62j15j3q6K90k67m0K70j62Nj3m2p6K42n04J97J23j3J10rj69K46n0
2470G1j31L88l63K1k35M32N7n0P7j04o3l52O2J38m8q9J92p2R6j09J04j01K53k21
2494d7J62k19J72m5o9M9j55J54J0J0j83n4K98j20j74J40M6R9K1P0kr4n3L5j33
2519h2K32k1j18l62M0M14j8l34L66j64q5J71l54L60L7j42J89j02o7M5J54r3r9
2542c3K19j36K60k00j27j58R2Kn5J78j04J91j03K15q5j05p8k00J68J02j88k62
2564d07K46K77r7P8jo1R3j10k10K01j12K9k8J10j95K17J42K6j89k17L27l33K25
$$ y = [-233, -135, -74, -42, 29, 171, -167, 170, 120, -35, -221, -121, -161, -149, 33, 136, 240, 152, 475, 242, -16, -44, -37, 5, 167, 176, 75, -69, -9, -72, -207, 16, -23, 20, 242, 162, 103, -95, 123, 76, -98, -106, 214, 25, 82, 56, -48, 52, 22, 44, -115, 147, 32, 19, -67, 223, -44, -84, 186, 24, 29, 16, -26, -102, 140, -364, -167, -44, -57, 53, 44, -125, 121, 71, -60, 328, -35, -14, -249, 183, 240, 190, 267, 163, 100, -252, -190, -52, -100, -189, 3, -69, 27, -82, 22, -79, 174, -47, 115, -104, 68, 23, -46, 3, -152, 2, 12, 22, -161, -215, 83, -37, -211, -71, -25, 74, 95, 165, 163, 69, 16, 51, -82, 150, 129, 11, -351, -311, 103, 85, -249, 117, -47, -132, 39, -315, 45, 82, -60, 129, 27, -40, 5, 159, 66, -33, 186, 50, 310, 110, -17, -175, -83, -81, -136, 42, -62, 129, 26, 241, 156, 51, -27, -227, -59, 43, -145, -407, -161, 116, 19, 97, 96, 35, 128, 18, -192, 9, -103, -74, -102, 8, -187, 30, 172, 198, 9, -208, 119, -214, 11]
2587A1q2jJ74j84J90j5n6N4n19M35p1J29Q4l71J87K38J29m28j15K82k23K31N2
2610A31l80Q8K80k6L8J53j97J94k51J81l07o5J08Q1k6K21l30K78r7J06k80L2L63
2633B95n27J04%k1p4K03L73j43m55K49K36l44R1K84l33J83j97k38K09J37J76m05
2655a97q8M94m4j16J24j3k54J34Pk4N5r2K55l21L16m57M77k83N6q6j63K01M2J89
2679B12k91K03p0j4j61J84J28m76K30J46k60J23k15K83k64J70l7p9J09Q7M2k6
2701B4n2q2J81K7k05j27K13l3K1n9J20j25j47J31K39j12J02k09J25l89M04j12
2723f5K38l17L99m10L07j5j45K84k89j7J72j96R7K0N5J55l59r5k0N08j22l62K00
2746B3j62K95J43j55k19P6l12K65L14k96L06j08m0O7k26n4N9O5J84J4j74j76K60
$$ y = [11, -71, -72, 102, -82, 108, 93, 37, 91, -428, 7, -64, 65, 149, -222, -35, 203, 332, -96, -211, 71, -152, 79, 131, -249, -161, 119, 93, 131, 284, 87, 281, 30, 211, -96, -161, -53, 28, 2, 223, -107, 171, 74, 180, -100, -68, 295, -232, -128, -128, -149, -223, -20, 353, 210, -245, 4, 240, -104, -13, 271, -62, 121, -76, -314, -105, 32, 208, -197, -285, 209, 165, 49, 173, 160, -94, 40, 47, 23, 78, -14, 241, -80, 236, -221, 256, -27, 29, -57, -220, -19, 23, 212, -79, 124, 54, 40, -121, 63, 191, -285, -55, 91, -169, -46, -261, 22, -242, -72, -109, -188, -79, 8, 50, 24, -28, -110, 71, 98, -107, -234, -21, -54, -33, -92, 28, -97, -244, -113, 126, 14, 116, -93, 32, -357, 47, -65, 173, -144, 255, -155, 152, 137, -8, 276, -13, -30, 142, -54, 43, 63, 118, 273, -86, -181, -201, 307, 185, -177, 23, -139, 156, 299, 144, -75, 1, -311, -46, 268, -28, 278, 170, 130, 197, -29, -83, -24, 41, 225, 239, 65, -111, 149]
2769A49L3j0j24r4k53L47N1j30k1j26n5L65m58J38MJ56r3q9K24j50K4J85K18k25
2793F6j47K66k33K95m49K90j03k98J92P4j20K45P6k39K3K65k97Q2k56L59L0k88
2815a67K37k88K90Q0l43j32J04K58q9k7J11R5j8k56J06l3K30k05n0j99K41k04
2837b59L63R8l74L2J05K49k84J55p7j7k00L61k34Q5K85k40J22l74J77j18K02p3
2859a6j74J59l54N67R9n64J24PJ1K04p4M7j05K64k22K05k55K70m17M6K09k57M87
2882B61l92K12j11J86lM7k64mJ14j62K61j63J16k40K31Nl7l2j35Lk3J46k84L93
2906A25j17K31k08Jj51L31k97J26j95L26m3l8j92J28J8j64j18K60k8J07k48Q0
2928f6k22L31K53k83K09oj07P1k98J01J53l73L45pk61L36m02K21J21k63J50j57
$$ y = [149, 182, 172, 48, -46, -299, 48, 99, -31, -52, -178, -233, 132, -326, -188, -184, -28, -121, -210, 14, -136, -112, 73, 291, 66, -81, 185, -48, 247, -202, 88, -15, -313, -121, -47, -167, 78, 154, -85, -62, 203, -94, -12, -268, 91, 121, -167, 70, -218, 72, 152, -191, -323, -219, 39, -50, -77, 34, 129, 111, -145, -39, -72, 158, -47, -97, -296, -55, -259, 104, 202, -172, -140, -35, 214, -70, 85, 8, -9, -209, 152, -82, 3, 288, 48, 170, -204, -27, -145, 57, -16, -190, -31, -385, 182, 281, -283, -159, -152, -141, 63, -11, 36, -69, 195, -27, 178, -77, 193, -224, -178, 31, -226, 261, -131, 81, -30, 156, 153, 200, -64, -68, 46, -116, 145, -18, 98, -142, 89, 94, 57, 25, -110, -107, -130, 16, -268, 125, 8, 239, 31, 32, -119, 212, -85, 41, -154, 172, 129, 91, -101, 27, 45, -119, -237, 23, -5, 102, -146, -66, -288, 43, 296, 13, 222, 216, 109, 180, -118, -17, 136, -237, 108, 101, -160, 176, -226, -5, 116, -147, 3, -154]
2950a54Q4K66K10l67J26L2j42j77K75k08m2J49j90K27k37K41o3K61l06m2MJ94
2972A41o8k5j78J11J51l32L49j02O3k2j56Q7or4l0N9k7QJ29j45M42l39J89Lk04
2997DRk8P3l6J09q6k26j2N3K37M7k2k58K79k66J40k34J98j6j59J73P3o8R8l38
3022b56P7P9P9Q7j93K71k43nJJ04p1k7J54o1j83K60j21p6M46j59j7j93J10j39
3046g6J82l09K31J52k57J73m6Q2r6j02o0j20L24J6p6J02L4j24m6p3K17Q0p7j04
3070B7J39l49j1L92k41n6p7J47O8r5r6K57j62j3J72j01K05q7pj45q4q2L76j1j43
3095B3q4N3o2l0J0L08k83K42k79K51r9l7K21j75l39K87o2O4L8j63k2k10K49J10
3119A1r4r8K4J81n0k45L32k37L44l34J8L21k66J56j49L1j64L46q9j21J98q8Q2
$$ y = [-154, -70, 196, 406, 39, 165, 197, 55, -122, 153, -55, -97, 52, -138, 89, -148, 93, 30, 291, -15, -57, -53, 141, 73, 48, -130, -19, 132, -200, 149, 47, 110, 88, -68, 19, 13, -81, -111, -52, -79, -71, 58, -87, 355, 16, 205, 208, 4, 13, -15, 58, 22, 131, 45, -181, -193, -140, 97, 144, 122, -136, 143, -123, 17, -217, -19, -35, -194, -21, 52, -16, 82, -256, -179, -100, -21, 66, -127, 144, -99, -104, -103, 1, -70, -97, 57, -4, -187, 73, -48, -124, 322, 163, 146, -47, 63, -76, 106, -203, 28, 180, -77, 96, 50, 132, 36, -66, -126, -246, 78, 94, 18, 120, 154, 30, -16, -89, 128, 208, 131, 27, 166, -183, -194, 198, -43, -99, -176, -29, 39, -56, -152, 105, -57, -70, 102, 1, 206, 119, 112, -33, -117, -199, 177, 166, 23, -61, -8, -70, -100, -90, 218, -65, 177, -102, 149, 50, 13, 234, 59, -280, 7, -55, 9, 47, -116, -138, -348, -99, 11, -83, -181, -157, 24, -26, -271, 61, -176, 168, -166, -148, 173, -93, 63, -86, -55, -219, 127, 38, -83, 115, 27, 109]
3142A09q5J8L4R6j63M2L7k97M2L87j56J80l00p0O3M0j92K22q2J21L6K7j07o9J4
3167e3N4j87P0q3r8J93J47j52N0MJ38n9L1j72K11l35M92k5l75K53k85M9K53j3
3191A08j00j82J04Q4M1j07N3J14p0o6m7K19j32m7Q7p7J5m4J51j31j92J47K17p5
3215G0j35K21k46R6j36j52K93k6K19m10K03O2n5k6K21k24j4O3r9J09q8L47k07
3238H6k94Q0K12j49O4MJ90j56k55K4M21n26O3M3J71M3K9K78m92J17j80K00P1k8
3262A6j72K26j3qOj43PJ89k37K14P2l94M28o8j63L3J66l66K81J88k10O1j46J47
3286A14k3R8m7J41k64L9j98L67l7p7J45l05N2K33n0R1l69L7M2k64J76K88Ok05
3310a0j25J67J34j71N9j39j22L42j71j25J64NL01k47j39Q6n4k50K17OM93m66J87
$$ y = [109, 24, 42, 76, 172, 9, 51, 88, -209, -167, 220, 64, 244, -56, -126, -63, -23, -215, 7, -75, 46, 82, 109, 2, -67, -53, 1, -186, -116, -199, -297, -104, 43, -109, -59, -55, 83, 24, 55, -117, 94, -241, 251, 226, -149, 104, -181, -132, 121, 108, 8, -174, -70, 14, 55, -52, 1, 115, 45, -21, -68, 151, 19, -28, 59, -18, -3, -47, 104, -27, -219, -72, 145, 70, -65, 156, -90, 6, -130, -282, 11, -15, 204, -206, -3, 59, 4, -22, 199, -25, -39, 24, -75, 34, -54, 293, 86, -208, -128, 84, -65, -1, 3, 193, 37, -218, -194, 227, -299, -236, -193, -22, 21, 50, 328, -164, -47, -227, -27, 44, 16, -156, 70, 57, 49, 55, -88, -81, 108, -129, 85, 157, -237, 191, 123, -40, -7, 159, -207, 74, 262, 52, 113, -33, 114, 91, 189, 142, 283, 19, 58, -140, 227, 190, 113, 258, -47, 5, 238, 188, 279, -90, -53, -11, -275, -99, 189, 195, -10, -135, 32, 166, -5, 54, -85, -207, 135, -36, -161, 3, 8, 309, 62, -77, 9, -45, -295, -78, -72, 421, -45, 142]
3333A42m40K90O2Q4l67J09K93j10m50N67k56J6J30K88o82J72MJ25J07k31K09l72
3355c10K82r6J68J36J3k18K33k67K44k28O6L9m15K98K14J41k1l54J20J63k23o7
3377h2J37o4j7N7j11O5R8O5K2l68J17L56l67K80l66K9j36L21K28m71L26l9n4n5
3401b9j58J80l9j70L28p5l2j05L58m07M40k44R6l55N30l23K6j01K20l37J01J73
3423G7k04P0o2K22k87J09J48k0j80J13j38J99J24k09K24k59K26j69j70M71l63
3444g8K26j96K35l22q5J56J29k05J15O3J44j07j46O2k56L88j19N8P7k08J58j98
3466a09J76qL7k66J96qL5j54J19Ro3J44j66K48J15k59j9o4k02J82OJ92k64J25
3490BLON5j58J38k2k67J23J99q6Q3j28M55l84R5r6n9k1j78K44J06J4n0J57m06
$$ y = [142, -298, -8, 54, 138, -229, -120, 173, 63, -387, 180, -76, -60, 70, 358, -324, -152, -148, -23, 84, -147, 62, -310, -28, -124, 44, 180, 193, -25, 208, -59, 185, -43, 23, 62, -353, -55, 159, 300, 279, -75, 45, 208, -15, -82, 55, -9, -26, 31, -80, -15, 83, 148, 170, -198, -81, 275, -92, 188, -178, -149, -285, 36, 264, -207, 119, 80, 26, -29, -187, -7, -46, -216, 112, 37, 5, -100, 258, -149, 291, 47, 143, -212, 318, -5, 21, -80, 140, -197, -96, 77, -127, -57, -119, 103, -184, -75, 73, 53, -127, -14, -152, 47, 171, -38, 186, -73, 153, -16, -186, 285, -78, 148, -48, 187, -135, -220, -64, 65, -140, -25, 38, 182, 75, -71, -9, -265, 123, 4, 62, 139, -69, 89, -109, 67, 59, 96, -170, 26, 18, 53, -101, 18, 27, -36, 108, -58, 190, 305, 46, 27, -37, -239, -57, -51, 141, -123, 2, 5, 11, 66, -92, 46, 24, -243, -120, 79, -7, 76, -52, 403, 19, 114, 18, -41, -62, -240, 4, 110, 124, 74, 231, -175]
3515a75K43o6m3J16J71k07O6J23k85J55Pj97J47k65L19j59N9m0J90j09j5K1j34
3538g8J25J1n9J14l08J44K52k33j59M02Q2j10M5j28j01m0P5K14j46ML5J19j20
3561A40p9%J01k09K07k34K13j46j10rK2R3j60o5M12l62L88k21N5k3K4M0o0o6k28
3586b77K85K01k38r3M4K0N8j23K26j75p2K25R1l32N8o5K66l34J17M3Q3J77k47
3609f2O3K46m47J57N8q5J11m7j18q2J18PL34j67L8l78M91l95L31k32L02k27J83
3632A99k01qj28q6J41o6K27j46J00N4l8J58j67j9K7j67j48K64J4k8Jm3K02j20
3656B2l1O1k24N3L79l55J26J17k35Q9j7J42j46L02m48J79j85L86l64L60k77R1
3678B5o9K30l22J43k5N1k04M62k12j42J74mk62M44j4m47J13J62j83Q2J28J5m96
$$ y = [-175, 68, 2, -41, 75, 246, 39, 105, 228, -57, 98, 105, -92, 55, -210, 109, -50, 9, -31, 159, 50, 35, 56, -78, 47, 58, -1, 113, -195, -51, 201, -32, -191, 211, 293, 183, 228, 100, -1, -41, 34, 248, 102, 106, 141, 260, 140, 61, 61, 162, -47, 160, -74, 139, -7, -117, -126, -104, -11, -171, -236, 176, -186, 202, -19, 36, 13, 37, 77, 17, -49, -277, 8, 209, -29, -122, -78, -58, 0, -123, 103, -72, -144, 81, 172, -160, -102, -167, 99, -235, -118, -75, 8, 185, -62, 1, 247, -200, -43, 15, -70, 41, -6, -124, -206, -88, -81, 253, 86, 124, -254, 237, -158, 173, -59, 243, 16, 199, -2, -10, -138, -224, -83, -149, 78, -68, 32, 86, 48, 206, 39, 20, 47, -120, -268, -4, 10, -18, -17, -60, 142, 22, -9, 52, -172, -119, 260, -95, 31, 148, -87, 2, -15, 127, -19, 283, -165, 14, -171, 215, -149, 211, -66, 25, -44, 186, -136, 7, -18, 33, -171, 291, 79, -63, 111, 107, -155, 289, 275, -172, -59, 103, -80, 2, 130, 145, -351]
3701c51N18np2L26p07K90k2J05k31N5J52j38J59o6N3l82K11M5K78m56K02k14J49
3724a01K11q6Lk09N74j40l23L6O5j1k81K81j0j19p6K39J06k23J80j8k64K14Q4
3747A32k89L52k04L37j26l54m2J96J77j64k66%L21j27J22j12L30k87J99k19L43
3768C19k47j96J88J89l45J98j56p9J02J6J97j28j5k53J25j64N25k28l1k2K46j61
3790H0k8K80k28l4j9P7Q3j91J02k41J35J96k54k9J46q5K85k19K20m51J32K29j82
3813Dq4j37J33J1P0m5m7O8K44k05jJ74R0k20J19k13L7qR0l5n7k04J88l0nJ25m3
3840A9K37l49k21O5P8K94k15J27l10Q5K05m4K83j47p4k11k8J06J78J53k70J78
3862A39j78K5J30J25l50J50R0J27n30L53jj45k9k0m1J38M8oJJ26m0j39N1l9o9
$$ y = [-351, 167, 162, 90, 416, -291, -1, -23, 82, -149, -94, 58, -80, 79, 13, 66, -316, -105, -60, 218, -238, -36, -250, -101, 110, 24, 27, -182, 392, 252, -71, -35, 30, 19, -262, 19, 9, -110, -186, 53, 159, -64, 116, 98, -166, 48, 132, -157, 195, -9, 328, 202, -152, -194, 2, 179, 15, -251, -251, 70, -57, 65, -47, 283, -4, 195, -24, 319, 72, -124, 64, 253, -92, 106, -50, -129, -27, -11, 186, 58, 43, -210, -85, -249, 276, 48, 17, -5, 241, 80, 52, 332, 104, 70, 51, 128, 211, 20, 122, -119, 16, 212, -42, -71, 75, -10, 275, 56, 276, -175, -43, 186, 4, -80, -217, -84, -73, -3, -48, -95, -27, 217, 12, 11, 185, 275, 55, 174, -39, -2, -10, 80, 45, -12, -216, -28, -58, -63, 62, 19, 256, -93, -314, -249, -171, 123, -92, 35, -275, -190, 15, -29, 254, 107, 33, -178, -206, -100, 78, 231, -39, 139, -39, -14, 116, 241, -109, 41, 131, 258, -272, 81, 80, -65, -94, -114, -155, -17, 31, 25, 26, 152, 112, -27, 24, -15, -84]
3887h4L17k09k73J73O7l6J61j07m0K54r9nk44R7L3k2k24J32L13J3m07L22k11k4
3911a03K56k11R3N5L3m96M49L35k08j86j90K43l0M4J34m34N62j14k08J22Q3l59
3933a30k61J95J78K71j15o5k77L39K9k78P6L2j06J62M9o9m9Kp4M53k26j42K6K65
3957B85j69n6j44K00j1r8j48K56q8j13l7J13J93l75NK19J50m3O5p7p2j00N7Q1
3981I3Mk47K46j48o0K40j61j0L26m22ML54j36j47j02J25n4K01r8K01k69J75j20
4004eJ1Q2J0k27J61j57K69l03J92k77L6K95k03K71j54j27J1K00r2j28j2m29M15
4027a61J57Ln6J63k54L27j63J9j21M40m01k02R3o7M34l26j7M9J99k54J68j64J28
4050fj0l86L58L23k59o0q9j59L21J00k61N1j03K14r9K86j18k03N0J32q7J13l54
$$ y = [-84, 233, 24, -249, -76, -9, -45, 116, 9, -31, 223, 124, 119, -125, -28, 5, -17, -241, -109, 204, 217, -190, 132, -79, -103, 153, -58, 35, 90, 123, -373, 76, 411, 203, 17, -173, 70, 40, 84, 218, -216, 346, 232, 24, 146, 229, -130, -391, -196, -18, 253, 138, 73, -204, 135, 164, -114, -38, -6, -112, 50, 99, 30, -19, -17, -91, 362, 136, -6, 20, 285, 116, 60, -84, 116, 105, 7, -141, 115, 27, -86, -123, -10, 183, -192, -187, 32, 182, 139, 204, 127, 55, -45, 12, 93, 97, -150, 96, -52, -112, 128, -33, -43, 283, -139, -135, 219, 83, -64, -166, -41, -95, 106, 8, 209, -60, 115, -5, 6, 88, 98, -129, 32, -125, 144, -159, 33, -244, -208, 87, -116, 155, 1, -126, -115, 85, -7, -135, -147, -576, -161, -4, -1, -57, 106, -148, 179, 16, 35, -86, 354, -47, -249, -156, -223, 211, -115, -132, -83, 116, -138, 30, -134, -6, -16, -402, -44, 279, 20, -40, -129, -288, 33, 133, -128, -77, -180, 34, -65, 221, 103, -100, -50, 82, -5, 108, -246]
4073b46J79MO8Q0m20N43j56j32J84J0m4J81j57m4l0m9L1M9j14j25J26k42K79j45
4097a70J3J90J50j53k35L92l34J9j40L64j7j12K18p4j19J04J13k47P0L1J1j05
4119c1M1J59k00J07L2j51P0k48M37k89J52k13k0J83J08j01N6j74o5L58R1n19L26
4142A09N1j47q7J03j06j02j09j86L93k01K44k9J77j95J33j11L10l58K80N4k86
4163f3jk22L87J17j34j81L8RP9K34l01K03l15J20K27j87j33m9K30j36o5L25j85
4186cR8j3j4L0j54J43l5j34K60n2j09N6j44j46L00j47J27j49p3L76k8l36Q5j00
4210a62K91n1J29j22l60M40m49M34m9k54N6R5O0l27M47J19j09m07M51m45N2L3
4232a28J89Jj97R8J66r8M2l09L14m6J14j53J5n7J24j41k1l4j58K40j70K74j61
$$ y = [-246, -67, -63, 5, 85, -335, 208, 52, -80, 104, 114, 70, 251, 94, 50, 20, -29, 2, 51, -63, -188, -62, -304, -25, -170, -157, 33, 183, 30, -205, 187, -147, -128, -268, 96, 79, -33, 185, 111, -8, 96, 209, -38, 32, 63, 74, -31, 10, 169, -31, 76, 108, -43, 27, -221, 216, -73, 79, -134, -154, 29, 137, 36, 92, -82, -147, 211, 302, -217, 109, 160, 13, -74, 29, -77, -179, -288, -474, -81, -282, -38, -67, 110, -85, 48, -63, 247, -111, 169, 223, -63, -64, -286, 101, 218, 84, -97, -59, -50, 29, 263, -38, 165, -150, -30, 197, 10, -123, -172, 58, -78, -143, 182, -3, 95, 82, 68, 98, -56, 87, 52, -82, 178, 126, 17, 73, -71, -217, 83, -64, 63, -86, -159, 217, 189, -147, -62, -162, 129, 78, 207, 85, -275, 165, -284, 150, 101, -153, -97, -2, 58, -269, 178, 297, 188, -219, 232, -213, -161, -128, 61, 62, -135, -37, 129, 31, 73, -236, 78, 32, 146, -7, 8, -49, 75, -66, -87, -121, -279, -39, -209, 65, -96]
4255i6L69k2l29L88l01j22M45l71JJ91q2l03J25N5K00j94kJ49j04K49j59j95Q1
4278b7J64k57L04j71l8J01k16R0p1K13k0m67M10q8J3J12Pj1k01J53N0l15J09L60
4302B04k93M34l15M0p1j0q0K12l31L63j20J23j13j15J99j06r8l2N5j3M56m72Q1
4325bO8J99j62P6k98J74k41P3M2p0L22l81K04J12Q6k38k0k2J26l22J32n7J96k05
4349b08J37J73j4l9J01j79m9J32j1J41k21K15J81n26J91O6j18K34o9l33j0K85
4371G9m2J32j67l2J28n8k6j23j12O2J59Q0J23l96Q8k4mJ85j14L63j14n7k77K13
4395F6l39L5J39L95k13j27Q3k03L83r9k61J63N0j44J50k24K06j66J5K25k18K57
4417A73l46K6K62n5p9K69k90L59l74M24n12J73m19M16j55K74p2j2k18K13K25k06
$$ y = [-96, 273, 251, -78, 310, 9, -113, 332, -39, -38, 153, 71, -232, -107, -52, 148, -46, -48, 101, -3, 246, 87, -108, -27, 137, -120, 184, 13, -25, 76, -140, -50, -121, 92, 72, -395, 15, -73, -60, 52, 59, 48, -153, 0, 50, -265, -156, 204, -89, 345, 30, 70, -1, -11, -91, 121, -210, 153, 33, 156, 43, -72, 127, 21, -77, -109, -54, -67, 389, -83, -2, 66, 265, 103, 179, -119, 55, -186, -113, -71, -141, 181, -200, 4, 116, 202, -36, -56, -78, 48, -274, -142, -199, -3, -208, -71, 102, 88, 49, 150, -29, -78, 54, 43, 184, -37, 178, 359, -167, 24, 90, -28, 206, 137, -196, -206, 79, 37, 169, 2, -30, 98, 40, 14, -109, -221, -159, 0, 80, 203, -193, -105, -129, -133, 52, -62, 301, 187, 130, -147, 66, -273, -238, -99, 296, 83, -44, 39, -164, 219, 120, -141, 22, 72, -72, 78, -146, 60, -106, -91, 134, -84, 173, -173, -147, 115, 60, -19, 250, -40, 319, -55, 369, -143, 30, -389, 27, -128, 146, 74, 62, -156, 57, 282, 76]
4439G6j01j19L5K19j97L5J20j19O3Mj41K12J3l7L0k53J64j61K87R6l80L16mj91
4463c3o7lP6k07L33j79p2N0K14P6k40L2J43j91R4j00L01q8k81L11j9Pk43J36n
4488D5o3k93J60K53j79mo1R1K65l95J12K27k69J39K41o2l7m28K23P5Kr4J95j69
4512b6j68K13j56k6K19L1j56J1J19K07l86J55R3k18O4J66q8j80L17n51K37K31
4534A08k58J91k51L06J55k03R3k87K39j79R5j0k12L46P1n8q0k67K10L9r7J9O7
4557C7Q3j91K20j10M6n7j48L26l19J02m2R2J68j83m1j34RK25j40k41K48J9Q7o1
4581ej23J71Q1n36O18j67J67J3l15J36p6J86j35lj06j43J69j1L67l46n6M10l63
4604f7l00M78L7j36Q2o3j4j17L23k15J59l29N7m9K7j9N2j04L83K32l68k98J35
$$ y = [76, -25, -144, -109, 110, -87, -52, 68, -51, 12, 16, -125, 87, 100, 63, 93, -160, 4, -157, 130, 226, -154, 162, 158, -33, -100, -103, -27, -234, 99, -80, -152, -102, 112, 188, -52, -20, 123, -68, 26, -74, 227, 139, -142, 169, 150, 157, -86, 50, 45, -18, -311, -151, 102, -77, -81, -142, -51, 214, -181, -69, 158, -111, 28, 269, 207, 170, -258, -35, 40, 42, -52, 143, -26, -194, 19, -137, -163, 56, 87, -69, -58, 61, 268, -118, 37, 130, -88, -24, 142, 54, -126, 191, -360, -123, 108, -150, 41, -210, 96, 251, 48, 141, -146, 93, -86, 9, -1, -213, 133, 204, 146, 66, -201, 9, 48, -49, -30, 37, 120, -71, 149, 39, 85, 28, -120, 206, -113, -11, -53, 39, 207, 24, -17, -151, -142, 83, -57, -298, -50, -31, 56, -5, -128, 43, 124, -412, 206, 39, 206, 219, -96, 40, -36, 150, 15, 12, -94, -237, -68, -79, 288, -58, -114, 296, -67, -367, 111, 148, 12, 94, 31, 17, -100, 223, 8, 167, -162, -105, -154, -127, -146, -94, -198, 185, 417, 49, -249, -114]
4627a14J79k02J72p9L3J52j22M2r6k6J86k64K81N7k51j10K21o8J26PM0j63rq2
4651i0K40k32L56j29m0j80r0L77J3k04j10L20j22l7k38R5o7M73j47k08Q8K56l58
4674c4p2j18L56j57k13L09k79L40m5j54L67m27J55j71K0o5J60J19j06O6rj7k00
4697a75J49r9K93r1l31J37K58l59j4L63J55k22l9R0j14j14j44J76j10L93l21J84
4719F5j44q6M9j06J18M02l00j84K98k1r5p1J22K75l30P3R7k95K89l59J35J2j30
4742a86n2N15j45kK4n9j12K16k53J39j0k09K07l44K60k00N39m29J71k72K4J02
4764g6k18L19J13j21j13k46K40j06K47R7k43m4m5J93m0K51l14J29Pj45J30j5k35
4787b35qK98j46P7q9J22q4J11L3j76k2J66J05o6l2j30l9J88O2j34j50L52j57l4
$$ y = [-114, 65, -137, 35, -44, -11, 141, 19, 61, -35, -61, 125, -139, 142, 199, -52, -162, 59, -9, 117, 124, 164, 1, -8, -90, 150, -82, 274, 145, 105, -75, -165, 212, 225, 21, -89, 231, 109, 72, -166, -71, -138, 335, 188, -20, 68, 324, -34, -106, -224, 132, -25, -238, 71, -208, 132, 87, -67, 300, -127, 28, -143, -123, -188, -28, 91, -15, 51, 42, 25, -175, -26, -125, 168, 77, -254, -117, 141, -218, -232, 131, 286, 64, 25, 115, 1, -113, -257, -81, -191, 202, -119, 65, -79, -165, -116, -222, -104, 298, -2, -186, 112, 91, -4, -75, 47, 322, -8, 65, 162, -133, 156, -203, -68, -56, -186, -238, 277, 132, 130, 154, 95, -17, 199, -54, 85, 75, -134, 73, -271, -11, -211, 328, -101, 70, -202, -178, -76, -294, 25, 138, 17, -96, -342, -102, -208, 39, 136, -107, -151, -196, -3, -43, 208, -106, 23, 30, -115, 15, 0, -235, -243, 55, -91, -14, -103, 19, -65, 46, 79, -97, -119, 47, 152, 86, 54, -76, -115, 73, 135, 1, -149, 203, 46, 12]
4811A2J03j54J2N4p1L1M6k31L82o3l46M40m66M17k93J87K0m5q2m1m2P3J00J53
4835A96k27j52L76k43R9q9P8N4K08n32J90l36M44O2l6m92K04K00q6p6nJ24M1K02
4859B04j31j61K02j26l7K17l66M02O7l30K79l08J03R0J10M3j7k88O3J82n3k69
4881a24J84n3j15J97j26J8M9p0P5l16M18J34o16M80j87J41J2J24l58K57k48K77
4903A53k23m09N62K7p7j27K35m38O42m76J64Lj15r3J21RO0j02J45j8j42K08j8
4926I1J37j73J82k23m5K16Lk66j4J46q0J6KJ63n8j81o3l4K32j24J51q8j25J28
4950gK45l78K93p0j03J44j48K8k68J69M2j78M77k52P3Q3k40o2R5J25p8k8l1J8
4974e1J58j45J48jj73J82j47P5q6j95J75J81j79j21N0Q4k1j17J58lJ9k4q6PJ06
$$ y = [12, 115, -39, -27, 27, -44, -13, 33, -198, 184, 121, -225, 215, -251, 166, -127, 60, 80, 35, -47, -88, -130, -57, 43, 196, -31, -183, 193, -50, 49, -40, 38, 92, 300, -232, -42, -378, 66, 128, 92, -400, -196, 4, -82, -158, -163, -39, 2, 204, 73, -88, 114, -12, -49, 168, -198, 204, 271, -59, 220, -88, 15, 105, 215, 258, 241, -47, 16, 198, 145, -124, 60, 7, -108, 89, -37, -19, 30, -40, 35, -281, 137, 271, -345, 135, -52, 89, 101, 225, -133, 124, -124, 153, -70, -479, 83, 110, 33, -94, 141, -297, 345, -131, 33, 36, -79, -172, -51, -42, 18, -84, 61, 43, -99, 109, 91, 228, 55, 237, 14, -31, 185, 188, -78, -92, 54, -26, -10, -8, 155, 97, -84, -147, -181, 51, -73, 78, -10, -135, -7, 238, -140, 153, 83, -20, 124, -24, 4, -264, -95, -53, -231, 246, -6, 67, 150, -90, -152, -57, 68, -10, -38, -69, -51, 107, -38, 110, 109, -64, 118, -29, 46, -40, -235, -60, 121, -58, -179, -129, -45, -66, -183, -25, -28, -9, -33, -119, -112, -6]
4999fK95j76j98J28j44J94r1J00k13Q5Q8j12m5n2L2J3J34R1n7o5j24j4K26m3q1
5024c5k19N25k77K04j21k7l9j44j44J66o0K63N8j51Jj7J39n6k13Q3K66l33J40
5047IOj44J5K9K71J8k36J40k34J72J68l76J10J33o3k08J88q2L42m43J37k1J06
5070C7J3k4R0l42k6M64j48l7K31k45P1J37m0l03L4nj25L94j67N8Pq7j96J53m8
5095a04Q2M06m86K25J37j08m5j29k1j51K11k01O8j15J79o9j65lJ51J90P9j48j54
5118a71J50KK57k97j16J14j00L5L23n17L47J52j96m5L45j31k22J43j22J13j14
5139e0j01J20j27P9K17j4r8J20mj46L6kl14N29k90O4J05K08m05J37J46j92k38
5162b20L30p0J27k56J09J8j20J39N0j81J03j21K86j73m5j80K80k66l5M04l44L61
$$ y = [-6, 289, 113, -85, 43, -101, 93, 2, 102, -111, -26, 62, -50, -95, -147, -115, -102, 32, 123, 66, 1, -123, -137, 89, 46, -35, -254, 271, -6, 198, 77, 50, 11, -133, -277, -111, -171, 92, 150, -1, 0, -17, 122, 66, -147, -64, 202, -131, 9, 15, -129, -114, -85, 186, 204, -32, 108, -126, 46, 214, -162, -52, 81, 18, -190, -2, -84, 258, -185, -48, -69, 37, 50, 26, 116, -226, -252, 212, 64, 27, 258, 13, 84, 221, 181, -122, -88, -93, -218, 176, 9, 67, 74, -13, -209, -56, -104, -22, 384, -102, 123, 260, 152, 107, -22, -43, -194, 17, -184, -116, -231, -52, -121, -286, -289, -138, 52, 131, -17, -171, -21, -19, 238, -59, -175, -61, -161, -126, 197, -320, 27, 179, -17, -62, 283, 152, -70, 73, -49, 64, -50, -151, -31, -158, -79, 138, 124, 26, 146, 142, -4, 32, 30, -284, 245, -45, 19, 124, 332, -73, 64, 210, 18, -220, 110, 40, 167, -89, 20, 38, -82, 57, 107, -74, 29, -92, 194, 21, -24, -204, 76, -190, -225, 179, -165, 196]
5184A96p4j25L3j07K65l71K34j29J07o2n9J67j26J89j55J24k4K04k20M6o7q2J80
5207A44n05K54K71j35LJ8j17RJ40l48J98J65p4J29j39M0j22K81l93P4L07l07K86
5230A79q7k26O1J05K74m18J15J37q1k49L64k42M5O7l45J45L82kn5j0N1J0m04J92
5254HQ1j17J67k12M0J42l37K65j96o4m4J44J95Q1j78J73p6k75n9K76j89L88k5
5277A88m47J35L9J6k6j6k21L62k62K93n7J81j43M43m22j88O2K09Nj60l11K60J91
5300A31l91K74j43K05p3q1M8o6J44l03N07k88k71K07J35k21n3L17O4k59J82j07
5322d2JP5L22m75J94p2M6k9q8j3k1L3j17L08L9r8j88J63q9L3J0L36l54P0j03q
5348f7Q4O2o6J21j78q6N9K04j33K1q0Q7R3Oq6k27M7j31M69q7Nj07k24K54O6j18
$$ y = [196, 122, -3, 30, -77, 188, -183, 51, -78, 29, -33, -92, 75, -51, 138, -17, 107, 83, 287, 67, 113, 46, -36, 144, -361, -107, 164, 29, 32, 50, -67, -58, 82, -266, -68, 97, 23, 152, 13, 53, -69, 212, -181, -107, 200, -107, 179, 92, -134, -73, 32, 306, -112, 3, 140, 59, -190, 174, -68, -23, 44, -301, -156, 226, 224, 169, 159, 210, 220, -184, 8, 89, -28, 139, -73, -33, 109, -228, 37, -159, -223, -267, -123, 72, 153, -25, 148, 72, -203, -262, 14, -175, 213, 188, -259, -124, -85, -69, -95, -111, -332, 30, -232, 61, 4, 185, 42, 485, 63, -125, -63, 146, 151, -9, -320, -60, 131, -260, 14, -129, 76, 3, -78, -30, -96, 48, -255, 252, -36, -307, -100, 35, -186, -239, 78, 142, -117, 65, -42, -41, 34, 356, -119, 75, 3, 49, 20, -68, -81, -102, -69, -186, 122, 161, 63, -125, 38, -51, -18, -8, 328, -26, 44, -59, -67, 17, 79, 13, 134, -44, -130, -71, 133, 0, 21, -59, 28, 121, 127, 41, -186, -139, -270, 199, 112, 117, 10, -214, 40, 106, -12]
5374a2j90J46L7J3J5K55pJ4n91L52r3N3o8J78J35k90j68O0K56j05L3K05p4j44
5398A0P8n6j25P5k0J13n2Q6j54O8j22N3r0K23J87J56k00l33J37J95j14j48m0M9
5422b4K41o6j57K54k13N3j5Q0k83K52q2K61j81n5J45j37l7j28J97M1l85L80j32
5445Ij50J78k87K70k07L03k4n7j12J80j34l2K33j08j63n6J97J63n04J70P5l9M26
5468C31l15J25J29n00K77j93K09k45J27n8J75j09J19j83J13L8Q9j43q7kJ76N5
5490A28j11J26N3j90Lk0k2J46K4k19L18l33K35k4J9n2rk28K36k45K79k44q7K76
5514E9J49j51j0L76l21j5j28RJ74J68l30r0R7M5P7r6p6lm0R9q3L3o1K02J34j53
5540F5m2r7Q1J72k60RJ48l81N42k0j33j16J24j18n5L32l61r7J74j51O6M52n25
$$ y = [-12, -202, -56, -19, -6, 9, 264, 257, 271, -320, 32, -61, -8, -76, 102, 237, -53, -221, -161, 95, -10, 23, 228, 154, 10, 88, 32, -93, -18, -38, 75, 23, 109, -45, 23, -99, -46, -136, 87, 274, 430, 230, -103, 34, 229, 115, -33, -73, -24, 217, 151, -6, 248, 35, 88, 73, 153, -130, 122, 40, 301, 120, 65, 210, 73, 36, -92, 105, 146, -239, 141, 9, -141, 37, -250, 20, -187, 116, 92, 35, -77, 103, -31, -63, 170, 62, -101, -157, 40, 203, -301, -131, -56, -95, 331, 16, 141, 270, -230, 47, -146, 63, -182, -55, -113, 62, -47, 72, -111, 2, 40, 129, -14, -101, -103, 73, 128, 17, 143, 196, 6, 9, -11, -33, 113, 137, -82, 236, -97, 138, 114, 133, 81, 72, -156, 80, -165, 114, -130, -217, 59, 208, 57, 47, 423, 102, 87, -41, -32, 142, 310, -20, -110, -13, 32, 109, 13, -63, -66, -106, -7, -90, -57, -118, 84, 218, 65, 23, -74, 7, 179, -81, -72, 76, -305, 237, 217, 84, -32, 92, -26, -81, 251, -110, -207, -33, -184, -118, 334, -191]
5563a91K48l1p6k4J17n7o5J33l33M39j95Q3J88j62j27r1M2L13j06l6l26K46O5
5586E4q9J6m2Q3O6j87Q5J40n4j17k45J95J12j24J6L32j05Jk20K8k54M19q5Q5j86
5611g6M6k24L00k5P4P4j63N8k49K41l1jM4j20j37j21K29o4K38p3l5j46K1J08j15
5636a47K96j42J51j21j39J11J40q3j56j91J48L7k7K16j11K11j92m5R5P0p3k5J45
5659A68j93K8j72J77J19Q4j54J36m2j48K69l91K53qj22oJ17j7O3J55l01j08m8
5682a41J52j05O6J92l21L49j83OJ7n9J1Q6O9Q8k62J95j56J97n2l17L08k35N8k75
5706c12K95J90r0N4j80l2P9J2L4k19L9K87k93K21q1J9J7J49k60J17N2nm0j34J25
5731D4q6j7J05k6J80m02j31L14J29p8p2N1J36r4n4m7j4m7j61J44K25j05J13k98
$$ y = [-191, 57, 26, -50, -74, 43, -14, -79, 54, -279, 160, -35, 48, 236, 74, -53, -144, -102, 211, 105, 69, -257, -11, 54, -35, -19, -61, 22, 88, -99, -14, 126, 72, -45, -290, -95, 17, -107, -91, 241, 136, 137, -83, -55, -309, 110, 25, 110, -76, -30, -254, 46, 21, 95, 169, 6, 64, -185, 56, 25, 24, 68, -52, -189, -310, -81, -145, 93, 20, -15, -161, -140, -32, -147, 149, 7, 158, 37, -102, 9, 149, 66, -90, -281, -133, -96, -123, 93, -18, 193, 1, -44, 51, 121, 48, 23, 168, -25, 3, -169, 8, 127, 211, 57, 193, 151, 3, 272, -119, 134, 126, 4, -2, 115, 98, 161, 316, 15, -93, -141, 11, -94, -28, 164, -157, 192, 9, 15, 32, -27, -16, 70, 139, 227, -35, 160, 4, 201, 149, -168, 140, -95, -37, -312, -17, 173, 83, 137, -43, -75, 4, 16, 50, -169, -130, 157, -136, 85, 4, 23, 40, 189, -71, 46, 98, 93, 53, -81, 44, -42, -59, 46, 20, 200, -202, -333, -19, 110, 32, -40, 11, 147, 53, -1, -48, -62, -109, -270, -126, 99, -6, 107, -191]
5755a91P8J78k49J72K25k92J1pK82k87p6K22j62N4O3J29k2j98N3j2J0J26j67J7
5779d3m0p3M28j66j64J47p9j27j49K96j21J23J9k08K51k12J61j14J34k5p6q6J69
5802D5j04l8J78j07N0j31K05k79J11J85o4L1j31k37M50r8l06M2L61j43q5j34J94
5825ej68J13o7J56L1J19K7k42r9K66j89r9J35J63k04j02L63k81k47L58r9M00k66
5848F3j50mK71j38n2K49j48j20j99K78K27k46pj54J62k48J59m5N3J2L73m87R8
5871e3J55j11p0j31Q9L2J40q7J49k64L66k58j61K44P7j6K19m46l9J07j14J53R8
5894G9O9j45J52r8j05J54k6P1j74m72O35J15o6P7J27l62q4Q6J51n9p0pj62Q0J67
5919A33M5q9j82j9J04l1Kk76K29K14Jj47Mr0J07j47O8J97k46K34j6j20J94j10
$$ y = [-191, -113, 65, -184, -12, 213, -79, -68, -75, 207, -80, -156, 66, -96, -42, 21, 150, 128, -70, -17, -29, -19, 107, -60, -43, -83, -156, 272, 106, -58, 89, 10, -117, -266, 30, -91, 32, 51, -157, 94, -118, 43, -71, 63, 38, -38, -124, 45, -59, -97, 81, -26, 24, -107, 98, -181, -70, 115, 51, 82, -49, -286, 164, 66, -240, -198, 163, 20, -65, -199, -5, -173, -60, -127, 29, 60, 179, 206, -36, -135, 131, -58, -157, -22, 141, -63, -165, 198, -83, -330, 28, -71, 329, 63, -87, -91, 180, 42, -10, 239, 91, -29, -228, 50, 277, 31, 24, -130, 32, -216, -57, -102, -49, -37, 336, -151, -53, 102, -9, -79, -210, -121, -89, 51, -36, 113, -151, 215, -43, -204, 40, 117, 101, 320, -126, -165, -58, -172, -19, 79, 148, 3, 155, 57, -48, 106, 80, 151, -23, -495, 140, 255, 189, 266, 393, 31, -53, 33, 184, 125, 55, 48, -114, -34, 133, 178, 89, -93, -112, -8, -39, -37, -313, -84, 130, 131, -16, -12, -102, 5, -142, -74, 123, -123, 111, 95, -25, 169, 59]
5943E9mk60K11k88L01l7K08l92K03j1j18p0R5M00n12R0p2M65n36L31r2k80L99
5966I0o3k29j51K77j52N2K32j25r9J78L0J04J1j89p0K27J45l77K80k11q3J76K
5989E5p7j97L77k06N7J78m33K17L6j02M7j23M2K5l7O4J0j2j81K36J9n2J35j14
6013c6n5J72j23j60K34k82L58P6k2m57J85r1J21K12j53J23L9o8P0j12J53N1l18
6036h3J68q6J6R6P8o7kk89L2K07on0Q1p3o4j32K19k56K29R5k08R0j93K68j67L10
6062B13j14k2r3R7j0J97k00k0m15M94m40L17j58J62J5M4O0j85J08j8K06r0p2j0
6086F6j49j05M17j27k26K58j48j9k4J79j14j9M8K6j50J33p0j40L05l87N30m41
$$ y = [59, 55, -205, 6, -282, 19, -18, 190, -202, 1, -10, -128, -198, -103, 297, -215, -125, -197, 268, -268, 63, -29, -309, 90, 27, -202, -353, -76, -228, -176, 56, -69, -168, 10, 40, 144, 155, -34, -104, 123, 268, -109, 171, -40, -123, 53, 55, -22, -219, 158, -48, 9, 187, -246, -29, 7, -95, -48, -171, -129, -104, -141, -77, -67, -79, -260, -24, -5, -57, 78, -36, -91, 81, -42, -202, 32, -250, 108, 184, 162, -295, -110, -201, -80, 132, -21, 102, 141, 73, 143, 31, 184, 235, -83, 85, -1, 15, 111, 189, 122, 120, -169, -137, 70, 64, 14, 95, 22, -42, -174, 45, -211, 18, 113, -95, -5, -198, 70, -97, 213, 99, 77, -16, 81, 71, 268, 68, 48, -367, 127, -313, 4, -154, 8, 23, 67, 127, -58, 50, 32, 238, 148, 76, 66, -83, -188, 229, 102, -124, 134, -14, -33, -57, 122, 8, -11, 37, 63, -87, 46, -24, -164, 141, -246, 284, -157]
$$ [...]
8191A45
##END NTUPLES=NMR FID
##END=
