##TITLE=1H_DE-54_DCM_KD6
 DMSO-d6
 8 sc, 
 6.5.2024
##JCAMPDX= 6.0         $$ Bruker NMR JCAMP-DX V2.0
##DATA TYPE= NMR FID
##DATA CLASS= NTUPLES
##ORIGIN= UXNMR, Bruker Analytische Messtechnik GmbH
##OWNER= root
$$ XWIN-NMR		Version 3.5
$$ Mon May  6 15:52:39 2024 Russian Standard Time (UT+4h)  she@DPX200
##.OBSERVE FREQUENCY= 200.1309
##.OBSERVE NUCLEUS= ^1H
##.DELAY= (6, 6)
##.ACQUISITION MODE= SIMULTANEOUS
##.ACQUISITION SCHEME= undefined
##.AVERAGES= 8
##.DIGITISER RES= 18
##SPECTROMETER/DATA SYSTEM= spect
##.PULSE SEQUENCE= zg30
##.SOLVENT NAME= CDCl3
##.SHIFT REFERENCE= (INTERNAL, CDCl3, 0, 15.7039)
##AUDIT TRAIL= $$ (NUMBER, WHEN, WHO, WHERE, WHAT)
$$ ##TITLE= Audit trail, XWIN-NMR		Version 3.5
$$ ##JCAMPDX= 5.01
$$ ##ORIGIN= Bruker BioSpin GmbH
$$ ##OWNER= she
$$ F:/spectra/data/she/nmr/H-F/1/audita.txt
$$ ##AUDIT TRAIL=  $$ (NUMBER, WHEN, WHO, WHERE, WHAT)
(   1,<2024-05-06 15:51:33.42 +0400>,<she>,<DPX200>,
      <created by zg, POWCHK disabled, PULCHK disabled
       configuration hash MD5:
       00 E9 B6 7A A2 85 ED C7 34 08 36 98 17 FE 4E 26
       data hash MD5: 16K
       78 27 6E B6 22 31 2E 8D 88 41 E7 CC 3F B9 3E E1>)
$$ ##END=
$$ 
$$ hash MD5
$$ F2 B0 17 38 9F 6C 04 17 F4 6D 58 FF DD B5 AA A7
##$RELAX= 
##$RELAX= 
##$RELAX= 
##$RELAX= 
##$RELAX= 
##$RELAX= 
$$ Bruker specific parameters
$$ --------------------------
##$DU= <F:/spectra>
##$EXPNO= 1
##$NAME= <H-F>
##$PROCNO= 1
##$TYPE= <nmr>
##$USER= <she>
##$AMP= (0..31)
100 100 100 100 100 100 100 100 100 100 100 100 100 100 100 100 100 100 
100 100 100 100 100 100 100 100 100 100 100 100 100 100 
##$AQSEQ= 0
##$AQ_mod= 1
##$AUNM= <au_zg>
##$AUTOPOS= <>
##$BF1= 200.13
##$BF2= 200.13
##$BF3= 200.13
##$BF4= 200.13
##$BF5= 200.13
##$BF6= 200.13
##$BF7= 200.13
##$BF8= 200.13
##$BYTORDA= 1
##$CFDGTYP= 0
##$CFRGTYP= 5
##$CHEMSTR= <none>
##$CNST= (0..31)
1 1 145 1 1 1 1 1 1 1 1 1 1 1 1 1 1 1 1 1 1 1 1 1 1 1 1 1 1 1 1 1 
##$CPDPRG= <>
##$CPDPRG1= <>
##$CPDPRG2= <>
##$CPDPRG3= <>
##$CPDPRG4= <mlev>
##$CPDPRG5= <mlev>
##$CPDPRG6= <mlev>
##$CPDPRG7= <mlev>
##$CPDPRG8= <mlev>
##$CPDPRGB= <>
##$CPDPRGT= <>
##$D= (0..31)
0 1.2 0 0 0 0 0 0 0 0.06 0 0.03 0 0 0 0 0.0002 0 0 0 0 0 0 0 0 0 0 0 0 
0 0 0 
##$DATE= 1714996292
##$DBL= (0..7)
120 120 120 120 120 120 120 120 
##$DBP= (0..7)
150 150 150 150 150 150 150 150 
##$DBP07= 0
##$DBPNAM0= <>
##$DBPNAM1= <>
##$DBPNAM2= <>
##$DBPNAM3= <>
##$DBPNAM4= <>
##$DBPNAM5= <>
##$DBPNAM6= <>
##$DBPNAM7= <>
##$DBPOAL= (0..7)
0.5 0.5 0.5 0.5 0.5 0.5 0.5 0.5 
##$DBPOFFS= (0..7)
0 0 0 0 0 0 0 0 
##$DE= 6
##$DECBNUC= <off>
##$DECIM= 32
##$DECNUC= <off>
##$DECSTAT= 4
##$DIGMOD= 1
##$DIGTYP= 9
##$DL= (0..7)
0 120 120 120 120 120 120 120 
##$DP= (0..7)
150 150 150 150 150 150 150 150 
##$DP07= 0
##$DPNAME0= <>
##$DPNAME1= <>
##$DPNAME2= <>
##$DPNAME3= <>
##$DPNAME4= <>
##$DPNAME5= <>
##$DPNAME6= <>
##$DPNAME7= <>
##$DPOAL= (0..7)
0.5 0.5 0.5 0.5 0.5 0.5 0.5 0.5 
##$DPOFFS= (0..7)
0 0 0 0 0 0 0 0 
##$DQDMODE= 0
##$DR= 18
##$DS= 0
##$DSLIST= <SSSSSSSSSSSSSSS>
$$ [...]
##$SUBNAM2= <"">
##$SUBNAM3= <"">
##$SUBNAM4= <"">
##$SUBNAM5= <"">
##$SUBNAM6= <"">
##$SUBNAM7= <"">
##$SUBNAM8= <"">
##$SUBNAM9= <"">
##$SW= 18.0517689322627
##$SWIBOX= (0..15)
0 0 2 0 0 0 0 0 0 0 0 0 0 0 0 0 
##$SW_h= 3612.71676300578
##$TD= 16384
##$TD0= 1
##$TE= 0
##$TE2= 300
##$TE3= 300
##$TEG= 300
##$TL= (0..7)
0 120 120 120 120 120 120 120 
##$TP= (0..7)
150 150 150 150 150 150 150 150 
##$TP07= 0
##$TPNAME0= <>
##$TPNAME1= <>
##$TPNAME2= <>
##$TPNAME3= <>
##$TPNAME4= <>
##$TPNAME5= <>
##$TPNAME6= <>
##$TPNAME7= <>
##$TPOAL= (0..7)
0.5 0.5 0.5 0.5 0.5 0.5 0.5 0.5 
##$TPOFFS= (0..7)
0 0 0 0 0 0 0 0 
##$TUNHIN= 0
##$TUNHOUT= 0
##$TUNXOUT= 0
##$USERA1= <user>
##$USERA2= <user>
##$USERA3= <user>
##$USERA4= <user>
##$USERA5= <user>
##$V9= 5
##$VALIST= <valist>
##$VCLIST= <CCCCCCCCCCCCCCC>
##$VD= 0
##$VDLIST= <DDDDDDDDDDDDDDD>
##$VPLIST= <PPPPPPPPPPPPPPP>
##$VTLIST= <TTTTTTTTTTTTTTT>
##$WBST= 1024
##$WBSW= 4
##$XGAIN= (0..3)
0 0 0 0 
##$XL= 0
##$YL= 0
##$YMAX_a= 114611
##$YMIN_a= -161359
##$ZGOPTNS= <>
##$ZL1= 120
##$ZL2= 120
##$ZL3= 120
##$ZL4= 120
##$ABSF1= 10
##$ABSF2= 0
##$ABSG= 5
##$ABSL= 3
##$ALPHA= 0
##$AQORDER= 0
##$ASSFAC= 0
##$ASSFACI= 0
##$ASSFACX= 0
##$ASSWID= 0
##$AUNMP= <proc_1d>
##$AZFE= 0.1
##$AZFW= 0.1
##$BCFW= 1
##$BC_mod= 2
##$BYTORDP= 1
##$COROFFS= 0
##$CY= 11.3945322036743
##$DATMOD= 1
##$DC= 2
##$DFILT= <>
##$DTYPP= 0
##$F1P= 15.6554695791079
##$F2P= 12.8336369535428
##$FCOR= 0.5
##$FTSIZE= 0
##$FT_mod= 4
##$GAMMA= 1
##$GB= 0.15
##$INTBC= 1
##$INTSCL= 1
##$ISEN= 128
##$LB= 0.24
##$LEV0= 0
##$LPBIN= 0
##$MAXI= 10000
##$MC2= 0
##$MEAN= 0
##$ME_mod= 0
##$MI= 1.114404
##$NCOEF= 0
##$NC_proc= 0
##$NLEV= 6
##$NOISF1= 3.799351
##$NOISF2= 2.8
##$NSP= 1
##$NTH_PI= 0
##$NZP= 0
##$OFFSET= 15.70392
##$PC= 1
##$PHC0= -25301.85
##$PHC1= 12.58749
##$PH_mod= 1
##$PKNL= yes
##$PPARMOD= 0
##$PSCAL= 0
##$PSIGN= 0
##$REVERSE= no
##$SF= 200.130013532006
##$SI= 16384
##$SIGF1= 3
##$SIGF2= 2
##$SINO= 400
##$SIOLD= 16384
##$SREGLST= <1H.CDCl3>
##$SSB= 0
##$STSI= 0
##$STSR= 0
##$SW_p= 3612.71676300578
##$SYMM= 0
##$S_DEV= 0
##$TDeff= 0
##$TDoff= 0
##$TI= <>
##$TILT= no
##$TM1= 0
##$TM2= 0
##$TOPLEV= 0
##$USERP1= <user>
##$USERP2= <user>
##$USERP3= <user>
##$USERP4= <user>
##$USERP5= <user>
##$WDW= 1
##$XDIM= 8192
##$YMAX_p= 0
##$YMIN_p= 0
$$ End of Bruker specific parameters
$$ ---------------------------------
##NTUPLES= NMR FID
##VAR_NAME=  TIME,          FID/REAL,        FID/IMAG
##SYMBOL=    X,             R,               I
##VAR_TYPE=  INDEPENDENT,   DEPENDENT,       DEPENDENT
##VAR_FORM=  AFFN,          ASDF,            ASDF
##VAR_DIM=   8192,          8192,            8192
##UNITS=     SECONDS,       ARBITRARY UNITS, ARBITRARY UNITS
##FACTOR=    0.0002768,     1,               1
##FIRST=     0,             0,               0
##LAST=      2.2672688,     0,               0
##MIN=       0,             -161359,         0
##MAX=       2.2672688,     114611,          0
$$ Real data points
##PAGE= N=1
##DATA TABLE= (X++(R..R)), XYDATA
$$ [...]
1877b55K99M0k17K11m37K79J26k40oQ5r2L39n6M5k83J30J14m98M94R6j43n2R2
1900G1k57K80j40K47Q0m39OJ32k2k45L59j24K42j38p9P8N2l39K14r4K39j53M9
1923A9n3K01k79N2K01j33K75l56k09L36L7q7o3J02j13J54r0R3K5q8q4r6K81q7
1947C8R4p0j74n6k9P1J84m25K91J93k7j24o3m1M9L4J4P3r0L4p0J7OJ67m6k60O4
1974a46O2k10K82J48j95J48k90K71r7j91J27P3j00K67k91K89n6k14K09n8k06P7
1996a01J00j78j3Q2J43k30K93p0j76l1K0M37j95j21R9P2j87j18L35p5k67J59j9
2019d1P2l61L71N7J9j97K6P7J22l25J94j68L33k09R2J00o4j04j0k7J87j99J94
2042A39l33N3K11k37J06J27J01j57K4j12J14P3M1l13K09j9p1Q1j08J45J8K34l00
$$ plain form
1877 -255 44 84 -133 78 -359 -80 46 -194 -200 -115 -207 132 76 121 -162 -32 82 -416 78 174 31 -21 71
1900 71 -186 94 -46 201 281 -158 -152 -20 -42 -287 72 -52 190 52 -27 51 103 -236 -22 -116 123 -30 19
1923 19 -34 167 -112 -60 141 8 283 -73 -282 54 91 4 -59 43 -70 84 -6 87 112 24 -60 -156 125 38
1947 38 132 62 -112 -168 -197 -126 58 -367 -76 117 90 -34 -97 -138 -89 -55 -41 32 -58 -24 -94 -77 -71 96 50 -210 -146
1974 -146 -84 -294 -12 136 -59 89 -201 70 -27 -218 -91 -18 -118 149 -142 147 91 -123 86 28 -178 -101
1996 -101 -1 -179 -192 -110 33 -197 96 26 -150 -181 -161 276 81 -40 59 131 -56 -174 161 86 -181 -22 -41
2019 -41 31 -330 41 98 117 -80 -54 23 145 -180 14 -154 179 -30 62 162 98 -6 -16 -43 144 -55 139
2042 139 -194 -141 70 -167 -61 66 167 10 34 -78 36 109 150 -163 46 27 -44 37 -71 74 92 326 26
2065B6o2K43l46P2N1r5J13J96k1k35l9l0M79k45j00J5J93k58j19K42k0k38L62
2088A84l79J45R3j75L13m22K38p9J55J24m5j52K62j11m1j75J50K3n2L2r0L25m27
2111a04J29Jq3J25M0k56J1K12k13J18M07m22J08O3o9L7j71M0K55m21K59m6K06
2134B26p3J2m8p9J28p1k22J01K19j05q0M8L3k80K40p1N7r0k9J80l10J32R3j37
2158a26L17k84p2L28j28M6k10P4J98k11J25j29K75j97j95J1L9J82k80N4K98KJ30
2181B47m3j21RR9m06N5l7J25M2K48n8l2r4k79J85N6k54K93p9o6j19K00J6r9J99
2206H7j1j78J72p9L3k6j13K06l62K69Q0l32K02J28J30j10k63M79n50M10j4j94
2228c6q3j06L32j12j13o9j81K20J07k6M9m7k6j5M12n06J97J21Q7Q2k95J61n9k11
$$ plain form
2065 26 -36 207 -139 -67 -16 -111 2 198 177 -58 -97 -127 352 107 7 22 215 -43 -162 80 60 -178 184
2088 184 -195 -50 43 -132 181 -241 -3 -82 73 197 152 0 262 151 110 -65 85 108 56 88 -2 323 -104
2111 -104 25 26 -57 68 108 -148 -137 75 -138 -20 387 -35 73 136 67 104 -67 -27 228 -193 66 20 226
2134 226 153 165 117 38 166 95 -127 -26 193 88 8 56 89 -191 49 -22 35 -55 -84 96 -214 -82 11 -126
2158 -126 191 -93 -165 163 35 81 -129 -55 143 -68 57 -72 203 6 -189 -178 -139 43 -237 -183 115 117 247
2181 247 204 83 92 191 -215 -160 -197 -72 -30 218 160 128 34 -245 -60 -4 -258 35 -44 -110 -229 -29 -13 -112 87
2206 87 76 -102 70 -9 24 -2 -115 91 -271 -2 78 -254 -52 76 206 96 -167 312 -238 172 158 -36
2228 -36 -119 -225 107 -5 -118 -187 -368 -148 -41 -67 -18 -65 -91 -106 306 -200 -3 118 205 287 -8 153 94 -117
2252a17q4J96M7P2j70L4K78k79j60K84J4J65l10N0J48j45M3m6k14M17k07Pp6o5
2276a18J52J57j93O7J1l3j14K13o9M2J17l40L2K27J73l79o4r6J46J28j6k5j02
2299h4k19N00k77K44k75o0K82q7OL0p3q7K93j25O6r6J23j02k4p8j16M80k15j7
2323H9P9l29J95K22k57n8J70j36JJ9K41j75j62jJ44J5j49Q6J16m1q2J19j85j9
2347i8L13k72J36J18j06Nj19K67j71j39J22j85K34k15r7J78O6j33k28L13k39R8
2369a52L24k68q6K1J4q1J64N2K73j4l02J41l30M79k72j19J74rJ09Q3k98P9j55
2392a73L65k20K50j87l7q7K0K7q2j82L35j39l6J51l2Q3Q4k80K16J51j47k5J06
2415A61O4j01k54K53j9r2M9o2K12K1l90J0J58k42O6L57k55K06o9k03J19j32K69
$$ plain form
2252 -117 -201 -5 42 114 -56 -22 256 -23 -183 101 115 280 -30 20 168 23 66 20 -194 223 16 23 -53 -118
2276 -118 34 191 -2 65 76 43 -71 142 73 115 232 -108 -76 151 324 -55 -119 -215 -69 59 43 18 -84
2299 -84 -303 197 -80 164 -111 -171 111 24 30 60 -13 -100 193 68 134 38 161 59 35 -43 -159 321 106 89
2323 89 168 -161 34 256 -1 -59 111 -25 -24 -5 236 61 -101 -102 42 57 -92 -6 110 69 -13 106 -79 -98
2347 -98 215 -57 79 197 91 96 -23 244 73 -66 56 -129 105 -110 -207 -29 37 -96 -324 -11 -250 -152
2369 -152 172 -96 -182 -161 -147 -228 -64 -12 261 247 -55 86 -244 235 -37 -156 18 9 118 201 -97 -18 -173
2392 -173 192 -28 222 35 -2 -89 -69 -42 -124 -306 29 -110 -146 5 -27 56 140 -140 76 227 80 55 161
2415 161 225 124 -130 123 104 12 61 -1 211 232 -158 -148 10 -232 -166 191 -64 142 73 -130 -11 -143 126
2438A26j43j08K88n4J3m5k3o2j9j11M57n14L50k52q4Q4QL93l24r9J76p7P0o0m3
2463e3Q1k10N8rk50N11L85q20O3J71M3o0l1K02K3k30L06j43n2j2J43j46J23%J
2488I4R1Rj36k43L71j16J78k75j36M15m10K32n4O8j04L9m0PJ5Q8j61L0J46k36
2512a28R5K40r5l60M32k22j67L64j94qJ68j6K8n3R1k49J95m6j55J3R4Jj15J05
2536A8o3R8Kk3o1K27l14K47Lj15j41J34J15n3k35J29jp8K03l86M69k76K18N7m24
2561b50R4J69Rj48K48j46J21j04J63o3n52N45nj59J7J32J78m16K78Q6K68o45K97
2584A17q1J39k38k42M12j98Q6J7l6J06l57J0M08j97l1J39K1o1q4J70j72j83L16
2607F1J36n23J53J05M9L77j81j19L6K35m04r7M25k24r8M5J6Q2o7j1rm8R2j37j63
$$ plain form
2438 126 -17 -125 163 109 122 77 54 -8 -27 -138 319 -195 155 -97 -181 -97 -89 304 -20 -119 57 -20 50 -10 -53
2463 -53 28 -182 -124 -133 -383 128 513 -307 -244 -73 -30 -90 -121 81 104 -126 180 37 -15 -27 116 -30 93 93 94
2488 94 185 194 58 -185 186 70 248 -27 -163 252 -158 74 20 88 -16 23 -17 -10 5 93 -68 -38 108 -128
2512 -128 -33 207 112 -248 184 -38 -205 159 -35 -43 125 109 137 84 175 -74 121 75 -80 -67 27 28 -87 18
2536 18 -45 53 55 32 -29 198 -116 131 134 19 -122 12 127 74 -161 -32 -33 -111 92 -294 175 -101 117 174 -250
2561 -250 -156 13 22 -126 122 -24 97 -7 156 93 -459 86 81 -78 -61 71 249 -167 111 197 465 -180 117
2584 117 36 175 -63 -305 107 -91 -5 12 -24 82 -275 -265 143 -54 -85 54 75 14 -70 100 -72 -255 61
2607 61 197 -326 -173 -68 -19 358 177 58 94 329 -75 -172 253 29 -69 -24 -8 74 7 -4 -13 -61 31 -106 -269
2632b69K15k11L17m1J22j76k15J83N6L6pO8k39Q3K49O8k80K66k97K7k7p4J28P5
2656E7j40J58j68J42j72J83j07j8R1p0O1k11Q1k1K22J43k26o1Q7k00J5n4N0l5
2680a93J77j84R9L00k6j71p7K34j58q4j2n4K85j51M7L0j42N6n1Q7R3k15K07j87
2704i0jj6Q0k72L06o0K05m9j37l3O9j7k1q3J62M2r7J41l24L21j71K94n07J37q2
2729b03K81J6J6N1l27J41R2J78k24J66k64J40k2j05k4J74k71K99n7P9P4o6k58
2752a14m6L42k42K9p9K83j53J28r1j07j72K83k59Q3R7k90j6L81j5p3J67n08L48
2775b4J03j17L2K37l12J77k3j2J9l89M03J43L2k79l0J1p8M9L51m58J78K26j73
2798F6j1p7J23O8k90J41m7J12j7J46k57Q5K15j37m25L7J38M0J69j38L83m44J79
$$ plain form
2632 -269 -54 -265 52 11 133 -43 -258 -75 -19 17 10 78 -161 -78 171 239 -41 225 -72 -45 -72 -146 -18 57
2656 57 -83 75 -93 49 -123 60 -47 -65 26 -44 17 -194 -113 -134 88 231 5 -56 31 -169 -154 -208 -158 -193
2680 -193 -16 -200 -101 199 173 2 -75 159 1 -83 -95 -149 136 -15 32 62 -80 -24 -75 12 105 -110 97 -90
2704 -90 -91 -107 -27 -299 7 -53 152 103 -34 -67 2 -15 -36 -119 43 85 -12 129 -195 126 -45 249 -258 -121 -203
2729 -203 78 94 110 161 -166 -25 67 245 21 187 -77 63 41 -64 -88 86 -185 114 57 136 210 144 -114
2752 -114 -160 182 -60 -31 -110 173 20 148 57 -50 -222 61 -198 -115 -18 -308 -324 57 42 -31 136 -372 -24
2775 -24 79 -38 -6 231 -81 96 73 61 80 -309 94 237 269 -10 -40 -29 -107 -58 293 -165 13 239 66
2798 66 55 -22 101 169 -121 20 -27 85 68 214 -43 42 257 120 -305 -268 -130 -90 79 -59 324 -120 59
2821E9q9PM8J02o3k43L45J09j05j85L12j09n54L52K20k37o4Q6m2N8l81L66M8k13
2845a73K47Q7k75J65o7j03L78k06N3j39Q8j73J33j05L03l26J25K04k24j11L71
2866B52j47k82n8K76N0l29L15k27K93p8K70k48J5o3k91k3K91m2J28J03l80r9L59
2889H5j85K05r5j08J56K7o9j54L53k98R9j23K80o8j97p8M3L83k05j77K18o1Kj09
2913g6N8L47k84M8k30L41j64J12l48K12k37R9M9o5J96q8M6J34k57J35K70j63l4
2936A01O3q8k56J12J34j85J77j75K06l08K35l00J80K82j92O8J0j92R2J01l10J52
2958i3K22k95Q4J05j7q6N9M5j18K57P8j73k74K59J34l15K46l58m9M74k35o4K34
2981A20Nl54K43J54k04j39J15J07j13K47k11o1oo4%P8L1l4L39j43j39L98l85l2
$$ plain form
2821 59 -30 -23 25 127 64 -179 166 275 170 -15 297 188 -366 -14 206 -31 -95 -9 -51 7 -374 -8 40 -173
2845 -173 74 161 -114 51 -16 -119 259 53 106 -33 55 -118 15 -90 213 -113 12 216 -8 -119 252
2866 252 105 -177 -235 41 91 -238 77 -150 143 65 335 87 102 39 -252 -275 16 -26 102 205 -175 -274 85
2889 85 -100 105 10 -98 58 85 16 -138 215 -83 16 -107 173 105 -92 -170 -127 256 51 -126 92 31 33 -76
2913 -76 -18 329 45 93 -137 204 40 152 -196 16 -221 -122 -73 -138 58 -30 16 150 -107 28 298 135 101
2936 101 164 76 -180 -68 66 -119 58 -117 89 -219 16 -284 -104 178 -14 54 64 -128 -36 65 -245 -93
2958 -93 129 -166 -82 23 6 -80 -21 24 -94 163 241 68 -206 53 187 -128 118 -240 -289 185 -50 -114 120
2981 120 125 -229 14 168 -36 -175 -60 47 -66 181 -30 -91 -97 -161 -161 -83 -52 -86 253 110 -29 369 -16 -48
3005d8j60K54j60K39J5q4j21J62o6k71J12Q4M1l36L78j63Q6j2J40j29o6K86M9
3028B30m81J54J49Q2j14N0l5R7j66J54L6j55o0J93K8K49l00j47j64K03k00P3M
3051a20J52r0K27J11j59O9p0l28J07K04k00J91J08k48j10K6M3L39j14O5j02k4
3073G7j49J25j30J92M1k65R9O6j18K17L6j27o2%q2J66o0K50k79j61j93K34K64
3096A41k5o3k24J36O6p6P9p2K19k17j93K76j6J35j23J47l03k33L72L34m47K1J12
3119D6k33j2M50k89J03K22j88k11Q8q0J5J85M2j99J32l12K23j26m7J94J76j34
3141D5Q2j55R2j37j12K7O8L22k57K92j63q1p4M1k36J13Rj28L88r3r9Rj30K97K2
3166A42l28K3M9K60k10L4K2j29N8K61j43Nj75K17j8N8P1j32k55J39K95l08J95
$$ plain form
3005 -48 -208 46 -114 125 140 56 -65 97 31 -240 -128 -44 -3 -339 39 -124 -38 -50 90 -39 -105 181 230
3028 230 -251 -97 52 134 20 70 35 132 -34 120 156 1 -59 134 162 411 111 -36 -200 3 -197 -124 -120
3051 -120 32 -58 169 280 121 190 120 -208 -101 103 -97 94 202 -46 -156 -130 -87 252 138 203 101 77
3073 77 -72 53 -77 115 156 -109 -10 56 -62 155 191 64 2 2 -80 86 26 276 -3 -164 -357 -123 141
3096 141 116 53 -171 -35 31 -45 34 -38 181 -36 -229 47 31 166 43 190 -113 -346 26 360 -87 -66 46
3119 46 -187 -199 251 -38 65 287 99 -112 -24 -104 -89 96 138 -61 71 -241 -18 -144 -191 3 179 45
3141 45 127 -28 64 -73 -185 -158 -90 232 -25 267 104 23 -51 -10 -246 -133 -124 -252 136 43 -56 -47 -177 120 142
3166 142 -186 -163 -114 146 -64 -30 -8 -137 -79 182 39 44 -131 86 68 126 197 65 -190 -51 244 -64 131
3189A31K4q7k10J01O4n2M9o2m6Oj44K58R2K1m7J42l18K63k45R8K5r8K38j61q1
3214c9k24O43n49J13o4J73R3j1m02K39QJ4q4L75j83k6Qj9j49L9l7J61L3J41k27
3239B6k85K45q6l10N36o6l3q7q1N4K4J96m20O41k69q1k02K01j70J27j1O1r0J34
3263E4oj64K35j15J50j89k75K75k1L04j02k47N0m6J7p5J35j43K09k47p6L35M3
3286A01J13M6l38mk76N89j78j10j04rR9O5m3l6K58o9l24L25j11l56P42m52j31
3309b03Q9KK0K37r0j90M53k37j35l8K12K82m77L7M68m52qK11k25K24j56k58L84
3332A50q1L2P3p2j04j16P8J59k67J75N2J3j90K25R1l90L08k51J12j04O4j80M6
3355a77J66K79k43J01k00J36J13k20K9N3K0qk38K28j40L3O1K0l27M97k05l2n6
$$ plain form
3189 131 155 68 -142 -41 23 -29 20 -42 -88 -82 -226 32 124 145 98 240 -78 185 -60 38 63 -35 203 42 -39
3214 -39 -263 380 -169 -56 -120 53 146 135 -267 -28 -20 -6 -90 285 102 76 84 65 -84 -45 -82 79 112 253 26
3239 26 -259 -14 -100 -410 126 60 27 -60 -141 -87 -63 133 -287 354 85 4 -198 3 -167 -40 -51 10 -80 54
3263 54 48 -116 119 4 154 -35 -310 -35 -56 248 146 -101 -51 -97 -80 -155 -20 -163 46 -201 -277 58 101
3286 101 214 260 -78 -82 -358 231 53 -57 -161 -170 -71 -6 -49 -85 173 104 -220 105 -6 -362 380 -72 -203
3309 -203 -114 -112 -92 145 55 -135 318 81 -54 -92 120 402 -75 -38 430 -22 -30 181 -44 180 24 -234 150
3332 150 69 101 174 102 -2 -118 -40 119 -148 27 79 92 -98 127 218 -172 136 -115 -3 -107 -43 -223 -177
3355 -177 -11 268 25 126 -74 62 175 -45 -16 37 57 49 -189 39 -101 -68 -7 13 -314 183 -22 -54 -110
3378a10J11J71r6m1j07L12l36K74k55KN3n8j71M20k1j55j48L5J04j16J02J24O7
3401A61p0k66K02j63J13j14K24oPj8J9k06K43L6q2r2J34k57M02k94J54O9k21J08
3425H3Lk80J06J56K86k86q1j41j30K13l1P4M4m2L27n98M17o5Q4l26K22Lj36K11
3449A13j96K09q0r2J53j50K07k16rO6J25P3j8k50J12j06J81j61k5K61j67k90L56
3472I6N3k19Q3j55K52j76j92L15r5k16J98j03K06J00k18J14O0k83J08l8K18j26
3494a8K58j04q6j80J67j87K59m69L58l04M11J07j15J45k27J14k16M03j77l91N0
3515b02k2L23j3k92M55o8k82J70j14J94j15K0Qj74K54q6j69K08j76N0J9l6N6j21
3539a13J66J17k66P7m2M9j00K79j86J21K5j60q3M8K42k04J30j84L3J55j52K5m9
$$ plain form
3378 -110 1 172 76 35 -72 240 -96 178 -77 -75 -22 -80 -251 169 148 -7 -155 -120 -16 -132 -30 94 161
3401 161 91 -175 27 -136 -23 -137 87 81 88 70 89 -117 126 162 80 -12 122 -135 267 -27 127 196 -25 83
3425 83 86 -194 -88 68 354 68 -13 -154 -284 -71 -102 -28 16 -26 301 -297 120 55 139 -187 35 38 -98 113
3449 113 -83 126 46 -46 107 -43 164 -52 -61 5 130 203 185 -65 47 -59 122 -39 -64 197 30 -260 96
3472 96 149 -70 13 -142 110 -66 -258 57 -38 -254 -56 -159 47 147 -71 43 103 -180 -72 -110 108 -18
3494 -18 240 136 50 -130 37 -150 109 -360 -2 -306 105 212 97 242 15 129 -87 316 139 -252 -202
3515 -202 -224 99 86 -206 249 181 -101 69 -45 149 34 54 62 -112 142 56 -113 95 -81 -31 -12 -48 8 -113
3539 -113 53 170 -96 -19 -61 -12 -112 167 -19 102 127 -33 -116 -68 174 -30 100 -84 -51 104 -48 -23 -72
3562g2r9J55K66k81k01R6J84Q9j75J82Q4k07K1q6K03j12R8j56m8NJ72l1M6q6j03
3587e6M4N3j82L06l33K6J69j56J49J36k38Q9j62J19J10M0j3k01N7j69J66j13N8
3610a01R3P6Rq9P1l2L6K01m25K08o7O4K63k70J64L8j45j06k4Q4k11k9P9P5J04
3635F6K17l63mn7K69r9K35l54J4O2R3L8K6k00J1P2K07k85m8K37k07J3LJ55m37
3660c36J85K16p1k72K9L22R2l70K62M2k46J1K22J5q7J47l35J57J54j06p3n2J17
3683B3r6p1J12OQ9N5k84K91p5J12j91R2k33J89j40K81j87Q2m3k12o4K79P2l39
3707b52L75j68J40j73j05N1K21k87L60J20l50Q4o4n7j06K72n9n9Q2J63j88K0p5
3730e5lL09m5l57L49j30k57J2J01K4J44kj31Q4j36R2J07m7q9r3L29l41J02j52
$$ plain form
3562 -72 -171 -16 250 -31 -232 -136 48 137 -38 144 228 21 42 -44 159 47 145 -11 -59 -54 118 87 133 47 -56
3587 -56 -12 41 -141 165 -168 -142 27 -129 20 156 -82 7 -155 -36 74 114 101 -100 -43 -212 -46 -159 -101
3610 -101 -8 68 77 -12 59 27 63 264 -161 47 -20 44 307 37 201 239 94 -12 -36 48 -163 -192 -113 -38 66
3635 66 283 -80 -84 -141 128 29 264 -90 -76 -14 79 117 143 -57 -46 26 233 -52 -100 137 -70 -57 -54 101 -336
3660 -336 -151 65 -6 -278 -249 73 165 -205 57 99 -147 -136 86 101 14 161 -174 -17 137 31 -42 -94 23
3683 23 -73 -144 -32 -26 63 118 -166 125 50 162 -29 63 -170 19 -121 160 -27 55 12 -200 -264 15 87 -252
3707 -252 123 -45 95 -78 -183 -132 89 -198 162 282 -68 16 -48 -105 -211 61 2 -57 25 188 0 20 -55
3730 -55 -58 251 206 -151 198 68 -189 -177 -76 -52 92 90 -41 43 -93 -1 106 59 -30 -123 206 -135 -33 -185
3754a85K96Q5j59r7J6J55k61L09k01J78j00K52l79j9M60m85k07K24J12l0L3K54
3776B51k13o6J20%J4j52J06j91m8J06J52J39n8J13m88L60p0%q3l8K10j61K08k6
3800A85J82l15K51m26p2L55k46NK0K3J3P7j85pK46l27K05o2J61j5j70K8R7j38
3824a15K9p0K15j98K69l81J95J77m2L66l46j20L19j80l08J91o9P7l6n1J13q1R7
3847E1J10k15K74k90J6J51k38J02n8rj9L9J14k9j84J37O2o9J84j43J52k22M2R2
3871E0P3j33L9j42K41k27N5O2o8Q8k74K73k24J00J21q0O0J44q0m7j12K32M0k92
3895a01j49Q5J22J74k49K64j40O2r9J48j95p5J66O1j35k4k66L25j4J76L2m74L10
3918Dj18J3J33N40p50K55O6k00J32k90J18K4J65p7L6l7R9k98K62j24m8P1J56K06
$$ plain form
3754 -185 111 196 37 -60 -44 111 -150 159 -42 136 36 288 -91 -110 350 -135 -342 -118 -6 -36 -3 251
3776 251 38 -28 92 92 106 -46 60 -131 -179 -73 79 218 160 273 -215 145 75 75 -8 -46 164 3 211 185
3800 185 367 52 303 -123 -195 160 -86 -81 -61 -38 -25 52 -133 -140 106 -221 -16 -78 83 68 -102 -74 23 -115
3824 -115 -86 -156 59 -139 130 -251 -56 121 79 445 99 -21 298 118 -190 1 -68 9 -27 -78 35 -46 51
3847 51 161 -54 220 -70 -54 97 -141 -39 -97 -106 -125 -86 28 -1 -185 -48 14 -55 129 -14 138 -84 -42 50
3871 50 123 -10 29 -113 128 -99 -44 18 -50 38 -236 37 -187 -87 34 -46 14 158 78 31 -81 151 191 -101
3895 -101 -250 -165 -43 131 -118 146 6 68 -31 117 -78 -153 13 74 -61 -85 -351 -26 -40 136 168 -306 4
3918 4 -114 -101 32 572 -178 77 143 -57 75 -215 -97 -73 92 15 51 14 113 -185 77 -47 -95 -24 132 338
3942C38j74k03r0K53l22J53m7j09Q4M2J74j68n9M2K35k33J78j84J18J72j60l8
3964Bj71j7M08j98O5Pl6K6o1lJ17j58Q5q9j56M53j83k72N1jk2L94k03L2P5j68
3990b3j8K64r7K41l90j41K84l00J76j63K34r1j39M35k24J4j54L26m38K71n77N52
4012D2O4O6k28LK94l88L2J69J07p8m73L95j00J33j14k59K02mJ14O6j64J68k51
4035b04L52j59R2l61L2K46j10q9J40N7m8O3k24K44J84m12J87j48K82p6j85K57
4057A20j85J10p5J1R9l6J05k22J22l22L63Ok76M25m15N5N2J79o8M5j20oq1m5N4
4082a05K14p1k4l6J43k06l2J68k33rL13q5j06nJ40n2j87L31k14M5j58K06K72n00
4106a91J96k53K18K1j0j08J67m0O2p8j24J62K20k37Qp6L39l05qK68m27L20k82
$$ plain form
3942 338 164 -39 -129 124 -198 -45 -92 -201 -117 -75 99 -69 -128 -86 149 -84 94 -90 28 200 40 2
3964 2 -169 -186 222 24 89 96 60 86 25 22 139 -19 66 -23 -179 274 91 -181 -130 -131 -153 241 38 70 145 -23
3990 -23 -41 223 126 367 -23 -164 120 -180 -4 -167 67 -24 -163 272 48 62 -92 234 -204 67 -510 42
4012 42 106 172 -56 -53 241 -147 -115 54 161 83 -390 5 -95 38 -76 -335 -133 -137 -23 43 -121 47 -204
4035 -204 148 -11 81 -280 -248 -2 -112 -201 -61 -4 -52 11 -213 31 215 -197 -10 -158 124 48 -137 120
4057 120 -65 45 -30 -19 80 44 149 -73 49 -273 90 96 -180 245 -170 -115 -63 116 48 93 -27 -33 -114 -159 -105
4082 -105 109 38 14 -22 121 -85 -117 51 -182 -191 122 37 -69 -74 66 14 -173 158 -56 -11 -169 37 309 -191
4106 -191 5 -248 -30 -9 -19 -127 40 0 62 -16 -140 22 242 5 13 -63 276 -29 -37 231 -196 124 -158
4129a58J5K36k10K56k20K07o4K25k47p7J97j69l1k04J45j3K37q3K76k05r4l7J10
4152I2k77O4J32P0k1m8J08O9j70o9K51k27%Q3Q2P3j38r1Q7j49J57k06J9L26k27
4177a0k39K55o1J4n6J01j14M8p5J94j5p0kk02M49n8k28J00J25k06j23K58q9j61
4201a65R9k0K00k53j12L91J5j09J29m39P1J15L3j0j12M2J45k8p2n4K07J77m10
4224a60K98J6l22K66j17k04N8J99L9L8l09K15l1j19L2J08l05N16m05J68J66m16
4246b69o2N39j22j75M4m7L15m6j01l0k6k92M05r6O1n22M96k07J54r9O9m6L64n01
4270a94j69O47k31l3j12Q7M3p7M7j3J61m7k5m0j8j03K22o5j94j77K19K12j59J58
4294A39q3j42j52K22j46K9J61k94r2K80M8n2K90p8j51O5NK8j61j5MM0K76l12O1
$$ plain form
4129 -158 -143 93 -117 139 -81 126 62 287 40 -37 160 -9 -40 -244 -99 -112 125 42 318 113 19 -18 92
4152 92 -185 -121 11 81 60 12 120 189 19 -50 201 -26 -26 57 139 212 74 -17 70 -79 78 -128 -109 217 -10
4177 -10 -249 6 -55 -41 -97 4 -110 -62 -137 57 42 -28 -30 -232 217 159 -69 31 156 -50 -173 85 -4 -165
4201 -165 -66 -86 114 -139 -251 140 155 46 175 -264 -193 -78 -45 -55 -167 -125 20 -8 -80 -134 73 250 -160
4224 -160 138 154 -168 98 -19 -223 -165 34 73 111 -198 17 -14 -133 -101 7 -298 218 -187 -19 147 -269
4246 -269 -331 208 86 -89 -45 -92 223 177 76 46 20 -272 133 37 98 -424 72 -135 19 -80 -11 -57 307 -194
4270 -194 -363 284 53 20 -92 -5 38 -39 8 -5 156 109 84 44 26 -77 145 80 -114 -291 -72 140 -19 139
4294 139 56 -86 -238 -16 -162 -133 28 -266 -358 -78 -30 -82 208 130 -21 44 49 77 -84 -99 -95 -55 221 -91 -30
4319c0j84M79k48J94k18j6l2k11J08K08k77L19j27n0K18J25n06L06J7k97J21l9
4341a40K16P0k23J05j79J75nP2j28k03L24J04j77l8J39j78j09J22L2P2o9j25M0
4364a03J30K19j93O4j22L1J07n3k74L30K8j71k67L51j13M7J80m01K19l95L16m4
4386a14K51j18k8k21M33j08N8k99J1P8K06j70J37j23j45J8n5MJ26j28M34j31k68
4409a52j1N25n56K49J53k25j4O7j72P6L75k31K3m0o4qR7K5N7j47qn0J41l69N03
4434B44l24M4k52K89j45l29L56k1RJ12j0K74k25K3J6j5j4L8q4n8M75m06j13N5
4458f1m8K01j34J69j37Kj56O1m7K79k41L14j31k35J21Ko0p4M09k94M3l06M05j11
4482b9q0K97k40k55J45J16j52K58JL8l94J17M9p0K73jN0n2k04K69k52j15J68Q4
$$ plain form
4319 -30 -214 265 17 211 -7 -23 -55 -266 -158 50 -227 92 -35 -85 133 258 -248 58 75 -222 -101 -140
4341 -140 76 146 -77 28 -151 24 19 91 -37 -240 84 188 11 -27 112 -66 -175 -53 -21 51 -18 -143 -103
4364 -103 27 246 53 117 -5 26 133 80 -194 136 164 -7 -274 77 -36 11 191 -210 9 -386 -70 -114
4386 -114 137 19 -9 -230 203 95 153 -146 -135 -57 149 -21 116 -7 -152 -134 -189 -185 -59 -187 247 116 -152
4409 -152 -163 362 -194 55 208 -17 -31 36 -136 -60 315 84 107 67 3 -5 92 117 174 27 19 -31 110 -259 244
4434 244 -80 -36 -288 1 -144 -473 -117 -138 -129 -17 -27 247 22 45 61 46 32 70 -14 -72 403 -3 -116 -61
4458 -61 -109 92 -42 127 -10 -8 -164 -103 -150 129 -112 202 71 -164 -43 -41 -101 -175 234 -60 -17 -323 82 -29
4482 -29 -109 188 -52 -307 -162 -46 -198 60 61 99 -295 -178 -129 -199 74 73 123 71 -133 136 -116 -231 -63 21
4506B1j08O2J53q1j10K83j58k52K13j53l8kL55l92K46j12p1J52K5L1p9J24q4k70
4530b45J65P1k68L41j90QK34J32k17K68l29J58j20J5j76R0q5J47j69J68M6J46
4552A90j38j35LJ74j4k30J73p4o6j01L96k99M81l76j96L28m01K42N8J2j39P9k06
4575b39J02K38l3o2K35k93J06q0oK70j00j66K4J52l43L02p7J42J5J30o04j5L55
4598E3L7j99L3n3J92M4j82o5L09K7L8j91Q9J8OJ05m07R4J01k34M1K65k02K3K49
4623A91k51k6J82l2j24L34l74P1q4K62k10M6K15l06j66K83j07K66j96n7mJ66q4
4646em9R5J98m23p9L51o2o7o6J14o6J44j58J39j85j33M10j02j60J30m26N53k20
4669f7N3J8j02J01O4N0m4J3k61J53p7J40k13Q5J22j39K23k09nJ40k53K83j39j81
$$ plain form
4506 21 -87 -25 128 47 -63 220 62 -190 23 -130 -168 -170 185 -207 39 -73 -144 8 33 64 -15 109 25 -245
4530 -245 -80 -9 -277 64 -126 -118 116 248 31 299 -30 128 8 23 -153 -63 -148 -1 -170 -2 44 190
4552 190 52 -83 -80 94 80 -150 23 -51 -117 -218 178 -121 360 -16 -212 116 -285 -43 15 27 -112 -33 -239
4575 -239 -137 101 68 6 241 -52 54 -26 -32 238 138 -28 -4 148 -195 107 30 172 187 317 -287 -302 53
4598 53 90 -109 -76 -129 63 107 -75 -140 169 196 234 43 132 150 156 261 -146 -52 49 -185 -144 121 -81 -58 191
4623 191 -60 -86 96 64 -60 274 -100 -29 -113 149 -61 -15 200 -106 -272 11 -96 170 -26 -83 -87 79 -5
4646 -5 -54 41 239 -184 -263 88 26 -41 -107 7 -59 85 -73 66 -119 -252 158 56 -104 26 -400 153 -67
4669 -67 -14 4 -98 3 67 117 73 86 -175 -22 -99 41 -172 -87 35 -104 119 -90 -95 45 -208 75 -64 -245
4693b45R7L2K69k11J0j22L41j62K1J25j7j14m0j97J01Q0P0P0j85L46J4l29k8J51
4717G7O7j59k4O3r6J54K38k36K77l63p8M53n30n2K42j83K33l00M31o7l43K58o9
4740gr9L59m49O6N7K06J74j85j4j73J04K6K12k69p4L8J80r9m8j78K24N7J33k49
4764hJ55k08L3M4k53J82q8J50j16j94K26j25L92m14L6jK10J5l94K55J25k6j71
4787a75N6NL5J11k35L59Kqj13j30q7L25k26P5R8K7m9j44J29q1L55M3l64R6J19
4812B23m18K05N3j44L9O9Q8j46N6J74j12J5K5Pk64P7j66K90k06j4K41k29PR9R7
4837F6j8L7K4q4j14J63k63M56j28M6n10L03L4O5q0R1j00oj25j8J34L34n36N7K51
4862G9J4j71K31j45N6OK43q9k87J80j9J1j62K92k48P1r9k47K90P9j58q4L6J84
$$ plain form
4693 -245 -148 -116 153 -58 -48 -170 171 9 30 155 138 24 -16 -213 -112 -32 38 108 -77 269 283 -46 -74 77
4717 77 144 -15 -39 24 -72 82 320 84 361 -2 -80 373 -157 -209 33 -150 83 -217 214 147 -196 62 -7
4740 -7 -106 253 -196 -130 -73 133 307 122 108 -65 39 65 277 8 -66 -28 152 53 5 -173 51 108 241 -8
4764 -8 147 -61 -28 16 -237 -55 -143 7 -109 -303 -77 -202 190 -224 -188 -189 21 36 -358 -103 22 -4 -175
4787 -175 -119 -114 -79 32 -203 156 158 150 37 -93 -180 145 -81 -6 92 119 70 -74 55 -26 329 372 8 104 223
4812 223 -195 10 63 -81 -42 27 115 -31 25 199 87 102 127 134 -130 -53 -219 71 -135 -149 92 -137 -130 -31 66
4837 66 48 85 109 25 -89 74 -189 267 139 185 -325 -22 12 77 -3 88 -12 -18 -143 -161 -27 307 -229 -172 79
4862 79 93 -78 153 8 64 70 313 224 -63 117 98 109 -53 239 -9 62 -37 -284 6 85 -73 -157 -121 63
4886F3j95K30j53r9MK27k71K77K21m14N27m98o9K30n4k0O1j74J61O5ml92K40M2
4910EK97k65j77N9J29K64m69K81N2j75Q8N3k80K95l5j39j6K52k72J64J7O6k00
4933fq8K70l26J28P4L0k63L71j06J4P1k24O4r6J84Q3j08J01k11j00J52j3q1K40
4957A60k85J48M4Q3n9j78j76K77J4l31J34J83j05K03j27k8J41j96J88l69L14p1
4979c6k3K2L0q0j99K85J3j9k9q1J14r5K35j12j92O9J24j81M8J40j2Nqk2P1O9l09
5006a73J66J2L4j17N3RN2k04J61p2Nl2M8J97Km8k24K52R0l96L26j70l2J56l6n4
5032Ek15J73j52K22j57L6K09k17L29j88KN4n8K6M4j46J07M1J5k17O9J86j02jm9
5057A6N8O5k03K65m93L97o8J33j3k08K27j28l3J2j31j42j09L84J33m95K37lJ49
$$ plain form
4886 63 -132 98 -55 -154 -150 77 -194 83 304 -110 417 -81 -150 80 26 6 67 -107 54 119 115 -277 -37 5
4910 5 302 37 -140 -81 48 312 -157 124 176 1 89 142 -138 157 122 -17 -33 219 -53 111 128 194 -6
4933 -6 -94 176 -150 -22 52 82 -181 190 84 98 169 -55 9 -87 97 180 72 173 -38 -138 14 1 -80 160
4957 160 -125 23 67 150 91 -87 -263 14 28 -303 -169 14 -91 112 -15 -43 98 -98 90 -279 35 -36
4979 -36 -59 -37 -7 -87 -286 -1 12 -7 -36 -117 -3 -98 137 25 -167 -98 26 -155 -107 33 21 26 18 -4 67 136 -173
5006 -173 -7 5 39 -78 -25 -16 36 -168 -7 -79 -74 -106 -58 139 141 93 -131 121 211 -185 141 -29 -61 95 59 5
5032 5 -210 -37 -189 33 -124 -88 121 -96 233 45 47 101 43 69 113 -33 74 115 130 -87 -18 168 66 65 16
5057 16 74 139 -64 201 -292 105 37 170 157 -51 176 48 15 27 -104 -246 -355 29 162 -333 -96 -99 50
5080E0K4k12J97o1j18K61j56O9J97l02J31j02l1L75l65N5k59N4o3K96K04k40M2
5103D6j98K14r4j47M33k80K4K29j67l07L60j4k52Q8O3nL5J23l41J13Q8k6j47Q3
5127g9K34N7k0k51j2j00J17pj65L09j80J24j79J2p3J01K3Q2j51r9O2J81K05l01
5151a10J68m8Oj75J31K20l59K05j11L0Q4J68k08q0K32r5O7L7p5K38l11k3r4j04
5175b07J73J6l04N05k04l43M9M22k5j66K02M9ok71P0K24j14j55L91k25mj81Q0
5198b4j97J54J89k92M42k30j12K21l61M38m01P8L1K3J22j60P1n2L1J77k85j73
5220c10L29l3m4k0K02O2O8l29J01l9k49L97k90J1K57k64K24r2J05p7o3l0J8j68
5244b34L33kk1J58l5j83n2K43k03O7q3k9MJ3J23l1j8j46K31j10O9r2K72j43o6
$$ plain form
5080 50 74 -138 59 -2 -120 141 -15 54 251 -51 80 -22 -53 322 -43 12 -247 -193 -256 40 244 4 46
5103 46 -152 62 -32 -179 254 -26 -2 227 60 -247 113 99 -153 -65 -2 -7 28 151 -190 -77 11 -15 -162 -79
5127 -79 155 212 192 -59 -71 -171 -54 -61 -226 83 -97 27 -152 -140 -213 -112 -89 -7 -158 -257 -195 -14 191 -110
5151 -110 58 10 16 -159 -28 192 -167 38 -73 -43 41 209 1 -79 153 58 125 162 87 325 14 -9 -103 -207
5175 -207 -34 -18 -322 183 -21 -364 -315 107 82 -84 118 167 161 -110 -40 184 70 -85 306 81 77 -104 -24
5198 -24 -221 -67 122 -170 272 42 -70 151 -210 228 -173 -95 -64 -41 81 -79 -8 -60 -29 148 -137 -310
5220 -310 19 -14 -58 -78 124 186 254 -75 26 -13 -262 135 -155 -144 113 -151 73 -19 86 9 -54 -84 -66 -234
5244 -234 99 97 76 234 199 16 -36 207 4 71 -12 -41 -37 -24 99 68 50 -96 135 25 94 2 274 131 65
5269F5n0k9l3J6p2j6J60J28n03L48m3l8M3M6M9m15M25j67R2j03N0n2j5r7M21k14
5295dn1j24K04j12j3j0J34J96k61J0j22J18l79O12j44n5p4J54KK18l73Q7k4P5
5319F4j58K5M72l88k11M71m12o0M7n3N00m23q4K4P6n5K40k06m7J61PJ2j86L14
5343A30j92K85j60k08J4J29J08r4J93j21k34J43J18l36J74k17L13R4r8J13j99
5364d5n7k64M15J39j81o6J39m0p3J93L9q4j17m1P9L5p0j33L13l27J03j91N6J77
5388aL0j4m9J34r4k2N4j30m9J77J16Kj68o9J38o5o8J65L19l32r4NO9K32j43k05
5414f2O0J00m1j02QJ36k71K91k8P0j92J8qj11K91j64J92m2j11m28N35j12J03l45
5438b13K23l2j5L21k25N3k73M3j38N05l26j93K45J33j79KK77l80K29J31k63J83
$$ plain form
5269 65 15 -14 -47 -31 -103 -119 41 169 -334 14 -29 -67 -24 22 71 -344 81 -86 6 -97 -47 -99 -114 -211 210 -4
5295 -4 -55 -179 25 -87 -100 -110 24 220 -41 -31 -153 -35 -414 198 54 -1 -75 79 81 299 -74 13 -11 64
5319 64 -94 -69 403 15 -196 275 -137 -197 -150 -203 297 -126 -210 -186 -110 -165 75 -131 -178 -17 -10 2 -184 130
5343 130 -62 223 63 -145 -131 -2 106 12 205 84 -150 -7 111 -225 -51 -268 45 139 41 154 -45
5364 -45 -102 -366 49 188 7 -59 80 40 -33 160 199 115 -2 -43 36 71 1 -132 181 -146 -43 -234 -178 -1
5388 -1 29 15 -34 100 6 -16 38 -92 -141 36 152 154 -14 -83 55 -10 -78 87 406 74 -20 -15 54 286 143 -62
5414 -62 -2 98 57 -45 -37 99 -172 119 91 161 -31 -13 -21 -132 159 -5 187 145 34 -394 141 29 132 -213
5438 -213 10 -22 -37 284 59 112 -161 -118 -256 249 -77 -270 -25 108 -71 -69 208 -172 57 188 -75 108
5460A08k93L01l45L92j04j09QK05j86j37J44l2o8o8L10O5l80J52K2Q4K8l11QL82
5484A76k59J20J42k01o5L27o4p4k2r1P2j62J05o6j91L34k48J53R0j0k96K90L4
5507I4j70r2J60N5J91j68j31K08j39J4j46K1O6m2KK01l08L39j88J42Q4j12j22
5530d1M7M5j79j88L33p9N3j53J07J9p2K9J08j58P9Q0p6Q6q2J42m90M24M6l39N13
5555B54j28J23j81j85p7K72k78M7L30k40j04Q0K62m0l30L65k44J15j84j5K55J90
5577B87p7n77K80J51q9r4J39j23j5Q6j05j8L5K9R2j38r1K13J44o3J6j00j47K94
5601A29N5o5K9oJ66l07n2N4m3K01l64J18K77k38L33j51j46k37L04l4J41n9k41
5624a36K42k25K17j6o6J4N3J07m01M51k89K15J80l59K4k21j34L94Q6j39J65l79
$$ plain form
5460 108 -185 116 -229 163 59 -50 -42 163 -23 -160 -16 -48 -116 -184 126 191 -189 -37 -15 69 97 -214 -206 176
5484 176 -83 37 179 -22 -87 240 176 102 80 -11 61 -101 4 -62 -253 81 -167 -14 76 66 -230 60 94
5507 94 -76 -168 -8 47 238 70 -61 147 8 22 -124 -103 -37 -79 -77 124 -184 155 -33 109 193 81 -41
5530 -41 6 51 -128 -316 17 -62 -9 -162 -55 -36 -108 -79 29 -129 -50 30 -46 40 -42 100 -390 34 80 -259 254
5555 254 126 249 68 -117 -194 78 -200 -153 177 -63 -167 -87 175 135 -195 170 -74 41 -143 -158 97 287
5577 287 210 -367 -87 64 -25 -119 20 -103 -118 -32 -137 -155 -120 -91 1 -137 -228 -15 129 66 82 -18 -165 129
5601 129 184 119 148 142 308 1 -51 3 -40 161 -203 -85 192 -46 287 136 -10 -247 57 23 164 105 -136
5624 -136 106 -119 98 82 16 30 83 190 -211 240 -49 166 346 -13 11 -210 -344 50 136 -3 162 -217
5646b17JL49k37k9J0oK72l1n4k12R4j34Q3J54j55j18K64J2J79k62J61j49J60k31
5670i6%J77P4L01m03j90J37J47j9k47K54k22k7j4J07R1M9k59k28O09k75J69k28
5693i3j08K36K68n66N10m39L76k17j50K18r9J73LL4n3J53k01P8q3j91J59K33r4
5716A47k19J93p0l11J38P1R9O6j36J68j76NQ6j25J47p6k9J41j35j15NJ67p4j67
5740b00J31J08r0J1J66j4k53L40l00j48m2R9J61r5J57K47j24p1j74J73k09N1L26
5763B50k66K79l58J13k05K03J00k44J99J80j41m3Q8k04O2J12p9Q9K8k29J82J8
5785A34k52j0M5R8k8l0J43p2k36K50K7k97J21L03k29K96j15r8N7j23K2M3j35j78
5809b64L87j1qj16J61j41r3K31j54j19J11p5kJ66k38J38j34L36R2j28q1j79k7
$$ plain form
5646 -217 -216 133 -104 -133 -123 -129 143 112 58 -154 -60 -194 -111 43 -112 -230 34 46 225 -37 124 -25 135 -96
5670 -96 -96 81 155 456 53 -137 0 147 128 -119 135 -87 -114 -128 -21 70 119 -140 -368 241 -34 135 -93
5693 -93 -201 35 303 -263 247 -192 184 -33 -183 35 -64 109 112 146 93 246 45 123 40 -151 8 241 147
5716 147 -72 121 51 -260 -122 -51 48 114 -22 146 -30 -25 61 -64 83 7 -22 119 -16 -131 -126 41 -33 -200
5740 -200 -69 39 -51 -40 126 112 -141 199 -101 -249 -291 -192 -31 -126 31 278 154 83 -91 82 -127 -76 250
5763 250 -16 263 -95 18 -187 16 116 -128 71 251 110 67 155 -49 13 125 46 135 163 -66 116 134
5785 134 -118 -128 -83 15 -13 -43 100 28 -208 42 69 -228 -107 196 -33 263 148 50 107 -16 6 49 -86 -264
5809 -264 123 112 104 -12 149 8 -85 146 -8 -127 -16 -91 -93 73 -165 -27 -161 175 267 139 58 -121 -148
5832a48K15k59K13k43L83l58J08J39k59J96K32j98j3K84l48J84J6j18o5J25j78
5853i2O4m8M8k6K51l03J56j39J57j43J09o3q6J57j46M52n25K45M5l33L48k49K1
5876a00J05N3j83n5R6m1K31j06j64K48J32l2j06l6K8j57j65P8L09p0L8l0P9k07
5900e5n9J35m1J23j71J40j40r1K62k90K97j53j09J2Q5K95l09M57k07j37Q3m82
5922c55J58L05k21K86l42l9L35j34J62q1j37LM8k8j12k9L52j63j41J32m4K9l00
5945c16L11N3j52K28N3k47L29j25o7j29M2o7J42L4q8n9J95j92Lj73K72k91N34
5968B90l76oK1M9J35j25j72K35n8J2K86j33R0J40l18k44J97l47L94q9j8Np2J67
5992F3J05k71J33j35J00Nj47L40j42p6R0ok41J83L0k0l18K92J64n8k89J50P3k14
$$ plain form
5832 -148 67 -192 21 -222 161 -197 -89 50 -209 -13 219 21 8 292 -56 128 144 26 -39 86 -92
5853 -92 -28 -76 -28 -54 197 -106 50 -89 68 -75 34 -29 -115 42 -104 348 -177 68 113 -220 128 -121 -100
5876 -100 5 58 -125 -180 -84 -125 106 0 -164 84 216 184 78 42 70 -87 -252 -174 135 65 103 73 152 -55
5900 -55 -114 21 -20 103 -68 72 -68 -159 103 -187 110 -43 -152 -140 -55 240 -69 388 181 44 127 -355
5922 -355 -197 108 -113 173 -169 -208 127 -7 155 74 -63 -60 -12 -40 -152 -181 171 8 -133 -1 -45 -16 -316
5945 -316 -5 48 -104 124 177 -70 259 134 67 -62 -20 -87 55 89 1 -58 137 -55 -52 -225 47 -244 290
5968 290 -86 -92 -71 -22 113 -12 -184 51 -7 5 291 158 248 388 70 -174 23 -324 70 -19 -37 -32 -104 63
5992 63 168 -103 30 -105 -5 0 -147 193 51 -25 65 59 -182 1 31 11 -307 -15 149 91 -198 -48 25 -189
6016a89K06j17N63n62L09j84j43K1J11J57j16j71M03k82j6J61j93j7Q9K51l60
6037g9K7j60J78K89m96L05k32J39p6O4l3J3J15rm0L6J6j73j1M0J41Rk8L3J01k17
6063d8r1K81j87n8J03OO0k34M6J80k02L34j71jm8q6J42j16k12L03j87K27r0l7
6087h6J4j01R4L7J26j40J67k59J58P6k89J62PJ66l26K49Ok68K44m2l9j7l3L38
6111B44k08O2j88Q0on6j56j8J57J57k6J15k29J03J4K44l73K39r5p4j36N3QO8j82
6136b03R9j32L17%n7J38J56k47k49N16j58j59j12J13nk81J48L69k53L8n2j21K21
6159H6O8l23L1P4QJ22K65k86O8J43k91k04O8O7J91k67K94k9m4j0k0j02L7j0P3
6184IM8j20k17M57j95l0k75N4L91Pk19J78k1O5J1k11K28k63Q6J60n86L53L1QK37
$$ plain form
6016 -189 17 -100 463 -99 210 26 -117 -96 15 172 56 -115 288 6 -10 151 -42 -59 30 281 -79
6037 -79 -52 -212 -34 255 -241 64 -168 -29 -105 -41 -74 -61 54 45 5 41 57 -116 -127 -87 54 63 35 68 169 -48
6063 -48 -139 142 -45 -103 0 6 66 -168 -122 58 -144 190 19 18 -30 -116 26 -90 -302 1 -186 41 -49 -86
6087 -86 -72 -173 -79 -42 84 -56 111 -148 10 86 -203 -41 -34 132 -194 55 61 -207 37 -5 -44 -61 -94 244
6111 244 36 98 -90 -10 -16 -72 -228 -246 -89 68 42 157 -72 31 45 289 -84 155 60 -14 -150 -97 -89 -21 -203
6136 -203 -104 -236 81 81 24 162 318 71 -178 338 180 21 -91 22 17 -264 -116 253 0 38 -14 -135 86
6159 86 154 -169 -138 -64 -56 66 331 45 113 256 -35 -239 -171 -104 87 -180 114 85 41 31 11 -91 -54 -64 9
6184 9 57 -63 -280 177 -18 -48 -323 -269 122 129 -90 88 67 132 143 -68 160 -103 -17 143 -443 -90 -59 -51 186
6209A86j66k08q7L41Q4rk77j19J26J57pO5l61N36k88J43l39L12k2j41L9M4r9J73
6233H3k67P6K56l07K03j15J29r8O4j10J67j04K47k49J10j86J83Q9k79J72O2n02
6255c76N20k14L7J67j48J4J45k70K84j09J6j69J70j73J46m7k50N5J83M6L9K44
6277C10l16k3J44j08l19M01N1j14j8j55K44j5k6j7k95Q15m49J32k51j08k3K55
6299A15j83j4K92k87m7O7L8n8p5J44J15P9l67N6J98l7n5K57k63M0L02j74k69L2
6323i4K71j16N0j31K65j95l92K70N4R5o6K4j21j03K26j97J73k05K95l46K06J51
6345A14j10k03K87P3Pn72L64J34J55m25K82j22q4K44m51L79j93J48NL1l15K01
6367e1m2kJ98J12l13K64k13J26R8M4q1k05K69j22k81K21p7L04n94L62n9J85j4
$$ plain form
6209 186 20 -188 -275 66 150 141 -136 -255 -129 28 21 86 -275 261 -27 116 -223 89 67 -74 -35 9 -90 83
6233 83 -184 -108 148 -159 44 -71 58 -40 24 -86 81 -23 224 -25 85 -101 82 171 -108 64 126 -376
6255 -376 144 -70 -33 134 -14 0 145 -125 159 50 66 -103 67 -106 40 -7 -257 -202 -19 27 66 310
6277 310 -6 -29 115 7 -312 89 140 26 8 -147 97 82 56 39 -256 559 110 242 -9 -117 -140 115
6299 115 -68 -82 210 -77 -124 -57 -19 -77 -152 -8 107 186 -181 -125 73 36 -19 238 -25 15 317 143 -126 -94
6323 -94 177 61 111 -20 245 50 -342 -72 -18 77 11 35 -86 -189 37 -160 13 -192 103 -243 -37 114
6345 114 4 -199 88 161 168 -404 -40 94 249 -176 106 -16 -100 144 -307 72 -121 27 32 63 -252 -51
6367 -51 -93 -95 103 215 -98 166 -47 79 177 221 140 -65 204 82 -199 22 -55 249 -345 17 -42 143 129
6390A29k91K53p0L0P7p4K6k70JK31j1k8K47j87j35N1j21J6j8J75p5L6M5K0k5L9
6416G1J93Rn79K24K88k36q8R0k5j3J87q0j48K7nj6L2j64j2O7J86M8K06l55J98
6441A05j17j73K68J00N7m46j20K25p2J99j7j32j44L75j78l8K91l1j26P7l63K2
6463b38J65MJ70J37l10N1P0k60L31o3Q0l0j35j20O5k5K25l36K27m3k44L88l42
6486b33N8K70n5o8JK86l05J61k81K1P2K18k03M0K98m30J25J23j06k13J70O8j65
6509a48L68m97L86j05L0m7R5n6K99k62j73Jk76O46l54R1l3Q4k19J44j13K86k0
6532A27m8j37pK11m53J79K46j10M6k29M35l52P7j2q9o8K15K7j29k0on7K54r3r3
6557h6L5J10r3L00k15r3k85L57j3k23J59J68j16J32J17P2l61K12m1l5j24k85K95
$$ plain form
6390 129 -162 91 21 51 128 54 80 -190 -189 42 31 3 250 63 -72 -21 -142 -126 -144 31 -44 -8 37 57 32 71
6416 71 264 273 -306 -82 206 -30 -118 -28 -53 -66 121 41 -107 -80 -85 -101 -69 -233 -245 -178 8 56 262 -93 105
6441 105 -12 -185 83 183 240 -206 -326 -101 -173 26 9 -123 -267 108 -70 -108 183 152 26 103 -260 -238
6463 -238 -73 -69 101 238 -72 -21 49 -211 120 57 137 107 -28 -148 -83 -108 117 -219 8 -35 -279 109 -233
6486 -233 -175 95 40 -28 -27 259 -46 115 -166 -145 -73 145 -58 -18 280 -150 -25 98 -8 -221 -51 17 -148
6509 -148 220 -277 109 4 34 -13 82 26 325 63 -110 -109 -385 261 -93 -2 -35 49 -170 -26 -139 147 127
6532 127 79 -58 -65 146 -307 -128 118 8 54 -175 260 -92 -15 -27 -116 -184 31 58 -71 -91 -97 -154 100 7 -86
6557 -86 -51 59 -34 266 51 -42 -327 30 17 -206 -47 121 5 137 254 326 -35 177 136 101 -23 -308 -13
6580a3N5lM3L7J16o20L53J6l3J21J49r2j06J19j38J73l29J30PK56j12k64j94M71
6604A42k04O2r0Rk50K55j9l7K33j10P4P6k51K3M04l28J03k11J96q0LL9j36L89
6628B92l59J11j56M0P0K30Rl49J61L8j61oq3J58k54L75k07lK94j94j66R9R4j14
6652h1M3J7L0p4J01j73M7n8j23K23N6jRj64J90j42J90r8J19n9p7M2J2J4J91m01
6678a67J53l6J7L8J58j82qR3K57m45J69J12k67J96k53j04N52n7j14j58m6P1m7
6701f8K38l66K34k49J25J90l64Q9N5q5K45j8j4j89J02NM48k59l0m32J32M55k54
6724a0K58k86J06m75N09k35K03l3p5j2O8l5J75j42r1J44l88O07l82J93k44l4R0
6747h9lj57L55j45J73r6L3j98N6J88L0k22k56L14k9K2k26K71L01l90P6j25L05
$$ plain form
6580 -13 42 39 82 119 235 -385 -32 -16 -49 72 221 129 23 142 4 177 -152 -22 -15 241 129 -135 -329 142
6604 142 -62 0 -90 -81 -331 -76 -95 -132 101 -9 65 141 -110 -87 317 -11 92 -119 77 -3 0 39 -97 292
6628 292 -67 44 -112 -72 -2 228 237 -112 49 87 -74 -80 -163 -5 -259 116 -91 -94 200 6 -160 -61 33 -81
6652 -81 -38 -21 9 -65 36 -137 -90 -148 -271 -48 8 7 16 -148 42 -100 90 -8 111 52 -25 17 29 43 234 -167
6678 -167 -14 -50 -33 5 163 -19 -27 66 323 -122 47 159 -108 88 -165 -269 283 226 112 -46 -92 -21 -68
6701 -68 170 -196 38 -211 -86 104 -260 -171 -116 -201 44 26 12 -177 -75 -70 378 119 89 -343 -211 244 -10
6724 -10 248 -38 68 -407 102 -133 70 37 -38 -50 18 -17 158 16 -75 69 -319 288 -94 99 -145 -179 -89
6747 -89 -92 -249 106 -39 134 38 71 -127 -71 117 147 -75 -331 -17 -46 -24 -250 21 322 -68 8 -117 188
6770A88l92L32j11n8L3l8j6N0n5L6K04K6j07j57j95P2K52j52K41j72MQ7j59J37
6794E0J90j90k57N1K28K7J30l31j74L50L8j13j14Q0N6j00j44Q7K15Jk55K1J94
6817D0j72M06k93q0J63j99j81M86r7J21l37L1L42k09j04K14J16k61j48K54N4O8
6839B14J4j99L25m79q2L00oj69K26k19M5J67Qq3j4k30K16j58J17j50P2Q0K01k47
6863e1o1J45n6n7J01l00J30J41m5j97K93K63m80J64J77O5n3k19J05j45J54r2j7
6886c5J93j72K12l49L21j54K5R1K19m17K5l2m9K22k26OK47m5j46K49k00q8K92
6909A89l03K7rk12J23J62K09l84K93J76m68L4K58J91j65Qk51J13n4J93J46k85
6931io0j19J99O3q5J17j47K40N5l35R7j67J72l27M00l6R0r5l7K40k42j22J73j07
$$ plain form
6770 188 -204 128 17 -41 -8 -46 -62 -12 -67 -31 173 199 92 -65 -260 -188 64 -88 153 -19 -15 72 -87 50
6794 50 240 50 -207 -156 72 99 229 -102 -276 74 112 -1 -115 -35 21 -79 -223 -136 79 80 -175 -154 40
6817 40 -132 274 -19 -99 64 -135 -316 170 73 194 -143 -112 230 21 -83 131 247 -14 -162 92 146 214
6839 214 228 29 354 -125 -207 93 87 -82 144 -75 -30 137 145 62 48 -182 34 -124 -7 -157 -85 -5 196 -51
6863 -51 -112 33 -23 -80 21 -279 -149 -8 -53 -250 43 306 -174 -10 167 232 179 -40 65 -80 74 -18 -35
6886 -35 158 -14 198 -151 170 16 41 132 351 -66 -41 -73 -122 100 -126 -120 127 82 -64 185 -15 -103 189
6909 189 -114 -87 -96 -308 -185 -23 186 -198 95 271 -197 -163 95 286 121 129 -122 -9 -63 130 276 -9
6931 -9 -69 -188 11 74 -11 106 -41 199 254 -81 16 -151 21 -306 94 58 148 53 16 256 14 -108 65 -42
6955d2r9P0p8L50r3j51K15j91j89K02Ko4J31j03n0J56j73J48l52L48N3k60J54
6978a6j80N49m89O8K21k11K7L2l23L04J6J49q4j62K04j26j72J90lJ24k81J56J40
7001A33k21j52o1M17j01j43R0K43J01k12l9Q0l05M87k62j14M6k48K46k5J97l12
7023a55L07J78l75J67M5k42rK23l4k50L70j51MJ1m0k87M94k02l1k6J07j23m5P1
7047GJ1l9K38j26j21k3K4j29L22j68rJ43L1j08qPl2J01j13m18P09j54o7r3r9M65
7073C51m31J51n9j09J35j88J9J35J59k89K61q8j57k01M46J1j12k75K64j21L54
7094B56l0l21J17j53L15j96M7j39K64j32m6n7O6j29P3J40L18m99OR4m7j76L24
7117I5m01L37K9p4ok32L37j1Jn0k02K80m1j40n5J86J49j47J02k92J2r5K56K07
$$ plain form
6955 -42 -141 -71 -149 201 108 -43 172 -19 -208 -6 -4 -68 63 -40 -90 66 -107 41 -311 37 90 -170 -16
6978 -16 -196 353 -136 -68 153 -58 -31 1 -322 -18 -2 147 63 -99 105 -21 -193 -3 -6 118 -163 -7 133
7001 133 -88 -240 -301 116 15 -128 -38 205 306 94 55 135 -170 317 55 -59 -13 -261 -15 -40 157 -155
7023 -155 152 330 -45 122 167 -75 -84 139 105 -145 225 74 78 89 49 -238 256 54 23 -3 104 -19 -64 7
7047 7 18 -21 217 91 -30 -53 -29 -158 164 -4 -13 130 161 53 45 52 20 121 8 -410 299 145 78 -15 -114 351
7073 351 -80 71 12 -97 38 -150 -131 4 163 -126 135 47 -110 -311 135 146 34 -241 23 -98 256
7094 256 226 -95 22 -131 184 -12 35 -104 160 28 -18 -75 -9 -138 -65 75 393 -106 -100 -6 -53 -229 95
7117 95 -306 31 60 -14 -20 -252 85 74 75 25 -177 103 62 -78 -133 53 202 55 157 -135 -123 -218 38 245
7141B45k72J0O9j21J97R0n36K13K90k91l8K33l02m5P3J90k17n4K80J60j29n33
7163d88L53J64j18m4J46P7J03j10j03q4pM4r3L1M1M7J65k08J21J59j05j76lq1
7187a69O6L6p2J23o9N3oJ91j24r9k06M12l12L2K00j1k38K11r9J14j35P6J1k3K
7212c6j89M34k50m5K5o0k0M3pJ10K0J03k21M5q5j42J78O9m5O0n5J32O6l40O7J36
7238gP0J37j46o9nJ1j78J43J74j72K58k96J46j7j92J76j26o9M0p1J42j25J81j76
7262a71K40q6K96n15L85Q0m3j19j08J1Q6J29m6m63L89N6J30j02j50J89o4j58J63
7285A29K0j66J11m24K71J67M8J22k08l8J2N0o4M9j18K1J55k81L08k19k0J22J7
7308F4j45j05J54K01k60K2K05M4q7j34J5p5J73j10J87k05j12K34j45L3kJ48j08
$$ plain form
7141 245 -27 -17 52 -69 128 218 -318 -105 185 -106 -144 89 -213 -258 -185 5 -212 -266 14 174 45 -488
7163 -488 -135 29 -89 -133 13 90 193 83 -20 -104 -111 -67 -160 -129 -88 -41 124 -84 37 196 91 -85 -88 -169
7187 -169 -103 -67 -139 -16 -85 -32 -38 153 29 -70 -276 136 -176 -144 56 45 -193 18 -81 33 -102 -26 -15 -38 -36
7212 -36 -225 209 -41 -86 -61 -121 -141 -98 -105 5 25 128 -93 -48 -133 -275 -97 -28 -73 -13 -68 64 130 -210 -143 -7
7238 -7 63 200 54 -15 -20 -9 -187 -44 130 -42 216 -80 66 49 -143 33 -93 -162 -122 -193 -51 -176 5 -171
7262 -171 69 -17 279 -236 149 229 186 67 -41 -30 56 185 139 -324 65 121 251 149 -1 188 124 -34 129
7285 129 149 -17 94 -330 -59 108 156 278 70 32 44 94 30 79 -39 -18 137 -144 164 -55 -75 47 64
7308 64 -81 -186 -32 169 -91 -69 136 180 93 -41 -26 -101 72 -38 149 -56 -168 66 -79 -46 -48 100 -8
7331hl51L28q5Q7J67j01q3q0J35j99J56K9J63M5k86K03k78K97r1r7J17l08K41
7354Aj43K34L4j63l9J4k8J59l5J25k73O8K61k45J28j31K62l11R1n3M7j35O1K63
7378A92n4j73K53k66oo6O7p6J49R8n4k95J69J46j40J69K56m32J37j54O3J78l38
7401a77j4M5K02q7Q6M3l57M35j16J19k85J61Q5k60J80J0j3j69q3K40P7l17N00
7424C05k99r1j03K50P6k53L31k9j47j13k9n7J71p0R1j64J79k1j92K46j01k5K77
7447B32n4j83K68l17K61j49J68k94k28L48J22k37q5K19p0%P3J23k69M3k1L31m45
7470a64K43J52j99l8K5J06j55K59j77q4O8J6l3N9q0l10L75k15Q2l59N12k4n4j63
7494a58K66p4l9j54J21R7R1lj35P3j59L8K02r7j1J5k11J81M4j8M1j20j44J14L53
$$ plain form
7331 -8 -359 -31 -116 -29 138 37 -46 -126 9 -190 -34 -5 158 203 -83 120 -158 139 48 -49 68 -240 1
7354 1 -142 92 126 -37 -76 -62 -90 69 34 159 -114 -46 215 -30 98 -33 229 -82 9 -44 3 -132 -71 192
7378 192 138 -35 218 -48 -54 -120 -53 -129 20 118 64 -231 -62 84 -56 113 369 -63 74 -80 -17 161 -177
7401 -177 -191 -146 56 -31 55 98 -259 176 60 179 -106 55 140 -120 60 70 57 -112 -195 45 122 -195 305
7424 305 6 -85 -188 62 138 -115 216 187 40 -73 -102 -159 12 -58 33 -131 48 27 -165 81 -20 -45 232
7447 232 178 -5 263 -54 207 58 226 -68 -296 52 174 -63 -148 71 1 1 74 197 -72 -29 -50 281 -164
7470 -164 79 231 32 -6 19 125 -30 229 52 -32 36 52 19 78 -2 -312 63 -152 -70 -429 83 59 5 -158
7494 -158 108 34 -5 -159 -38 59 150 147 12 85 -74 -36 166 69 58 73 -138 43 87 69 110 -10 -154 -40 313
7519C13l82K19j79J32l70L14j79J98k18J45n7K9J60q2l8oM0K47j91o1n1l42L83
7542B4lj48J5K64o3o7J10j34k67L77j07Q2MN8m03J54J68J19j23L1K29m26jK56
7566A49j52j41Q4K1O7P1k15n7K53j02O4p0R1j39K21m10K06K07j12k70J89j09k9
7589a83M21l01J78j77J38JO5J89l89op6r1L77m5n3J46k21j62K72J03k40J67L1
7612A44k27l2J25J65q9k13j04K71l3J43k59J37K68m88J99l6j52K93M9r5k72J18
7634h8J61j59J79J28O3n86K53J93j60P0n4J97k18k78L51j41J16j01j78L37l30
7655b45NK36qj01P3j30p7M57j47K25m06J56J11j8m56M39K91m62m3j40R9K03j55
7678i3M1P4O5j79J62j42k21J46J11j16K19Lo1l5j3K69j57ol39L97k03M8J37k24
$$ plain form
7519 313 -69 150 -29 103 -267 47 -132 66 -152 -7 -64 -35 125 43 5 -1 39 286 95 34 -17 -359 24
7542 24 21 -127 -112 152 89 22 132 -2 -269 108 1 83 87 145 -258 -104 64 183 60 91 320 -106 -107 149
7566 149 -3 -144 -60 -39 28 99 -116 -173 80 -22 42 -28 63 -76 145 -265 -59 148 36 -234 -45 -154 -183
7589 -183 238 -63 115 -62 76 77 142 331 -58 -64 -140 -231 146 101 48 194 -27 -189 83 186 -54 113 144
7612 144 -83 -115 10 175 86 -127 -231 40 7 150 -109 28 296 -192 7 -29 -181 112 161 66 -206 -88
7634 -88 73 -86 93 221 284 -302 -49 144 -16 54 0 197 -21 -299 52 -89 27 -74 -252 85 -245
7655 -245 -240 -4 -12 -113 -40 -170 -247 210 63 288 -118 38 149 131 -325 114 405 -57 -100 -240 -141 62 -93
7678 -93 -52 22 87 -92 70 -72 -293 -147 -36 -152 67 70 9 -26 -39 230 73 67 -272 125 -78 -30 107 -117
7702a17q3K8K16k84J48K23j85K67l89j0J08J25p9O8q9J41q3k72M98l92K24J31
7724A94j02l5K09j47l00K11k0K70l53rj3J37J5k11M06r1L3k75K34j90l5K29j89
7747c2l0P4k44M33k50j00M08l4q6j60K02n02M59L3m3J75l37j25j90M81j84n7q
7770a17JN1q1J81L2L41m06M7k41n1N48k26Lk7l4M3l9on5j10L18k58l1%J3N4K57
7797B07n92J72J50P1j5qK46l04M5J69m3j76l8J36J48k32J30j9L1J09j05Op6J57
7821A69j46r4P6j65K76l8K12l03p1K80j64o2NK21j96R8j09R1j68k15M42j41j59
7844a61M2j14j2K16J08j15K38k27J55l6j44J8P1R2k87J58P1J08k08j17N8K4L3
7867b9N3o7J76Qj92j26m6J84q8K3q2J00OQK60l2l42K25o4L11k48k51R0o6L27j22
$$ plain form
7702 -117 -200 -172 44 -240 -92 131 -54 213 -176 -186 -78 47 -32 36 -53 88 5 -267 231 -161 63 194
7724 194 92 57 266 119 -181 30 10 280 -73 -82 -95 42 57 -154 252 161 194 -81 153 -37 -72 157 -32
7747 -32 -62 12 -232 201 -49 -149 259 225 139 -21 181 -321 138 171 128 303 -34 -159 -349 132 -52 -109 -117
7770 -117 -116 -65 -146 35 67 408 2 49 -192 -243 305 79 82 55 21 64 25 19 -36 -146 172 -86 -117 -117 -104 -50 207
7797 207 -385 -213 -63 8 -7 -15 231 -73 -28 141 98 -78 -116 20 168 -64 66 47 78 187 82 88 12 169
7821 169 23 -71 5 -160 116 78 290 -13 -84 196 32 -30 -25 196 0 98 -11 80 -88 -303 139 -2 -161
7844 -161 -119 -233 -245 -29 79 -36 202 -25 130 94 -50 -32 39 131 -156 2 73 181 -27 -144 -86 -62 -29
7867 -29 24 -43 133 141 -51 -177 -223 -39 -127 -104 -186 -86 -80 -72 188 156 -186 39 -25 286 38 -213 -123 -189 138 16
7893A6k3o7J32j67N8K19l52J09k14J70J28j33k1K92k23L23j37k43J46M8p3M2j53
7916a23R7r7J58r7n1J96J7j91L01j40j39K18r3l8L3o6p9J08L2l7p3K80k56Q6k53
7941b07L47j65N1j56O0p3Q1j64J21J53k2K9J17m5o7j83L62j28M5j86mQ9J1j06
7965d0j61L22k76Q8K53l86K0K92k35J3J55Q9k93J91j14k2Q3J13j06r4k57L45J76
7988A56k10L8J03j73j42K97j79K02n7j58J35p9n0K89j79M0P0j29K37m42L37P7
8010A83l02p6J7P2j5J0k1K24L6l66O7J78pk28K67k32L46L2j32K34m49j7l0K05
8034dJ5q3J8J11l16P6J93j20J51k10N2l1L01l69J51j27N2P7p2J20K6J89m62J38
8058a24j5P4J78o2J04k20n4L03l33K27l46J55J02k47L97j21l15K15K57l60%J61
$$ plain form
7893 16 -7 -74 58 -109 -51 168 -184 -75 -289 -119 9 -124 -145 147 -76 247 110 -133 13 61 -12 30 -123
7916 -123 -26 -123 35 -62 -113 83 100 -91 210 70 -69 149 56 18 51 -15 -94 14 46 9 -64 216 -40 46 -207
7941 -207 140 -25 26 -130 -70 -143 -62 -226 -105 48 26 55 172 127 60 -123 239 111 156 -30 -34 55 66 -40
7965 -40 -201 121 -155 -67 186 -200 -180 112 -123 -110 45 134 -159 32 -82 -104 -21 92 -14 -108 -365 -20 156
7988 156 -54 -16 87 -86 -228 69 -110 92 35 -123 12 -67 -117 172 -7 33 103 -26 211 -231 106 183
8010 183 -119 -195 -178 -106 -121 -111 -132 92 128 -238 -171 7 0 -228 39 -193 153 185 53 287 -162 -179 -209 -4
8034 -4 11 -72 -54 57 -259 -183 10 -110 41 -169 -117 -148 153 -216 -65 -192 -140 -63 -135 -15 11 200 -262 -124
8058 -124 -139 -65 113 51 155 -65 -119 184 -149 78 -268 -113 -11 -258 139 18 -297 -82 175 -185 -185 -24
8080b4J5P7J65j18m28J41J56K11J93l92O7j83M70l13m0K4N1j81L68l17J15nJ42
8103A94k57J94r1k15J13j05K2K81n5m5l0q9J20k2q3j56K12J29q9Kk29J12L48k80
8127a9J6PL57n94J39Q2j9n2L99k26Q8j88N5m7R9o7N1k28O4J50l03K17J54j64j65
8152a94R9J04j17J85J14j28Qk4M1L8j39N2KK2K4l3p3L23m19L51k76J67q8n9j79
8177a99L70M1k48j9R2K46k97J38k62K08k4k81L41j77
$$ plain form
8080 -24 -9 68 233 115 -313 -172 -16 195 388 -4 63 -120 350 37 -3 21 72 -109 259 -58 57 52 194
8103 194 -63 131 40 -175 -62 -167 -145 136 81 36 6 -83 37 15 -68 -224 -12 117 28 30 -199 -87 261 -19
8127 -19 -3 4 361 -233 -94 -12 -31 -83 316 90 178 -10 45 -2 97 30 81 -147 -83 67 -236 -19 135 -29 -194
8152 -194 -95 9 -108 77 191 63 71 47 88 126 -13 39 41 63 87 54 -19 304 -115 236 -40 127 39 -20 -199
8177 -199 171 212 -36 -55 37 283 -14 124 -138 70 46 -235 106 -71
8191g1
$$ Imaginary data points
##PAGE= N=2
##DATA TABLE= (X++(I..I)), XYDATA
0@%%%%%%%%%%%qJ6j6J6k2L0l2M0m8N6p2Q8j04J20j36J60j90K17k49K86l26L72
33A98m20M74n36O02o75P55q43R39j043J159j284J420j572J734j912K109k323K561
51A343k821L108l427L784m184M638n158N756o457P290q302R561j1171J3318j6342
66i064K0948k8889M6289j53419P9190J59556k50358J11404Q9203j20215L1110
77b4245N2085q6596Q4218K090q3654Q4695L0647p8801N9332j6200m1731Q4233
89F6073l7249p2303J12005j0042q1970O3882J043m7229L1044n6653o572R2453
101E4482o7717m5022J10020l8495o8571O0243k5257k3013N5222n5898m723R1856
113D3127o3612m5578Q1830k4669k5229M5496m3865J6641P1631p6616m718J03247
$$ plain form
0 0 0 0 0 0 0 0 0 0 0 0 0 -8 8 -8 8 -14 16 -16 24 -24 32 -40 48 -56 64 -72 88 -102 115 -134 152 -174 198
33 198 -222 252 -284 318 -357 398 -445 494 -549 610 -674 746 -826 908 -1004 1105 -1218 1343
51 1343 -1478 1630 -1797 1987 -2197 2441 -2717 3039 -3418 3872 -4430 5131 -6040 7278 -9064
66 -9064 11884 -17005 29284 -124135 -44945 114611 -135747 -24343 64860 -55355 -24245
77 -24245 27840 -58756 25462 27552 -56102 28593 59240 -19561 39771 23571 -18160 66073
89 66073 28824 -43479 68526 58484 -23486 40396 41439 -5790 25254 -31399 -37971 54482
101 54482 -13235 -58257 51763 13268 -55303 4940 -20317 -43330 11892 -44006 -48729 43127
113 43127 -20485 -66063 15767 -8902 -34131 11365 -32500 -15859 55772 -20844 -25562 77685
125G7685o6516n8302Q0574q942l1942L6508j9632O091L9841n0900j2937M5602
137C7130l2536j4496K4737k2731J8054J4295o0774K1543M8737o3781j4478N2836
149H536j6592j3402J1572j1155K6886P9n4353L1732L9139n2754N856M4737k3052
162b771L452J8447l1865J5773K6852m2346K434M3680j5123j8942J0512N230Q853
175B4186j7421k2954L2723J2105l9728P801K7326j6406j4108q14k50J0354j2249
188i435j5745K3005P534j9174J663K722J46P235j8734n892L7068m916l1850K3775
202b598K1245k2086p371J1555P970K952j2416O08K4902n414k3533J0159J1789
215A7762j1156m972J348M385Q666q636j3077J0331P394j6647j1934J2938J1409
$$ plain form
125 77685 11169 -47133 33441 24499 -7443 29065 9433 15524 55365 4465 -8472 37130
137 37130 4594 -9902 14835 -7896 10158 24453 -36321 -14778 33959 -29822 -44300 8536
149 8536 -8056 -21458 -9886 -21041 5845 5924 -48429 -16697 22442 -30312 -24456 20281 -2771
162 -2771 681 19128 -12737 3036 29888 -12458 -10024 33656 18533 -409 10103 15333 24186
175 24186 6765 -16189 16534 28639 -11089 -3288 24038 7632 -6476 -7290 -7540 2814 -9435
188 -9435 -25180 -2175 5359 -13815 -12152 -9430 -9284 -2049 -20783 -26675 10393 5477 -26373 -2598
202 -2598 18647 -3439 -10810 745 8715 11667 -749 -141 24761 19347 -4186 5973 17762
215 17762 6606 1634 2982 7367 16033 7397 -5680 4651 12045 -4602 -16536 -3598 7811
228G811j4744j2739J7918R875k1055p562J5930L367r521k511P573J0379m783j1330
242a1392P068R885p035o162O369Q344L494o963l710J3411K821j7476k425J7315
256A3544M32j5853R19J5603k591j5694k9J0139k736q881j025O545M616p751q664
271a1426P457N629j1144n310Q038N507k163o048K008J2026k927j5224P549J4977
285H949r472p792J1450O279n081m182J253N756P16p621P7R520J279p867k374O195
301G085K208j0129m649Q914K881q969l084O704L563q314p644P280O789j0047m746
316a2158J1392K000q166M0L329J276L77m452N31R557L18q185L783Q170l187o744
332b119K430O786m2o376KQ297j06r168o85P629q59p306M56N372J58n576k197L179
$$ plain form
228 7811 -6933 -19672 -1754 8121 -12934 -20496 -4566 -1199 -10720 -13231 -5658 4721 -62 -11392
242 -11392 -4324 5561 -1474 -7636 -1267 7077 10571 3608 -102 13309 16130 -1346 -3771 13544
256 13544 13976 -1877 -958 14645 12054 -3640 -3669 6470 3734 -5147 -6172 373 4989 -2762 -11426
271 -11426 -3969 1660 -9484 -14794 -6756 -1249 -3412 -9460 -7452 4574 1647 -13577 -6028 8949
285 8949 -523 -8315 3135 9414 4333 151 1404 7160 7876 255 332 9852 11131 3264 890 7085
301 7085 9293 -836 -5485 3429 6310 -2659 -5743 961 4524 -3790 -11434 -4154 2635 -7412 -12158
316 -12158 -766 1234 -6932 -6892 -3563 -2287 -1910 -6362 -5831 3726 4044 -4141 -358 7812 4625 -2119
332 -2119 311 7097 7055 679 681 8978 8872 -296 -981 6648 5789 -1517 -1061 4311 4469 -1107 -3304 -125
350a25J366m390m802M040N144m858n532N839M488n521l746M849M516l199l876
365e807L781N355k300m964L457N012j729m217K983N405j383l776N92L481j06m075
381A709k058M309J869o144k172N651Q7o324l96L944R6l017j478J275L074k877
397b452m929M027M043m586k606N032K289k469j352J567L315p59l978K316M858
412D316k047l513K698K591j665j879O41K855J34k500p41K664O32l469k216L510
428B011J581m819k076M822L80m844n31K760l15j953r87J517K111j774k546L122
444a541J648l204n30K821P86J90n84p06L715R92m634L90N209j938l120L003J686
461D183j441j171m40J384J62l253L43K718j129j677K73k65O51o95l099J247K953
$$ plain form
350 -125 1241 -3149 -7951 -3911 1233 -3625 -9157 -3318 1170 -4351 -8097 -3248 1268 -1931 -5807
365 -5807 -2026 3329 1029 -3935 -478 4534 2805 -1412 1571 6976 5593 1817 2409 5890 5784 1709
381 1709 -349 3960 5829 -315 -2487 3164 3251 -3073 -3469 475 571 -2446 -3924 -2649 425 -2452
397 -2452 -7381 -3354 689 -3897 -6503 -1471 818 -1651 -3003 -1436 1879 1120 -2858 -542 4316
412 4316 2269 -1244 1454 4045 2380 501 1142 3997 4131 1631 890 3554 4186 717 -1499 2011
428 2011 3592 -1227 -3303 1519 1899 -2945 -3476 -716 -1031 -2984 -3971 -2454 -343 -2117 -4663 -1541
444 -1541 107 -3097 -3627 -806 -20 170 -414 -1120 2595 3587 -1047 -657 4552 2614 -506 2497 4183
461 4183 2742 1571 1131 2515 2677 -576 -233 2485 1356 -321 -48 -313 338 -357 -3456 -2209 744
478G44k766j796L182K45j916l90j00J871l28k754L116L230l993m49L773j847n0
495b28J455j907J153L222k543n72L409j573j641J167j02P53q97k174K801J304
511C627n144j65L519k445j738J498j85K63j44j441R86J54j990J345j76n41K663
528H6j167j567L998o10m041L462K451l362J990L13p18K381j699k297L727j071
544A876l591M987N9m437L600J07l985L063j47m935L736J483m003J630N85j888
560a860J896j702j917M200j893k844N074m36m377L394J123l095J854M20j392K783
576A228q8j469K818k038m08L040k969o99M657k845k162M905k188l565L337n66
592I88k057K024j661M9K700l308n05L172l525n82L763l218r00M290k588j219L531
$$ plain form
478 744 -2022 -3818 -636 -391 -2307 -2697 -2797 -926 -1254 -4008 -892 2338 -1655 -2104 1669 -178 -228
495 -228 1227 -680 473 3695 1152 580 3989 2416 775 1942 1840 2593 1696 -478 2323 3627
511 3627 -1517 -1682 1837 -608 -2346 -848 -1033 -770 -914 -2355 -1369 -1215 -3205 -1860 -2036 -2577 86
528 86 -1081 -2648 1350 740 -3301 161 2612 -750 1240 1553 835 3216 1517 -780 2947 1876
544 1876 -1715 3272 3331 -1106 2494 2601 -1384 1679 1532 -3403 333 1816 -2187 -557 28 -1860
560 -1860 36 -1666 -3583 617 -1276 -4120 954 518 -3859 -465 658 -2437 -583 -163 -1555 1228
576 1228 1140 -329 2489 451 43 3083 114 -585 4072 1227 -935 3970 1782 -1783 1554 988
592 988 -1069 955 -706 -657 2043 -1265 -1770 1402 -2123 -2705 1058 -2160 -3060 1230 -1358 -2577 954
609I54k367r92L121j830L28K083k374J330K677m350Q89L790m094J39M428l098
625F34o91L317k457p75K287k647M45J919k393O06J404l417J773J465m682J294
641a918L603l963l2L704k675o21K436j578o75J038q22J378N67j856J695J026k386
658a079J420J174k518J450J708j399L42N15r19K42m57m49J410j219p94K867j294
675A000k673K863l44k811J842L59k379J484P02j440O73k61m39Q12o34l34K096
692E16r73q16K569j020k081K393J16j665J222P19o30O31q9j4L30j347R44J026
710A831j842J77K074j890p65J558r73q08Q25k05n33M20k47L09k7j166Q75K33j932
729b086Q56J510j687L12J846j620o3R62o74J48N05L69N36n47l31J377n12j401
$$ plain form
609 954 -1413 -2405 716 -1114 -786 1297 -1077 253 2930 -1420 -531 3259 -835 -696 3732 634
625 634 -57 3260 803 28 2315 -332 113 2032 -361 245 1649 -1768 5 1470 -3212 -1918
641 -1918 1685 -2278 -2310 1394 -1281 -1902 534 -1044 -1719 -681 -1503 -125 442 -1414 281 1307 -1079
658 -1079 341 1515 -1003 447 2155 756 1098 1613 694 936 479 30 1440 221 -573 2294 1000
675 1000 -1673 1190 846 -1965 -123 236 -2143 -659 43 -1397 -724 -985 -1424 -612 -1246 -1580 516
692 516 -457 -1273 1296 276 -1805 588 704 -961 261 980 350 981 892 878 1208 -139 805 1831
710 1831 -11 166 2240 350 -415 1143 170 -638 187 -18 -551 -131 -378 -69 -96 -1262 -387 -154 -2086
729 -2086 -1230 280 -1407 -1095 751 -869 -932 30 -644 -496 9 378 914 367 36 1413 901 -500
747e00J667Q6j416J137Q49j694Q02K1q87M13l68p08J090o18n06J250p17j543J608
766c4n58j600J555M32j191R33N29j312R85K40r91Q12k80J08O70n0n70J158l30
785E06o92J116L89j097Q32L92q44J36K56n74J82n30J66P50r74J04J072j388n85
804g83J133j131n27J048M6q70Q05m22l00L17o04O01M87o47N65R84r23k43J544
823A080r94p33J267P6n29R04J29l66j23l8K50k12o32O67M27j205pP82r27k28M33
844B1m54k24J84k05K96K24m26K49k67o88P16L83q56P30N08r14L90N75n04j73Q29
865C94n1P7L49k20j67N48n79J72J04l74L65K98p00K58J64o31o3N03k71m63j69
886d56L24l9l71n9L28l91m84O50N1k54L75J34m15M23N8l94L78N8p5M31K79l42
$$ plain form
747 -500 1167 1253 -163 974 1823 129 931 952 65 478 110 -598 492 -126 -632 618 -99 -1642 -34
766 -34 -592 -2192 -637 -205 -1396 -463 66 -1246 -261 -21 -1012 -200 -480 -372 298 248 -322 836 506
785 506 -186 930 1319 222 1054 1446 602 738 994 420 602 72 238 988 14 118 1190 -198 -783
804 -783 350 -781 -1308 -260 -214 -1084 -279 -701 -1001 -684 -1288 -687 -200 -847 -282 702 -221 -464 1080
823 1080 86 -647 620 696 167 1071 1200 834 711 673 923 711 79 746 1173 -32 -39 743 -184 -412 21
844 21 -433 -657 -473 -678 -382 -158 -584 -335 -602 -1290 -574 -191 -1047 -317 191 -723 -333 242 -262 -435 394
865 394 343 420 769 549 382 930 351 523 627 253 618 916 216 474 638 7 -56 447 176 -287 -456
886 -456 -132 -171 -542 -601 -273 -664 -1148 -498 -447 -701 -326 -192 -607 -184 -126 -520 -142 -84 -159 272 551 209
908B09L49k50k33L35J81m18M20M68p20L5J56j73j01l2k69r9j61P0J55m2L35n19
930c04m82K44L06m01J21L45j88m50j69M98J90Jn3L87J25o6J57K09k63j39K83J
952C52j31L59j96Q2J81k21m0j64J23L19n94K29M97o22o41N51m14j81L0k19K86
973d14M89o74L6L78l33j9L32l47J27P22m32l8Q61n26l96M84k5pK36J19j38J73
995F08j56l81N73l68l33K19j13J7L24m31%L82n51j01K32m08J00Q9k93L61l17l69
1017i16M50J19o45P61J01k7J88L60p21M14J93r70R25K04o11O33M79o85J68J0m04
1038B6P52K16j255P68l9m12K43j07n48N25o7m60K87K35n72M47L16r78J27p5l04
1059h75O61j64l92Q23r6m46N01J25l29L35Q1l52M39M8l70O11mm95k85N34K77k01
$$ plain form
908 209 558 308 75 410 591 173 593 1061 341 376 532 359 258 226 -43 -142 -303 -233 -78 -120 215 -304
930 -304 -786 -542 -236 -637 -516 -171 -359 -809 -978 -480 -290 -289 -342 45 170 104 261 470 207 68 351 352
952 352 221 580 384 466 647 426 386 222 345 664 70 299 796 174 -467 84 -330 -511 -481 -700 -414
973 -414 75 -599 -563 -185 -518 -537 -205 -552 -425 297 -135 -173 688 162 -234 250 225 218 454 573 435 608
995 608 452 71 644 276 -57 162 49 66 390 -41 -41 341 -210 -311 -79 -487 -387 -298 -591 -230 -547 -916
1017 -916 -466 -347 -992 -231 -130 -157 31 391 -330 84 277 -693 232 436 -175 458 937 252 420 430 26
1038 26 778 994 -261 507 468 56 299 192 -356 169 102 -358 -71 164 -408 39 355 -623 -496 -571 -875
1059 -875 -214 -378 -770 53 -43 -489 12 137 -192 143 224 -128 311 359 -11 600 596 101 -184 350 627 426
1081D26j35j32K28k70k46M06l35P1PJ58m02N2l20L1K53n06J35N28k55J02K90o58
1103e72j8P31l56l9P54o98J34O84n03k45O29m36K68J57n77M10M79m49j64O96j051
1124a66j20P50m05l6K10k96n8L71n49J5Q6n04O63n7o65N84K57l97J07J2l94Q9
1146e03N72l14K98r9p9M88l71k39O53j41l40L79mp60J027q4o52O18k56o8M28l88
1168A65n36Q33m11n32Q70o34m16R78j96p72P15q8o02Q93k57l75L15j44n2N6k62
1189d52J66M96l14k77Q37Q1p71P55j89j07K38O5n71L05q1k45K62M3N2J5k6n76
1211b94N75k97j88M15m51M7K08n6l67J15j10J37J13l99M15L37m44Q8Q7l63M41
1232IL10n30K93k39J14M99l49J23J7M0k69M51n5n06L08J37m25J39N5p2r9J34j97
$$ plain form
1081 426 291 159 387 117 -129 277 -58 13 20 178 -224 -172 -492 -461 -208 -714 -579 -51 -306 -204 86 -572
1103 -572 -590 141 -215 -254 500 -198 -64 620 117 -128 501 65 333 490 -87 323 802 353 189 885 -166
1124 -166 -286 464 59 23 233 -63 -121 250 -299 -284 -198 -702 -39 -96 -761 -177 80 -317 -210 -198 -592 -503
1146 -503 69 -245 53 -46 -125 363 -8 -247 406 265 -75 304 300 -460 567 483 -169 449 193 125 553 165
1168 165 -371 462 51 -481 389 -245 -661 317 121 -651 64 -24 -626 267 10 -365 -50 -194 -246 -190 -452
1189 -452 -286 210 -104 -381 456 537 -234 521 332 225 463 528 -43 262 181 -64 198 241 293 308 282 -294
1211 -294 281 -16 -204 211 -240 -193 15 -41 -408 -293 -403 -266 -153 -552 -137 200 -244 -156 -69 -432 9
1232 9 319 -211 82 -157 -43 456 107 230 247 287 18 469 414 -92 216 353 -72 67 122 50 -49 85 -112
1255a12k39N34m03Q3jj89mk0K40N5K03l71j64M24j79k68L87k31J47J47M7qk39
1278a61K54Qm6Q9L13m9k61K60j83m29M01k47M08m55O3J73N2k06k83M69l19j81
1300c30J98k85K66K09k78l0L63L7l36L2K09l1J58k57k26M72k39K0N73m10j74M95
1322D36n31K00L65k80j20N9k11J76J82k77o1K17j82j6L53m57P8K05l71j27L67
1343El71j4J39K1n7K25O3L8m7J05O5Mj99J13J31j24p3j3n8j44J81J12K8N1J67
1368C48k19j43O8K83j80j22j17N59m53l4N9j49k05K15R9m03K59O9j07K25k02k76
1390d26K78k19O07l67m4K78j2j29K99J67o35N7K26n4k1K11l2N9l48K19qo9J57
1413A94O0m1l77L63Q3Lm59J26K79m59k3l2L52n76Q41m37J03q6P0K9l44J82k4K56
$$ plain form
1255 -112 -351 183 -220 -137 -138 -327 -331 -351 -111 -56 147 -224 -388 36 -143 -411 -24 -255 -108 39 86 78 -161
1278 -161 93 101 55 144 457 408 147 407 224 -205 196 -51 357 -98 -35 138 190 -16 -299 170 -149 -330
1300 -330 -132 -417 -151 58 -220 -250 113 150 -186 -154 55 24 182 -75 -301 171 -68 -48 525 115 -59 436
1322 436 -95 105 470 190 70 129 -82 94 276 -1 -62 155 -27 -43 310 -147 -69 136 -235 -362 5
1343 5 -366 -380 -241 -220 -277 -52 11 49 2 107 172 176 -23 90 221 97 24 11 -47 -191 -10 102 130 181 348
1368 348 129 -14 54 337 157 35 -82 477 24 -10 49 -100 -305 -90 9 -394 -135 -66 -173 52 -150 -426
1390 -426 -148 -367 240 -127 -171 107 95 -34 265 432 -203 -146 80 26 5 216 184 243 -105 114 106 37 194
1413 194 254 213 -164 199 282 285 -174 -48 231 -228 -251 -283 69 -507 334 -103 0 -86 -16 13 -331 -149 -173 83
1437H3p9L0q0l1J46J00l23M43k2N3k22J45k41J69p7k1M0J83k80k53K42o1J92k03
1461f7k9K23l40K97j1LO6k75j34Q0J77L2r3l8L92k14j59N7R4j5n7J03j59mK27
1486A56k24M4K12j09k48J34k1K55J84K21n15j28J94j56j42L54k90J10j24j83M17
1507A41k88MJ21k13J57N7K13j12q9j34J72J49j93K2n1J00o4K33k50J83k27K59
1529A90k46K23j22j85K74L00m87jJ45q9J8j75k65L34L62m19L40n87K19k7J16k4
1551a06K36nr9J14j74o9Jj48J59P2O1rK86j37q7K36k17k95L39k74k35K51Q3R4
1575G7O4K55o01M43j24k13J95J16k25K74k76k14K98l3o0J34J74l84KJ19k63K10
1597c2k3m02N50k67N4L30j30P3o3j43k6K34K50o74L53R9k13J45q0m7jL5kpk50
$$ plain form
1437 83 4 34 -46 -77 69 169 -154 289 267 320 98 243 2 171 94 73 113 296 16 -237 5 -56 136 -67
1461 -67 -96 127 -213 84 73 76 142 -133 -267 -187 -10 22 -71 -109 283 69 -90 -33 61 46 -11 92 -67 -71 156
1486 156 -68 -24 188 79 -169 -35 -56 199 383 604 89 -39 155 -1 -143 211 -79 31 -93 -276 141
1507 141 -147 -143 -22 -235 -78 -21 192 80 -9 -143 29 178 -15 7 -44 56 -8 225 -25 158 -69 190
1529 190 -56 167 45 -140 134 434 -53 -54 91 2 20 -155 -420 -86 276 -143 197 -390 -171 -198 -82 -106
1551 -106 130 125 26 140 -34 -103 -102 -250 -91 -19 42 33 319 182 95 331 114 -181 158 -116 -351 -100 -17 77
1575 77 141 396 -205 238 114 -99 96 212 -13 261 -15 -229 69 36 -24 110 284 -100 -98 21 -242 -32
1597 -32 -55 -457 93 -174 -120 210 80 153 90 -53 -79 155 405 -269 84 183 -30 115 35 -12 -13 22 20 13 -237
1622b37J48j9J91R9M1l86m8K05k12L5M37m99J81L36l75j5p3Q1o4K35m28L63L11
1645C07k38j33Q3k63K75J77l59R8J59j52J98Q4j59L1P4k26R3J81j41N3j7l08K40
1668E7oq6n6M82o20L15J79m76Q1L95j54k15J50o5o0r9k5M8K41k02J78K08n06M52
1692B16n5j20J00l3j71K40j27j13K47l25K13m0k19J30nj84K16p2R2p0N9K6J99
1715B04j35k28%K70J72m56L12J95p15L97O1K5K6r6k52N16j78j31L35k36j3J38
1737B11l69K75J17k46O0N5m16K62L32m21J93j02j09j36K33O9j16L5J79l0k68O0
1759a32j56J97j98K96q2J4Q7j42j08J52j3k38L15j33J42l37M66m2J31l93K59M2
1781A27j63k9R0k7J3m7J34k78K83R0l27K22p8q5l6N92m78J99j99k60j19N53r2
$$ plain form
1622 -237 -89 -108 83 182 223 -163 -211 -6 -218 -183 254 -245 -64 272 -103 -118 -191 -110 -174 61 -367 -4 307
1645 307 69 -64 19 -244 31 208 -151 -53 106 -46 152 236 77 108 182 -44 49 230 89 142 125 -183 57
1668 57 51 -35 -91 391 -229 86 265 -211 -130 265 111 -104 46 -19 -79 -178 -203 -155 86 -116 62 270 -236 216
1692 216 161 41 141 108 -63 177 50 -63 184 -141 72 32 -187 -57 -62 -246 -30 -102 -10 -80 -21 5 204
1715 204 69 -159 -159 111 283 -173 139 334 -381 16 77 102 128 32 -220 296 118 -13 322 86 73 211
1737 211 -158 117 234 -12 48 103 -313 -51 281 -140 53 -49 -158 -294 -61 8 -108 -73 106 76 -192 -132
1759 -132 -288 -91 -289 7 -75 -61 26 -116 -224 -72 -85 -323 -8 -141 1 -336 130 88 219 -174 85 127
1781 127 -36 -65 25 -2 11 -36 98 -180 103 193 -134 88 10 -75 -111 481 3 202 3 -257 -376 177 85
1804H5L0p8J88j30O0k41j3J40O4j37l9J62m44N89m59L21J6l27M77k06j47L90k86
1827A5M4K42j30l09mR4J7l0j23J26J63o8l31J12K08lP2k02J01J48m28L21k46J00
1851a11M2j71K83j12l4N8j8K83o5k23M4M09k98j40K02j08M5l1o7k5J42k38J86
1874E3l6k21K56J19J04j28k26J01M6j8l46J80J80k09K86k52J60K40n90R6O17m79
1896f7L32m22M05k69J42k52J31j40N5J6j94J16J54J99j63N4l11J61K7J9j9O6k65
1919b25J63M4O5j0Q7j25m2k3j57P0L8J2o5L03p8j79M39l07k39L49j45J74k51J45
1943D3J4j22kq6K26j07j83q7K57R9J04N7l11Q1R7r3j7M3K46j31j77q1J95j97L86
1968B54k69J70k21J75pj65j19O8K29j3k86j48M99j69j37R0nK11P0k95K83j12N9
$$ plain form
1804 85 115 37 225 95 155 -86 -99 41 105 -32 -71 91 -353 236 -223 98 114 -213 264 58 -89 301 15
1827 15 59 301 171 -138 -142 -48 -31 -61 -184 -58 105 37 -294 -182 26 23 95 -107 -6 142 -286 35 -211 -111
1851 -111 -69 -240 43 -69 -103 -45 -63 220 155 -68 -24 385 87 -53 149 41 86 55 -12 -37 105 -133 53
1874 53 17 -204 52 171 275 147 -79 22 68 50 -296 -116 64 -145 141 -111 49 289 -301 -205 412 -67
1896 -67 265 -157 248 -21 121 -131 0 -140 -85 -69 -263 -147 7 206 43 97 -214 -53 -26 -7 -26 40 -225
1919 -225 -62 -18 47 37 124 -1 -43 -66 -223 -153 -115 -103 -168 135 57 -122 317 10 -229 120 -25 149 -102 43
1943 43 57 -65 -67 -153 73 -34 -217 -304 -47 52 156 213 -98 -17 80 -13 -30 13 259 128 -49 -130 65 -132 254
1968 254 -15 155 -66 109 102 -63 -182 -114 115 102 -184 -332 167 -2 -139 -49 -54 157 227 -68 215 103 162
1991A62k19J92J2j57O4k43L31J5k94L43k89J56L9j19j3k52L22k48P5O8k70J07
2013b18Q3K09p5k3J96l63M5J09J01L13n00n0j2K55k91J26K5OL0J31J2j62J13l81
2037c21O35k39m6k08K20n1J35k49m4j5J01n0Q8J68r6j21J64k1lj02J14q3j50K42
2061F8j72J48j79J29j27L73k42j59J4K58K14k01l88K92o2k07J63N4L52k44j58
2082g4J47Q3j16Q3q4J00n82L28K63Pk35j03K83k43O4k63J92N00m67L43j54j07
2104c5K6J47k97M26m12K92l55J80k4M5J37J60l70M2J46j39K6m4j89J62J81j01
2126DO3n0pO0n5k8J57l54M11k60K18j72j9K16l14P8n6P0K58k65J48l31K29K36
2150B37j85j06J57q1r2K2K25j10k7J66j19l58K12n6m0J84J44r3j4J75j37k34j46
$$ plain form
1991 162 -57 135 147 -10 54 -189 142 157 -137 206 -83 73 112 -7 -20 -272 50 -198 -123 -55 -325 -218
2013 -218 -135 74 -1 -24 172 -191 -146 -37 64 377 -123 -173 -185 70 -221 -95 -70 -64 -34 97 109 -53 60 -321
2037 -321 314 75 29 -179 41 -10 125 -124 -168 -183 -82 -132 -44 124 28 -93 71 50 47 -55 59 -24 -174 68
2061 68 -104 44 -135 -6 -133 240 -2 -161 -147 111 325 124 -264 28 -34 -241 -78 -24 328 84 -74
2082 -74 73 156 40 123 39 139 -443 -115 148 155 -80 -183 100 -143 -79 -342 -150 350 -117 226 72 -35
2104 -35 -9 138 -159 267 -145 147 -208 -28 -52 -7 130 290 -80 -38 108 -31 -5 -49 -238 -76 105 4
2126 4 67 17 10 70 15 -13 144 -210 201 -59 159 -13 -32 184 -130 -52 -108 -38 220 -45 103 -228 1 237
2150 237 52 -54 103 22 -70 -48 177 67 40 206 87 -271 -59 -115 -155 29 173 80 66 241 104 -130 -276
2173b76R5m0K22K46l69R1j34J31r4j14QJ65M2J56l01K93Rm29N04q9k57J74J05
2196A38l6j39L5K42m64J94J04j65j31K87j47L64j36l2k24J23j40J06Q8l22J23
2217a32j40J70N6J4J15j71J11K8l8MJ2p6J67j43K36j58j61M58m45j76J04J44J47
2240A26m8l52M86l10k01K67N8J26k48m7J46J32j58L43l83K6j38M23l92K62O1p2
2262A07M3j77o4j57J44J70k84Q1J14o4K62j57j51K72k8l05K67k09J14j97J59J10
2284E0k31R4K14l49K70r4K09j50K26l40l4R9pR9k26L68k76J59m44M22j7N9R1k04
2308a2k5K43m16J86O8j92K23j79K23m9p5j08K38M8k0j44n5P4rk73K57O2l13K91
2332D3m0KmJ29k41J08lo8J44j44o8j45K26J27j26O0O8k15K51P3N1j50l1j69K6
$$ plain form
2173 -276 -181 -221 1 247 -122 -31 -165 -34 -128 -242 -234 -69 -27 129 -172 121 130 -299 205 116 -141 33 138
2196 138 102 -37 -2 240 -224 -30 74 -91 -222 65 -82 282 146 114 -110 13 -127 -21 67 -255 -132
2217 -132 -272 -102 -46 -32 83 -88 23 51 13 17 29 -47 120 -23 213 55 -106 352 -93 -269 -165 -21 126
2240 126 78 -274 212 -98 -299 -32 26 152 -96 -143 3 135 -23 320 -63 -37 -175 248 -144 118 179 107
2262 107 150 -27 -91 -248 -104 66 -218 -137 -23 -87 175 18 -133 139 111 -194 73 -136 -22 -219 -60 50
2284 50 -181 -87 127 -222 48 -46 163 13 239 -101 -135 -36 -43 56 -170 198 -78 81 -363 59 42 101 192 -12
2308 -12 -37 206 -210 -24 44 -148 75 -104 119 70 -5 -113 125 173 153 9 -46 28 19 -254 3 65 -248 43
2332 43 3 5 1 130 -111 -3 -6 -74 70 -74 -142 -287 -61 66 -60 0 68 -147 104 177 228 78 47 -122 -96
2357i6L00k60K9j30L6L03k49j20Q1lJ00KL7j50k17R8M07k47J98j31j68L19j57
2380a8r7J27k17J68J36j15j99K37j68j4M10m72J79O9J22j87j6J72k29K68j07o
2402D3N9j41J28j65J85l38J26N65k87k93J02j17O5N2O6Q7j79o3L78l45J00R6l03
2425a79L3K66l23K44j04Q7J20l53J2J61o6P8l09M39k23k73N85j28k8l7L11k55
2447E8j74K48l45O0K5K39J2j04k90J79N8J26k78L06r1Pj26K56j06j35p9K37r8
2470a5j80K03J13R3k72K4L17j74P1j67r1k9J07L93n95O9J30l3N5k09K09J15l38
2493b04K45l19J10k7K83k16JK28p0j28J16l97M15j47J49j42J72J02k71P2K28r4
2515A06j6m3l64L74J3K33k12k25L6mj54L33j86K22j44J21r6J17k5k27K5J64l9
$$ plain form
2357 -96 204 -56 -27 -157 -121 182 -67 -187 -106 -109 -9 -7 30 -120 -337 -239 168 -79 119 -12 -180 139 -18
2380 -18 -115 12 -205 -37 99 -16 -215 22 -146 -160 250 -222 -43 26 148 -39 -55 117 -112 156 49 43
2402 43 102 -39 89 -76 109 -229 -103 462 175 -118 -16 -133 -68 -16 50 137 -42 -105 273 -72 28 124 -179
2425 -179 -146 120 -203 41 -63 24 144 -209 -197 -36 -102 -24 -333 106 -117 -390 195 67 39 2 313 58
2447 58 -116 132 -213 -153 -128 111 123 19 -271 -92 -34 92 -186 120 29 36 -90 166 60 -75 -154 83 -15
2470 -15 -195 8 121 214 -58 -34 283 109 180 13 -78 -107 0 393 -202 -133 -3 -36 19 -190 19 134 -204
2493 -204 41 -278 -168 -195 88 -128 -127 101 31 -97 19 -378 37 -110 39 -103 69 171 -100 -28 200 106
2515 106 90 47 -317 57 70 303 91 -134 -98 -102 -256 77 -109 113 -31 90 -6 111 86 -141 -116 48 9
2538Im56M82J71k34M3R7q8P6P9k04J76k64L49j35k3J61k03r9j6K35l25M1m8L16
2562A40M5k41N9j39J08J98k64J02K59l19j4N7J2k24J95J35k60L45k30o5J42o6
2584b5L35j35l58J65K0K64j39n6j57j45K22l8R0R2R6k50J23k4j20j01N51L4m81
2607c7J38k56K31k1o6k6J17q5m06K16J18O7r5J96k88K18j49R8J0n8J65j00J4m0
2631c9mK8J40p5k24M18l92Q3j12J24q5L21k32N5K00l64J28J96jk24j35K82k49
2654a61K07J8J00j46j21K71n4j96J54j93K33j51J03j22j29O9J26j29j50K68M5
2675D2J20l28J0Q7J57j55K64j97l2J2K22m69M57k06o6J11j22J36j80Rj91M12j29
2698c6k18K73j61M73m25J87q2Oj4J37j84o3K7J00L5L7k25J79J12k12j40J63R1
$$ plain form
2538 9 -447 35 206 -28 15 112 24 100 179 -25 151 -113 236 101 78 239 36 -63 -79 156 -169 -128 -176 140
2562 140 185 -56 3 -136 -28 170 -94 8 267 -52 -66 -9 3 -221 -26 109 -151 194 -36 -101 41 -25
2584 -25 310 175 -183 -18 2 266 127 71 -86 -231 -9 -47 43 135 231 -19 104 80 -40 -141 410 444 -37
2607 -37 101 -155 76 55 -11 -37 80 -5 -411 -195 -77 -10 -105 91 -197 21 -128 -30 -20 -78 87 -13 1 -39
2631 -39 -43 -15 125 50 -174 244 -148 -65 -177 -53 -138 183 -49 6 206 -158 -30 166 165 -59 -194 88 -161
2654 -161 46 64 164 18 -103 168 114 -82 72 -121 112 -39 64 -58 -187 -118 8 -121 -271 -3 42
2675 42 162 -166 -156 -69 88 -67 197 0 -32 -20 202 -267 190 -16 -82 29 -93 43 -137 -128 -319 93 -36
2698 -36 -254 19 -142 331 -94 93 11 17 3 140 -44 -107 -80 20 55 92 -133 46 158 -54 -194 -31 60
2721F0ko8o1J85j54j95K41J66M1o1L1j58j38J94j70P1N4J9J06j75J26m6p6j09
2745a19j4J73j22J61l68N04l27J15j18n0q0J81L9J88r6lK7l27L90n3k67l3J15
2768h4M18M2k02J17l76j39K4J24J07j7j3k5J0r4Q2p6K63k64J5J02Kq3K23j98L8
2793dJ70Q5k13Rl2j85K38l00J19L83p5O1l54J27j68L73l12r4K81l07L1J85Jj38
2817a19M7N0k17L41j55J60r6m0j07k55M79j67M14o70L28n2J31oj52K48l66K92
2839H8j02J46R4j51J1j51Q4J75r5pJ07l07K44j88K90j39R1k73Q7L4j38Q3m0J91
2863A34L3l55j9J62%K75m32K65k21K22j35J40k25M05j27q4n6l1J03j04J78j33
2885el02N26k02j86JK55k21L73k18M0J29m06K51j73R6J16k1j65j15L48j98O1j60
$$ plain form
2721 60 58 -10 -71 114 -40 -235 6 172 213 152 183 25 -113 81 -89 -18 36 55 161 -14 112 66 -10 -119
2745 -119 -133 40 -82 79 -289 215 -112 3 -115 -165 -245 -64 -25 163 67 64 91 -236 154 101 -166 -199 -84
2768 -84 334 376 174 291 -85 -224 -200 -76 31 14 1 -24 -14 -108 -26 -102 161 -103 -88 14 16 -67 156 -42 -4
2793 -4 166 251 38 47 15 -170 68 -232 -113 270 195 256 -98 29 -139 234 -78 -172 109 -198 -167 18 19 -119
2817 -119 -72 -22 -239 102 -53 107 11 -29 -136 -391 88 -79 335 -335 -7 -59 72 66 -86 162 -204 88
2839 88 -14 132 226 75 86 -65 19 194 99 92 199 -108 136 -52 238 99 190 -83 4 38 -100 -17 -57 134
2863 134 167 -188 -207 -45 -45 230 -202 63 -158 64 -71 69 -156 249 122 38 -18 -49 54 -50 128 -5
2885 -5 -307 219 17 -169 -168 87 -134 239 21 61 190 -216 35 -138 -42 74 53 -112 -227 121 -77 -16 -176
2908a76J08ORK87k34qn2p1K70r8Pj54J8j28K85o8K8K9M4j23r2j04K48k66K38P
2934A0R3q4l1J97r1M6j24j97K30j05J1j02J07K8j56N0J62J1k4J79l04NN5J25j52
2959f1L9L1K6o4j09j1q9M33l51M12k28j07O8n3M0N3j97j44M50R5j90l0K48j96
2983F5R0n0k05K38l93j05L11p9J72K21l83K01j53Q6j5k78N09j44l58L23%p0K07
3006A90j37Qk4M1O2n4N2j52Q0n9J17j21j12J60k36J91J07nk80J82j82K06j5J02
3030A21k13Q0P6p1j13R9J64k9J65k97K9n9K17r4m3O7m72K66P3j7q9L66k75J20
3054G1K8k62J87M34o08K75k31J53J3l9J10k71o8J54K09m72L22J36j39k48J91K52
3076A97j02l8m8J75o8j70K86l64L39l05N3mj73K83j13Mo1K33k68J68J24P6k04
$$ plain form
2908 -176 -68 -62 -53 234 0 -8 -60 -131 139 41 48 -106 -88 -216 69 1 29 58 102 -21 -113 -217 31 -235 3 10
2934 10 103 19 -12 185 94 140 16 -181 49 -56 -45 -147 -40 -12 -168 -118 44 55 31 210 -94 -89 -34 91 -61
2959 -61 -22 9 35 -29 -138 -149 -238 195 -156 256 28 -79 -11 -64 -24 29 -168 -312 138 233 43 13 261 65
2983 65 155 105 -100 138 -255 -360 -49 -128 44 265 -118 83 -70 16 1 -277 232 88 -270 53 53 -17 190
3006 190 53 61 37 78 140 86 138 -14 66 7 124 3 -109 51 -185 6 113 108 -172 10 -172 34 19 121
3030 121 -92 -12 64 -7 -120 -21 143 114 279 -18 11 -48 169 75 32 99 -373 -107 -34 -51 -140 226 -49 71
3054 71 99 -163 24 458 -150 125 -106 47 60 21 131 -140 -208 -54 155 -317 5 141 2 -246 -55 197
3076 197 95 57 9 184 116 -54 232 -132 207 -98 -45 -49 -222 61 -52 -48 -109 124 -144 24 148 224 20
3099B0Q8J7J65k58k57J05K17k78K30l00L78j0o3M4j04J12K9j97P0j3l09O42l58
3122c0j96P8Q6j08L47j99j07J85oL5l22J9M00l89J53K6j5pK4p2L37Q0n16M40j81
3147F2j34N6J44J71j67j10O9l14N0K38n9N2M4M3k34qJ04j2k13N76l64n5j6K05
3171A28j66JJ05N5j09j42J43k15J94j06J31K81l74L3J84k36J09j90K59J68m27
3192a74p8L36m37M34J6l24L4J23p5K08R4J60j48j58K9j53o7J83O4P2p1k8k03K87
3216A24j43R5l3K85k21P9k99J22Q9P4k07n8k50K66L0J6J02j06N3k9K20m25J77
3239c9R8n1n5L4k6j44K63m36K23Q0o9J48o3j0K0l3J89n1j76J31O7m0K55l58J25
3264H2j43K34p9j90l9q1J37p2L50l34J00p2N1l0K9J97j67K20j36q5j12K89l86
$$ plain form
3099 20 108 125 290 32 -225 -120 97 -181 49 -251 127 117 54 98 -6 106 135 -62 8 -5 -314 328 -30
3122 -30 -226 -148 -62 -170 177 -22 -129 56 50 85 -237 -218 182 -207 -54 -28 -43 -50 -26 -98 239 319 -197 243 62
3147 62 -72 -16 128 299 132 22 91 -223 -173 65 6 58 102 145 -89 -97 7 -5 -218 358 -6 -61 -77 128
3171 128 -38 -37 68 123 14 -128 15 -200 -6 -112 19 300 -74 -41 143 -93 16 -174 85 253 -174
3192 -174 -252 84 -353 81 97 -227 -193 -70 -145 63 157 317 169 11 40 -113 -180 3 67 139 68 40 -163 124
3216 124 -19 76 43 328 107 186 -113 9 98 172 -35 -93 -343 -77 -47 -31 71 -35 18 -11 209 -216 -39
3239 -39 59 8 -47 -13 -39 -183 80 -356 -133 -53 -122 26 -37 -47 -27 -60 129 78 -98 33 100 60 315 -43 82
3264 82 -61 173 94 -96 -135 -216 -79 -151 199 -135 -35 -107 -56 -86 -57 140 -27 193 57 -28 -140 149 -237
3287b37L32k56L11j22o1L16k24j13r4Q8P1K19j11k19nK97r2m3j18oK61k36M2K66
3311B66l75K4M1l1OL52l99O4j4j14K18k00K23j22p1M29l30o3K01k30J62M8k49
3334a64K13j14m3L9M7R2l04J46O0q6J60k9J31j08R0P3j75L58p4n91L13J91k20
3357EM2r2j7o3L15m98M29j66J32l56P4J86o4R5K91M5p29M82n0Q1j67J0J01J63
3381B49m65K82j23k38O5P9L11n3L3N0j70j21j45Q6L17J79k39q3k00L44k69j51
3403b62L64p0k33J62O9Q4J54p9j93M9j39q1J07k38J98J57l61K38KJ8L1q5K87n1
3427A28j01j40J40K2K9o2J35j4k03J19j94J72J11r8N9K1M3j26k16Q1K40m30J47
3450a37J32N4K4J33j82K39l04j01J49k53L14jk29J90M2M6k1k55k3L75l74K46q1
$$ plain form
3287 -237 95 -161 150 28 -33 283 59 -54 -148 -60 11 230 119 -100 -105 192 100 57 -61 -67 194 -42 0 266
3311 266 -109 -85 -44 -75 -69 283 -116 -52 -66 -180 38 -162 61 -61 -132 297 -33 -96 105 -125 37 85 -164
3334 -164 49 -65 -108 -69 -22 70 -234 -88 -28 -114 46 17 148 40 130 203 28 386 312 -279 34 225 5
3357 5 47 -45 -62 -125 190 -308 121 -45 87 -269 -195 -9 -73 22 313 358 -371 111 61 142 -25 -15 86 249
3381 249 -216 66 -57 -295 -230 -151 160 107 140 190 20 -101 -246 -160 157 336 97 14 -186 158 -111 -262
3403 -262 102 32 -201 -39 30 114 268 189 -4 45 -94 -175 -68 -306 -108 49 -312 -74 -72 -54 -23 -108 179 128
3427 128 27 -113 27 49 78 16 151 137 -66 53 -141 31 142 44 103 124 167 41 -175 -94 146 -284 -137
3450 -137 -5 49 73 206 24 263 -41 -142 7 -246 68 67 -162 28 70 116 95 -160 -183 192 -182 64 -17
3473a7j23O2O2L15l87Q3j94J63R1K4oj37K81k22L9qq7K0L10l32M1J74k5j11k78
3498b62k8M21o0j21R6J71k75rK73l54L72J7j75Mo0K1J36j96l3J27p7j2J45J62
3522B83k50L0O2k78r1L09j38J03l8j20K04j53O3j90L37k77L00q9j2m9k06l5M25
3545A90p5l43R6P7M2L1j3JL3J61n0k49P0K11k48K57j12r8l04P1L67p8o4J04k24
3570a47N17l55j17K10J14l35J61j6k0Q6K8k46j40K11K51l30O4N6P2M3J25r0k17
3593g5N3j28n7n9K56j6MJ26k6l11L56r3K0O0q8l2L3r2n7K84j59L4J32k88M3n1
3619a31L49j42k13R5J92k15j02L39n19N74l37O1l3K68k38J85o8MP1k56K63k41
3641i4J18P9nl44Q2J52J35j98J06J5k12L57N0k7l7j67k53p8L10kJ55L8l42L79
$$ plain form
3473 -17 -140 -78 -16 299 -88 -5 -199 -36 55 79 73 -64 217 -5 34 26 -61 -41 269 -63 -22 152 127 16 -262
3498 -262 -290 131 71 -50 46 217 -58 -67 206 -148 224 241 66 70 10 31 167 -29 -62 65 -12 -24 121 283
3522 283 33 63 125 -153 -244 65 -73 30 -8 -128 76 -77 -14 -204 133 -144 156 67 55 6 -200 -235 190
3545 190 115 -228 -132 -55 -13 18 5 6 39 200 150 -99 -29 182 -66 191 79 -19 -323 -252 115 37 -27 77 -147
3570 -147 370 15 -102 108 222 -113 48 32 12 98 126 -120 -260 -49 202 -128 -64 -8 64 107 232 142 -75
3593 -75 -22 -150 -207 -266 -10 -26 -22 104 78 -233 123 30 50 110 22 -10 23 -69 -126 158 -1 33 165 -123 -80 -131
3619 -131 218 76 -137 -42 150 -65 -167 172 -347 227 -110 -49 -82 186 -52 133 65 69 140 -116 147 -94
3641 -94 24 103 98 -246 -164 -12 123 -75 31 46 -166 191 241 214 177 10 -243 -321 -11 -13 142 180 -162 217
3665B17j08Rl40L9j8K74k8J19j90l6K08m7l83J11K19m5j01M3K00l09J12j18K8
3688a44J26J34jk10M7Q9j72nK06j69l2R2J69j97K53k03L4Rk4q2J18j57K63o9J5
3713I0Ok87L38l01J1J81J81j09k41N07o05O9R8j0K34k12R8m9J01r7j7j9L3Q1p5
3738FJ2K97l53m5KP3q0m6J22K53m44K05J40n4j31P0r4J14k54J96L38k33k30K39
3762A03r2N8J05l10n3mL73k39J69J09l45J43J36k03J80j60l2p5K6j2K04l76L15
3785B0k34L85j16pJ37l1o1q7k51K26l3j09K01J80m92K51k4nj26R9OJ14J10o1k28
3810a36K89p2k09PK88n6k04N5j6K21j86q9K20n4k57Q0j34K57k32Q1j03K09j76
3833b17Q2K37l87M20Q4j51j21L13R6m04j81K08J24r5J49l36L08m3k74K58K3k60
$$ plain form
3665 217 109 118 -222 -183 -201 73 45 164 -26 -62 146 99 -284 -173 46 1 -100 -57 143 -166 -54 -172 -144
3688 -144 -18 116 115 -95 -48 41 -131 -136 70 -99 -131 -39 130 -67 186 -17 17 26 2 -80 38 -119 144 75 90
3713 90 96 -191 147 -154 -143 38 219 110 -131 376 -229 -160 -62 -72 162 -50 48 -1 100 3 -14 -33 0 81 6
3738 6 18 315 -38 -83 -81 -8 -88 -134 -12 241 -203 2 142 88 -43 27 -67 47 -207 -11 327 94 -136 103
3762 103 11 69 174 -136 -189 -193 180 -59 110 219 -126 17 153 -50 130 -30 -62 -137 -111 -123 81 -295 20
3785 20 -214 171 55 48 185 154 93 6 -245 -19 -52 -161 40 220 -272 -21 -45 -50 -176 -77 -71 43 153 92 -136
3810 -136 153 81 -128 -121 167 111 -93 -38 -54 167 -19 -108 112 58 -199 -119 -253 4 -228 -147 -250 -41 -217
3833 -217 -135 102 -285 135 219 68 -53 260 356 -48 -229 -21 103 8 157 -179 129 86 -188 70 93 -167
3855a67J23j18P2J50K8k90K68K76n30J96p6j68L32l01L01o3P2m6J21rp4L3L5k05
3879d0j5K03r0j8n2J20j74Q5Q8j45K62j95J3r1j56K54l07K30J99l47K4J36j68
3902a84K23J32q0k7j69RK46l57L96m98L37K32l29k4lL45l18o9O0r5l2J14K7J81
3926A17j09j43K06l5j92J79k06J76n1J65j7j09J45q9k28J73j38J02q1L48j11j03
3948aJ95J7l14J91q8p7p5J87l0K38j48r7N7k15J51r8J94k66L12o4J4k15j5K8L74
3973B55j67o0J17j60J10m2K91m37K42m36P2M9K58j05k25K69k13J55j2l3O7p4r9
3996a78K42j09J69j11j8K4J06r9m3%j10K49K2k3O4o8l11L9j71M96J10l1n56O28
4020C21l62j2K25j96M8j1K8O0m8l47K01K47k61l4M9oj48M55n7l75M07l20K43J48
$$ plain form
3855 -167 -44 -162 -90 60 88 -202 66 342 -188 8 -68 -236 96 -205 96 33 105 59 180 171 97 130 165 -40
3879 -40 -55 148 58 40 -12 108 -66 19 107 -38 224 29 42 -49 -205 49 -258 -28 171 -176 -152 -16 -184
3902 -184 39 171 91 64 -105 -96 150 -207 189 -309 28 260 -69 -93 -96 249 -69 -138 -78 -173 -205 -91 -64 117
3926 117 8 -135 71 36 -156 23 -183 -7 -58 107 90 -19 126 37 -191 -18 -156 -54 -135 213 102 -1
3948 -1 194 211 -103 88 0 -77 -152 35 5 243 95 -2 55 -160 -9 -107 87 -179 133 69 83 -132 -147 -119 255
3973 255 88 28 145 -15 95 53 344 -93 149 -287 -215 -166 92 -13 -238 31 -182 -27 -39 -72 -5 -79 -178
3996 -178 64 -45 124 13 -5 19 125 26 -17 -17 -127 122 144 121 185 117 -194 -155 -326 170 280 249 -307 321
4020 321 -41 -53 172 -24 24 13 41 101 53 -294 -93 154 -107 -141 -92 -98 -246 209 152 -223 184 -136 107 255
4044B55l91L50l58J36O4k16j3K09MN6J27k30o0R0o1mP9j94J46K01j12r8J65j59
4068a4l00K46k3j6kK15j81L02m19K43j23L80m91J10R1Q4J5Q7%k18r5J98P8k24
4092e7M07m91K46j01R4J02l46L52k55j58K56q4J04N3j46J1J03j44K45k65j32K64
4114E8mK9k70K87R4k93K3M6K19n9Lk83K28p3R3o8k8Q0j75j26K13K44l55J38L8
4139E9j84K27k59K3K77j46O9j76K31l63K88l9J9l51L2M46J6l31J63L63k75k76
4161a87J23k7K74J9l30K00O1m11K29J54J53k33k1J97j64j21K45j51j43L83j69
4182H1j77L25m50M00k98J52L10k53J48k74q6J74K12j60l35J17P6J19M4n9K0j28
4204d2j1J66j70J17n9k02N8J08L6P7m7m1k02m9L58J35r6j43J8p9J17k02J23k58
$$ plain form
4044 255 -136 214 -144 -8 56 -160 -173 36 40 96 223 -7 -67 23 -38 -42 37 -157 -11 190 78 -20 145 -14
4068 -14 -314 -68 -91 -107 -109 106 -75 227 -192 51 -72 308 -183 -73 18 102 117 204 204 -14 -109 89 167 -57
4092 -57 350 -141 105 4 98 200 -146 206 -49 -207 49 -35 69 122 -24 -13 90 -54 191 -74 -206 58
4114 58 54 83 -187 100 194 -99 -76 -30 189 130 133 -150 78 5 98 30 2 82 -93 -219 -6 238 -117 21 59
4139 59 -125 102 -157 -134 143 -3 66 -110 121 -242 46 7 26 -325 -293 153 169 -162 1 364 89 -187
4161 -187 -64 -91 183 202 -128 72 133 -278 -49 105 258 25 4 201 37 -84 161 10 -133 250 81
4182 81 -96 229 -221 179 -119 33 343 90 238 -36 -122 52 264 104 -231 -114 -38 81 125 66 86 -42
4204 -42 -53 113 -57 60 1 -201 -143 -35 1 78 31 -10 -212 -261 97 232 136 -7 11 -68 49 -153 -30 -288
4228b88K31J49k2k59M40k52n2J10r3qR1N0q1QP5k04L27k37j86K73l21K78J04J0
4252A43j97j47J28K48k22J01N4j39j54J34J32q2l4J07K04k13j31k33K35P1j24
4273a19J98m9k00j2J81J50p0j06K0k37J02J93J50k77K29k40M8R4j35j9j03K69
4295F7m9j59j68K85M1j90K12j09J07k83O14m96J56j88J48O4j97J20J54l46L08
4316I1j51j85J67l1K38k48K96j11j63J78j23K53l31J61p7rr7J87k7j65K84M1m34
4339b56L63j21j19mO9K93k28k50K85O8J07q1R3j69k62J13P3q1J62k3j11M9J37
4362A07l45L36k39K80k21l1r2O3L51k35J71j00k14J60M97m07J06j16J27j0k80
4383i2M42m90O2K36kk83K14k07K59%j69j80J63O2l9J40l1k02j16P1M3M87m03l6
$$ plain form
4228 -288 -57 92 70 -189 251 -1 -53 57 -36 -44 47 97 16 24 99 -105 222 -15 -201 72 -249 29 133 143
4252 143 -54 -201 -73 175 -47 54 108 -31 -185 -51 81 -1 -35 72 276 63 -68 -301 -66 5 -119
4273 -119 79 30 -170 -182 -1 149 79 -27 -7 -244 -142 51 201 -76 153 -87 -39 55 -80 -99 -202 67
4295 67 18 -141 -309 -24 17 -173 39 -70 37 -246 368 -128 28 -160 -12 52 -145 -25 129 -217 91
4316 91 -60 -245 -78 -109 129 -119 177 66 -97 81 -42 211 -120 41 -36 -45 -142 45 18 -147 137 178 -256
4339 -256 107 -14 -133 -137 -68 225 -3 -253 32 100 207 126 219 50 -212 -99 -26 -107 55 32 -79 -30 107
4362 107 -238 98 -141 139 -82 -113 -205 -142 209 -26 145 45 -169 -9 488 81 187 71 198 188 -92
4383 -92 350 -140 -78 158 156 -127 87 -120 139 139 -30 -210 -47 15 -24 116 85 -117 -233 -162 -119 368 -35 -71
4407g1k5r9K58L9J12m95K71r0K14lj8k88J01N3m2o4R7J07l10Q1K29j6J18jk47
4432h9J79jk94J26J2J31P7n23K27Q6J59l36L11k50J89j25J71k04J65j43R2J23
4454H3j73r7J97j51o4K71j9j47K20r2l66M47j63O0q4J55m2m9o3M5J17k54N0Q4
4478c5R6K5k31O3K0K41k62J60m7J51k39j32j8j97J49J89q8q3L86j76K08j72j52
4501a44P4K42l97L47Ok59K85m4o7P6o9M8Rk60J35M8j04P7jM2Q7p3M4n9m6o3K0
4528d6J54Q5k79M5j9%r3J22J59pMj43K9P4l40K47o4N9M2O5j82l9r8J40L48l40
4554g7m7LJ44k11J40j17J40J36n4j37J96k78q1P3J27J36j28J10j06m8n2J07K80
4577B56j22j64J56l61K23Q1J78l08K75j44j37j9J87j51J96j29N8J7k53J57J80
$$ plain form
4407 -71 -96 -195 63 102 214 -281 -10 -100 114 111 93 -195 -94 -41 -83 -147 -50 57 -253 -172 57 41 159 158 -89
4432 -89 90 89 -205 -79 -67 64 141 -382 -155 -69 90 -246 65 -185 4 -121 50 -154 11 -132 -40 83
4454 83 -90 -187 10 -141 -205 66 47 -100 120 28 -338 109 -54 6 -78 77 35 -14 -77 -32 85 -169 -119 -35
4478 -35 61 86 -145 -82 -62 179 -83 77 30 181 -58 -190 -208 -405 -256 -67 -155 -238 148 -28 180 8 -144
4501 -144 -70 172 -225 122 128 -131 154 110 43 119 50 98 107 -153 -18 30 -74 3 2 44 131 58 102 43 -3 -66 -46
4528 -46 108 193 -86 -41 -60 -60 -153 -31 128 121 125 -18 11 85 -255 -8 -72 -13 29 94 -88 -127 -225 -85 263 -77
4554 -77 -124 -121 23 -188 -48 -165 -25 111 57 -80 116 -162 -243 -170 -43 93 -35 75 -31 -79 -131 -24 256
4577 256 134 -30 126 -235 -12 69 247 -61 214 70 -67 -86 101 -50 146 17 75 92 -161 -4 176
4598A76j48K2j80L99j15m42M24j41k6M7j18K80p3j29J86j13K6q5J48j04j34O9
4620c1j41J14J63K80m54r9K22R8l6k68O4M4Q7J30k73M3lm3K50L5l38L03o8l0P5
4645A24j56M4n0K70l55o5K16l8K69l12k7K68p4J60m62K23n5J31j98K9o8K7K26
4668A27j94n6Q0R1k49K11k5r5r8j5N13l72J40j18j4l4J91k36O2L0J84l27j60K77
4692h7K6J2j25M08j78j85J35J93l54n1J74Rl87M43k22L40j42j05j06K08J63j08
4714F1q9L01l26Q5o8R3j17j24J86j87L28r4J4k32k2K40J05r4o7j18J90O4r2m8
4738a1J52j76r7J62k34J72J67j90L7n0L2k97L65K36o15M82j51R3J56k33j31K70
4760A39j22k43L43l70L90j67J49k35K32O5n29M62k19J47J61K7m31L86l82K01L3
$$ plain form
4598 176 28 50 -130 269 154 -288 136 -5 -31 16 -102 178 105 -24 162 49 75 -10 138 34 -100 -31
4620 -31 -172 -58 105 385 -69 -168 54 152 116 -152 -88 -44 43 173 -100 -57 -60 -103 147 182 -156 147 79 49 124
4645 124 -32 12 -38 232 -123 -188 28 -10 259 -53 -80 188 114 274 -188 35 -20 111 -87 -58 -126 -99 127
4668 127 -67 -123 -43 48 -201 10 -15 -110 -208 -223 290 -82 58 -60 -74 -108 83 -153 -91 -61 123 -204 -364 -87
4692 -87 -61 -49 -174 234 56 -129 6 199 -155 -206 -32 -23 -410 33 -189 151 9 -96 -202 6 169 61
4714 61 -28 273 -53 32 -36 57 -60 -184 2 -185 143 49 63 -169 -191 49 154 60 -7 -125 65 129 37 -11
4738 -11 141 -35 -132 30 -204 -32 135 -55 -18 -68 -36 -333 32 268 -347 135 -16 77 233 0 -131 139
4760 139 17 -226 117 -253 137 -30 119 -116 116 181 -348 114 -105 42 203 230 -201 185 -197 4 37
4781C7j95L24j73j37K99j82K7J27q7O4k76K17l14L29j73PK85k77J76O7j12L41
4803C74k04JO5l16J12N7k5j17R5J38k94J47o2K2K27k78j06K76M7l23K58n5J76
4826B15k12n0j28L73j37o5P3j14J13J56j40J03k48J89l80L64J7j00K66j75o3m16
4848c59N44p5j9m4n8j7j75J05j63L69m8J02m7qk55K53q4NR5K3l65L95k09N2J01
4873A18k48P9k3N5l36P99j22l13J71q1j66J99k71L09K2l61%J42o8k1L09m4r4j60
4897a05PQ6J22j26K7Ll0J12j46l9R5J54j08l90L47PJ13k52J30k3K2j24K41j17
4921Fp3K03j85j6K7k76M16Q4J12m77K56k08K20L0l0p8j85K66j85K05l18L14q9
4944A9kpmk14L59k23J02m2K45j80j73K36k71K65o9r1n1R1J01K6l11J77p1J23J96
$$ plain form
4781 37 -158 166 -7 -144 155 -27 0 127 40 104 -172 45 -269 60 -113 -106 179 -98 78 145 33 374
4803 374 170 171 236 -80 32 89 64 -53 42 180 -114 33 -29 -7 220 -58 -164 112 159 -164 94 39 215
4826 215 3 -47 -175 198 61 -4 69 -45 68 224 84 187 -61 128 -252 112 129 29 295 120 57 -359
4848 -359 185 110 91 47 -11 -28 -203 -98 -261 108 60 162 115 107 -148 105 21 26 121 144 -221 174 -35 17 118
4873 118 -130 -51 -74 -19 -355 444 322 9 180 99 -67 132 -139 170 192 -169 -169 -27 -95 -116 193 149 55 -105
4897 -105 -98 -12 110 -16 11 14 -16 96 -50 -89 6 160 52 -338 9 16 129 -123 7 -16 6 -118 123 6
4921 6 -67 136 -49 -65 -38 -314 102 186 298 -179 77 -131 89 119 89 11 -174 92 -93 112 -206 108 19
4944 19 17 10 6 -208 151 -72 30 -12 233 53 -120 116 -155 110 41 -50 -101 -10 91 117 -194 -17 -88 35 231
4969B31l38j2JK84j87j65ml3K61p4j82L40q3r7L83m63L85j23j02L1J5J14m3k19
4993h0J10k22J29o7M8j30K75k77J9L07n7J33m45M52j40L5j27J45p0k29P3N38m10
5016A0qJ32j51k5n9K21ok48K5K5j05K59j21M79k88j02N0q1j03j0P9k59Q3L00k52
5041a55L92k03j42J17m1O6k16K94k35K96j70L83m44P1j52p0J98n7j71K51j59J52
5063EN6j5J30j42L5J85l49l5N9J60k14J88J79m52M42k56R5j21L09k73K9J36k19
5086f8n0J40l48M31j26rR0l92M02K16k25k46L08j97K26M2q9j49o5J55j64J99J1
5109I2n6m7J33j56J80m4j4l33M2K02rK23q3J29l96K62l71K04Q3k7O6p4O1k3l42
5134b98M12m0k26K3L4K39Pj87M7o8j42K84p8J01k80J92r8m4N8q2J97j18j8m5K32
$$ plain form
4969 231 -107 -119 -118 166 -21 -186 -190 -223 38 -36 -218 122 39 -58 325 -138 247 124 22 53 68 182 139 -80
4993 -80 30 -192 -63 -130 -82 -212 63 -214 -195 112 55 188 -257 195 55 90 -37 108 38 -191 -118 420 10
5016 10 2 134 -17 -42 -101 120 114 -134 -109 -84 -189 70 -51 428 140 38 88 7 -96 -106 -27 -286 -203 97 -155
5041 -155 237 34 -108 9 -32 34 -182 112 -123 173 3 386 -58 13 -139 -209 -11 -68 -239 12 -147 5
5063 5 61 46 176 34 69 254 -95 -130 -71 89 -125 63 242 -210 232 -24 71 -50 259 -14 15 151 -68
5086 -68 -118 22 -326 105 -21 -30 60 -332 70 286 61 -185 123 -74 152 194 105 -44 -109 46 -118 81 92
5109 92 36 -11 122 -34 146 102 88 -245 -203 -1 -10 213 130 259 -137 125 -246 -42 41 14 80 6 67 44 -298
5134 -298 114 74 -152 -129 -95 144 151 -36 11 -57 -199 85 7 108 -172 20 -78 -122 -64 -146 51 -67 -85 -130 102
5159A02r2j0l8p3K94k64O8Q9N2k38K40k50K98j92J54k0k57J31j01J95o7J40Mj96
5183c1Q7J38j79m1k6Q8p6L52l92L27j77r8K57j57k06M9k3L64l81J31O2j31J67
5206A04l98J84K58r0LJ08Kl68J62j53q1K22J14j87m9L28j08q9J23O0j60l21L29
5229grkj86Q7K82j54o3l0N3n1k9j03J64l1M6J5L9m7j54Q3J6k8J86q5K58k78J27
5256I9m0Oj7j14J46J02Ok35R5N5o0j5J54k15J38l5j73O5j51K29j21K46o0j07J35
5281A33j38Q0qQ4j55p5Nj69M44k4m31L29P4j62l5Q3j28k3R6n6k23K17J16k53J95
5306b4k02M14k10k1M9k12O4K67j35J67l56L69l49L65k05L8j47L53n1k77R5K5R5
5329A12k46K25k49J58l0J5P4k0lj49J91J0r4J8J18j52J07r6l3l6J45K6q7J5LJ62
$$ plain form
5159 102 10 0 -38 -111 183 -81 -13 76 128 -110 130 -120 178 -14 140 120 -137 -6 -107 88 21 161 165 -31
5183 -31 56 194 15 -26 -52 36 -40 312 -80 247 70 -28 229 72 -134 -85 -108 256 -125 6 68 -63 104
5206 104 -294 -110 148 58 61 169 171 -197 -35 -188 -269 -47 67 -120 -169 159 51 -38 85 145 -15 -336 -7
5229 -7 -16 -18 -204 -117 165 11 -52 -82 -29 -80 -109 -212 -48 -79 -33 -18 21 -26 -180 -97 -81 -109 77 -8 250 -28 99
5256 99 59 65 48 -66 80 182 188 -47 48 103 43 28 182 -33 105 70 -103 -38 -189 40 -81 165 105 -2 133
5281 133 -5 75 67 151 -4 -79 -74 -243 201 177 -254 75 149 -13 -48 35 -93 -116 -20 -76 -299 -82 34 -219 -24
5306 -24 -226 188 -22 -43 6 -206 -142 125 -10 157 -199 170 -179 186 -19 19 -128 225 174 -103 -8 17 112
5329 112 -134 91 -158 0 -30 -15 59 39 36 -113 78 88 -6 12 130 -22 85 -11 -44 -80 65 91 4 19 22 184
5355A84n8j39n3O1k65K93q6L45q5j16j19N6l28K12M9J66j62O0k70K06J29k0O5
5378A25j73m4J35N1O3o3J5j28k28M37J64k30n3o6L8l6j44K40J06Kk37k5k7J31
5402E3k65K46Q2r4o0jJ34n3j49J44J40k84J12J38q7LJ32l2q6O1j45O0j71J92k02
5427a32Q7m1L48k12j16L72m20n7J96k45J66K08R8k75J38j43J63m5l47K40k3J2
5449b8Q1j2J24N6j85Oj6O1j63K17r8k30J41J19j37M5j0KJ11N2j62L2m5J43k0l24
5475b40L53r5K8j35J73j64p0L10j0l71j43O54l47K65j81k04M47k55l5L5J62j53
5497B4o3q6K58j58kpm0q4R0J55Q9k54J26j59l6J38K02j83Pk90K24p0K83m71M92
5522A85n3k36J42j21N9P6L7m20K88P2L1k2j95L00K6k57L19l89K12lj07J03Lj62
$$ plain form
5355 184 126 -13 -66 -5 -270 23 -63 282 197 81 -38 18 -310 -98 -49 117 -45 15 -255 -49 80 60 125
5378 125 -48 -92 43 94 157 94 109 -19 -247 190 354 124 71 5 43 7 -137 103 209 211 -26 -51 -78 53
5402 53 -212 34 116 22 -38 -39 95 42 -107 37 177 -107 5 143 56 59 191 159 73 134 -11 49 -122 70 -132
5427 -132 -45 -86 262 50 -66 306 -114 -171 25 -220 -54 154 252 -23 115 -28 135 90 -257 -17 -40 -28
5449 -28 53 41 165 221 36 42 26 87 -76 141 43 -187 -46 73 -64 -19 -29 -27 84 136 -26 6 -39 104 84 -240
5475 -240 113 18 46 -89 84 -80 -150 160 150 -221 -364 290 -57 208 27 -177 270 15 -20 15 177 24
5497 24 -39 -125 133 -25 -27 -34 -74 -158 -68 87 176 -78 48 -111 -147 -9 193 10 17 -273 -49 -119 164 -307 185
5522 185 132 -104 38 -83 -24 52 89 -331 -43 29 60 38 -157 143 169 -88 231 -158 54 51 -56 47 50 -112
5546a12N4lJ39k01K88n02L23K66k20K0k31R7K93l79K69j28o4Q4j63L22j7j25O7
5569G7J3j60K05k65K71m9n5j24R4K2j2q6j17M46k10k7j35J96Rm4J65k55K40m44
5593b45L21j75k07R1J15L71k54k73M08j92j22J93J25j41L6l5J18j15K20k03j91
5614a55K33k01K8r7K24r9o0L59k15kj13kr6J48r1K56l61R0K97j87r0M2Q6J63k0
5639A37Q6J2QJ9n6k60J09K5k80K30j81K01j7j13J13Q9k10O0k43M9K22n0L0J42
5663A22j66j64J05l9k5J45j08N0j47K62j19P9J17k9nK51m53m3j7K60p9J38p2l49
5687b86K47L01j24k63j8L45k28J51j00P3j46J53j50J6k1r6n2J23j91K41J31k27
5709a21K22mj69J36K0k78M00l32J22jl03K56K5k64L54l15K76p1K02n0k00K94k87
$$ plain form
5546 -112 -58 -61 78 -123 165 -337 -14 252 32 52 -179 -82 211 -168 101 -27 -91 -7 -170 152 135 10 77
5569 77 90 -70 135 -130 141 92 37 -87 7 29 17 -69 -186 260 50 23 -112 84 93 49 214 -41 199 -245
5593 -245 76 -99 -306 -215 -100 271 17 -256 152 -40 -162 31 156 15 51 16 134 19 239 36 -155
5614 -155 78 -123 -95 -192 32 -67 -127 232 17 15 -98 -100 -196 -48 -139 117 -244 -154 143 -44 -134 -92 -6 157 137
5639 137 223 235 243 262 206 -54 55 80 -200 30 -151 50 33 -80 33 122 -88 -28 -271 -222 0 -50 -20 122
5663 122 -44 -208 -103 -142 -167 -22 -130 -80 -227 35 -84 -5 112 83 78 329 -124 -167 -184 76 -3 135 63 -286
5687 -286 -39 262 138 -125 -143 202 -26 125 25 98 -48 105 -45 -29 -50 -146 -198 -75 -266 -25 106 -121
5709 -121 101 97 -72 64 84 -194 206 -126 -4 -5 -308 -52 -27 -291 63 -252 24 -47 155 105 -95 199 -88
5732h8M5jK45k39n1m7J35P7m4j02J90Ln1j56j16N22l01r7K51J5l35%J23K42n4
5757A66l25K12j76P3j46m1M01k06Q3l31J90k03J34L58j68J50L8j56L2j53MJ83
5779A19k7k45K15k49J17R6kJ93k61N3J8j98P8K13r0k62J90J17K92j30q2q5O1j68
5803c7k80P4L84p7P9J4j78l0k2p0L67k27L7L4L1R2k62Q5k3o5k53L89O3P0q4j75
5829f4J18l70M83q8J71l44J38j00L95l60L02j74J54k77l42M46j17J14k15M5J14
5850B9M8J42k03l4J90n7m8l2K6J69k18J10P2l2j10K5k07J98k69K79M2k60N1j19
5874b08L46k65O5N3j29K79k32K76l41j10K23j33J34Q2r1K0J83l3k14J02j05K4
5896g4M60m63K77k75K20p5j49j49K88M4p6p9r1J38K3J35j68k67M80p0l65L16q
$$ plain form
5732 -88 -43 -44 201 -38 -89 -136 -1 76 32 -70 120 123 72 -84 -200 322 21 -76 175 190 -145 -145 -22 220 166
5757 166 -159 53 -123 -50 -196 -237 164 -42 41 -290 -100 -303 -169 189 21 171 209 53 85 -68 -64 119
5779 119 92 -153 62 -187 -70 26 24 217 -44 9 27 -171 -93 120 30 -232 -42 75 367 237 155 70 131 -37
5803 -37 -317 -243 141 64 143 157 -21 -51 -73 -143 224 -3 34 68 99 191 -71 14 -9 -74 -327 62 125 195 111 -64
5829 -64 54 -316 167 79 250 -94 44 -56 339 -21 281 107 261 -16 -358 88 -29 85 -130 -85 29
5850 29 77 219 16 -18 172 115 67 35 61 230 12 122 194 162 52 77 -130 68 -201 78 120 -140 -89 -208
5874 -208 138 -127 -62 -9 -138 141 -91 185 -156 -266 -43 -176 -42 40 -51 -31 152 119 -95 7 -98 -74
5896 -74 386 -77 200 -75 145 70 -79 -228 60 104 28 -51 -142 -4 19 154 -14 -281 199 129 -236 80 72
5919G2j91L0J78k03K77k11j24Q0K13j74K42j94l4j01J38J3Ql8J90j94L0m9J06
5942F4J9k25k2K22O7j31r3RK09q4j26J66j31O5j09J09Q2k9K2j21k34M50n6k03
5966h0j35K49j76k8J24P2o4K6J32j62K46l05J81n6l4k14L37j88O3n2J89j17J06
5989A14j87J81k83L14Rm3k51K8K86k24o9J08P0P5p3J73Pj65q4R9k31K34p4o1j
6014d8K46J15o66M71ln5j06P7j69J75q3J10l21K27k12J05K38M6O3k01qj21m2K0
6038a42L77k56l5K38j16o9J41k21J48k49j6K42k2m7R0k60J96Q5Q5%k52j05QN5
6062a25K4O9m0Q0O7j82L8J92j07K82n32K66J07j38L4J86K2k03J5j05p9J02R8j48
6086g7k2rL46q1Ol1l71K10j86J95P2j54k3K1L9j45J14M3k8j0L12l08j15N43m12
$$ plain form
5919 72 -119 -89 89 -114 163 -48 -172 -92 121 -53 189 -5 -39 -140 -2 11 19 -19 171 -23 7 -42 64
5942 64 83 -142 -164 58 125 -6 -99 -90 119 35 -91 75 -56 9 -100 9 91 62 84 -37 -271 179 123 -80
5966 -80 -215 34 -142 -170 -46 26 -38 -12 120 -42 204 -101 80 24 -10 -224 113 -75 -12 -64 125 8 114
5989 114 -73 108 -175 139 148 105 -146 -118 168 -56 -125 -17 53 128 55 228 235 70 -14 85 -146 88 14 -47 -48
6014 -48 198 313 -353 118 115 60 -46 31 -138 37 -46 64 -257 -30 -242 -137 101 147 210 9 1 -120 -162 -142
6038 -142 235 -21 -56 182 66 -3 138 -83 65 -184 -200 42 20 -27 63 -197 -1 84 169 169 -83 -188 -180 -125
6062 -125 -101 -32 -72 8 75 -107 -69 123 16 298 -234 32 139 1 35 221 243 40 55 -50 -129 -27 71 -77
6086 -77 -99 -108 238 157 163 132 -239 -29 -215 -20 52 -102 -125 -104 -65 -210 -96 -53 -81 -91 221 -87 -202 341 -71
6111g1J62m3j54n1N5o4K08j53L5J61J35l54K4M0r9q8J16M33k58j30J06P3j09Q0
6135E4n9p5K30o5p5K09l03M1K4J15k08j09L53m17K77N6o3j14j11L01m1l06L68
6158H2L0j16R2P8R0k38J9q3K12j91k12L54Q8n0k16J83K56k72j5M2r1l9k78L25
6182E0k14O6O0j11K35k71RK16j44J27o4J1J34j72J41J14m44L80j46k91L05j56
6204a65K18j73O6J4J75j96r5Q4r0K04R9k24q6N8lJ98l26M99j37J14k64L5l8J93
6228A60N4J34l74R8l7J25Oj83p4O7q5OM35n15L49O4j95n0j42K43q1l04L46j62
6252a15j66K6J26j4j6J04L61k79R6j97K49k14l4J44j92J05j76P7N74n20K67l31
6274a25j13L24M8k57J28o4J10j1r0K22l03J13j3M4k55L66p6L2O3q5o8Mj4j92N0
$$ plain form
6111 -71 91 48 -106 -157 -102 -166 42 -111 -76 85 220 -134 -110 -70 -169 -257 -141 292 34 -96 10 83 -26 54
6135 54 -5 -80 150 85 10 219 -84 -43 -19 96 -112 -221 132 -285 -8 48 -15 -129 -240 61 20 -286 82
6158 82 112 -4 88 166 256 18 37 -46 166 -25 -237 117 205 155 -61 122 378 106 91 133 42 3 -275 50
6182 50 -164 -98 -38 -149 86 -185 -176 40 -104 23 -41 -30 104 -68 73 187 -257 123 -23 -314 -9 -165
6204 -165 53 -120 -54 -40 135 -61 -156 -72 -162 42 141 -83 -169 -111 -114 84 -242 257 120 234 -30 5 -33 160
6228 160 214 348 -26 72 35 160 166 -17 -91 -24 -109 -103 332 -183 166 230 35 -15 -157 86 5 -299 47 -115
6252 -115 -281 -255 -129 -143 -159 -55 306 27 123 -74 175 -39 -73 71 -121 -16 -192 -115 459 -61 206 -125
6274 -125 -238 86 134 -123 5 -59 51 40 -50 172 -131 -18 -31 13 -242 124 48 80 143 58 -10 -6 -20 -212 -162
6299a62R7L09l03mJ85l30P0Kj20K67Q6n8Pl3K48k80p3j00L27M6J64j31Jk60K23
6324A78m07L09j95O9j53M8J62j01n9N55k24k71K3Q2Q5k77J68N8JJ22j99M1K47
$$ plain form
6299 -162 -65 244 -59 -63 122 -208 -138 -136 -256 11 97 39 46 13 261 -19 -92 -192 135 181 345 214 215 -45 178
6324 178 -229 80 -115 -46 -199 -151 11 -90 -149 406 182 -89 -66 16 101 -176 -8 50 51 173 -26 15 262
$$ [...]
8191H2
##END NTUPLES=NMR FID
##END=
